0
270
511
692
853
977
1094
1201
1305
1381
1445
1512
1577
1640
1705
1755
1814
1870
1908
1938
1976
2016
2057
2086
2112
2149
2191
2215
2249
2280
2313
2343
2371
2388
2413
2438
2461
2483
2506
2530
2564
2585
2609
2632
2647
2664
2686
2700
2728
2744
2768
2777
2793
2812
2826
2845
2864
2880
2891
2909
2931
2949
2960
2972
2989
3004
3015
3030
3043
3055
3075
3092
3107
3120
3134
3145
3158
3170
3187
3198
3210
3224
3234
3242
3254
3270
3289
3300
3316
3332
3342
3352
3364
3373
3382
3391
3404
3414
3424
3438
3447
3454
3466
3480
3492
3499
3507
3522
3531
3540
3553
3565
3571
3582
3595
3602
3616
3629
3634
3647
3653
3661
3668
3684
3691
3700
3713
3719
3732
3740
3745
3750
3761
3769
3781
3787
3797
3802
3810
3818
3825
3835
3839
3846
3853
3861
3870
3879
3887
3894
3908
3922
3933
3943
3952
3960
3966
3971
3980
3990
3998
4010
4017
4025
4038
4044
4053
4061
4069
4080
4089
4100
4108
4113
4125
4133
4140
4146
4152
4159
4168
4176
4188
4197
4205
4210
4217
4223
4231
4234
4240
4249
4252
4257
4261
4274
4282
4287
4296
4303
4310
4316
4324
4335
4341
4344
4346
4354
4360
4369
4377
4381
4388
4389
4392
4395
4404
4409
4413
4421
4429
4437
4442
4448
4450
4456
4466
4473
4476
4480
4487
4489
4496
4500
4506
4511
4520
4524
4533
4541
4544
4548
4552
4559
4563
4567
4575
4580
4588
4599
4607
4614
4627
4636
4641
4646
4651
4659
4665
4671
4681
4688
4692
4701
4705
4714
4718
4721
4725
4729
4731
4743
4748
4752
4754
4761
4765
4770
4772
4779
4781
4787
4796
4801
4808
4816
4825
4829
4837
4844
4851
4859
4870
4875
4878
4882
4885
4892
4896
4899
4904
4910
4914
4921
4928
4937
4940
4946
4954
4958
4964
4969
4977
4985
4989
4998
4999
5008
5011
5012
5016
5022
5025
5032
5037
5044
5057
5062
5065
5070
5076
5079
5083
5093
5094
5095
5099
5110
5116
5121
5122
5132
5134
5139
5146
5148
5154
5157
5159
5164
5165
5169
5178
5182
5183
5185
5192
5196
5198
5205
5210
5219
5223
5228
5234
5237
5242
5246
5250
5256
5262
5264
5267
5273
5277
5287
5289
5293
5297
5303
5308
5316
5321
5326
5335
5336
5340
5343
5348
5353
5354
5357
5366
5371
5373
5378
5384
5389
5395
5401
5405
5409
5413
5417
5425
5426
5432
5436
5443
5446
5448
5453
5461
5464
5471
5474
5477
5483
5484
5487
5494
5496
5501
5503
5507
5510
5514
5519
5524
5526
5531
5535
5536
5539
5545
5549
5556
5559
5565
5570
5573
5576
5581
5587
5593
5598
5604
5608
5614
5617
5620
5622
5624
5630
5632
5635
5637
5641
5643
5645
5650
5657
5664
5665
5665
5668
5675
5678
5683
5686
5689
5689
5693
5696
5703
5708
5713
5717
5720
5727
5729
5732
5738
5741
5747
5751
5753
5758
5758
5761
5763
5765
5769
5772
5779
5784
5788
5790
5794
5796
5799
5800
5804
5807
5811
5815
5819
5821
5823
5830
5835
5841
5848
5851
5854
5860
5863
5869
5875
5878
5881
5881
5885
5888
5891
5896
5899
5903
5907
5913
5916
5920
5924
5929
5931
5935
5943
5944
5947
5951
5954
5955
5960
5963
5965
5967
5971
5976
5978
5979
5982
5985
5985
5986
5990
5993
5996
5997
6001
6003
6006
6008
6011
6015
6018
6020
6023
6025
6028
6031
6037
6042
6045
6050
6055
6060
6062
6064
6067
6070
6074
6076
6079
6082
6087
6089
6094
6099
6103
6108
6111
6112
6116
6118
6119
6120
6126
6127
6131
6135
6137
6139
6144
6149
6151
6155
6159
6160
6163
6168
6172
6176
6176
6181
6184
6189
6190
6192
6199
6204
6204
6208
6211
6215
6219
6222
6224
6225
6226
6232
6235
6238
6243
6244
6247
6250
6254
6259
6264
6266
6273
6273
6275
6283
6284
6288
6290
6293
6298
6300
6304
6308
6310
6311
6317
6318
6324
6327
6328
6330
6330
6330
6333
6337
6339
6343
6346
6349
6351
6352
6355
6357
6363
6367
6369
6370
6371
6373
6375
6377
6383
6385
6388
6390
6394
6396
6396
6397
6400
6402
6405
6408
6411
6414
6415
6421
6423
6428
6429
6432
6434
6438
6444
6447
6452
6457
6463
6464
6465
6470
6475
6475
6475
6476
6477
6479
6481
6482
6485
6489
6490
6496
6499
6501
6505
6508
6511
6512
6515
6517
6517
6517
6518
6522
6528
6533
6535
6537
6537
6540
6543
6544
6545
6547
6551
6554
6557
6562
6568
6568
6570
6574
6580
6582
6583
6583
6584
6591
6595
6596
6597
6599
6600
6601
6605
6609
6613
6614
6616
6618
6621
6621
6621
6623
6624
6628
6631
6637
6638
6639
6641
6642
6645
6647
6649
6650
6651
6653
6657
6659
6660
6662
6662
6662
6664
6667
6668
6670
6671
6672
6673
6676
6680
6681
6683
6688
6688
6690
6693
6695
6695
6695
6697
6700
6703
6706
6709
6710
6712
6713
6716
6716
6719
6724
6726
6726
6729
6729
6730
6737
6739
6741
6741
6743
6743
6746
6747
6750
6750
6753
6756
6758
6759
6759
6763
6767
6768
6769
6771
6774
6777
6781
6782
6787
6790
6792
6801
6801
6803
6807
6809
6809
6810
6813
6815
6819
6823
6825
6826
6830
6832
6835
6838
6843
6845
6848
6851
6852
6854
6855
6856
6859
6860
6860
6861
6862
6864
6866
6869
6869
6870
6870
6873
6877
6882
6885
6886
6890
6891
6895
6896
6900
6901
6902
6903
6905
6907
6909
6910
6911
6914
6915
6918
6922
6924
6926
6927
6927
6927
6929
6932
6932
6934
6934
6935
6935
6937
6940
6944
6947
6947
6949
6951
6952
6952
6953
6956
6956
6957
6957
6959
6959
6960
6962
6963
6963
6967
6968
6969
6973
6974
6974
6975
6977
6978
6984
6984
6987
6988
6990
6991
6994
6994
6996
6996
6997
7000
7000
7002
7002
7005
7006
7010
7010
7015
7015
7018
7021
7022
7025
7026
7027
7031
7032
7033
7034
7035
7036
7037
7038
7038
7038
7038
7041
7042
7043
7044
7046
7046
7049
7051
7052
7054
7056
7056
7058
7060
7060
7060
7061
7061
7061
7063
7064
7065
7065
7065
7065
7067
7068
7068
7070
7071
7072
7075
7077
7079
7081
7082
7084
7085
7086
7086
7087
7090
7090
7092
7093
7094
7096
7097
7098
7098
7100
7101
7103
7103
7104
7104
7105
7107
7109
7112
7113
7113
7115
7116
7116
7119
7119
7121
7122
7123
7124
7124
7124
7124
7124
7128
7128
7129
7131
7132
7134
7135
7136
7136
7136
7137
7137
7139
7139
7139
7140
7141
7142
7142
7143
7144
7146
7148
7151
7153
7153
7154
7155
7157
7160
7160
7164
7167
7167
7169
7170
7172
7176
7176
7179
7179
7180
7181
7182
7184
7185
7186
7188
7188
7190
7192
7193
7194
7196
7198
7201
7202
7203
7205
7207
7207
7207
7210
7211
7211
7212
7213
7213
7215
7215
7215
7217
7219
7221
7222
7222
7225
7227
7230
7231
7232
7233
7234
7234
7234
7234
7235
7235
7235
7236
7237
7238
7239
7240
7243
7247
7248
7250
7252
7253
7254
7254
7256
7256
7256
7256
7257
7259
7261
7262
7263
7265
7266
7269
7269
7269
7269
7269
7270
7271
7274
7275
7275
7276
7278
7281
7281
7282
7283
7284
7284
7287
7287
7289
7291
7291
7291
7292
7293
7294
7295
7298
7298
7300
7301
7301
7302
7302
7302
7304
7304
7306
7309
7311
7311
7314
7315
7316
7317
7319
7320
7320
7322
7322
7324
7324
7326
7328
7330
7332
7333
7334
7334
7335
7337
7337
7338
7339
7340
7341
7341
7342
7342
7342
7343
7344
7345
7346
7346
7348
7349
7351
7353
7354
7355
7355
7358
7359
7360
7362
7364
7367
7368
7368
7370
7371
7372
7372
7373
7376
7379
7380
7384
7385
7387
7387
7391
7392
7392
7393
7394
7396
7396
7398
7399
7400
7401
7403
7404
7406
7406
7406
7408
7408
7409
7409
7411
7412
7412
7412
7413
7413
7415
7415
7415
7417
7417
7420
7421
7422
7424
7424
7424
7427
7427
7431
7431
7431
7433
7434
7434
7434
7437
7437
7437
7438
7438
7439
7439
7439
7440
7440
7440
7441
7441
7442
7442
7446
7447
7447
7447
7447
7447
7447
7447
7449
7451
7454
7456
7457
7457
7459
7459
7460
7460
7460
7461
7463
7464
7464
7465
7466
7466
7466
7467
7467
7468
7468
7469
7469
7469
7469
7469
7470
7470
7471
7471
7471
7472
7472
7474
7474
7474
7474
7474
7475
7475
7476
7477
7477
7477
7479
7479
7479
7479
7480
7481
7481
7483
7483
7483
7487
7488
7488
7488
7488
7490
7494
7495
7496
7496
7500
7500
7501
7502
7502
7502
7502
7503
7503
7503
7504
7504
7505
7506
7506
7509
7512
7514
7514
7514
7514
7514
7514
7514
7515
7515
7516
7518
7518
7518
7519
7519
7519
7521
7523
7523
7524
7525
7525
7525
7526
7526
7526
7527
7527
7527
7528
7529
7530
7530
7531
7531
7531
7533
7533
7534
7535
7536
7537
7537
7539
7539
7539
7540
7541
7541
7542
7542
7542
7543
7543
7543
7543
7543
7543
7544
7545
7546
7546
7546
7546
7546
7547
7549
7549
7549
7549
7550
7550
7550
7550
7550
7551
7551
7553
7554
7554
7555
7556
7558
7558
7559
7559
7559
7561
7562
7562
7562
7562
7562
7563
7565
7565
7566
7566
7567
7567
7568
7569
7571
7571
7571
7571
7572
7572
7574
7576
7576
7576
7577
7577
7577
7577
7577
7578
7578
7578
7578
7580
7580
7582
7582
7584
7585
7585
7586
7586
7587
7588
7588
7589
7589
7589
7591
7591
7592
7592
7592
7592
7592
7593
7593
7595
7595
7597
7597
7597
7597
7597
7598
7598
7599
7599
7600
7601
7601
7601
7602
7603
7603
7603
7604
7604
7604
7604
7604
7604
7604
7604
7605
7606
7606
7606
7606
7606
7606
7607
7608
7608
7608
7610
7610
7610
7610
7611
7612
7612
7612
7612
7612
7613
7613
7614
7614
7615
7616
7616
7617
7617
7617
7618
7619
7620
7621
7622
7624
7625
7625
7626
7626
7626
7626
7626
7627
7627
7628
7629
7631
7632
7632
7632
7632
7632
7633
7633
7633
7633
7633
7633
7633
7635
7636
7637
7637
7637
7637
7637
7637
7638
7638
7638
7640
7640
7640
7640
7640
7640
7641
7642
7643
7643
7643
7644
7644
7644
7644
7645
7645
7645
7646
7646
7647
7647
7647
7648
7648
7649
7649
7650
7650
7650
7650
7655
7656
7657
7658
7658
7659
7660
7660
7660
7660
7660
7660
7661
7661
7661
7661
7661
7661
7661
7661
7661
7661
7661
7661
7661
7661
7661
7661
7662
7662
7662
7662
7664
7664
7665
7666
7666
7667
7667
7668
7668
7669
7669
7669
7670
7670
7670
7670
7670
7670
7670
7670
7670
7670
7671
7671
7671
7671
7671
7671
7671
7671
7671
7672
7673
7673
7673
7674
7674
7675
7675
7675
7676
7676
7676
7676
7677
7678
7678
7678
7678
7679
7679
7680
7680
7680
7680
7680
7680
7682
7684
7684
7684
7685
7687
7689
7689
7691
7691
7691
7692
7692
7692
7692
7692
7693
7694
7694
7694
7695
7695
7695
7695
7696
7696
7696
7697
7697
7697
7697
7697
7697
7697
7698
7698
7698
7698
7699
7700
7700
7701
7702
7703
7703
7703
7703
7704
7706
7706
7706
7706
7706
7707
7707
7708
7708
7708
7709
7710
7711
7711
7711
7711
7711
7711
7711
7712
7712
7712
7714
7715
7715
7715
7715
7715
7715
7716
7717
7717
7718
7718
7718
7719
7719
7720
7721
7721
7721
7721
7721
7721
7721
7722
7722
7722
7723
7724
7724
7724
7725
7726
7726
7727
7728
7728
7728
7728
7728
7729
7730
7730
7731
7731
7732
7732
7732
7734
7734
7734
7735
7735
7735
7735
7735
7735
7736
7736
7737
7737
7738
7738
7738
7738
7739
7740
7741
7741
7741
7741
7742
7742
7742
7742
7742
7742
7742
7744
7745
7745
7745
7746
7746
7746
7747
7747
7747
7747
7747
7748
7748
7749
7750
7751
7752
7752
7752
7753
7753
7753
7753
7755
7756
7756
7757
7757
7757
7757
7758
7758
7758
7758
7759
7760
7762
7762
7764
7766
7766
7766
7766
7766
7766
7767
7767
7768
7770
7771
7771
7771
7772
7773
7773
7774
7775
7775
7776
7777
7777
7777
7777
7777
7777
7777
7777
7777
7777
7777
7777
7779
7779
7779
7779
7779
7779
7779
7779
7779
7779
7779
7779
7780
7780
7780
7780
7781
7781
7781
7781
7783
7783
7783
7783
7784
7784
7784
7784
7784
7784
7785
7786
7786
7786
7786
7786
7786
7787
7788
7788
7789
7790
7790
7790
7790
7790
7790
7790
7791
7791
7791
7791
7792
7792
7792
7792
7792
7792
7792
7792
7792
7792
7792
7792
7792
7792
7792
7792
7793
7793
7793
7793
7793
7793
7793
7794
7794
7795
7795
7795
7795
7795
7795
7796
7796
7796
7796
7796
7796
7796
7797
7797
7797
7797
7797
7797
7798
7798
7798
7799
7800
7800
7800
7800
7800
7800
7801
7801
7803
7803
7803
7803
7803
7803
7804
7805
7805
7807
7807
7807
7807
7808
7808
7809
7810
7810
7810
7810
7810
7810
7810
7811
7811
7812
7813
7813
7814
7814
7817
7817
7817
7817
7818
7818
7818
7818
7818
7818
7818
7818
7819
7819
7819
7819
7819
7819
7819
7819
7819
7819
7820
7820
7820
7820
7821
7821
7821
7821
7821
7821
7821
7821
7821
7821
7821
7822
7822
7823
7823
7823
7824
7824
7824
7824
7824
7824
7824
7824
7824
7825
7826
7826
7826
7826
7827
7828
7829
7830
7830
7830
7830
7832
7832
7832
7832
7832
7832
7832
7832
7832
7832
7832
7832
7832
7832
7832
7832
7832
7832
7832
7832
7832
7832
7832
7832
7832
7832
7832
7832
7833
7833
7833
7833
7834
7834
7834
7835
7835
7835
7836
7836
7837
7837
7837
7838
7838
7838
7838
7839
7839
7839
7839
7839
7840
7840
7841
7841
7842
7842
7842
7843
7843
7843
7844
7844
7845
7845
7845
7845
7845
7846
7846
7847
7848
7848
7848
7848
7848
7848
7848
7848
7849
7849
7849
7850
7850
7850
7851
7851
7851
7851
7852
7852
7852
7852
7852
7852
7852
7852
7853
7853
7853
7854
7854
7854
7855
7855
7856
7856
7856
7856
7856
7856
7857
7857
7857
7857
7857
7857
7857
7857
7857
7857
7857
7857
7857
7857
7857
7857
7857
7857
7857
7857
7857
7858
7858
7859
7859
7859
7860
7860
7861
7861
7861
7861
7861
7861
7861
7861
7861
7861
7861
7861
7861
7861
7861
7861
7861
7861
7861
7862
7863
7863
7863
7864
7864
7864
7864
7864
7864
7864
7865
7865
7865
7865
7865
7865
7865
7865
7865
7865
7865
7865
7865
7865
7866
7866
7866
7866
7866
7866
7867
7867
7868
7868
7868
7869
7869
7869
7869
7869
7869
7870
7870
7870
7870
7870
7871
7872
7872
7872
7872
7872
7872
7873
7874
7874
7874
7874
7874
7875
7875
7876
7876
7876
7876
7877
7877
7877
7878
7878
7878
7878
7878
7878
7879
7879
7879
7879
7879
7879
7879
7879
7879
7879
7879
7879
7879
7879
7879
7879
7879
7879
7879
7879
7879
7879
7879
7879
7879
7879
7879
7879
7879
7879
7879
7880
7881
7881
7881
7881
7881
7881
7882
7882
7882
7882
7883
7883
7884
7884
7884
7884
7886
7886
7886
7886
7887
7888
7888
7888
7888
7889
7889
7889
7889
7889
7889
7889
7889
7889
7890
7890
7891
7891
7891
7891
7891
7891
7891
7891
7891
7891
7891
7891
7891
7891
7891
7891
7891
7892
7892
7892
7892
7892
7892
7892
7892
7892
7892
7892
7892
7892
7893
7893
7893
7894
7894
7894
7894
7894
7894
7894
7894
7894
7894
7894
7894
7894
7894
7894
7894
7894
7894
7894
7894
7894
7894
7894
7894
7894
7895
7895
7895
7896
7896
7896
7896
7896
7896
7897
7897
7899
7899
7899
7899
7899
7900
7900
7900
7900
7900
7900
7901
7902
7902
7902
7903
7903
7903
7903
7903
7904
7904
7904
7904
7904
7904
7904
7904
7904
7904
7904
7904
7904
7904
7904
7904
7904
7904
7904
7904
7904
7904
7904
7904
7904
7904
7904
7904
7904
7905
7905
7905
7905
7905
7905
7905
7905
7905
7905
7905
7905
7905
7905
7905
7905
7905
7905
7905
7905
7905
7905
7905
7905
7905
7906
7906
7906
7906
7906
7907
7907
7907
7907
7907
7907
7907
7907
7907
7907
7907
7907
7907
7907
7907
7907
7907
7907
7908
7909
7910
7911
7912
7912
7913
7913
7913
7913
7913
7913
7914
7914
7914
7914
7915
7915
7915
7915
7915
7915
7915
7916
7916
7917
7917
7917
7917
7918
7918
7918
7918
7918
7918
7918
7918
7918
7918
7918
7918
7918
7918
7918
7918
7918
7918
7918
7918
7918
7919
7919
7919
7919
7919
7919
7919
7919
7919
7919
7919
7919
7919
7919
7919
7919
7919
7919
7919
7919
7919
7919
7919
7919
7919
7919
7919
7919
7919
7919
7919
7919
7919
7919
7919
7919
7919
7919
7919
7919
7919
7919
7919
7919
7919
7919
7919
7919
7919
7920
7920
7921
7921
7921
7921
7921
7921
7921
7921
7921
7921
7922
7922
7923
7923
7923
7923
7924
7924
7924
7924
7924
7924
7924
7924
7924
7924
7924
7924
7924
7924
7924
7924
7924
7924
7924
7924
7924
7924
7924
7924
7924
7924
7924
7924
7925
7925
7925
7926
7926
7926
7926
7926
7926
7926
7927
7927
7927
7927
7927
7928
7928
7928
7928
7928
7928
7929
7929
7929
7929
7929
7929
7929
7930
7930
7930
7930
7930
7930
7930
7930
7931
7931
7931
7931
7931
7932
7932
7932
7932
7932
7932
7932
7932
7932
7932
7932
7932
7932
7932
7932
7932
7934
7934
7934
7934
7934
7934
7935
7935
7935
7935
7935
7935
7935
7935
7936
7936
7936
7936
7936
7936
7936
7936
7936
7937
7938
7938
7938
7938
7938
7938
7938
7938
7938
7938
7938
7938
7938
7939
7939
7939
7939
7939
7939
7939
7939
7939
7939
7939
7939
7939
7939
7939
7939
7939
7940
7940
7940
7940
7940
7940
7940
7940
7940
7940
7940
7940
7941
7941
7941
7941
7941
7941
7941
7941
7941
7941
7941
7941
7941
7941
7941
7941
7941
7941
7941
7941
7942
7942
7942
7942
7942
7942
7942
7942
7942
7942
7942
7942
7942
7942
7942
7942
7942
7942
7942
7942
7942
7942
7942
7942
7942
7942
7942
7942
7942
7942
7943
7943
7944
7945
7945
7945
7945
7945
7945
7946
7946
7946
7946
7946
7946
7946
7946
7946
7946
7946
7946
7946
7946
7946
7946
7946
7946
7946
7946
7946
7946
7946
7946
7946
7946
7946
7946
7946
7946
7946
7946
7946
7947
7947
7947
7947
7947
7947
7947
7947
7947
7948
7948
7948
7948
7948
7948
7948
7948
7948
7948
7948
7948
7948
7948
7948
7948
7948
7948
7948
7948
7948
7948
7948
7948
7949
7949
7949
7949
7949
7949
7949
7949
7949
7949
7949
7949
7949
7949
7949
7949
7949
7949
7949
7949
7949
7949
7949
7949
7949
7949
7950
7950
7950
7950
7950
7951
7951
7951
7951
7951
7951
7951
7952
7952
7952
7952
7952
7952
7952
7952
7952
7952
7952
7952
7952
7952
7952
7952
7952
7952
7952
7952
7952
7952
7952
7952
7952
7952
7952
7952
7952
7952
7952
7952
7952
7952
7952
7952
7952
7952
7952
7952
7952
7952
7952
7952
7952
7952
7952
7952
7952
7952
7952
7952
7952
7952
7952
7952
7952
7952
7952
7952
7952
7952
7952
7952
7952
7952
7952
7952
7952
7952
7952
7952
7952
7952
7952
7952
7952
7952
7952
7952
7952
7952
7952
7952
7952
7952
7952
7952
7952
7952
7952
7952
7952
7952
7952
7952
7952
7952
7952
7952
7952
7952
7952
7952
7952
7952
7952
7952
7952
7952
7952
7952
7952
7952
7952
7952
7952
7952
7952
7952
7952
7952
7952
7952
7952
7952
7952
7952
7953
7953
7953
7953
7953
7953
7953
7953
7953
7953
7953
7953
7953
7953
7953
7953
7953
7953
7953
7953
7953
7954
7954
7954
7954
7954
7955
7955
7956
7956
7956
7956
7957
7957
7957
7957
7957
7957
7957
7957
7957
7957
7957
7957
7957
7957
7957
7957
7957
7957
7958
7958
7958
7958
7958
7958
7958
7958
7958
7958
7958
7958
7958
7958
7958
7958
7958
7958
7958
7958
7958
7958
7958
7958
7959
7959
7959
7959
7959
7959
7959
7959
7959
7959
7959
7959
7959
7959
7959
7959
7959
7959
7959
7959
7959
7959
7959
7959
7959
7960
7960
7960
7960
7960
7960
7960
7960
7961
7961
7961
7961
7961
7962
7962
7962
7962
7962
7962
7962
7962
7962
7962
7962
7962
7962
7962
7962
7962
7962
7962
7962
7962
7962
7962
7962
7962
7962
7962
7962
7962
7962
7962
7962
7962
7962
7962
7962
7962
7962
7962
7962
7962
7962
7962
7962
7962
7962
7962
7962
7962
7962
7962
7962
7962
7962
7962
7962
7962
7963
7963
7963
7963
7963
7963
7963
7963
7963
7963
7963
7963
7963
7963
7963
7963
7963
7963
7963
7964
7964
7964
7964
7964
7964
7964
7964
7964
7964
7964
7964
7964
7964
7964
7964
7964
7964
7964
7964
7964
7964
7964
7964
7964
7964
7964
7964
7964
7964
7964
7964
7965
7966
7966
7966
7966
7966
7966
7966
7966
7966
7966
7966
7966
7966
7966
7966
7967
7967
7967
7967
7967
7967
7967
7967
7967
7967
7967
7967
7967
7967
7967
7967
7967
7967
7967
7967
7967
7968
7968
7969
7969
7970
7970
7970
7970
7970
7970
7970
7970
7970
7970
7970
7970
7970
7970
7970
7970
7970
7970
7970
7970
7970
7970
7970
7970
7970
7970
7970
7970
7970
7970
7970
7970
7970
7970
7970
7970
7970
7970
7970
7970
7970
7970
7970
7970
7970
7970
7970
7970
7970
7970
7970
7971
7971
7971
7971
7971
7971
7972
7972
7972
7972
7973
7973
7973
7973
7973
7973
7973
7973
7973
7973
7973
7973
7973
7973
7973
7973
7973
7973
7973
7973
7973
7973
7973
7973
7973
7973
7973
7973
7973
7973
7973
7973
7973
7973
7973
7973
7973
7973
7973
7973
7973
7974
7974
7974
7974
7974
7974
7974
7974
7974
7974
7975
7975
7975
7975
7975
7975
7975
7975
7975
7975
7975
7975
7975
7975
7975
7975
7975
7975
7975
7975
7975
7975
7975
7975
7975
7975
7975
7975
7975
7975
7975
7975
7975
7975
7975
7975
7975
7975
7975
7975
7975
7975
7975
7975
7975
7975
7975
7975
7975
7975
7975
7975
7975
7975
7975
7975
7975
7975
7975
7975
7975
7975
7975
7975
7975
7975
7975
7975
7975
7975
7975
7975
7975
7975
7975
7975
7975
7975
7975
7975
7975
7975
7975
7975
7975
7975
7975
7975
7975
7975
7975
7975
7975
7975
7975
7975
7976
7976
7976
7976
7976
7977
7977
7977
7977
7977
7977
7977
7977
7977
7977
7977
7977
7977
7977
7977
7977
7977
7977
7977
7977
7977
7977
7977
7977
7977
7977
7977
7977
7977
7977
7977
7977
7977
7977
7977
7977
7977
7977
7977
7977
7977
7977
7977
7977
7977
7977
7977
7977
7977
7977
7977
7977
7977
7977
7977
7977
7977
7977
7977
7977
7977
7977
7977
7977
7977
7977
7977
7977
7977
7977
7977
7977
7978
7978
7978
7978
7978
7978
7978
7978
7978
7978
7979
7980
7980
7980
7980
7980
7980
7980
7980
7980
7980
7980
7980
7980
7980
7980
7980
7980
7980
7980
7980
7980
7980
7980
7980
7980
7980
7980
7980
7980
7980
7980
7980
7980
7980
7980
7980
7980
7980
7980
7980
7980
7980
7980
7980
7980
7980
7980
7981
7981
7981
7981
7981
7981
7981
7981
7981
7981
7981
7981
7981
7981
7981
7981
7981
7981
7982
7982
7982
7982
7982
7982
7982
7982
7982
7982
7982
7982
7982
7982
7982
7982
7982
7982
7982
7982
7982
7982
7982
7982
7982
7982
7982
7982
7982
7982
7982
7982
7982
7982
7982
7982
7982
7982
7982
7982
7982
7982
7982
7982
7982
7982
7982
7982
7982
7982
7983
7983
7983
7983
7983
7983
7983
7983
7983
7983
7983
7983
7983
7983
7983
7983
7983
7983
7983
7983
7983
7983
7983
7983
7983
7983
7983
7983
7983
7983
7983
7983
7983
7983
7983
7983
7983
7983
7983
7983
7983
7983
7983
7983
7983
7983
7983
7983
7983
7983
7983
7983
7983
7983
7983
7983
7983
7983
7983
7983
7983
7983
7983
7983
7983
7983
7984
7984
7984
7984
7984
7984
7984
7984
7984
7984
7984
7984
7984
7984
7984
7985
7985
7986
7986
7986
7986
7986
7986
7986
7986
7986
7986
7986
7986
7986
7986
7986
7986
7986
7986
7986
7986
7986
7986
7986
7986
7986
7986
7986
7986
7986
7986
7986
7986
7986
7986
7986
7986
7986
7986
7986
7986
7986
7986
7986
7986
7986
7986
7986
7986
7986
7986
7986
7986
7986
7986
7986
7986
7986
7986
7986
7986
7986
7986
7986
7986
7986
7986
7986
7986
7986
7986
7986
7986
7986
7986
7986
7986
7986
7986
7986
7986
7986
7986
7986
7986
7986
7986
7986
7986
7986
7986
7986
7986
7986
7986
7986
7986
7986
7986
7986
7986
7986
7986
7986
7986
7986
7986
7986
7986
7986
7986
7986
7986
7986
7986
7986
7986
7986
7986
7986
7986
7986
7986
7986
7986
7986
7986
7986
7986
7986
7986
7986
7986
7986
7986
7986
7986
7986
7986
7986
7986
7986
7986
7986
7986
7986
7986
7986
7986
7986
7986
7986
7986
7986
7986
7986
7986
7986
7986
7986
7986
7986
7986
7986
7986
7986
7986
7986
7986
7986
7986
7986
7986
7986
7986
7986
7986
7986
7986
7986
7986
7986
7986
7986
7986
7986
7986
7986
7986
7986
7986
7986
7986
7986
7986
7986
7986
7986
7986
7986
7986
7986
7986
7986
7986
7986
7986
7986
7986
7986
7986
7986
7986
7986
7986
7986
7986
7986
7986
7986
7986
7986
7986
7986
7986
7986
7986
7986
7986
7986
7986
7986
7986
7986
7986
7986
7986
7986
7986
7986
7986
7986
7986
7986
7986
7986
7986
7986
7986
7986
7986
7986
7986
7986
7986
7986
7986
7986
7986
7986
7986
7986
7986
7986
7986
7986
7986
7986
7986
7986
7986
7986
7986
7986
7986
7986
7986
7986
7986
7986
7986
7986
7986
7986
7986
7986
7986
7986
7986
7986
7986
7986
7986
7986
7986
7986
7986
7986
7986
7986
7986
7986
7986
7986
7986
7986
7986
7986
7986
7986
7986
7986
7986
7986
7986
7986
7986
7986
7986
7986
7986
7986
7986
7986
7986
7986
7986
7986
7986
7986
7986
7986
7986
7986
7986
7986
7986
7986
7986
7986
7986
7986
7986
7986
7986
7986
7986
7986
7986
7986
7986
7986
7986
7986
7986
7986
7986
7986
7986
7986
7986
7986
7986
7986
7987
7987
7987
7987
7987
7987
7987
7987
7987
7987
7987
7987
7987
7987
7987
7987
7987
7987
7987
7987
7987
7987
7987
7987
7987
7987
7987
7987
7987
7987
7987
7987
7987
7987
7987
7987
7987
7987
7987
7987
7987
7987
7987
7987
7987
7987
7987
7987
7988
7988
7988
7988
7988
7988
7988
7988
7988
7988
7988
7988
7988
7988
7988
7988
7988
7988
7988
7988
7988
7988
7988
7988
7988
7988
7988
7988
7988
7988
7988
7988
7988
7988
7988
7988
7988
7988
7988
7988
7988
7988
7988
7988
7988
7988
7988
7988
7988
7988
7988
7988
7988
7988
7988
7988
7988
7988
7988
7988
7988
7988
7988
7988
7988
7988
7988
7988
7988
7988
7988
7988
7988
7988
7988
7988
7988
7988
7988
7988
7988
7988
7988
7988
7988
7988
7988
7988
7988
7988
7988
7988
7988
7988
7989
7989
7989
7989
7989
7989
7989
7989
7989
7989
7989
7989
7989
7989
7989
7989
7989
7989
7989
7989
7989
7989
7989
7989
7989
7989
7989
7989
7989
7989
7989
7989
7989
7989
7989
7989
7989
7989
7989
7989
7989
7989
7989
7989
7989
7989
7989
7989
7990
7990
7990
7990
7990
7990
7990
7990
7990
7990
7990
7990
7990
7990
7990
7990
7990
7990
7990
7990
7990
7990
7990
7990
7990
7990
7990
7990
7990
7990
7990
7990
7990
7990
7990
7990
7990
7990
7990
7990
7990
7990
7990
7990
7990
7990
7990
7990
7990
7990
7990
7990
7990
7990
7990
7990
7990
7990
7990
7990
7990
7990
7990
7990
7990
7990
7990
7990
7990
7990
7990
7990
7990
7990
7990
7990
7990
7990
7990
7990
7990
7990
7990
7990
7990
7990
7990
7990
7990
7990
7990
7990
7990
7990
7990
7990
7990
7990
7990
7990
7990
7990
7990
7990
7990
7990
7990
7990
7990
7990
7990
7990
7990
7990
7990
7990
7990
7990
7990
7990
7990
7990
7990
7990
7990
7990
7990
7990
7990
7990
7990
7990
7990
7990
7990
7990
7990
7990
7990
7990
7990
7990
7990
7990
7990
7990
7990
7990
7990
7990
7990
7990
7990
7990
7990
7990
7990
7990
7990
7990
7990
7990
7990
7990
7990
7990
7990
7990
7990
7990
7990
7990
7990
7990
7990
7990
7990
7990
7990
7990
7990
7990
7990
7990
7990
7990
7990
7990
7990
7990
7990
7990
7990
7990
7990
7990
7990
7990
7990
7990
7990
7990
7990
7990
7990
7990
7990
7990
7990
7990
7990
7990
7990
7990
7990
7990
7990
7990
7990
7990
7990
7990
7990
7990
7990
7990
7990
7990
7990
7990
7990
7990
7990
7990
7990
7990
7990
7990
7990
7990
7990
7990
7990
7990
7990
7990
7990
7991
7991
7991
7991
7991
7991
7991
7991
7991
7991
7991
7991
7991
7991
7991
7991
7991
7991
7991
7991
7991
7991
7991
7991
7991
7991
7991
7991
7991
7991
7991
7991
7991
7991
7991
7991
7992
7992
7992
7992
7993
7993
7993
7993
7993
7993
7993
7993
7993
7993
7993
7993
7993
7993
7993
7993
7993
7993
7993
7993
7993
7993
7993
7993
7993
7993
7993
7993
7993
7993
7993
7993
7993
7993
7993
7993
7993
7993
7993
7993
7993
7993
7993
7993
7993
7993
7993
7993
7993
7993
7993
7993
7993
7993
7993
7993
7993
7993
7993
7993
7993
7994
7994
7994
7994
7994
7994
7994
7994
7994
7994
7994
7994
7994
7994
7994
7994
7994
7994
7994
7994
7994
7994
7994
7994
7994
7994
7994
7994
7994
7994
7994
7994
7994
7994
7994
7994
7994
7994
7994
7994
7994
7994
7994
7994
7994
7994
7994
7994
7994
7994
7994
7994
7994
7994
7994
7994
7994
7994
7994
7994
7994
7994
7994
7994
7994
7994
7994
7994
7994
7994
7994
7994
7994
7994
7994
7994
7994
7994
7994
7994
7994
7994
7994
7994
7994
7994
7994
7994
7994
7994
7994
7994
7994
7994
7994
7994
7994
7994
7994
7994
7994
7994
7994
7994
7994
7994
7994
7994
7994
7994
7994
7994
7994
7994
7994
7994
7994
7994
7994
7994
7994
7994
7994
7994
7994
7994
7994
7994
7994
7994
7994
7994
7994
7994
7994
7994
7994
7994
7994
7994
7994
7994
7994
7994
7994
7994
7994
7994
7994
7994
7994
7994
7994
7994
7994
7994
7994
7994
7994
7994
7994
7994
7994
7994
7994
7994
7994
7994
7994
7994
7994
7994
7994
7994
7994
7994
7994
7994
7994
7994
7994
7994
7994
7994
7994
7994
7994
7994
7994
7994
7994
7994
7994
7994
7994
7994
7994
7994
7994
7994
7994
7994
7994
7994
7994
7994
7994
7994
7994
7994
7994
7994
7994
7994
7994
7994
7994
7994
7994
7994
7994
7994
7994
7994
7994
7994
7994
7994
7994
7994
7994
7994
7995
7995
7995
7995
7995
7995
7995
7995
7995
7996
7996
7996
7996
7996
7996
7996
7996
7997
7997
7997
7997
7997
7997
7997
7997
7997
7997
7997
7997
7997
7997
7997
7997
7997
7997
7997
7997
7997
7997
7997
7997
7997
7997
7997
7997
7997
7997
7997
7997
7997
7997
7997
7997
7997
7997
7997
7997
7997
7997
7997
7997
7997
7997
7997
7997
7997
7997
7997
7997
7997
7997
7997
7997
7997
7997
7997
7997
7997
7997
7997
7997
7997
7997
7997
7997
7997
7997
7997
7997
7997
7997
7997
7997
7997
7997
7997
7997
7997
7997
7997
7997
7997
7997
7997
7997
7997
7997
7997
7997
7997
7997
7997
7997
7997
7997
7997
7997
7997
7997
7997
7997
7997
7997
7997
7997
7997
7997
7997
7997
7997
7997
7997
7997
7997
7997
7997
7997
7997
7998
7998
7998
7998
7998
7998
7998
7998
7998
7998
7998
7998
7998
7998
7998
7998
7998
7998
7998
7998
7998
7998
7998
7998
7998
7998
7998
7998
7998
7998
7998
7998
7998
7998
7998
7998
7998
7998
7998
7998
7998
7998
7998
7998
7998
7998
7998
7998
7998
7998
7998
7998
7998
7998
7998
7998
7998
7998
7998
7998
7998
7998
7998
7998
7998
7998
7998
7998
7998
7998
7998
7998
7998
7998
7998
7998
7998
7998
7998
7998
7998
7998
7998
7998
7998
7998
7998
7998
7998
7998
7998
7998
7998
7998
7998
7998
7998
7998
7998
7998
7998
7998
7998
7998
7998
7998
7998
7998
7998
7998
7998
7998
7998
7998
7998
7998
7998
7998
7998
7998
7998
7998
7998
7998
7998
7998
7998
7998
7998
7998
7998
7998
7998
7998
7998
7998
7998
7998
7998
7998
7998
7998
7998
7998
7998
7998
7998
7998
7998
7998
7998
7998
7998
7998
7998
7998
7998
7998
7998
7998
7998
7998
7998
7998
7998
7998
7998
7998
7998
7998
7998
7998
7998
7998
7998
7998
7998
7998
7998
7998
7998
7998
7998
7998
7998
7998
7998
7998
7998
7998
7998
7998
7998
7998
7998
7998
7998
7998
7998
7998
7998
7998
7998
7998
7998
7998
7998
7998
7998
7998
7998
7998
7998
7998
7998
7998
7998
7998
7998
7998
7998
7998
7998
7998
7998
7998
7998
7998
7998
7998
7998
7998
7998
7998
7998
7998
7998
7998
7998
7998
7998
7998
7998
7998
7998
7998
7998
7998
7998
7998
7998
7998
7998
7998
7998
7998
7998
7998
7998
7998
7998
7998
7998
7998
7998
7998
7998
7998
7998
7998
7998
7998
7998
7998
7998
7998
7998
7998
7998
7998
7998
7998
7998
7998
7998
7998
7998
7998
7998
7998
7998
7998
7998
7998
7998
7999
7999
7999
7999
7999
7999
7999
7999
7999
7999
7999
7999
7999
7999
7999
7999
7999
7999
7999
7999
7999
7999
7999
7999
7999
7999
7999
7999
7999
7999
7999
7999
7999
7999
7999
7999
7999
7999
7999
7999
7999
7999
7999
7999
7999
7999
7999
7999
7999
7999
7999
7999
7999
7999
7999
7999
7999
7999
7999
7999
7999
7999
7999
7999
7999
7999
7999
7999
7999
7999
7999
7999
7999
7999
7999
7999
7999
7999
7999
7999
7999
7999
7999
7999
7999
7999
7999
7999
7999
7999
7999
7999
7999
7999
7999
7999
7999
7999
7999
7999
7999
7999
7999
7999
7999
7999
7999
7999
7999
7999
7999
7999
7999
7999
7999
7999
7999
7999
7999
7999
7999
7999
7999
7999
7999
7999
7999
7999
7999
7999
7999
7999
7999
7999
7999
7999
7999
7999
7999
7999
7999
7999
7999
7999
7999
7999
7999
7999
7999
7999
7999
7999
7999
7999
7999
7999
7999
7999
7999
7999
7999
7999
7999
7999
7999
7999
7999
7999
7999
7999
7999
7999
7999
7999
7999
7999
7999
7999
7999
7999
7999
7999
7999
7999
7999
7999
7999
7999
7999
7999
7999
7999
7999
7999
7999
7999
7999
7999
7999
7999
7999
7999
7999
7999
7999
7999
7999
7999
7999
7999
7999
7999
7999
7999
7999
7999
7999
7999
7999
7999
7999
7999
7999
7999
7999
7999
7999
7999
7999
7999
7999
7999
7999
7999
7999
7999
7999
7999
7999
7999
7999
7999
7999
7999
7999
7999
7999
7999
7999
7999
7999
7999
7999
7999
7999
7999
7999
7999
7999
7999
7999
7999
7999
7999
7999
7999
7999
7999
7999
7999
7999
7999
7999
7999
7999
7999
7999
7999
7999
7999
7999
7999
7999
7999
7999
7999
7999
7999
7999
7999
7999
7999
7999
7999
7999
7999
7999
7999
7999
7999
7999
7999
7999
7999
7999
7999
7999
7999
7999
7999
7999
7999
7999
7999
7999
7999
7999
7999
7999
7999
7999
7999
7999
7999
7999
7999
7999
7999
7999
7999
7999
7999
7999
7999
7999
7999
7999
7999
7999
7999
7999
7999
7999
7999
7999
7999
7999
7999
7999
7999
7999
7999
7999
7999
7999
7999
7999
7999
7999
7999
7999
7999
7999
7999
7999
7999
7999
7999
7999
7999
7999
7999
7999
7999
7999
7999
7999
7999
7999
7999
7999
7999
7999
7999
7999
7999
7999
7999
7999
7999
7999
7999
7999
7999
7999
7999
7999
7999
7999
7999
7999
7999
7999
7999
7999
7999
7999
7999
7999
7999
7999
7999
7999
7999
7999
7999
7999
7999
7999
7999
7999
7999
7999
7999
7999
7999
7999
7999
7999
7999
7999
7999
7999
7999
7999
7999
7999
7999
7999
7999
7999
7999
7999
7999
7999
7999
7999
7999
7999
7999
7999
7999
7999
7999
7999
7999
7999
7999
7999
7999
7999
7999
7999
7999
7999
7999
7999
7999
7999
7999
7999
7999
7999
7999
7999
7999
7999
7999
7999
7999
7999
7999
7999
7999
7999
7999
7999
7999
7999
7999
7999
7999
7999
7999
7999
7999
7999
7999
7999
7999
7999
7999
7999
7999
7999
7999
7999
7999
7999
7999
7999
7999
7999
7999
7999
7999
7999
7999
7999
7999
7999
7999
7999
7999
7999
7999
7999
7999
7999
7999
7999
7999
7999
7999
7999
7999
7999
7999
7999
7999
7999
7999
7999
7999
7999
7999
7999
7999
7999
7999
7999
7999
7999
7999
7999
7999
7999
7999
7999
7999
7999
7999
7999
7999
7999
7999
7999
7999
7999
7999
7999
7999
7999
7999
7999
7999
7999
7999
7999
7999
7999
7999
7999
7999
7999
7999
7999
7999
7999
7999
7999
7999
7999
7999
7999
7999
7999
7999
7999
7999
7999
7999
7999
7999
7999
7999
7999
7999
7999
7999
7999
7999
7999
7999
7999
7999
7999
7999
7999
7999
7999
7999
7999
7999
7999
7999
7999
7999
7999
7999
7999
7999
7999
7999
7999
7999
7999
7999
7999
7999
7999
7999
7999
7999
7999
7999
7999
7999
7999
7999
7999
7999
7999
7999
7999
7999
7999
7999
7999
7999
7999
7999
7999
7999
7999
7999
7999
7999
7999
7999
7999
7999
7999
7999
7999
7999
7999
7999
7999
7999
7999
7999
7999
7999
7999
7999
7999
7999
7999
7999
7999
7999
7999
7999
7999
7999
7999
7999
7999
7999
7999
7999
7999
7999
7999
7999
7999
7999
7999
7999
7999
7999
7999
7999
7999
7999
7999
7999
7999
7999
7999
7999
7999
7999
7999
7999
7999
7999
7999
7999
7999
7999
7999
7999
7999
7999
7999
7999
7999
7999
7999
7999
7999
7999
7999
7999
7999
7999
7999
7999
7999
7999
7999
7999
7999
7999
7999
7999
7999
7999
7999
7999
7999
7999
7999
7999
7999
7999
7999
7999
7999
7999
7999
7999
7999
7999
7999
7999
7999
7999
7999
7999
7999
7999
7999
7999
7999
7999
7999
7999
7999
7999
7999
7999
7999
7999
7999
7999
7999
7999
7999
7999
7999
7999
7999
7999
7999
7999
7999
7999
7999
7999
7999
7999
7999
7999
7999
7999
7999
7999
7999
7999
7999
7999
7999
7999
7999
7999
7999
7999
7999
7999
7999
7999
7999
7999
7999
7999
7999
7999
7999
7999
7999
7999
7999
7999
7999
7999
7999
7999
7999
7999
7999
7999
7999
7999
7999
7999
7999
7999
7999
7999
7999
7999
7999
7999
7999
7999
7999
7999
7999
7999
7999
7999
7999
7999
7999
7999
7999
7999
7999
7999
7999
7999
7999
7999
7999
7999
7999
7999
7999
7999
7999
7999
7999
7999
7999
7999
7999
7999
7999
7999
7999
7999
7999
7999
7999
7999
7999
7999
7999
7999
7999
7999
7999
7999
7999
7999
7999
7999
7999
7999
7999
7999
7999
7999
7999
7999
7999
7999
7999
7999
7999
7999
7999
7999
7999
7999
7999
7999
7999
7999
7999
7999
7999
7999
7999
7999
7999
7999
7999
7999
7999
7999
7999
7999
7999
7999
7999
7999
7999
7999
7999
7999
7999
7999
7999
7999
7999
7999
7999
7999
7999
7999
7999
7999
7999
7999
7999
8000
8000
8000
8000
8000
8000
8000
8000
8000
8000
8000
8000
8000
8000
8000
8000
8000
8000
8000
8000
8000
8000
8000
8000
8000
8000
8000
8000
8000
8000
8000
8000
8000
8000
8000
8000
8000
8000
8000
8000
8000
8000
8000
8000
8000
8000
8000
8000
8000
8000
8000
8000
8000
8000
8000
8000
8000
8000
8000
8000
8000
8000
8000
8000
8000
8000
8000
8000
8000
8000
8000
8000
8000
8000
8000
8000
8000
8000
8000
8000
8000
8000
8000
8000
8000
8000
8000
8000
8000
8000
8000
8000
8000
8000
8000
8000
8000
8000
8000
8000
8000
8000
8000
8000
8000
8000
8000
8000
8000
8000
8000
8000
8000
8000
8000
8000
8000
8000
8000
8000
8000
8000
8000
8000
8000
8000
8000
8000
8000
8000
8000
8000
8000
8000
8000
8000
8000
8000
8000
8000
8000
8000
8000
8000
8000
8000
8000
8000
8000
8000
8000
8000
8000
8000
8000
8000
8000
8000
8000
8000
8000
8000
8000
8000
8000
8000
8000
8000
8000
8000
8000
8000
8000
8000
8000
8000
8000
8000
8000
8000
8000
8000
8000
8000
8000
8000
8000
8000
8000
8000
8000
8000
8000
8000
8000
8000
8000
8000
8000
8000
8000
8000
8000
8000
8000
8000
8000
8000
8000
8000
8000
8000
8000
8000
8000
8000
8000
8000
8000
8000
8000
8000
8000
8000
8000
8000
8000
8000
8000
8000
8000
8000
8000
8000
8000
8000
8000
8000
8000
8000
8000
8000
8000
8000
8000
8000
8000
8000
8000
8000
8000
8000
8000
8000
8000
8000
8000
8000
8000
8000
8000
8000
8000
8000
8000
8000
8000
8000
8000
8000
8000
8000
8000
8000
8000
8000
8000
8000
8000
8000
8000
8000
8000
8000
8000
8000
8000
8000
8000
8000
8000
8000
8000
8000
8000
8000
8000
8000
8000
8000
8000
8000
8000
8000
8000
8000
8000
8000
8000
8000
8000
8000
8000
8000
8000
8000
8000
8000
8000
8000
8000
8000
8000
8000
8000
8000
8000
8000
8000
8000
8000
8000
8000
8000
8000
8000
8000
8000
8000
8000
8000
8000
8000
8000
8000
8000
8000
8000
8000
8000
8000
8000
8000
8000
8000
8000
8000
8000
8000
8000
8000
8000
8000
8000
8000
8000
8000
8000
8000
8000
8000
8000
8000
8000
8000
8000
8000
8000
8000
8000
8000
8000
8000
8000
8000
8000
8000
8000
8000
8000
8000
8000
8000
8000
8000
8000
8000
8000
8000
8000
8000
8000
8000
8000
8000
8000
8000
8000
8000
8000
8000
8000
8000
8000
8000
8000
8000
8000
8000
8000
8000
8000
8000
8000
8000
8000
8000
8000
8000
8000
8000
8000
8000
8000
8000
8000
8000
8000
8000
8000
8000
8000
8000
8000
8000
8000
8000
8000
8000
8000
8000
8000
8000
8000
8000
8000
8000
8000
8000
8000
8000
8000
8000
8000
8000
8000
8000
8000
8000
8000
8000
8000
8000
8000
8000
8000
8000
8000
8000
8000
8000
8000
8000
8000
8000
8000
8000
8000
8000
8000
8000
8000
8000
8000
8000
8000
8000
8000
8000
8000
8000
8000
8000
8000
8000
8000
8000
8000
8000
8000
8000
8000
8000
8000
8000
8000
8000
8000
8000
8000
8000
8000
8000
8000
8000
8000
8000
8000
8000
8000
8000
8000
8000
8000
8000
8000
8000
8000
8000
8000
8000
8000
8000
8000
8000
8000
8000
8000
8000
8000
8000
8000
8000
8000
8000
8000
8000
8000
8000
8000
8000
8000
8000
8000
8000
8000
8000
8000
8000
8000
8000
8000
8000
8000
8000
8000
8000
8000
8000
8000
8000
8000
8000
8000
8000
8000
8000
8000
8000
8000
8000
8000
8000
8000
8000
8000
8000
8000
8000
8000
8000
8000
8000
8000
8000
8000
8000
8000
8000
8000
8000
8000
8000
8000
8000
8000
8000
8000
8000
8000
8000
8000
8000
8000
8000
8000
8000
8000
8000
8000
8000
8000
8000
8000
8000
8000
8000
8000
8000
8000
8000
8000
8000
8000
8000
8000
8000
8000
8000
8000
8000
8000
8000
8000
8000
8000
8000
8000
8000
8000
8000
8000
8000
8000
8000
8000
8000
8000
8000
8000
8000
8000
8000
8000
8000
8000
8000
8000
8000
8000
8000
8000
8000
8000
8000
8000
8000
8000
8000
8000
8000
8000
8000
8000
8000
8000
8000
8000
8000
8000
8000
8000
8000
8000
8000
8000
8000
8000
8000
8000
8000
8000
8000
8000
8000
8000
8000
8000
8000
8000
8000
8000
8000
8000
8000
8000
8000
8000
8000
8000
8000
8000
8000
8000
8000
8000
8000
8000
8000
8000
8000
8000
8000
8000
8000
8000
8000
8000
8000
8000
8000
8000
8000
8000
8000
8000
8000
8000
8000
8000
8000
8000
8000
8000
8000
8000
8000
8000
8000
8000
8000
8000
8000
8000
8000
8000
8000
8000
8000
8000
8000
8000
8000
8000
8000
8000
8000
8000
8000
8000
8000
8000
8000
8000
8000
8000
8000
8000
8000
8000
8000
8000
8000
8000
8000
8000
8000
8000
8000
8000
8000
8000
8000
8000
8000
8000
8000
8000
8000
8000
8000
8000
8000
8000
8000
8000
8000
8000
8000
8000
8000
8000
8000
8000
8000
8000
8000
8000
8000
8000
8000
8000
8000
8000
8000
8000
8000
8000
8000
8000
8000
8000
8000
8000
8000
8000
8000
8000
8000
8000
8000
8000
8000
8000
8000
8000
8000
8000
8000
8000
8000
8000
8000
8000
8000
8000
8000
8000
8000
8000
8000
8000
8000
8000
8000
8000
8000
8000
8000
8000
8000
8000
8000
8000
8000
8000
8000
8000
8000
8000
8000
8000
8000
8000
8000
8000
8000
8000
8000
8000
8000
8000
8000
8000
8000
8000
8000
8000
8000
8000
8000
8000
8000
8000
8000
8000
8000
8000
8000
8000
8000
8000
8000
8000
8000
8000
8000
8000
8000
8000
8000
8000
8000
8000
8000
8000
8000
8000
8000
8000
8000
8000
8000
8000
8000
8000
8000
8000
8000
8000
8000
8000
8000
8000
8000
8000
8000
8000
8000
8000
8000
8000
8000
8000
8000
8000
8000
8000
8000
8000
8000
8000
8000
8000
8000
8000
8000
8000
8000
8000
8000
8000
8000
8000
8000
8000
8000
8000
8000
8000
8000
8000
8000
8000
8000
8000
8000
8000
8000
8000
8000
8000
8000
8000
8000
8000
8000
8000
8000
8000
8000
8000
8000
8000
8000
8000
8000
8000
8000
8000
8000
8000
8000
8000
8000
8000
8000
8000
8000
8000
8000
8000
8000
8000
8000
8000
8000
8000
8000
8000
8000
8000
8000
8000
8000
8000
8000
8000
8000
8000
8000
8000
8000
8000
8000
8000
8000
8000
8000
8000
8000
8000
8000
8000
8000
8000
8000
8000
8000
8000
8000
8000
8000
8000
8000
8000
8000
8000
8000
8000
8000
8000
8000
8000
8000
8000
8000
8000
8000
8000
8000
8000
8000
8000
8000
8000
8000
8000
8000
8000
8000
8000
8000
8000
8000
8000
8000
8000
8000
8000
8000
8000
8000
8000
8000
8000
8000
8000
8000
8000
8000
8000
8000
8000
8000
8000
8000
8000
8000
8000
8000
8000
8000
8000
8000
8000
8000
8000
8000
8000
8000
8000
8000
8000
8000
8000
8000
8000
8000
8000
8000
8000
8000
8000
8000
8000
8000
8000
8000
8000
8000
8000
8000
8000
8000
8000
8000
8000
8000
8000
8000
8000
8000
8000
8000
8000
8000
8000
8000
8000
8000
8000
8000
8000
8000
8000
8000
8000
8000
8000
8000
8000
8000
8000
8000
8000
8000
8000
8000
8000
8000
8000
8000
8000
8000
8000
8000
8000
8000
8000
8000
8000
8000
8000
8000
8000
8000
8000
8000
8000
8000
8000
8000
8000
8000
8000
8000
8000
8000
8000
8000
8000
8000
8000
8000
8000
8000
8000
8000
8000
8000
8000
8000
8000
8000
8000
8000
8000
8000
8000
8000
8000
8000
8000
8000
8000
8000
8000
8000
8000
8000
8000
8000
8000
8000
8000
8000
8000
8000
8000
8000
8000
8000
8000
8000
8000
8000
8000
8000
8000
8000
8000
8000
8000
8000
8000
8000
8000
8000
8000
8000
8000
8000
8000
8000
8000
8000
8000
8000
8000
8000
8000
8000
8000
8000
8000
8000
8000
8000
8000
8000
8000
8000
8000
8000
8000
8000
8000
8000
8000
8000
8000
8000
8000
8000
8000
8000
8000
8000
8000
8000
8000
8000
8000
8000
8000
8000
8000
8000
8000
8000
8000
8000
8000
8000
8000
8000
8000
8000
8000
8000
8000
8000
8000
8000
8000
8000
8000
8000
8000
8000
8000
8000
8000
8000
8000
8000
8000
8000
8000
8000
8000
8000
8000
8000
8000
8000
8000
8000
8000
8000
8000
8000
8000
8000
8000
8000
8000
8000
8000
8000
8000
8000
8000
8000
8000
8000
8000
8000
8000
8000
8000
8000
8000
8000
8000
8000
8000
8000
8000
8000
8000
8000
8000
8000
8000
8000
8000
8000
8000
8000
8000
8000
8000
8000
8000
8000
8000
8000
8000
8000
8000
8000
8000
8000
8000
8000
8000
8000
8000
8000
8000
8000
8000
