Phase Function Approach (Version 0.8)

--- a software for reconstruction of rate
constant distribution in complex decay data


Released May 22, 2006
Zhuang Lab, Harvard University


Reference: Y. Zhou & X. Zhuang, Robust Reconstruction
of the Rate Constant Distribution Using the Phase
Function Method, Biophys. J., 91:pageno. (2006)

=======Probability Distribution=======
k		F(k)		+/-F(k)		+/-lnk		dF(k)/dlnk
0.000104	0.000000	0.000000	0.900000	0.000000
0.000106	0.000000	0.000000	0.900000	0.000000
0.000109	0.000000	0.000000	0.900000	0.000000
0.000112	0.000000	0.000000	0.900000	0.000000
0.000114	0.000000	0.000000	0.900000	0.000000
0.000117	0.000000	0.000000	0.900000	0.000000
0.000120	0.000000	0.000000	0.900000	0.000000
0.000123	0.000000	0.000000	0.900000	0.000000
0.000126	0.000000	0.000000	0.900000	0.000000
0.000129	0.000000	0.000000	0.900000	0.000000
0.000133	0.000000	0.000000	0.900000	0.000000
0.000136	0.000000	0.000000	0.900000	0.000001
0.000139	0.000000	0.000000	0.900000	0.000002
0.000143	0.000000	0.000000	0.900000	0.000005
0.000146	0.000000	0.000000	0.900000	0.000009
0.000150	0.000000	0.000000	0.900000	0.000014
0.000153	0.000000	0.000000	0.900000	0.000021
0.000157	0.000000	0.000000	0.900000	0.000031
0.000161	0.000000	0.000000	0.900000	0.000042
0.000165	0.000000	0.000000	0.900000	0.000054
0.000169	0.000000	0.000000	0.900000	0.000069
0.000173	0.000000	0.000000	0.900000	0.000142
0.000178	0.000000	0.000000	0.875000	0.000146
0.000182	0.000000	0.000000	0.850000	0.000150
0.000187	0.000000	0.000000	0.825000	0.000155
0.000191	0.000000	0.000000	0.800000	0.000160
0.000196	0.000000	0.000000	0.775000	0.000165
0.000201	0.000000	0.000000	0.750000	0.000170
0.000206	0.000000	0.000000	0.725000	0.000176
0.000211	0.000000	0.000000	0.700000	0.000183
0.000216	0.000000	0.000000	0.675000	0.000189
0.000222	0.000000	0.000000	0.650000	0.000197
0.000227	0.000000	0.000000	0.625000	0.000205
0.000233	0.000000	0.000000	0.600000	0.000213
0.000239	0.000000	0.000000	0.575000	0.000222
0.000244	0.000000	0.000000	0.550000	0.000232
0.000250	0.000000	0.000000	0.525000	0.000243
0.000257	0.000000	0.000000	0.500000	0.000256
0.000263	0.000000	0.000000	0.475000	0.000269
0.000270	0.000000	0.000000	0.450000	0.000284
0.000276	0.000000	0.000000	0.425000	0.000301
0.000283	0.000000	0.000000	0.400000	0.000319
0.000290	0.000000	0.000000	0.375000	0.000340
0.000297	0.000000	0.000000	0.350000	0.000362
0.000305	0.000000	0.000000	0.325000	0.000387
0.000312	0.000000	0.000000	0.325000	0.000419
0.000320	0.000006	0.000091	0.300000	0.000447
0.000328	0.000044	0.000245	0.275000	0.000478
0.000336	0.000146	0.000446	0.250000	0.000511
0.000344	0.000331	0.000674	0.250000	0.000547
0.000353	0.000615	0.000918	0.225000	0.000582
0.000362	0.001012	0.001177	0.225000	0.000620
0.000371	0.001538	0.001451	0.200000	0.000657
0.000380	0.002197	0.001734	0.200000	0.000695
0.000389	0.002990	0.002023	0.175000	0.000734
0.000399	0.003916	0.002315	0.175000	0.000771
0.000409	0.004973	0.002609	0.175000	0.000809
0.000419	0.006162	0.002904	0.150000	0.000847
0.000429	0.007475	0.003199	0.150000	0.000884
0.000440	0.008907	0.003492	0.150000	0.000919
0.000451	0.010444	0.003781	0.150000	0.000954
0.000462	0.012071	0.004065	0.150000	0.000988
0.000473	0.013768	0.004342	0.125000	0.001023
0.000485	0.015514	0.004609	0.125000	0.001054
0.000497	0.017285	0.004864	0.125000	0.001084
0.000509	0.019072	0.005110	0.125000	0.001113
0.000522	0.020865	0.005345	0.125000	0.001140
0.000535	0.022651	0.005569	0.125000	0.001166
0.000548	0.024412	0.005781	0.125000	0.001191
0.000562	0.026140	0.005982	0.125000	0.001214
0.000576	0.027824	0.006172	0.125000	0.001236
0.000590	0.029459	0.006351	0.100000	0.001258
0.000605	0.031037	0.006518	0.100000	0.001278
0.000620	0.032555	0.006676	0.100000	0.001296
0.000635	0.034011	0.006824	0.100000	0.001314
0.000651	0.035413	0.006963	0.100000	0.001331
0.000667	0.036766	0.007095	0.100000	0.001348
0.000683	0.038069	0.007219	0.100000	0.001365
0.000700	0.039321	0.007337	0.100000	0.001383
0.000718	0.040529	0.007449	0.100000	0.001400
0.000736	0.041697	0.007555	0.100000	0.001419
0.000754	0.042828	0.007657	0.100000	0.001438
0.000772	0.043928	0.007755	0.100000	0.001459
0.000792	0.045002	0.007849	0.100000	0.001481
0.000811	0.046055	0.007940	0.100000	0.001504
0.000831	0.047095	0.008029	0.100000	0.001529
0.000852	0.048126	0.008117	0.100000	0.001555
0.000873	0.049153	0.008203	0.100000	0.001583
0.000895	0.050175	0.008288	0.100000	0.001612
0.000917	0.051200	0.008372	0.100000	0.001642
0.000940	0.052236	0.008456	0.075000	0.001673
0.000963	0.053295	0.008542	0.075000	0.001705
0.000987	0.054383	0.008628	0.075000	0.001739
0.001011	0.055514	0.008718	0.075000	0.001775
0.001036	0.056703	0.008811	0.075000	0.001811
0.001062	0.057963	0.008908	0.075000	0.001849
0.001088	0.059306	0.009011	0.075000	0.001888
0.001115	0.060747	0.009119	0.075000	0.001929
0.001143	0.062295	0.009235	0.075000	0.001972
0.001171	0.063963	0.009358	0.075000	0.002016
0.001200	0.065760	0.009488	0.075000	0.002063
0.001230	0.067688	0.009626	0.075000	0.002113
0.001260	0.069739	0.009771	0.075000	0.002165
0.001292	0.071907	0.009922	0.075000	0.002220
0.001324	0.074175	0.010077	0.075000	0.002279
0.001356	0.076526	0.010235	0.075000	0.002341
0.001390	0.078930	0.010395	0.075000	0.002408
0.001425	0.081369	0.010554	0.075000	0.002479
0.001460	0.083820	0.010712	0.050000	0.002550
0.001496	0.086273	0.010868	0.050000	0.002630
0.001533	0.088713	0.011020	0.050000	0.002715
0.001571	0.091136	0.011170	0.050000	0.002806
0.001610	0.093539	0.011316	0.050000	0.002902
0.001650	0.095934	0.011460	0.050000	0.003004
0.001691	0.098320	0.011602	0.050000	0.003112
0.001733	0.100704	0.011742	0.050000	0.003224
0.001776	0.103090	0.011880	0.050000	0.003340
0.001820	0.105490	0.012017	0.050000	0.003459
0.001865	0.107914	0.012155	0.050000	0.003581
0.001911	0.110386	0.012293	0.050000	0.003703
0.001958	0.112923	0.012433	0.050000	0.003825
0.002007	0.115554	0.012577	0.050000	0.003945
0.002057	0.118307	0.012726	0.050000	0.004062
0.002108	0.121221	0.012882	0.050000	0.004175
0.002160	0.124318	0.013046	0.050000	0.004282
0.002213	0.127635	0.013219	0.050000	0.004383
0.002268	0.131209	0.013402	0.050000	0.004477
0.002324	0.135098	0.013600	0.050000	0.004565
0.002382	0.139355	0.013812	0.050000	0.004646
0.002441	0.144061	0.014043	0.050000	0.004721
0.002502	0.149278	0.014295	0.050000	0.004791
0.002564	0.155079	0.014571	0.050000	0.004854
0.002627	0.161491	0.014869	0.050000	0.004913
0.002692	0.168532	0.015189	0.050000	0.004968
0.002759	0.176151	0.015529	0.025000	0.005020
0.002827	0.184325	0.015885	0.025000	0.005067
0.002897	0.192956	0.016253	0.025000	0.005110
0.002969	0.201928	0.016626	0.025000	0.005151
0.003043	0.211040	0.016997	0.025000	0.005189
0.003118	0.220128	0.017360	0.025000	0.005225
0.003196	0.228986	0.017705	0.025000	0.005259
0.003275	0.237464	0.018030	0.025000	0.005290
0.003356	0.245407	0.018329	0.025000	0.005318
0.003439	0.252750	0.018601	0.025000	0.005344
0.003524	0.259458	0.018847	0.025000	0.005367
0.003612	0.265576	0.019068	0.025000	0.005387
0.003701	0.271133	0.019266	0.025000	0.005403
0.003793	0.276193	0.019445	0.025000	0.005415
0.003887	0.280820	0.019607	0.025000	0.005422
0.003983	0.285116	0.019757	0.025000	0.005424
0.004082	0.289146	0.019896	0.025000	0.005420
0.004183	0.292976	0.020027	0.025000	0.005411
0.004287	0.296650	0.020152	0.025000	0.005397
0.004393	0.300229	0.020273	0.025000	0.005377
0.004502	0.303755	0.020392	0.025000	0.005354
0.004614	0.307280	0.020510	0.025000	0.005327
0.004728	0.310833	0.020628	0.025000	0.005299
0.004845	0.314451	0.020748	0.025000	0.005269
0.004965	0.318154	0.020870	0.025000	0.005241
0.005088	0.321975	0.020995	0.025000	0.005214
0.005214	0.325919	0.021123	0.025000	0.005190
0.005344	0.330005	0.021255	0.025000	0.005171
0.005476	0.334234	0.021391	0.025000	0.005156
0.005612	0.338635	0.021531	0.025000	0.005146
0.005751	0.343210	0.021676	0.025000	0.005142
0.005893	0.347982	0.021826	0.025000	0.005142
0.006040	0.352939	0.021981	0.025000	0.005148
0.006189	0.358083	0.022141	0.025000	0.005158
0.006343	0.363375	0.022304	0.025000	0.005173
0.006500	0.368794	0.022470	0.025000	0.005192
0.006661	0.374289	0.022636	0.025000	0.005215
0.006826	0.379846	0.022804	0.025000	0.005242
0.006995	0.385437	0.022971	0.025000	0.005272
0.007169	0.391058	0.023138	0.025000	0.005306
0.007346	0.396665	0.023303	0.025000	0.005341
0.007528	0.402241	0.023466	0.025000	0.005379
0.007715	0.407750	0.023626	0.025000	0.005419
0.007906	0.413178	0.023783	0.025000	0.005460
0.008102	0.418496	0.023936	0.025000	0.005502
0.008303	0.423723	0.024085	0.025000	0.005544
0.008509	0.428854	0.024230	0.025000	0.005586
0.008720	0.433910	0.024373	0.025000	0.005629
0.008936	0.438894	0.024512	0.025000	0.005670
0.009157	0.443832	0.024650	0.025000	0.005710
0.009384	0.448725	0.024785	0.025000	0.005748
0.009617	0.453601	0.024919	0.025000	0.005784
0.009855	0.458475	0.025053	0.025000	0.005820
0.010099	0.463385	0.025187	0.025000	0.005854
0.010350	0.468346	0.025321	0.025000	0.005888
0.010606	0.473402	0.025458	0.025000	0.005921
0.010869	0.478571	0.025596	0.025000	0.005954
0.011138	0.483885	0.025738	0.025000	0.005987
0.011414	0.489352	0.025883	0.025000	0.006020
0.011697	0.495002	0.026032	0.025000	0.006052
0.011987	0.500834	0.026185	0.025000	0.006085
0.012284	0.506866	0.026342	0.025000	0.006119
0.012589	0.513080	0.026503	0.025000	0.006154
0.012901	0.519488	0.026668	0.025000	0.006189
0.013220	0.526066	0.026836	0.025000	0.006224
0.013548	0.532822	0.027008	0.025000	0.006259
0.013884	0.539723	0.027182	0.025000	0.006292
0.014228	0.546763	0.027359	0.025000	0.006325
0.014581	0.553888	0.027537	0.025000	0.006356
0.014942	0.561081	0.027715	0.025000	0.006384
0.015312	0.568306	0.027893	0.025000	0.006410
0.015692	0.575576	0.028071	0.025000	0.006433
0.016081	0.582877	0.028248	0.025000	0.006451
0.016479	0.590222	0.028426	0.025000	0.006463
0.016888	0.597593	0.028603	0.025000	0.006469
0.017306	0.605003	0.028779	0.025000	0.006467
0.017735	0.612425	0.028955	0.025000	0.006458
0.018175	0.619857	0.029130	0.025000	0.006440
0.018625	0.627275	0.029304	0.025000	0.006414
0.019087	0.634693	0.029477	0.025000	0.006379
0.019560	0.642117	0.029649	0.025000	0.006336
0.020045	0.649564	0.029820	0.025000	0.006284
0.020542	0.657012	0.029991	0.025000	0.006224
0.021051	0.664439	0.030160	0.025000	0.006157
0.021573	0.671810	0.030327	0.025000	0.006084
0.022107	0.679113	0.030491	0.025000	0.006006
0.022655	0.686330	0.030653	0.025000	0.005923
0.023217	0.693453	0.030811	0.025000	0.005839
0.023792	0.700466	0.030967	0.025000	0.005753
0.024382	0.707352	0.031119	0.025000	0.005666
0.024986	0.714084	0.031266	0.025000	0.005579
0.025605	0.720611	0.031409	0.025000	0.005493
0.026240	0.726877	0.031545	0.025000	0.005407
0.026890	0.732833	0.031674	0.025000	0.005324
0.027557	0.738454	0.031795	0.025000	0.005244
0.028240	0.743714	0.031908	0.025000	0.005167
0.028940	0.748614	0.032013	0.025000	0.005093
0.029657	0.753137	0.032110	0.025000	0.005023
0.030392	0.757288	0.032198	0.050000	0.004957
0.031145	0.761070	0.032279	0.050000	0.004892
0.031917	0.764517	0.032352	0.050000	0.004830
0.032708	0.767666	0.032418	0.050000	0.004770
0.033519	0.770572	0.032479	0.050000	0.004713
0.034350	0.773296	0.032537	0.050000	0.004657
0.035201	0.775912	0.032592	0.050000	0.004602
0.036073	0.778480	0.032646	0.050000	0.004548
0.036967	0.781051	0.032700	0.050000	0.004493
0.037884	0.783670	0.032754	0.050000	0.004437
0.038823	0.786372	0.032811	0.050000	0.004381
0.039785	0.789199	0.032870	0.050000	0.004324
0.040771	0.792185	0.032932	0.050000	0.004267
0.041781	0.795368	0.032998	0.050000	0.004209
0.042817	0.798769	0.033068	0.050000	0.004151
0.043878	0.802418	0.033144	0.050000	0.004094
0.044966	0.806329	0.033224	0.050000	0.004037
0.046080	0.810522	0.033311	0.050000	0.003980
0.047222	0.814989	0.033402	0.050000	0.003924
0.048393	0.819724	0.033499	0.050000	0.003868
0.049592	0.824707	0.033601	0.050000	0.003814
0.050821	0.829923	0.033707	0.050000	0.003759
0.052081	0.835341	0.033817	0.050000	0.003705
0.053371	0.840925	0.033930	0.050000	0.003649
0.054694	0.846617	0.034044	0.050000	0.003592
0.056050	0.852352	0.034159	0.050000	0.003533
0.057439	0.858064	0.034274	0.050000	0.003471
0.058863	0.863674	0.034386	0.050000	0.003406
0.060322	0.869126	0.034494	0.050000	0.003337
0.061817	0.874352	0.034598	0.050000	0.003264
0.063349	0.879322	0.034696	0.050000	0.003187
0.064919	0.883999	0.034788	0.050000	0.003105
0.066528	0.888369	0.034874	0.050000	0.003018
0.068177	0.892403	0.034953	0.050000	0.002927
0.069866	0.896098	0.035025	0.050000	0.002831
0.071598	0.899440	0.035090	0.050000	0.002730
0.073373	0.902446	0.035149	0.050000	0.002626
0.075191	0.905119	0.035201	0.050000	0.002519
0.077055	0.907477	0.035247	0.075000	0.002408
0.078964	0.909522	0.035286	0.075000	0.002297
0.080922	0.911265	0.035320	0.075000	0.002186
0.082927	0.912709	0.035348	0.075000	0.002076
0.084983	0.913870	0.035371	0.075000	0.001968
0.087089	0.914758	0.035388	0.075000	0.000786
0.089247	0.915391	0.035400	0.075000	0.000556
0.091459	0.915787	0.035408	0.075000	0.000365
0.093726	0.915979	0.035412	0.100000	0.000274
0.096049	0.916045	0.035413	0.100000	0.000163
0.098430	0.916061	0.035413	0.100000	0.000084
0.100869	0.916062	0.035413	0.100000	0.000034
0.103369	0.916062	0.035413	0.100000	0.000010
0.105931	0.916062	0.035413	0.100000	0.000002
0.108557	0.916062	0.035413	0.125000	0.000008
0.111247	0.916062	0.035413	0.125000	0.000011
0.114004	0.916062	0.035413	0.125000	0.000011
0.116830	0.916062	0.035413	0.125000	0.000011
0.119726	0.916081	0.035413	0.125000	0.000011
0.122693	0.916129	0.035414	0.125000	0.000014
0.125734	0.916168	0.035415	0.125000	0.000025
0.128850	0.916168	0.035415	0.125000	0.000053
0.132044	0.916168	0.035415	0.125000	0.000102
0.135316	0.916169	0.035415	0.100000	0.000119
0.138670	0.916197	0.035416	0.100000	0.000206
0.142107	0.916313	0.035418	0.100000	0.000332
0.145629	0.916588	0.035423	0.100000	0.000492
0.149239	0.917081	0.035433	0.100000	0.001413
0.152937	0.917818	0.035447	0.100000	0.001450
0.156728	0.918821	0.035466	0.100000	0.001486
0.160612	0.920102	0.035491	0.100000	0.001519
0.164593	0.921672	0.035521	0.100000	0.001550
0.168672	0.923530	0.035557	0.100000	0.001576
0.172853	0.925683	0.035599	0.100000	0.001598
0.177137	0.928128	0.035646	0.100000	0.001616
0.181527	0.930876	0.035698	0.100000	0.001630
0.186027	0.933918	0.035757	0.100000	0.001639
0.190637	0.937254	0.035820	0.100000	0.001643
0.195362	0.940870	0.035889	0.100000	0.001644
0.200204	0.944752	0.035963	0.100000	0.001640
0.205166	0.948863	0.036042	0.100000	0.001632
0.210251	0.953161	0.036123	0.100000	0.001621
0.215462	0.957586	0.036207	0.100000	0.001605
0.220802	0.962072	0.036292	0.100000	0.001586
0.226275	0.966548	0.036376	0.100000	0.001563
0.231883	0.970928	0.036458	0.100000	0.001536
0.237630	0.975132	0.036537	0.100000	0.001504
0.243520	0.979064	0.036611	0.100000	0.001469
0.249555	0.982656	0.036678	0.100000	0.001430
0.255740	0.985835	0.036737	0.100000	0.001386
0.262079	0.988557	0.036788	0.100000	0.001338
0.268574	0.990783	0.036829	0.100000	0.001286
0.275231	0.992514	0.036861	0.125000	0.001224
0.282053	0.993759	0.036884	0.125000	0.001165
0.289043	0.994560	0.036899	0.125000	0.001102
0.296207	0.994970	0.036907	0.125000	0.001037
0.303548	0.995096	0.036909	0.150000	0.000965
0.311072	0.995106	0.036909	0.150000	0.000360
0.318782	0.995106	0.036909	0.175000	0.000309
0.326683	0.995106	0.036909	0.175000	0.000185
0.334779	0.995106	0.036909	0.200000	0.000162
0.343077	0.995106	0.036909	0.225000	0.000144
0.351580	0.995106	0.036909	0.225000	0.000075
0.360294	0.995106	0.036909	0.250000	0.000067
0.369223	0.995106	0.036909	0.275000	0.000061
0.378375	0.995106	0.036909	0.300000	0.000056
0.387752	0.995106	0.036909	0.325000	0.000052
0.397363	0.995106	0.036909	0.350000	0.000048
0.407211	0.995106	0.036909	0.375000	0.000045
0.417304	0.995106	0.036909	0.400000	0.000042
0.427647	0.995106	0.036909	0.425000	0.000040
0.438246	0.995106	0.036909	0.450000	0.000037
0.449108	0.995106	0.036909	0.475000	0.000035
0.460239	0.995106	0.036909	0.500000	0.000034
0.471646	0.995106	0.036909	0.525000	0.000032
0.483335	0.995106	0.036909	0.550000	0.000031
0.495315	0.995106	0.036909	0.575000	0.000029
0.507591	0.995106	0.036909	0.600000	0.000028
0.520171	0.995106	0.036909	0.625000	0.000033
0.533064	0.995106	0.036909	0.650000	0.000049
0.546276	0.995106	0.036909	0.675000	0.000051
0.559815	0.995106	0.036909	0.700000	0.000049
0.573690	0.995106	0.036909	0.725000	0.000047
0.587909	0.995106	0.036909	0.750000	0.000046
0.602480	0.995106	0.036909	0.775000	0.000044
0.617412	0.995106	0.036909	0.800000	0.000043
0.632714	0.995106	0.036909	0.825000	0.000041
0.648396	0.995106	0.036909	0.850000	0.000040
0.664466	0.995106	0.036909	0.875000	0.000039
0.680935	0.995106	0.036909	0.900000	0.000038
0.697812	0.995106	0.036909	0.900000	0.000027
0.715107	0.995106	0.036909	0.900000	0.000021
0.732831	0.995106	0.036909	0.900000	0.000019
0.750994	0.995106	0.036909	0.900000	0.000019
0.769607	0.995106	0.036909	0.900000	0.000019
0.788682	0.995106	0.036909	0.900000	0.000019
0.808229	0.995106	0.036909	0.900000	0.000019
0.828261	0.995106	0.036909	0.900000	0.000019
0.848789	0.995106	0.036909	0.900000	0.000019
0.869826	0.995106	0.036909	0.900000	0.000019
0.891384	0.995106	0.036909	0.900000	0.000019
0.913477	0.995122	0.036910	0.900000	0.000019
0.936117	0.995200	0.036911	0.900000	0.000019
0.959319	0.995401	0.036915	0.900000	0.000019
0.983095	0.995806	0.036922	0.900000	0.000019
1.007461	0.996293	0.036931	0.900000	0.000019
1.032431	0.996487	0.036935	0.900000	0.000019
1.058019	0.996495	0.036935	0.900000	0.000019
1.084242	0.996495	0.036935	0.900000	0.000019
1.111115	0.996495	0.036935	0.900000	0.000019
1.138653	0.996495	0.036935	0.900000	0.000019
1.166875	0.996495	0.036935	0.900000	0.000019
1.195795	0.996495	0.036935	0.900000	0.000019
1.225433	0.996495	0.036935	0.900000	0.000019
1.255805	0.996495	0.036935	0.900000	0.000019
1.286930	0.996495	0.036935	0.900000	0.000019
1.318826	0.996495	0.036935	0.900000	0.000019
1.351513	0.996495	0.036935	0.900000	0.000019
1.385010	0.996495	0.036935	0.900000	0.000019
1.419337	0.996495	0.036935	0.900000	0.000019
1.454515	0.996495	0.036935	0.900000	0.000019
1.490565	0.996495	0.036935	0.900000	0.000019
1.527508	0.996495	0.036935	0.900000	0.000019
1.565367	0.996495	0.036935	0.900000	0.000019
1.604164	0.996495	0.036935	0.900000	0.000019
1.643923	0.996495	0.036935	0.900000	0.000019
1.684667	0.996495	0.036935	0.900000	0.000019
1.726421	0.996495	0.036935	0.900000	0.000019
1.769210	0.996495	0.036935	0.900000	0.000019
1.813059	0.996495	0.036935	0.900000	0.000019
1.857996	0.996495	0.036935	0.900000	0.000019
1.904046	0.996495	0.036935	0.900000	0.000019
1.951237	0.996495	0.036935	0.900000	0.000019
1.999598	0.996495	0.036935	0.900000	0.000019
2.049157	0.996495	0.036935	0.900000	0.000019
2.099945	0.996495	0.036935	0.900000	0.000019
2.151992	0.996495	0.036935	0.900000	0.000019
2.205329	0.996495	0.036935	0.900000	0.000019
2.259987	0.996495	0.036935	0.900000	0.000018
2.316000	0.996495	0.036935	0.900000	0.000015
2.373402	0.996495	0.036935	0.900000	0.00001
2.432226	0.996495	0.036935	0.900000	0.000003
2.492508	0.996495	0.036935	0.900000	0.000000
2.554284	0.996495	0.036935	0.900000	0.000000
2.617592	0.996495	0.036935	0.900000	0.000000

=======Phase Function========
k		phi(ik)/pi
0.000102	0.000000
0.000105	0.000000
0.000108	0.000000
0.000110	0.000000
0.000113	0.000000
0.000116	0.000000
0.000119	0.000000
0.000122	0.000000
0.000125	0.000000
0.000128	0.000000
0.000131	0.000000
0.000134	0.000000
0.000137	0.000000
0.000141	0.000000
0.000144	0.000000
0.000148	0.000000
0.000152	0.000000
0.000155	0.000000
0.000159	0.000000
0.000163	0.000000
0.000167	0.000000
0.000171	0.000000
0.000176	0.000000
0.000180	0.000000
0.000184	0.000000
0.000189	0.000000
0.000194	0.000000
0.000198	0.000000
0.000203	0.000000
0.000208	0.000000
0.000214	0.000000
0.000219	0.000000
0.000224	0.000000
0.000230	0.000000
0.000236	0.000000
0.000241	0.000000
0.000247	0.000000
0.000254	0.000000
0.000260	0.000000
0.000266	0.000000
0.000273	0.000000
0.000280	0.000000
0.000287	0.000000
0.000294	0.000000
0.000301	0.000000
0.000308	0.000428
0.000316	0.002225
0.000324	0.004840
0.000332	0.007929
0.000340	0.011387
0.000349	0.015494
0.000357	0.019827
0.000366	0.024345
0.000375	0.028655
0.000384	0.033210
0.000394	0.037553
0.000404	0.042128
0.000414	0.046352
0.000424	0.050682
0.000434	0.054271
0.000445	0.057862
0.000456	0.060374
0.000468	0.062601
0.000479	0.063657
0.000491	0.065055
0.000503	0.065543
0.000516	0.065873
0.000528	0.065179
0.000542	0.064624
0.000555	0.063009
0.000569	0.061709
0.000583	0.059536
0.000597	0.057579
0.000612	0.055146
0.000627	0.053461
0.000643	0.051442
0.000659	0.049609
0.000675	0.047424
0.000692	0.045910
0.000709	0.044093
0.000727	0.042749
0.000745	0.041291
0.000763	0.040352
0.000782	0.039253
0.000801	0.038770
0.000821	0.038217
0.000841	0.037896
0.000862	0.037320
0.000884	0.037438
0.000906	0.037572
0.000928	0.038281
0.000951	0.039016
0.000975	0.040558
0.000999	0.042246
0.001024	0.044653
0.001049	0.047190
0.001075	0.050527
0.001102	0.053691
0.001129	0.057923
0.001157	0.061910
0.001185	0.066341
0.001215	0.070126
0.001245	0.074315
0.001276	0.077443
0.001307	0.080541
0.001340	0.082146
0.001373	0.083728
0.001407	0.083948
0.001442	0.084366
0.001478	0.083621
0.001514	0.083140
0.001552	0.082097
0.001590	0.081830
0.001630	0.080883
0.001670	0.080544
0.001712	0.079751
0.001754	0.079796
0.001797	0.079551
0.001842	0.080537
0.001888	0.081443
0.001934	0.083671
0.001982	0.086167
0.002032	0.090177
0.002082	0.094033
0.002133	0.099455
0.002186	0.105080
0.002241	0.112927
0.002296	0.121317
0.002353	0.132622
0.002411	0.144823
0.002471	0.160060
0.002532	0.175826
0.002595	0.193934
0.002659	0.211451
0.002725	0.231594
0.002793	0.251409
0.002862	0.272362
0.002933	0.290883
0.003006	0.309070
0.003080	0.323412
0.003156	0.335134
0.003235	0.340483
0.003315	0.340726
0.003397	0.333784
0.003481	0.323088
0.003568	0.306476
0.003656	0.286868
0.003747	0.264749
0.003839	0.245649
0.003935	0.227549
0.004032	0.212831
0.004132	0.199288
0.004234	0.189825
0.004339	0.182057
0.004447	0.177913
0.004557	0.174626
0.004670	0.174198
0.004786	0.174172
0.004904	0.176739
0.005026	0.178885
0.005151	0.182797
0.005278	0.186291
0.005409	0.192048
0.005543	0.197494
0.005681	0.205226
0.005821	0.212279
0.005966	0.221041
0.006113	0.228218
0.006265	0.236144
0.006420	0.241716
0.006579	0.247956
0.006742	0.252775
0.006910	0.258659
0.007081	0.262149
0.007256	0.265927
0.007436	0.267211
0.007620	0.268083
0.007809	0.266098
0.008003	0.264779
0.008201	0.261702
0.008404	0.259450
0.008613	0.255869
0.008826	0.253602
0.009045	0.249871
0.009269	0.247688
0.009499	0.244860
0.009734	0.244219
0.009976	0.243153
0.010223	0.244838
0.010476	0.246504
0.010736	0.250540
0.011002	0.254217
0.011275	0.260451
0.011554	0.266205
0.011840	0.274046
0.012134	0.281019
0.012435	0.289775
0.012743	0.297641
0.013059	0.307273
0.013382	0.315958
0.013714	0.325999
0.014054	0.334185
0.014402	0.342568
0.014759	0.348980
0.015125	0.356458
0.015500	0.362919
0.015884	0.370583
0.016278	0.377412
0.016681	0.385596
0.017095	0.393006
0.017518	0.400930
0.017952	0.407499
0.018397	0.414749
0.018853	0.422190
0.019321	0.431648
0.019799	0.441522
0.020290	0.452069
0.020793	0.461951
0.021308	0.472138
0.021837	0.482340
0.022378	0.493116
0.022932	0.504372
0.023501	0.516672
0.024083	0.530643
0.024680	0.545261
0.025292	0.559947
0.025919	0.573280
0.026561	0.586212
0.027219	0.597065
0.027894	0.607689
0.028585	0.615824
0.029294	0.622063
0.030020	0.622938
0.030764	0.618895
0.031526	0.606570
0.032308	0.585313
0.033109	0.553870
0.033929	0.517361
0.034770	0.480070
0.035632	0.446314
0.036515	0.418632
0.037420	0.396502
0.038347	0.381551
0.039298	0.372041
0.040272	0.368857
0.041270	0.369022
0.042293	0.373702
0.043341	0.380854
0.044415	0.392045
0.045516	0.404466
0.046644	0.419249
0.047800	0.434657
0.048985	0.452130
0.050199	0.470816
0.051443	0.491371
0.052718	0.512916
0.054025	0.535155
0.055364	0.558271
0.056736	0.580890
0.058142	0.604085
0.059583	0.625718
0.061060	0.647691
0.062573	0.668051
0.064124	0.689639
0.065713	0.709655
0.067342	0.730670
0.069011	0.749329
0.070722	0.769031
0.072474	0.787030
0.074271	0.806438
0.076112	0.825166
0.077998	0.845860
0.079931	0.865767
0.081912	0.887720
0.083942	0.909609
0.086023	0.933305
0.088155	0.957847
0.090340	0.982394
0.092579	0.993432
0.094873	0.999688
0.097225	1.000000
0.099634	1.000000
0.102104	1.000000
0.104634	1.000000
0.107228	1.000000
0.109885	1.000000
0.112609	1.000000
0.115400	0.913985
0.118260	0.239303
0.121191	0.000000
0.124195	0.000000
0.127273	0.000000
0.130427	0.000702
0.133660	0.020059
0.136973	0.046484
0.140368	0.080721
0.143847	0.113673
0.147412	0.143234
0.151065	0.172762
0.154809	0.199620
0.158646	0.226736
0.162578	0.251225
0.166608	0.276602
0.170737	0.300374
0.174969	0.326016
0.179305	0.350660
0.183749	0.377124
0.188304	0.403520
0.192971	0.432127
0.197753	0.461246
0.202655	0.491674
0.207677	0.522845
0.212825	0.554602
0.218099	0.587833
0.223505	0.621242
0.229045	0.656662
0.234721	0.691191
0.240539	0.727558
0.246501	0.762790
0.252610	0.799905
0.258871	0.835173
0.265287	0.871482
0.271862	0.906146
0.278600	0.940811
0.285505	0.972984
0.292581	0.997178
0.299833	1.000000
0.307264	1.000000
0.314880	1.000000
0.322684	1.000000
0.330681	1.000000
0.338877	1.000000
0.347276	1.000000
0.355883	1.000000
0.364704	1.000000
0.373743	1.000000
0.383006	1.000000
0.392499	1.000000
0.402227	1.000000
0.412196	1.000000
0.422412	1.000000
0.432881	1.000000
0.443610	1.000000
0.454605	1.000000
0.465872	1.000000
0.477419	1.000000
0.489252	1.000000
0.501378	1.000000
0.513804	1.000000
0.526539	1.000000
0.539589	1.000000
0.552962	1.000000
0.566667	1.000000
0.580712	1.000000
0.595105	1.000000
0.609854	1.000000
0.624970	1.000000
0.640459	1.000000
0.656333	1.000000
0.672600	1.000000
0.689270	1.000000
0.706354	1.000000
0.723860	1.000000
0.741801	1.000000
0.760186	1.000000
0.779028	1.000000
0.798336	1.000000
0.818122	1.000000
0.838399	1.000000
0.859179	1.000000
0.880473	0.941963
0.902295	0.641614
0.924659	0.531848
0.947576	0.631049
0.971061	0.819933
0.995129	0.990074
1.019793	1.000000
1.045068	1.000000
1.070970	1.000000
1.097514	1.000000
1.124715	1.000000
1.152591	1.000000
1.181158	1.000000
1.210433	1.000000
1.240433	1.000000
1.271177	1.000000
1.302683	1.000000
1.334969	1.000000
1.368056	1.000000
1.401963	1.000000
1.436710	1.000000
1.472319	1.000000
1.508810	1.000000
1.546206	1.000000
1.584528	1.000000
1.623800	1.000000
1.664045	1.000000
1.705288	1.000000
1.747554	1.000000
1.790866	1.000000
1.835253	1.000000
1.880739	1.000000
1.927352	1.000000
1.975121	1.00000
2.024074	1.000000
2.074241	1.000000
2.125650	1.000000
2.178334	1.000000
2.232323	1.000000
2.287651	1.000000
2.344350	1.000000
2.402454	1.000000
2.461998	1.000000
2.523018	1.00000
