Population Name, 25346_Young_CTRL_M , 25347_Young_CTRL_M , 25348_Young_CTRL_M , 20497_Old_CTRL_M , 20498_Old_CTRL_M , 20499_Old_CTRL_M , 25350_Young_CTRL_F , 25351_Young_CTRL_F , 25352_Young_CTRL_F , 20485_Old_CTRL_F , 20486_Old_CTRL_F , 20487_Old_CTRL_F ,24778_Young_MUT_M,24779_Young_MUT_M,24780_Young_MUT_M,19426_Old_MUT_M,19427_Old_MUT_M,19428_Old_MUT_M,24783_Young_MUT_F,24784_Young_MUT_F,24785_Young_MUT_F,19432_Old_MUT_F,19433_Old_MUT_F,19434_Old_MUT_F
NAME,25346_Young_CTRL_M,25347_Young_CTRL_M,25348_Young_CTRL_M,20497_Old_CTRL_M,20498_Old_CTRL_M,20499_Old_CTRL_M,25350_Young_CTRL_F,25351_Young_CTRL_F,25352_Young_CTRL_F,20485_Old_CTRL_F,20486_Old_CTRL_F,20487_Old_CTRL_F,24778_Young_MUT_M,24779_Young_MUT_M,24780_Young_MUT_M,19426_Old_MUT_M,19427_Old_MUT_M,19428_Old_MUT_M,24783_Young_MUT_F,24784_Young_MUT_F,24785_Young_MUT_F,19432_Old_MUT_F,19433_Old_MUT_F,19434_Old_MUT_F
Mice id,25346,25347,25348,20497,20498,20499,25350,25351,25352,20485,20486,20487,24778,24779,24780,19426,19427,19428,24783,24784,24785,19432,19433,19434
Mutation,CTRL,CTRL,CTRL,CTRL,CTRL,CTRL,CTRL,CTRL,CTRL,CTRL,CTRL,CTRL,MUT,MUT,MUT,MUT,MUT,MUT,MUT,MUT,MUT,MUT,MUT,MUT
GROUP,Young,Young,Young,Old,Old,Old,Young,Young,Young,Old,Old,Old,Young,Young,Young,Old,Old,Old,Young,Young,Young,Old,Old,Old
GENOTYPE,SS,SS,SS,SS,SS,SS,SS,SS,SS,SS,SS,SS,SS,SS,SS,SS,SS,SS,SS,SS,SS,SS,SS,SS
SEX,M,M,M,M,M,M,F,F,F,F,F,F,M,M,M,M,M,M,F,F,F,F,F,F
AGE,6,6,6,13,13,13,6,6,6,13,13,13,6,6,6,13,13,13,6,6,6,13,13,13
Comment,,,,,,,,,,,,,,,,,,,,,,,,
Cellularity_Spleen,140.04,188.128,110.44,134.648,163.944,119.296,92.736,169.536,120.04,174.832,141.856,166.088,362.784,119.44,194.424,125.264,172.304,209.24,153.224,308.1,89.944,110.008,114.36,103.696
NK Cells_CYTO_P03A_Spleen,2.73,2.92,3.03,2.3,2.1,2.18,2.92,2.92,2.66,2.6,2.8,2.9,2.5,2.1,2.5,1.5,1.7,1.5,1.9,1.5,1.6,1.9,1.9,1.7
 NK Stage I_CYTO_P03A_Spleen,2,2.2,2.1,4,3.8,4.2,3.5,3.2,3.1,3.8,4.3,2.2,4.9,4.6,3,3.4,4.5,4.5,4.4,3.8,3.5,4.1,4.1,4.8
NK Stage II_CYTO_P03A_Spleen,54.5,55.1,62.5,56.7,59.6,56.2,58.2,57.5,51.6,58.4,66.4,58.6,62.3,55.5,58.6,65.3,55.7,61.6,62.3,47,50.4,53,53.5,54.4
NK Stage III_CYTO_P03A_Spleen,28.1,28.5,22.6,16.8,15.8,19.7,23.5,24.2,23.3,12.7,10.1,16,14.2,15.7,19.9,13.9,15.7,14.6,13.5,23.9,20.4,13.4,14.8,13.3
NK Stage IV_CYTO_P03A_Spleen,13.6,12.6,11.3,20.8,19.3,18.2,12.6,13,18.8,22.6,16.9,20.8,16,21.3,16.2,15.1,21.1,16.6,16.3,23.6,23.7,26.9,24.1,25.3
NK EM_CYTO_P03A_Spleen,13.4,17.3,15.3,26,44.6,19,18.3,17.3,24.3,25.9,21.9,15.3,9.3,11.4,13.1,17.5,13.7,17.1,10,19.5,16.5,13.7,16.5,16.9
NK CM_CYTO_P03A_Spleen,85.4,82,84.1,72.9,54,80,80.7,81.6,74.2,72.2,77.2,82.7,86.8,84.3,85.1,81.6,84.7,81.8,89.1,77.7,81.6,83.7,80.5,79.9
L-T_CYTO_P03A_Spleen,30.65,27.77,30.54,21.7,19.3,21.24,28.49,26.65,27.04,27.5,29.3,27.4,29.9,28.7,26.9,24.9,28.8,21.8,30.3,28,26.6,23.3,27,27
ab-T_CYTO_P03A_Spleen,27.04,25.04,28.1,19.9,17.8,19.38,25.48,23.51,23.75,24.5,26.3,24.6,27.6,26.3,24.2,22.8,24.9,20,26.8,25.4,24.2,21.6,24.8,24.6
CD4+ SP_CYTO_P03A_Spleen,17.17,15.87,18.33,12,11.3,11.96,15.73,14.65,14.77,14.3,15.8,14.6,18,18.2,16.8,12.3,14.6,11.3,16.9,14.7,15.4,12.6,14.4,14
Conventional CD4+_CYTO_P03A_Spleen,17.03,15.77,18.28,12,11.2,11.9,15.71,14.62,14.76,14.3,15.8,14.4,18,18.2,16.7,12.3,14.6,11.3,16.9,14.7,15.4,12.6,14.4,14
EM/CM CD4 _CYTO_P03A_Spleen,15.1,16.9,14.8,29.9,38.3,28,15.8,15.1,18.3,32.4,29.2,38.8,3.3,4.8,3.6,8.8,11.7,11.7,4,5.4,4.8,7.9,7.5,7.8
Naive CD4 _CYTO_P03A_Spleen,81.7,79.3,81.5,65.7,57.4,68.9,81.4,82.5,77.7,66.1,68.8,58,92.7,92.9,92.6,87.3,85.4,84.4,94.1,91.1,91.6,89.5,87.5,89.9
Early CD4  _CYTO_P03A_Spleen,8.36,7.67,7.42,5.1,4.9,6.61,7.51,7.67,6.21,6.4,6.6,6.3,5.1,9.2,9.3,7,6.3,7,9.6,8.9,11.9,11,9.3,9.4
Late CD4 _CYTO_P03A_Spleen,72.51,70.96,73.9,60.3,52.2,61.85,73.65,74.54,71.14,59.5,62,50.8,87.5,83.6,83.2,80.1,79.1,77.3,84.3,82.1,79.5,78.2,78,80.3
Ly6C+ CD4 _CYTO_P03A_Spleen,36.8,30.6,29.3,22.1,25.8,23.6,36.9,33.8,35,21.2,23,16.1,33.6,31.8,30.1,38.1,38.2,38,31.2,35,29.9,27.1,27.5,26
Treg_CYTO_P03A_Spleen,0.8,0.6,0.3,0.4,0.3,0.5,0.1,0.2,0.1,0.1,0.1,1.5,0.1,0.1,0.1,0,0.1,0,0.1,0.1,0.1,0.1,0.1,0
EM TReg _CYTO_P03A_Spleen,30.7,32.5,30.2,51.3,68.6,47.7,30,31.8,37.1,54.5,46.3,69.8,34.5,34.5,28,47.6,71.1,39.1,22.2,40.9,35.9,38.5,26.1,12.5
CM  TReg  _CYTO_P03A_Spleen,68.8,66.1,68.9,46,29.4,51.6,70,68.2,62.9,45.5,53.7,30,62.1,65.5,70.7,52.4,28.9,56.5,77.8,59.1,64.1,56.4,73.9,87.5
Early  Treg _CYTO_P03A_Spleen,16.9,17.8,19.1,15.1,21.1,15.4,19,20.5,25,16,45.5,25.2,16.7,19.4,22.6,36.4,27.3,23.1,35.7,26.9,39,40.9,35.3,57.1
Late  Treg _CYTO_P03A_Spleen,81.5,80.5,79,84.9,77.2,83.2,79.4,75,65.9,80,50,73.4,83.3,80.6,75.5,36.4,63.6,69.2,60.7,65.4,58.5,50,50,35.7
Ly6C+ Treg _CYTO_P03A_Spleen,12.7,11.5,8.5,2.7,7.2,6.9,21.1,16.3,17.1,7.3,14.6,13.5,31,18.2,17.3,9.5,5.3,13,19.4,13.6,25,17.9,34.8,25
CD8 SP_CYTO_P03A_Spleen,9.17,8.44,9.01,7.3,5.9,6.79,8.94,8.09,8.2,9.2,9.5,8.9,8.7,6.9,6.3,9.7,9.4,8,8.1,8.9,7.2,7.5,8.7,8.9
EM CD8 _CYTO_P03A_Spleen,3.5,5.3,3.9,7.3,11.9,6.6,4,3.9,7.2,6,4,5.3,1.8,2.2,3.4,5,4.4,4.4,0.7,2.6,4.2,1.7,2.3,1.4
CM CD8 _CYTO_P03A_Spleen,26.13,24.5,21.81,24.4,26.8,30.8,22.6,24.5,18.9,26.3,24.1,28.7,18.5,22.3,23.1,27.4,26.6,29,21.5,29.3,24.4,32.7,32.3,26.1
Naive CD8 _CYTO_P03A_Spleen,68.98,68,72.78,65,56.7,60.52,72.11,69.93,71.01,67.1,70.9,64.4,74.7,71.6,70.3,64.6,65.3,63,74.4,60,64.6,63.7,62.9,70.3
Ly6C+ CD8 _CYTO_P03A_Spleen,42.3,40.9,33.9,34.3,43.9,38.6,28.4,30.4,31.4,30.6,26.1,29.9,51.1,40.9,44.6,46.2,53.3,48.9,26.9,44.3,34.9,28.7,32,26.3
Late CD8 _CYTO_P03A_Spleen,61.19,61.33,65.51,60,51.8,54.05,64.83,63.08,64.91,59.9,63.2,56.3,69.4,63.3,61.6,58.3,58.6,56.5,65.4,53.1,55.9,54.6,55.5,61.7
Early CD8 _CYTO_P03A_Spleen,7.66,6.53,7.13,4.9,4.8,6.42,7.21,6.78,5.97,7.1,7.6,8,5.3,8.3,8.6,6.3,6.7,6.4,9,6.8,8.6,9.1,7.3,8.7
gd-T_CYTO_P03A_Spleen,0.32,0.26,0.3,0.3,0.3,0.28,0.29,0.28,0.26,0.4,0.4,0.6,0.2,0.2,0.2,0.3,0.3,0.2,0.3,0.4,0.3,0.3,0.3,0.3
EM gd-T _CYTO_P03A_Spleen,12.1,20.8,19.8,18.4,18.2,13,23.7,20.6,30.5,11,12.9,9.5,12.4,14.8,15.3,9.3,7.6,10.3,16,14.4,16,7.9,8.9,9.1
Naive gd-T _CYTO_P03A_Spleen,85.9,78.7,78.9,80.2,80.3,86.3,76,78.8,68.6,88.4,86.6,90.2,86.9,84.5,83.9,90.3,92.1,89,83.7,84.8,83.5,91.9,90.6,90.6
Late gd-T _CYTO_P03A_Spleen,53.26,52.18,53.42,56.5,65.4,66.8,51.68,54.61,49.12,68.5,69.4,65.2,67.4,61.7,60,74.6,70.2,72.3,52.6,62.5,60.7,70.9,71.3,70.9
Early gd-T _CYTO_P03A_Spleen,4.51,6.8,6.32,5.3,3.3,2.87,7.44,5.95,8.33,2.4,2.5,2.6,2.8,4,4.3,1.6,1.8,1.9,5.8,3.8,4.3,1.8,1.9,2
Ly6C+ gd-T _CYTO_P03A_Spleen,31.4,30.8,26.7,43.6,57.1,49,24.9,26,25.3,48.3,51.4,49,43,39,39.7,68.8,67.7,66.9,33.9,36.2,33.8,55.2,54,50.8
Monocytes_CYTO_P03A_Spleen,1.12,0.78,0.83,1,0.9,0.88,0.7,0.91,0.79,0.7,0.6,0.5,0.8,1.1,1.2,0.5,0.6,0.6,0.6,0.8,0.6,0.9,1.2,0.8
Granulocytes_CYTO_P03A_Spleen,2.05,1.25,1.75,1.7,2.8,1.44,1.39,1.61,1.36,1.8,1.7,1.7,1.2,1.6,1.5,2.8,1.2,2.5,1.7,2,1.2,2.5,2.2,2.1
NKT_CYTO_P03A_Spleen,0.7,0.72,0.64,0.9,1.1,0.98,1,1.02,0.96,1.8,1.4,2.1,0.9,1,0.7,1.4,1.3,1.4,1,1.1,0.8,1.5,1.7,1.9
Ly6C NKT _CYTO_P03A_Spleen,36.6,32,34.6,45.7,40.1,43.1,32.9,33.7,30,53.5,51.5,47.7,61.7,52.3,55,77.3,73.8,75.1,55.9,52.3,50.3,60.6,59.9,63.1
Klrg1+  CD4 _CYTO_P03A_Spleen,3,3.4,2.7,4.1,4.4,4.1,0.9,1,1,1.7,1.2,5.5,1.7,1.9,2,1.9,2.7,2.5,3.2,2.8,2.5,3.1,2.6,2.6
Klrg1+  CD8 _CYTO_P03A_Spleen,0.8,0.8,1.6,0.9,2.2,1.7,0.3,0.4,0.4,1.3,0.5,3.3,0.3,0.4,0.4,0.7,1,0.6,0.7,0.7,0.5,0.9,0.7,0.6
Klrg1+ gd-T _CYTO_P03A_Spleen,6.1,3.6,3.5,4.6,2.5,2.5,2,1.3,1.9,1.9,1.9,5.2,5.4,7.6,5.6,4.2,2.6,2.1,4.6,2.5,1.1,2.2,3.1,4.5
Klrg1+ NK _CYTO_P03A_Spleen,40.8,38.2,46.9,36.3,40.4,39.1,32.3,37.6,31.4,39.4,44.3,47.6,46.9,37,43.4,41.4,36.7,39.5,38.6,37.4,34.9,40.5,39.5,37.8
B cells_CYTO_P03B_Spleen,4.8,3.9,4.2,2.4,1.6,2.9,2.4,1.9,1.6,1.7,2.4,3.2,4.6,3.5,5.3,2.5,2.6,2.4,4,2.9,3,3.6,2.8,3
CD45Rhi_CYTO_P03B_Spleen,84.99,84.08,85.95,88,85.3,90.5,87.09,82.8,83.44,86,88.2,87.8,86.9,83.9,83.9,87.6,83.3,88,82.8,85.8,81,87.2,88.7,87.4
CD23lolCD21/35-_CYTO_P03B_Spleen,45.47,35.68,28.31,27.7,26.2,20.43,59.6,37.97,25.2,20.6,7.2,45.6,26.5,22.3,25.6,13.6,14.5,14.7,28.6,23.6,21.2,17.1,13.2,7.5
B Mem_CYTO_P03B_Spleen,12.66,9.66,11.15,2.6,4.3,2.69,14.85,13.11,8.58,6.2,3.5,6.9,12.1,10.7,11.1,5.2,5.8,5.4,12,13.7,10.3,8.2,5.7,4.6
T1_CYTO_P03B_Spleen,32.01,25.24,16.14,24.6,21.2,17.29,43,23.62,15.72,13.8,3.4,37.4,14,10.6,13.4,7.8,8,8.7,15.4,9,10.2,8.3,7.1,2.8
CD23hiCD21/35int_CYTO_P03B_Spleen,20.81,33.44,43.46,35.3,41.5,44.8,15.29,37.12,50.36,47.8,70.2,16.1,51,52,46.7,61.6,57.7,60.5,45.3,54.2,52.7,59.4,62.5,69.2
T2_CYTO_P03B_Spleen,1.36,1.65,2.79,0.6,0.9,0.82,1.23,2.78,2.81,1.7,1.9,0.6,3.8,3.5,3.4,2.5,2.4,2.3,3.6,6,3.7,3.1,2.3,3.7
T3 + FO_CYTO_P03B_Spleen,19.12,31.34,39.9,34.5,40.2,43.64,13.76,33.67,46.74,45.5,67.6,15.3,46.5,47.7,42.5,58.4,54.6,57.6,40.9,47,48.1,55.6,59.5,64.7
CD23loCD21/35hi_CYTO_P03B_Spleen,13.31,8.32,7.35,16.4,12,17.24,10.27,5.39,5.9,13.8,8.4,23.2,4.2,5.3,6.4,8.8,7.3,9.4,5.8,5,5.9,9.2,10.8,8.5
MZB_CYTO_P03B_Spleen,7.21,5.48,5.04,5.9,6.8,9.07,6.02,2.96,4.45,9.9,6.6,11.2,2.8,3.7,4.5,5.9,4.3,6.3,4,3.4,3.6,5.7,6.5,6.4
Plasmocytes_CYTO_P03B_Spleen,0.07,0.66,0.03,0,0.1,0.02,0.02,0.04,0.03,0,0,0,0.3,0.1,0.1,0.2,0.5,0.6,0.4,0.1,0.2,1.2,0.7,0.9
CD45Rlo_CYTO_P03B_Spleen,4.28,5.01,4.35,3.1,5.6,2.14,4.05,5,5.54,3.9,3.7,3.2,3.4,3.8,4.5,2.4,4.6,3.6,4.4,3.9,5.7,3.2,3.4,3.9
B1a_CYTO_P03B_Spleen,1.59,2.03,1.68,0.2,3.5,0.32,1.37,1.76,2.3,0.6,0.8,0.6,1,1.3,1.1,0.5,0.5,0.8,1.2,1.3,2.3,1.2,1.4,1.3
pre-B_CYTO_P03B_Spleen,2.62,2.88,2.57,2.8,2,1.78,2.63,3.15,3.15,3.2,2.8,2.5,2.3,2.4,3.3,1.8,4,2.7,3.1,2.5,3.4,1.9,1.9,2.5
Granulocytes_CYTO_P03C_Spleen,1.11,0.86,1.35,1.24,1.99,1.07,0.92,1.52,0.91,1.2,1.6,1.2,0.9,1,0.9,1.9,1.1,2.1,1.4,1.4,1,1.9,1.4,1.5
T cells  _CYTO_P03C_Spleen,28.55,29.75,33.4,24.69,23.34,24.72,31.9,30,28.37,30.2,32.8,31.7,34.1,33.9,30.8,26.1,31,24.7,33.1,31.2,31.2,28.1,28.6,30.7
Eosinophils_CYTO_P03C_Spleen,0.23,0.32,0.38,0.32,0.64,0.55,0.44,0.48,0.52,0.5,0.3,0.4,0.3,0.2,0.2,0.6,0.4,0.8,0.5,0.7,0.4,0.3,0.7,0.6
Monocytes  _CYTO_P03C_Spleen,0.48,0.48,0.58,0.75,0.74,0.78,0.46,0.72,0.54,0.6,0.7,0.4,0.6,0.7,0.8,0.4,0.4,0.5,0.4,0.6,0.4,0.6,0.7,0.6
Macrophages  _CYTO_P03C_Spleen,0.19,0.17,0.22,0.04,0.04,0.05,0.18,0.23,0.26,0,0.1,0,0.4,0.3,0.5,0.2,0.1,0.2,0.3,0.3,0.4,0.1,0.1,0.1
pDC  _CYTO_P03C_Spleen,0.51,0.41,0.35,0.32,0.63,0.33,0.29,0.44,0.37,0.5,0.5,0.4,0.4,0.4,0.4,0.3,0.4,0.3,0.4,1.2,0.4,0.5,0.4,0.5
CD4+CD8-_CYTO_P03C_Spleen,38.5,39.6,39,36.9,34.9,31.7,37,40.4,40.4,37.5,42.4,35.8,37.4,38.8,38.2,32.4,39.5,34.9,43.2,49.9,49.9,45.4,45.4,49.1
CD4-CD8-_CYTO_P03C_Spleen,25.9,26.1,31.4,36.5,26.7,39.3,30.1,23,24.2,36.4,36.3,41.7,26.3,30.4,32.7,33.9,31.2,32.5,26.2,12.2,19.7,27.1,24.8,31.1
CD4+CD8+_CYTO_P03C_Spleen,30.4,28.7,23.5,20.7,33.1,21.8,27.8,31.7,29.9,17.6,14.8,16.4,30.2,25.2,24.2,26,23.5,26.6,25.9,35,26.6,23.2,25.5,14.9
cDC_CYTO_P03C_Spleen,2.3,2.07,1.87,1.28,1.02,1.49,1.92,1.93,2.52,1.5,1.5,1.7,1.9,1.9,2.3,1.3,1.2,1.2,1.8,2.2,2.2,1.6,1.3,1.6
im cDC_CYTO_P03C_Spleen,55.14,54.41,53.76,41.76,32.82,46.99,51.66,52.73,50.2,48.7,45.4,42.3,51.6,46,46.8,44.4,44.7,41,46.1,48.9,46.2,40,34.7,40
CD8a Type im cDC_CYTO_P03C_Spleen,25.07,23.42,21.88,20.34,39.57,17.04,19.23,18.74,19.69,16.8,8.9,13.4,13.1,18.2,13,13.3,10.3,9.2,8.1,8.3,8.1,10.8,6.4,7.4
CD11b Type im cDC_CYTO_P03C_Spleen,74.04,75.5,77.21,77.95,58.85,81.8,79.7,80.07,78.93,81.5,89.6,85,86,80.8,85.8,85.7,88.4,89.4,91.1,90.7,90.8,88.1,92.7,91.6
mat cDC_CYTO_P03C_Spleen,21.43,24.92,25.86,35.41,32.92,32.03,26.15,23.38,23.37,28,27.6,31.3,33.9,33.5,29.1,37.7,35.1,37.4,33.3,29.4,29.5,30.2,33.9,38.4
CD8a+ Type mat cDC_CYTO_P03C_Spleen,13.2,12.8,10.5,14.5,21.5,13.7,12.1,11.7,8.9,14.2,15.8,17.6,7.7,9.6,9.4,13.4,13.1,11.9,9.2,7.9,6.4,16.5,13.9,13.9
CD11b+ Type mat cDC_CYTO_P03C_Spleen,85.9,86.2,88.5,84.6,76.4,85.2,87,86.9,90.3,84.2,83.3,81.2,91.7,89.7,89.5,85.8,85.6,87.5,89.9,90.7,92.6,82.4,85.2,85.3
