Population Name,NAME,Mice id,Mutation,GROUP,GENOTYPE,SEX,AGE,Comment,Cellularity_Spleen,NK Cells_CYTO_P03A_Spleen, NK Stage I_CYTO_P03A_Spleen,NK Stage II_CYTO_P03A_Spleen,NK Stage III_CYTO_P03A_Spleen,NK Stage IV_CYTO_P03A_Spleen,NK EM_CYTO_P03A_Spleen,NK CM_CYTO_P03A_Spleen,L-T_CYTO_P03A_Spleen,ab-T_CYTO_P03A_Spleen,CD4+ SP_CYTO_P03A_Spleen,Conventional CD4+_CYTO_P03A_Spleen,EM/CM CD4 _CYTO_P03A_Spleen,Naive CD4 _CYTO_P03A_Spleen,Early CD4  _CYTO_P03A_Spleen,Late CD4 _CYTO_P03A_Spleen,Ly6C+ CD4 _CYTO_P03A_Spleen,Treg_CYTO_P03A_Spleen,EM TReg _CYTO_P03A_Spleen,CM  TReg  _CYTO_P03A_Spleen,Early  Treg _CYTO_P03A_Spleen,Late  Treg _CYTO_P03A_Spleen,Ly6C+ Treg _CYTO_P03A_Spleen,CD8 SP_CYTO_P03A_Spleen,EM CD8 _CYTO_P03A_Spleen,CM CD8 _CYTO_P03A_Spleen,Naive CD8 _CYTO_P03A_Spleen,Ly6C+ CD8 _CYTO_P03A_Spleen,Late CD8 _CYTO_P03A_Spleen,Early CD8 _CYTO_P03A_Spleen,gd-T_CYTO_P03A_Spleen,EM gd-T _CYTO_P03A_Spleen,Naive gd-T _CYTO_P03A_Spleen,Late gd-T _CYTO_P03A_Spleen,Early gd-T _CYTO_P03A_Spleen,Ly6C+ gd-T _CYTO_P03A_Spleen,Monocytes_CYTO_P03A_Spleen,Granulocytes_CYTO_P03A_Spleen,NKT_CYTO_P03A_Spleen,Ly6C NKT _CYTO_P03A_Spleen,Klrg1+  CD4 _CYTO_P03A_Spleen,Klrg1+  CD8 _CYTO_P03A_Spleen,Klrg1+ gd-T _CYTO_P03A_Spleen,Klrg1+ NK _CYTO_P03A_Spleen,B cells_CYTO_P03B_Spleen,CD45Rhi_CYTO_P03B_Spleen,CD23lolCD21/35-_CYTO_P03B_Spleen,B Mem_CYTO_P03B_Spleen,T1_CYTO_P03B_Spleen,CD23hiCD21/35int_CYTO_P03B_Spleen,T2_CYTO_P03B_Spleen,T3 + FO_CYTO_P03B_Spleen,CD23loCD21/35hi_CYTO_P03B_Spleen,MZB_CYTO_P03B_Spleen,Plasmocytes_CYTO_P03B_Spleen,CD45Rlo_CYTO_P03B_Spleen,B1a_CYTO_P03B_Spleen,pre-B_CYTO_P03B_Spleen,Granulocytes_CYTO_P03C_Spleen,T cells  _CYTO_P03C_Spleen,Eosinophils_CYTO_P03C_Spleen,Monocytes  _CYTO_P03C_Spleen,Macrophages  _CYTO_P03C_Spleen,pDC  _CYTO_P03C_Spleen,CD4+CD8-_CYTO_P03C_Spleen,CD4-CD8-_CYTO_P03C_Spleen,CD4+CD8+_CYTO_P03C_Spleen,cDC_CYTO_P03C_Spleen,im cDC_CYTO_P03C_Spleen,CD8a Type im cDC_CYTO_P03C_Spleen,CD11b Type im cDC_CYTO_P03C_Spleen,mat cDC_CYTO_P03C_Spleen,CD8a+ Type mat cDC_CYTO_P03C_Spleen,CD11b+ Type mat cDC_CYTO_P03C_Spleen,,NA
 25346_Young_CTRL_M ,25346_Young_CTRL_M,25346,CTRL,Young,SS,M,6,,140.04,2.73,2.00,54.50,28.10,13.60,13.40,85.40,30.65,27.04,17.17,17.03,15.10,81.70,8.36,72.51,36.80,0.80,30.70,68.80,16.90,81.50,12.70,9.17,3.50,26.13,68.98,42.30,61.19,7.66,0.32,12.10,85.90,53.26,4.51,31.40,1.12,2.05,0.70,36.60,3.00,0.80,6.10,40.80,4.80,84.99,45.47,12.66,32.01,20.81,1.36,19.12,13.31,7.21,0.07,4.28,1.59,2.62,1.11,28.55,0.23,0.48,0.19,0.51,38.50,25.90,30.40,2.30,55.14,25.07,74.04,21.43,13.20,85.90,,
 25347_Young_CTRL_M ,25347_Young_CTRL_M,25347,CTRL,Young,SS,M,6,,188.128,2.92,2.20,55.10,28.50,12.60,17.30,82.00,27.77,25.04,15.87,15.77,16.90,79.30,7.67,70.96,30.60,0.60,32.50,66.10,17.80,80.50,11.50,8.44,5.30,24.50,68.00,40.90,61.33,6.53,0.26,20.80,78.70,52.18,6.80,30.80,0.78,1.25,0.72,32.00,3.40,0.80,3.60,38.20,3.90,84.08,35.68,9.66,25.24,33.44,1.65,31.34,8.32,5.48,0.66,5.01,2.03,2.88,0.86,29.75,0.32,0.48,0.17,0.41,39.60,26.10,28.70,2.07,54.41,23.42,75.50,24.92,12.80,86.20,,
 25348_Young_CTRL_M ,25348_Young_CTRL_M,25348,CTRL,Young,SS,M,6,,110.44,3.03,2.10,62.50,22.60,11.30,15.30,84.10,30.54,28.10,18.33,18.28,14.80,81.50,7.42,73.90,29.30,0.30,30.20,68.90,19.10,79.00,8.50,9.01,3.90,21.81,72.78,33.90,65.51,7.13,0.30,19.80,78.90,53.42,6.32,26.70,0.83,1.75,0.64,34.60,2.70,1.60,3.50,46.90,4.20,85.95,28.31,11.15,16.14,43.46,2.79,39.90,7.35,5.04,0.03,4.35,1.68,2.57,1.35,33.40,0.38,0.58,0.22,0.35,39.00,31.40,23.50,1.87,53.76,21.88,77.21,25.86,10.50,88.50,,
 20497_Old_CTRL_M ,20497_Old_CTRL_M,20497,CTRL,Old,SS,M,13,,134.648,2.3,4.0,56.7,16.8,20.8,26.0,72.9,21.7,19.9,12.0,12.0,29.9,65.7,5.1,60.3,22.1,0.4,51.3,46.0,15.1,84.9,2.7,7.3,7.3,24.4,65.0,34.3,60.0,4.9,0.3,18.4,80.2,56.5,5.3,43.6,1.0,1.7,0.9,45.7,4.1,0.9,4.6,36.3,2.4,88.0,27.7,2.6,24.6,35.3,0.6,34.5,16.4,5.9,0.0,3.1,0.2,2.8,1.24,24.69,0.32,0.75,0.04,0.32,36.90,36.50,20.70,1.28,41.76,20.34,77.95,35.41,14.50,84.60,,
 20498_Old_CTRL_M ,20498_Old_CTRL_M,20498,CTRL,Old,SS,M,13,,163.944,2.1,3.8,59.6,15.8,19.3,44.6,54.0,19.3,17.8,11.3,11.2,38.3,57.4,4.9,52.2,25.8,0.3,68.6,29.4,21.1,77.2,7.2,5.9,11.9,26.8,56.7,43.9,51.8,4.8,0.3,18.2,80.3,65.4,3.3,57.1,0.9,2.8,1.1,40.1,4.4,2.2,2.5,40.4,1.6,85.3,26.2,4.3,21.2,41.5,0.9,40.2,12.0,6.8,0.1,5.6,3.5,2.0,1.99,23.34,0.64,0.74,0.04,0.63,34.90,26.70,33.10,1.02,32.82,39.57,58.85,32.92,21.50,76.40,,
 20499_Old_CTRL_M ,20499_Old_CTRL_M,20499,CTRL,Old,SS,M,13,,119.296,2.18,4.20,56.20,19.70,18.20,19.00,80.00,21.24,19.38,11.96,11.90,28.00,68.90,6.61,61.85,23.60,0.50,47.70,51.60,15.40,83.20,6.90,6.79,6.60,30.8,60.52,38.60,54.05,6.42,0.28,13.00,86.30,66.80,2.87,49.00,0.88,1.44,0.98,43.10,4.10,1.70,2.50,39.10,2.90,90.50,20.43,2.69,17.29,44.80,0.82,43.64,17.24,9.07,0.02,2.14,0.32,1.78,1.07,24.72,0.55,0.78,0.05,0.33,31.70,39.30,21.80,1.49,46.99,17.04,81.80,32.03,13.70,85.20,,
 25350_Young_CTRL_F ,25350_Young_CTRL_F,25350,CTRL,Young,SS,F,6,,92.736,2.92,3.50,58.20,23.50,12.60,18.30,80.70,28.49,25.48,15.73,15.71,15.80,81.40,7.51,73.65,36.90,0.10,30.00,70.00,19.00,79.40,21.10,8.94,4.00,22.6,72.11,28.40,64.83,7.21,0.29,23.70,76.00,51.68,7.44,24.90,0.70,1.39,1.00,32.90,0.90,0.30,2.00,32.30,2.40,87.09,59.60,14.85,43.00,15.29,1.23,13.76,10.27,6.02,0.02,4.05,1.37,2.63,0.92,31.90,0.44,0.46,0.18,0.29,37.00,30.10,27.80,1.92,51.66,19.23,79.70,26.15,12.10,87.00,,
 25351_Young_CTRL_F ,25351_Young_CTRL_F,25351,CTRL,Young,SS,F,6,,169.536,2.92,3.20,57.50,24.20,13.00,17.30,81.60,26.65,23.51,14.65,14.62,15.10,82.50,7.67,74.54,33.80,0.20,31.80,68.20,20.50,75.00,16.30,8.09,3.90,24.5,69.93,30.40,63.08,6.78,0.28,20.60,78.80,54.61,5.95,26.00,0.91,1.61,1.02,33.70,1.00,0.40,1.30,37.60,1.90,82.80,37.97,13.11,23.62,37.12,2.78,33.67,5.39,2.96,0.04,5.00,1.76,3.15,1.52,30.00,0.48,0.72,0.23,0.44,40.40,23.00,31.70,1.93,52.73,18.74,80.07,23.38,11.70,86.90,,
 25352_Young_CTRL_F ,25352_Young_CTRL_F,25352,CTRL,Young,SS,F,6,,120.04,2.66,3.10,51.60,23.30,18.80,24.30,74.20,27.04,23.75,14.77,14.76,18.30,77.70,6.21,71.14,35.00,0.10,37.10,62.90,25.00,65.90,17.10,8.20,7.20,18.9,71.01,31.40,64.91,5.97,0.26,30.50,68.60,49.12,8.33,25.30,0.79,1.36,0.96,30.00,1.00,0.40,1.90,31.40,1.60,83.44,25.20,8.58,15.72,50.36,2.81,46.74,5.90,4.45,0.03,5.54,2.30,3.15,0.91,28.37,0.52,0.54,0.26,0.37,40.40,24.20,29.90,2.52,50.20,19.69,78.93,23.37,8.90,90.30,,
 20485_Old_CTRL_F ,20485_Old_CTRL_F,20485,CTRL,Old,SS,F,13,,174.832,2.6,3.8,58.4,12.7,22.6,25.9,72.2,27.5,24.5,14.3,14.3,32.4,66.1,6.4,59.5,21.2,0.1,54.5,45.5,16.0,80.0,7.3,9.2,6.0,26.3,67.1,30.6,59.9,7.1,0.4,11.0,88.4,68.5,2.4,48.3,0.7,1.8,1.8,53.5,1.7,1.3,1.9,39.4,1.7,86.0,20.6,6.2,13.8,47.8,1.7,45.5,13.8,9.9,0.0,3.9,0.6,3.2,1.2,30.2,0.5,0.6,0.0,0.5,37.5,36.4,17.6,1.5,48.7,16.8,81.5,28.0,14.2,84.2,,
 20486_Old_CTRL_F ,20486_Old_CTRL_F,20486,CTRL,Old,SS,F,13,,141.856,2.8,4.3,66.4,10.1,16.9,21.9,77.2,29.3,26.3,15.8,15.8,29.2,68.8,6.6,62.0,23.0,0.1,46.3,53.7,45.5,50.0,14.6,9.5,4.0,24.1,70.9,26.1,63.2,7.6,0.4,12.9,86.6,69.4,2.5,51.4,0.6,1.7,1.4,51.5,1.2,0.5,1.9,44.3,2.4,88.2,7.2,3.5,3.4,70.2,1.9,67.6,8.4,6.6,0.0,3.7,0.8,2.8,1.6,32.8,0.3,0.7,0.1,0.5,42.4,36.3,14.8,1.5,45.4,8.9,89.6,27.6,15.8,83.3,,
 20487_Old_CTRL_F ,20487_Old_CTRL_F,20487,CTRL,Old,SS,F,13,,166.088,2.9,2.2,58.6,16.0,20.8,15.3,82.7,27.4,24.6,14.6,14.4,38.8,58.0,6.3,50.8,16.1,1.5,69.8,30.0,25.2,73.4,13.5,8.9,5.3,28.7,64.4,29.9,56.3,8.0,0.6,9.5,90.2,65.2,2.6,49.0,0.5,1.7,2.1,47.7,5.5,3.3,5.2,47.6,3.2,87.8,45.6,6.9,37.4,16.1,0.6,15.3,23.2,11.2,0.0,3.2,0.6,2.5,1.2,31.7,0.4,0.4,0.0,0.4,35.8,41.7,16.4,1.7,42.3,13.4,85.0,31.3,17.6,81.2,,
24778_Young_MUT_M,24778_Young_MUT_M,24778,MUT,Young,SS,M,6,,362.784,2.5,4.9,62.3,14.2,16.0,9.3,86.8,29.9,27.6,18.0,18.0,3.3,92.7,5.1,87.5,33.6,0.1,34.5,62.1,16.7,83.3,31.0,8.7,1.8,18.5,74.7,51.1,69.4,5.3,0.2,12.4,86.9,67.4,2.8,43.0,0.8,1.2,0.9,61.7,1.7,0.3,5.4,46.9,4.6,86.9,26.5,12.1,14.0,51.0,3.8,46.5,4.2,2.8,0.3,3.4,1.0,2.3,0.9,34.1,0.3,0.6,0.4,0.4,37.4,26.3,30.2,1.9,51.6,13.1,86.0,33.9,7.7,91.7,,
24779_Young_MUT_M,24779_Young_MUT_M,24779,MUT,Young,SS,M,6,,119.44,2.1,4.6,55.5,15.7,21.3,11.4,84.3,28.7,26.3,18.2,18.2,4.8,92.9,9.2,83.6,31.8,0.1,34.5,65.5,19.4,80.6,18.2,6.9,2.2,22.3,71.6,40.9,63.3,8.3,0.2,14.8,84.5,61.7,4.0,39.0,1.1,1.6,1.0,52.3,1.9,0.4,7.6,37.0,3.5,83.9,22.3,10.7,10.6,52.0,3.5,47.7,5.3,3.7,0.1,3.8,1.3,2.4,1.0,33.9,0.2,0.7,0.3,0.4,38.8,30.4,25.2,1.9,46.0,18.2,80.8,33.5,9.6,89.7,,
24780_Young_MUT_M,24780_Young_MUT_M,24780,MUT,Young,SS,M,6,,194.424,2.5,3.0,58.6,19.9,16.2,13.1,85.1,26.9,24.2,16.8,16.7,3.6,92.6,9.3,83.2,30.1,0.1,28.0,70.7,22.6,75.5,17.3,6.3,3.4,23.1,70.3,44.6,61.6,8.6,0.2,15.3,83.9,60.0,4.3,39.7,1.2,1.5,0.7,55.0,2.0,0.4,5.6,43.4,5.3,83.9,25.6,11.1,13.4,46.7,3.4,42.5,6.4,4.5,0.1,4.5,1.1,3.3,0.9,30.8,0.2,0.8,0.5,0.4,38.2,32.7,24.2,2.3,46.8,13.0,85.8,29.1,9.4,89.5,,
19426_Old_MUT_M,19426_Old_MUT_M,19426,MUT,Old,SS,M,13,,125.264,1.5,3.4,65.3,13.9,15.1,17.5,81.6,24.9,22.8,12.3,12.3,8.8,87.3,7.0,80.1,38.1,0.0,47.6,52.4,36.4,36.4,9.5,9.7,5.0,27.4,64.6,46.2,58.3,6.3,0.3,9.3,90.3,74.6,1.6,68.8,0.5,2.8,1.4,77.3,1.9,0.7,4.2,41.4,2.5,87.6,13.6,5.2,7.8,61.6,2.5,58.4,8.8,5.9,0.2,2.4,0.5,1.8,1.9,26.1,0.6,0.4,0.2,0.3,32.4,33.9,26.0,1.3,44.4,13.3,85.7,37.7,13.4,85.8,,
19427_Old_MUT_M,19427_Old_MUT_M,19427,MUT,Old,SS,M,13,,172.304,1.7,4.5,55.7,15.7,21.1,13.7,84.7,28.8,24.9,14.6,14.6,11.7,85.4,6.3,79.1,38.2,0.1,71.1,28.9,27.3,63.6,5.3,9.4,4.4,26.6,65.3,53.3,58.6,6.7,0.3,7.6,92.1,70.2,1.8,67.7,0.6,1.2,1.3,73.8,2.7,1.0,2.6,36.7,2.6,83.3,14.5,5.8,8.0,57.7,2.4,54.6,7.3,4.3,0.5,4.6,0.5,4.0,1.1,31.0,0.4,0.4,0.1,0.4,39.5,31.2,23.5,1.2,44.7,10.3,88.4,35.1,13.1,85.6,,
19428_Old_MUT_M,19428_Old_MUT_M,19428,MUT,Old,SS,M,13,,209.24,1.5,4.5,61.6,14.6,16.6,17.1,81.8,21.8,20.0,11.3,11.3,11.7,84.4,7.0,77.3,38.0,0.0,39.1,56.5,23.1,69.2,13.0,8.0,4.4,29.0,63.0,48.9,56.5,6.4,0.2,10.3,89.0,72.3,1.9,66.9,0.6,2.5,1.4,75.1,2.5,0.6,2.1,39.5,2.4,88.0,14.7,5.4,8.7,60.5,2.3,57.6,9.4,6.3,0.6,3.6,0.8,2.7,2.1,24.7,0.8,0.5,0.2,0.3,34.9,32.5,26.6,1.2,41.0,9.2,89.4,37.4,11.9,87.5,,
24783_Young_MUT_F,24783_Young_MUT_F,24783,MUT,Young,SS,F,6,,153.224,1.9,4.4,62.3,13.5,16.3,10.0,89.1,30.3,26.8,16.9,16.9,4.0,94.1,9.6,84.3,31.2,0.1,22.2,77.8,35.7,60.7,19.4,8.1,0.7,21.5,74.4,26.9,65.4,9.0,0.3,16.0,83.7,52.6,5.8,33.9,0.6,1.7,1.0,55.9,3.2,0.7,4.6,38.6,4.0,82.8,28.6,12.0,15.4,45.3,3.6,40.9,5.8,4.0,0.4,4.4,1.2,3.1,1.4,33.1,0.5,0.4,0.3,0.4,43.2,26.2,25.9,1.8,46.1,8.1,91.1,33.3,9.2,89.9,,
24784_Young_MUT_F,24784_Young_MUT_F,24784,MUT,Young,SS,F,6,,308.1,1.5,3.8,47.0,23.9,23.6,19.5,77.7,28.0,25.4,14.7,14.7,5.4,91.1,8.9,82.1,35.0,0.1,40.9,59.1,26.9,65.4,13.6,8.9,2.6,29.3,60.0,44.3,53.1,6.8,0.4,14.4,84.8,62.5,3.8,36.2,0.8,2.0,1.1,52.3,2.8,0.7,2.5,37.4,2.9,85.8,23.6,13.7,9.0,54.2,6.0,47.0,5.0,3.4,0.1,3.9,1.3,2.5,1.4,31.2,0.7,0.6,0.3,1.2,49.9,12.2,35.0,2.2,48.9,8.3,90.7,29.4,7.9,90.7,,
24785_Young_MUT_F,24785_Young_MUT_F,24785,MUT,Young,SS,F,6,,89.944,1.6,3.5,50.4,20.4,23.7,16.5,81.6,26.6,24.2,15.4,15.4,4.8,91.6,11.9,79.5,29.9,0.1,35.9,64.1,39.0,58.5,25.0,7.2,4.2,24.4,64.6,34.9,55.9,8.6,0.3,16.0,83.5,60.7,4.3,33.8,0.6,1.2,0.8,50.3,2.5,0.5,1.1,34.9,3.0,81.0,21.2,10.3,10.2,52.7,3.7,48.1,5.9,3.6,0.2,5.7,2.3,3.4,1.0,31.2,0.4,0.4,0.4,0.4,49.9,19.7,26.6,2.2,46.2,8.1,90.8,29.5,6.4,92.6,,
19432_Old_MUT_F,19432_Old_MUT_F,19432,MUT,Old,SS,F,13,,110.008,1.9,4.1,53.0,13.4,26.9,13.7,83.7,23.3,21.6,12.6,12.6,7.9,89.5,11.0,78.2,27.1,0.1,38.5,56.4,40.9,50.0,17.9,7.5,1.7,32.7,63.7,28.7,54.6,9.1,0.3,7.9,91.9,70.9,1.8,55.2,0.9,2.5,1.5,60.6,3.1,0.9,2.2,40.5,3.6,87.2,17.1,8.2,8.3,59.4,3.1,55.6,9.2,5.7,1.2,3.2,1.2,1.9,1.9,28.1,0.3,0.6,0.1,0.5,45.4,27.1,23.2,1.6,40.0,10.8,88.1,30.2,16.5,82.4,,
19433_Old_MUT_F,19433_Old_MUT_F,19433,MUT,Old,SS,F,13,,114.36,1.9,4.1,53.5,14.8,24.1,16.5,80.5,27.0,24.8,14.4,14.4,7.5,87.5,9.3,78.0,27.5,0.1,26.1,73.9,35.3,50.0,34.8,8.7,2.3,32.3,62.9,32.0,55.5,7.3,0.3,8.9,90.6,71.3,1.9,54.0,1.2,2.2,1.7,59.9,2.6,0.7,3.1,39.5,2.8,88.7,13.2,5.7,7.1,62.5,2.3,59.5,10.8,6.5,0.7,3.4,1.4,1.9,1.4,28.6,0.7,0.7,0.1,0.4,45.4,24.8,25.5,1.3,34.7,6.4,92.7,33.9,13.9,85.2,,
19434_Old_MUT_F,19434_Old_MUT_F,19434,MUT,Old,SS,F,13,,103.696,1.7,4.8,54.4,13.3,25.3,16.9,79.9,27.0,24.6,14.0,14.0,7.8,89.9,9.4,80.3,26.0,0.0,12.5,87.5,57.1,35.7,25.0,8.9,1.4,26.1,70.3,26.3,61.7,8.7,0.3,9.1,90.6,70.9,2.0,50.8,0.8,2.1,1.9,63.1,2.6,0.6,4.5,37.8,3.0,87.4,7.5,4.6,2.8,69.2,3.7,64.7,8.5,6.4,0.9,3.9,1.3,2.5,1.5,30.7,0.6,0.6,0.1,0.5,49.1,31.1,14.9,1.6,40.0,7.4,91.6,38.4,13.9,85.3,,
