let
  G0 := int * (3);
in
  { x0 | x0 in nat && G0 };
// Automata size             : #SA=1 #EA=1 #S=3 #D=0 #Refs=3 #to0=0/6
// Formula size              : 17 nodes
// Time to synthesis formula : 0 ms
