let
  G0 := int * (11, 0, 0, 0) + int * (0, 7, 0, 0) + int * (0, 0, 5, 0) + int * (0, 0, 0, 3);
  nat4 := (nat, nat, nat, nat);
in
  { (x0, x1, x2, x3) | (x0, x1, x2, x3) in nat4 && G0 };
// Automata size             : #SA=1 #EA=1 #S=4620 #D=0 #Refs=3 #to0=0/9240
// Formula size              : 63 nodes
// Time to synthesis formula : 10010 ms
