2.115252321551704284e+01 3.181744794426766276e+01 2.747389892703016301e+01 3.450931061000368061e+01 2.597362163563239790e+01 5.716487273417156700e+01 5.702172388810304682e+01 1.556385857829227746e+02 2.867449508765380415e+02 1.301100977548117612e+02 6.170293677995965709e+01 1.437542686753855570e+01 8.704383089281343189e+00 3.430418571507824765e+01 4.257950489300726815e+01 1.006069420508184109e+01 3.872421483437520351e+01 7.462120416514665067e+01 7.515713690523379853e+01 2.908198907292985425e+01 2.351816513138970777e+01 3.442764801024029264e+00 2.701660622116726973e+00 1.089424515641018054e+01 2.143588054123082287e+01 1.716915569424571331e+01 8.152377787947870047e+00 7.274188857512522421e-01 7.015723263607499538e-01 8.977900587104639119e-01
1.576661066106354525e+01 3.567990803238637909e+01 6.404263683962872733e+01 5.176904229809997560e+01 3.588289618334709274e+01 1.617733731935529420e+02 7.833712553436190262e+01 9.941184733481919977e+01 6.654326402554188746e+01 5.784307567564569297e+01 4.273310648688307367e+01 8.700539684607228708e+00 1.209026285934033140e+01 2.904794491112541976e+01 4.274677042399288496e+01 2.929085552417350868e+01 3.970381779208118189e+01 1.441135075515634298e+02 1.221833316654751087e+02 4.091857992531232924e+01 1.484039816922898858e+01 3.394313233920905226e+00 7.278353944397794706e+00 6.605112655729531213e+00 5.994222783730943860e+00 8.329702290636694428e+00 3.090504977091600658e+00 7.819371919208139010e-01 1.094547994468201502e+00 1.083588836999487492e+00
1.847862978117261150e+02 1.923600519518861063e+02 4.072978811269151151e+02 3.285144217927842192e+02 7.024467342954008018e+02 7.235146229261610529e+01 1.387541512124731469e+01 1.520703236802654246e+01 2.550608226201329671e+02 8.000195313659061469e+01 2.250864174373507751e+02 1.583615263490049756e+02 6.144652554088526131e+01 9.398944464236734575e+01 1.877285744232866449e+01 8.350652227782390469e+01 6.140238077909509684e+01 1.408475355370417503e+02 5.322548313254087589e+02 9.960487024540734069e+01 9.778875725172923694e+00 2.920833695305714794e+00 4.604508470864374203e+00 1.676108040576562264e+00 1.051256162263739968e+00 7.406800448804915504e-01 7.063585727964382110e-01 5.253391642038961473e-01 8.448661287722973867e-01 9.107130641890002209e-01
8.823762820422058439e+01 2.585509027394228383e+02 5.680909102903220855e+02 4.551778498925687586e+02 1.886394652370621259e+02 2.932409910408360432e+01 2.367316700932482831e+01 1.600010256395746566e+01 9.993401938801167006e+00 9.466168972929145298e+01 6.231144768863470063e+01 1.287423977760327887e+02 6.110754563172810094e+01 4.331577040927557221e+01 1.347011732443577792e+01 1.090733292112933839e+01 2.465172248750544526e+01 5.043137150317040351e+01 3.975637679750599318e+01 3.744384831471957398e+01 1.780058451984496770e+01 6.352149203365955898e+00 2.070293686185813442e+00 4.198889224418699051e+00 8.319443366278502783e-01 6.564706656497457660e-01 6.053411420476105809e-01 5.337995797662081765e-01 9.984364591929690835e-01 1.036093445203914332e+00
5.296092351453411595e+01 1.693270209777877255e+02 4.713515948505421989e+02 1.824551348863554381e+02 1.053663458425153294e+02 1.531944791894329683e+01 2.339229214694506709e+01 1.300965177694189379e+01 6.006425572711465932e+00 2.084702091603161307e+02 2.605245241266666198e+02 2.255814613533269153e+02 3.453116752464141115e+01 3.065198251943514407e+01 1.532023556048587309e+01 6.055732585220964026e+00 6.927171612184349669e+01 4.248722094330534560e+01 7.380531473116657537e+01 4.539800522923879100e+01 3.317251552483709531e+01 9.795775042938972277e+00 2.279896912774224660e+01 6.599907473221852783e+00 1.409681251801699231e+00 8.256521855091034645e-01 6.171785511487761777e-01 6.678277303896151817e-01 9.639492150306074869e-01 3.393495544082799853e+00
5.529946882793220198e+01 6.051738597825170984e+01 2.705814370396774393e+02 2.161377666966540687e+02 8.590970075405198259e+01 9.074421994592350771e+00 1.083562454609000625e+01 1.143012969309925353e+01 1.053340262998881727e+01 3.104803592505206780e+02 2.378485859087047061e+02 1.243406182234454462e+02 1.451563952087470355e+01 4.692134792146811506e+00 3.803796359671123284e+00 6.641893470973874614e+00 3.644510376022334697e+01 9.920080575968128755e+00 3.387630886536480546e+01 1.230981542812273801e+02 1.604379264086854562e+02 1.022326553464034617e+02 2.735337643139756381e+01 3.749500409397047207e+00 1.998469894429549587e+00 2.055059253782440365e+00 1.379402512020811766e+00 8.909014736170817184e-01 1.083709648885802679e+00 1.873481856445065041e+00
7.792777287566547528e+00 1.301913855277632948e+01 1.379185795385508584e+01 7.006908121615143159e+01 3.366949968972068774e+01 5.494527638572098738e+01 8.105651677692310386e+01 4.515394394054057869e+01 5.250122246653082669e+01 5.864246898930966978e+01 4.354910734621323343e+01 1.748047145227351962e+01 7.274793109771874988e+00 3.007393440182390520e+00 1.685070333568263301e+00 3.211724159573675852e+00 1.959426987940162945e+01 9.539224977184998622e+00 5.034748753621165207e+01 7.167543354313906434e+01 3.545834797936922200e+01 9.147623366817716928e+00 3.868530617377435643e+00 3.230264537031662719e+00 1.297554632933832774e+00 1.459057217904168979e+00 1.382081652553087903e+00 1.125026200878437077e+00 1.208620146189866906e+00 2.766934557751185686e+00
1.601975719948574550e+01 3.050036871115849380e+01 1.799426645517029399e+01 3.921124501626688641e+01 6.076737094811883821e+01 6.805599989484385048e+01 5.972081139156563268e+01 5.602254808130469144e+01 4.495205172150191686e+01 2.434313226624419002e+01 9.510144195661771604e+00 2.865300126810208070e+01 6.113090250174080253e+00 2.104961918874549198e+00 2.241291428632067095e+00 4.320330599918256631e+00 3.712411056269758092e+01 6.167479766226126969e+01 5.653563571416155753e+01 4.226503891109739186e+01 1.240044330805981687e+01 6.254388597148304640e+00 2.258689470365980334e+00 1.867144262165093105e+00 9.389345686054970663e-01 1.060656219854829718e+00 1.751786283256536958e+00 2.089585413364628330e+00 1.988823510333544764e+00 5.635685320653834651e+00
4.075239861745276926e+01 2.731340428394256037e+01 1.624946728307901722e+01 9.598895095735187510e+01 6.377989335059763931e+01 2.722245329082553056e+01 8.815810522090447421e+01 3.996230279863299728e+01 3.415348070206128028e+01 3.271103001172467373e+01 2.844872244591976340e+01 3.675290581002650470e+01 7.977415501435997669e+01 5.291426766457583852e+01 8.019852123283918388e+00 7.473553230056568353e+00 3.364867255322065631e+01 1.067720710619690863e+02 1.107127088514226187e+02 1.959278437612520918e+01 3.305156438643607864e+00 2.720824280834141184e+00 2.737119298654778099e+00 1.767317278483492959e+00 1.077569878424236016e+00 1.761028712026333487e+00 7.010282790539579700e+00 1.348380510850585168e+01 3.742355489001563029e+01 1.786514626825508145e+01
6.640518507959427552e+01 4.345776744768339483e+01 7.046596652750130829e+01 6.743284835648613296e+01 6.135934223267776133e+01 1.235311143350818774e+01 5.827820288035872665e+01 2.542543614178486422e+01 1.106735509115670979e+01 4.043362143747969206e+00 5.801846560425051536e+01 5.557952811271144355e+01 1.159418998083412191e+02 1.236087922951871292e+02 5.833744014308805248e+01 6.319852619697791596e+01 3.496005732894656148e+02 3.797482587534626077e+02 1.617135412059192845e+02 7.707023156124586194e+01 4.036960852844169167e+00 2.032247107867104496e+00 2.205857432549979791e+00 2.410966332935270184e+00 1.369810591566829050e+00 1.856192980833441197e+00 1.835879402578936848e+01 3.018252336627353927e+01 3.624007980244559946e+01 9.219512747455089752e+00
5.614051730383746985e+01 2.927982493713846068e+01 6.605814746012805472e+01 5.739123175451717174e+01 7.564936396401397189e+01 7.140795533367169767e+00 6.160690842451725047e+00 5.549816108548482063e+00 3.633520215140694010e+00 3.188711519704189001e+01 4.898913233638148768e+02 8.026501763769538229e+02 1.618330784413817128e+03 7.697931999886832273e+02 1.375375966352250714e+02 2.597999383808948437e+02 4.917085244353120288e+02 1.412848857126953135e+02 3.549505992327868142e+01 7.517043581872472124e+00 2.681960935474114294e+00 1.953552523055222645e+00 2.431545887879969392e+00 3.405768267159609231e+00 3.686058015805624422e+00 2.068172193369646195e+00 3.405171455464425900e+00 2.631601607374680185e+00 2.287576383102180699e+00 1.598270509128374428e+00
1.070452206069455059e+01 6.291536464780775439e+00 5.545971931031250790e+01 5.500591160937792523e+01 4.397579942207327264e+01 1.040712726296066037e+01 4.185125046365077317e+00 2.798545489818851983e+00 3.627435142728311135e+00 6.627942799203938762e+01 1.567055201350062816e+02 9.989480204479078793e+02 1.731307293857936656e+03 8.563428202965396849e+02 2.968475282908789268e+02 3.197553254280911688e+02 3.520186040519683388e+02 2.104535838040930571e+02 5.292899049387514765e+01 1.538074453439579159e+01 2.335102766159539378e+00 2.128533378539426035e+00 2.476880231307884817e+00 4.455573387712063571e+00 4.297809415878303341e+00 3.121808252429242092e+00 2.443439889437136969e+00 2.169332057375319422e+00 2.280316495796333776e+00 2.405857830039719758e+00
2.113282617409932840e+00 5.459491957866744016e+00 1.322374141230911526e+01 3.757257767726821385e+01 2.492980588125261221e+01 8.143211675232024049e+00 4.337570766191477745e+00 3.803217516195507741e+00 5.057001406934659826e+00 3.544682598002037821e+01 1.146027713007487492e+01 3.377295772344969009e+02 1.355843462757698944e+03 5.438196140045819220e+02 1.614429923963641613e+02 1.763579003782418511e+02 6.352199759644416588e+01 9.180175124644691209e+01 1.036709019053363221e+02 3.898318693730328022e+01 2.653102987633076282e+00 2.410812910794466024e+00 2.947912116143091676e+00 5.071112216123526473e+00 6.663854767633669240e+00 6.330149549279626697e+00 4.751653458054884815e+00 4.279632984639381910e+00 3.247663626679167859e+00 2.520123823810792807e+00
1.722598515781567086e+00 4.964457889553282044e+00 8.954274025659367808e+00 6.508991966326794554e+00 3.880849580270223864e+00 1.583038099407492716e+01 5.788259872243312287e+01 5.379560329999790724e+01 7.600659608739793960e+00 2.283649883100005162e+00 8.958951427781077115e+00 5.834717596038557730e+01 6.506952024039601383e+02 8.101820624382553433e+02 8.045068564971240903e+02 1.014957150752219832e+03 8.689591581157155815e+02 5.390613564316408883e+02 1.416685294498073745e+03 6.470124910809836365e+02 5.390677405763599239e+01 1.574698846321924250e+01 1.192200490019324022e+01 2.978591010219008695e+01 6.831110671980172810e+01 6.391723998167560694e+01 1.775277056069674018e+02 5.939561469615128431e+01 4.842309289632619418e+00 4.816918000756541751e+00
1.569971370371197494e+00 1.587164301943177591e+00 4.359271006724890540e+00 3.269991158190372005e+01 1.200385000264517998e+01 2.893122398361518854e+00 3.951729806238514442e+01 1.217875770608807500e+02 8.806424250452498370e+01 9.065144327897545651e+00 1.935767891877659252e+01 3.070051385476338623e+02 6.241156645178728013e+02 7.249104800505677986e+02 6.047806927120195724e+02 6.786279013079295055e+02 1.077502443346497557e+03 1.741857683464897491e+03 1.676719019350870894e+03 1.279928505593762793e+03 5.471749184719249115e+01 5.727591669008874931e+01 5.080981990288550065e+01 1.562158583901306770e+02 2.191452503124045563e+02 1.113358534162392743e+03 1.126829518846606788e+03 2.343334324797315844e+02 5.361427931868838037e+00 3.309321168282824743e+00
1.397891265683970596e+00 1.539960090964168415e+00 3.541485230442536825e+00 3.957437860387467143e+00 2.670949674554828235e+00 3.096652048612956065e+00 2.236181824358296666e+01 6.507555948564404957e+01 1.405494336080088829e+02 5.204585818670140185e+01 5.572641671272584318e+01 5.049726487257594698e+01 3.833197230082735700e+02 7.119131319524867649e+02 6.136169390774533667e+02 8.707589755028793661e+02 1.366690542633467203e+03 1.520854579593367816e+03 8.174347117288173195e+02 1.705507474940597490e+02 1.014055456687135717e+02 6.907474461841791253e+02 9.972274835960351993e+02 1.629388159133745830e+03 1.490719759928011172e+03 1.933465975690550749e+03 1.572853100163062663e+03 4.643957359350962406e+02 8.166554573639105641e+00 3.753385916647899112e+00
1.736434116844179698e+00 2.039742325371078913e+00 2.031819536583045593e+00 1.975356030680140762e+00 3.100866583225341699e+00 6.539860342951469008e+00 3.817894551161925847e+02 1.292450773162650876e+03 6.479271251413035770e+02 1.161547854170368907e+02 9.192264414816997942e+01 1.543321705394526475e+02 3.030459401554088572e+02 4.074729277324320265e+02 4.933501191904183543e+02 8.174323135471679507e+02 1.556038371569770334e+03 1.409050139541981480e+03 6.110405038697280133e+02 1.972985563515554759e+02 8.292197709740962637e+02 1.467987690715715871e+03 1.849988644389875844e+03 1.839220290567439179e+03 1.587010401338583961e+03 1.375976944008754344e+03 2.079771300617417182e+03 3.701597281484769155e+02 1.198311887267217912e+01 5.081201076460487798e+00
4.261434362927101205e+00 3.412886136897534506e+00 1.808035862518594605e+00 2.929390822525288485e+00 3.998406383381458085e+01 2.029572694211323096e+02 1.117497449348970349e+03 9.151866187606453877e+02 9.247761925346258067e+02 4.843869168138481882e+02 1.901073236188504723e+02 5.652840487231303257e+01 5.550438888615624222e+01 1.295364700212204525e+02 2.663387742064491022e+02 1.133807989738658534e+03 1.026868804889473722e+03 1.053455403001100422e+03 1.641933677766485289e+02 2.675878917378810229e+02 9.115264555983815171e+02 1.904494508172953601e+03 2.291869836682136338e+03 2.291803823551483219e+03 1.863366514612833271e+03 1.820805068767250759e+03 1.747237537109105460e+03 1.386661747769038129e+03 6.164731461378923427e+01 4.068163353533744697e+01
1.922029684650769399e+00 5.469270165411456830e+00 1.048694919960209404e+01 7.675139957319410655e+01 1.835719581619764824e+02 2.638550963692901519e+02 8.290015953990651951e+02 1.041789206248936352e+03 7.346668844514381362e+02 5.878622434518523505e+02 1.293773877087361370e+02 1.344329666460342843e+01 1.999431017101412777e+01 5.122164996967477180e+01 1.015449422208783261e+02 5.524305490929243661e+02 1.844235070381033381e+02 5.232728390574696675e+01 1.567847249568216839e+01 1.043504951334206510e+02 3.750064222972115431e+02 1.898295215446438988e+03 2.304864103163714390e+03 2.299873570989054315e+03 1.626975719726287252e+03 7.459511797249972460e+02 1.216959619669943777e+03 8.359404972487784562e+02 7.545793281094555027e+01 2.979566064141442894e+01
4.947497974669872889e+01 6.725503331857724731e+01 4.809165597805329639e+01 6.465567475087843263e+01 1.675808335493619268e+02 9.955307585777828194e+01 5.198475266073933199e+02 6.825230750287023511e+02 6.463282690942360205e+02 1.530208996700884256e+02 3.883774484521548942e+01 8.317092266549803270e+00 1.395292083462929966e+01 3.750597669619853036e+01 1.363490956937400256e+02 8.467815863363199469e+01 1.370401060270755238e+02 3.611371668820763858e+01 6.061325303962824762e+01 2.604375762407254911e+02 1.302128378651536423e+03 2.315295164644094257e+03 2.353086857431926546e+03 2.099488179386686170e+03 1.529846000836852909e+03 1.081971462614936399e+03 1.033224827637473709e+03 6.966639080281895531e+02 6.276774827906459109e+01 2.234783848663025196e+01
1.463286481795044836e+02 1.450854954655846711e+02 8.221538538629164350e+01 6.611436877276986479e+01 9.748734055702908563e+01 5.522831659685014927e+01 3.245932937455215210e+02 3.001351745945726179e+02 8.531174643588586548e+01 4.463460737952777890e+01 1.488053896690484912e+01 1.149634967826285958e+01 6.524447355969025253e+00 3.364089713907588042e+00 8.171881038681087617e+00 2.587414895345606425e+01 8.230237137669155345e+01 1.681638345951851079e+02 1.457770740251697532e+02 5.911218378381497587e+02 1.479200399635397844e+03 1.985985009337852944e+03 7.558151762223649257e+02 1.040528190338986860e+03 1.242567977454051061e+03 6.623839102272606851e+02 4.786294941645077756e+02 3.933215607431898206e+02 1.442143444495967941e+01 1.303742081615524562e+01
1.241023672289990003e+02 1.550018336960462761e+02 2.552089138373201394e+01 1.998037612529116203e+01 1.880852508150194424e+01 2.999794672710358867e+01 4.469955285518921073e+01 1.170240980034339273e+01 1.574094522507832394e+01 2.356848895565027746e+00 2.964147930008172338e+00 4.346549022942816087e+00 4.565593713962481814e+00 1.526661021001424245e+01 4.047979196034250293e+01 4.934586041997356460e+02 8.437965817152328327e+02 1.101338271903446639e+03 6.828735740786853512e+02 4.690735520180626850e+02 3.014837440078958934e+02 9.880218626006956129e+01 3.524855875126751670e+01 6.883622679524179944e+01 2.275538341798090869e+02 7.138352276304127031e+01 6.273916867177797485e+01 2.115019692653527628e+01 2.399645895220661629e+00 1.961278454325623866e+00
2.757806519783574117e+02 2.270272945923522911e+02 2.708940114817949052e+01 1.303841342624468425e+01 2.157543870141979170e+01 1.789805625243596054e+01 2.881586755301102087e+01 3.219013544798142057e+00 2.799721178041392644e+00 1.162597965650354448e+00 2.651971840096589261e+00 4.837159351452366529e+00 6.104921093443509861e+00 3.077099263087373515e+01 4.730113250946732251e+01 2.775676305432534718e+02 9.136326942491368754e+02 1.549747066943228674e+03 1.607137369631723004e+03 1.274845519540602936e+03 2.452070212241293348e+02 4.972687466358136987e+01 5.617922528500356805e+01 1.266213328360633170e+02 2.625271833293252826e+02 7.266293223518263744e+01 2.663661818265261871e+01 9.906644531806149345e+00 3.070324609873849919e+00 2.740463416976854027e+00
3.689121463513345134e+02 4.955002600471810581e+01 1.483146587360947777e+01 5.320251033184021594e+00 6.715093725230124377e+00 1.551458721610781488e+01 2.078071361627197078e+01 2.420835103526485010e+00 1.372801031369190738e+00 1.522779948265622130e+00 2.596669417046485240e+00 4.278553063913935972e+00 4.586603607126155779e+00 2.370237339340645377e+01 8.626441385719616051e+01 3.894668400148357250e+02 6.847113243641331337e+02 1.443077711285588975e+03 1.672717344128100649e+03 1.294280385010738655e+03 5.799468973243192522e+02 3.021565842724428208e+01 1.950335563588618371e+01 3.981426080116160904e+01 2.192198691091331284e+02 1.258588577955214305e+02 1.095565881203517620e+02 2.014735196286354579e+01 2.850577557505607373e+00 2.124317730928966252e+00
2.243671998134469732e+02 7.212629227281338729e+01 2.949578687610128469e+01 2.946464664331137584e+01 7.192781855179329398e+01 5.167033857102643424e+01 2.215523310549639291e+01 9.435648017871557158e+00 1.452473190103040501e+01 1.812593099920436046e+01 1.624673577237865985e+00 1.769112564298596313e+00 2.607376689065311837e+00 5.499562599953403463e+00 3.108102151946524572e+01 1.188718679775642499e+02 1.101115828438822746e+02 4.357709202969156195e+02 5.203923545808106610e+02 4.094778297612120355e+02 3.066662606420306929e+02 3.576285000174348028e+01 5.034532892948407223e+00 9.549123942296352752e+00 4.166718855517061115e+01 1.026124743185208956e+02 2.707565670561554612e+02 1.472428760327787245e+02 3.556339056834620482e+00 2.579017846421054472e+00
8.164144206886926725e+01 3.356515203418231863e+01 3.754907099245946256e+01 6.766942328919792260e+01 4.054711348798251436e+01 1.906482867619462240e+01 9.076280255652507734e+00 6.634411201146285464e+00 2.158231132748384695e+01 8.002257414220613896e+01 5.237808915519826414e+00 1.745509218971829757e+00 2.789453322624364517e+00 5.694722079820129679e+00 2.526157997211389272e+01 4.252639864747944642e+01 2.716870857145406859e+01 1.259356013572496380e+01 1.867641815951234108e+01 3.160395330814447590e+01 5.123237799564176953e+01 1.077564359309517172e+01 5.180269517705665905e+00 2.587247201532261087e+01 6.230434009686962327e+01 2.184840576282175206e+01 7.402455178712243367e+01 7.980531501200351840e+01 2.747730819924520773e+01 4.057647920398835595e+00
8.280937546681988692e+01 6.888616391437017228e+01 3.515866829143043759e+01 2.757987964420134830e+01 2.817094339262469660e+01 1.108760868669494570e+01 7.582947161350245935e+00 8.082952609101992536e+00 9.163644271500086091e+00 3.502223151016681868e+01 9.501201070881876376e+00 8.713681105358439538e+00 7.769863500916587284e+00 9.015315061958045106e+00 2.446918871354850467e+01 1.618842667269392166e+01 1.056613898265740481e+01 6.134064607155480076e+00 5.253666958143980992e+00 3.897348849117789005e+00 2.968965575728326201e+00 4.167390469822756849e+00 6.393346306367827303e+00 1.562537667531348262e+01 2.696263060883405416e+01 1.273442769810293029e+01 1.994977029109926647e+01 1.278066168322631491e+01 1.250546384541115330e+01 7.836468185882966786e+00
1.122353696126496061e+02 6.067060376839463487e+01 3.615765567593191321e+01 5.293512836635375862e+01 5.104556874790684162e+01 2.903714780606204471e+01 1.026896774418256939e+02 8.104685696012320761e+01 1.232835825629212678e+01 8.561560994720167628e+00 2.933392261431492010e+00 6.496829057146043418e+00 1.821953187024905318e+01 1.887581787815666701e+01 5.510476906897547167e+01 3.937683284095487579e+01 1.205977219617340168e+01 1.392678395977536709e+01 6.278389453482084548e+00 2.668260094142901995e+00 2.368434974574960883e+00 3.535307117624826745e+00 5.380218589160833176e+00 1.641443028661299763e+01 1.653452642349822455e+01 3.895548119463684067e+00 4.267931926790485164e+00 5.354798843117026586e+00 1.706186061896273287e+01 3.460768025904567224e+00
1.506351179942011527e+02 1.351959618509921199e+02 4.299701705681716390e+01 1.576631378857900927e+02 2.005093609811179931e+02 3.954367404715485463e+02 2.757781332448434455e+02 3.269048500559257064e+01 1.213322012662015581e+01 6.714236876988382008e+00 1.905794622677511985e+00 2.297666042316557800e+00 2.723477838954381447e+00 1.031489261717548445e+01 1.233050410633185479e+01 5.342205609463693605e+00 5.072045454608529624e+00 5.992128292604362194e+00 7.997922760641658080e+00 4.229779654190640059e+00 2.285971499174661581e+00 3.092157814018505313e+00 3.458991618544175140e+00 5.705989369424178115e+00 1.757185328066862340e+01 2.719600920790250065e+00 3.876609558261053134e+00 6.313446811171539608e+00 7.547647522592731306e+00 1.493258574999549282e+01
8.247141223467744453e+01 2.135846278667568185e+02 6.720917633233923993e+01 7.718928919811230571e+01 4.061770072426965044e+02 4.470682982078325267e+02 3.089048043538247157e+02 2.210803133946803101e+01 1.596096800371924473e+01 1.440820569681428509e+01 5.673105370855063612e+00 2.704659383613568391e+00 1.657047678852764605e+00 2.776956079961124146e+00 1.281815518355843864e+01 3.620664593111468932e+00 1.237606019011388980e+01 7.176141419192067872e+01 1.221237682005906606e+02 1.632681592483837463e+01 3.163612457131081523e+00 3.995597459671010654e+00 3.392005516052434722e+00 3.687882142839209898e+00 4.840605953206117640e+00 3.664816827629761686e+00 4.259367429843284647e+00 5.224214520983161414e+00 7.007671089634797568e+00 1.714469823893590927e+01
