7.985986951862008090e-03 1.174517807831170629e-02 1.024589458344938794e-02 1.294920924822287253e-02 9.844888105654614821e-03 2.159067116557555899e-02 2.142440523867327612e-02 5.800013904830534500e-02 1.052046983247244133e-01 4.749606794013327971e-02 2.205367292052181835e-02 5.041011897701281122e-03 2.957739360331828205e-03 1.099002930762361767e-02 1.270890268061560316e-02 2.767445525859153418e-03 9.571984906172465585e-03 1.642168657668129778e-02 1.454243843786650996e-02 5.019628020122052399e-03 4.662754331570155737e-03 7.085139600061142462e-02 5.562640872571462947e-02 1.934667632501783311e-03 3.213697651147993765e-03 2.529289258573892869e-03 1.201658831121383501e-03 1.377936214945458225e-02 1.336748675174393060e-02 1.676125936714921438e-02
6.294728613281665337e-03 1.388932578912240381e-02 2.494597682495429750e-02 2.040786630361222584e-02 1.421575905557109255e-02 6.352507018849458398e-02 3.008924301702183349e-02 3.794592456755527254e-02 2.470215005566839261e-02 2.121068647972623386e-02 1.501144999440334055e-02 2.940632592652375407e-03 3.909587373042461463e-03 8.903292223868625177e-03 1.238323178709098242e-02 7.881625320645241004e-03 9.558741322623047140e-03 3.057862173063545172e-02 2.250452318901343882e-02 6.614228414205129171e-03 2.772504587026965086e-03 6.712653016887354385e-02 1.704405096973426884e-03 1.210359490371925402e-03 8.252748342840635727e-04 1.090668675953938155e-03 5.233190188791386060e-02 1.388971447116241729e-02 2.015800402182700915e-02 2.010873633255921139e-02
7.602600130074413376e-02 7.672121807944820571e-02 1.622153637616928212e-01 1.320667645811505753e-01 2.800322030210561919e-01 2.844589558176965557e-02 5.258321993201532131e-03 5.624521005249351682e-03 9.004830857755702356e-02 2.768445469437052359e-02 7.466054045937187134e-02 4.985857817738289371e-02 1.836227437630782652e-02 2.676584080045339015e-02 5.110633630452314329e-03 2.133207729589683271e-02 1.403224507858627859e-02 2.800173893330969513e-02 9.060415693925143177e-02 1.466987515481850239e-02 1.535684665987583492e-03 5.467331647862387622e-02 8.693024532737787802e-02 3.047642335363169586e-02 1.808693904210650211e-02 1.204036722395625258e-02 1.087372439789164105e-02 8.715919318273255764e-03 1.486936385185649509e-02 1.664442276724706349e-02
3.527887453970404014e-02 1.001862837744722928e-01 2.199223241748673729e-01 1.777599949502630117e-01 7.241487315459141372e-02 1.116558039480146543e-02 8.796778590985026430e-03 5.917717033654603699e-03 3.624959374261745807e-03 3.433676894770014421e-02 2.224733561942255494e-02 4.434382860988416580e-02 2.009902284847396234e-02 1.328046511013424545e-02 3.881950761159946601e-03 2.923958777843793655e-03 5.990268287657945188e-03 1.095222131817891534e-02 7.562837829548563727e-03 6.298879735496512068e-03 2.904136592390094748e-03 1.117859516469592914e-03 3.876747137620006195e-02 7.743265900772471066e-02 1.488210802593679417e-02 1.099520428349295281e-02 9.450749358246511925e-03 8.966328598902667882e-03 1.821532947850037013e-02 1.976382618581784892e-02
2.024538711295249468e-02 6.219275831861014597e-02 1.737000429312762495e-01 6.732804526311954307e-02 3.815189503745305966e-02 5.558417371768437608e-03 8.522505311094333985e-03 4.750591362868197484e-03 2.216691453540533922e-03 7.833654609462269158e-02 9.952474564913089961e-02 8.462141167764659910e-02 1.246768731569744201e-02 1.230278687574371671e-02 5.789810804535625889e-03 2.167441608650487635e-03 1.804487201769171614e-02 1.019588400698233019e-02 1.608106870155823556e-02 9.076071894270369353e-03 6.155487814131260088e-03 1.725419027885648172e-03 4.344949355910676658e-03 1.375948832837581119e-03 2.695556134116173369e-02 1.473803597323219278e-02 1.024713003695253838e-02 1.185027703610414679e-02 1.855317614732298476e-02 6.816824665104571912e-02
2.005196485017439120e-02 2.074147810346657628e-02 9.302559204188258490e-02 7.454524340103306501e-02 2.938008189064613904e-02 3.163691080509156792e-03 3.882529752845342939e-03 4.183221613586412570e-03 3.966516879010493525e-03 1.213032326423125751e-01 9.614969763680160375e-02 5.044138941652558106e-02 7.275369752486550781e-03 2.993900318924973963e-03 6.767037460151928419e-02 3.288023901307478899e-03 1.149695582640051540e-02 2.626610412438922133e-03 8.407807831976006965e-03 2.869576786374321287e-02 3.424215040461425080e-02 2.129015749323397849e-02 6.416846144769608982e-03 7.275426062743844957e-02 4.036556763680491933e-02 3.865003224592570424e-02 2.412989014373773458e-02 1.663253743908294294e-02 2.194521090286619472e-02 3.945143657470936982e-02
2.782776502347731815e-03 4.354638732520623237e-03 4.603011223537846822e-03 2.332986330696769361e-02 1.116701492462472169e-02 1.864904188350239092e-02 2.856305096228398469e-02 1.643294872240896876e-02 1.976219226618950928e-02 2.316762010802471058e-02 1.796515448109349891e-02 7.388412477224540718e-03 4.057477602614084806e-03 5.851327643777903126e-02 3.428369109001138532e-02 5.901657369871024517e-02 6.495842534296570464e-03 2.738701226844009358e-03 1.392094175309761990e-02 1.892929426898281448e-02 8.542523117162451399e-03 2.518284933201162586e-03 7.103156253418425881e-02 6.868446285613787061e-02 2.795322076823583343e-02 2.875919732409343288e-02 2.526524382949449019e-02 2.179497388445294018e-02 2.431979241287763466e-02 5.792964466063137141e-02
6.061605850800113812e-03 1.101631446355473901e-02 6.435510755733822065e-03 1.385433935719834753e-02 2.127398949251244412e-02 2.406199559147654404e-02 2.149210952486140316e-02 2.042478307629316120e-02 1.639974592696981023e-02 9.229705566651189019e-03 3.732068781867443029e-03 1.159827112838454806e-02 3.357544212305026490e-03 3.860770073330055396e-02 4.388385603666008355e-02 2.182691532422477258e-03 1.305193921647593118e-02 1.884894191726349186e-02 1.651955106126742553e-02 1.255618968705965628e-02 4.364584903424790184e-03 3.348463380144035481e-03 5.140472780283136811e-02 4.456340181419960605e-02 2.137035123958866759e-02 2.151032027261862850e-02 3.195269437100078935e-02 3.690590600056369019e-02 3.571301258141811735e-02 1.409987872653490184e-03
1.627184838487455779e-02 1.068394811211398343e-02 6.223067688097569904e-03 3.598227398230545437e-02 2.321701675025475420e-02 9.850097867604521579e-03 3.179193427008106254e-02 1.433231676800484147e-02 1.218438069870000397e-02 1.208174410632598464e-02 1.083387213037002861e-02 1.407654981537514484e-02 3.238703310634318683e-02 2.316858913381013643e-02 3.420487944168302402e-03 2.911013229127805326e-03 1.143087040163353989e-02 3.489386846829774236e-02 3.432929244713748412e-02 6.877720336888064681e-03 5.763460598890372127e-02 6.005935111630705814e-02 6.583188675136335266e-02 4.378132289391249016e-02 2.569734741145068835e-02 3.531642330401774110e-02 1.550421896091020357e-03 2.540370576917267992e-03 7.305621984255388987e-03 3.617776675293132675e-03
2.728678946751822085e-02 1.791899331607083035e-02 2.837284838828697461e-02 2.650991699012187133e-02 2.296994830261459355e-02 4.524884515012209812e-03 2.085613521580329324e-02 9.568129016607130471e-03 4.086131888648750730e-03 6.227496002982561146e-02 2.087982377040096399e-02 2.013607391035498323e-02 4.255973309635995017e-02 4.559079804301408717e-02 2.144514133072402545e-02 2.334680118336939642e-02 1.254713010758653491e-01 1.301608649357467729e-01 5.193471733057882650e-02 3.041321304457772837e-02 7.523904401973881273e-02 4.764590841034455071e-02 5.402764454194348975e-02 5.869768293411053994e-02 3.257938999176605843e-02 3.901568035475213442e-02 5.695127215362371514e-03 7.750177311968913831e-03 9.644450155986026771e-03 2.437848282348966961e-03
2.281912280145492397e-02 1.207857614659823935e-02 2.673350645499688108e-02 2.282036871051184093e-02 2.853583969464524098e-02 3.365553813037487022e-03 3.485468706587181806e-03 3.387453866807827677e-03 6.188881710596443042e-02 1.241699001370434076e-02 1.664730122824201741e-01 2.749645724952389236e-01 5.679434468050255091e-01 2.779549433513952561e-01 5.083082563856326785e-02 9.935343560349341185e-02 1.850314920555782283e-01 5.100678936272224490e-02 1.206512070174119503e-02 3.350392367667241484e-03 5.146933766888343864e-02 4.614450089271131261e-02 5.746225152001400299e-02 7.756303814149990983e-02 8.149857558892431575e-02 4.417324138175123677e-02 6.933626521156997791e-02 5.224872649523189250e-02 4.742719297284524183e-02 3.461016292168110631e-02
5.431142859870020587e-03 3.155601599273772599e-03 2.196796680231555970e-02 2.161746690941558288e-02 1.661492461583080615e-02 4.931599250852103898e-03 7.528447281001225677e-02 5.322608552890889522e-02 6.469285892791547254e-02 2.414593501600373338e-02 4.969817024369904690e-02 3.281629634759724023e-01 5.884414314889054864e-01 3.025984800511065109e-01 1.081326052188417430e-01 1.213125978086089379e-01 1.336684840451911882e-01 7.845294058564777906e-02 1.915503014089167677e-02 6.941969804122308761e-03 4.905048067904718007e-02 5.004889155205755752e-02 5.669087862474472134e-02 4.797800690874195161e-03 3.428487115312859115e-03 6.744210215559610921e-02 5.448070294596678298e-02 4.982877459500769518e-02 5.409864752027871565e-02 5.830094067942011293e-02
3.939213201180007118e-02 3.760722070894647120e-03 5.112911294487431334e-03 1.581159407259785307e-02 1.025142432876802352e-02 4.179199477112519392e-03 2.603800256718682635e-03 6.856357674414606529e-02 2.363101932191000870e-03 1.165287613377539479e-02 3.522433347981655371e-03 1.039127174474916565e-01 4.371347022248656122e-01 1.861257718847640630e-01 5.809076549050969790e-02 6.681722708773377151e-02 2.458408985586324480e-02 3.592202988825580340e-02 4.070430031347985200e-02 1.722375674809244195e-02 4.646605914941093207e-02 5.064345151028986497e-02 6.104778602232199813e-02 2.975260271389031878e-03 3.013892026201339929e-03 3.337834279891830225e-03 3.083865281926570067e-03 8.378149456665343053e-02 7.022282503407353826e-02 5.781562061835723160e-02
3.475589704074868308e-02 5.643135022091032640e-03 4.536100165225437006e-03 2.738045190789859321e-03 5.883873927257861347e-02 6.583235886980355264e-03 2.214522567975812234e-02 1.757478529512419840e-02 2.334288663711003593e-03 3.990979476480292082e-02 2.596238242777641585e-03 1.686184772627949760e-02 1.989701210817328147e-01 2.675367467943087219e-01 2.832935955371937986e-01 3.800291261440896795e-01 3.407927944782004892e-01 2.206802912983518994e-01 6.015188343703752327e-01 2.818710891080058456e-01 2.544542164380206306e-02 8.585760092636913338e-03 6.297484751034500110e-03 1.422098720222794016e-02 2.865717896228569053e-02 2.690232308578747317e-02 7.814662409958880729e-02 2.934414934218241428e-02 4.349430688617952206e-03 4.382226278864614910e-03
3.330961098255436764e-02 3.166214700099360263e-02 4.152659459782210086e-03 2.262885971254005590e-02 6.937970811008141621e-03 4.925282345668151318e-02 1.372925789015629408e-02 3.582107895778961770e-02 2.488568237105400968e-02 2.558188709839466588e-03 5.445617378808618840e-03 8.322768285686257816e-02 1.769110082667015305e-01 2.238322410035462062e-01 2.014231128456819286e-01 2.424827117502745544e-01 4.130230615364604008e-01 7.132257888279170954e-01 7.255097096440180637e-01 5.689978956773878993e-01 2.423004198056205594e-02 2.521724878940843906e-02 2.245751769852426943e-02 7.068647090427490620e-02 1.022948727034690558e-01 5.259949687952162334e-01 5.261075360131283185e-01 1.041511057480157543e-01 4.421561586010116368e-03 7.437579632235763460e-02
3.173596245104338270e-02 3.322630009763186121e-02 6.481691508957433678e-02 6.686065535119677106e-02 4.384341981330405758e-02 5.287849660796938023e-02 7.463659138646804199e-03 1.918894308044392927e-02 3.961883887705332230e-02 1.411179348448473279e-02 1.456418968252849028e-02 1.275163579478275598e-02 9.938717547612611891e-02 2.010875548706403393e-01 1.873237071131930165e-01 2.867717968066967327e-01 4.966857980378285298e-01 6.040042761162599527e-01 3.492301315373272375e-01 7.612432115841477609e-02 4.577581616033567918e-02 3.149104229618002737e-01 4.601516205141830684e-01 7.760851532951474896e-01 7.359263409926303234e-01 9.684481585643451851e-01 7.789555093129939545e-01 2.193886368850810620e-01 7.030053336095611928e-03 8.672039778359021123e-02
4.102804970189594808e-02 4.630078788606045714e-02 4.349995716550362351e-02 3.955351022772624764e-02 5.793531317956093774e-02 2.387199835735517254e-03 1.134626285324146916e-01 3.717290452464654948e-01 1.809128797714633363e-01 3.084840369352689557e-02 2.281610242537267241e-02 3.549101033230860763e-02 7.023738966149996321e-02 1.038224697681384562e-01 1.375526702402890544e-01 2.474206121673536707e-01 5.345420721444867906e-01 5.387309867382518158e-01 2.553706690709903748e-01 8.782334012780572408e-02 3.801787935345037894e-01 6.922232402953033548e-01 8.908875770551007989e-01 9.216930239051759344e-01 8.205339851943415086e-01 7.173891528922837768e-01 1.068580223255689354e+00 1.839870279829187438e-01 8.174708174192798354e-03 3.674918746466212735e-03
1.020141400151200334e-01 7.906563401591852613e-02 3.828285039589916783e-02 5.415099820081989423e-02 1.373571786582515955e-02 5.672924754088541632e-02 3.028261586264733296e-01 2.476362593188961014e-01 2.427159588513801980e-01 1.207313496843480799e-01 4.393569236702788566e-02 1.176703418997587271e-02 1.150629599095191226e-02 2.968716254133070900e-02 6.736256137123866616e-02 3.112900756584441320e-01 3.281338776058571050e-01 3.827981571970205943e-01 6.680749963416884873e-02 1.183062141953601515e-01 4.214535607257273719e-01 9.150394546716756894e-01 1.131334262203779639e+00 1.183539771667140528e+00 9.890311371981279631e-01 9.673193451718290481e-01 9.087407575124217818e-01 7.130681066303414806e-01 3.141005007786090708e-02 2.048198339650653815e-02
4.057836071121453253e-02 5.909580422071381532e-03 5.722109843521641821e-03 2.227312999849554234e-02 4.494581793250575219e-02 6.126658689315963441e-02 1.934429703091148645e-01 2.419516923681572507e-01 1.656089174068739178e-01 1.282001473316450313e-01 2.671419698700087247e-02 2.606219225243868592e-03 3.967669660419732847e-03 1.126655818417543822e-02 2.466959005578589492e-02 1.461561444725741898e-01 5.572493638260581084e-02 1.776441427010365046e-02 5.954481969888007764e-03 4.333417514609307075e-02 1.659382683049930862e-01 8.881966967176943006e-01 1.128550118477155584e+00 1.189802339419280930e+00 8.764812821808570797e-01 4.102884633604543252e-01 6.708317484822093890e-01 4.556654764626125731e-01 4.087269638706671898e-02 1.589902663694139559e-02
1.492494281796205927e-02 1.907923349363287169e-02 1.174442748611885697e-02 1.457162402996571050e-02 3.416471124196916731e-02 1.962835563752225385e-02 1.010286343059929592e-01 1.305895488387003311e-01 1.200942675653833142e-01 2.817918249222484128e-02 7.051061373295502976e-03 1.489705387910278357e-03 2.759183876538744487e-03 8.145615234073432659e-03 3.232736018643368042e-02 2.109625019787866526e-02 3.837305876229532564e-02 1.129512665035968186e-02 2.117212293975656232e-02 1.006962334494817257e-01 5.466665766901945833e-01 1.040047746799183992e+00 1.121261494332453479e+00 1.071017830588172348e+00 8.275843534675111357e-01 6.102040755122334348e-01 5.941908785259648607e-01 3.967657117846333792e-01 3.555031694479383886e-02 1.250126870415499934e-02
3.882280105967254868e-02 3.541358808527116098e-02 1.808874299039208225e-02 1.293916299220226364e-02 1.667780056156490526e-02 8.941055282817078620e-03 5.086584789810871809e-02 4.546669809844402360e-02 1.280074042942705090e-02 7.380290105270500070e-03 2.587026369067593409e-03 2.013407806627756820e-03 1.209070636827582444e-03 5.338350078500653934e-02 1.813884994521315543e-03 6.041575557796582778e-03 2.153001972825724711e-02 4.883077538323478406e-02 4.677062409397714920e-02 2.089341312637111592e-01 5.741986074405257545e-01 8.346099003365146096e-01 3.405209229396600201e-01 5.136421385814436968e-01 6.671476395593894937e-01 3.796854478229584884e-01 2.839705951330787070e-01 2.385887665887350684e-01 1.152456479626813232e-02 1.095314214554009465e-02
3.163334564773776642e-02 3.628251196527305239e-02 5.291414538730354090e-03 3.625823937969229437e-03 2.946457236583053911e-03 4.386948552404755508e-03 6.480438269438304824e-03 1.711880873644116511e-03 2.386604750838744547e-03 3.898808177182838675e-02 5.378632907793678974e-02 8.094273860905169121e-04 8.133984537158411637e-04 2.991194075913883657e-03 8.667713788979602638e-03 1.117127262687119260e-01 2.135163349380784781e-01 3.070614412543219429e-01 2.084720115383079109e-01 1.564163054329621994e-01 1.111718566553964033e-01 3.981450483824050535e-02 1.548602455293344310e-02 3.378621276105764348e-02 1.229392191425117270e-01 4.165695243039478635e-02 3.821480076786445967e-02 1.791732544547413111e-02 5.012942599075706496e-02 4.715519801337107048e-02
6.724535554026024597e-02 5.158813819635336279e-02 5.474949827052322249e-03 2.335543278564547985e-03 3.389985333174049854e-03 2.635729637958469321e-03 4.375105426543919769e-03 5.690681607122954899e-02 5.377455724678354559e-02 2.344837432792974685e-02 5.455233072851826959e-02 9.788744496319957186e-04 1.029421096147884341e-03 5.820052885395445366e-03 1.004432902475017354e-02 6.571262284756732019e-02 2.394378720984958187e-01 4.434756344909580039e-01 4.988556682451052438e-01 4.308388678617095513e-01 9.183025761779212148e-02 2.053697596886601071e-02 2.565134573951432032e-02 6.382684219189507790e-02 1.426365838563674882e-01 4.220846162147212643e-02 1.600777441923930192e-02 9.068636429797849799e-03 7.004938319017108006e-02 6.793433833269579836e-02
8.451981023254938330e-02 1.074688104877812717e-02 2.909567852331491466e-03 9.441486481196555060e-04 1.059801305177103178e-03 2.310356466589973644e-03 3.241271108816152265e-03 4.617195131548893633e-02 2.659457381927602532e-02 3.052594645880769494e-02 5.288703407607685258e-02 1.042423418972481496e-03 9.403552204842687869e-04 5.030383898568101253e-03 1.844285761301918403e-02 9.352891240131940009e-02 1.803464040743037733e-01 4.124610211210752442e-01 5.157381325747916190e-01 4.363783122484143351e-01 2.194890448874115829e-01 1.273707401768347722e-02 9.141614155694848670e-03 2.007864162431701599e-02 1.161465526946246357e-01 7.043395119160741902e-02 6.318376083007504196e-02 1.736056120896649693e-02 5.632186113864384724e-02 5.127950574831308811e-02
4.697079144429166381e-02 1.455580720508901915e-02 5.552957323385666194e-03 5.126635956158041678e-03 1.122233204288638868e-02 7.613729417411923238e-03 3.229154615882105003e-03 1.352249621765330440e-03 2.088741225310197010e-03 2.942726829839795947e-03 3.193094008701871656e-02 3.692805429757659019e-02 4.712261480887841580e-02 1.311065986860315618e-03 6.648971028414204197e-03 2.867906993688884576e-02 2.877744332856505341e-02 1.220474624427615867e-01 1.555906551776412849e-01 1.346968948080342621e-01 1.150757556116058511e-01 1.507516676531479340e-02 2.359022483114318631e-03 4.679165070307017907e-03 2.079216851577683767e-02 5.262585419134049869e-02 1.412740417307468410e-01 9.215621801139312064e-02 6.291940832277295725e-02 5.515368621058908821e-02
1.681659343305895102e-02 6.684389857546220448e-03 7.036331627178473921e-03 1.174028635311418454e-02 6.310056568269634993e-03 2.800684291298192064e-03 1.275077260136432905e-03 8.862987020206914606e-04 2.798147220685828513e-03 1.113451985952383823e-02 9.370828524701940417e-04 3.531340435890580748e-02 5.195604501946994580e-02 1.358089115463886540e-03 5.388401988693833529e-03 1.021628654441714829e-02 7.012112364861944509e-03 3.466211221498067142e-03 6.387317535435101633e-03 1.338713442091150202e-02 2.913184436868059696e-02 6.103378356244140539e-03 2.827814720853274750e-03 1.192840963629266879e-02 2.924841276135888707e-02 1.052343591155552663e-02 3.646651060525567256e-02 4.363646626374415027e-02 2.559521582867150050e-02 7.831674468696911418e-02
1.704560282162386267e-02 1.369819473855562152e-02 6.584475861058519848e-03 4.764442149672525918e-03 4.355459297142514480e-03 1.618580318689336528e-03 1.062185843899128741e-03 1.079076731782349988e-03 1.188695942193858119e-03 5.057014066083114108e-03 1.562001777199700141e-03 1.752399526001085107e-03 1.566598734423165070e-03 1.931367544079180603e-03 5.298435308688043653e-03 3.946366512062338475e-03 2.759417984196579389e-03 1.705275009685666568e-03 2.563003889503909227e-03 7.450558334011717077e-02 6.086196763363195539e-02 8.247181231864741946e-02 5.184186458086980157e-03 6.763402372515176647e-03 1.423393456583243316e-02 6.968891072821224372e-03 1.127086910531100925e-02 6.521978025012292908e-03 1.026523410090905176e-02 6.706092090718405313e-03
2.316114682456070842e-02 1.208504116470791173e-02 6.769904168592934951e-03 9.117853582941511451e-03 7.881874049264197407e-03 4.246386157561222313e-03 1.440702033519760707e-02 1.081638407734241726e-02 1.591803570913187093e-03 1.318721456531445155e-03 5.734238977147125549e-02 1.369521274410314413e-03 3.724002629761999188e-03 4.000055177099650673e-03 1.194078674589516866e-02 9.594161624142371822e-03 3.147757938082675500e-03 3.875136108229433173e-03 2.989131921761993028e-03 4.951991269758090897e-02 4.896835564234541804e-02 7.232730380756469124e-02 7.509735828918700194e-03 1.051158194141632585e-02 1.048214479538591565e-02 6.643716330940512005e-02 4.454191764439880893e-03 4.442380091250234912e-03 1.105182195993055158e-02 5.772307817694334597e-02
3.114658799549692089e-02 2.697572910787045947e-02 8.070448037753773229e-03 2.719271811433978878e-02 3.113137898752092042e-02 5.840510238218361849e-02 3.899021622330443859e-02 4.391724869783659654e-03 1.576691272321922247e-03 1.043549596895849540e-03 3.845784899074083940e-02 4.507534278593477300e-02 4.796186258087930393e-02 3.050436561841894743e-03 4.125445655222723454e-03 1.679703571092703131e-03 1.648991654469035215e-03 1.713672304638919628e-03 3.212735972407605375e-03 4.137642331301134499e-03 4.412832870039356398e-02 6.413877792805292022e-02 6.720435449370659731e-02 7.529205668566176998e-03 2.010401466560669814e-02 4.995770852069516405e-02 7.314457132621750290e-02 8.672212074644525259e-03 4.918753576381911484e-03 9.817954005349974200e-03
1.692467118171388576e-02 4.208882209458402607e-02 1.243977523148805282e-02 1.315695483166390636e-02 6.301225192591346225e-02 6.642551255875941973e-02 4.412010003281804926e-02 3.023125800783255449e-03 2.135238720667211910e-03 2.186949500383013768e-03 1.394786380798253679e-03 6.009213345025742753e-02 3.431882300531585717e-02 4.977577730745940537e-02 4.698650938983426999e-03 6.064545172491137004e-02 4.340553139664686533e-03 2.280495404106200677e-02 4.234583735660556181e-02 1.285807251675179751e-02 6.198884128884166178e-02 8.614613924020890490e-02 7.165574084111112074e-02 6.966951569081962503e-02 5.797611546499190777e-03 7.134978058498098186e-02 8.382849790425697667e-02 7.909571174247228414e-03 4.141995841774512820e-03 1.015775894024181433e-02
