1.440382761736688777e-01 4.742201822124082170e-04 4.210255141551915142e-04 5.421710457959934455e-04 4.166434515540406482e-04 9.198227494989862476e-04 9.089627208641433637e-04 2.451826311851007089e-03 4.454415493101542001e-03 2.034214061714517512e-03 9.635315854887111170e-04 9.920157664846304679e-02 5.912752837320751909e-02 4.715287481622451853e-04 5.337023729290738460e-04 6.039331006354312081e-02 3.881022453179997249e-04 6.510977063045511994e-04 5.650643728843220484e-04 1.917914150791357429e-04 1.116828489292487070e-01 1.632708107821113225e-02 1.275752737613746780e-02 5.001509661514200872e-02 9.384859451363783411e-02 7.128954350058727685e-02 3.194374176527035175e-02 2.832941275620816379e-03 2.701188435925591831e-03 3.393129798406647156e-03
1.096481044420438838e-01 5.468736753692987011e-04 9.957121714944804514e-04 8.160078353656296385e-04 5.727040452835918151e-04 2.582762254710848498e-03 1.234688618097473656e-03 1.538117312114559761e-03 1.002510944278913818e-03 8.594881511653232548e-04 6.195862380308676809e-04 5.769850562669986971e-02 7.852745333610612610e-02 3.666929514428966417e-04 5.047800343217815570e-04 3.215372378478306725e-04 3.844017200859169278e-04 1.201723562059909926e-03 8.684068102547490980e-04 2.525502086224649923e-04 6.844336738612011306e-02 1.556470518988468422e-02 3.307671454120688498e-02 2.880760933927947742e-02 2.442688573504271654e-02 3.149133692125806461e-02 1.077567163533975012e-02 2.805526371726197159e-03 4.017921622774402179e-03 4.048222204721325587e-03
3.087015624856377389e-03 2.973040224657374012e-03 6.298416759556817873e-03 5.084442376386289972e-03 1.088346531597201260e-02 1.116866128196803646e-03 9.431677146043082605e-02 1.014210013637044105e-01 3.633775880662317923e-03 1.107393730208204368e-03 2.987292876886178151e-03 1.982141974061010434e-03 7.281976480982923529e-04 1.076446888057737373e-03 1.121280089678034636e-01 8.758330478423947746e-04 5.677773164032872463e-04 1.110398860965662333e-03 3.535142192597804690e-03 5.689529372224779672e-04 4.360686446119745041e-02 1.290009850512607859e-02 2.005536362739387957e-02 6.908592670986199620e-03 3.963100452954004815e-03 2.528249822888589075e-03 2.164939770942782976e-03 1.724525517540169330e-03 2.945881185774421041e-03 3.352912982557764744e-03
1.425058336714438113e-03 3.839709626209882737e-03 8.439606071818978386e-03 6.763732164040494460e-03 2.804903232342643472e-03 4.391041980168453821e-04 1.607182823309625808e-01 1.089791467969860594e-01 6.680859229168900626e-02 1.400225372528611208e-03 9.054364908491732873e-04 1.815516281899020277e-03 8.235522301266436172e-04 5.513851727643093083e-04 8.362658183983870397e-02 6.576909625903784584e-02 1.417865914451102993e-01 4.431119606917570961e-04 3.028595403761566310e-04 2.503101710928228594e-04 8.438854361662655179e-02 2.950395029976918618e-02 9.394065134182415233e-03 1.790905483649844060e-02 3.232811933182420158e-03 2.304003520277807162e-03 1.906389509274447353e-03 1.813400194959796739e-03 3.635310717892980409e-03 4.023892379030526850e-03
8.208381557502442485e-04 2.389579037589902727e-03 6.653923179025522661e-03 2.577182928492414375e-03 1.489101118091370720e-03 1.012976397777863302e-01 1.575185369311677963e-01 8.894059918512792207e-02 4.130425475434270494e-02 3.319558916472924691e-03 4.209368314069338902e-03 3.664714483306912192e-03 5.433262687590173284e-04 4.445398825875014354e-04 9.968408420449303975e-02 3.785702706376905397e-02 7.685276705755901419e-04 4.273598543699978032e-04 6.686831620585243635e-04 3.711925865683163316e-04 2.511754078875950307e-04 4.882575539845104839e-02 1.099490272385028056e-01 2.983935819393719949e-02 5.833552064948411761e-03 3.106433304275342359e-03 2.103822723985547712e-03 2.450873412464108121e-03 3.790880330158254846e-03 1.423676635194193185e-02
8.150125718390142330e-04 8.023802093728535801e-04 3.590648269440104880e-03 2.870067200920828170e-03 1.140960616987761987e-03 5.866271401597322743e-02 7.215761472644469099e-02 7.814597852060561900e-02 7.292260966572333691e-02 5.273063978059724932e-03 4.230005698748577452e-03 2.293933172257692655e-03 1.080195700327403474e-01 3.339552518376782964e-02 2.580088137353578337e-02 4.274776983777185679e-02 4.412195335943248854e-04 6.036173792942636090e-02 3.582437281583511664e-04 1.202133007092875960e-03 1.420074506888694766e-03 8.145525539302470117e-04 1.947888310628560033e-04 1.787317097224684626e-02 8.763834171882230531e-03 8.236089206578325883e-03 5.045746944827388461e-03 3.507895575371851316e-03 4.569410566748964911e-03 8.426314877315776303e-03
5.145084310965152008e-02 8.189030429989116455e-02 8.645864416509868589e-02 9.099199444003943944e-04 4.351744995860640100e-04 7.408464255263787560e-04 1.172777960812025925e-03 6.964068589074345417e-04 8.579513324412864394e-04 1.036126741037905578e-03 8.243611498478690481e-04 1.356288922841155931e-01 5.637515302949155926e-02 2.224054020838652640e-02 1.181584494930234056e-02 2.120616324806189751e-02 1.266245159627125694e-01 6.074233614659420993e-02 6.071828606619782652e-04 8.132419318855573561e-04 3.596244654752153496e-04 5.134308732735234915e-02 2.062705667375253071e-02 1.616291622886029469e-02 6.010610600577621920e-03 6.202962734937590185e-03 5.383903626408941857e-03 4.723031530570386168e-03 5.429612384924965493e-03 1.322945249679621099e-02
1.100595565262717235e-01 4.570844322747001556e-04 1.190179786873052092e-01 5.701966760533257617e-04 8.677618022855513496e-04 9.880545054446112242e-04 8.995071477083954473e-04 8.698386695438951009e-04 7.154885994261025225e-04 1.737718253760389131e-01 6.999020900525783351e-02 5.511206076327735195e-04 4.643027980490750661e-02 1.552276566333049557e-02 1.597509836550199333e-02 2.965977576749631930e-02 5.310198994114949129e-04 8.424549756910917984e-04 7.339879108449221283e-04 5.143501106479823198e-04 7.530307520300680291e-02 3.639606336623576327e-02 1.254626274060118007e-02 9.807550311924722111e-03 4.614070296323290188e-03 4.842590909597777223e-03 7.438541748329035794e-03 9.488744772874944944e-03 9.609193421052247136e-03 2.884986963400408208e-02
7.132706509203999437e-04 4.588475410696634857e-04 1.110721779726185354e-01 1.537842469965128214e-03 9.895347826372070249e-04 4.199084787910474775e-04 1.369848841761992907e-03 6.197270400375370176e-04 5.242819708101810819e-04 5.348401253160940585e-04 4.919309073900418085e-04 6.674369752148300982e-04 1.465862101876609213e-03 9.365158837991722617e-04 5.770188249780462686e-02 5.289452612123578257e-02 5.191612298306752960e-04 1.564762422552522410e-03 1.533877916914350333e-03 1.271704095112368149e-01 2.068257397354675980e-02 1.635875585938548551e-02 1.576498202673156171e-02 9.697005227209825468e-03 5.587794199223812888e-03 8.561957399289468057e-03 3.200829631791916874e-02 6.555345945587867651e-02 2.634424736899826543e-04 9.703052429474176566e-02
1.235945375143839399e-03 7.994504001332420218e-04 1.273143680029724173e-03 1.177467681399335577e-03 1.022566833731403070e-03 8.409772634644344103e-02 9.269106900288276701e-04 1.706376491103402671e-01 7.265027344143362709e-02 2.724535072665845020e-02 9.407933796778674774e-04 9.373746987375135287e-04 1.998922399772927634e-03 2.136762908040543748e-03 1.005408421822003929e-03 1.078741904420013956e-03 5.726748453118019923e-03 5.907181825393115031e-03 2.366032392858941676e-03 1.049181984188123301e-03 2.593685566502221956e-02 1.257806670079177069e-02 1.311188937850733122e-02 1.375048525794707148e-02 7.447839555086759912e-03 9.531954792866082285e-03 8.925207745999685915e-02 2.149081744977576433e-04 2.893968422070085931e-04 5.281476550990072544e-02
1.051115788632314436e-03 5.462240510257711668e-04 1.218527109533564141e-03 1.031100750358213136e-03 1.299846281378806657e-03 4.934078699222871345e-02 4.185633979065388893e-02 3.675427336208050844e-02 2.325407415498285252e-02 4.644558364830167615e-04 7.432726567284591440e-03 1.259508358635729255e-02 2.617489979963324997e-02 1.280526852906348212e-02 2.339812900246226665e-03 4.492262464443093697e-03 8.302559165797312665e-03 2.299157060786380727e-03 5.506884081183893677e-04 5.147246498046222085e-02 1.789320630758332864e-02 1.265162781821387722e-02 1.523085726420779322e-02 2.069449108044064956e-02 2.159166507450008266e-02 1.156719235705971557e-02 1.817986560585765562e-02 1.479057153662654070e-02 1.344260530926421476e-02 9.770779845900790656e-03
7.662053848232953934e-02 4.491019715117754857e-02 1.002493522105100607e-03 9.799709513581000841e-04 7.597973013242954746e-04 7.203678855533596215e-02 2.824016916742105171e-02 1.824909044728715082e-02 2.270654752102869295e-02 9.064999511559873688e-04 2.229413282775656591e-03 1.471152995257218529e-02 2.640094248919123976e-02 1.355550101234449800e-02 4.851252667709563329e-03 5.375810677728555531e-03 5.945218079632753894e-03 3.538840796216050685e-03 8.798172141382741389e-04 1.097038062235801692e-01 1.643860398223845332e-02 1.475639089034791462e-02 1.686432091838028363e-02 2.988477092681707248e-02 2.830373217459510732e-02 2.000979195245413192e-02 1.523866636050890365e-02 1.393668555495728920e-02 1.501563562444888783e-02 1.617840653044217217e-02
1.485081934415079588e-02 3.818273774198244902e-02 9.371463060935582290e-02 6.615747240435582415e-04 1.761473983250577136e-01 5.628163398888027386e-02 2.896110526069095581e-02 2.431526110268469529e-02 3.077194278401361449e-02 4.521394108463007216e-04 7.253864233901609337e-02 4.637891270857572371e-03 1.937564455876427186e-02 8.153517693413110667e-03 2.526484939128857861e-03 2.867243801984687215e-03 1.067788167622263796e-03 1.587880650296000055e-03 1.833783826139920650e-03 6.947083143757054168e-04 1.957312052477732170e-02 1.772660502748977726e-02 2.155109679060810551e-02 3.705758651239512980e-02 4.855869014443381371e-02 4.566792620073172049e-02 3.385743551025855586e-02 3.098714204667459698e-02 2.372759338940166884e-02 1.841514466161322736e-02
1.183269145270551999e-02 3.389161678260546595e-02 6.258016588892886811e-02 4.602293994023883006e-02 2.742320304851543489e-02 1.090698651768629429e-01 8.401628789227913018e-04 6.905041628042161679e-04 4.480232557159416484e-02 1.376268428466605187e-02 5.503578560075885612e-02 7.409556833760395228e-04 8.645653991845440520e-03 1.145569591353757383e-02 1.200072137862981045e-02 1.587452781938351876e-02 1.448667217106028478e-02 9.551824204001850560e-03 2.649468612817559160e-02 1.257126910681786308e-02 1.054365098385016530e-03 1.219319433126508645e-01 9.255929023323668237e-02 5.899120235553741761e-04 1.374668244907100356e-03 1.284805205639418663e-03 3.514413413011594194e-03 1.161144008622333988e-03 3.869703757925747195e-02 3.778211426623778041e-02
1.059489038647374801e-02 1.063373923928432815e-02 2.980557776485370444e-02 5.272998256331089262e-04 8.270010949876434314e-02 1.952119312897892395e-02 5.506843665300807699e-04 1.549499893781845165e-03 1.020265341474628322e-03 5.488887245381991742e-02 1.176584862261628728e-01 3.623067307041270661e-03 7.594155124528398880e-03 9.422820171811993606e-03 8.340760266059125266e-03 9.875812860208872321e-03 1.716644006738336087e-02 3.034168317915326291e-02 3.167520442940226222e-02 2.568482210483260739e-02 1.122865958007840392e-03 1.196862280054765762e-03 1.072706700081031868e-03 3.405077201932403801e-03 4.922670517038201833e-03 2.525556336401366467e-02 2.540739514545963321e-02 5.189402241737806933e-03 4.497806617605108054e-02 2.727733324221526950e-02
9.233404731926598066e-03 1.008416425017739926e-02 2.359117325722027980e-02 2.650881897716452634e-02 1.778479035488958124e-02 2.029602014392706960e-02 1.434704700798383470e-01 8.110533025190477373e-04 1.649661498701315019e-03 5.980322872280099001e-04 6.238040442651925782e-04 5.451296424166991467e-04 4.200745503982156875e-03 8.365035554190651534e-03 7.681874964552127399e-03 1.155520701148575816e-02 2.043901486010305316e-02 2.558552826258390228e-02 1.531155965545459574e-02 3.464698669308482332e-03 2.133704472789689499e-03 1.497736491678537500e-02 2.215489642572380374e-02 3.772146923625593201e-02 3.571820435328872112e-02 4.675929583603957718e-02 3.782403466761991018e-02 1.093891966199917257e-02 7.013230703440317959e-02 3.193654733251621164e-02
1.115885451478081623e-02 1.297885135234035439e-02 1.313805213296284982e-02 1.278480175843045921e-02 1.983473219528705117e-02 4.134029936032700137e-02 4.691765445873015243e-03 1.532671695251899661e-02 7.347733818720727887e-03 1.275485527247276901e-03 9.574448972763628055e-04 1.498364822600611618e-03 2.944296800366711167e-03 4.275043270583653646e-03 5.548407868176341573e-03 9.776349500173524276e-03 2.168302308429593747e-02 2.280373176635078561e-02 1.129680732399041508e-02 4.036322435224264787e-03 1.780483752056435595e-02 3.290451569215344096e-02 4.303764115449205258e-02 4.500637739448488939e-02 4.013122955596296754e-02 3.497009477387547777e-02 5.211999236626831816e-02 9.153267641517592174e-03 1.035102303891303754e-01 4.428829754887003006e-02
2.674726504444336489e-02 2.116192650584154678e-02 1.135006074690930386e-02 1.828365686653268818e-02 4.579643939441343072e-04 2.275982412777670730e-03 1.238410819442908525e-02 9.820159838837215147e-03 9.456817855898407010e-03 4.827083645086022168e-03 1.794619090906250745e-03 4.868198273724211062e-04 4.753524914829677255e-04 1.210348959134719109e-03 2.684047103827131089e-03 1.215885241415625394e-02 1.326444418429494239e-02 1.629598069882978034e-02 2.975737039923158529e-03 5.470421295593897067e-03 1.987081598940115129e-02 4.394604699807027476e-02 5.556555097798904219e-02 5.888756450543657789e-02 4.940292678535126991e-02 4.795195210122554091e-02 4.470386126276907485e-02 3.544401773605126982e-02 1.573065688946811719e-03 1.037266858697686320e-03
1.214084289492868909e-02 3.389247957088009633e-02 6.437037437705432630e-02 8.335946264259209027e-04 1.825319867851613650e-03 2.518574685985326689e-03 7.715934963680429540e-03 9.295532699915162733e-03 6.203851778360342135e-03 4.903048428190044314e-03 1.044220391838833516e-03 6.920949495307344990e-02 1.043140964465086029e-01 4.511534711070867539e-04 9.833876914835525552e-04 5.823378658774799183e-03 2.311229519428373725e-03 7.755735533456417641e-04 1.146192997334464225e-01 2.027288117059946725e-03 7.780679463090776210e-03 4.185302608713322575e-02 5.368228798282986824e-02 5.757525776182467053e-02 4.306401407195875608e-02 2.030253125919295049e-02 3.320650498685807223e-02 2.279029543445319772e-02 2.054862986118126573e-03 8.110794306922714837e-04
6.210394850279174483e-04 7.768795960673150402e-04 5.106340045248028859e-04 6.193861550720429704e-04 1.422652255877769221e-03 7.891117423689624193e-04 3.915761965746419708e-03 4.838478168825443432e-03 4.307587917852944565e-03 1.031463344064133779e-03 2.628968285063302580e-04 4.062775255174849720e-02 7.017250754582904371e-02 3.071901183668760251e-04 1.251496384176320042e-03 8.622803821785778380e-04 1.637781326049803955e-03 5.042779680107622835e-04 9.799818828769174019e-04 4.724844557035445293e-03 2.532125296058018032e-02 4.794472104035674143e-02 5.163715442051526605e-02 5.052500472594619735e-02 4.010171254632069471e-02 3.022427095463319641e-02 2.987115843057473741e-02 2.012494578711401805e-02 1.811784782852615943e-03 2.078163130004760939e-01
1.770851341687177619e-03 1.574835951043137595e-03 7.892317245919815150e-04 5.495192939556890494e-04 6.877152937034237620e-04 3.526143480848836255e-04 1.914877099440246561e-03 1.618405048091837647e-03 4.246381793972666503e-04 2.355428410601264537e-04 6.697823695185606274e-02 5.277581829993758383e-02 3.131679658517642906e-02 1.719679880979333580e-02 4.418983479519045243e-02 2.493301362568185178e-04 9.227654201430841472e-04 2.178690618127369655e-03 2.164413965172015241e-03 9.794439688627226692e-03 2.636915700260607925e-02 3.785597712193557174e-02 1.529088018091971993e-02 2.377715612313243548e-02 3.207017202545456996e-02 1.888983093410605621e-02 1.451561784404559879e-02 1.192125375589623074e-02 1.354274380594692739e-01 1.237385560262618533e-01
1.435303263120094042e-03 1.603900366977168822e-03 2.291527461798178219e-04 1.047790275592228315e-01 9.148881970145575360e-02 1.700397753037125362e-04 2.308182002167368375e-04 4.908504975622356159e-02 6.325469887944684677e-02 9.836130694523322754e-03 1.281546575860874164e-02 1.939504968442569421e-02 2.150953963478634962e-02 7.706807760891906667e-02 3.362201040260103294e-04 4.682693985956502998e-03 9.203088609634623926e-03 1.370381629014745355e-02 9.614712594770907089e-03 7.340099532477355714e-03 5.137650073798592787e-03 1.818784744944778762e-03 6.948947679202485943e-04 1.553504938124385939e-03 5.905482357913494074e-03 2.090770291474437076e-03 1.998709701798397596e-03 2.037552849892978468e-01 2.342859787296849503e-02 1.917206539503705370e-02
3.005037065133806667e-03 2.250431181870683230e-03 2.347818265163576206e-04 6.688679712686691758e-02 1.031744320768898382e-01 8.177652183400797858e-02 1.497646708913785956e-04 1.358562154198113443e-02 1.143373058599989056e-02 4.934563693506815660e-03 1.166771237895261430e-02 2.200905242703255979e-02 2.937900804296580959e-02 2.275897055670193531e-04 4.081311364778107686e-04 2.764473621075932801e-03 1.031617218381920310e-02 1.970730200653283970e-02 2.286496866504546949e-02 2.029501458022883731e-02 4.376768895295029584e-03 9.859190124960662792e-04 1.226532525312702855e-03 3.079103055028356573e-03 7.088522305372286364e-03 2.159768153686526023e-03 8.530625079411027246e-04 9.742032538368011751e-02 3.086377284913130459e-02 2.777029213016798254e-02
3.697681747748190161e-03 4.584371216625895236e-04 7.823113010336366080e-02 2.658048637194090902e-02 3.143305984327416508e-02 6.989851756647057213e-02 9.087049247162504173e-02 1.023836044415143282e-02 5.664755477988066279e-03 6.534341577135253584e-03 1.155511678102941371e-02 1.970177891007019247e-02 2.237914586909464307e-02 1.243949019347655172e-01 7.615849946481479619e-04 3.994221638601110416e-03 7.882959516375279488e-03 1.851934166155448647e-02 2.374276358708254583e-02 2.065586245981368418e-02 1.067212994200321743e-02 6.331174748118909663e-04 1.671677334770666490e-01 1.011026409778589038e-03 5.928756213825632851e-03 3.616959627762923561e-03 3.321578579753346836e-03 1.803736685284083041e-01 2.788497213604594974e-02 2.155970874205655197e-02
2.024562821280455685e-03 6.112975789716256457e-04 2.283926534678851141e-04 2.029606102930373197e-04 4.270424606621308185e-04 2.830447807852992442e-04 9.592468309386975589e-02 3.978606842498565166e-02 6.011060301981942938e-02 7.815558622688811852e-02 7.268696026494327403e-03 8.185669522018353475e-03 1.280518789118916846e-02 2.911512257330800893e-02 2.765438370234637490e-04 1.229818251675413726e-03 1.271182458397333154e-03 5.560883558424579987e-03 7.275853804765749361e-03 6.480026685102736536e-03 5.750182874703739511e-03 7.789252737403873188e-04 4.465629420153330309e-02 8.472954952562877784e-02 1.092701650515201343e-03 2.741832418772976836e-03 7.434288013694775182e-03 4.256544809957480552e-03 3.361382147530781600e-02 2.558951462357577505e-02
7.231730402777531612e-04 2.797034807321554877e-04 2.869923600728533893e-04 4.615127988261971616e-04 2.385959222468216642e-04 8.394741699937002810e-02 3.919390112756680755e-02 2.793563031755958576e-02 8.933458197243118737e-02 3.926582275935413375e-04 2.344853977778590948e-02 8.078607472738610212e-03 1.371321800797089749e-02 3.019711957807329900e-02 2.249691476279656183e-04 4.396433737961565492e-04 3.129635546961854467e-04 8.421490683143210976e-02 1.305069829223785005e-01 4.905515116784511147e-04 9.248736461081889706e-04 8.945540313568284274e-02 4.508637407653716400e-02 6.277294897752103446e-04 1.544742104834235467e-03 1.841393786424546375e-01 1.929158321475182673e-03 2.203448258582921780e-03 7.953338036789936449e-04 3.957128949082897029e-02
7.331150868204968675e-04 5.736067935763582148e-04 2.684596511185257132e-04 1.326020463800955396e-01 1.274641250469525644e-01 4.881458770854907314e-02 3.273849319128267071e-02 3.402583467630919400e-02 3.794672178038883958e-02 1.719635339028115217e-04 4.254876889553527858e-02 4.034002643525122500e-02 3.822555631013764554e-02 4.783417562769047560e-02 1.391244692902245950e-01 9.786444129057084163e-02 6.737800353896762628e-02 4.105186960769023619e-02 3.673806167276746221e-02 2.845315368348010424e-02 2.266903166218022653e-02 3.315021797276687665e-02 5.279663099565147510e-02 1.322793770600821650e-01 6.287826224284855277e-04 1.118964419723389447e-01 1.796208327692316864e-01 1.160987952798568923e-01 1.175332113362436703e-01 7.642646697156005309e-02
9.931060825325447108e-04 5.048383060239042090e-04 2.758210259387168734e-04 3.601090719135935196e-04 2.994229012662395707e-04 1.278188424850558724e-01 5.269946279078227720e-04 3.879274705888203405e-04 5.107417581444130550e-02 3.696590477958910936e-02 1.314088612902881807e-02 3.008617340197271631e-02 8.970240333457216164e-02 1.002200075212841129e-01 4.922784794745458607e-04 4.081016417775977685e-04 7.693131174784949289e-02 9.323190220889129853e-02 4.391636039816605025e-02 1.929627280249994123e-02 1.753987754587857731e-02 2.679324456240293750e-02 4.169513338337602765e-02 1.331791353104926079e-01 1.401823590272108788e-01 3.428850700727033990e-02 3.879747759161659981e-02 4.952770496777295084e-02 1.589058276329013975e-01 3.337290505265567281e-02
1.333457992320441661e-03 1.125363157212875848e-03 3.280937498436827015e-04 1.073731466328836084e-03 1.179671057726732874e-03 2.163205780200322392e-03 1.423523398305075009e-03 1.575066470849541072e-04 5.049022356513988702e-02 2.909732081872969806e-02 8.564713297981207257e-03 1.066906075832698558e-02 1.344318743384211728e-02 5.486918824258500693e-02 7.024553708524031159e-02 3.233622741609394613e-02 3.236158268556905970e-02 3.959305257694472474e-02 5.480210553126003969e-02 3.018454197356387064e-02 1.638202583667590015e-02 2.218841881235272470e-02 2.486628410758780217e-02 4.392469677522072014e-02 1.448690361575767360e-01 2.371543032248860094e-02 3.524890776420151750e-02 5.785315655153300263e-02 6.821771911973995017e-02 1.400931361755105020e-01
7.320577598687182282e-04 1.783236693355958261e-03 5.151088185888457035e-04 5.316887275406080495e-04 2.460123902849997712e-03 2.551591638453890205e-03 1.683622558708687458e-03 9.704355750416887583e-02 6.951172636712052433e-02 6.528563416247727680e-02 2.666719549977929898e-02 1.314453988192004069e-02 8.534173901462646650e-03 1.534626112006463178e-02 7.563562227985795583e-02 2.267648579809613055e-02 8.271025364995103490e-02 1.039758787546566157e-03 1.981241144554066105e-03 1.246224831818288081e-01 2.437123271540435690e-02 3.075627521655349000e-02 2.609081720882814800e-02 3.004402114170292085e-02 4.185523417779767053e-02 3.335533527340178023e-02 4.032960567308116473e-02 5.016231732741441296e-02 6.578790702021850012e-02 1.667409536606955511e-01
