7.643884767600700111e-03 1.129340511016041319e-02 9.884454768193308427e-03 1.253448385335910985e-02 9.557006567617248177e-03 2.100028598912780098e-02 2.085376437708554714e-02 5.650274090939089167e-02 1.026062244014430275e-01 4.607678006716918462e-02 2.128324438353790260e-02 4.839471027945842392e-03 2.826740910256384486e-03 1.047164600082601746e-02 1.208225932970688130e-02 2.626478117262943078e-03 9.125271854562116286e-03 1.575835796427604851e-02 1.405635112312871027e-02 4.878746092901367799e-03 4.409889222577458370e-03 6.112059041887668576e-02 4.825585789907783224e-02 2.456679329672661373e-03 4.086071593183119091e-03 3.418259362971892874e-03 1.381234136993368389e-01 1.256339730038524317e-02 1.205267790273610931e-02 1.520697771503065274e-02
6.107108232746183418e-03 1.361151499477456124e-02 2.449049545746202761e-02 2.005855741031917910e-02 1.399395151098700545e-02 6.265822687890729159e-02 2.975061435866325696e-02 3.757310956445572558e-02 2.451330708555785054e-02 2.076215824025125917e-02 1.452639235976584293e-02 2.815298500721291185e-03 3.716640541282909341e-03 8.443996150992835042e-03 1.172515584004170906e-02 7.461189952532920611e-03 9.105698906461812472e-03 2.938843025203256507e-02 2.184712681697695627e-02 6.474865685324921599e-03 2.630510042416558947e-03 5.821456580133595182e-02 1.257296321742350786e-01 1.095274482798039017e-01 9.557988351189503073e-02 1.317320064582254979e-01 4.832634095506201100e-02 1.275525838516691941e-02 1.822430123416839826e-02 1.826180084035398249e-02
7.501312749809702085e-02 7.703743359191179974e-02 1.628588893672693327e-01 1.325119670046925047e-01 2.810572652649500625e-01 2.860767254305680157e-02 5.310569145485156267e-03 5.698881499819627786e-03 9.160405046707882637e-02 2.746028537895062530e-02 7.254592163960732476e-02 4.764511127977730243e-02 1.737706434095393285e-02 2.530409541925121228e-02 4.826233492045773135e-03 2.016936833035553461e-02 1.337174271948548925e-02 2.698738233089841010e-02 8.847537153297270474e-02 1.449124535096708855e-02 1.661064247929113294e-03 4.835732072931179376e-02 7.777020366714082478e-02 2.728736128027065347e-02 1.639968592518789570e-02 1.100746318172830980e-02 1.000043162798871198e-02 7.888227531120962574e-03 1.348175577703065661e-02 1.513671424381784342e-02
3.491729025736963615e-02 1.006515139867725089e-01 2.209518523540422996e-01 1.785198902063807602e-01 7.278603828367156969e-02 1.124650979767092239e-02 8.898173616476101611e-03 6.198437714157493776e-03 3.804051787840712073e-03 3.512267876767804359e-02 2.167174845893206359e-02 4.248695011405621141e-02 1.909065799951401715e-02 1.263571345640908221e-02 4.068911799757496048e-03 3.124419470841039142e-03 6.496267930961668879e-03 1.061221456172614652e-02 7.393329493254920115e-03 6.209171890598612527e-03 3.136985216478729160e-03 9.949209375761045027e-02 3.435272917466610648e-02 6.837340198479129050e-02 1.339328891888256351e-02 9.771295260977188799e-03 8.487231197135101241e-03 8.065682648071642591e-03 1.640020441285872446e-02 1.784136152882207990e-02
2.011813778935414576e-02 6.255701298546621769e-02 1.746268830035664632e-01 6.767607107120485188e-02 3.838655080021057681e-02 5.602411776121539282e-03 8.617086971828682995e-03 4.998645300020825369e-03 7.296221140951730799e-02 8.033602053486699202e-02 9.733899334073782550e-02 8.143674604552397778e-02 1.384445970254135835e-02 1.383937816237744076e-02 7.781483684172404991e-03 8.821858260785156447e-02 2.308503705986829357e-02 9.951455499010339670e-03 1.576723259308910816e-02 8.939887598748929437e-03 6.529454183244179886e-03 1.840122618086778832e-03 5.017009118182686953e-03 1.088103402866156394e-01 2.416468322376285130e-02 1.302711852697990488e-02 9.100200058181781571e-03 1.054232228692501654e-02 1.651654184441218864e-02 6.082531112554725311e-02
2.322361582115730835e-02 2.381196290538905788e-02 9.365584939125334851e-02 7.502373858594063583e-02 2.958195607275363945e-02 3.188958695927674412e-03 3.922422432975341405e-03 4.381563486075733260e-03 4.151778805630709779e-03 1.245050315581548578e-01 9.438857482944366939e-02 5.554032139206260821e-02 8.904704854357462646e-03 7.029890533316687784e-02 5.952022303624988908e-02 1.017083697102449391e-01 1.429657413874263136e-02 2.587326367173954037e-03 8.306249265600171988e-03 2.845654524768560442e-02 3.406766403031408208e-02 2.123022670022968808e-02 6.816990075988732870e-03 6.483060099741161375e-02 3.609527177277292720e-02 3.397493184024821117e-02 2.118641320898908068e-02 1.463663638211905663e-02 1.934832718287158096e-02 3.484350920901164994e-02
1.053937258901090357e-01 5.030996745766760231e-03 4.610034356278098870e-03 2.336592245138020135e-02 1.119265494218067529e-02 1.872469614334271171e-02 2.875500069184228069e-02 1.658936131298292121e-02 2.000681137516141517e-02 2.311564753590629115e-02 1.768913380637809896e-02 8.919011685310297352e-03 1.076048577688896030e-01 5.144413847603883372e-02 3.033267311812462563e-02 5.205783311011801667e-02 8.379803874321089391e-03 2.720916671331218353e-03 1.388517648449612632e-02 1.896941303169590032e-02 1.094596236973123873e-02 3.183481480959250449e-03 6.476599355954970605e-02 6.109365137364110299e-02 2.460655563051063546e-02 2.515957208505074580e-02 2.198185911487527192e-02 1.899306357703864009e-02 2.176356197916034033e-02 5.182718037678853140e-02
6.885753544354718952e-03 1.251705974068305881e-02 6.330167472999299709e-03 1.363372915290158097e-02 2.096043511234711720e-02 2.379711804528394578e-02 2.136621833635958881e-02 2.041094551364823831e-02 1.648112949189956683e-02 9.161871178602100374e-03 3.662912453831370426e-03 1.432856863932402587e-02 9.144029208768353345e-02 3.380370341361913639e-02 3.851542538356120954e-02 7.048643151755593084e-02 1.547417068724300619e-02 1.860390473715195503e-02 1.632146229987776684e-02 1.241800281796678548e-02 5.243128856714751769e-03 1.134828037686604341e-01 4.647942185790467085e-02 3.929403287245505222e-02 1.863151560307929958e-02 1.909881933833947748e-02 2.825835435996028322e-02 3.257142863518522335e-02 3.165319893663758044e-02 9.420492877708343260e-02
1.576403376325298533e-02 1.036279763352026921e-02 6.045026476536661045e-03 3.500423495272738522e-02 2.263084579411308792e-02 9.661310478270493732e-03 3.140454992160392894e-02 1.426239864087022920e-02 1.218205757312536969e-02 1.193960028049098274e-02 1.059293459491957544e-02 1.514339525219409247e-02 3.459791464793066790e-02 2.680693821291792525e-02 1.233418236860915895e-01 1.041338772675940161e-01 1.325753724006502321e-02 3.422003913700029376e-02 3.364520005746369363e-02 6.703507051265654090e-03 5.069538513389205969e-02 5.320384564846167286e-02 5.868873393822119505e-02 3.845477912392650938e-02 2.239445626147109139e-02 3.098862459876531791e-02 1.068697976902157898e-01 2.854276081727899830e-03 8.577491436500111685e-03 4.338155533813255540e-03
2.646352610789421550e-02 1.735059988551935009e-02 2.735143553542267181e-02 2.554508179020184566e-02 2.424977385190883045e-02 5.644093339363204405e-03 3.061574515458314466e-02 1.301332900654728411e-02 4.894333901759970358e-03 5.400400352019070482e-02 2.037537490461316381e-02 1.951559123403833959e-02 4.112967637135316046e-02 4.817213547732952794e-02 2.393150580811917796e-02 2.594890649570683050e-02 1.281195950066966738e-01 1.269416445915227953e-01 5.424704618711011228e-02 3.122548187064424358e-02 6.508231042987727699e-02 4.147771007957776201e-02 4.770471442961980030e-02 5.242857683672481894e-02 2.910456125705643618e-02 3.464361773858016386e-02 6.089744555410399329e-03 8.289668785648770036e-03 9.294131463223206935e-03 2.401051931014771754e-03
2.435946114084294387e-02 1.277474487502161700e-02 2.819180062142078239e-02 2.195801467541533269e-02 3.010041266604619736e-02 8.867095085389399556e-02 8.629516072821254158e-02 7.961380786932716058e-02 5.467499179701146295e-02 1.217490974834817101e-02 1.618629891500651674e-01 2.660115365156009437e-01 5.479193153120929249e-01 2.684821969083460158e-01 4.915073816407552337e-02 9.616749627231648001e-02 1.790182600499088394e-01 4.934656695336502030e-02 1.248730670347936514e-02 1.046080447421384590e-01 4.422393248053621551e-02 4.000400679120512393e-02 5.177514592243313840e-02 7.245694171222821778e-02 7.723201068897772581e-02 4.038907001707224553e-02 5.989801451680175359e-02 4.505253583281346869e-02 4.128563484506857922e-02 3.048008360238754072e-02
7.200486836155999340e-03 8.077712756525037840e-02 2.836718588155855841e-02 2.086166681704532469e-02 2.023801286851872189e-02 7.253472178198085152e-03 6.733098988208882640e-02 4.748225968011508813e-02 5.693378260978010363e-02 2.547941164825719487e-02 4.812119023143549001e-02 3.164132076870829757e-01 5.658704941831471658e-01 2.905348958898920642e-01 1.036477427568674170e-01 1.159772512854238546e-01 1.278789564888216934e-01 7.518126329085950132e-02 1.976725161901049521e-02 7.046385932049089446e-03 4.196579058229915615e-02 4.322788097002224633e-02 5.119864068572343996e-02 9.168475725345209826e-02 8.718504274036532886e-02 6.199621425746232317e-02 4.749830280470426075e-02 4.318514779508732943e-02 4.739768149107818213e-02 5.162658340869138995e-02
3.561408373950541301e-02 8.177667075842243172e-02 1.113349545794792630e-02 1.770663297573866340e-02 1.313598461403352180e-02 1.129397679510346503e-01 6.533114821819996365e-02 5.986631028926549247e-02 7.724873324985306877e-02 1.319814656059921723e-02 3.388764114489930829e-03 9.994952277392171736e-02 4.193858224985075323e-01 1.777098902784094159e-01 5.520212621869727276e-02 6.316925542388376891e-02 2.328837884238458070e-02 3.413385597291339335e-02 3.879560029705483859e-02 1.636233784901350297e-02 3.946141581102739077e-02 4.340839021558795530e-02 5.471881626234224860e-02 9.213795344770758788e-02 1.178706580791548525e-01 1.044497255145642178e-01 7.722135710192468139e-02 7.273826580580405876e-02 6.412886435543391217e-02 5.353470164985558999e-02
3.115031901998235181e-02 8.375126357782333719e-02 9.753061444488323253e-03 8.554087322516018554e-02 5.091434985967444732e-02 8.085110419139816124e-03 2.760955639509213994e-02 2.170521696379374907e-02 1.060787875327069835e-01 3.423895326702425940e-02 2.482511646361027381e-03 1.618426772000856190e-02 1.905637458853491895e-01 2.540185446048752738e-01 2.670058055005799513e-01 3.555716965627098713e-01 3.199120987747093858e-01 2.080530962683346530e-01 5.694225364067885264e-01 2.677000383546098705e-01 2.414775477638043608e-02 8.334403550326056204e-03 7.093790812663361076e-03 1.847624786657514617e-02 3.918110142738995966e-02 3.334295319864623991e-02 8.525629975171664099e-02 3.391347829554432203e-02 8.675116865275597777e-02 1.008139444249351174e-01
2.931159619168151320e-02 2.800860912496926786e-02 6.656567284406769702e-02 2.869156873117171061e-02 7.517235082046886362e-03 4.180755537560935930e-02 1.318038798948175522e-02 3.700575495261386461e-02 2.571596193270540148e-02 2.650383558233077030e-03 5.208523137513413476e-03 7.990813598527332640e-02 1.695471810055074746e-01 2.128349973354043412e-01 1.900862117468178625e-01 2.271048823983858322e-01 3.878537423520058702e-01 6.722098910069995714e-01 6.862764693060317001e-01 5.404596033397592869e-01 2.311917230453557764e-02 2.417484980513086301e-02 2.161793754913534163e-02 6.819813433715173068e-02 9.876842257609839970e-02 5.082002058404263556e-01 5.089068886546982418e-01 1.160232515090669492e-01 8.903156717795313035e-02 6.839077810760102460e-02
2.719736489042866995e-02 2.863865554144164050e-02 5.599017928885428874e-02 5.773101829319243761e-02 3.724353886396705726e-02 4.486996733759875816e-02 7.241250257349649694e-03 1.849179277375298525e-02 3.817834748239218312e-02 1.357393924223839268e-02 1.397994593132091332e-02 1.226358027429946124e-02 9.543345140499522039e-02 1.919070220083925193e-01 1.776289606738825633e-01 2.700664741835573923e-01 4.683230376353457181e-01 5.708133544983647889e-01 3.308577175891286304e-01 7.237749988957034586e-02 4.375456244821545465e-02 3.026191297203847386e-01 4.444757035517130084e-01 7.492998699511086436e-01 7.084413949363631557e-01 9.296030691274501656e-01 7.465401185703804954e-01 2.246053649567437971e-01 1.292878213453199920e-01 7.592570480397971278e-02
3.506920853053797221e-02 3.953707168351697221e-02 3.713041260374651958e-02 3.365052533015734648e-02 4.918934106316710103e-02 8.718270082313103742e-02 1.104941971222690722e-01 3.581548505593790122e-01 1.744404733500150018e-01 2.970927060947667689e-02 2.194154986945063765e-02 3.421121700923512171e-02 6.763294328874452921e-02 9.946154967963624638e-02 1.310364329827639618e-01 2.344049765755085168e-01 5.060919818095860334e-01 5.106363709673327200e-01 2.423681431482286319e-01 8.359050829249921322e-02 3.640297726904925812e-01 6.667906183330760683e-01 8.634894284202310200e-01 8.906849049367191462e-01 7.879550305902554008e-01 6.848163076134892169e-01 1.017731369820174869e+00 1.811559420137197340e-01 9.126757295630918282e-03 9.140068396709602472e-02
8.798512256483136118e-02 6.811095077405480980e-02 3.285405651142889183e-02 4.602440453047224045e-02 1.317850503556833655e-02 5.508129725433510981e-02 2.948455592413211090e-01 2.382239826944916317e-01 2.337466121228824467e-01 1.162465799010345829e-01 4.228310647940430878e-02 1.135771029008988443e-02 1.110264542488521855e-02 2.854326266067560430e-02 6.450906803456100957e-02 2.973055417313957838e-01 3.124272917226990076e-01 3.641378661841184750e-01 6.352451961610722231e-02 1.127214396602003732e-01 4.043085615562100887e-01 8.839052694872944205e-01 1.100778878407169259e+00 1.145349975843892976e+00 9.481130784297131520e-01 9.212686067763862230e-01 8.629945417018212162e-01 6.776513130024279796e-01 3.445113949227506661e-02 2.329198702129430323e-02
3.535965503015921219e-02 9.626321498851125869e-02 5.950925093891387858e-03 2.133194714856561508e-02 4.310151236045269008e-02 5.883901113562597929e-02 1.854854915812417793e-01 2.315547274847770398e-01 1.582737863870020412e-01 1.225040555724783431e-01 2.557384770584018863e-02 2.502013906782818951e-03 3.814250487524435684e-03 1.083461841311324399e-02 2.375739135559041745e-02 1.411420541635635406e-01 5.363845388162379046e-02 1.705665912819166741e-02 5.707709723988973853e-03 4.152510419938887365e-02 1.593763704447317964e-01 8.553179480983059690e-01 1.090001791062221059e+00 1.146455230296594685e+00 8.416433711893862579e-01 3.937468480220641109e-01 6.437397809329034049e-01 4.374706519983507791e-01 3.926049886991160587e-02 1.528480169322549848e-02
1.686411628993318701e-02 2.143385437103583618e-02 1.336666441533646867e-02 1.416965979794884700e-02 3.297315808085698324e-02 1.885014146355416115e-02 9.662225064095769644e-02 1.243154870488656361e-01 1.139019631825228529e-01 2.678404051701550187e-02 6.719151276030442890e-03 1.685650121138219590e-03 3.097288242573078068e-03 9.004562439613976108e-03 3.133659634872647953e-02 2.063108129235830326e-02 3.738968963333436785e-02 1.096215938179022006e-02 2.047045057793374367e-02 9.708357532107585175e-02 5.259941451132382761e-01 9.993348580155680949e-01 1.076260786202445807e+00 1.029189756690274349e+00 7.977846538707142887e-01 5.903758350243079045e-01 5.768233018858982541e-01 3.853061110194400118e-01 3.452725799129346268e-02 1.214919609199042322e-02
3.905694612817260658e-02 3.537505401832801571e-02 1.791855312677860523e-02 1.270726341297245647e-02 1.623871912896831735e-02 8.629292654192821654e-03 4.872607386580388167e-02 4.321502146275880973e-02 1.205210706368920262e-02 6.940097483010663690e-03 2.801407629900292198e-03 2.950125304885789414e-03 9.667184165768616388e-02 4.660974639207896703e-02 1.773015349473798172e-03 6.000287042344724063e-03 2.128300861141501146e-02 4.802187041243967391e-02 4.578070836174997355e-02 2.034970138477170121e-01 5.560735224982751301e-01 8.041222861163030977e-01 3.265044473916295376e-01 4.941929757470445161e-01 6.461644107128873271e-01 3.705123134192489509e-01 2.790316304569143147e-01 2.337929224871378719e-01 1.100877127194644853e-02 1.041895667515678123e-02
3.170547318272817078e-02 3.605809926710340507e-02 5.231025711107272283e-03 3.564571575516599540e-03 2.879624605449099609e-03 4.247602302511826848e-03 6.177248706204464465e-03 1.596963479008398773e-03 2.183066592424732100e-03 3.301428820015865628e-02 4.697738915104971574e-02 7.432432507185977866e-02 6.967553373281765161e-02 4.346437546980483346e-03 8.499361409868944756e-03 1.114980320423449439e-01 2.120017139893806690e-01 3.032711939715325711e-01 2.049269799798815461e-01 1.529650502987285332e-01 1.079650808873584555e-01 3.841393533133391491e-02 1.484059548427143875e-02 3.249378431509742510e-02 1.192250843271824567e-01 4.079613379122833811e-02 3.777755615920089238e-02 1.724884981887557511e-02 4.399597265472688506e-02 4.139907843742045984e-02
6.619319446874298574e-02 5.042823366952838005e-02 5.545504140574390381e-03 2.493364640279421146e-03 3.674834328229931602e-03 2.680219563170094070e-03 4.145759553409900967e-03 4.832859560799653009e-02 4.540145503734600851e-02 1.985567030565671062e-02 4.979118560766365026e-02 9.018904267604570257e-02 9.201496452433979845e-02 8.308800976156415982e-03 9.778950143513688575e-03 6.466310158561640320e-02 2.345383130055336551e-01 4.326160166348426150e-01 4.849591536518976786e-01 4.174518936053012164e-01 8.858028584185247134e-02 1.972410379624656152e-02 2.452118241752342109e-02 6.116547126797620276e-02 1.375300477917497100e-01 4.097585581374180858e-02 1.565113844522508096e-02 8.590201784952391714e-03 6.074093075480493931e-02 5.898598667244916299e-02
8.233837675413904766e-02 1.041199970220361114e-02 2.924087584915170245e-03 8.542935824630397412e-02 1.088764514535757455e-01 2.365165594457458755e-03 3.290640112103890898e-03 3.943092923724145216e-02 2.263136143309438242e-02 2.588443930183777913e-02 4.736894190070693039e-02 8.002738394880642980e-02 7.055146284048571803e-02 6.859972820740362597e-03 1.948204224486655214e-02 9.093190053308250476e-02 1.747421494970726463e-01 3.986061992660114295e-01 4.981843119149841348e-01 4.211265985103637699e-01 2.112888900108501333e-01 1.364937601624450353e-02 9.739138670203041984e-03 2.102492608915990796e-02 1.117626322319743015e-01 6.799729500912725377e-02 6.125202485328658242e-02 1.634408285022392188e-02 4.840552028706338050e-02 4.417273782123672110e-02
4.548251598267805118e-02 1.398992572361184433e-02 5.574178055207833909e-03 5.439266199532060038e-03 1.225931043736176035e-02 8.318903529850233888e-03 3.746301512176139232e-03 1.539095851159204553e-01 2.230574916967380857e-03 2.858206680632176776e-03 2.790175435380369551e-02 3.321721325965336369e-02 4.229295849661030698e-02 8.040836728004178979e-02 8.053488274828216748e-03 2.755885781995725398e-02 2.761399201777562859e-02 1.172371628006691896e-01 1.498229222995833276e-01 1.298323311351744780e-01 1.108589534264323440e-01 1.935565822350351212e-02 7.947033998008570799e-02 5.712707447170048414e-03 2.002839039015759381e-02 5.062837132447427918e-02 1.361433138558734990e-01 8.801451979500105050e-02 5.382627004734302778e-02 4.732290610049073865e-02
1.626592116465459467e-02 6.414784630456486260e-03 6.721031217397173754e-03 1.124571635508808676e-02 6.138802612082732216e-03 2.974966170681393393e-03 1.500432151403444936e-01 1.089491350858977914e-01 3.281172483997440818e-03 1.151652252589563039e-02 8.600022499195338066e-02 3.159401551713424128e-02 4.675179237063355892e-02 8.445633549499317883e-02 6.603902188775768491e-03 9.787741904065321713e-03 8.532783534433666106e-03 5.166505597310812846e-03 9.008685141156245330e-03 1.571920021516775776e-02 2.976608102234425124e-02 9.586726086401133051e-03 8.292869215953371786e-02 1.902718221627909545e-02 2.825636111387699184e-02 1.014119899577347293e-02 3.519887857143194632e-02 4.215571923945939103e-02 3.136554041298252049e-02 6.872409134410557840e-02
1.648696466326372498e-02 1.314589463594108276e-02 6.289030210659424941e-03 4.564426996092793218e-03 4.238655923883982365e-03 1.733094261322169326e-03 1.246752874300515734e-01 1.307100464882434143e-01 1.434619506847882031e-01 5.601076129795124273e-03 2.091352262015649510e-03 2.653660242021314841e-03 1.170576797467589025e-01 2.600379805467275662e-03 5.891873186259367901e-03 3.785771939444926640e-03 3.356806571969205878e-03 9.271420593405818589e-02 8.391684548221003959e-02 6.624366699882126841e-02 5.272115853776394856e-02 7.419343444597670256e-02 1.012308303427263551e-01 1.413676537425479288e-02 1.417136357682531080e-02 9.471756245028693094e-03 1.959445504453733583e-02 1.187702755122497372e-02 1.655391840107437243e-02 1.236299097865801166e-01
2.239608534704458365e-02 1.159551856902666343e-02 6.465848110593093445e-03 8.737061001884987785e-03 7.671785212897815238e-03 4.234219655941981290e-03 1.469434726843463906e-02 1.148832027360256573e-02 1.942030028876332286e-03 1.420977991824879383e-01 5.058732967694410526e-02 1.079477569622415145e-01 5.089238508566647397e-03 4.707200185110762582e-03 1.304698128654281641e-02 1.167167490874379543e-02 4.966213902987436264e-03 1.002162339323501086e-02 9.548791208204809866e-02 4.425773996103671282e-02 4.261875403877659479e-02 6.425043904768168446e-02 8.920170744143765540e-02 2.129133089768226947e-02 1.512611587577041353e-02 5.940412147505938489e-02 7.203152407447974137e-02 8.593204268780728350e-02 3.592505873792125465e-02 5.274870577677001626e-02
3.009804205891508655e-02 2.587503643456271624e-02 7.707216640520342735e-03 2.606800298497406396e-02 3.030264512942772853e-02 5.671548247839200418e-02 3.757058482167267843e-02 4.203241672678268044e-03 1.792146153826407878e-03 1.132829812125564356e-01 3.433810383561271967e-02 3.945530592966331462e-02 4.137294721318097307e-02 2.820734051013099215e-03 4.243742428379265220e-03 6.921348712158602312e-02 5.867114878434950831e-02 6.446281015722712948e-02 8.958627220956226489e-02 5.418968909251154625e-02 3.818852669870084066e-02 5.598678419573479420e-02 5.951831395333512242e-02 8.913549803370446334e-02 3.367571724083377044e-02 4.605174603084207646e-02 7.050889457818182438e-02 1.083460315330669332e-01 1.165400904003202343e-01 2.363420358703624893e-02
1.630805378299339872e-02 4.034569145336498741e-02 1.190273252445584080e-02 1.267203579865541947e-02 6.147055905470433235e-02 6.490823761784510204e-02 4.304764798093440453e-02 2.944392472766330093e-03 2.274944434542615097e-03 2.744784745657404858e-03 1.038368400866327146e-01 5.192124171600155658e-02 2.930718182490186716e-02 4.241620844658114398e-02 4.871487606202845599e-03 5.220231797221180914e-02 5.240009724437643020e-03 2.869614182802068120e-02 5.498278310879867875e-02 1.438296059363006890e-02 5.361064342799378574e-02 7.452996858561537763e-02 6.282646040868491988e-02 6.294258881113500015e-02 8.242721972758651483e-02 6.519550405510003699e-02 7.960742229256634328e-02 9.440908361914983338e-02 1.114712486039850237e-01 2.654684099331627856e-02
