1.488108104848173130e-01 4.619960908082101805e-04 4.119383372789031422e-04 5.327472865309677624e-04 4.111668912641616757e-04 9.110019649847777819e-04 9.030263994379428153e-04 2.443929048665820572e-03 4.455855718454532731e-03 2.025094850713508605e-03 9.540085509749601051e-04 1.024997294619793137e-01 6.102645637914641541e-02 4.689153791206370978e-04 5.361704887771385391e-04 6.348343841247203190e-02 4.063904298535828130e-04 7.096681643237818995e-04 6.428338516039539029e-04 2.251946829494603976e-04 1.240291763408863934e-01 1.777681364460846278e-02 1.363053692285990520e-02 5.356124952974782027e-02 1.023882198956585499e-01 7.934883413802534813e-02 3.632161372380075109e-02 3.259568300848763450e-03 3.142543822048231815e-03 3.989525317661582644e-03
1.142931015474845935e-01 5.442535749856438091e-04 9.929606603752349440e-04 8.154397533801458625e-04 5.735135734964518211e-04 2.595665841988204024e-03 1.247487458961252281e-03 1.563460476734802266e-03 1.025827937816724007e-03 8.734433394708252625e-04 6.244856312485512961e-04 6.011241327413554408e-02 8.150345741554512746e-02 3.646887165071361226e-04 5.023671825671587477e-04 3.199859510399956776e-04 3.965987893812402375e-04 1.304073466665227939e-03 9.946032241174370021e-04 3.011009501861240103e-04 7.644355237408312354e-02 1.700316568049661803e-02 3.536963055800453060e-02 3.088946126329935801e-02 2.674265505095549389e-02 3.525952406746550583e-02 1.235625465033734008e-02 3.245738380384660150e-03 4.688873693320726871e-03 4.764648980925682495e-03
3.116406681180220253e-03 3.018184509025825107e-03 6.393334238108093655e-03 5.160694429042152892e-03 1.104634536033846821e-02 1.137665828468890656e-03 9.999329321952615812e-02 1.080277957724433552e-01 3.804061703627500089e-03 1.149694788668444070e-03 3.068278024566584682e-03 2.010172429150945857e-03 7.300320983062510852e-04 1.071002228249652837e-03 1.158040521605715328e-01 8.536365488605237185e-04 5.769346618371310820e-04 1.199790273656734050e-03 4.078006500994763375e-03 6.888995593511404707e-04 4.894751318246071820e-02 1.412273767504003061e-02 2.143167027245544351e-02 7.406676620249803833e-03 4.347928173392620610e-03 2.843676758254838101e-03 2.500821528923012887e-03 2.005213741405986131e-03 3.447996643776660500e-03 3.950249935571143421e-03
1.449111183736725159e-03 3.940004016978059138e-03 8.659109440926229459e-03 6.938895898755549629e-03 2.877233348430157864e-03 4.507346777520559187e-04 1.709661313504658997e-01 1.159106305823962846e-01 7.117987057029916131e-02 1.434281635353708371e-03 9.163058308462379087e-04 1.812561128917993761e-03 8.126840462831011989e-04 5.399768221929270853e-04 8.582088981165082731e-02 6.707232562642674589e-02 1.474137621974452583e-01 4.632662122074954919e-04 3.343147555770171293e-04 2.880980850836375963e-04 9.329392482921114449e-02 3.209648136254703715e-02 1.005516235300466660e-02 1.925790486927236866e-02 3.543856087672296682e-03 2.577784048473794488e-03 2.179352888061709091e-03 2.085704160167895296e-03 4.206955010257537944e-03 4.685612342508364142e-03
8.413419200110619153e-04 2.481076947262487661e-03 6.907873107479077859e-03 2.675221772630438991e-03 1.545563972067242253e-03 1.087112499172538660e-01 1.681414109975392923e-01 9.444538421416398544e-02 4.368328101049272216e-02 3.340423144230872388e-03 4.178889393823696612e-03 3.586578956162577055e-03 5.257271011075665768e-04 4.274217217619208321e-04 1.016622123448506221e-01 3.842967378400918149e-02 7.460940781985542832e-04 4.305328253357947879e-04 7.004411775811949722e-04 4.014698900890493419e-04 2.709845067520291664e-04 5.268923068354724321e-02 1.180306859701060473e-01 3.221549775881725475e-02 6.381512112994912680e-03 3.444370282020387929e-03 2.365148539753048756e-03 2.772797605706636345e-03 4.316492419197671265e-03 1.631795301065465387e-02
8.426158960884649407e-04 8.439347803867801139e-04 3.776109340967980128e-03 3.017914228042289926e-03 1.199578485947846605e-03 6.346810351646428594e-02 7.723995591881988032e-02 8.277942887781622461e-02 7.655837828278828916e-02 5.210498026152349423e-03 4.119896313669265536e-03 2.200931222021065749e-03 1.100401118929845989e-01 3.393992833862825853e-02 2.615407041333057611e-02 4.321307968245394204e-02 4.190282638449546195e-04 6.230905518584116398e-02 3.575866111854811465e-04 1.228922882793491650e-03 1.473847196873760267e-03 8.583347889987511924e-04 2.083136671931041595e-04 1.936594848382713549e-02 9.560030446589224545e-03 9.044414102332622163e-03 5.578535272389151083e-03 3.905500376806448574e-03 5.123763375766310357e-03 9.518934199702689877e-03
5.532937880778356077e-02 8.936938930240301282e-02 9.443919074330670016e-02 9.599213816317135085e-04 4.594551171447297869e-04 7.734750097193764844e-04 1.201143474501041543e-03 7.001704904771139607e-04 8.472359932549340319e-04 1.008847763952239358e-03 7.907437740761324042e-04 1.379330522580527463e-01 5.701696973873568441e-02 2.248783314222087618e-02 1.194263925950689656e-02 2.142328295298735752e-02 1.284621539457438399e-01 6.195459661512953825e-02 5.847417066315095495e-04 7.961502852282544528e-04 3.617988207769013949e-04 5.464853311859346752e-02 2.227764368625940669e-02 1.755774749853438593e-02 6.533737825856568426e-03 6.745239749463555548e-03 5.857748137922866999e-03 5.179637151246516136e-03 6.003062515887161096e-03 1.475110721609586110e-02
1.164480419649368270e-01 4.676384596110926039e-04 1.274541366731605785e-01 5.862985247394106314e-04 8.945130280037431967e-04 1.011825760136239594e-03 9.095758270113786818e-04 8.688122326218140120e-04 7.060589829389682512e-04 1.793758356597126291e-01 7.172130106126288485e-02 5.201804537791076839e-04 4.705864603432104165e-02 1.580937149160062741e-02 1.634405284240348505e-02 3.046778383599554885e-02 5.172869245875345119e-04 8.255671523242347470e-04 7.237028351929812933e-04 5.115526054357252871e-04 7.904050020989218661e-02 3.862847944514445631e-02 1.346528063568688122e-02 1.059027236191671661e-02 4.997754353969538661e-03 5.260005074883987788e-03 8.104635811218285912e-03 1.042819087595519244e-02 1.065342241128975145e-02 3.227201344231873242e-02
7.064482398056442375e-04 4.573748659252856066e-04 1.169337994134291292e-01 1.543408761712565871e-03 9.966393392071037135e-04 4.220967345097102752e-04 1.368778162719218056e-03 6.154124953123928489e-04 5.172983976611454605e-04 5.205203656302329149e-04 4.717197433148942833e-04 6.298662734580280078e-04 1.383748574835674903e-03 9.047570431737703969e-04 5.973229682252975681e-02 5.520843547226837733e-02 5.246876234499672428e-04 1.579346318396803199e-03 1.545691179639607088e-03 1.325935440614193495e-01 2.172433340739603896e-02 1.731593013320491259e-02 1.681897989303677426e-02 1.041350943679842170e-02 6.034172478790740535e-03 9.292912143702730665e-03 3.492032214197134804e-02 7.218580377277120097e-02 3.044653038045711468e-04 1.087920521761596149e-01
1.201285544605252241e-03 7.786810155384440470e-04 1.244356018267185355e-03 1.155005947914682259e-03 1.006897134921011950e-03 8.780291596568359780e-02 9.159483540688889876e-04 1.773705712319015304e-01 7.534668702177417521e-02 2.808736884783069945e-02 9.022618208177332405e-04 8.845768637745609741e-04 1.897569355132343229e-03 2.100879659442550420e-03 1.021770816151802361e-03 1.131400162204180496e-03 5.998458319158815610e-03 6.134907367294573435e-03 2.433055771946798090e-03 1.070475708011864400e-03 2.725393979938173575e-02 1.328151008720640167e-02 1.390951787797806843e-02 1.469270592082800447e-02 8.022555942537885204e-03 1.034312576158215313e-02 9.754409932070823297e-02 2.448563076148796967e-04 3.354044105658223092e-04 5.932748143866652807e-02
1.001831283860809977e-03 5.214814238380198735e-04 1.171297476495938156e-03 9.978295108050911407e-04 1.266324844492312330e-03 5.121680202628925427e-02 4.348471682255877074e-02 3.820623844385104967e-02 2.417619078527588616e-02 4.541745917603882553e-04 7.179522318046674748e-03 1.200687260020071728e-02 2.518922584594913971e-02 1.280153376036359189e-02 2.426277336610838282e-03 4.826570261315200894e-03 8.904165476571242882e-03 2.441605465468383793e-03 5.778570260824670039e-04 5.427764573702125589e-02 1.893450739650885672e-02 1.343408173308437495e-02 1.622026314335785549e-02 2.219682732901561567e-02 2.336593846946651010e-02 1.262215660293493878e-02 1.999021706215120195e-02 1.639102681153894320e-02 1.500326822337739660e-02 1.097420254552425659e-02
7.693407855175704579e-02 4.519786295741085036e-02 9.516232895162331099e-04 9.416898632651070789e-04 7.390290629175256696e-04 7.485536363520055303e-02 2.939223420510234108e-02 1.902565716428815737e-02 2.370761986245283059e-02 8.932095625878835659e-04 2.183399004577418236e-03 1.431348515396982726e-02 2.596737306512283266e-02 1.376805047525687942e-02 5.084061871997330208e-03 5.809040803178811344e-03 6.434886499909417586e-03 3.814372599222757253e-03 9.430938822276928009e-04 1.175449648156857430e-01 1.768244175037995275e-02 1.593527352386445856e-02 1.828073575058769898e-02 3.260017353126294648e-02 3.110493264744500219e-02 2.214522953565292718e-02 1.697350685621367219e-02 1.555239610260054223e-02 1.678186348988336754e-02 1.810209864774774829e-02
1.477239777306252333e-02 3.810133990914366803e-02 9.463400040556373127e-02 6.315452988553200064e-04 1.822099674663683611e-01 5.854129376545452734e-02 3.018580013142090762e-02 2.540229621533126800e-02 3.222485760956460971e-02 4.484558564372281581e-04 7.600169940864412443e-02 4.604311414554380227e-03 1.947516701119726343e-02 8.416423963212561060e-03 2.675986140195376131e-03 3.113641840719718560e-03 1.165772691310312413e-03 1.736201298952407251e-03 2.005804293830046152e-03 7.604091598087872736e-04 2.138257959281781098e-02 1.944730995606833157e-02 2.374280771823376185e-02 4.104743587804872418e-02 5.410546545380558181e-02 5.116838804838437504e-02 3.811445916534778738e-02 3.477762180624484334e-02 2.653030667833927714e-02 2.050166747660331010e-02
1.166840110766080574e-02 3.355418948440999638e-02 6.284478098840126647e-02 4.689520011720122589e-02 2.836393042087841793e-02 1.135498791904888116e-01 8.247229204333131813e-04 6.796985948462894774e-04 4.700170733905589815e-02 1.449864700474457098e-02 5.817810846956451842e-02 7.504327025632056246e-04 8.878674023887075939e-03 1.202096384615091579e-02 1.284458447924504212e-02 1.730398235302997578e-02 1.594478011538617152e-02 1.058954057976265947e-02 2.954874311307047891e-02 1.409406296644043904e-02 1.189886427711558253e-03 1.357650797173169110e-01 1.035144694863908560e-01 6.816467626014885211e-04 1.606737849738255897e-03 1.518424601426818493e-03 4.186606180998943966e-03 1.361059811839131477e-03 4.323008160320740423e-02 4.179931801668922142e-02
1.061447106888291358e-02 1.071295811167898883e-02 3.031485071077304888e-02 5.069402767888019426e-04 8.583271025905017670e-02 2.041883973379346115e-02 5.506763842472494133e-04 1.567719104888827628e-03 1.044217169349246710e-03 5.856287192426415378e-02 1.254739056145131038e-01 3.709028012470735880e-03 7.856375076049748607e-03 9.959571122876926044e-03 8.986848588588482178e-03 1.082506908824824518e-02 1.898981984257052530e-02 3.380593223045821882e-02 3.550339144445326806e-02 2.896589489421427105e-02 1.276759331239040894e-03 1.372106150753175458e-03 1.239849548317072201e-03 3.948416287570252065e-03 5.716520491110412862e-03 2.937661277806183704e-02 2.954100783457971890e-02 5.941698496424530421e-03 4.968596935893451055e-02 2.984950358333463699e-02
9.425653637482983918e-03 1.037238890683697852e-02 2.436125770189169135e-02 2.749215810929971082e-02 1.853223379297369924e-02 2.134866771371321179e-02 1.526964149183300812e-01 8.487969940193522585e-04 1.762440812582639297e-03 6.320250423204766934e-04 6.519740914877551318e-04 5.632781199086605390e-04 4.365154841607892314e-03 8.887760173500125482e-03 8.324918099181328676e-03 1.274413816462813612e-02 2.270729194611937479e-02 2.857343984865569342e-02 1.716889480956850650e-02 3.905809307838264965e-03 2.428173475844762515e-03 1.720243284083220608e-02 2.567623830315181321e-02 4.344643156457991817e-02 4.066309599463599489e-02 5.264062526784671348e-02 4.213535931661565453e-02 1.206341161811591046e-02 7.620662713643913677e-02 3.450419903429208235e-02
1.161347971304749205e-02 1.363760768339483329e-02 1.377882060115874843e-02 1.338845412635103482e-02 2.075136110116546084e-02 4.374348019890685058e-02 4.914728831041673129e-03 1.660209112305117279e-02 8.194525676627442690e-03 1.392013002114263296e-03 1.021998753639402277e-03 1.563585392720691835e-03 3.074671990634305230e-03 4.567548281611637923e-03 6.048093735831610099e-03 1.084524289435722343e-02 2.418848435475588407e-02 2.552610948598316859e-02 1.267337943148749875e-02 4.549358038518024581e-03 2.028143750572038856e-02 3.786460115020803124e-02 5.001722467861535737e-02 5.148561555017384939e-02 4.480705762675446513e-02 3.814680397111799154e-02 5.573459144636759566e-02 9.741759955649851796e-03 1.108177669328882647e-01 4.723594804538013697e-02
2.831626201376238883e-02 2.263758195358628322e-02 1.207042397266237799e-02 1.933625762769819456e-02 4.587822327027025115e-04 2.337920352466918775e-03 1.324798828681342244e-02 1.094732691374896046e-02 1.092011213768507780e-02 5.415409778064942704e-03 1.953934051677937156e-03 5.137306652801963865e-04 4.997792319761382770e-04 1.300971346263927629e-03 2.941143864983292687e-03 1.354700933584989872e-02 1.483840380779042484e-02 1.826470017397796575e-02 3.337350730670402433e-03 6.160661869822650974e-03 2.264066616684004551e-02 5.063889037732341447e-02 6.472345704515877762e-02 6.689980676683464356e-02 5.411809205750205132e-02 5.073961452087369373e-02 4.600177288142789228e-02 3.647981308351595786e-02 1.619189380437980859e-03 1.067685541920572077e-03
1.294590922475165502e-02 3.638432250669310780e-02 6.893863888671923623e-02 8.560811250616108797e-04 1.868846775073046505e-03 2.627818012618284970e-03 8.292068334945171953e-03 1.030458269466128819e-02 7.065973349792066538e-03 5.479355028711717021e-03 1.144402478641033585e-03 7.530442752948854346e-02 1.133121587674541381e-01 4.881642442121813174e-04 1.074616465070848178e-03 6.417211053522447681e-03 2.548591406173407199e-03 8.547528597920100134e-04 1.255338604558890736e-01 2.235532627828060517e-03 8.649719233893271228e-03 4.688277763001938436e-02 6.057234187312064005e-02 6.396128250710558794e-02 4.676238510090889589e-02 2.155983686796251672e-02 3.462698638161985226e-02 2.376206016500116008e-02 2.142197897365312464e-03 8.454399118259793263e-04
6.395936541892468684e-04 8.066899418823626593e-04 5.317105758974707873e-04 6.468068347183279733e-04 1.490248668939853603e-03 8.371299946351778640e-04 4.230200934962288079e-03 5.333644898082180036e-03 4.838677749171661768e-03 1.149865950484296653e-03 2.907156919890893317e-04 4.465544123601737636e-02 7.696451647760706172e-02 3.346972948539061131e-04 1.362090965130797809e-03 9.376380683387935781e-04 1.775906524743427802e-03 5.450914107829399335e-04 1.055833192710727963e-03 5.091459465509471684e-03 2.745421385445282955e-02 5.226993267416563116e-02 5.657383174070673704e-02 5.499299170657680202e-02 4.320167091306176266e-02 3.222181324408440739e-02 3.156978899769895958e-02 2.126675420882583739e-02 1.914344196008902366e-03 2.222364909399918709e-01
1.841013130763012031e-03 1.641733960674023659e-03 8.302963322224878083e-04 5.834658889258856167e-04 7.372881556615437735e-04 3.805499134408796757e-04 2.081023320694300963e-03 1.774922347752758405e-03 4.706572698045847917e-04 2.624117479835465119e-04 7.438405035871760440e-02 5.864373026595511712e-02 3.468467654266931682e-02 1.893196020216990696e-02 4.837253563713683757e-02 2.668501150253717227e-04 9.812940993149769919e-04 2.303044647645074040e-03 2.274958138597636074e-03 1.028265925763737279e-02 2.785549441481729657e-02 4.018968543649956149e-02 1.630138308530219154e-02 2.540394547463079369e-02 3.430232249977463455e-02 2.021206649959861323e-02 1.553144221868536443e-02 1.275410461320225508e-02 1.461189762308193751e-01 1.332972356642551370e-01
1.492774846525531411e-03 1.668575432106756675e-03 2.420170831868017638e-04 1.148807280370390538e-01 1.009992058757689659e-01 1.861526585264810965e-04 2.525005219774083568e-04 5.415044568059367014e-02 6.979711693277813878e-02 1.089243691571063072e-02 1.423672384086661566e-02 2.160551689364869493e-02 2.386544571632083847e-02 8.474117613263615345e-02 3.602506769718804647e-04 4.928591654779762923e-03 9.634637436001734431e-03 1.427870912598046618e-02 9.971137491450381835e-03 7.598539614185288206e-03 5.334138201394947147e-03 1.893125233046858997e-03 7.246889126358907127e-04 1.631306766876812822e-03 6.250239035100629316e-03 2.228854043410913050e-03 2.142738484883778029e-03 2.199797718743595198e-01 2.524591015719652304e-02 2.065522828953776646e-02
3.102637360674668186e-03 2.323218978730174321e-03 2.475300622675592017e-04 7.354370901372384028e-02 1.145662111730062077e-01 9.084094559203026442e-02 1.649510147693413354e-04 1.499534337510384854e-02 1.258713293016280182e-02 5.438369194989259303e-03 1.287115412099852987e-02 2.429815095313191120e-02 3.230497996790684945e-02 2.438197960256246663e-04 4.299966455194689135e-04 2.868098154792038477e-03 1.073618452219590735e-02 2.057941547607068655e-02 2.394984449542181953e-02 2.123277333443736314e-02 4.545399109502950424e-03 1.017417999779821275e-03 1.258739875074693084e-03 3.171859716984135220e-03 7.345573726298213618e-03 2.250629415344140242e-03 8.928250670575681343e-04 1.033816700796720833e-01 3.264055470690523097e-02 2.932788139508765018e-02
3.787298984316555053e-03 4.693913212707975552e-04 8.518686284892026950e-02 2.931425883879360331e-02 3.511220628280221911e-02 7.804604112022729689e-02 1.009319317924811249e-01 1.130965682827022450e-02 6.225995694981589432e-03 7.172730144670787927e-03 1.266829498180744619e-02 2.157271430817563063e-02 2.440097722611825684e-02 1.347743593231594261e-01 7.896789949014269058e-04 4.087159139454368990e-03 8.156495321303478332e-03 1.937210307172938101e-02 2.508941129427862127e-02 2.180218775959832239e-02 1.107094987609974490e-02 6.466037867422500581e-04 1.738120009361574514e-01 1.018654749242932367e-03 5.995514404118790046e-03 3.671007101328648166e-03 3.380413294698534320e-03 1.886728965071934327e-01 2.897567328529085384e-02 2.228929244485613331e-02
2.055202238157415994e-03 6.204005340548899477e-04 2.400521139281409943e-04 2.211879621973758341e-04 4.833709309052368493e-04 3.203267301459932631e-04 1.068697702617468215e-01 4.399621325573890157e-02 6.600677423965509161e-02 8.552016506436295462e-02 7.926440865220270304e-03 8.894581031444224323e-03 1.384856668118507328e-02 3.132219614031911403e-02 2.824158614598325581e-04 1.241786633385396797e-03 1.307830277969173781e-03 5.824382588976223171e-03 7.748401703553856046e-03 6.889406810431282675e-03 5.950420130227870689e-03 7.860599308256982888e-04 4.569039558368852283e-02 8.670201715201504566e-02 1.075646421323143021e-03 2.702741724148063386e-03 7.333149195010847492e-03 4.193252228554192676e-03 3.419782214822061905e-02 2.587132610617332018e-02
7.329381038707700937e-04 2.835234306403719841e-04 3.016612466787575502e-04 5.036677178297075275e-04 2.708427650572789555e-04 9.429588672494110257e-02 4.369161713344066333e-02 3.089853129758143857e-02 9.808412459662156635e-02 4.224646817602113269e-04 2.553750724311210432e-02 8.761446720014694559e-03 1.479836523905915871e-02 3.242149662391932696e-02 2.287432882576557840e-04 4.422281845875245410e-04 3.215210044059020351e-04 9.040940353370602312e-02 1.405507086936379491e-01 5.238313028158969164e-04 9.629984738595254688e-04 9.308817845939609814e-02 4.627022834489757930e-02 6.186220227590961355e-04 1.515619494096056338e-03 1.879873665357129076e-01 1.877754712303314130e-03 2.141167187455514896e-03 7.725682459719890403e-04 3.961706300755006571e-02
7.428823625799934206e-04 5.816420758511336954e-04 2.822819985644502063e-04 1.468397288661217881e-01 1.434664514419739800e-01 5.482814467753824306e-02 3.649270038438468672e-02 3.763179206870061189e-02 4.166162581992896574e-02 1.849993266417956244e-04 4.633744258254089005e-02 4.374799274357336204e-02 4.124829082536528302e-02 5.135536089320018316e-02 1.486454094737498788e-01 1.041047079483791160e-01 7.204137223482923180e-02 4.407293834222602430e-02 3.956646356045562252e-02 3.055969200648922524e-02 2.409854105963681395e-02 3.488853870907410865e-02 5.501871509452786746e-02 1.368313628260433013e-01 6.245783417509338494e-04 1.142669878715372733e-01 1.822071317526028911e-01 1.174437099869674317e-01 1.183615959001499129e-01 7.651277534359915422e-02
1.006158174045737944e-03 5.120876411039379950e-04 2.901259239505593634e-04 3.932932184327674963e-04 3.401569264631019150e-04 1.435546647853755964e-01 5.892488986168847951e-04 4.275780990651013554e-04 5.607201574488124979e-02 4.041889660790257827e-02 1.431041018298575239e-02 3.262656842215624214e-02 9.679078884837404029e-02 1.075924767728885234e-01 5.004263639719821067e-04 4.105901476091901271e-04 8.225956248620178157e-02 1.000963055344203656e-01 4.729868112567732485e-02 2.076804455520117262e-02 1.877740957510347017e-02 2.853142703141694353e-02 4.416453394331676385e-02 1.394442281075914114e-01 1.449959072881976674e-01 3.505981498100027571e-02 3.929342273209080610e-02 5.002646568068527116e-02 1.601191893789625786e-01 3.347029017807830881e-02
1.350865067611444143e-03 1.141347018162422542e-03 3.446313965365618609e-04 1.169730546246740450e-03 1.335378028500417650e-03 2.444268423584265628e-03 1.587741620738268664e-03 1.733325642537669200e-04 5.542193341346231261e-02 3.180948434178112322e-02 9.325170537385279318e-03 1.156761241945594362e-02 1.450306511589491594e-02 5.889895299547322910e-02 7.504371602973790301e-02 3.440142937358694336e-02 3.460467873385137533e-02 4.255220689525099353e-02 5.910155673235104046e-02 3.256979243623942671e-02 1.766650746279829765e-02 2.392075242686191733e-02 2.679674866433074537e-02 4.660145726890183721e-02 1.510308792405124501e-01 2.432259803149323593e-02 3.569785007180222708e-02 5.849059905209849641e-02 6.887199873219311541e-02 1.408344662505096045e-01
7.418877933088120812e-04 1.803049242981574892e-03 5.344969463362866501e-04 5.666535570655341879e-04 2.695740969890913531e-03 2.798678640746743614e-03 1.835885003970497750e-03 1.067977977094493047e-01 7.619506951505115866e-02 7.123591243634716519e-02 2.896548009252383760e-02 1.421132835268212533e-02 9.183217333815621441e-03 1.643933567731648698e-02 8.067297032833110892e-02 2.410256457626590298e-02 8.874722908505869312e-02 1.105152735093390326e-03 2.159492861532323615e-03 1.363919193649101858e-01 2.663796474242218632e-02 3.361254901244091486e-02 2.851015750853327577e-02 3.236967083364925002e-02 4.438600631528160506e-02 3.484089617963050112e-02 4.158129684908618007e-02 5.138259887283055244e-02 6.712051899431877022e-02 1.687461436951167015e-01
