3.579486335482093273e-01 5.180664294468276809e-01 4.394219152048999266e-01 5.455569031254124956e-01 3.833192705457125204e-01 7.997824567028564147e-01 7.293998488938581160e-01 1.837936712780411166e-02 2.606255339449229866e-02 3.568786129050620370e-02 8.839614477252635272e-01 2.288885961722930962e-01 1.497539794484946674e-01 5.946075385182139073e-01 7.392882004619407699e-01 1.760787469371094538e-01 6.653777565784297909e-01 8.412928607897246502e-03 3.617378024241357706e-03 4.921742330969997026e-01 4.599006783753984418e-01 6.860520857530208461e-02 5.237331253887407556e-02 2.089932139179229709e-01 4.053734857016674242e-01 3.184462661792328286e-01 1.467727688194836178e-01 1.294160865228476294e-02 1.237377198963458130e-02 1.558430302490944157e-02
2.344163095515791329e-01 4.963461472954718845e-01 8.749959392090508326e-01 6.597475000243298027e-01 4.548285341840808127e-01 4.572390991018958351e-02 1.787726567943111883e-02 1.499321073662289103e-02 7.453272517444673451e-01 6.797308153966412636e-01 5.442154816170947651e-01 1.183466207451478319e-01 1.766450254658553098e-01 4.575830673856176589e-01 6.714750109441874892e-01 4.834800918390771973e-01 6.167015897072808395e-01 2.099916431969795633e-02 5.168208563374595763e-03 5.867252120922767933e-01 2.636625935549901656e-01 6.606543122558758419e-02 1.368541107008088287e-01 1.222118232874266908e-01 1.083268021209630588e-01 1.457731268437576222e-01 5.150163727405904918e-02 1.311471868793917007e-02 1.869042828907841597e-02 1.870809911605795378e-02
2.161485348370612708e-02 3.022502466530252799e-02 6.116734726897624097e-02 4.293958930789403688e-02 7.137463828872911420e-02 1.514400088597987748e-02 1.880380294235845517e-01 1.992946964005529453e-01 3.952143875557566355e-02 1.175030293312467888e-02 2.716981809843741630e-02 3.667217615628143995e-02 8.009233190064430907e-01 5.231162896468370682e-02 2.750467876601232486e-01 3.507603023571003592e-02 9.438568784899887820e-01 2.009519425235751708e-02 3.264131620788959798e-02 7.480637288910184889e-03 1.662107938945786290e-01 5.489431988848969546e-02 8.358060863386755635e-02 2.904377939668416342e-02 1.725763363554793164e-02 1.142613254352004004e-02 1.028772979494047002e-02 8.091132751206734849e-03 1.381525323695182751e-02 1.550102165579915307e-02
9.063471616029902464e-03 2.360767590916887718e-02 2.165140563436487170e-02 1.743011754476166478e-02 1.557624030263199920e-02 3.814654387735648688e-01 3.803259824071259509e-01 2.365616582008386037e-01 1.282777668306993302e-01 6.347289974389142171e-03 6.788716439578525996e-01 2.603980823249451432e-02 7.885105247077955903e-01 6.416874315983365218e-01 2.019238698096098017e-01 1.725578483605282043e-01 3.800843520673033993e-01 7.488949743339526899e-01 5.880866935021570319e-01 5.467103461874807113e-01 3.019026007303177161e-01 1.169304609043057275e-01 3.921484406649921456e-02 7.725264858396203860e-02 1.413487401448751228e-02 1.011578594506702157e-02 8.729089224884413814e-03 8.292029811645255585e-03 1.685423095705965157e-02 1.832708694703048119e-02
7.383932827813509681e-01 4.385211499176477207e-02 3.564499333577637180e-02 6.571955271347467049e-03 1.073451004827342611e-02 2.237926439922231225e-01 3.912746305136747260e-01 2.203353779757597775e-01 8.090869614727105863e-02 1.774723158414468968e-02 1.425556164056881840e-02 3.948322039441862219e-02 4.774590382588272952e-01 4.972157565673243629e-01 2.608478039221329148e-01 1.060281048136467036e-01 2.711643479690965461e-02 7.194258728721010243e-01 1.599352046217831363e-02 6.825193180508595248e-01 4.854039682987114634e-01 1.512175562930404560e-01 3.852995917388551961e-01 1.271175464171968583e-01 2.555206787291727788e-02 1.352812921843607810e-02 9.407170712031186904e-03 1.089619474489227254e-02 1.707026767320070360e-02 6.285612665540890598e-02
8.546980997288498028e-01 8.001976627473622594e-01 3.990676091244909490e-02 2.527283632385398174e-02 2.562979106587589054e-02 1.327527669726212001e-01 1.708529380085533345e-01 1.810486424917343573e-01 1.510828856410564858e-01 9.722434172134086783e-02 4.671628839655576904e-02 2.779342974713023759e-02 2.145390198868485920e-01 8.163390592810212953e-02 6.903851462750452972e-02 1.215812437380797972e-01 6.687225033192064627e-01 1.740328856657483991e-01 5.559630132936024260e-01 2.603327879613524104e-02 1.729764093130582714e-02 1.599960509750985790e-02 4.753573289370722210e-01 7.426109858942875341e-02 3.816222203240322852e-02 3.539684773084457448e-02 2.204473208576746002e-02 1.524396558873910949e-02 2.018436074184225618e-02 3.634870533882408883e-02
1.434336176080835412e-01 2.193535916667809504e-01 2.121716935544009641e-01 4.097184922996537082e-02 4.951496435347971237e-01 8.252295927773664053e-01 8.676765064373478942e-02 7.065226763777205932e-01 7.999823138001050937e-01 8.520664171556298072e-01 6.095117355371038048e-01 2.600336909358238469e-01 1.193763989887382249e-01 5.574653135647800878e-02 3.302550937399138797e-02 6.194413083910620121e-02 3.660834821980724629e-01 1.721867651315090175e-01 8.440098244867144661e-01 2.603562276651993912e-02 5.505280680201883881e-01 1.522518844648264591e-01 7.043458715568927386e-02 6.719486703324968613e-02 2.586723742151372102e-02 2.638175586618655630e-02 2.333261160390179972e-02 2.035111058994375915e-02 2.370883770634473614e-02 5.610160657871884893e-02
3.179167978066182454e-01 5.970399506578509818e-01 3.154494520943476599e-01 6.318080350153286728e-01 9.482231572845223333e-01 1.030805507198393922e+00 8.982434694173574430e-01 8.574380540881648693e-01 7.412729494020765530e-01 4.117871733583029492e-01 1.629829913990786250e-01 4.841475933374779217e-01 1.043593103590112481e-01 3.673518447514241558e-02 4.223155130820163000e-02 8.139976176529285790e-02 6.471003962138424104e-01 1.018738366316751076e+00 8.970576601762646485e-01 6.857328767788948287e-01 2.187391083488782473e-01 1.253967882840530956e-01 4.981860595942222414e-02 4.149681836748955743e-02 1.970075369491336784e-02 2.067266723879709889e-02 3.348858925572361506e-02 4.325265832989516612e-02 4.253406171159859750e-02 1.221630409946793810e-01
8.083329574393998129e-01 5.357187928172212343e-01 2.976158085325301683e-01 2.158651998365165026e-01 1.042843692429741065e+00 4.309812842257505494e-01 1.182687690063673469e-01 6.329949622147320598e-01 5.732322546876893465e-01 5.712634248493215772e-01 5.008633601443682748e-01 6.185341806203253912e-01 3.318209520468538148e-02 8.593503887629875271e-01 1.369309771601749381e-01 1.181376882999151112e-01 4.887004874593997017e-01 3.696280668370883343e-02 3.315137367154917525e-02 2.936640031034084553e-01 5.681513435370965509e-02 5.768122531497819894e-02 6.255177826149266318e-02 4.075886830700349572e-02 2.383997484519653765e-02 3.648202826948297728e-02 1.448351868076408477e-01 2.894043741672925885e-01 8.176683134016392573e-01 3.951946823739419523e-01
1.306819416813409518e+00 8.456244905303537118e-01 1.291946750668463206e+00 1.163282408966197279e+00 1.005988476364527262e+00 1.933650282458075909e-01 9.167792321149976775e-01 4.050518565771416002e-01 1.886754712141121559e-01 6.730818568396779167e-02 9.073416601719778152e-01 7.654306102786959665e-01 2.412692977118361531e-02 1.986113617290401548e-02 8.541126330323809412e-01 8.625070956625181529e-01 3.242197384162800317e-02 2.725326139438990353e-02 1.331473812476766973e-02 1.001260759658141597e-02 7.020095609933091341e-02 4.431908630239477648e-02 5.086554784764377862e-02 5.588457372886391356e-02 3.121023464489377716e-02 4.003787188257176832e-02 3.870491898807715270e-01 6.547109659262728698e-01 7.996040152565936365e-01 2.060284404067032615e-01
1.104105968937759918e+00 5.682434751100047254e-01 1.243420428947922485e+00 1.035885106655828558e+00 1.785842025733422322e-01 1.201606911875163219e-01 1.053114511057623159e-01 9.498202676122446952e-02 6.263888304985941458e-02 4.911420046296122721e-01 7.953449179918947731e-02 6.130229787231337296e-02 7.107031441277149308e-02 4.491070221988979760e-02 1.205027365509832131e-02 2.291122339343042158e-02 3.008267584826336549e-02 1.346674220617786674e-02 4.789285788927061249e-01 1.166074664065468447e-01 4.802664751727483972e-02 4.286840125574477300e-02 5.543610706881955952e-02 7.766486588182802686e-02 8.309555369426029070e-02 4.531623420809139519e-02 7.312112506338874773e-02 5.763912036657384275e-02 5.121318141101005583e-02 3.644719707070989689e-02
2.126947407234084930e-01 1.232147659306076365e-01 1.064034356320354924e+00 1.019159674706471508e+00 7.991796359306140296e-01 1.848414094772228289e-01 7.752722189743400938e-02 5.202012161278610214e-02 6.341171625159043590e-02 1.005160700114045902e+00 2.694441867275962355e-02 3.375986778524334847e-02 5.488881966720872418e-02 2.866147952093380663e-02 1.042300701040165499e-02 1.453704079732359364e-02 1.598461747669504759e-02 2.313837245075489601e-02 8.005933691492783666e-01 2.654875398055868141e-01 4.591410963401949819e-02 4.656654630131004668e-02 5.517517376439144000e-02 9.888004912886871889e-02 9.411726558955660349e-02 6.715415544705723161e-02 5.168910535444909415e-02 4.718758686678244801e-02 5.165438903991526054e-02 5.618767751994672988e-02
4.302945300796996719e-02 1.090124675316655467e-01 2.589595517608953013e-01 7.247656524138742506e-01 4.768114626332285999e-01 1.543216355180832000e-01 8.096494209009186260e-02 7.001884416507833664e-02 8.837795484128380119e-02 5.826731713981330163e-01 1.636965108939538172e-01 1.463696818379778795e-02 4.913003611184799807e-02 1.743451941653829940e-02 5.515120361342676358e-03 7.848156759988907105e-03 7.879880730194115390e-01 8.481914085381955098e-03 1.430437469457250706e-02 5.596469207684857672e-01 4.406522813647070075e-02 4.821809387956067783e-02 6.094144672027150544e-02 1.020163534903512081e-01 1.300135394689386215e-01 1.139748989339970375e-01 8.409610648790513676e-02 7.917587705760378847e-02 6.995146545498566459e-02 5.846222849508003055e-02
3.547254939712263244e-02 1.014380628903212567e-01 1.807380281097192842e-01 1.304378888686372195e-01 7.745891397666487821e-02 3.067280505685975878e-01 1.034627054049158446e+00 9.034389158283353538e-01 1.204695530584177637e-01 3.797286067482191774e-02 1.363332315112124604e-01 7.346548187444736921e-01 2.252742029760521070e-02 2.480633505232153480e-02 2.655891242278927977e-02 4.403505353520833360e-02 3.970330265865547326e-02 2.579873626589913524e-02 7.435932407355887175e-02 5.554787808753532119e-02 7.936137957627581452e-01 2.895372660453794378e-01 2.167386866691459746e-01 5.182239065461196059e-01 1.045704549982120479e+00 8.907503565514505173e-01 2.171306656872369623e-02 8.964984947827334683e-01 9.481463828948469286e-02 1.108000541606131151e-01
3.262745701903475154e-02 3.279278150290848570e-02 8.922817002967287081e-02 6.668337013224820975e-01 2.436468890893730421e-01 5.604913310849517216e-02 6.876774271196062216e-01 6.234713864517109350e-02 1.785480589804465390e-02 1.424031938978118916e-01 2.981919908241213446e-01 2.651177470888137905e-02 2.514092174871989521e-02 2.029994681829534395e-02 1.850024045071635079e-02 2.254973080525497428e-02 3.923112578058608052e-02 6.917445119536448639e-02 7.191563096840469793e-02 9.430661233792214659e-02 7.677294526725173540e-01 8.605017732762361149e-01 7.149730498003623591e-01 2.633225028040137028e-02 3.073658213622940810e-02 1.062221866067584175e-01 9.993681178235432061e-02 2.422538376382708455e-02 9.760362686307122448e-02 7.537179292918017026e-02
2.958591012816316063e-02 3.224199241586588049e-02 7.282214151356622422e-02 8.087791163838416175e-02 5.432408041429864776e-02 5.727839976193920685e-02 3.163397276795570368e-01 8.454046792181694192e-01 8.490371629820489194e-03 7.222729347319265525e-01 7.919188197697535347e-01 6.346962179519830549e-01 1.175502714202594258e-02 1.780506924705235750e-02 1.686996210363581050e-02 2.624357730103765718e-02 4.661369499569462810e-02 5.819739751357391744e-02 3.458448278011187066e-02 9.717320266780422183e-03 8.092520686063670032e-03 6.251945817674003925e-02 7.792384968257110023e-02 9.717385634227784785e-02 7.690124864442253461e-02 1.009755631024898681e-01 8.118105156919194765e-02 3.197144195083827245e-02 1.421490625226926596e-01 8.416102838338530845e-02
3.770079686154168691e-02 4.347757969947906725e-02 4.239550382694107222e-02 3.988881707850773506e-02 5.725600186979570155e-02 9.530711810467604184e-02 1.907247029169182456e-02 5.125474625618614555e-02 3.134690008457020893e-02 7.212138506701716058e-03 8.241046798807761392e-03 1.294192274410900685e-02 1.762166405611574269e-02 1.495976907314679541e-02 1.211831585667381972e-02 2.221639083883649585e-02 4.950310585829074267e-02 5.166899101015041268e-02 2.531246541676764397e-02 8.929499000492302843e-03 3.905103125552020216e-02 7.165557780600345650e-02 9.290446023428441946e-02 9.665624899951634486e-02 8.615147617181340145e-02 7.513318332865329130e-02 1.120563776213539253e-01 3.319675025519343292e-02 1.975619673404983012e-01 1.073734313754604042e-01
9.397266853469328496e-02 7.355359924231731628e-02 3.570050210557633441e-02 4.990881828778509499e-02 5.876764937877857475e-01 1.060940681336384681e-02 2.760153767946939979e-02 2.106530461456636305e-02 2.063920124202765077e-02 1.018598979299059799e-02 8.257945144099608156e-03 7.279781764731771965e-01 7.083820189738709860e-01 1.007289443741718471e-02 1.190128566991239048e-02 2.750696421889865795e-02 3.871148693708574562e-02 5.053710241924047608e-02 9.022138214112894808e-03 1.328457025358937074e-02 4.341240996782653322e-02 9.529109200817179048e-02 1.191940266794666858e-01 1.254630221621957642e-01 1.049927466442845542e-01 1.025833907643675796e-01 9.661932416854773775e-02 1.199169234791040706e-01 1.011013990026192522e+00 8.340097735634676157e-01
3.774041097491406815e-02 1.040159677270697802e-01 1.811106275731636239e-01 1.149875644583941807e-02 1.327045544159153809e-02 9.692045517682386369e-03 1.575351350647093834e-02 1.961409053986992376e-02 1.337421973191645769e-02 1.598294768883402189e-02 7.819355565623785712e-03 1.960956766729369805e-01 3.050579501634486101e-01 7.210920326424060667e-01 8.122276013192434446e-03 1.291085704397974473e-02 9.940463115341059697e-03 7.013416737646884780e-01 2.219057085316287758e-01 7.269593382587174156e-03 1.681725243312981455e-02 9.093691622896310500e-02 1.168467302068444402e-01 1.247886240118225576e-01 9.298504278592525929e-02 4.398761679682518938e-02 7.250344806768725670e-02 1.033824855241877450e-01 5.417844801952349798e-02 6.096531976000487685e-01
7.897360707600806773e-01 1.140194266804584432e-02 7.207215311759680443e-01 9.078752830054586109e-01 8.823429524919695205e-03 2.433302640633109096e-03 1.220005834608827930e-02 1.002369566198078876e-02 1.451841347989366732e-02 6.772089958970363421e-03 5.199936119521845201e-01 1.338266714352072395e-01 2.364264267226293681e-01 5.781947467675015995e-01 1.319178352332676767e-02 2.548525383369024296e-03 8.226889725924500449e-03 5.447643012827105835e-01 8.841306921995887302e-01 1.676919699036026959e-02 5.424743787271275874e-02 1.043759240894370915e-01 1.139011596477095545e-01 1.111905578114812665e-01 8.794970439938780415e-02 6.616245821991333098e-02 6.547730427432245370e-02 8.365242245170220747e-02 1.072673962207350895e+00 4.682316420628221953e-01
1.160681422151146197e-02 1.712065506357413058e-02 8.909545910566888868e-03 7.948884550828141590e-03 9.043011866873328433e-03 6.915868312354813696e-01 1.408069954037716523e-02 8.394939121803798518e-03 2.410656424109626494e-03 5.677082307390945992e-01 2.298138539136933001e-01 2.034313786906523924e-01 1.153709946786964924e-01 5.411203073012568060e-02 1.159446312504824605e-01 3.342414282389717939e-01 3.766927880760040630e-03 1.118630966091731412e-02 1.029541431737283040e-02 3.236457798103539729e-02 5.588213075975714816e-02 9.278252819248793137e-02 3.822336836936801596e-02 5.917164612662381695e-02 7.113321789327822775e-02 6.604435414551025618e-02 6.379139882549729468e-02 8.207977847978203956e-02 2.624765941393130131e-01 2.855593972925765667e-01
2.758985461751617234e-03 7.338532426559890749e-03 3.573646445720392029e-01 3.090504437501792045e-01 2.924720389728346359e-01 4.284550922096572734e-01 5.996567244184071166e-01 1.493681517727420971e-01 2.074473852788555062e-01 3.604975263709517957e-02 5.347850536364226470e-02 8.454297282558546900e-02 8.165430505989093590e-02 2.613984456929858702e-01 5.850835760453121370e-01 2.745300184604257052e-02 2.223369869464541376e-02 2.768904134179663024e-02 1.923622865038575325e-02 1.475363947812911337e-02 1.780122830481875931e-02 1.605928907292394556e-02 4.778261910539838841e-01 1.077347386343774360e-02 1.313001194907273059e-02 1.166919200412907913e-02 1.031365845550211047e+00 3.768768340631234448e-01 4.853219310251456059e-02 4.528844407833811092e-02
9.053403606676061616e-03 1.540068558689250064e-02 4.083289815583496241e-01 2.409374657889010729e-01 4.096141997224979070e-01 3.230255861414121910e-01 5.048485704233198756e-01 5.546619655610128541e-02 4.903475287296375773e-02 2.124288488363567165e-02 5.268689009804126966e-02 9.755175485823067150e-02 1.074663856366219195e-01 5.061659011370842620e-01 6.620989537635453281e-01 1.333476623500266453e-02 2.088864050590954341e-02 3.947157138734599252e-02 4.537614999903614998e-02 4.027054030250364069e-02 1.961575502640673652e-02 7.889999938151525116e-01 9.300167488123112225e-01 3.527444532090712875e-02 3.050697547095715043e-02 1.148019410970083087e-02 4.309393423666025846e-01 1.762865013143824489e-01 6.552899569924523770e-02 6.286862461367190291e-02
1.143248596282131317e-02 6.512750162818261579e-01 2.318500514003742907e-01 1.032213552611790097e-01 1.359195122525857224e-01 3.099197531868030375e-01 4.034824580513939885e-01 4.540894531384784272e-02 2.425416339315456665e-02 2.763336591067174289e-02 5.020160889575464580e-02 8.586146606072489473e-02 8.066466685982165430e-02 3.915029932724876094e-01 1.353002562020379912e-02 2.172570945403098225e-02 1.568031438572954975e-02 3.647322887002794195e-02 4.658668573743020291e-02 4.059719030519431948e-02 6.451939273217591198e-02 4.935949042378723339e-01 3.389124206792275551e-01 6.095873807379847964e-01 6.652541297796700503e-02 3.113851902526839840e-02 2.211765563649075589e-02 2.983913794553563203e-01 5.224581291998886545e-02 4.721915294685790493e-02
9.835310315143359211e-03 7.329803064869172720e-03 5.184154466377144388e-01 5.809857981577710717e-01 1.439302620906307117e+00 1.007402487643859201e+00 4.167869130849968240e-01 1.706075847102134502e-01 2.577792572516253711e-01 3.284192238862256308e-01 3.064643595485511476e-02 3.575140969752238496e-02 4.774550171188156333e-02 9.492483189663067367e-02 4.970480456017650206e-01 3.137842581988571633e-02 1.726109068967598276e-02 2.824211529020575345e-02 2.838881154586358341e-02 3.932200698643244230e-02 5.634497786360282562e-02 6.158099478912240077e-01 9.933218717100818218e-02 1.729053118754432239e-01 7.053536557456763223e-01 9.415595198768331175e-02 4.695816698063802475e-02 5.016684171638999268e-02 6.058323043494248661e-02 5.298495886790999948e-02
5.572187854509391344e-03 5.086048421085509474e-01 6.833938412690772068e-01 1.348293126474472192e+00 8.099285546605119457e-01 3.690586053264405808e-01 1.684984430103825259e-01 1.186468508607815692e-01 3.847294323417338457e-01 1.455992531977815529e+00 1.012345886616469459e-01 3.753759173978463842e-02 5.769765509042119878e-02 1.115233753083464674e-01 4.795667996616950202e-01 8.019996377356027883e-01 4.739685643298716666e-01 2.059731305559175940e-01 2.920447463366323548e-01 4.970350765678571703e-01 8.710673353832828480e-01 2.056050781765396129e-01 1.073341880485565586e-01 5.196217034376450217e-01 1.187564130544435992e+00 3.672828145222888363e-01 5.214103623753156558e-02 7.974487086956386084e-02 4.942812653156093416e-01 8.431990454955641534e-02
8.268047415414953027e-03 1.164726410128115841e+00 6.743127153957632069e-01 5.463829435768622345e-01 5.532643644978474384e-01 2.061085056436213758e-01 1.359881141295748996e-01 1.413681328489748146e-01 1.630652545088465133e-01 6.372902841678858010e-01 1.882280081014237327e-01 1.954628913580029603e-01 1.644608829567875408e-01 1.854525250771869582e-01 5.015564174923490270e-01 3.329508398078000475e-01 2.104231257919358389e-01 1.175978553198758769e-01 9.937305657446607321e-02 7.435076682595306852e-02 5.961691256661939831e-02 8.745739152452869369e-02 1.350876529305295448e-01 3.235833111166990794e-01 5.530364053188536744e-01 2.483308782123646863e-01 3.635596090660534463e-01 2.501034775494562767e-01 2.586537890644262094e-01 1.708347175101034010e-01
9.262345509663620288e-03 1.015045482788345277e+00 6.581102522215522832e-01 9.854052236938075637e-01 9.018914524394601173e-01 4.928680809448082178e-01 4.172872432066461815e-03 1.373069547101098298e+00 2.165339962302536558e-01 1.546037561073849431e-01 5.906886510352917646e-02 1.463824582789478301e-01 3.874413922946494671e-01 3.923603528792722894e-01 1.145694536583215406e+00 8.145673707655023410e-01 2.362952436892681862e-01 2.544359861179609217e-01 1.122608973630361273e-01 4.926431395106409955e-02 4.795598098083982824e-02 7.522630559208622059e-02 1.151302300001210976e-01 3.520843002760754015e-01 3.550547797002751582e-01 8.343576137134922632e-02 9.167847938485076953e-02 1.177443024190139576e-01 3.840748893060285662e-01 7.866929780720526011e-02
6.168394529711540911e-03 1.148067384679095360e-02 7.386961214902123540e-01 1.651964047350331852e-02 1.073876745839817334e-02 8.742650930051580269e-03 9.022782700932686917e-03 5.442470930378238148e-01 2.149641931835594988e-01 1.227830871157433168e-01 3.772249185451159725e-02 5.172982696210160630e-02 5.837637063244614788e-02 2.153225527565862385e-01 2.565596991450179720e-01 1.064666512815612975e-01 8.189019885665821397e-02 8.082375529887325660e-02 1.065911925551401296e-01 6.125048616072392704e-02 4.354407283915681659e-02 6.502649646199398781e-02 7.432309548155052736e-02 1.242064875786161315e-01 3.864174717151458993e-01 6.061786475110884920e-02 8.761362237044105494e-02 1.435670743798451165e-01 1.735797896799788631e-01 3.449407114150627174e-01
1.366165457027497358e-03 1.028862833932504828e-02 1.144530580266646780e+00 1.361558369899533716e+00 1.072834817763134753e-02 5.065612831433076620e-03 5.482677524700634540e-03 3.793792082227827045e-01 2.925753570306044993e-01 2.725310286398713866e-01 1.120477837680830951e-01 5.788734206811185085e-02 3.721927724103074597e-02 5.919676408952641300e-02 2.697337698010671136e-01 6.938468403006856078e-02 1.785430401169118830e-01 1.349845788317446255e-02 2.288343910781620930e-02 2.347433431893097555e-01 6.078321178041823369e-02 8.521516895522719681e-02 7.434760802928952472e-02 8.187564906596606074e-02 1.084928469340971924e-01 8.294512344217616628e-02 9.743797447280520829e-02 1.200791140683588470e-01 1.619834392556138980e-01 3.978299626831606761e-01
