3.064592940131433685e-01 4.428525718284204715e-01 3.716912306424504098e-01 4.581323721301446827e-01 3.170880120794159485e-01 3.553892563664638737e-02 2.404438813070414530e-02 6.452985558168122804e-02 1.166686388256410190e-01 6.087209110325725314e-02 4.002764291376625927e-02 1.757292744921652994e-01 1.188527893908879196e-01 4.694373557397233943e-01 5.781226298217058135e-01 1.365810893703902351e-01 5.140491623229216378e-01 3.160724396813870823e-02 1.972772737809962845e-02 3.803803724323778779e-01 3.625392868134182933e-01 5.518872140000027904e-02 4.302192083364599767e-02 1.770317288934717403e-01 3.553293053286645242e-01 2.871500239866888182e-01 1.356340338334511286e-01 1.186967684842481219e-02 1.125345041901806668e-02 1.404999062954082577e-02
2.052299581986077315e-01 4.396154431094174142e-01 1.098939884863234379e-01 5.775071580447157515e-01 3.934693062207371139e-01 1.144429472317082808e-01 4.386878767811105279e-02 5.404709229654240665e-02 3.175616687063689825e-02 2.789678156732749298e-02 4.231582234221554772e-01 9.031686770822341948e-02 1.393964813306695361e-01 3.593367075227331120e-01 5.263503316856216196e-01 3.717708693460561320e-01 4.679585482851839062e-01 5.598913112383144958e-02 2.962469318509807284e-02 4.522572353090366093e-01 2.053771138204655011e-01 5.200417262918387296e-02 1.089779913947103995e-01 1.004877916926957271e-01 9.284644069257011467e-02 1.293805252067448397e-01 4.710865152806014561e-02 1.193368681204336028e-02 1.691024541249463303e-02 1.682887075991400944e-02
1.309833980339619730e-01 1.339019617831680165e-01 2.752930870113518003e-01 2.063594195673314757e-01 4.803005632114869528e-01 7.176876975087602417e-02 1.744155487337040455e-01 1.817959845456083023e-01 1.578501506414723143e-01 4.024755260418629021e-02 1.041273360222696454e-01 7.668093831423694606e-02 5.087433116848591452e-02 1.165022653358305516e-01 2.150928662563641736e-01 8.902097015250030887e-02 3.632361542914398084e-02 5.186475875838509469e-02 1.464378928092634757e-01 2.808294857503645936e-02 1.278931833673032648e-01 4.227766753833002433e-02 6.446317983622935899e-02 2.316663997739717290e-02 1.445971435436142413e-02 9.983040936563341086e-03 9.311239935334421694e-03 7.303864587827555051e-03 1.243562113368503266e-02 1.391533232448967199e-02
5.484666496515070572e-02 1.571900666323949036e-01 2.799357630924078078e-01 2.269318257190832966e-01 1.173728851596039374e-01 3.557575853583448411e-01 3.513407228799354520e-01 2.167935636559650825e-01 1.168312245523294435e-01 4.419198527125074022e-02 2.523337168005484674e-02 6.059456387564363111e-02 5.926435495012040422e-02 5.062970825560350052e-01 1.612697537852500196e-01 1.353299030839581751e-01 2.951380463457513037e-01 5.765684717191403852e-01 4.608706258798969113e-01 4.276210205572367751e-01 2.376679602183131845e-01 9.262771048597479018e-02 3.123582084830373376e-02 6.330572565417637299e-02 1.203673284430416095e-02 8.921513602852464836e-03 7.935753196995206857e-03 7.521277523923880666e-03 1.524869464764980892e-02 1.654561319778514311e-02
6.262070835513485756e-01 9.819209301378996335e-02 2.201180138315627366e-01 8.532954620897292841e-02 6.760336481508005813e-02 2.065873333830836045e-01 3.582831872160890385e-01 2.004120623386715372e-01 7.328650406729846079e-02 1.079358325431229171e-01 1.146577245305325510e-01 1.320418810644450047e-01 3.965287508437729258e-01 4.087661149119703463e-01 2.141741170676432493e-01 8.676381476497169176e-02 7.701127035877154692e-02 5.800223202075508455e-01 5.062624906091141991e-02 5.471034742694020903e-01 3.955682738341833038e-01 1.249346930565361086e-01 3.225812400927002832e-01 1.086864337699548627e-01 2.239403560901776294e-02 1.214784825185859750e-02 8.637256670686585536e-03 9.976129004721907140e-03 1.558027437890121582e-02 5.721765306904903758e-02
4.466128021211203392e-02 4.732566218187246598e-02 1.488637973107906909e-01 1.212414660488436990e-01 5.569429076707579918e-02 1.164922794443885995e-01 1.499236623677570601e-01 1.610124038490473031e-01 1.312422225739958981e-01 2.620679144914957459e-01 1.550652141202566447e-01 1.132878593975635839e-01 1.855109834607346353e-01 6.978538952500067116e-02 5.847804581445949224e-02 1.018648207514742665e-01 5.541021617152958045e-01 1.421141313086777824e-01 4.521346290882580776e-01 8.084560590085219933e-02 7.404756360537895210e-02 5.732571369677135625e-02 4.165935513049602856e-01 6.607529109193882588e-02 3.440293114713276201e-02 3.236078319715468554e-02 2.043022340465733971e-02 1.407281814921015721e-02 1.855774819061253855e-02 3.330547478883341683e-02
1.120716029210706011e-01 1.731458584870941286e-01 1.713786668934178248e-01 6.174048833422061955e-02 3.834524775594856383e-01 3.691390476441080981e-02 8.589055852999642748e-02 5.830429428097917421e-01 6.676739924026728890e-01 9.599546670156956785e-02 5.261415493046307512e-01 2.292270218403476834e-01 1.051833682073009951e-01 4.872247497718217024e-02 2.858947504074434501e-02 5.259853090377417800e-02 3.002386396368777466e-01 1.374939682110414008e-01 6.594544555806005626e-01 5.941877474134758808e-02 4.734127930672200613e-01 1.350435193202967066e-01 6.408834710502127330e-02 6.182670844048836212e-02 2.389845429188672613e-02 2.450085835296659381e-02 2.178352960912534678e-02 1.890844644071518893e-02 2.192206342439591976e-02 5.165561796076720280e-02
2.285590659547461767e-01 4.304120925773673445e-01 2.336598966774534603e-01 4.620394036205067168e-01 4.605196756178931566e-02 3.994817894000242398e-02 6.239076134339793800e-02 1.085230674916738552e-01 6.040304561831494334e-01 3.424017267256012076e-01 1.368243907089264355e-01 4.139870253097960862e-01 8.940532329568239012e-02 3.123496266714273495e-02 3.549492939978524109e-02 6.690221550225232405e-02 5.128375821639123977e-01 6.235176625596460659e-02 4.023683558214473377e-02 5.447937608367801054e-01 1.843285871742365578e-01 1.089772516431736643e-01 4.437339431574232468e-02 3.736346028167236016e-02 1.780841302967246798e-02 1.876827874010675301e-02 3.053086294526374117e-02 3.938373491596020709e-02 3.868225045075557311e-02 1.110711817236084004e-01
5.156935169350258530e-01 3.367167882710115356e-01 1.935292178291971033e-01 8.328498104544511393e-02 4.529014543521693581e-02 2.784472152495068853e-01 8.808060428146691212e-02 4.781023261447734374e-01 4.600275132803262057e-01 4.664450984849573545e-01 4.121174362093819044e-01 5.111141945580606194e-01 9.879446285189047439e-02 7.051793001672086447e-01 1.100426465711562135e-01 9.325466429380738220e-02 3.743512013417114037e-01 6.310020118003632772e-02 5.620178236648633308e-02 2.300465716827300444e-01 4.695959191004576289e-02 4.909343462052893903e-02 5.449054371234149374e-02 3.586660885078996747e-02 2.105174851153601701e-02 3.232616705425062076e-02 1.287175824793791445e-01 2.579937807658085891e-01 7.314402249006904944e-01 3.549631164085768620e-01
1.223653213145944191e-01 4.686553243125690660e-01 9.337237613342506959e-02 3.948661824658206837e-02 3.778794085691895149e-02 1.282662900439307252e-01 7.207466189422591374e-02 3.073934843669666184e-01 1.506601224230124103e-01 5.393767594099595913e-02 7.934932903950385474e-02 4.601530470831469849e-02 8.406644978490497577e-02 7.336223700737709574e-02 3.619039466397250965e-02 3.032605288863190682e-02 1.499776225106495553e-01 1.645628281772583412e-01 7.241567869523900247e-02 4.151314273149488837e-02 5.707617046299762881e-02 3.689210818353877430e-02 4.326001119930222849e-02 4.795407677958782311e-02 2.685865743883672496e-02 3.455752500414233097e-02 3.351506983655677119e-01 5.719668857889332880e-01 7.046429552865490775e-01 1.830333763501128530e-01
6.833823865896437866e-02 3.143563527382799427e-01 1.497985503092246484e-01 1.297341169486079804e-01 1.443046927661288947e-01 8.428071023795195849e-02 7.827816417358231249e-02 7.147448910207052086e-02 4.951830182560378046e-02 3.871139982911008803e-01 2.012670014820165110e-01 2.841674183643768115e-01 5.804076332566427965e-01 2.819495612607769708e-01 5.120049663372368276e-02 9.954154202435204490e-02 1.863070888479909926e-01 7.137895856487506963e-02 3.735740683189688882e-01 9.165421857216020374e-02 3.848071656129720824e-02 3.498762885488593960e-02 4.606488975832206956e-02 6.495869822654273817e-02 6.958088063483500174e-02 3.801001932922483395e-02 6.150571745407897722e-02 4.911477526970945556e-02 4.415269211575933300e-02 3.174710224162739097e-02
1.284673990481115524e-01 7.532479706118683227e-02 6.992832468708475302e-01 6.933912303294248458e-01 5.719714836512160838e-01 1.384738964337113298e-01 6.035839780338725369e-02 4.122121405785943854e-02 5.024603867321602441e-02 4.260319835435136954e-02 8.064396430131612337e-02 3.427045200149730353e-01 5.966636392694422142e-01 3.057057648948905970e-01 1.088970865735407328e-01 1.217624942789737319e-01 1.347167576899316321e-01 1.117579746082760783e-01 6.262708686702171956e-01 2.086173993847036390e-01 3.650415205449165923e-02 3.747105046995663491e-02 4.490141360566493600e-02 8.063124055732773243e-02 7.657626979704618142e-02 5.456261423064669852e-02 4.204099261401467863e-02 3.883937669714807722e-02 4.298631477952721824e-02 4.714637081687440834e-02
3.045731785086733256e-02 7.663832569243264614e-02 1.855254051717905583e-01 5.263639090824622224e-01 3.555465662610024502e-01 1.156877838630692573e-01 6.056163148782630484e-02 5.167409403137034757e-02 6.769970648130067825e-02 4.599592922083194368e-01 1.277340457317062972e-01 1.119370825346440168e-01 4.411913795343814226e-01 1.877215518748129863e-01 5.858505658173643327e-02 6.739121379030679759e-02 2.486716641892775317e-02 4.641058517698239821e-02 6.543117719270068189e-02 4.375886972237786332e-01 3.454617784487119814e-02 3.800166265147893879e-02 4.847643405310243792e-02 8.056277576935427787e-02 1.017626142035835679e-01 8.867163169571933012e-02 6.536445096709772584e-02 6.264514517428113050e-02 5.605710065023977728e-02 4.739861369477557651e-02
2.632202537459654018e-02 7.547770045565020680e-02 1.370283178372508903e-01 1.006574180085516718e-01 6.084056238765089830e-02 2.371417521051266963e-01 7.165167124586971359e-02 3.371737939003253970e-02 9.371636242867058264e-02 3.049144483485603449e-02 1.076108005220736824e-01 2.005272038597980672e-02 2.004023818893211073e-01 2.696629936438090236e-01 2.864245271560116879e-01 3.857495175037866653e-01 3.461312205824401689e-01 2.242410019090593787e-01 6.458207051209604588e-01 3.033783638185219567e-01 3.341614463378513034e-02 2.229094514157948792e-01 1.680290360337372835e-01 3.985771180919627787e-01 4.807764772447214313e-02 3.397461174712303189e-02 8.563397019261663468e-02 3.410665429622732753e-02 7.360902228887135357e-02 8.694994550710548331e-02
2.520792546353331498e-02 2.535570167007739420e-02 6.974934634495502661e-02 5.281355313507920535e-01 1.952665704578474271e-01 4.389468187642022595e-02 5.101462213300553827e-01 6.224465501940078943e-02 3.486164266171044163e-02 1.139247042458962633e-01 2.339701312763247942e-01 1.052876066179489201e-01 1.920846029515735631e-01 2.269581874671038058e-01 2.045417367515794671e-01 2.468369917647039169e-01 4.201819387978220632e-01 7.250110741514732560e-01 7.369260270847058925e-01 5.773075317241297411e-01 3.029000383771221494e-02 3.743925501057127764e-02 5.487066530346109694e-01 9.967837038369417590e-02 1.221685923248972960e-01 5.226466969327693279e-01 5.221007050608804656e-01 1.192380741213351636e-01 7.601443081047751238e-02 5.922291728260701410e-02
2.368251408024869137e-02 2.573297857589620583e-02 5.802521392972025127e-02 6.473064550646952242e-02 4.377251231294965184e-02 4.618597941945147556e-02 2.553681854121339079e-01 3.041472994947699848e-02 5.075574170273334379e-02 5.818211191166922092e-01 2.216946599820870251e-02 4.961599001992595404e-01 1.092622667499739547e-01 2.055707881646130220e-01 1.913111395381323909e-01 2.927400444335088170e-01 5.060053679580363006e-01 6.142055535819284096e-01 3.546022284122392620e-01 7.708910705993184120e-02 4.608059498062319626e-02 3.312870838106422577e-01 4.797787486522441247e-01 8.103300563751870689e-01 7.385490458243950673e-01 9.778791106864532789e-01 7.924284244796313548e-01 2.443035803592455979e-01 1.135520733344076300e-01 6.734638411527721358e-02
3.095478627723914980e-02 3.551713368726932413e-02 3.457092825371270439e-02 3.247827633625554461e-02 4.682001144643709034e-02 7.862110190684590272e-02 1.298487712386304505e-01 4.106940254218529041e-01 2.164208799795574178e-01 3.711898667494747256e-02 2.980875116135611042e-02 4.024219928218317893e-02 7.868969513039722474e-02 1.070942958894351288e-01 1.413655816315018687e-01 2.535653374964070839e-01 5.457607871698780810e-01 5.486766376963533309e-01 2.595254313463382645e-01 8.883682147584230637e-02 3.809033537712394613e-01 6.871711462031401263e-01 8.766965022016913744e-01 9.158158605794981533e-01 8.290485407879183422e-01 7.370872476488102842e-01 1.115798087623991020e+00 2.032529300429721242e-01 1.596515289509255475e-01 8.679398917292234505e-02
7.853165405691052425e-02 6.111344038639701659e-02 2.958349344454143034e-02 4.131233888525023823e-02 4.878462635118007706e-01 7.156558446138060192e-02 3.257521489209690424e-01 2.632599742764398787e-01 2.586227697009697568e-01 1.283856109028081727e-01 5.023819711156995993e-02 1.607569027171681583e-02 1.871803533268221950e-02 4.425119097140379348e-02 8.459635598133159740e-02 3.213463153042269704e-01 3.569545672587896012e-01 4.242300222061891057e-01 7.381736738199597136e-02 1.225825341755856779e-01 4.208060880161536566e-01 9.026641737956510037e-01 1.103384118111256917e+00 1.173302569009960328e+00 1.007299255051808284e+00 1.012982846564945527e+00 9.762256478160872275e-01 7.849963573511533621e-01 9.123062355454977790e-02 6.854210965592216764e-01
3.173067140158013916e-02 8.689675818985291567e-02 1.486308487534610534e-01 3.815567711132878542e-02 5.704226013052483835e-02 7.656693578764579844e-02 2.061336010826596010e-01 2.583898243305164932e-01 1.774382509891683501e-01 1.541151061848972936e-01 3.847956768773420910e-02 1.592879482734488594e-01 2.470115229881172381e-01 5.845682298632707274e-01 4.139483046194469829e-02 1.545848640948803698e-01 6.983369458871999114e-02 5.582866746291853532e-01 1.765851500010722774e-01 4.600307951236259213e-02 1.703434367331365940e-01 9.047182664187070067e-01 1.141373854368139540e+00 1.213310148900710095e+00 9.065192418405069175e-01 4.313396346800167924e-01 7.158614717813925887e-01 4.879716007032714464e-01 1.272624142324533247e-01 4.967042357471125880e-01
6.689564320864389568e-01 4.262971806830681554e-02 5.898419132841020707e-01 2.338558436450434430e-02 3.659923938027205559e-02 2.098133014422579740e-02 1.082205978112032313e-01 1.402064056735392583e-01 1.447963261580727801e-01 4.353945496356412953e-02 4.398576704531954040e-01 1.138982602879843459e-01 2.004130121907010398e-01 4.844953301278140945e-01 6.136272636539340936e-02 2.467120469551716683e-02 5.269898115217641621e-02 4.419365190857141856e-01 2.791868573230587777e-02 1.093284900388746955e-01 5.764875279966973354e-01 1.093082673881454303e+00 1.174977448395260859e+00 1.122345904143688733e+00 8.698651042081845253e-01 6.439977695055014717e-01 6.298658426741543526e-01 4.444883369786981619e-01 1.013103068400831586e-01 3.810750143289154956e-01
6.385534489167665750e-02 7.341690420356647429e-02 3.211823087253153075e-02 2.584445700806930341e-02 2.760126570504862348e-02 1.421533530206954554e-02 7.336497595381642756e-02 6.207694059480657611e-02 1.756886772395177543e-02 4.800868483755304506e-01 1.977596978022064522e-01 1.780367995294714900e-01 1.008040361229897014e-01 4.656387280875017715e-02 9.845941096777822976e-02 2.802062762621584935e-01 2.809111852834461978e-02 6.068922547548022406e-02 5.735900902576819560e-02 2.263282952759193833e-01 6.223176895413389254e-01 9.287834802251754285e-01 3.791173830467230443e-01 5.673442794346764684e-01 7.126909688311886537e-01 4.024552241925610785e-01 3.251714613244849339e-01 2.883621591989689592e-01 2.132994160194590927e-01 2.319729060316311209e-01
3.526384767531261233e-02 5.072426591763397330e-02 2.960382122037865105e-01 2.536353388264190878e-01 2.357803535603157641e-01 3.465010696371260135e-01 4.885575632272771696e-01 1.238725227951036623e-01 1.737209797892632357e-01 3.069640308976835652e-02 4.630416913387283562e-02 7.445753376578966021e-02 7.187656416878769605e-02 2.271368668085385623e-01 5.026545278782820203e-01 1.732387138521114811e-01 2.465030995501301669e-01 3.379880526350254599e-01 2.278033985992566068e-01 1.705084395135909037e-01 1.366552138386194770e-01 5.054057109381124985e-02 3.994196991745491143e-01 3.799129971657451421e-02 1.324624567354789340e-01 5.328925482752657622e-02 6.015475852444920196e-02 3.065484232071458148e-01 3.960782303694682094e-02 3.697219278880702759e-02
8.059113536668813249e-02 8.194153318061946079e-02 3.351488290789984004e-01 1.984049688343601237e-01 3.377270975291465360e-01 2.679739838802228657e-01 4.227348967376408639e-01 4.690746630913528864e-02 4.184651218346500945e-02 1.818362912305826473e-02 4.524027321651635791e-02 8.410939610768790320e-02 9.258683945234882917e-02 4.347839566070912376e-01 5.678324835362962286e-01 9.534987235924560767e-02 2.654303382137706557e-01 4.829318834615122236e-01 5.345699797025325051e-01 4.584298168550300923e-01 1.202927660525335840e-01 6.378824095856557852e-01 5.023491563317282471e-02 1.012815488100199807e-01 1.849163489939573135e-01 5.352016559512136340e-02 3.488626920896554795e-01 1.427494204918298704e-01 5.333430045387429347e-02 5.118507033112255217e-02
9.834750156651350661e-02 5.186354784820970121e-01 1.882653939332099846e-01 8.313998934018282383e-02 1.100766224056794473e-01 2.539650707952102460e-01 3.439411758518266526e-01 3.918580799006037008e-02 2.104271692098641511e-02 2.372570631920135897e-02 4.270105989512775618e-02 7.241229251324583782e-02 6.801190463961361010e-02 3.325428894302289717e-01 5.246755113816731902e-02 1.427574780641346630e-01 1.998791831197503366e-01 4.447742210300566490e-01 5.431685037047083719e-01 4.544030334369200674e-01 3.193305771707529717e-01 3.904335126955503776e-01 2.708036400992947512e-01 4.882636770791718428e-01 2.449224127913891824e-01 1.271913237133916186e-01 9.882688228365693606e-02 2.409854064878580726e-01 4.214783209972641775e-02 3.809457639334826173e-02
6.015762769492487283e-02 2.658035335804039348e-02 4.067669010429856291e-01 4.513494147169876403e-01 2.877594525065631584e-02 8.298479494684088964e-01 3.618966348670702993e-01 1.501433793227527624e-01 2.184043889943089733e-01 2.722306612920449842e-01 2.491977098464098761e-02 2.946540785006537821e-02 3.938855499794746695e-02 7.973477855642946421e-02 4.250749361338021504e-01 1.063329146265288988e-01 6.784079582253992047e-02 1.714929922605208656e-01 1.938010168152913826e-01 1.956178710620383454e-01 2.140521871274356225e-01 4.874524311047560010e-01 7.911188323487000629e-02 1.379140260808114915e-01 5.627899960120631428e-01 2.436348503913428887e-01 2.242669498919369619e-01 1.711147954607188659e-01 4.829446391949864664e-02 4.221076606692918815e-02
1.932161213401017291e-02 3.871939262808323234e-01 5.217016539166829947e-01 3.436715541589131784e-02 6.372135360469486365e-01 3.046169625092354782e-01 1.470637203355759925e-01 1.048468088946490628e-01 3.276785436817738484e-01 2.225518401989609249e-02 8.239298056334158626e-02 3.073226443714840994e-02 4.731882620056263727e-02 9.338344386315397538e-02 4.099867574727909525e-01 6.999460750123005504e-01 4.014438013838351194e-01 1.689931743635113837e-01 2.317750134179845378e-01 3.870429975430760283e-01 6.807616359824528729e-01 1.613096553850047465e-01 8.456688887391403120e-02 4.097641410773287807e-01 9.376686974830799048e-01 2.904673230630977487e-01 1.415317416147746088e-01 1.952088805330320920e-01 3.912061741427044215e-01 6.672885513072494834e-02
1.993407733685977415e-02 2.404448389364619021e-02 5.052889661019885903e-01 4.333547045341170079e-01 4.488347180679497783e-01 1.775993677949326832e-01 1.175202015837890218e-01 1.232442325598897825e-01 1.372297909199516885e-01 5.293380602179819094e-01 1.536277455311064188e-01 1.600518854474922148e-01 1.348577220202139271e-01 1.551606340279376162e-01 4.283323237998434840e-01 2.902579396472997897e-01 1.779822176486481333e-01 9.637167058832592226e-02 7.877449120699800411e-02 5.782820078676020187e-02 4.649243277552869008e-02 6.838553072106098862e-02 1.058588172864070726e-01 2.538886929173840290e-01 4.351407217416400353e-01 1.959881840741390935e-01 2.876848926167935305e-01 1.976669379333835797e-01 2.044369989319214653e-01 1.351069060262174992e-01
2.306076230769861166e-02 1.728730469071836778e-02 5.069128529373896352e-01 8.141036181211999123e-01 7.707565449870691365e-01 4.281655859232704753e-01 2.034006824581835113e-02 1.614232170010501330e-02 1.889679319853239392e-01 1.332957632992123054e-01 4.960766012361411681e-02 1.198506484667273414e-01 3.177494064165237719e-01 3.283138744569208400e-01 9.786949529481537846e-01 7.100247367951717514e-01 1.998318405518489105e-01 2.084419711511275308e-01 8.896122651220965405e-02 3.829824086282244966e-02 3.732630535917344505e-02 5.862161558607333067e-02 8.977203567073747947e-02 2.750693079677415387e-01 2.786501184507915174e-01 6.574049310873313068e-02 7.243609684438429008e-02 9.295625842488036694e-02 3.031567548251065114e-01 6.216756261128875832e-02
3.113111921210697658e-02 3.320118582377599992e-02 5.774202255579981014e-01 4.646398927056470674e-02 4.717743087839754851e-02 7.752147277188393970e-02 5.159742758170995230e-02 4.772699244369922877e-01 1.879325557502676824e-01 1.061432207124736182e-01 3.174746035575826825e-02 4.238698766426113318e-02 4.792197806243979341e-02 1.802185805371348537e-01 2.191644992034056105e-01 9.273890667925954734e-02 6.924145415594354369e-02 6.623538334697003094e-02 8.449951341945299843e-02 4.759526937896080279e-02 3.380125166400818615e-02 5.045727169702229203e-02 5.761503009337965581e-02 9.660321965679612155e-02 3.023871683044086489e-01 4.768253129955292435e-02 6.918388913331123546e-02 1.132809577019400493e-01 1.368523088898312146e-01 2.723642817008352091e-01
1.746241966175465093e-02 4.805014339389578060e-02 1.493230604879547917e-02 1.665757626271863537e-02 7.294613592844644001e-02 7.806776556643878207e-02 5.675853913147341223e-02 3.366150766087713242e-01 2.600243320209915110e-01 2.371388207751461419e-01 9.542216293933269977e-02 4.824160099835846094e-02 3.112023793180530157e-02 5.032447849384022454e-02 2.330486607863369586e-01 6.077965975431280643e-02 1.514311059785239666e-01 5.343108480033633562e-02 8.958760208318315710e-02 1.819934880248272047e-01 4.707200981467863504e-02 6.597645736611913725e-02 5.754494063250849278e-02 6.352574147634486301e-02 8.454942522209871192e-02 6.488014500072269986e-02 7.649964045583476646e-02 9.445926500474802201e-02 1.275266373177411372e-01 3.144623609800704656e-01
