4.656955655505826686e-01 2.700967606756758416e-03 2.346422988246519258e-03 2.957809256987876771e-03 5.743944269603901143e-01 4.835718593214117719e-03 4.722481785141604237e-03 1.259156422887255933e-02 2.261682437966504311e-02 1.002498818529902122e-02 4.605080731179479053e-03 2.884507898905332990e-01 1.698938852055423276e-01 2.170976613101058012e-03 2.483476165377384616e-03 1.763552462402227239e-01 1.827571186663118829e-03 3.058802590375209879e-03 2.651086855142194450e-03 8.982714416475870651e-04 3.157261649239451184e-01 4.642555898323327129e-02 3.652760458644455088e-02 1.459423254905044265e-01 2.816330373760945749e-01 2.201041389552308436e-01 1.016026807007841953e-01 8.928835116407539407e-03 8.423947965943864163e-03 1.045955016196583806e-02
3.642711992409978228e-01 3.268707323812868049e-03 5.885083288686271223e-03 4.769011318090536633e-03 3.309622178006091549e-03 1.469503097240241161e-02 6.892554452045559360e-03 8.427849744025103090e-03 5.393397276430577508e-03 4.483110996073531168e-03 3.127576306002253018e-03 1.715888183131520917e-01 2.294045695570401389e-01 1.737087779574096255e-03 2.375604821726077284e-03 1.503891654300548676e-03 1.788175806503099251e-03 5.559753893330861285e-03 3.993378906430042688e-03 1.151311249645693138e-03 1.900738092440077409e-01 4.323510955778855219e-02 9.198125894951454662e-02 8.176954027483834819e-02 7.167770273576323792e-02 9.560613015402970316e-02 3.389810456653376269e-02 8.762713264689962755e-03 1.245205384787245219e-02 1.244225132076212832e-02
1.849231514667457055e-02 1.867273454344601027e-02 3.952326715080491798e-02 3.187079444108709136e-02 6.813325594584151990e-02 6.884427426081980717e-03 3.236177968618880185e-01 3.423215375527774440e-01 2.071429290200196144e-02 6.111928044401512827e-03 1.594827921952903654e-02 1.022571390261269378e-02 3.642680720123504367e-03 5.252391734870202368e-03 3.261045649023496806e-01 4.064120881104310232e-03 2.607182850241876893e-03 5.057250341121146200e-03 1.591988970256145997e-02 2.519207859141595410e-03 1.187945198980197570e-01 3.493667867409281508e-02 5.402506595312036447e-02 1.901046612002460501e-02 1.134101058461616657e-02 7.530175013836171855e-03 6.723046401870894952e-03 5.332746024566172201e-03 9.069687559048430700e-03 1.027488406704001565e-02
8.479503578102013522e-03 2.384416012034597243e-02 5.241560331833355901e-02 4.201259259842874544e-02 1.742472051515439949e-02 2.676343712937509674e-03 5.455399960582185681e-01 3.632499763025329176e-01 2.187880289778949827e-01 7.507663824592569063e-03 4.702151485416977347e-03 9.112919073486894228e-03 4.019829620243098138e-03 2.642601052549088409e-03 2.435575591200666856e-01 1.900294967987448402e-01 4.053748094906106658e-01 2.001752898577389451e-03 1.354461287262422563e-03 1.104454431178060643e-03 2.323713221252932393e-01 8.075938246729186254e-02 2.555564178361217562e-02 4.943307316089153025e-02 9.176208571195967195e-03 6.738001526015195350e-03 5.753306876948177835e-03 5.462522014358599416e-03 1.092829166642832889e-02 1.206866399931915725e-02
4.849127802109804743e-03 1.464749390796733601e-02 4.079194571035978101e-02 1.580143703669675131e-02 9.131248052112451302e-03 3.461291920338692707e-01 5.264805106274130786e-01 2.911961294519829768e-01 1.327387705243056604e-01 1.715217007263020177e-02 2.105418131784286134e-02 1.772811917174480292e-02 2.565738174776355414e-03 2.081062902608004240e-03 2.910167031199137888e-01 1.102583931195015299e-01 3.487626446659365491e-03 1.921670274287627656e-03 2.981432734378392305e-03 1.640651143093366932e-03 1.096073681331483128e-03 1.363175377800268373e-01 3.053415921985956905e-01 8.334401474616785765e-02 1.652134164491149762e-02 8.933742415631329425e-03 6.150095685755054692e-03 7.162529745067470338e-03 1.107250568058481231e-02 4.155089292264509820e-02
4.780506371923290247e-03 4.854989305305646742e-03 2.172880267749351807e-02 1.737039715813826213e-02 6.906259591573940537e-03 1.978996883945344232e-01 2.373899576657035049e-01 2.513257810510065027e-01 2.299729717888172043e-01 2.630421134935602770e-02 2.041382153668304389e-02 1.070514302500777219e-02 3.134726741420485463e-01 9.737718337485780362e-02 7.552774624826941174e-02 1.254555554699627040e-01 1.993479710640088266e-03 1.745034893231194040e-01 1.589778124666211840e-03 5.303348886848131653e-03 6.234276028557431126e-03 3.547290171811092081e-03 8.385918906229469956e-04 5.043310032309138158e-02 2.475579067537849592e-02 2.331014729831239196e-02 1.431942136928200660e-02 9.967291255866447472e-03 1.299676573412281502e-02 2.398874453408146590e-02
1.703658119916471592e-01 2.751754311176642931e-01 2.905199670271901846e-01 5.363643449162200892e-03 2.563480628362354696e-03 4.234408613017854629e-03 6.390779782986743228e-03 3.635022581096319406e-03 4.308933694365663959e-03 5.026918912464654193e-03 3.865259425309284114e-03 3.941601525503884984e-01 1.623119496261049011e-01 6.463495792990291144e-02 3.462047795704097097e-02 6.255465634797276187e-02 3.717573293866877626e-01 1.771594939099396249e-01 2.681738291224876596e-03 3.575291796715365528e-03 1.583089398273949391e-03 1.478753421693990155e-01 5.911963872380972262e-02 4.593591976665493959e-02 1.692159412992346249e-02 1.729886537396083807e-02 1.488075626130742034e-02 1.308414076372512586e-02 1.507762099630347713e-02 3.683373236010487051e-02
3.511529261540706215e-01 2.550607910428749191e-03 3.828539443486349003e-01 3.152415270693729142e-03 4.772340554557732116e-03 5.321476309598270962e-03 4.708661268117908354e-03 4.441161864661783906e-03 3.575193102788554525e-03 5.230276202551972231e-01 2.062480157457053376e-01 2.481444814898451853e-03 1.328023396614089191e-01 4.474109497749602371e-02 4.637451043895156333e-02 8.664499537933119389e-02 2.381000104265245179e-03 3.746270526110988004e-03 3.239461700344625078e-03 2.254999575463551096e-03 2.150626875160925322e-01 1.032605443893778868e-01 3.528752127939156075e-02 2.742076247478435203e-02 1.285009729386648106e-02 1.342793802280452600e-02 2.053220340611295464e-02 2.614741689852248530e-02 2.644011618940745809e-02 7.928663264284373235e-02
3.724427892487392790e-03 2.415654671702559611e-03 3.420163233524701196e-01 7.953545989096855867e-03 5.069181570901270563e-03 5.475346045029921838e-01 6.874843511086451212e-03 3.087711341165210593e-03 2.598584156401385469e-03 2.555829876250490917e-03 2.270674273816438143e-03 2.980643534658911596e-03 6.444137718204547005e-03 4.144817121956275233e-03 1.658454389212172808e-01 1.528934891059210988e-01 2.319447984005666100e-03 6.940516314525033495e-03 6.754357685056729121e-03 3.619028842713154503e-01 5.837258102893551348e-02 4.569291591208541475e-02 4.349846900636627350e-02 2.667321822285015701e-02 1.539775594255973941e-02 2.360923936307997642e-02 8.821317520712765314e-02 1.796940185313440075e-01 1.094413371731047880e-03 2.631441728935881574e-01
6.087959853711714595e-03 3.946383801384413179e-03 6.241477807735443251e-03 5.703991909672773142e-03 4.881036231899788490e-03 2.452140793717269562e-01 4.456635711849779233e-03 5.078024494709046932e-01 2.186045298055412645e-01 8.040155727503309202e-02 4.302913923304700280e-03 4.150050987637273793e-03 8.714535282026033419e-03 9.379060438414188461e-03 4.450050432576902783e-03 4.822947667988115514e-03 2.551202966959555465e-02 2.613160641860647060e-02 1.038532719856162176e-02 4.548505322898768050e-03 7.224369615946749090e-02 3.456662495719711736e-02 3.547589587878140910e-02 3.720936612445419067e-02 2.030694953951412904e-02 2.614159861170015087e-02 2.456503377285165768e-01 8.955614616172666688e-04 1.182807396854558893e-03 1.414031734106441784e-01
5.051870510982591281e-03 2.626959018407944331e-03 5.801189667811742535e-03 4.854666033146632677e-03 6.022162409286880604e-03 1.411493066609409985e-01 1.212882185463417112e-01 1.079571041641894519e-01 6.921097057726495472e-02 2.181107855178514646e-03 3.381154915232563452e-02 5.557222705479022973e-02 1.139929779882864480e-01 5.631101269412354393e-02 1.041102281952715342e-02 2.026992907803785993e-02 3.732939277478565521e-02 1.025726014135823136e-02 2.435002447919675222e-03 1.445193491081797621e-01 4.958607437220848013e-02 3.456197036795069510e-02 4.092765303921377940e-02 5.566340360094360756e-02 5.859507737928634080e-02 3.162283901003669351e-02 4.992539012094183992e-02 4.009694941586641748e-02 3.598121800731336056e-02 2.580508621652889342e-02
2.230842435008342228e-01 1.309551539830390299e-01 4.772345049072968665e-03 4.605852450773206645e-03 3.521226083697441903e-03 2.061801337897922193e-01 8.160772633752053085e-02 5.326617627613666056e-02 6.690409490308614482e-02 4.231921533079398799e-03 1.013083284396559987e-02 6.510363980090799751e-02 1.158971466002900047e-01 6.043094538216187139e-02 2.199990692487760122e-02 2.484042672973393873e-02 2.734856049894934804e-02 1.613252878650514241e-02 3.971501445021866257e-03 3.098854660959933227e-01 4.588985916366829926e-02 4.068072052794263760e-02 4.587390206919569891e-02 8.114035795496205017e-02 7.710099179255984481e-02 5.463038825285709138e-02 4.160225852847886790e-02 3.742429470779297385e-02 3.967181945030343743e-02 4.203411523391295535e-02
4.337292643074891485e-02 1.118661325731243467e-01 2.720916737821845732e-01 3.104924970489082118e-03 5.028852187557307785e-01 1.608509024846281055e-01 8.329955405018311942e-02 7.039994952764300207e-02 8.962567636184405606e-02 2.096886856191147556e-03 2.070225496828937417e-01 2.061683362064808608e-02 8.590029357771640506e-02 3.690739105351721616e-02 1.169405331589122403e-02 1.359035506245147990e-02 5.029326001042782809e-03 7.396432873999263247e-03 8.444448683923695687e-03 3.152188830201665005e-03 5.501337451182817390e-02 4.928293906207623781e-02 5.923675717651646910e-02 1.013234931994123206e-01 1.324526217948324980e-01 1.241966135400236759e-01 9.164446867863884627e-02 8.229636406019971706e-02 6.180348286391601498e-02 4.700511304101398502e-02
3.466992871399660753e-02 9.978498493235198052e-02 1.822566256700998977e-01 1.327265837039359464e-01 7.835866284805620419e-02 3.113480834909624906e-01 3.886608795419497359e-03 3.207771936763186872e-03 1.290894128181339362e-01 3.939427172686944811e-02 1.565559371949568068e-01 3.313592905550779514e-03 3.878076839146177290e-02 5.273855316249292935e-02 5.678126976406642351e-02 7.730463245083078749e-02 6.992290098797518394e-02 4.546499913376655239e-02 1.243883655614946848e-01 5.813112485796614187e-02 4.781552072533718292e-03 3.416768757675870960e-01 2.568394698657400221e-01 2.529614011919764562e-03 5.829474513099876243e-03 5.389538731972365673e-03 1.451322003611158103e-02 4.531396684110064639e-03 9.918192629867125798e-02 9.462225729107387462e-02
3.120940514360896062e-02 3.139019986908588022e-02 8.702224775784747623e-02 2.480722945883859828e-03 2.366551524037892040e-01 5.587149197599993594e-02 2.574395529179439573e-03 7.306586515377140600e-03 4.843502559479422390e-03 1.578541265384244829e-01 3.355284196189743384e-01 1.628738157430574193e-02 3.422796837750421983e-02 4.373834828128369406e-02 3.990302402959107486e-02 4.873011448932864503e-02 8.368312025952240329e-02 1.454019162164710277e-01 1.492561033557583683e-01 1.188367940207099849e-01 5.076718901644507349e-03 5.284869275233781277e-03 4.622539369745239796e-03 1.442895438587862497e-02 2.058678168573550848e-02 1.042508732331289822e-01 1.030341644694285075e-01 2.005166812949469787e-02 1.156826965836023763e-01 6.878237342516620167e-02
2.739916812462713305e-02 2.989652297183742133e-02 6.911099258573377702e-02 7.679121006410696837e-02 5.099280334567264650e-02 5.830218206013518256e-02 4.151631171212810112e-01 3.902488860328087381e-03 8.027671281329144121e-03 2.845334413704335690e-03 2.900624409859032214e-03 2.464270467399718497e-03 1.899911243695658752e-02 3.905806300170187179e-02 3.703922765230920067e-02 5.754125960074193968e-02 1.001871790026254289e-01 1.228609897568268272e-01 7.204980518439196846e-02 1.593812101413513704e-02 9.526852864557512970e-03 6.488419816212845359e-02 9.307749769505840876e-02 1.558461451306251133e-01 1.459084460116750748e-01 1.887664411357699579e-01 1.504919889166586588e-01 4.216075516064703849e-02 1.831159526987728714e-01 8.232822801867799301e-02
3.334260207089886907e-02 3.865429412477855431e-02 3.864784672464837562e-02 3.714918356204659905e-02 5.700779968192250247e-02 1.192516055441538714e-01 2.259113185241915997e-02 7.530343263682459654e-02 3.666559271905229372e-02 6.189395209958283711e-03 4.512622960965637781e-03 6.817698580841818727e-03 1.337386997107870359e-02 2.008605743323958054e-02 2.696870940983187026e-02 4.915852238529203749e-02 1.069055401856189996e-01 1.097513404898893818e-01 5.310156556859370325e-02 1.846694788063527048e-02 7.852711545449268804e-02 1.399437366965339546e-01 1.765336769913948833e-01 1.815156523139079825e-01 1.602994470184088416e-01 1.383175557704276470e-01 2.035844043106442292e-01 3.518502974416717888e-02 2.745042961745901566e-01 1.167036603833604275e-01
8.024872114859468719e-02 6.314470775902221444e-02 3.346889794915122729e-02 5.326539684197992286e-02 2.148914178251909793e-03 1.082960445390974275e-02 6.050181349437635386e-02 4.923656306184801684e-02 4.837983308527067650e-02 2.393392623938325053e-02 8.605093510850805524e-03 2.241876997443871707e-03 2.178528176021786878e-03 5.730106535913690596e-03 1.313703989949367539e-02 6.156559351145267367e-02 6.560874377810259339e-02 7.844365693590528432e-02 1.395229221084072144e-02 2.487444658002147674e-02 8.660622358431643852e-02 1.837414068068734807e-01 2.229958490327676457e-01 2.321455157438018224e-01 1.931564911840142063e-01 1.857270479833726395e-01 1.716881011204264285e-01 1.360739828372735383e-01 6.035218734803734532e-03 3.975828661212787475e-03
3.615866014105685589e-02 1.002272417738046956e-01 1.886755964793460083e-01 3.930017635579501414e-03 8.521199839233164000e-03 1.199017952312267377e-02 3.793688968890246427e-02 4.724575091016456480e-02 3.243487798215956286e-02 2.505060405958359562e-02 5.197343670839071027e-03 2.019006127503835679e-01 3.033635388924948439e-01 2.171334301253016914e-03 4.771336946990181738e-03 2.852354427968600836e-02 1.102786147796892477e-02 3.600648685450248340e-03 3.250572743441479395e-01 8.963896953596207917e-03 3.372872219810155170e-02 1.778148549887669239e-01 2.234390874971164120e-01 2.343178292830188081e-01 1.712383917954952428e-01 7.875864229626815260e-02 1.261894962072285797e-01 8.661456597373501376e-02 7.810247217248942123e-03 3.083089306532291966e-03
2.923559717105815754e-03 3.639767382286746879e-03 2.377661676798795056e-03 2.873566444878562949e-03 6.594088242544545765e-03 3.756724227936223195e-03 1.938964533217244976e-02 2.497029708015320246e-02 2.306093927798557458e-02 5.432063978828916354e-03 1.361265008120078569e-03 1.217383891111149113e-01 2.088234822636672039e-01 1.500408148398124034e-03 6.003451969211809694e-03 4.072533804465899854e-03 7.521873492785961443e-03 2.254246468772538696e-03 4.271754477504960054e-03 2.031121082827281460e-02 1.092875880264249644e-01 2.075247704143130534e-01 2.239079239999166859e-01 2.126170460308412224e-01 1.621451704500487812e-01 1.174981951896801047e-01 1.124246264790974281e-01 7.574993481072936352e-02 6.820124524095144344e-03 5.556593237735933943e-01
8.115110547423396575e-03 7.171421101837611133e-03 3.589552209585271641e-03 2.503111317629365222e-03 3.146307160212051188e-03 1.669879499579012038e-03 9.512225328376242017e-03 8.456678527991543307e-03 2.323163913724159320e-03 1.280140300852057383e-03 2.062914038744145528e-01 1.624958894333723147e-01 9.526232965219610938e-02 5.128002937014918688e-02 1.294800529017234858e-01 4.241118761801929704e-01 4.057994197265326133e-03 9.333711784100952313e-03 9.048865365042653777e-03 4.077098807559570437e-02 1.129790741777126073e-01 1.667378619001818052e-01 6.914979624721437346e-02 1.034778260080014139e-01 1.319417995979001723e-01 7.359722371103774585e-02 5.413936645958181831e-02 4.446675274097863784e-02 3.612875168844203455e-01 3.295966595928775389e-01
6.492962023803691349e-03 7.212835939857630864e-03 4.106716589153183161e-01 3.016947194855932324e-01 2.640174164405457158e-01 8.066430324911368511e-04 1.149476295127580330e-03 1.488872630184696066e-01 1.952718909167074357e-01 3.044002371856194614e-02 3.976347499377441003e-02 6.030616474767393209e-02 6.593579613276044638e-02 2.302228699906455622e-01 1.564884589066770082e-03 2.061409590080253915e-02 3.936673626980114610e-02 5.711050241900331170e-02 3.909715240326317592e-02 2.984049500556950479e-02 2.174127919535838102e-02 8.011944661671375686e-03 3.186707882087521509e-03 6.841559957745223935e-03 2.445027032290351954e-02 8.154529033232802565e-03 7.433375958638631029e-03 5.422878608926101629e-01 6.215938917560331900e-02 5.080249032969509637e-02
1.358515364466101986e-02 1.013402714093094778e-02 1.068071906792682690e-03 1.929913339831913210e-01 2.993151635854498505e-01 2.400767554255922309e-01 7.473594461183754884e-04 4.109662654004989785e-02 3.506301131961988421e-02 1.512916596494585236e-02 3.577363925707589820e-02 6.749750323325146018e-02 8.903968843120713128e-02 1.106247901642837522e-03 1.888987053557984177e-03 1.221555550086117839e-02 4.424135099555460970e-02 8.219403996303262239e-02 9.288392528211422694e-02 8.189030572477497272e-02 1.810015793865622086e-02 4.182667774478831049e-03 5.343348638473999733e-03 1.303768450525156879e-02 2.875470054825362415e-02 8.400155171542290217e-03 6.709827762640109272e-01 2.590829987354997255e-01 8.142130986985890440e-02 7.280718579674212709e-02
1.665481729547645812e-02 2.061690314126219965e-03 2.243109924933435473e-01 7.688135606365437136e-02 9.171163485266642379e-02 2.060593683358835637e-01 2.709357345883074419e-01 3.088842464453965542e-02 1.726006661767506140e-02 1.985154151586574975e-02 3.501125690092472820e-02 5.955800383773961204e-02 6.703231913780721696e-02 3.675405815954719824e-01 3.512035525021881162e-03 1.775942890734563684e-02 3.390673284714688929e-02 7.721264065655435160e-02 9.605538826642343042e-02 8.236373274559136148e-02 4.297213138752784684e-02 2.578400027325058672e-03 4.674790463604285851e-01 4.101794161821688614e-03 2.346908259729777249e-02 1.397159109530165741e-02 1.253910574720893539e-02 4.805372395953015352e-01 7.314558643088292511e-02 5.581812813953729996e-02
9.071711805589490613e-03 2.746500344493353358e-03 1.055523210213106739e-03 9.587973356752982693e-04 2.051143566853413230e-03 1.386367876656136467e-03 2.861367809234474646e-01 1.196582560606890139e-01 1.819100090143590531e-01 2.352806526793041475e-01 2.176515753563570271e-02 2.438857537319790575e-02 3.790505057497874086e-02 8.558212118215696718e-02 1.273609529338706964e-03 5.520737436415720789e-03 5.490665897568735958e-03 2.315491733448792402e-02 2.925778459808344237e-02 2.548031478029741739e-02 2.250772534085250173e-02 3.040863601197834123e-03 1.212571732521808832e-01 2.301421113575571886e-01 4.214400203359163800e-03 1.050319058760986086e-02 2.816514347139800756e-02 1.572260599016353858e-02 8.740102528149548688e-02 6.535808130353661094e-02
3.237779798980283934e-03 1.256942569641661140e-03 1.328549737527460811e-03 2.186663170042943850e-03 1.149810245030056816e-03 2.484792327619536056e-01 1.169335968001788961e-01 8.396567688025315113e-02 2.699174861206563580e-01 1.999822451115114939e-03 7.000170080451138810e-02 2.397686054707331288e-02 4.046255972240541537e-02 8.863698930598694348e-02 4.194666160187334181e-01 1.980358422457491070e-03 1.353630077915855606e-03 2.328340395720090994e-01 3.517232767524109405e-01 1.920725551033294811e-03 3.591733809223418474e-03 2.387455635949918276e-01 1.207536394342269143e-01 6.125813989783541746e-01 5.906374360928959288e-03 4.959586425019608669e-01 7.316959702887766703e-03 8.121465112460504038e-03 2.851581492124512316e-03 1.004593241325930919e-01
3.281921891369942845e-03 2.578462281153698528e-03 1.243063089104511293e-03 3.849342027500425312e-01 3.741950922387285994e-01 1.444993373833165784e-01 9.768100160642502472e-02 1.022783310734915463e-01 1.146462833354705974e-01 8.756760388793235171e-04 1.270148454950185968e-01 1.197205237384636328e-01 1.127830131243423850e-01 1.404004455352224068e-01 4.065302064974783969e-01 2.847896928829874996e-01 1.910942904111906371e-01 1.134706418644273462e-01 9.898727897944555043e-02 7.556980835275620145e-02 6.027585508905404510e-02 8.828162574143696983e-02 1.408639988555298872e-01 3.537073487040555131e-01 6.242947305041760542e-01 3.006405981884840428e-01 4.813405853995934569e-01 3.058625660226580445e-01 3.041917986982922151e-01 1.939915638695507427e-01
4.445317583067421446e-03 2.270010179398269934e-03 1.277462639651307441e-03 1.706850424089815122e-03 1.443314079723308913e-03 3.783942972330451848e-01 2.641394790637291348e-03 1.983291814726664912e-03 1.542983963299977557e-01 1.110182046911180609e-01 3.922535239477628610e-02 8.928451403768089545e-02 2.646487859877507121e-01 2.941476445307459886e-01 2.265923779520970759e-03 1.837038297278564651e-03 2.181362019030539667e-01 2.576370142689086151e-01 1.183001526452862884e-01 5.124113995546370620e-02 4.659919739118900672e-02 7.122603581829806130e-02 1.109227882968368550e-01 3.549872428823742654e-01 3.746760481756352679e-01 9.194430414639206961e-02 1.038581713814720475e-01 1.303646916041292514e-01 4.113249854535483974e-01 8.483008609450823356e-02
5.970946264161673851e-03 5.059073508363987927e-03 1.516976683579554681e-03 5.074209959113585092e-03 5.664552910965952627e-03 1.057741907728245237e-02 7.102179939936935707e-03 4.146440963552648906e-01 1.523743429447229625e-01 8.731714343157684355e-02 2.555102012264485675e-02 3.164810476536622508e-02 3.965007404364975785e-02 1.610195654472423854e-01 2.052410568040138883e-01 9.405533237411101144e-02 9.173846780256331157e-02 1.094182826996695362e-01 1.476301332895115226e-01 8.016171043274158969e-02 4.349637660772351366e-02 5.891428080639930787e-02 6.602629225209327712e-02 1.168262277133817334e-01 3.864822851555073657e-01 6.352827617095610502e-02 9.434273475217608285e-02 1.523371535274681277e-01 1.768875017614028322e-01 3.567346271041142436e-01
3.286605737757700586e-03 7.985414232468441773e-03 2.346932116652603300e-03 2.451521117723402116e-03 1.142637968379946189e-02 1.198283171199263086e-02 8.009536032898051730e-03 2.879866659212861335e-01 2.074347701409746669e-01 1.940183519703485571e-01 7.891737148126740098e-02 3.871101404209913860e-02 2.503367129033221700e-02 4.490202113972585618e-02 2.208338181811457801e-01 6.608014582551256788e-02 2.350623971462111883e-01 4.354435510247959586e-03 8.027477520341337602e-03 3.326579306288531268e-01 6.500790813794510292e-02 8.203549845896869475e-02 6.958813338033802143e-02 8.029767211160235285e-02 1.122234740682090809e-01 8.978070102580130996e-02 1.083923300213433388e-01 1.325795571410511298e-01 1.713376849624038134e-01 4.260876117929093265e-01
