1.389615430553306497e-01 1.958816019354641669e-01 1.736574930574248943e-01 2.220038996122690456e-01 1.685687125896997429e-01 3.623876622307817819e-01 3.439400038231470447e-01 8.896094229134412501e-01 1.547783989898920076e+00 6.692628171796854986e-01 2.986881899231011439e-01 6.461856643503798014e-02 3.453658897867333682e-02 1.104948368853385238e-01 1.097196918315149483e-01 2.039861143677337146e-02 5.832954379843885429e-02 8.073640073343768542e-02 5.704173160532326203e-02 1.602571659169297474e-02 1.245968566341696358e-02 1.731983894258999190e-03 1.275809330469879471e-03 4.599210595982357493e-03 7.745191497536052516e-03 5.155769816224128367e-03 1.971209173024347262e-03 1.607657414342892862e-04 1.364150127461444999e-04 1.483224615805679779e-04
1.210326918083517028e-01 2.494292701553817437e-01 4.538796808673882799e-01 3.713254149797082238e-01 2.598528792437529988e-01 1.135647697917969268e+00 5.109090074189341912e-01 5.961635140432961499e-01 3.623843856473810132e-01 2.883374233190342251e-01 1.912605982852214614e-01 3.425944055478799544e-02 4.068314345798539761e-02 8.076277711512663826e-02 9.661646659730639686e-02 5.300945792242656163e-02 5.270751407357891771e-02 1.338740466438466392e-01 7.725259321784380684e-02 1.822515204004531569e-02 6.093954027160682074e-03 1.258870742189357322e-03 2.389609899220742142e-03 1.813299571733385232e-03 1.309616215400387623e-03 1.398408509308654134e-03 3.865754417879861357e-04 1.079360361949959662e-04 1.620772180871572472e-04 1.666427082384636116e-04
1.608008472641383024e+00 1.463104188591723975e+00 3.097707309734701653e+00 2.499005109126183566e+00 5.346435058761397130e+00 5.289819102017914165e-01 9.265689293474992094e-02 9.061596103533621493e-02 1.326559142972577821e+00 3.706928967098165328e-01 8.981331866945444498e-01 5.241757114806516737e-01 1.679824249727615570e-01 2.182709138807411020e-01 3.610467074577253244e-02 1.301287558022966029e-01 6.965113095766813089e-02 1.095043879028139849e-01 2.731155487133624105e-01 3.470798095858391302e-02 3.023065044433567196e-03 7.750305574138343940e-04 1.018903259449684649e-03 2.892706236342860852e-04 1.333744350791775065e-04 6.603826140925675621e-05 4.265204445443051781e-05 4.381179023557187579e-05 9.349919609657519665e-05 1.286741626532049323e-04
6.991001360651951657e-01 1.768659987255068344e+00 3.890420500712584051e+00 3.116412798852662647e+00 1.294987786439385946e+00 1.973199258160458491e-01 1.517073262131465039e-01 9.595599871285456772e-02 5.512168754710577989e-02 4.906500740314936881e-01 2.947333620032965285e-01 5.398985030938733276e-01 2.175776494247077253e-01 1.254575178572806538e-01 3.123492171902861672e-02 1.989032305280811347e-02 3.375673976625550438e-02 5.021840483524077359e-02 2.799527581165103807e-02 1.891072084485756477e-02 7.530017834694152298e-03 2.192591392827048045e-03 5.685925524429665152e-04 8.536931587386652111e-04 1.174593836748144142e-04 6.178389534044242590e-05 3.707271285358925447e-05 4.775414187481062997e-05 1.265201586311465772e-04 1.803217397023512887e-04
3.753120470649496387e-01 1.013763538673762232e+00 2.825322280527355456e+00 1.095220346446123427e+00 6.334007732827106052e-01 9.257577223588341064e-02 1.413853421744878935e-01 7.754882055069994840e-02 3.489896620432661467e-02 1.215415974129072652e+00 1.489449890047112479e+00 1.236412627505374395e+00 1.667218660094194060e-01 1.158406041044646589e-01 4.471919229096373016e-02 1.342895376302730495e-02 1.210052635640337382e-01 5.836090353437962952e-02 7.833879800768564494e-02 3.715925914236987981e-02 2.189469396423535108e-02 5.085533444834084218e-03 9.104529163322929927e-03 1.886007216844706779e-03 2.707020984393350232e-04 1.032370625534540897e-04 4.970321250495514235e-05 7.899868886430688340e-05 1.633562296385900167e-04 8.067972374187757680e-04
3.453925064354401164e-01 3.097249081393443904e-01 1.387270527379951046e+00 1.109958172842480995e+00 4.417705010160344337e-01 4.838104594846026618e-02 6.085592382597704991e-02 6.672353599165839477e-02 6.318493042087988676e-02 2.005246443426995206e+00 1.614971574778441221e+00 8.669851207255132586e-01 9.191949112535655053e-02 2.258135754741452672e-02 1.364112155638856627e-02 1.739446004869480214e-02 7.917796763547332861e-02 1.826120032101982704e-02 5.200846689682378510e-02 1.545956363885964691e-01 1.586226737194352809e-01 7.703470272950141418e-02 1.523441002918838119e-02 1.447404675427843871e-03 5.082686550282754148e-04 3.325935564077925669e-04 1.414123371156170183e-04 1.357525417109662290e-04 2.398917181012808018e-04 5.894854589776621356e-04
4.633335933431950021e-02 6.288483466088694296e-02 6.582664128885350185e-02 3.305980150469430834e-01 1.570996826496338095e-01 2.687026301250776128e-01 4.286948402168645478e-01 2.550783144021111504e-01 3.134577378540571724e-01 3.980965579168865842e-01 3.285469399171345173e-01 1.427527017113025820e-01 5.567362046324577513e-02 1.749229441367033261e-02 7.233884872687383616e-03 9.867138681721624588e-03 5.219819995575188110e-02 2.284575560383331205e-02 1.064085805380304284e-01 1.291244869955306684e-01 4.970205168950479757e-02 9.543608440336779491e-03 2.860961328787385311e-03 1.626044577342712801e-03 4.272693062441140842e-04 3.003406857970989741e-04 1.767815073575258245e-04 2.169763377802601603e-04 3.423088419280290737e-04 1.122073504138640029e-03
1.099363158112553196e-01 1.817603694778117673e-01 1.029905150921177903e-01 2.145995026764777602e-01 3.167476527242907292e-01 3.548311526806472993e-01 3.193220484821567284e-01 3.038346892972126345e-01 2.445674191765295769e-01 1.481124815454573640e-01 6.372714135386949030e-02 2.079550487017531035e-01 4.311118731256349812e-02 1.242784467568176787e-02 1.088272719682836440e-02 1.693988886770834632e-02 1.265881894359639770e-01 1.847219861775622196e-01 1.469048976374915938e-01 9.223208846491627588e-02 2.074801424007537143e-02 7.766200417477641879e-03 2.001895999002238635e-03 1.176887675076101298e-03 4.126576331257727592e-04 3.129993841867186283e-04 3.484461649480071616e-04 5.982524784268092007e-04 8.036877703916706821e-04 3.155396707035774528e-03
3.117561452833302882e-01 1.927528313104779067e-01 1.080035902996468733e-01 5.918788818516048655e-01 3.595884078255168204e-01 1.473897095336494933e-01 4.685996563431195083e-01 2.047477596145193535e-01 1.658493409875150260e-01 1.751121401345536177e-01 1.655841454764419296e-01 2.291399501402520134e-01 5.005444540795687125e-01 3.079400510198362362e-01 4.274109918050940371e-02 3.599902891306655528e-02 1.420760043134501327e-01 3.894014319638868793e-01 3.446847431263904138e-01 5.034958969039374233e-02 6.461983316309410225e-03 3.924163477629622962e-03 2.825460226284004679e-03 1.358626652130052147e-03 6.158753782417438014e-04 7.192612152147613873e-04 2.056518406184564517e-03 5.526176020897286337e-03 2.098484534159723511e-02 1.342742102652339127e-02
5.473099866621172760e-01 3.479099195838535885e-01 5.270304566799195456e-01 4.551119785956304620e-01 3.626017707717840710e-01 6.782753561043330937e-02 3.037581771993417834e-01 1.215101164266462891e-01 4.697171037848437564e-02 1.866285304531974457e-02 2.863354282808999729e-01 2.887071961544505072e-01 6.282332717381210463e-01 6.935464314882732184e-01 3.332673034923402389e-01 3.630626302485006618e-01 1.783907410922969339e+00 1.654041332797882458e+00 5.894035766835118428e-01 2.273357694939834306e-01 9.055784318736768632e-03 3.352463422895695863e-03 2.590151201108018865e-03 2.202465854603053927e-03 9.932364056462919359e-04 1.016130656134239460e-03 7.576933217987240343e-03 1.709303950077049189e-02 2.739052754240198922e-02 9.038099088059959457e-03
4.506456849117337349e-01 2.327032373404605003e-01 4.977117851732005827e-01 3.935183790128623516e-01 4.540716030646249624e-01 3.895965277333138244e-02 3.070131925495092617e-02 2.421852077941071338e-02 1.337333096263028029e-02 1.267979612818632973e-01 2.069543092746278568e+00 3.543225141994261307e+00 7.652068281545531647e+00 4.055049969238867291e+00 7.952151806403247036e-01 1.628387582610670847e+00 2.855318442159514358e+00 7.237504052917829167e-01 1.565603060577955008e-01 2.754754891549466081e-02 7.726521107084561787e-03 4.296082142154262866e-03 3.943661554837714182e-03 4.527168743228050102e-03 4.127015822978803532e-03 1.856108265123608374e-03 2.426887296150234078e-03 2.372261863479933463e-03 2.541288173990066332e-03 2.129755008537796875e-03
7.814814190916646863e-02 4.535115015401817995e-02 3.914993101567023626e-01 3.653586624231799362e-01 2.643594390690668927e-01 5.584396338621093470e-02 1.955319029953517945e-02 1.093528938601444692e-02 1.149088811143312780e-02 2.276730333368343351e-01 5.757344358154137254e-01 3.875258786259397681e+00 7.348020617633445717e+00 4.184136702187120527e+00 1.652103079670280472e+00 2.004105338822454563e+00 2.193692420698851286e+00 1.256454201271617777e+00 2.972304175023280370e-01 7.835910368944992710e-02 1.013572123562935662e-02 7.720711483914073636e-03 7.357415862942381576e-03 1.169254152886715914e-02 1.015172424897583907e-02 6.405870284077565431e-03 4.298297258867284781e-03 4.055697138473957596e-03 4.448176850200816733e-03 4.801744984481083611e-03
1.371408013599028676e-02 3.471615214469406241e-02 8.589806946615664851e-02 2.381282001051168162e-01 1.478836266477452366e-01 4.250570653660150355e-02 1.882293444964309309e-02 1.313492451052434423e-02 1.353736208922975623e-02 1.038287415143077930e-01 3.616318285093916840e-02 1.133354223986535070e+00 5.100096076680977752e+00 2.444002373763794367e+00 8.562797987147190426e-01 1.091052645948750843e+00 4.199720230637805640e-01 6.303074578292928720e-01 7.262712514278391041e-01 2.686771036200595320e-01 1.681249413191306802e-02 1.379848265410554831e-02 1.499770644756634463e-02 2.436030008254466347e-02 3.055285610995448625e-02 2.688934059168082008e-02 1.828920627476702393e-02 1.534832389140943290e-02 1.051468432510803928e-02 7.164785399983641598e-03
9.649872521724799090e-03 2.714800404653482102e-02 5.271040610854534764e-02 3.896236060931244222e-02 2.245173634778148408e-02 7.915876252658096690e-02 2.306758235318771832e-01 1.618018654631014075e-01 1.681304988559945840e-02 5.624861040575196945e-03 2.398977486155015257e-02 1.668079840280492498e-01 2.136704680937496992e+00 3.320781380217362688e+00 4.029230618443506273e+00 6.101866823495381453e+00 6.011511527157159307e+00 4.188330846593339096e+00 1.213236783037084976e+01 5.872237946666954755e+00 4.841135661766001186e-01 1.367168268687174448e-01 9.812149915623383234e-02 2.454703149609146484e-01 5.673114618109307283e-01 5.175661852836078713e-01 1.351229524426793782e+00 3.798688517421389133e-01 2.475386422152009089e-02 1.863679389625372967e-02
7.950544701064734404e-03 7.740690333719731260e-03 2.233595918503366445e-02 1.678939047038305321e-01 5.891622725266544569e-02 1.273083692711714579e-02 1.494528682261180297e-01 3.824392077033908488e-01 2.263422987191869018e-01 2.328136534722620096e-02 4.898867661537056883e-02 7.556681529431295008e-01 1.694655819102856231e+00 2.481549926227075709e+00 2.561248950336662222e+00 3.498552178058195850e+00 6.795788977059554981e+00 1.318956901438352958e+01 1.494309783378717960e+01 1.275684100836669543e+01 5.541369593099891855e-01 5.784657453474228994e-01 5.043363266123805921e-01 1.606292473749370231e+00 2.344868835210500713e+00 1.201733302424999295e+01 1.172904466420899716e+01 2.041394161165748677e+00 3.752079871559711732e-02 1.773727087270207670e-02
6.293979041231858099e-03 6.560016960341857363e-03 1.548329450467964344e-02 1.692609074223461879e-02 1.068013566890240601e-02 1.159760656116052072e-02 7.848736237427252072e-02 2.089912623419704629e-01 4.056497501814966267e-01 1.362542519064219027e-01 1.301621192653532322e-01 1.034399335991506019e-01 8.247439898982544815e-01 1.944637797288115921e+00 2.087612031603028662e+00 3.630871965671889079e+00 7.428664823806334638e+00 1.059104849120897462e+01 7.133765363597280640e+00 1.735017349006008347e+00 1.060433784867173879e+00 7.331161249755032472e+00 1.062100815505509210e+01 1.832340354473554811e+01 1.765617213156015808e+01 2.337208117823092124e+01 1.849228907311772829e+01 4.780667863543952123e+00 7.216609775553184392e-02 2.791891514925094742e-02
6.789528286643949431e-03 7.395181055407138750e-03 7.441628870736130379e-03 6.918669920857214821e-03 9.804125152550687700e-03 2.030668234904412991e-02 1.204227455486634568e+00 3.997463489125948843e+00 1.899487215650876415e+00 2.883115891897912175e-01 1.875016371070830912e-01 2.504328954294853804e-01 4.959331235390302961e-01 8.612116512203951135e-01 1.312298734109532905e+00 2.673872024130957925e+00 7.150501840627487837e+00 8.898483267332235158e+00 5.134593723586499792e+00 2.017133419129689464e+00 8.891677058943736611e+00 1.628780174520397495e+01 2.096851865558514305e+01 2.241540701852084538e+01 2.051186807935218326e+01 1.804122199549599870e+01 2.636964456695852022e+01 4.355165881759111457e+00 1.299721704107293374e-01 5.055844512661709922e-02
1.451415787831202009e-02 1.047601467954663648e-02 5.452924877461347991e-03 8.154042635725698013e-03 9.623082965335438832e-02 4.942756512563277749e-01 2.917308466705452741e+00 2.438115261060639138e+00 2.381175051223792138e+00 1.029035057024206834e+00 3.167189015871908486e-01 7.001212248035015850e-02 6.787528833125608396e-02 2.090964154273374231e-01 5.470079391369780941e-01 2.865717597353746093e+00 3.932532595941828024e+00 5.942880531942748235e+00 1.307682824795826537e+00 2.705235427077446353e+00 9.916658980251581212e+00 2.190057400450233871e+01 2.739133756403421316e+01 2.999033298610824971e+01 2.588870765545967600e+01 2.520537727758736679e+01 2.290660099145015138e+01 1.812242728269906777e+01 8.017169688924217219e-01 5.262897686738468028e-01
6.098695292301795946e-03 1.489540008396660759e-02 2.545656514740390897e-02 1.586124030466369295e-01 3.077888048213138772e-01 4.223655885727398140e-01 1.346473018824803969e+00 1.666903890643666397e+00 1.116328990806188415e+00 7.946758028951439456e-01 1.515631471487108861e-01 1.328147005590473578e-02 2.098813372751661896e-02 7.074955523864549789e-02 1.797721293051550984e-01 1.224888490913215833e+00 5.968951251821172921e-01 2.428575157433991993e-01 1.013710696045292958e-01 8.640501970199219173e-01 3.488026950354819355e+00 1.955072550778698570e+01 2.596410866732406930e+01 2.956773866351302260e+01 2.319025900051711986e+01 1.122070686068566836e+01 1.836818455718433540e+01 1.259831413749467544e+01 1.135274427437783062e+00 4.478723031814801359e-01
1.417285153644969875e-01 1.563432773578283808e-01 9.122789885602983206e-02 9.608142140505568363e-02 1.867079883803469675e-01 9.932818775109503173e-02 4.970557083149935718e-01 6.116720507751387537e-01 5.377907793581702123e-01 1.257057348823623355e-01 3.100281327665066131e-02 6.360113383876575197e-03 1.214661212433634438e-02 4.303845560995800401e-02 2.015883994285711522e-01 1.581150802470705219e-01 3.632600112326699326e-01 1.339968421659997744e-01 3.082098906229526203e-01 1.709031663658999722e+00 1.008399510939677590e+01 2.084716783119545980e+01 2.430302505461480678e+01 2.594195904180919854e+01 2.210020791191900003e+01 1.747542856853376847e+01 1.772919284736734724e+01 1.193777038837525062e+01 1.074184004835061268e+00 3.821404721206680399e-01
3.667698707413438730e-01 2.770661898696356040e-01 1.181983133407390196e-01 6.823601319151693934e-02 6.847493891734494909e-02 3.243559566489512963e-02 1.717762097462596504e-01 1.399044023173688089e-01 3.551738742994748482e-02 2.106086070954162406e-02 7.786414982156475255e-03 6.543801719103584102e-03 4.532956058822078596e-03 3.105603412205027239e-03 9.750825056197565122e-03 3.902621588521296148e-02 1.726249849634694244e-01 4.826725205973503297e-01 5.603827094286374377e-01 2.949121546543919337e+00 9.208291332432505527e+00 1.512046441321560408e+01 6.911533331077105657e+00 1.208612201280248399e+01 1.793776022989550967e+01 1.137235708745330953e+01 9.180638510132112629e+00 7.536175937279917747e+00 2.760829259365020771e-01 2.494031196109734450e-01
2.744662690928303395e-01 2.605439859740171782e-01 3.120899390378294863e-02 1.689547699177809670e-02 1.043177571532042172e-02 1.337693776245037561e-02 1.721859098222425916e-02 3.805621026947053447e-03 4.463467422007864893e-03 8.125998623955785639e-04 1.222909172121025437e-03 2.089400663973032743e-03 2.786988222676030618e-03 1.255582320031245827e-02 4.345598611072803291e-02 6.745934312301536950e-01 1.560854209162881645e+00 2.708018112291807888e+00 2.181859935095052716e+00 1.948579084125479977e+00 1.644899204384460356e+00 6.912249204596255803e-01 3.090240996353715852e-01 7.884312818823105973e-01 3.343599430692039576e+00 1.289817099468406170e+00 1.304724996363290757e+00 4.421340114910753960e-01 5.040174811252053078e-02 4.136713429272973613e-02
5.315449731069088468e-01 3.514701178891129763e-01 3.131352191828241233e-02 1.077385861381206789e-02 1.217378194909570985e-02 8.208327898464583619e-03 1.139853853940100276e-02 1.079291384579002559e-03 8.263193879351862000e-04 4.109327845010344758e-04 1.111516377119433014e-03 2.364847946643622648e-03 3.829887322269644699e-03 2.656175828252577836e-02 5.499384888843658614e-02 4.246822403517162559e-01 1.830818132616545801e+00 3.998635984770148255e+00 5.262652197759143391e+00 5.442505333312926297e+00 1.430078526166945974e+00 3.875479938389198020e-01 5.727423897816660281e-01 1.600150167155143244e+00 3.991466295148991428e+00 1.303438797101541979e+00 5.411775875778981337e-01 2.068151461708994110e-01 6.560830030297001847e-02 5.976344640987793499e-02
5.864882222427540981e-01 6.648302080895139576e-02 1.558468395988517677e-02 4.172384175121925109e-03 3.745110903196561224e-03 7.172935043432304703e-03 8.301443747357799274e-03 8.192518014629742275e-04 4.092968248599299455e-04 5.380206336200358359e-04 1.073077439753546700e-03 2.033849292937743407e-03 2.830915387032962791e-03 2.062272022426685225e-02 1.035269989497814569e-01 6.322570752739167244e-01 1.418820566122264815e+00 3.758834031050269253e+00 5.403777967056626608e+00 5.478102716359196656e+00 3.492338849815838309e+00 2.509256738208579529e-01 2.167620960296978705e-01 5.148470669529257027e-01 3.178451337166667834e+00 2.034720412243880894e+00 1.949585511922176995e+00 3.787181378323924430e-01 5.598730147481627284e-02 4.321842263164581144e-02
2.766927101900619190e-01 7.862817424205176264e-02 2.707597906870907664e-02 2.131201165461283492e-02 3.846446035760493071e-02 2.345073482013539795e-02 8.794805611934535319e-03 3.157719932937389472e-03 4.249751912553654566e-03 6.229410491414471077e-03 6.425791924976344792e-04 7.851448723731877834e-04 1.511723514557200857e-03 4.614371644615874492e-03 3.669747422729973535e-02 1.925212432306394605e-01 2.249875582745261560e-01 1.098078655673956572e+00 1.589257505138790272e+00 1.650482899713195284e+00 1.829970763635056841e+00 3.002720204073442978e-01 5.607788988486034354e-02 1.149798472154688334e-01 5.201504232806614114e-01 1.329895376614411040e+00 3.703587322448539609e+00 2.215672522738783456e+00 5.717247542185951992e-02 4.343714747790147074e-02
9.622723300571728311e-02 3.513655772665266047e-02 3.350945645360552810e-02 4.802428195673847516e-02 2.139653063802324576e-02 8.588165805878929596e-03 3.586200034655573875e-03 2.205916934988473403e-03 6.270481501007067922e-03 2.723627955500468670e-02 2.041045155444773385e-03 7.560877744101001871e-04 1.583029473527846611e-03 4.707424346657827427e-03 2.951755378569229787e-02 6.829563570483947188e-02 5.484134996469162970e-02 3.118145159932661503e-02 5.556781188221805723e-02 1.207395878940681899e-01 2.756560540197182663e-01 7.855412810659703760e-02 4.872190877704270229e-02 2.639287433412814687e-01 6.645419644176780993e-01 2.430081673411601806e-01 8.731850814068328193e-01 1.054607574541939430e+00 3.915537085066987943e-01 6.062393804566565403e-02
9.749385022914722199e-02 7.202113093757303575e-02 3.131734950079163859e-02 1.952373079341327908e-02 1.481765514512843086e-02 4.989357118386551250e-03 2.991725326081624142e-03 2.682695273345713817e-03 2.666675327696581103e-03 1.193699154546128648e-02 3.706602382809196915e-03 3.777661742035283345e-03 4.425919633404270387e-03 7.477722122938607226e-03 2.868217099464121997e-02 2.606951462036158004e-02 2.137853845190302443e-02 1.522170556457258864e-02 1.566288404374814244e-02 1.422016530494455734e-02 1.374462562846039473e-02 2.406816106980287640e-02 4.530565298672599439e-02 1.291259831356660892e-01 2.534407872095617575e-01 1.345347186001812911e-01 2.355673541472950716e-01 1.690698916782089611e-01 1.783217184070405303e-01 1.171113658260604373e-01
1.319914395452233546e-01 6.335356128294655775e-02 3.214680065565089090e-02 3.737806332819169214e-02 2.676280795920530156e-02 1.305253852583675850e-02 4.045384296848627409e-02 2.685029102781470722e-02 3.593426108871361404e-03 2.922276337433157498e-03 1.145679287847762261e-03 2.819060811100669237e-03 1.041715116602497104e-02 1.571031459442435996e-02 6.479525474569199084e-02 6.355299902348032770e-02 2.444905642402580778e-02 3.461885012404786882e-02 1.874721381136622983e-02 9.267166660700109498e-03 9.327706315976506957e-03 1.574442880371471412e-02 2.700192122193739719e-02 1.056054113334990024e-01 1.354709448319181553e-01 3.905838347492220086e-02 5.046099079665225529e-02 7.090655109184369753e-02 2.434342460084050197e-01 5.173171601503619155e-02
1.770638016536968118e-01 1.409914958293948528e-01 3.811848582368104754e-02 1.111363378819916758e-01 1.053208332207874742e-01 1.787313491617467665e-01 1.093216751940673942e-01 1.091617820074463827e-02 3.583634058877238626e-03 2.321329358548828662e-03 7.535117664351892973e-04 1.008856202993282589e-03 1.576818352964301680e-03 8.668644539356821013e-03 1.460556592629114192e-02 8.660910045932196377e-03 1.030634795749920882e-02 1.492564745692468581e-02 2.392137677188757930e-02 1.394091485094251133e-02 7.572914053136305286e-03 1.031892785171649105e-02 1.165607204033352641e-02 2.762382476337323783e-02 1.234493772414387847e-01 2.585879352209644044e-02 4.588682363846163098e-02 8.368018496388451855e-02 1.077592575452329948e-01 2.232867834353011449e-01
9.612651499272212297e-02 2.194062817817366007e-01 5.826554807929827662e-02 5.381654944293447207e-02 2.172273932831277621e-01 2.103268825020148114e-01 1.297636282973894939e-01 8.068097892276382757e-03 5.354231805629047075e-03 5.788368565862189036e-03 2.674781021148848505e-03 1.464649924971907170e-03 1.188796869093744013e-03 2.855717253770945901e-03 1.848164767113246940e-02 7.169425143831718340e-03 3.321242683445980309e-02 2.546281415778184343e-01 5.595676000906132375e-01 8.537353178382670049e-02 1.647418676916458102e-02 2.071524564428111823e-02 1.750931699137132577e-02 2.614837243257840671e-02 4.788688614580310227e-02 4.824343678487117565e-02 6.954365901700018671e-02 9.409279719492061322e-02 1.348340803739639659e-01 3.452226238881608289e-01
