1.038725554692591230e-02 1.533694621174325201e-02 1.328962882456564271e-02 1.671552173825834736e-02 1.255869697575731636e-02 2.730989982400177166e-02 2.674882415934136046e-02 7.155055187524227145e-02 1.289747868918284801e-01 5.707210956323208878e-02 2.619830178784003649e-02 5.881891841830800584e-03 3.395903933628738151e-03 1.253635517897360580e-02 1.450256076718796187e-02 3.176094223096291840e-03 1.106812385485874024e-02 1.909827781724394297e-02 1.709725837390546621e-02 5.954469627002873661e-03 4.764855721735135330e-03 6.878808454688382576e-04 5.308247765020456584e-04 2.067837217131520983e-03 3.860607869082644666e-03 2.902073204765075361e-03 1.282737822037278898e-03 1.104375902133030899e-04 1.016157723909503341e-04 1.223704270842617368e-04
8.256188816144205411e-03 1.823717929980729624e-02 3.279475771328684008e-02 2.654510382962077183e-02 1.840364457899979281e-02 8.186051846296442391e-02 3.857032019303541920e-02 4.741422292699001145e-02 3.053933682201269428e-02 2.556404671358664810e-02 1.797796836375672308e-02 3.457927783745087889e-03 4.515328896287916158e-03 1.020385059727974171e-02 1.404792169818167707e-02 8.956544226556820490e-03 1.092379055468072589e-02 3.513593434710454710e-02 2.616836710673643707e-02 7.783844087622109054e-03 2.743629398261201828e-03 6.072074162532145299e-04 1.255003399267003552e-03 1.078499892468709953e-03 9.054092874141749566e-04 1.149454428686338221e-03 3.861084654507647060e-04 1.007079340141621518e-04 1.438044016465681984e-04 1.438375068060622714e-04
1.016115486082424246e-01 1.023709412333978219e-01 2.167031753589607479e-01 1.747646586802058255e-01 3.736430261403479447e-01 3.786727412509170027e-02 7.009461693063830101e-03 7.351424781476582730e-03 1.166994803391315644e-01 3.499762696225532793e-02 9.284384843360327100e-02 6.048399691921496624e-02 2.176481784057361646e-02 3.142771456868811986e-02 5.897799494563606658e-03 2.443182769820469169e-02 1.609412199278557540e-02 3.240567899866984847e-02 1.062082486990878483e-01 1.740526357751032149e-02 1.633423947800808707e-03 4.631737788585898108e-04 6.888262920930109329e-04 2.320351464451733811e-04 1.312853269854551250e-04 8.201969327648541580e-05 6.850931366092351900e-05 5.668449674679877984e-05 1.000341719153218336e-04 1.171353203172437944e-04
4.693165236767947446e-02 1.319133390614262158e-01 2.899512474238251092e-01 2.323905990129349064e-01 9.637056068090946170e-02 1.482415977706218191e-02 1.167498249813605365e-02 7.659379277335866092e-03 4.612190948897327419e-03 4.256608810042704361e-02 2.698442406715673841e-02 5.294296923631521684e-02 2.355478666437575697e-02 1.554380412384769733e-02 4.481600723458030108e-03 3.344596489398814036e-03 6.840080815514238723e-03 1.251776122583977621e-02 8.750657692437980445e-03 7.348646794419698772e-03 3.281798209048935981e-03 1.093641996331562189e-03 3.311995583004368176e-04 6.100322775905622340e-04 1.068433328381525809e-04 7.358972790392793182e-05 5.868093466638880104e-05 5.863092409528256039e-05 1.229405953093028149e-04 1.418677458682063113e-04
2.706686978049603967e-02 8.197030915059588807e-02 2.282529090709210784e-01 8.840678306727826896e-02 5.108395389178727042e-02 7.396273047330694135e-03 1.118036327580806955e-02 6.132098196821918028e-03 2.780222698167285865e-03 9.619911748194595602e-02 1.187845000635461695e-01 1.006788759080079615e-01 1.466195314445858586e-02 1.197085176549885638e-02 5.475585087340023062e-03 1.971662589141168903e-03 2.070748747243830387e-02 1.165067743055936411e-02 1.848552651372480440e-02 1.039596990835910985e-02 7.057644347646526220e-03 1.923175416264131512e-03 4.110317986738181231e-03 1.064905208056152056e-03 1.991431928708965412e-04 1.011614190117511884e-04 6.528026597045030635e-05 8.011330772728008308e-05 1.301164757083325880e-04 5.114948861731647214e-04
2.694829284851614146e-02 2.753569002670941401e-02 1.232170724609857604e-01 9.848893156820724692e-02 3.915599090286568662e-02 4.157990373356078122e-03 4.993148920119492955e-03 5.276791492528491376e-03 4.856795019086646015e-03 1.460684019376232434e-01 1.133440739746170434e-01 5.948831337103321903e-02 6.699974669300549912e-03 1.974024181996895857e-03 1.449055648667175187e-03 2.270514146209370952e-03 1.161821653676355093e-02 2.971095834591164827e-03 9.499524195130209375e-03 3.218583094504145342e-02 3.868327591217710082e-02 2.254833825551377097e-02 5.470437385201207606e-03 6.643757229737846069e-04 3.078187891398155183e-04 2.725549813210389073e-04 1.574335611843095343e-04 1.156949218633312028e-04 1.587495972450634848e-04 3.075949199758886646e-04
3.713315649382405072e-03 5.757766564288807620e-03 6.070453776966661108e-03 3.069800621341223917e-02 1.468394894919788397e-02 2.416878847757315471e-02 3.620486530634945549e-02 2.041091303730251799e-02 2.393533222469406904e-02 2.776827810197949817e-02 2.125296806819552964e-02 8.720828755152969583e-03 3.542338647932303207e-03 1.336941703916082018e-03 6.759733029316326467e-04 1.147415703006280513e-03 6.625988468363743812e-03 3.089876588603621653e-03 1.556635415890637170e-02 2.097673175388161879e-02 9.535531512648992569e-03 2.232297437616847981e-03 8.449358634002228450e-04 6.223778002549225710e-04 2.167886533684549460e-04 2.085569274051770543e-04 1.688893503797062349e-04 1.570646821000513537e-04 1.906473936816975990e-04 4.891166606175553939e-04
7.933488221025729661e-03 1.439595179619966234e-02 8.363224090258372656e-03 1.791567157940551075e-02 2.722700405827884612e-02 3.034216814629229000e-02 2.672880212716278320e-02 2.507811243455712602e-02 2.005716760406732468e-02 1.119409127343630114e-02 4.479183590469445336e-03 1.376063747544905604e-02 2.893965858561843227e-03 9.359869853934305690e-04 9.286296137877510281e-04 1.656738556423898757e-03 1.353942901456412808e-02 2.148076611561583471e-02 1.874220780433794725e-02 1.321394579106917322e-02 3.540589263919045274e-03 1.614121637761127374e-03 5.216936042962862360e-04 3.862304841028633127e-04 1.726503708588969456e-04 1.713991406458073683e-04 2.493824425573967405e-04 3.326357172009996145e-04 3.513364671936995243e-04 1.098030888736703427e-03
2.066360418279915637e-02 1.346934454833904893e-02 7.825573048951428579e-03 4.490266054329930534e-02 2.882470498434761344e-02 1.213140968419886175e-02 3.916986522218852962e-02 1.756719588455794498e-02 1.476301939096578628e-02 1.447013953866486263e-02 1.281393248984548199e-02 1.675752338174575293e-02 3.612944215667691916e-02 2.321915269612080668e-02 3.391261138080373539e-03 3.034011562828944127e-03 1.309388339977703847e-02 3.962430220294697186e-02 3.902110378084643755e-02 6.489015437253410450e-03 9.955541950837562808e-04 7.383957204248553854e-04 6.638406668002218769e-04 3.897001329820211596e-04 2.163231859741957691e-04 3.171535926988349754e-04 1.134357964131711867e-03 2.403989839606025802e-03 7.284861605301982262e-03 3.775452469717480077e-03
3.355300226296446808e-02 2.179770201470827146e-02 3.470036023187842572e-02 3.200418814907071696e-02 2.768759468995227180e-02 5.450947643141561966e-03 2.550308478622579852e-02 1.090560783781740518e-02 4.592386409911899947e-03 1.703853870923626584e-03 2.466219274571057607e-02 2.370627295194597389e-02 4.953609407923637020e-02 5.294033118969006246e-02 2.494427703414420910e-02 2.684009420812515437e-02 1.433507178961279938e-01 1.488299523172480487e-01 6.003807164380854655e-02 2.675445512393241632e-02 1.273242216546858520e-03 5.764009084780456369e-04 5.576561217107819848e-04 5.625952814043839968e-04 2.971157702134650863e-04 3.674297001434435558e-04 3.320182330735757439e-03 5.949444374799535071e-03 7.703557235147458562e-03 2.094599835904369968e-03
2.784145278683708424e-02 1.449601746579271162e-02 3.222676998444708868e-02 2.719586202307449144e-02 3.411509674952148408e-02 3.126490578763413929e-03 2.640921558600952453e-03 2.299066306270578560e-03 1.433126199522186594e-03 1.271177713560555506e-02 1.961605459111576133e-01 3.211800446350809857e-01 6.544558912116438254e-01 3.198428965390527345e-01 5.851218771837939786e-02 1.126633190253497896e-01 2.090393133599964814e-01 5.812624824198440315e-02 1.398913128496234726e-02 2.797695348117055364e-03 9.165624966142969917e-04 6.078713703893627975e-04 6.820176871552517932e-04 8.985145862235037646e-04 9.208997011534605752e-04 4.802251528286394233e-04 7.312195174111691060e-04 5.994817023009797567e-04 5.466171938464731627e-04 3.966792941598822585e-04
5.173250152113001779e-03 3.035204533550912766e-03 2.659291962186285246e-02 2.584267365275429856e-02 1.992886081553948280e-02 4.547557133187903229e-03 1.754573090499135469e-03 1.111157758588578225e-03 1.349805273785674832e-03 2.490740587409308315e-02 5.926236831391300947e-02 3.788297436501707471e-01 6.690258583019279559e-01 3.446636939191134452e-01 1.239727774648211600e-01 1.382907978120485049e-01 1.526027946115967038e-01 9.051748035706425055e-02 2.243516493229605335e-02 6.331748074296876701e-03 9.079440303433293502e-04 7.776659025991210705e-04 8.449596950385074865e-04 1.463649180523307700e-03 1.367899213599179037e-03 9.466882039245057539e-04 7.022594846584353460e-04 6.252566433553987182e-04 6.535902732399133429e-04 6.805055143580824705e-04
9.884651427532109482e-04 2.548545699145995155e-03 6.206076872159933290e-03 1.745673229687605410e-02 1.127293746569041008e-02 3.517088348263512024e-03 1.760425602481594052e-03 1.430901637464790637e-03 1.747523969082855370e-03 1.247372472315373855e-02 4.079913648222864390e-03 1.209161230094820405e-01 4.990476542776752789e-01 2.114629811809818627e-01 6.607452974469346652e-02 7.572214410955308006e-02 2.794074505538943903e-02 4.106753846542465086e-02 4.690278843753064447e-02 1.757008962023858673e-02 1.158687531485021400e-03 1.016264161303671171e-03 1.193619183368108821e-03 2.020091945159503081e-03 2.619473294312243180e-03 2.422885492387650674e-03 1.753938647321043581e-03 1.521932521799428464e-03 1.097235077811132761e-03 7.944093058300550096e-04
7.747046260615657364e-04 2.229644268307374826e-03 4.098787881045673487e-03 2.983794889764578972e-03 1.746196697510982773e-03 6.740828355090070986e-03 2.267985963969921734e-02 1.909446884367568473e-02 2.424835147561692217e-03 7.472955638731950236e-04 2.992834536198784364e-03 1.960322915648543551e-02 2.268458007913031482e-01 3.036783167961010776e-01 3.217162973629146272e-01 4.310449393498714254e-01 3.867591721074048472e-01 2.499032558119886338e-01 6.800600799204375990e-01 3.171053893091606568e-01 2.620769000033741636e-02 7.563715466934399501e-03 5.617250816527222419e-03 1.402682861626436926e-02 3.225122322497583904e-02 2.983149152940408472e-02 8.058790295116276259e-02 2.529219118650292628e-02 1.876777305678070575e-03 1.654556424249676574e-03
6.852745665689915231e-04 6.861763579267207442e-04 1.904020667142900143e-03 1.419678808559224348e-02 5.092978655848679793e-03 1.175934377910873175e-03 1.515301205744510986e-02 4.361085985553579680e-02 2.933145855910002445e-02 2.996376950657624917e-03 6.332678875672637271e-03 9.825524336555023497e-02 2.045999691806376919e-01 2.565626699202416816e-01 2.297088115602173020e-01 2.753521035555068774e-01 4.667003131174333741e-01 8.015396216548645869e-01 8.141958858598739024e-01 6.441816594980698252e-01 2.757994813550249460e-02 2.879279012845251465e-02 2.528472689118397079e-02 7.854702998230371491e-02 1.113152755418905099e-01 5.617615101663475663e-01 5.550852362484099967e-01 1.086050737084376244e-01 2.277121469488054342e-03 1.260571801035366120e-03
5.880638537020097976e-04 6.354051806574321755e-04 1.463517189382503719e-03 1.610087400926747377e-03 1.052037748976904826e-03 1.185937052180366120e-03 8.326408292151806639e-03 2.337771204366477854e-02 4.848371484607652548e-02 1.730047665098829665e-02 1.776285396896831736e-02 1.522917903303545178e-02 1.167186321011001449e-01 2.346831133305528339e-01 2.177563608201405487e-01 3.311614671675380261e-01 5.660897038914440849e-01 6.825579324182381447e-01 3.941538921765633252e-01 8.632977703784662504e-02 5.163881351608606146e-02 3.521898082599150825e-01 5.063876072171963338e-01 8.400123874005169800e-01 7.771538719034860598e-01 9.975819967477498329e-01 7.916440586659826417e-01 2.228091159719870207e-01 3.690647894311775267e-03 1.585312992594284723e-03
6.926434965709107492e-04 7.917493086613960418e-04 7.886906729509437618e-04 7.475725641776486676e-04 1.123118340235587740e-03 2.334528297660359679e-03 1.360840805160658529e-01 4.544481234542921966e-01 2.222334525527933646e-01 3.797176748369210375e-02 2.811387544121406873e-02 4.326969098076856313e-02 8.462671852285184870e-02 1.238765196034941479e-01 1.621817062593209902e-01 2.884607119568667333e-01 6.125829520855374799e-01 6.148052793155218687e-01 2.914829008377392561e-01 1.000123747630591864e-01 4.249486670813866773e-01 7.572382084585491668e-01 9.558949869731112603e-01 9.692562334404559721e-01 8.421810884512082040e-01 7.179713891010628402e-01 1.048431261412861248e+00 1.816114714330498980e-01 5.707113325823146011e-03 2.346682530170798430e-03
1.608307297076789610e-03 1.242075698855772551e-03 6.559625223159582311e-04 1.025112845345409239e-03 1.319990309613970798e-02 6.664688920297648367e-02 3.711999502264223816e-01 3.020353036449235362e-01 2.978736725784155714e-01 1.493698193385336048e-01 5.470029495675432507e-02 1.461447327325092471e-02 1.418547195105274682e-02 3.624841888842129933e-02 8.078508858544591886e-02 3.682558609930101645e-01 3.814418999860069714e-01 4.436641522588772313e-01 7.696075009577069137e-02 1.349102985258985865e-01 4.683252667573250538e-01 9.916176207305322787e-01 1.202368936612882244e+00 1.229012301342590430e+00 1.001677868837306473e+00 9.481990612516978389e-01 8.671802954718078604e-01 6.874841437963187252e-01 3.050250856656889012e-02 2.010212434841374129e-02
7.102957308321654036e-04 1.920209472645441643e-03 3.536427619516252074e-03 2.440484691448639720e-02 5.389871401505388904e-02 7.620378046652831472e-02 2.410544244036810779e-01 3.008706635883434677e-01 2.076209372391859265e-01 1.614793106788114663e-01 3.386860594974397398e-02 3.303389317162455045e-03 4.971682569275685457e-03 1.384874199662554373e-02 2.959633492960094675e-02 1.722124066093709549e-01 6.492224536721988293e-02 2.069411075095028280e-02 6.890944909117585442e-03 4.948317602527010223e-02 1.846604036217472100e-01 9.663315755798381756e-01 1.206666409241407889e+00 1.239961908120704059e+00 8.864504821284883151e-01 4.001608545812244677e-01 6.330468002291947949e-01 4.345516484472033425e-01 3.918863701293152230e-02 1.547152917693115151e-02
1.770985912153609163e-02 2.242033924042121859e-02 1.490095593682816758e-02 1.836191671540021025e-02 4.304395255819285643e-02 2.474492865796955321e-02 1.283186935580090393e-01 1.662396888174435539e-01 1.545271630557027154e-01 3.637383919345042738e-02 9.119402490980189208e-03 1.919934742427228513e-03 3.331485745159633131e-03 9.668008333375261928e-03 3.766806442620226208e-02 2.489980066737354850e-02 4.497076446301791208e-02 1.319338656556326081e-02 2.449318021907925455e-02 1.143516972307233870e-01 6.067527681360631586e-01 1.137644422579945136e+00 1.213297436454391587e+00 1.126392459746065944e+00 8.384983832990097197e-01 5.950123894339517383e-01 5.610611605238133848e-01 3.780586448699337909e-01 3.404106818958427955e-02 1.211870800973842421e-02
5.008371748616682190e-02 4.522467033719874269e-02 2.310571739519251544e-02 1.649158839077758537e-02 2.127182802399107259e-02 1.146116708377420065e-02 6.596975249840265898e-02 5.932799954743754600e-02 1.645454406139206308e-02 8.951484970000615424e-03 3.090297385367454189e-03 2.455029246430357089e-03 1.466933572201584201e-03 8.119985977163860164e-04 2.099824117614812122e-03 7.014588917289677795e-03 2.471527499507189529e-02 5.575790515746182480e-02 5.306665352022606197e-02 2.346940524955504204e-01 6.376239120599771493e-01 9.237875322101418707e-01 3.766549241589942087e-01 5.491194503577871977e-01 6.820311736246217338e-01 3.717954536649887842e-01 2.692167714061409201e-01 2.211307578459786316e-01 8.105981641475877575e-03 7.327834809200091566e-03
4.080206478358800598e-02 4.634568187204107792e-02 6.776580447509411402e-03 4.640289868433275511e-03 3.763223366593850330e-03 5.644207632728524132e-03 8.156856614015876861e-03 2.055392303623468017e-03 2.685917864602124609e-03 4.285630245565066453e-04 5.721361574392837225e-04 8.829477526629998796e-04 9.897975307215530188e-04 3.559453028812213215e-03 1.005447080105830587e-02 1.293668176012813253e-01 2.425090326183306222e-01 3.457866036993354486e-01 2.328964920129587834e-01 1.744643837947544296e-01 1.240815792353320152e-01 4.469337625159026939e-02 1.740198181304299790e-02 3.637649014421476951e-02 1.266140544450834182e-01 4.123273978352076652e-02 3.693745846203753264e-02 1.246208149816582789e-02 1.414937636250783188e-03 1.157101531556573937e-03
8.691319321338750181e-02 6.605144583459424124e-02 7.066311237197643938e-03 2.998718419242627636e-03 4.317352097959959584e-03 3.375521750405798514e-03 5.267578303232912061e-03 5.672151349584318367e-04 4.803757311906296443e-04 2.113798344655146556e-04 5.086821657324395920e-04 9.750794249555790874e-04 1.323095435532139260e-03 7.276816806391072159e-03 1.211335831509156163e-02 7.642338040895009510e-02 2.723016966499834934e-01 4.982397134621928680e-01 5.549924499466027950e-01 4.801999218776884515e-01 1.034237914028041383e-01 2.332118436472824588e-02 2.910862751940100634e-02 6.952072965679083338e-02 1.502540312628218855e-01 4.305643402384906615e-02 1.616850342301182422e-02 6.057641490264610053e-03 1.890178388084466209e-03 1.696241282712831686e-03
1.085033326030581668e-01 1.363238968010877135e-02 3.745680612416630358e-03 1.204201027913306878e-03 1.335375523021652871e-03 2.915585609141633887e-03 3.782162541388427515e-03 4.247335801849289093e-04 2.346451594102914049e-04 2.741370048895842154e-04 4.903488853041566321e-04 8.450460232510972414e-04 9.818003384780705622e-04 5.626760018250356703e-03 2.252114506452039186e-02 1.110247280678514775e-01 2.089255838338766880e-01 4.693760602156361039e-01 5.762484163227592493e-01 4.849243808872092942e-01 2.461039540000654058e-01 1.438639432182863172e-02 1.032676623118933268e-02 2.199838968818576546e-02 1.243127502159249165e-01 7.310485300483393623e-02 6.490289515550848320e-02 1.208747041993813234e-02 1.725837619650633569e-03 1.295149625654057205e-03
6.024546526349262854e-02 1.844202922735174027e-02 7.120663844403222857e-03 6.518896056243119255e-03 1.406238450975587362e-02 9.582058454464276176e-03 3.984720444837525945e-03 1.631404709210220860e-03 2.438574308414702407e-03 3.198995544201732773e-03 2.993090234922553316e-04 3.385890570559188886e-04 5.451398750708327844e-04 1.296647393253183437e-03 8.182185511591883245e-03 3.457411472020979065e-02 3.394619521382676031e-02 1.413701252913796835e-01 1.765142439784242456e-01 1.508349018608358405e-01 1.293744472578201576e-01 1.700751960030423560e-02 2.657730715257615364e-03 5.168230801726268926e-03 2.272497094143204402e-02 5.642117170113176983e-02 1.504955123552412510e-01 8.324338575709309962e-02 2.033911159590118256e-03 1.486829072290134224e-03
2.157078458686931960e-02 8.462416978923543304e-03 8.979162899660143859e-03 1.488290475787224301e-02 7.885358800143526387e-03 3.522967276595024341e-03 1.626881535096363646e-03 1.141990139667940036e-03 3.605254180819223320e-03 1.404071087159243156e-02 9.578264207145129787e-04 3.307966642893138865e-04 5.789410833099556397e-04 1.338733234666188762e-03 6.659695003393697847e-03 1.241401297833094781e-02 8.381659058959507053e-03 4.069640344286242113e-03 6.281099519624312386e-03 1.142060352751835157e-02 2.082629478020354974e-02 4.866106542125332723e-03 2.565598312327541965e-03 1.320567745952246942e-02 3.232848619955738800e-02 1.151549119916995233e-02 3.966311489856575584e-02 4.356587572901170907e-02 1.517633630142085910e-02 2.256143487519502583e-03
2.186804117498683184e-02 1.736016254407016582e-02 8.401855585044842173e-03 6.059726328777651459e-03 5.471029911167721652e-03 2.048336425116638066e-03 1.358729199274635998e-03 1.390730507147262731e-03 1.531542117565234560e-03 6.147690941205407808e-03 1.738096148451985252e-03 1.651858769316475514e-03 1.614631239724745098e-03 2.121827846470099050e-03 6.458059622156231416e-03 4.730084375685908449e-03 3.262571867286756869e-03 1.983986099417216729e-03 1.768251702634796030e-03 1.386798261251480369e-03 1.146331926488896452e-03 1.736304490453125741e-03 2.859328874654253928e-03 7.378728307394761751e-03 1.335214499080150663e-02 6.584553558793997119e-03 1.068893858262137675e-02 6.978309711628204529e-03 6.908537527797660796e-03 4.357248393743691495e-03
2.962413387084011918e-02 1.528378276678224977e-02 8.634824224895913669e-03 1.161906699611908733e-02 9.900116629768080170e-03 5.363031907987049138e-03 1.839357601075346238e-02 1.393862615720731571e-02 2.061513861199148947e-03 1.503525595111684671e-03 5.368102220246015899e-04 1.231998342877883845e-03 3.790854016841177510e-03 4.447606823208505485e-03 1.455823678290696713e-02 1.151130842736617678e-02 3.725305664895772924e-03 4.505821871414563036e-03 2.113723524884816244e-03 9.334713774830889028e-04 8.650039553048955582e-04 1.346876636103277146e-03 2.136050153921723472e-03 7.100050147642669035e-03 7.783225713331310205e-03 1.975784785852962092e-03 2.287475732088439968e-03 2.924327370487865216e-03 9.427357884505126184e-03 1.924255267026644869e-03
3.972885382846106511e-02 3.401405636372011043e-02 1.024562852397188639e-02 3.452922954451894538e-02 3.885522510294420195e-02 7.306508224658840589e-02 4.941936640131999736e-02 5.625903332198540184e-03 2.033034656387250946e-03 1.182245554668143834e-03 3.499181024035490258e-04 4.372803248623532871e-04 5.689457585541778670e-04 2.438056579571930022e-03 3.265330428042265143e-03 1.563634544867962758e-03 1.567552653797148199e-03 1.940162368473279282e-03 2.693928947090230841e-03 1.453488904341758122e-03 7.869171611337680457e-04 1.067108051097496015e-03 1.197768519020319007e-03 2.237707081052605837e-03 7.835296627343394521e-03 1.352502912145067378e-03 2.078232785964040114e-03 3.448485162215359466e-03 4.171446290908346552e-03 8.303395966727735930e-03
2.163895126608976482e-02 5.319273040631160299e-02 1.576550755987014482e-02 1.663149085889914156e-02 7.841637421900826688e-02 8.256834812600911955e-02 5.534163465784260744e-02 3.820667115664988685e-03 2.709292530866300869e-03 2.609323192766800116e-03 1.090512712894609959e-03 5.479701224140081295e-04 3.698009835495002433e-04 6.991189165268900645e-04 3.610460829237704776e-03 1.130040414022636611e-03 4.189090236382453022e-03 2.611567076461560055e-02 4.743318161467962452e-02 6.556350793063549579e-03 1.268708408512667606e-03 1.599960201200847964e-03 1.356264229475556866e-03 1.641979174662391763e-03 2.415301687453655539e-03 2.022544925060735296e-03 2.522429221412696848e-03 3.138032855567272211e-03 4.248034476098646976e-03 1.044611791863260183e-02
