1.542565059757556589e-01 2.184284860776115056e-01 1.814355429710692857e-01 2.222449541126185202e-01 1.532355126612505447e-01 1.934326863347749642e-02 1.411362600065132686e-02 3.801587055330556131e-02 6.886335389008095553e-02 3.077189748524796972e-02 1.938867529772689974e-02 8.636701349334954814e-02 5.702060618374061446e-02 2.088497195821696073e-01 2.130236899153231667e-02 5.891891735972349525e-02 2.485873909596374443e-01 1.521628280456205351e-02 1.175947860330488204e-02 1.959061568769569772e-01 1.798164113454500945e-01 2.702579357865131718e-02 2.055127029111739057e-02 8.155151738240126735e-02 1.573422309835348643e-01 1.227914395909942002e-01 5.622134450496561742e-02 4.907157300423852994e-03 4.644720519988271810e-03 5.792170238034502830e-03
1.003893107788787903e-01 2.082870642432954889e-01 5.018712791791784394e-02 3.143370224563349358e-02 1.839024745225919244e-01 5.977602300240793254e-02 2.401208814004687775e-02 2.980902257715980358e-02 1.786752802005890303e-02 1.417752779884037806e-02 1.320848885138131701e-02 4.491690479722759699e-02 6.810461541840488742e-02 1.624630579535143449e-01 2.126799636413351582e-02 1.620537668536405074e-01 1.093982860560705969e-02 2.753254002431725425e-02 1.786219793928848706e-02 7.256708727695695971e-03 1.025016690974803607e-01 2.574547487192155315e-02 5.315257686686915284e-02 4.723590370554647117e-02 4.161465796694233110e-02 5.560271686010333919e-02 1.950177946451490951e-02 4.932284098847281376e-03 6.981400663903125636e-03 6.940683757082182978e-03
6.979700349640771684e-02 6.840157323600920547e-02 1.293917865592887351e-01 9.776344824722967009e-02 2.250778944086706534e-01 3.493961196252221707e-02 7.884563621162364588e-02 8.198208956690371252e-02 8.220264374276127495e-02 1.983198038727101639e-02 5.335938154919500631e-02 3.968082692063819999e-02 1.870184516467275626e-02 3.251729731759982200e-02 1.003313078868870167e-01 2.633940101691618907e-02 1.436487914820136318e-02 2.154507935385607462e-02 6.851628448608071409e-02 1.477789830676945991e-02 6.388278813180833793e-02 2.116156475561959543e-02 3.214434735715333835e-02 1.111920926820853320e-02 6.568443162823003542e-03 4.317062150133846310e-03 3.855711913386523915e-03 3.020277407774944918e-03 5.136563751776296836e-03 5.741011296020429380e-03
2.438513864370924281e-02 6.946476278070091992e-02 1.522069541095778800e-01 1.234768182298808387e-01 6.126005519540200089e-02 1.612418357264665814e-01 1.583742130801315817e-01 9.733557459752681384e-02 5.233077315403425467e-02 2.494225189543306659e-02 1.515165396802544903e-02 3.557697495863629961e-02 2.433467754360092022e-02 2.406697047933629291e-02 7.751954983045727943e-02 6.585235904062020085e-02 1.400368988101710344e-01 8.280342114617153873e-03 5.565301116415874265e-03 2.060541590338812457e-01 1.130274618512261409e-01 4.474452289531163224e-02 1.500460179680783261e-02 2.949486826133031550e-02 5.374900847464603865e-03 3.834791310266526601e-03 3.298485936183683399e-03 3.113455395628897913e-03 6.288926612052950227e-03 6.797551009259751587e-03
1.405221357279971481e-02 4.355515280501718461e-02 1.217097852562631366e-01 4.729078397397949024e-02 3.538664770355044731e-02 9.376387015197804042e-02 1.612749326198101296e-01 8.967179579370351816e-02 3.264255857356952728e-02 5.831789918998430550e-02 6.696985479097142258e-02 7.411688782629176353e-02 1.909957459766291332e-01 1.947094381196233792e-01 1.007121985261914959e-01 4.104742417885359762e-02 3.020495305196078603e-02 1.523064457250660440e-02 1.527996141549092281e-02 9.633131264729345722e-03 1.819654684937929423e-01 5.758320388729228079e-02 1.466961690849678812e-01 4.837575984062490037e-02 9.734281537204129281e-03 5.169688311656308807e-03 3.607846492145886600e-03 4.136684018531286595e-03 6.415595634833548208e-03 2.339234439617550107e-02
1.958227169417909447e-02 2.094065552181327908e-02 8.017209809953680655e-02 6.552557748131765392e-02 2.944661214003501531e-02 5.299148436536459117e-02 6.608167453203930841e-02 6.941448359239302257e-02 5.557064169685790173e-02 8.554999153162877457e-02 7.163532603380724784e-02 5.263423567476820802e-02 8.887075080435558050e-02 3.292173681663383700e-02 2.722553727916739857e-02 4.684029591768030382e-02 2.502483073918759238e-01 6.288929346612587290e-02 1.947622953209652008e-01 2.813910566936243807e-02 3.321970785028943024e-02 2.883578154242719821e-02 1.794043175361297593e-01 2.813365761962363654e-02 1.456876711934397203e-02 1.364293605745201324e-02 8.578798499025567723e-03 5.850626898220079308e-03 7.641352194101880962e-03 1.357883764530018467e-02
5.360340004780841244e-02 8.089167942466846117e-02 7.988406568979686262e-02 3.203410104037824474e-02 1.783784939747962428e-01 1.909715779438503347e-02 2.890559684375514082e-02 1.587876759170372964e-02 2.028273577415025744e-02 2.332428287702180414e-02 2.400000000592961494e-02 1.064950278962872171e-01 4.956528558430101095e-02 2.267437907671130889e-02 1.313025793582463761e-02 2.379200665875766743e-02 1.352186352749924214e-01 6.081163696336805424e-02 1.245846536857671966e-02 1.848509803880668198e-02 1.998152790519290845e-01 5.684271740037454002e-02 2.634123594539480862e-02 2.534462962444858011e-02 9.900051733020109879e-03 1.025610015549806124e-02 9.203165350449507218e-03 7.890999845650297287e-03 9.039962879421324302e-03 2.104481966205313040e-02
1.168627291544053204e-01 2.155747944213018408e-01 1.156757005558336493e-01 2.265667200246245794e-01 2.559408562097195694e-02 2.249721921370042427e-02 2.254355482025052412e-02 2.720205943679476421e-02 3.230785657078587975e-02 1.514053642097469843e-01 6.393484582467154342e-02 1.979390782833986839e-01 4.273619351820502621e-02 1.475310467432155472e-02 1.661031175820379402e-02 3.173124919644957492e-02 2.427389829997197157e-01 2.771850779788527161e-02 1.332974432088424033e-02 1.170777401178061360e-02 8.111928547059872596e-02 4.756882650970051252e-02 1.887963231895301019e-02 1.580555239501209297e-02 7.577204256723985530e-03 8.030871806517122374e-03 1.312229486052718039e-02 1.664455529379700940e-02 1.607951908991043025e-02 4.537484582518609699e-02
2.796870168031094783e-01 1.797681360668320627e-01 1.004542895244732725e-01 4.737551077182839548e-02 2.639002211415289803e-02 1.384095704810710259e-01 4.455509402880045849e-02 2.217451038431544341e-01 2.106448425484415965e-01 2.167841463681027259e-01 1.995694418838191986e-01 2.531149872247600019e-01 4.354361319163983779e-02 1.764821081211208689e-02 5.325684447528936799e-02 4.619448558937616633e-02 1.854602923024904204e-01 3.639984192122459883e-02 2.528083221148401741e-02 1.093656065909576203e-01 2.161496347837815052e-02 2.231949177797217659e-02 2.404827194281644598e-02 1.567337355074982855e-02 9.207443845682014918e-03 1.415583562830500033e-02 5.637417589416717639e-02 1.105526762165048998e-01 3.064854071929196677e-01 1.453606775139918428e-01
5.723133602322396513e-02 3.815386975125782676e-02 3.973210889123787032e-02 2.290406922279402541e-02 2.176782593101058566e-02 6.586712528487222162e-02 3.706158028923057374e-02 1.523440414027428802e-01 7.327489039153968486e-02 2.656985908449418718e-02 3.860077491772974378e-02 2.526015757367590028e-02 3.852533201321773487e-02 3.264790921335541246e-02 1.606610445799709630e-02 1.894262419218589039e-02 9.614675054246227259e-02 1.043117388198120110e-01 4.462453932882923940e-02 2.444101021999238801e-02 2.801758357917100151e-02 1.748733981956876113e-02 1.982316298115646691e-02 2.167263613825494081e-02 1.209074961672052494e-02 1.550365992924797147e-02 1.496182983443927472e-01 2.482226908958123923e-01 2.972516513063583332e-01 7.506936161488220183e-02
2.946363828126521284e-02 1.697694691528900401e-01 2.627876567077240197e-02 1.706895080265340495e-02 2.911487529414957115e-02 4.123107571024647172e-02 4.023719918144650493e-02 3.654687281385086278e-02 2.501851135615303437e-02 1.977345497594984181e-01 1.244352096092729704e-01 1.833093513664785512e-01 3.790705871802392268e-01 1.868181477430137238e-01 3.437766884932993289e-02 6.760023134202414186e-02 1.270398375834532467e-01 3.821252335747653966e-02 1.947755417178098358e-01 4.735435601721967036e-02 1.956445716665033280e-02 1.722863390814643667e-02 2.195306742755197271e-02 3.049564587125806747e-02 3.245175013458066748e-02 1.761313801871127252e-02 2.825349819538998039e-02 2.182711778485261350e-02 1.899190851067387303e-02 1.322447528992067543e-02
7.454461587998247041e-02 4.093582699689917587e-02 4.835242295851133881e-02 4.700717083124392182e-02 3.807622527684125652e-02 6.760679715612855079e-02 3.104697395321229236e-02 2.128399313859743666e-02 2.578211636463100323e-02 2.474287110015882182e-02 4.858592030682517410e-02 2.220749148634872661e-01 3.927847555097557231e-01 2.046679650296942266e-01 7.402899246461192018e-02 8.404837729457147188e-02 9.335016132054757554e-02 6.003878604916470380e-02 1.936172543787492359e-02 1.096264687243959646e-01 1.902373541642896418e-02 1.906968811183030674e-02 2.228418572154025959e-02 3.954613950996400257e-02 3.733906596243007081e-02 2.644018316255450710e-02 2.019462207200896711e-02 1.804231291778377044e-02 1.932411724222398916e-02 2.051758895130513863e-02
1.745531389140518586e-02 4.222903333452759228e-02 9.678584323050945515e-02 2.612955499324816078e-01 1.740971154179337677e-01 5.729294896395555753e-02 3.128561299952031804e-02 2.691607011030958119e-02 3.510341435746259370e-02 2.387705716331536276e-01 6.637636242531240460e-02 7.245716685661093837e-02 2.919947189098707208e-01 1.267892714737316739e-01 4.030634301773648731e-02 4.718984576459753916e-02 1.749414575410545430e-02 2.573516707130742501e-02 3.577923404329293872e-02 2.338496213275991220e-01 1.842139417564409715e-02 1.993284536714294911e-02 2.498670012851633010e-02 4.117305191212542598e-02 5.175298093777606911e-02 4.485725585339939148e-02 3.279125073938425616e-02 3.043008371808653134e-02 2.635696048720988227e-02 2.155666681991045067e-02
1.491269566708952089e-02 4.241755730609407526e-02 7.528663448910744016e-02 5.405260051641030267e-02 3.197679988372699456e-02 1.231173689496960072e-01 3.648876857830517240e-02 1.982376044770577106e-02 4.908500944816283212e-02 1.591172233270577580e-02 5.598716004239271543e-02 1.272327317048587564e-02 1.330369616156013568e-01 1.836618016663971731e-01 1.992906971706175367e-01 2.736858624628012993e-01 2.471180579565870061e-01 1.608425519272360105e-01 4.594324917935260766e-01 2.152305225243092701e-01 2.234778044627705809e-02 1.200655911061162123e-01 8.964823747019784461e-02 2.115130623286420319e-01 3.097515540702360307e-02 2.267462507439385599e-02 5.743167370665358540e-02 2.161052622844322410e-02 3.618494307020349993e-02 4.130812627469770959e-02
1.408404655365800943e-02 1.415312874378736423e-02 3.836818374445044588e-02 2.859855520449168242e-01 1.039877879666199351e-01 2.316555390773088891e-02 2.690660735972243978e-01 3.811713610346428860e-02 1.974180356093962335e-02 5.918906594252763137e-02 1.206877670790315327e-01 6.353857207603579027e-02 1.208283055986877630e-01 1.559089905792892805e-01 1.429386896889526803e-01 1.751779214446150257e-01 3.003187348688576286e-01 5.212566483455060018e-01 5.325335146899924377e-01 4.174095008262611040e-01 2.086335958599050411e-02 2.405334530010218297e-02 2.366627398059280990e-02 6.378067293869599252e-02 8.183012443019736792e-02 3.574111174504134847e-01 3.520186819929097544e-01 7.698279223877986521e-02 3.727954913781986873e-02 2.824154686018012089e-02
1.303381219334079875e-02 1.420882414931139842e-02 3.167623241601266043e-02 3.492805255628944616e-02 2.332924730397073140e-02 2.449357242954671929e-02 1.360824162786331004e-01 1.901592953132336117e-02 2.980127005388923112e-02 1.153480742119834639e-02 1.191022932401811056e-02 9.711511798115850247e-03 6.972073814732504538e-02 1.424264433535881447e-01 1.338801891644784692e-01 2.067088175327108646e-01 3.601478341365635938e-01 4.402207339552044463e-01 2.556441606560923563e-01 5.564050234831750125e-02 3.304113226981187507e-02 2.246760985003385391e-01 3.248192659005186278e-01 5.370921100400489756e-01 4.980309737659907032e-01 6.415704352048340331e-01 5.064831308010998567e-01 1.517349918810182996e-01 5.411218044850790720e-02 3.149798554159304736e-02
1.673877559879210011e-02 1.935597898262342992e-02 1.872665479639831071e-02 1.743309737652486147e-02 2.495506100894833920e-02 4.178509838021162576e-02 8.642342099085295604e-02 2.768242336662716241e-01 1.305115716121235947e-01 2.224888608042190075e-02 1.645849124774081615e-02 2.559802627240153131e-02 5.064799158051545153e-02 7.483019917265798515e-02 9.906171281863702938e-02 1.779082876326207596e-01 3.865989777591897214e-01 3.916358380329734157e-01 1.865167397121770820e-01 6.400257631291571270e-02 2.729211108878288883e-01 4.899418850505353751e-01 6.220021313237599214e-01 6.279868158316349591e-01 5.441963131612779225e-01 4.638164991210322885e-01 6.760155689111206900e-01 1.209884510498675098e-01 7.396894468817045987e-02 3.984031425285920747e-02
4.156172270134581709e-02 3.276478534682460836e-02 1.588381231489139830e-02 2.205499199658519233e-02 1.027991674706282138e-02 4.177282431307272753e-02 2.231642523374096077e-01 1.807471210774842241e-01 1.774941464604460617e-01 8.867009352137163181e-02 3.448636268668548582e-02 1.067910663418328125e-02 1.037665938191364469e-02 2.473351697383436784e-02 4.877889504662560882e-02 2.226057470197946031e-01 2.361479765075278348e-01 2.829356150714791296e-01 4.966647386668692626e-02 8.766383713655209742e-02 3.007985958480307587e-01 6.422010763227898877e-01 7.811620949776645340e-01 7.939346726337617177e-01 6.428564643634847586e-01 6.103946626591612024e-01 5.595773914683550565e-01 4.479943299611910956e-01 4.649236364801541399e-02 3.086368537966586723e-01
1.617909916292827391e-02 4.472864632200439228e-02 7.774782842559736784e-02 1.788690173283345383e-02 3.299244148068315036e-02 4.534597647503046947e-02 1.428196775465423451e-01 1.783638847998743893e-01 1.220579877428207144e-01 1.034305556518147623e-01 2.502650300290178847e-02 8.282173577032909961e-02 1.256093094027348755e-01 1.392922965133149178e-02 2.199588319332051317e-02 1.014976284649877492e-01 4.294219089231444270e-02 1.414298053324753758e-02 9.243912158793524125e-02 3.148764010991245837e-02 1.159209893767275262e-01 6.091813226444965368e-01 7.601567251399335978e-01 7.827894504708353685e-01 5.627548861397332347e-01 2.571724420366462427e-01 4.126010859338743453e-01 2.810706648569546440e-01 6.477074429626390739e-02 2.242623511165727779e-01
1.178829881630772368e-02 1.689113777728256868e-02 1.090601482622078483e-02 1.228106209717552341e-02 2.578738600628726826e-02 1.478642451208735456e-02 7.572050438859702359e-02 9.748592449390668102e-02 8.943319034952615376e-02 2.563373067456947360e-02 2.236032625870811308e-01 5.743231484659638147e-02 9.827303546387505806e-02 2.342616894387158644e-01 3.034261284577460110e-02 1.509816976649056529e-02 3.021597296199395044e-02 2.178856025786766737e-01 1.674839515466531106e-02 7.165335404205290526e-02 3.737784149531707123e-01 6.977725711846405332e-01 7.384588874761454091e-01 6.922200234816268116e-01 5.249590883158644639e-01 3.801657920726110307e-01 3.651911737527610002e-01 2.553848987853132302e-01 5.232113662963171902e-02 1.726280235318820300e-01
2.772467288179501776e-02 2.810480844970522987e-02 1.653817652208025915e-02 1.352920206832915369e-02 1.823074166526300610e-02 8.565333942559472807e-03 4.413543604552223193e-02 3.739283258693157364e-02 1.042775216465035258e-02 7.255374222814376522e-03 9.817209875322663315e-02 8.715715913700958217e-02 4.813790382388594136e-02 2.161847948344597717e-02 4.499318060418665277e-02 1.265937366417862753e-01 1.635771064998497656e-02 3.636443532705800619e-02 3.509735277034041478e-02 1.423342608334625947e-01 3.836510213963140736e-01 5.587350135343450708e-01 2.238457229296334228e-01 3.326833450125152303e-01 4.182055674390935951e-01 2.352134427420609908e-01 1.870365092888382208e-01 1.637186486119976969e-01 9.690996838350328380e-02 1.053741928626155122e-01
2.248129854294236493e-02 3.197232412178459965e-02 1.531972808942761166e-01 1.321756426137570828e-01 1.236702165729986480e-01 1.795180879012994168e-01 7.770097888113237580e-03 6.357940718268187408e-02 8.850028427440258250e-02 1.529537264203919243e-02 2.261433263337624469e-02 3.621854985208612654e-02 3.393416244711987967e-02 1.027077079994472703e-01 9.923807635766871207e-03 7.603759506364317355e-02 1.430040499924370434e-01 2.028303237303294704e-01 1.399999799734805428e-01 1.052482843571881238e-01 7.324460320065809271e-02 2.638038943854534302e-02 1.817917461170807936e-01 2.177773009953189870e-02 7.682164275822569999e-02 3.024138687381550117e-02 3.337478830151252573e-02 1.403250776565951596e-01 1.812806769019750103e-02 1.690748072848700587e-02
4.799433846759632027e-02 4.851640345445486224e-02 1.747020714923083473e-01 1.028681209555422499e-01 1.729275545481722132e-01 1.341827372101861426e-01 2.099987233761991812e-01 2.314021459849757364e-02 2.110941316054536568e-02 9.140119365371670787e-03 2.265421777614031254e-02 4.182247729175458256e-02 4.478475902718091761e-02 2.008426285344171169e-01 1.306167462679796304e-02 4.250604189526276805e-02 1.572623533732523948e-01 2.964886396915958344e-01 3.393045023969648022e-01 2.931034792224611607e-01 6.524806588131540352e-02 1.757262628898558984e-02 2.485429429689415062e-02 5.514359659196378660e-02 1.048063494069394197e-01 3.091530734717943402e-02 1.637912004981123271e-01 6.681438125616168122e-02 2.490468179819175371e-02 2.382878297537823972e-02
6.050006442003518642e-02 1.060940018111222738e-02 9.925972070258114177e-02 4.285115399241398726e-02 5.422096873506064563e-02 1.233712625954067055e-01 1.656498784479757402e-01 1.926630029461450302e-02 1.040930071131987607e-02 1.186895331535512722e-02 2.156631063412984758e-02 3.681772753942884335e-02 3.378769246414004696e-02 1.578354011946569713e-01 2.450887509187472599e-02 6.909170985282590827e-02 1.199004264766628386e-01 2.791282011882756930e-01 3.549524298357254470e-01 2.998536538650313221e-01 1.748993555714201398e-01 1.892227915391148096e-01 1.288044571020151297e-01 2.302747824141983535e-01 1.124884649217376409e-01 6.236399659906300547e-02 5.572054810262817848e-02 1.151516777287441839e-01 2.003478965798730083e-02 1.800768438251739920e-02
3.739382963836312967e-02 1.615761163907109693e-02 2.161772813244747238e-01 2.314273487799903550e-01 1.464878667302140121e-02 1.043641900702307543e-02 1.697480096377488867e-01 7.228533659327181227e-02 1.057812833576999706e-01 1.352525060080618791e-01 1.268337748677997139e-02 1.525399653906848486e-02 1.990000695840703562e-02 3.796040011168286266e-02 1.871161170453893852e-01 3.145884862863997100e-02 2.281371651930861125e-02 1.007157729672482904e-01 1.251512541760683717e-01 1.040078316611279530e-01 1.081434326433836079e-01 2.400295463873255153e-01 3.774592626022374442e-02 6.155270498527834477e-02 2.491880925725179496e-01 5.220452439734012823e-02 1.186725234701182102e-01 9.464832408673408415e-02 2.334438218702553081e-02 2.023012092649519034e-02
1.355331725568713168e-02 2.192540201612714068e-01 2.807762790427047461e-01 2.014553435777198878e-02 3.044301350088825520e-01 1.429814814957457436e-01 6.854966143171449533e-02 5.026214053649786379e-02 1.579767640510186810e-01 1.363210342567930909e-02 4.165744837542113832e-02 1.546267853436286005e-02 2.272633459317993654e-02 4.151711299780138503e-02 1.698063367480703856e-01 2.228929266096466369e-02 1.746408801194169469e-01 8.162559873243961650e-02 1.187892529843052047e-01 1.998647377915641898e-01 2.573502395812039129e-02 8.041512925118973754e-02 4.097427022475727543e-02 1.898787026487951668e-01 1.092031457275398076e-01 1.330564735742129634e-01 6.655056206796974849e-02 9.948305513228095087e-02 1.902688111148297667e-01 3.215019735413980617e-02
1.395169339937664399e-02 1.589326403176845662e-02 2.694638048411262532e-01 2.181777412112011205e-01 2.136298803226570897e-01 8.452197756562213060e-02 5.642793503333147498e-02 5.914817401659012985e-02 6.618035867838538422e-02 2.626655821726586182e-01 7.714465492343176856e-02 7.751711999501850747e-02 6.192601839285933468e-02 6.218994192961899148e-02 1.634115854747382746e-01 1.089850925604933241e-01 7.626851239455495479e-02 4.611162712367322669e-02 4.015768414840507200e-02 3.005586703147849342e-02 2.388842864978553762e-02 3.466174636373398760e-02 5.261371405549826463e-02 1.219786939356548305e-01 2.070661125489672572e-01 9.265204119581635367e-02 1.411106197533970874e-01 9.701246675748952109e-02 9.944728663357181586e-02 6.511532584318296957e-02
1.660563528119588309e-02 1.170262193479626976e-02 2.699682279843833022e-01 1.148492945135847279e-02 7.961857121923309258e-03 2.045042522543258079e-01 1.282726680284780769e-02 1.009244868348488887e-02 9.113451106049456907e-02 6.614235737219602285e-02 2.483117797708536689e-02 5.783405468986425185e-02 1.442801849666153213e-01 1.312317724424944265e-01 4.833092875930486421e-02 2.688266841300074317e-01 8.644690164792646903e-02 9.975983926481803155e-02 4.538049786309212436e-02 2.012536510652781704e-02 1.946889824227421295e-02 3.029027121294450633e-02 4.580816239342769269e-02 1.384789623240965661e-01 1.384923347628627677e-01 3.245880437147482395e-02 3.575274313465398590e-02 4.565272063428707505e-02 1.476036781937335451e-01 2.999568392529670252e-02
2.234732440455362498e-02 2.304505041103746196e-02 3.069975241036735358e-01 2.500729285965710980e-02 2.450056985614605665e-02 4.614594518666279704e-02 3.287852026590004639e-02 2.286312633893564095e-01 9.041701798798247591e-02 5.256384414184546439e-02 1.598174992759638161e-02 2.053222272731431222e-02 2.186815782553729048e-02 7.395078251205269848e-02 8.671123806334495032e-02 3.605562656043787007e-02 3.024509039466751273e-02 3.187489884115584510e-02 4.324566593235930345e-02 2.511791901349800377e-02 1.781432165391816022e-02 2.652316080878178856e-02 3.016721561000590413e-02 4.976504481356253812e-02 1.531853320951510611e-01 2.385556529141462032e-02 3.428980402666447630e-02 5.572669429496335952e-02 6.677830813398766274e-02 1.317357415179058744e-01
1.225404715282453483e-02 3.347374887609200211e-02 1.009650132057544197e-02 1.092500669515099679e-02 4.778381718595611088e-02 5.035248011454188793e-02 3.559712571476465054e-02 1.566827909619136205e-01 1.206769920750289937e-01 1.131821296018889061e-01 4.667533190711035951e-02 2.365171415644994404e-02 1.420397081340891814e-02 2.227532206216000649e-02 1.008428441966744832e-01 2.619545879099945476e-02 7.064688046761311013e-02 2.959905546750703220e-02 5.529189402250932889e-02 9.683246788484210776e-02 2.498195011938195154e-02 3.495338845743832523e-02 3.042623890354582625e-02 3.314482874308290888e-02 4.353704117057933393e-02 3.305369029542407078e-02 3.863932771267929167e-02 4.735141251528856426e-02 6.339621961591065946e-02 1.550438499393440028e-01
