1.035088584855296395e-01 3.793313605434191476e-03 1.142247530712533045e-03 1.440565617732733443e-03 1.096165887690718531e-03 2.409044092970248629e-03 2.395112761826743205e-03 6.493704509002978971e-03 1.180832130418696217e-02 5.289430078354386694e-03 4.317904856420809283e-03 6.462041076283314700e-02 4.045318849630751001e-02 2.211444889827262998e-03 1.735969134589500319e-03 4.390515850863076219e-02 1.437171626386842243e-03 1.892162665512298883e-03 1.733898402586548293e-03 1.201185583261003310e-03 1.420496972987957685e-01 2.191938091182064202e-02 1.675528763603722007e-02 6.645287748318375043e-02 1.278595788727698856e-01 9.940078657717560384e-02 4.527251104815965821e-02 3.944089069449005155e-03 3.725102182744086457e-03 4.632450920941975220e-03
6.792604805750342145e-02 3.975569903316423376e-03 2.829191814523359348e-03 2.303940187815423785e-03 1.607445786441529835e-03 8.612479714887912030e-03 4.784425215965306538e-03 5.940769356209307100e-03 3.341716210308944088e-03 2.424589700739169813e-03 2.862245074000967920e-03 3.358298506434091724e-02 4.827132366023643290e-02 2.027121043699981785e-03 2.067309895971309545e-03 1.375376004781011293e-03 1.398299779889267081e-03 3.511993345421886986e-03 2.677886427018117462e-03 1.592434436978605638e-03 8.212588293371707315e-02 2.110310436583901633e-02 4.388656370301686344e-02 3.890360140183708043e-02 3.401473671836480195e-02 4.501525180550745853e-02 1.560646018220494639e-02 3.945451382044875763e-03 5.581236684196835308e-03 5.543740003013555677e-03
1.078722230936453481e-02 1.057683341794614547e-02 1.861641837581049300e-02 1.512042221125568103e-02 3.218731928007868837e-02 7.498276939852902001e-03 5.846355490921117254e-02 6.176001533164963975e-02 1.841647911784492775e-02 3.588551086722391141e-03 9.434764045410328273e-03 7.241404853673361064e-03 2.676810230707198958e-03 5.332852379191528776e-03 7.437533424842025787e-02 5.298059888838969368e-03 2.550421510231888622e-03 4.362287921136374924e-03 1.077798013742511420e-02 3.161335527819838544e-03 5.186351134615992120e-02 1.748795396939568231e-02 2.679840884027090073e-02 9.248679574196588815e-03 5.395040373666281329e-03 3.491961499182016492e-03 3.061376292494669311e-03 2.402081948336804839e-03 4.091560059798256786e-03 4.579272817220787252e-03
4.158638066692360927e-03 1.180389138651816161e-02 2.588482469545061795e-02 2.089364658166034672e-02 1.074417824572628487e-02 5.623892222166288965e-03 1.186066841377760861e-01 7.347019732761707334e-02 3.975179520393167659e-02 4.651115648939551338e-03 2.581333221803457870e-03 5.117673093193934875e-03 2.302578328944907774e-03 3.632167116276019576e-03 5.632735883583496472e-02 4.997949766036469121e-02 1.091073217235809245e-01 1.631944657690959392e-03 8.767104128215516285e-04 1.083192067520337811e-03 8.987639129239267943e-02 3.583303654699539903e-02 1.235641889681162765e-02 2.421292913023367910e-02 4.379023269509615263e-03 3.093883405532687255e-03 2.613609498749437394e-03 2.476375646265815880e-03 5.021097004750119108e-03 5.446768840213046976e-03
2.436973983648279846e-03 7.552479707590978829e-03 2.105907396268929394e-02 8.166899402469007807e-03 6.706002016054201341e-03 7.090956501906861553e-02 1.219139582560336138e-01 6.787523778746518133e-02 2.469170074708914447e-02 1.139706421772083804e-02 1.150680040357896297e-02 1.193305629618083251e-02 2.255116562908931425e-03 3.793715062089070451e-03 7.229945301994926410e-02 2.944398180071718454e-02 4.895618464890526267e-03 1.704698154379623602e-03 2.207305092438884356e-03 1.315899976343774640e-03 1.144810499606916179e-03 4.527112762702746596e-02 1.165591279443938255e-01 3.737222270539043711e-02 7.872662500400707739e-03 4.154383748155752835e-03 2.855108067728060871e-03 3.293043432552906092e-03 5.137521385419075923e-03 1.883984080982896783e-02
3.774436394613424773e-03 4.091293403773635373e-03 1.497659948545064859e-02 1.033302617530062681e-02 5.455474686429244262e-03 4.056139019964900838e-02 5.056678130196388954e-02 5.265425756067906859e-02 4.181111514335279083e-02 1.603732327527174553e-02 1.357651205280814045e-02 1.007127431441048535e-02 6.440840760989714753e-02 2.360552546365426996e-02 1.937350756972437693e-02 3.277827603819219449e-02 3.449731654694508393e-03 4.476470537201049371e-02 1.301765250188386585e-03 3.192851877114602759e-03 5.006953187035491012e-03 4.589800166377234689e-03 1.660259419168970884e-03 2.178164794053897430e-02 1.168919469182781376e-02 1.090820194615309269e-02 6.765218650803711195e-03 4.648388039913902738e-03 6.113594269277856930e-03 1.094962677933042361e-02
3.761010049102781611e-02 5.761067207099494075e-02 5.660853895277068865e-02 4.407598773485625794e-03 1.679097337223616707e-03 3.665161421899747890e-03 6.853253926866612229e-03 3.679365561044130404e-03 4.284707357038262249e-03 4.517115000761231722e-03 3.824369130701450736e-03 7.827418656454325496e-02 3.643561792342796257e-02 1.678771059042090050e-02 9.540328987374648018e-03 1.607276322386103073e-02 9.173315435367512816e-02 4.164236774298493704e-02 2.035156715026663517e-03 2.940379447705067373e-03 2.093950966295661346e-03 4.425044831941604001e-02 2.087729625164812947e-02 1.964202919697748823e-02 7.934314020238109402e-03 8.145177957151601006e-03 7.148477216596656712e-03 6.146179743513085179e-03 7.011146774820525666e-03 1.657657333294127941e-02
7.748767983202145548e-02 4.467298632805372094e-03 7.998859980138231518e-02 3.076129293370758605e-03 2.712050422858578152e-03 2.997717360443021787e-03 2.584020695028186286e-03 2.370251304176283422e-03 2.688201781338831180e-03 1.031080015852217369e-01 4.352174347364011486e-02 2.768357579844516088e-03 3.089149898075745082e-02 1.111410598957338416e-02 1.240402766442476844e-02 2.259400745693419810e-02 3.338752457536502995e-03 3.963693317644499149e-03 2.688608354113539590e-03 2.459745556817240480e-03 6.383330263425741891e-02 3.787218334554835752e-02 1.540894705223207553e-02 1.292171177565791702e-02 6.135449221720469526e-03 6.344400594637701965e-03 9.741181057203047652e-03 1.093067201291677767e-02 1.081115828045714836e-02 3.117086910259631374e-02
3.710205518232026576e-03 3.188664232262582773e-03 6.887360941371888090e-02 7.176631522992197448e-03 3.458356590870720511e-03 1.438734403879378182e-03 4.533670480901421176e-03 2.210236953987109332e-03 2.556150520417964020e-03 2.954632212288986742e-03 2.247137784697614792e-03 2.383643759590462537e-03 4.656041677584233165e-03 3.946019932869253462e-03 4.076252532823699398e-02 3.404313333522163837e-02 1.798876394338797761e-03 4.101289129784320593e-03 4.958599327956686280e-03 8.603744929859799551e-02 1.723883335293245958e-02 1.806395312379665066e-02 1.975127168707265304e-02 1.290566846847929217e-02 7.523962395314367536e-03 1.104474338339571891e-02 3.873748494623966560e-02 6.858281126125900795e-02 3.111556704090196867e-03 9.529614386640111734e-02
3.434703669181420234e-03 2.760809718651092981e-03 4.382245336318395766e-03 4.065628888858062624e-03 3.870846953589456799e-03 5.051315887474670113e-02 5.314688418369921744e-03 2.337100138016261989e-03 4.932600121163693146e-02 1.795684040726665265e-02 2.445832026179425162e-03 2.324707839868702872e-03 4.973153908617407130e-03 6.321137483701024656e-03 3.293579599223481636e-03 3.603365512183826901e-03 1.684795696843124219e-02 1.611425192206730056e-02 8.657730272327487583e-03 5.655564006380596649e-03 2.241329543160429025e-02 1.420788318965741405e-02 1.634230907687220929e-02 1.791425843065874018e-02 9.947142651205361299e-03 1.231142973588401565e-02 1.061219976695578215e-01 2.694187678083127205e-03 3.207302332934510673e-03 4.993228703322071665e-02
5.552417204814637935e-03 2.808809354797371389e-03 3.953762827198213127e-03 2.853148547642449413e-03 6.473318892824850117e-03 3.190209669259969766e-02 3.048825261317561139e-02 2.735080308067395355e-02 1.840786296371873382e-02 2.156558293914336705e-03 1.959132283132773711e-02 3.177259538662714766e-02 6.665409240667789781e-02 3.389665222632130825e-02 6.425014051938798473e-03 1.294352679975201148e-02 2.404519879596920748e-02 6.584311340107907792e-03 2.350523328431953270e-03 3.709182585518355779e-02 1.565937356382388415e-02 1.400983645213869401e-02 1.811058493427460114e-02 2.524503452926087771e-02 2.680765996081803382e-02 1.428309711900728821e-02 2.128130480886573916e-02 1.552635696023524185e-02 1.361872522041277823e-02 9.770878075449296318e-03
5.525587587489214775e-02 3.009154148652644356e-02 6.409624587803950529e-03 6.887659142335932072e-03 6.401443177952944631e-03 5.172286979191315776e-02 2.408397211707036245e-02 1.652410879580345701e-02 1.946689982333429589e-02 3.764591609730173760e-03 6.077635830653019093e-03 3.965478189130385717e-02 6.973658937821052006e-02 3.729959268211670287e-02 1.384776190506943096e-02 1.607310846983028840e-02 1.780472076924701288e-02 1.046702784037077151e-02 3.954658053187258201e-03 8.622396539309978847e-02 1.525934718965759988e-02 1.553941370942954481e-02 1.837904815174771361e-02 3.268327068271008329e-02 3.080759575766326211e-02 2.173665377569810112e-02 1.651343112981883132e-02 1.465332033235860684e-02 1.567227094306261267e-02 1.659750814065012389e-02
1.297813385717923491e-02 3.051058850178766518e-02 6.704094120217608810e-02 7.459650662071982269e-03 1.235376157382113843e-01 4.307071284438975661e-02 2.413161664987431912e-02 2.112949509415424504e-02 2.695969192785768742e-02 2.137522676551915392e-03 5.101800517941208757e-02 1.349446335708479050e-02 5.242928742548874643e-02 2.321251583343669420e-02 7.527656608189704085e-03 8.972441707347202783e-03 3.343271335424595307e-03 4.928765496882423977e-03 7.560255696823419379e-03 3.387442154923296471e-03 1.488122732420680584e-02 1.630435159355058186e-02 2.044598802206033100e-02 3.371403567671434065e-02 4.228900546093170010e-02 3.701025019840452346e-02 2.702062708650684875e-02 2.492670813119388096e-02 2.147571583704227863e-02 1.746243725530249868e-02
1.108637672989809357e-02 3.043287221268309653e-02 4.732246249064551297e-02 3.337297219248190616e-02 1.984490454290902331e-02 8.748271586617398232e-02 7.445954806468098319e-03 3.501274914338146395e-03 3.789720007570345633e-02 1.231277812752732369e-02 4.353347547898309827e-02 2.608280335450170392e-03 2.411532432198820047e-02 3.375692816424197967e-02 3.715963582362346446e-02 5.168040059565520011e-02 4.726062260303418028e-02 3.107922489779759226e-02 8.589799535771817929e-02 4.112893071781768828e-02 5.495620901108003858e-03 9.871637320548670713e-02 7.336025578694264915e-02 4.140801913526127517e-03 7.058422016308490109e-03 5.608505295861813088e-03 1.363678311779959601e-02 5.851562116728175125e-03 2.940541712891101001e-02 3.332414179074860011e-02
1.052146807258738659e-02 1.019352540645575289e-02 2.447969218482353923e-02 9.389711061513037957e-03 6.381833328498266733e-02 1.614207915405140373e-02 3.688427132376326245e-03 5.387181248383644816e-03 4.061814695661136732e-03 4.731949470112935263e-02 9.650663005819545837e-02 1.278708019843614700e-02 2.154779479219491936e-02 2.823861958337490347e-02 2.628853310189204276e-02 3.267529179828347619e-02 5.695620376345761349e-02 1.003914676976159909e-01 1.041409613062652395e-01 8.304889623344445526e-02 5.011814312329838927e-03 6.298339636704579705e-03 5.449776873447853033e-03 1.273937374943779136e-02 1.471738518034973117e-02 7.406689543832969957e-02 7.259135269834236792e-02 1.768984474178149705e-02 2.999831556224882498e-02 2.257792612644779484e-02
9.849737162727837184e-03 1.046464711318504694e-02 2.043153920503661819e-02 2.159778474968625239e-02 1.403786041250632347e-02 1.702856900468473905e-02 1.044248725492703950e-01 2.610820364781440972e-03 5.707803937923258165e-03 2.410491057016093952e-03 2.482283873771399044e-03 1.870331961890696467e-03 1.213854494054011565e-02 2.530023403224434045e-02 2.425070322249479882e-02 3.811383874285532297e-02 6.772143229994687097e-02 8.442644047043124100e-02 5.001460193320850234e-02 1.111098595986420405e-02 6.718719569087636991e-03 4.643342608618333117e-02 6.805284526543109447e-02 1.124706820129794949e-01 1.033515538970499748e-01 1.316059141379253006e-01 1.028658098164491747e-01 3.284336627351702731e-02 4.289858620822287194e-02 2.484784152556286999e-02
1.282897093644684572e-02 1.464002969756364111e-02 1.369537481321357608e-02 1.233754434704408161e-02 1.791929425873622916e-02 3.168472939770190788e-02 1.613845114212048709e-02 5.124981363930319195e-02 2.372748417596686962e-02 3.968421944306581468e-03 2.871924930927640188e-03 4.356093355735136778e-03 8.609799789206033435e-03 1.302722474391797454e-02 1.763184931017347870e-02 3.234339605215231367e-02 7.197995025293345284e-02 7.483236864097218832e-02 3.652671126392796619e-02 1.282175646167473676e-02 5.567041211837910064e-02 1.015743202038029286e-01 1.310292599523172619e-01 1.317592489920759169e-01 1.124889906668174733e-01 9.416876428419611311e-02 1.350603191728694252e-01 2.514479602052624441e-02 5.531739350727747639e-02 2.963916005105243084e-02
3.227419022922532049e-02 2.545315754112462484e-02 1.224443361064662776e-02 1.702193534270914771e-02 2.039250005990229410e-03 7.540986458705272073e-03 3.966339862812710143e-02 3.233062538510075856e-02 3.218517288521765413e-02 1.569472972138052577e-02 6.332788014990267493e-03 2.131974174582562404e-03 2.061725356490080874e-03 4.747531364383961519e-03 8.537326959082233366e-03 3.994062345808381542e-02 4.358951977437051234e-02 5.504392619493003735e-02 9.921141558631982327e-03 1.792224558967110346e-02 6.152731938610937756e-02 1.338024106051324547e-01 1.657948734755743114e-01 1.672516186066375921e-01 1.326559686074820776e-01 1.227710418419364208e-01 1.100478713811103015e-01 8.944626978504172099e-02 4.994600406692230321e-03 3.465818759183418238e-03
1.274993727534546109e-02 3.546395077971986609e-02 6.178852911338730131e-02 3.926127175814126888e-03 5.884374786864267695e-03 7.766772382856742749e-03 2.466730246216885733e-02 3.100982125266542669e-02 2.132309757716012791e-02 1.632062943906144314e-02 4.492462510596456626e-03 6.422543353252568865e-02 9.581989596321852098e-02 2.506593233029144260e-03 3.043207300210085987e-03 1.802040680008768977e-02 7.115250863333033582e-03 2.472512336765501830e-03 7.359929689979843870e-02 6.321463853202027514e-03 2.316060385994066217e-02 1.235811714112949183e-01 1.566499983163948395e-01 1.613726676994376441e-01 1.151407077196421602e-01 5.207217278395755850e-02 8.260085557308713411e-02 5.625549816993759278e-02 9.326113094301532319e-03 4.068135890048341953e-03
2.571187435616539320e-03 3.986712353063983326e-03 2.473834027794691304e-03 2.483008807496929655e-03 4.412735619293817711e-03 2.508467330916272151e-03 1.278614186996497246e-02 1.637232695372349903e-02 1.496145301547887815e-02 4.388394768516871991e-03 2.003501562356482541e-03 4.453766690133568323e-02 7.503097200257112520e-02 2.319560545546608347e-03 4.223626865511377268e-03 2.622325375569964454e-03 4.693281665918376533e-03 1.520862200006778929e-03 2.929890212752445967e-03 1.406262243148561665e-02 7.271675714384337463e-02 1.375264174834439079e-01 1.474747521850231224e-01 1.395969028513627530e-01 1.065687959655919198e-01 7.748694557784530090e-02 7.452431049067376190e-02 5.480566995587626833e-02 1.346777116526549217e-02 1.318338122166672066e-01
4.998716572465773840e-03 4.600792492277109950e-03 3.059483786147937975e-03 2.762012635398759970e-03 3.725419514489383167e-03 1.521820108540574432e-03 6.799349358711859366e-03 6.703141679796331340e-03 1.905036683683446370e-03 1.391431650765214767e-03 7.650292381340594028e-02 6.753345258056329958e-02 3.679326594465508193e-02 1.653782978296072098e-02 3.437035783918854920e-02 7.151203873571707233e-04 2.502011334697075342e-03 5.891509959109264734e-03 5.850359360437287076e-03 2.664251605875067597e-02 7.262659663483461703e-02 1.048389624222372946e-01 4.249031766273067556e-02 6.446081858923986829e-02 8.432702960034724193e-02 4.824749806741385205e-02 4.169595673229611887e-02 3.911432718631496080e-02 7.624322689836018907e-02 8.291683018359170820e-02
4.035686759535674073e-03 4.655123118747720584e-03 1.183392978476017782e-03 1.052241001160528489e-01 9.941499446899562664e-02 1.444744986317763984e-03 1.209498501925209118e-03 4.959200463009331983e-02 6.977442790189333777e-02 1.209395699876124157e-02 1.783756093340664595e-02 2.841028850390559315e-02 2.591889825556368057e-02 7.837997043853270340e-02 1.627479763695885429e-03 1.295120744428006690e-02 2.425132309486767446e-02 3.615606305628037836e-02 2.542503192730989972e-02 1.943435508140600038e-02 1.368606550036378412e-02 4.862786537674706859e-03 1.874884901425056183e-03 4.141759693759283593e-03 1.535743236884226648e-02 5.300256900984710168e-03 7.312514667173979251e-03 1.102435240586814302e-01 1.439477984686711280e-02 1.343659916268828865e-02
8.526046719280467451e-03 7.571210023264790361e-03 1.466167122137695782e-03 8.068137744837333702e-02 1.369773323699932099e-01 1.039222938716212047e-01 1.233359342750115027e-03 1.786987653669630527e-02 1.677865204694231616e-02 7.290447549029395978e-03 1.806699471817695135e-02 3.304294759121966657e-02 3.443897283483354776e-02 2.430638958535414826e-03 2.474052390531457889e-03 7.416243243703091875e-03 2.789535438222460681e-02 5.348368008244883814e-02 6.223226130689548524e-02 5.464121168346649376e-02 1.151388589889651252e-02 3.565818549278804411e-03 4.344532414573359057e-03 1.031213943441049684e-02 1.786892460137015290e-02 5.365293626333944924e-03 3.582380332765498342e-03 5.272533206313469167e-02 1.988802775306306933e-02 1.907930246789913201e-02
1.062913538752442016e-02 1.570891952145725802e-03 7.694327690132533870e-02 3.265769935220688702e-02 4.252018879323907902e-02 9.571156749061661417e-02 1.275983517022578340e-01 1.474009505970824176e-02 8.354639637823057033e-03 9.548500365871560175e-03 1.734342345964604015e-02 2.933992656692658088e-02 2.610091479068983242e-02 1.216439745711973414e-01 3.964266457686780980e-03 1.083726755830130214e-02 2.157284207025839465e-02 5.099880125203155867e-02 6.581110541173547379e-02 5.638105614372982549e-02 2.792207896980986384e-02 2.608848973951421232e-03 9.850922689495739126e-02 4.091176092803680726e-03 1.650942907358099107e-02 8.887733143351070689e-03 1.215597206739176851e-02 9.105035054368716685e-02 1.603548395383880276e-02 1.447788116846835012e-02
5.859896491004738459e-03 2.150597592037028962e-03 9.527730147463517839e-04 1.012596123028575764e-03 2.530323784580026068e-03 2.511268108332576944e-03 1.363808989837922148e-01 5.835517397531878730e-02 8.566817447098920568e-02 1.095627616008026384e-01 1.027050868125764169e-02 1.227039779091443870e-02 1.591260862258094336e-02 2.947060091293118161e-02 1.800437917275728682e-03 3.411572158764632819e-03 3.876446356833017099e-03 1.843043737188573838e-02 2.388954505684094329e-02 1.933703014356242741e-02 1.853560763806476330e-02 4.772790666697123568e-03 2.742910615624611151e-02 4.430639539553464512e-02 4.053858752905681838e-03 8.982458791778344734e-03 2.801600581250877908e-02 1.541679505482601055e-02 1.811937306378971768e-02 1.580637251234052326e-02
2.095293420872171124e-03 8.300914320788457161e-04 1.097479431047522925e-03 2.289428292449892897e-03 1.550067992053001621e-03 1.125050552807091153e-01 5.523018219046433447e-02 4.070652469412972679e-02 1.261471212526830143e-01 3.172324835553961327e-03 3.333035552247994721e-02 1.248988844618042007e-02 1.825594077460913900e-02 3.220914521437832218e-02 2.546684057244408446e-03 4.055763724011627984e-03 2.848888330653534442e-03 6.566290686617233530e-02 9.623376985181665566e-02 3.370562404395727098e-03 6.690433517665481632e-03 6.309347848553420457e-02 3.084326433701641348e-02 1.394208436881273251e-02 3.030491756606729786e-02 1.031772952404961946e-01 2.255165283295056111e-02 3.045514251221768248e-02 1.773945419311292668e-02 2.529638873313054884e-02
2.123422106880246216e-03 1.701225829044867048e-03 1.041027123051856389e-03 1.632162655763396697e-01 1.672118541381859835e-01 6.638995201169493876e-02 4.546384052929694497e-02 4.786870587795538645e-02 5.280028943084286858e-02 1.316572950171319024e-03 6.173701953205487647e-02 6.255040295922668914e-02 4.983530657267016412e-02 4.908628105784058199e-02 1.212691419368793766e-01 8.077132649052909397e-02 5.854821311817812179e-02 3.699540619691160659e-02 3.251686555597843586e-02 2.435423179516408090e-02 1.925487489569633476e-02 2.765715850068711443e-02 4.090680325230760389e-02 9.479886781174000354e-02 1.607763871374926490e-01 7.299947139236469262e-02 1.118691719857713290e-01 7.691537711722609694e-02 7.931223627847484858e-02 5.223429855185562215e-02
2.883749935251457997e-03 1.500460372006108328e-03 1.070048987753934294e-03 1.818927728426398974e-03 1.818340651607435431e-03 1.637835445694398318e-01 2.459113202457771652e-03 2.041295749399794652e-03 7.223834937092750430e-02 5.269857232342247538e-02 1.985762194259360278e-02 4.667943136156806061e-02 1.163534147240990330e-01 1.049406498940738258e-01 1.006725542573701053e-02 7.415805913794462113e-03 6.669093858949355635e-02 8.027336554373853961e-02 3.684396045770752665e-02 1.637547917804276984e-02 1.579466453820364130e-02 2.440737956038252152e-02 3.669433731097477419e-02 1.103518060101959380e-01 1.099271622238768842e-01 2.573248574265103381e-02 2.843858083796565669e-02 3.659505586916825259e-02 1.191296219020668568e-01 2.436348821356165706e-02
3.882863057260109267e-03 3.355074501923798087e-03 1.014638501706426835e-03 3.453650878459915002e-03 4.305887402993911241e-03 8.066869015781335389e-03 5.838595615536676560e-03 9.020205963682965565e-04 7.303822246641314408e-02 4.267117764778158989e-02 1.296394639754071439e-02 1.658210581503695782e-02 1.765094150639144946e-02 5.959290756823582003e-02 6.732176168545014883e-02 2.804314862428035349e-02 2.349407714639498504e-02 2.572270817076935043e-02 3.515340043416419896e-02 2.047763667595371359e-02 1.452002931139129843e-02 2.158504401092155647e-02 2.449530604952925364e-02 4.010381255376377352e-02 1.225311507222735935e-01 1.899813144389872130e-02 2.731366794106908358e-02 4.472827865262249403e-02 5.398692220266049918e-02 1.071672226186982518e-01
2.134348660692322354e-03 5.315087599730684842e-03 1.575869755323442822e-03 1.670112426929093062e-03 7.991908914144158632e-03 8.359703647671556589e-03 6.005895854869907312e-03 1.258454087556158119e-01 9.701225770150259664e-02 9.128533061267078696e-02 3.755659893273265854e-02 1.895837095853639132e-02 1.136435442322966151e-02 1.777056859188993337e-02 8.072581540045903337e-02 2.106001085819291310e-02 5.714526376896664206e-02 8.125357518521253430e-03 1.618511671033999455e-02 7.912622956510725891e-02 2.041029094793025273e-02 2.853352750782612093e-02 2.481205209328542563e-02 2.683837784894290562e-02 3.501948725800889395e-02 2.645878916139012688e-02 3.087913572280178223e-02 3.800871518969672902e-02 5.112788012267751453e-02 1.254387289069463229e-01
