7.097212077203163272e-01 2.244014084770195108e-03 1.965426693287983598e-03 2.497284703635876783e-03 8.760892736489898081e-01 4.138895309070402158e-03 4.059178675658261203e-03 1.086687053250694375e-02 1.959398441513130612e-02 8.875330627551365759e-03 4.170109418313923400e-03 4.650079252906570426e-01 2.764727325419019111e-01 2.032547141347677919e-03 2.316177251241752222e-03 2.842060723709772252e-01 1.694675442909134369e-03 2.834760321961039397e-03 2.453571776788105938e-03 8.292340403099075210e-04 5.115672116534000224e-01 7.452205841808076658e-02 5.803515752936977412e-02 2.296009973650813829e-01 4.390340533566682302e-01 3.401553557463349309e-01 1.555984756347056075e-01 1.373364914262461753e-02 1.301759010581154952e-02 1.624297394414850673e-02
5.429865059449288101e-01 2.623583954803322855e-03 4.743949168397203209e-03 3.860841050839228933e-03 2.690828821522797416e-03 1.201822797515052221e-02 5.676405322646797119e-03 6.985891985354409327e-03 4.497598770423444012e-03 3.838212209863651331e-03 2.755399007472423244e-03 2.737010043928060909e-01 3.711800275642995750e-01 1.608066580786184779e-03 2.202026891706267142e-03 1.394811307921679615e-03 1.657997494381857530e-03 5.149049925534234483e-03 3.692143998837867612e-03 1.062075622143483214e-03 3.081846756750205030e-01 6.951971289846010926e-02 1.465258963607573850e-01 1.289520773605886683e-01 1.121077741358174479e-01 1.484228167349299909e-01 5.223863870613938698e-02 1.354197054714407003e-02 1.930071194010147054e-02 1.934487917584051114e-02
1.477536487187797523e-02 1.447390570502002372e-02 3.065106536372744911e-02 2.473047299192611750e-02 5.290260777315181073e-02 5.378778929053175395e-03 4.646852431733826672e-01 4.941607824946164240e-01 1.663858233229799019e-02 5.067378672757114760e-03 1.366951465456564367e-02 9.065185860159126127e-03 3.307823302684707260e-03 4.805331504949221684e-03 5.259814803014296603e-01 3.766029073979821132e-03 2.416841609982020491e-03 4.680122723067146190e-03 1.470367545327953655e-02 2.322440297412939163e-03 1.927607983020952764e-01 5.628035590463572463e-02 8.630423185215595205e-02 3.007987896461327207e-02 1.780479801135439674e-02 1.175057388182840917e-02 1.043472606401853880e-02 8.284419289590609636e-03 1.410338652006305413e-02 1.599398882263638327e-02
6.783740857277307211e-03 1.859435545572160273e-02 4.087237695703387769e-02 3.275811795635821810e-02 1.358549063912471710e-02 2.103369994152258678e-03 7.890453326614202956e-01 5.288132819351099023e-01 3.203741995790702068e-01 6.288291200217894020e-03 4.048021200341296241e-03 8.076035336853554236e-03 3.633882895623662210e-03 2.400202976421250863e-03 3.893026569991930863e-01 3.034705948035826273e-01 6.497339001706715633e-01 1.840733243360873767e-03 1.246508089539845061e-03 1.016365099401741155e-03 3.738805821723014122e-01 1.290675424397509097e-01 4.053346202959249439e-02 7.793717325236691751e-02 1.442946630475227913e-02 1.057075735293780926e-02 9.007039212576724990e-03 8.560360068143622186e-03 1.714285605179641236e-02 1.895102430264837892e-02
3.885146767084884240e-03 1.150119097094767784e-02 3.202770695430517955e-02 1.240566150005422905e-02 7.168453039747375508e-03 5.013701335779396917e-01 7.696635797203513762e-01 4.291138169794342372e-01 1.969320962388742269e-01 1.457459964482605771e-02 1.828783433946195094e-02 1.575072457649719093e-02 2.313094533800279934e-03 1.877796661862268920e-03 4.604005423442398826e-01 1.738449590125749622e-01 3.167227282629875990e-03 1.753938890912815334e-03 2.732864154701698713e-03 1.506925879358234771e-03 1.001882029022471655e-03 2.158350204225838453e-01 4.803784347002455490e-01 1.309237772078255257e-01 2.600135470113597302e-02 1.408229707115072130e-02 9.707903965506105987e-03 1.132880247252708930e-02 1.754788998561053123e-02 6.598186002013084472e-02
3.834709063750540384e-03 3.836688768556617210e-03 1.717030900627946124e-02 1.372543461628205827e-02 5.456739993933018736e-03 2.891368788414627189e-01 3.507748545573433629e-01 3.748429800148290747e-01 3.455018296785182796e-01 2.265763859840562444e-02 1.788612648397299235e-02 9.545101775228794633e-03 4.970511307649886357e-01 1.534694273951413557e-01 1.183412646084446296e-01 1.955747490025889213e-01 1.794796801595750693e-03 2.746749272542816089e-01 1.454884664207197744e-03 4.874561019503460824e-03 5.698582409881127082e-03 3.223096378295786137e-03 7.571416856609182542e-04 7.902854849117617320e-02 3.899502626849025294e-02 3.689785859539776447e-02 2.276952919381837470e-02 1.589780495337474522e-02 2.079176684325899013e-02 3.848935947588041917e-02
2.521531345806263813e-01 4.036621971128763198e-01 4.262803296632042827e-01 4.290821902840707795e-03 2.052069979678463468e-03 3.439342854027139552e-03 5.306054121339745695e-03 3.074462762611736809e-03 3.699649056375594897e-03 4.376464436043505171e-03 3.411807696744567197e-03 6.209973556112988735e-01 2.567158274990760658e-01 1.014047487028067462e-01 5.391171039193427827e-02 9.677938281572154300e-02 5.772745591179261337e-01 2.766712572640480650e-01 2.451785951454611007e-03 3.288798356082566106e-03 1.447885198397431397e-03 2.313902056344392666e-01 9.220287604744081822e-02 7.189910766411901355e-02 2.668239478100570272e-02 2.747792501866742204e-02 2.380644842794788635e-02 2.102166175360848516e-02 2.432415159196238061e-02 5.965931713557893340e-02
5.305987959502271867e-01 2.089125766081361812e-03 5.757499296547570200e-01 2.598650762681656637e-03 3.948571521459691078e-03 4.447453079041946249e-03 3.982649056430706894e-03 3.791567638773035796e-03 3.072670167315530356e-03 8.084836472417599174e-01 3.228503052319140476e-01 2.229795348858734996e-03 2.112826785992663603e-01 7.071662263352068711e-02 7.283004560036074326e-02 1.352644148747785824e-01 2.141138633035111639e-03 3.389277872963394281e-03 2.947391597548273175e-03 2.059009140747759033e-03 3.385014521871126392e-01 1.622774482278907249e-01 5.537536265965341264e-02 4.315712341551754261e-02 2.033007051008293292e-02 2.135480762923226000e-02 3.282548053757743112e-02 4.205531076137816737e-02 4.278263851312980037e-02 1.290691293180654120e-01
3.143995716303837548e-03 2.032747968491114242e-03 5.276198325298966374e-01 6.773491734623189944e-03 4.343301188934556301e-03 8.501218753487965740e-01 5.936598900627931136e-03 2.668088830282837158e-03 2.242646215835527018e-03 2.242470611674163890e-03 2.022872520075750906e-03 2.693100767146208892e-03 5.863769940814896053e-03 3.765308657261026183e-03 2.629629431214298707e-01 2.412002710474423772e-01 2.099858007469559279e-03 6.291484592937019761e-03 6.129250108705132719e-03 5.716302980220623331e-01 9.219267846668208199e-02 7.218937405731920554e-02 6.875266739064896104e-02 4.224848457899234300e-02 2.445834316330476599e-02 3.760900462693583107e-02 1.409719605221988470e-01 2.893761497337293265e-01 1.034517359536297858e-03 4.305891251122195840e-01
5.302189801780210487e-03 3.433015426751270371e-03 5.446493767863071905e-03 5.012333600472767756e-03 4.327815376361123303e-03 3.902673044419641135e-01 3.932637023652486331e-03 7.947340493045033094e-01 3.388589174699015438e-01 1.261350464041794406e-01 3.856426693061972000e-03 3.772143362501712612e-03 7.984332103725557891e-03 8.597896020184557855e-03 4.078682757549845043e-03 4.416907450011779007e-03 2.329395722311151939e-02 2.377697662060903813e-02 9.415042131012700891e-03 4.115132007190182989e-03 1.146386002968135670e-01 5.495850824266873547e-02 5.653803094709271282e-02 5.936673326683778590e-02 3.240914212615298579e-02 4.173409187865741860e-02 3.925571318169813750e-01 8.359478078209008544e-04 1.124805806191469040e-03 2.325718719768605502e-01
4.451814251464908910e-03 2.316204802900208651e-03 5.135155814575832756e-03 4.313547997929545463e-03 5.393497829602985835e-03 2.266381144127684044e-01 1.931155073972916081e-01 1.702976996270773868e-01 1.081458495979233658e-01 1.934209321046428042e-03 3.044257830370800805e-02 5.075957623086284343e-02 1.050211186915691181e-01 5.196221171194232574e-02 9.616801034029679590e-03 1.873479579591485339e-02 3.433816988911725376e-02 9.380844253418771372e-03 2.213649459061058956e-03 2.303227374536118699e-01 7.921483562057192451e-02 5.535320884808785091e-02 6.576378389123802015e-02 8.951265076077938310e-02 9.416330115248063015e-02 5.077990184583636157e-02 8.017218174503848438e-02 6.503715272175708551e-02 5.893942416509422022e-02 4.271296303115575121e-02
3.540868168937135740e-01 2.079408839311324142e-01 4.213142906442910764e-03 4.079288539095224549e-03 3.131779620457110502e-03 3.297634293830991048e-01 1.298021395960030355e-01 8.421884209580948744e-02 1.051717938085361126e-01 3.760728851885332749e-03 9.142353654098213725e-03 5.963472217646613449e-02 1.071041892510154192e-01 5.593490626718281011e-02 2.038963664815401575e-02 2.304675483700202587e-02 2.527752441476847217e-02 1.484225474893785535e-02 3.636883649302462967e-03 4.980121799047695363e-01 7.391312561392342217e-02 6.567570521791644966e-02 7.424086648485006545e-02 1.315590454856823133e-01 1.251805825588050702e-01 8.881519754286638924e-02 6.776430791681384291e-02 6.146964375549329729e-02 6.569591437900956787e-02 7.021942415869439347e-02
6.856993700734545505e-02 1.769017378475777891e-01 4.318805414242506413e-01 2.740252196851106908e-03 8.031912670050809222e-01 2.567248070624666423e-01 1.325641663185789798e-01 1.116931541452348409e-01 1.418149281906646575e-01 1.867441885849747355e-03 3.324950675410920375e-01 1.891441395963997310e-02 7.952065567094937504e-02 3.423411075292601136e-02 1.086407633701327348e-02 1.264107009660683616e-02 4.666315121810778350e-03 6.841854928644370247e-03 7.787925458244067053e-03 2.904437224425433263e-03 8.933564819917225175e-02 8.019360678135895037e-02 9.659479230443823727e-02 1.657441611085294642e-01 2.174084387217351810e-01 2.045352695878586147e-01 1.514547813735217519e-01 1.368613632084834109e-01 1.034659646669219002e-01 7.925429732744605771e-02
5.458157589313179792e-02 1.571181229617812647e-01 2.881541250464507709e-01 2.105247111244449298e-01 1.246638703418261468e-01 4.956457805303075004e-01 3.423703936306689462e-03 2.824293232939030767e-03 2.052427148833175230e-01 6.306409682602828748e-02 2.520657736434447349e-01 3.040930047334115642e-03 3.591716734604353395e-02 4.897652909670384413e-02 5.282687859557243237e-02 7.198634664711714426e-02 6.505738738284742861e-02 4.225902715563377432e-02 1.155062903399804441e-01 5.400460861380956823e-02 4.458754083179827278e-03 5.604068484743174317e-01 4.219953365376605259e-01 2.396805992199997626e-03 5.575614483037141106e-03 5.199931212735360228e-03 1.412774146077260332e-02 4.476032476500381267e-03 1.678664835810768918e-01 1.610190153216195519e-01
4.894776051814611617e-02 4.928435614874943083e-02 1.372304728433553223e-01 2.173352057505990344e-03 3.761483390461330401e-01 8.889376826150385824e-02 2.265714471893890553e-03 6.427911767793795250e-03 4.262596544111558333e-03 2.524681085951236970e-01 5.393447889817293284e-01 1.485717174732333057e-02 3.148071200482077669e-02 4.031008461687739935e-02 3.682760317922856297e-02 4.501046986593758292e-02 7.743971053450399156e-02 1.348251809363116283e-01 1.386800666800271364e-01 1.107805934025667127e-01 4.761959390966463701e-03 4.987535628340684576e-03 4.388839007060702999e-03 1.382631626296103311e-02 1.992730834956634584e-02 1.018974267762787489e-01 1.016925866077862256e-01 2.002230364845838939e-02 1.963182908153041362e-01 1.172064378818808567e-01
4.271729073468998050e-02 4.670420360360080791e-02 1.086145161871197445e-01 1.213648971055149711e-01 8.101025015174974364e-02 9.274191249312262186e-02 6.600358189541022380e-01 3.429739957018317683e-03 7.055221112601862271e-03 2.522807335184971966e-03 2.592663830189612627e-03 2.229678373067861454e-03 1.731153457662140682e-02 3.563301474844698946e-02 3.381988546987157312e-02 5.256627661803700557e-02 9.197572091101427483e-02 1.133843959417903668e-01 6.683692289617843008e-02 1.488217858626606285e-02 8.982079703414134683e-03 6.175194594313478114e-02 8.940112660093203767e-02 1.511639874749039214e-01 1.429237074702275900e-01 1.867052856233644975e-01 1.502317759128886654e-01 4.242665159341366121e-02 3.100394381520961695e-01 1.397731956654758023e-01
5.167008130109840280e-02 6.004048866902142456e-02 6.047881296348592284e-02 5.858438032456374234e-02 9.051828689763659341e-02 1.896460874455558332e-01 1.985326076514859830e-02 6.611171242047295116e-02 3.217334012833106272e-02 5.463143489401968769e-03 4.005250521327302637e-03 6.112373780976323480e-03 1.206118210952440359e-02 1.813138630980886540e-02 2.435452142365011202e-02 4.439508041538130223e-02 9.734610187696546291e-02 1.008046807113630039e-01 4.918158938864542612e-02 1.727185609706266556e-02 7.440763567964409075e-02 1.342670884311905899e-01 1.714193906852377325e-01 1.781458778754699823e-01 1.588599077993552156e-01 1.383512641354949779e-01 2.056824032380090705e-01 3.570923357832194583e-02 4.634661639219343487e-01 1.973115505457536112e-01
1.236113512187183988e-01 9.756222567414937763e-02 5.214646685016638417e-02 8.373925777053531361e-02 1.880621801289549758e-03 9.503119483732652001e-03 5.304768140009043231e-02 4.311932175257057742e-02 4.232567258670796861e-02 2.100128318568265234e-02 7.573227392491213225e-03 1.987946011534273520e-03 1.941978752090710910e-03 5.117021054871958782e-03 1.173940695704880390e-02 5.500459798520482280e-02 5.929698467593042671e-02 7.173830063406799740e-02 1.290429332085926868e-02 2.330127093696714169e-02 8.244223364686359412e-02 1.776002524744648703e-01 2.187095413707600966e-01 2.304324768900264386e-01 1.936195489119022228e-01 1.881782865855216591e-01 1.755813351989788940e-01 1.391653826637273828e-01 6.173092642780335718e-03 4.067492232497707527e-03
5.552688590563506499e-02 1.546404204914728076e-01 2.930462914560643117e-01 3.376490682207884154e-03 7.388392543942216492e-03 1.041442777026148347e-02 3.291404208877099502e-02 4.093891152561493496e-02 2.806989591792551780e-02 2.168377678639459710e-02 4.509544198716079061e-03 3.188980217736614442e-01 4.801176094865265420e-01 1.923260045771695449e-03 4.258622366041448989e-03 2.561699068700374476e-02 1.001599683791340456e-02 3.306014369597963694e-03 5.289200098954591756e-01 8.404205439512363665e-03 3.199718446168892810e-02 1.706218407912780399e-01 2.167925794665606920e-01 2.307483229594066432e-01 1.713746265220053300e-01 8.021168309898846216e-02 1.303744280649904164e-01 8.947879332891447990e-02 8.067778571969901405e-03 3.184456464829137426e-03
2.455132981872161328e-03 3.073880551424994396e-03 2.020947148994181510e-03 2.455623346964579991e-03 5.658778668583027208e-03 3.224545786265818181e-03 1.661885765199097587e-02 2.137020486827597224e-02 1.970674380145190363e-02 4.641365434532091459e-03 1.163273513470387778e-03 1.898556152282279696e-01 3.267001783677438431e-01 1.318358731641217823e-03 5.355864051307916360e-03 3.681848632605382293e-03 6.873078941926570942e-03 2.079989603850525975e-03 3.977582234985798521e-03 1.906567522149513541e-02 1.032908003213122983e-01 1.974534485071914314e-01 2.144359582254641572e-01 2.076014813536679049e-01 1.621098858034129009e-01 1.202301287812860137e-01 1.172459272620523935e-01 7.899177897570366924e-02 7.111401790934961456e-03 9.470652297279802401e-01
6.789710911978742540e-03 6.045973986294118918e-03 3.040036504593170499e-03 2.127179839141823611e-03 2.679778951375588400e-03 1.421326681216670846e-03 8.083613352460047169e-03 7.174183052509467903e-03 1.966753960682891215e-03 1.080119235965360577e-03 3.189261540274423989e-01 2.502016638405133997e-01 1.474092483920951269e-01 8.023745561813258598e-02 2.045518987966817859e-01 6.759173914999331290e-01 3.746333400083682458e-03 8.689502565268162129e-03 8.490050498761968212e-03 3.845300099032256114e-02 1.066886038811553916e-01 1.576131231561497814e-01 6.541722628651849836e-02 1.002485302500977227e-01 1.317149432899922534e-01 7.563600147398501228e-02 5.694314422841455225e-02 4.676605238420485783e-02 6.191907664356788299e-01 5.649906854557116276e-01
5.450245206552390906e-03 6.105942835216277703e-03 6.346726107811619944e-01 4.659542642405823387e-01 4.073004394540160611e-01 6.842926401754764049e-04 9.728096140589094498e-04 2.309569278979277107e-01 3.032295650360179451e-01 4.702065855412770889e-02 6.109117844941876901e-02 9.219316963164701784e-02 1.013780631781937280e-01 3.587437911884604480e-01 1.397588823027176314e-03 1.891357638914338557e-02 3.648202803776624814e-02 5.338754897765586593e-02 3.684484084555285366e-02 2.823803484526781968e-02 2.052496940038346998e-02 7.540511502807125538e-03 2.988127773163560229e-03 6.575461352744499735e-03 2.426198582764527850e-02 8.344537440690847491e-03 7.794680166019465548e-03 9.296652061973627035e-01 1.066934013663987935e-01 8.727652538658535464e-02
1.151897926765020792e-02 8.669959922504660854e-03 9.124219920491228198e-04 2.997680608947622671e-01 4.631314395647865290e-01 3.711872726543600232e-01 6.328625805325154919e-04 6.357041178137817772e-02 5.421407131089001075e-02 2.330838601041546748e-02 5.491202209288293529e-02 1.032211203706360630e-01 1.368876739833579936e-01 9.565032279795972637e-04 1.673316668371772203e-03 1.107280913030269862e-02 4.061865258789933153e-02 7.636478733437515598e-02 8.727869923998740620e-02 7.745187582572635177e-02 1.709375536733255888e-02 3.940373592122336024e-03 5.016704217890518430e-03 1.245451231086663717e-02 2.809767277273300667e-02 8.391462702937743309e-03 1.131107676852254551e+00 4.386281029204200377e-01 1.384306169221921901e-01 1.242682514265592425e-01
1.430656429120728823e-02 1.786727108373337754e-03 3.527357739701783568e-01 1.200933862837249011e-01 1.423642206972586255e-01 3.190038284094220966e-01 4.187034901650711349e-01 4.764602870479951041e-02 2.657107150559269437e-02 3.050092837314870992e-02 5.369270514900947866e-02 9.116185073877372536e-02 1.030943258971434295e-01 5.705483048201578367e-01 3.085276517209154488e-03 1.590475684672372492e-02 3.086445944946281800e-02 7.138173702230357631e-02 9.020164431156117713e-02 7.808632766355197430e-02 4.071098248783127510e-02 2.437822523164549955e-03 7.569498545849895343e-01 3.903857380740617146e-03 2.263529448515270298e-02 1.365394747465207767e-02 1.241034789721474040e-02 8.036372040347310453e-01 1.232463507833915367e-01 9.473422776383746968e-02
7.905247090270193025e-03 2.409462458226857302e-03 9.150594894441701653e-04 8.269341493626547121e-04 1.770665432883015283e-03 1.189132101010196381e-03 4.421223491049325882e-01 1.841459782004460921e-01 2.789532738226966346e-01 3.605434875959457885e-01 3.334825913144116860e-02 3.736560558009655031e-02 5.833082591725843175e-02 1.326379384796687877e-01 1.108888738648486708e-03 4.880197608713351606e-03 4.954741557783260905e-03 2.132222523981157011e-02 2.748828824381494007e-02 2.423152485298088465e-02 2.140435877235680184e-02 2.887200006183373614e-03 1.971876403552201840e-01 3.743037863059686110e-01 4.013473641595137302e-03 1.004170524754336748e-02 2.710804251018512565e-02 1.537806244295860866e-02 1.460038188481112276e-01 1.102939419348245020e-01
2.827868645755468938e-03 1.104627905941645005e-03 1.153102337686039754e-03 1.887501834228692615e-03 9.941495989033808257e-04 3.858834239629281848e-01 1.806663992273727648e-01 1.291435977185482198e-01 4.135255721795740858e-01 1.669844913196172082e-03 1.072314480432473571e-01 3.674438694812112716e-02 6.227923921984646061e-02 1.373177740167993988e-01 6.536881329084189840e-01 1.743409647035866093e-03 1.218221526316202227e-03 3.763020880884433428e-01 5.772279363957061316e-01 1.828275562811401082e-03 3.420220605062038524e-03 3.920638863315986100e-01 1.973667592545046701e-01 9.993904930461059433e-01 5.602394441030834372e-03 8.069183518073042016e-01 6.961549386149777988e-03 7.866993872303624374e-03 2.811002278262637270e-03 1.690798026397478115e-01
2.866909256468865626e-03 2.265708774525907777e-03 1.078821903740128730e-03 6.051755344077288656e-01 5.841124537492130564e-01 2.243932816029995114e-01 1.509139801006967041e-01 1.573024538748123147e-01 1.756425141500495557e-01 7.311801084198767033e-04 1.945673242859544683e-01 1.834716594407124202e-01 1.736051386974851174e-01 2.175230403905736853e-01 6.335641809833523208e-01 4.462744683989878780e-01 3.041441162648276797e-01 1.834163930886897054e-01 1.624755792965346113e-01 1.250432449815630787e-01 9.953571417326975701e-02 1.454371093372475721e-01 2.314246766944209610e-01 5.796155893363423850e-01 1.020325474155430401e+00 4.899914863377737850e-01 7.847128463253015829e-01 5.037503554651430182e-01 5.063575129561589394e-01 3.265341408452183680e-01
3.883847881016879843e-03 1.994406969836273573e-03 1.108590959465021548e-03 1.473295841617273168e-03 1.248058148873997788e-03 5.875793907006814365e-01 2.244232375253276020e-03 1.670008000204068702e-03 2.363901596395424631e-01 1.700175603152427883e-01 6.008749812718444661e-02 1.368289665570640579e-01 4.073968727412300428e-01 4.557504957466238515e-01 1.968268220135408180e-03 1.617837699351224075e-03 3.472343385380318170e-01 4.165117804426951009e-01 1.942032115098941136e-01 8.481773214334513422e-02 7.706050677272843763e-02 1.176608238101353593e-01 1.830230194844109370e-01 5.840108811633608621e-01 6.140844235505169557e-01 1.500630144238924157e-01 1.693528015463760805e-01 2.147766647802993312e-01 6.846895056672477331e-01 1.427617900872617251e-01
5.210710956415543459e-03 4.440621573296709215e-03 1.316081805839375675e-03 4.381032525646266079e-03 4.900498374177093483e-03 9.084187212641849085e-03 6.035725935874427031e-03 6.373225144950053211e-01 2.333084544173661956e-01 1.336876251842461505e-01 3.913947009754348977e-02 4.850949747675540463e-02 6.105083321072919678e-02 2.495159017961549597e-01 3.199055818501782000e-01 1.474312917913286336e-01 1.460528663747425737e-01 1.769248165694644603e-01 2.424012716285382785e-01 1.327374179037308366e-01 7.202122307426049586e-02 9.754540966729326190e-02 1.093138159626986239e-01 1.928346738876838828e-01 6.350313848426211161e-01 1.038094506712678861e-01 1.538518988348681338e-01 2.509643531541134176e-01 2.943814632136291798e-01 6.001728769261863716e-01
2.842641157853601202e-03 6.965408405579701957e-03 2.032879674204007316e-03 2.120652542195118444e-03 9.920360527692278357e-03 1.033412076780660695e-02 6.839743910264938637e-03 4.401556063320364309e-01 3.153627737832978006e-01 2.960401059743617558e-01 1.208692501362483573e-01 5.955478910299381173e-02 3.870835857768648025e-02 6.975496102707662294e-02 3.445849409537259378e-01 1.035234391446869795e-01 3.744635013349568720e-01 4.015273555220211579e-03 7.576761572556047278e-03 5.531418294860939167e-01 1.080923191803699612e-01 1.363997547732528071e-01 1.156991227626474883e-01 1.332011971622484858e-01 1.855283759177653868e-01 1.478324330502782669e-01 1.784219897799477761e-01 2.207159326200729410e-01 2.884660517773851574e-01 7.263032612468685034e-01
