2.969511937519549605e-03 4.338782145316294817e-03 3.848715880089124790e-03 4.953957056377632749e-03 3.807771962927555126e-03 8.427211603957131258e-03 8.362029685140975194e-03 2.265975664601221906e-02 4.137901348924767631e-02 1.875125932262837122e-02 8.818066714029931807e-03 2.027484631920284299e-03 1.189453236406563200e-03 4.398244830170629227e-03 5.094152593418316451e-03 1.116353970845789662e-03 3.980348500591589754e-03 7.073347109092298357e-03 6.525447751294020243e-03 2.324319954237331551e-03 1.823886250095973268e-03 2.580968300178736359e-04 1.787549720651988513e-02 7.480773277180738021e-04 1.383062127205494408e-03 1.032856248110777548e-03 4.542328578176370161e-04 4.453290619894158080e-03 4.316495148988211579e-03 5.510670290821218301e-03
2.347422702478224512e-03 5.113609133929567820e-03 9.304519526280674233e-03 7.621267050128065906e-03 5.347308442392610661e-03 2.418650273430726291e-02 1.163764069878720116e-02 1.461243435666403044e-02 9.615227259970495280e-03 8.173973098710015164e-03 5.843819672154564743e-03 1.143453188094390328e-03 1.516819775357973552e-03 3.468711550363906115e-03 4.831769242632484064e-03 3.115979130719188570e-03 3.923981674210287422e-03 1.312664534551788095e-02 1.019229053061728764e-02 3.137276483760177356e-03 1.092187954716211792e-03 2.387591142678669603e-04 4.873370817182694258e-04 4.121294771108881890e-04 3.411828749491287605e-04 4.281641442992503124e-04 1.695383144140834297e-02 4.465233520375535940e-03 6.468515704923344725e-03 6.592439754379602473e-03
2.875820125182788553e-02 2.846117439901826168e-02 6.027827955314063457e-02 4.864771130462739596e-02 1.041051775109256838e-01 1.072230186951027980e-02 2.043466219882270670e-03 2.207598709476652626e-03 3.611778522786214529e-02 1.090090309038492522e-02 2.911617259893959503e-02 1.914739951233548204e-02 6.997149443753595752e-03 1.034775180439551426e-02 1.986623514212756438e-03 8.421017545104256263e-03 5.777785767472856659e-03 1.221767971276263229e-02 4.226200737669630336e-02 7.258176801927187713e-03 6.777663609654578300e-04 1.913854408962101640e-04 2.836198917233498200e-04 9.823960100530510636e-03 5.856173733315612334e-03 3.885859865506919360e-03 3.463928685398039772e-03 2.777689961872801313e-03 4.777144594196341965e-03 5.474571131139120521e-03
1.344029727578580601e-02 3.734213032180367514e-02 8.206435895608227282e-02 6.576087139799279002e-02 2.726545897568232596e-02 4.266562671586184886e-03 3.465933669310780445e-03 2.344884728921409547e-03 1.456026127585728245e-03 1.350042786865727693e-02 8.597412109849733933e-03 1.698966317134294191e-02 7.658058736119332729e-03 5.159415962617126296e-03 1.518776660273727080e-03 1.157646256307851267e-03 2.457768446982583690e-03 4.697289617411842463e-03 3.440037916783956866e-03 3.007813080699603923e-03 1.346407035488151899e-03 4.501099110983215398e-04 1.328544681926988394e-02 2.501727242541861409e-04 4.781610745287040790e-03 3.522302817924190775e-03 3.013771922704179280e-03 2.882923811287222641e-03 5.812350592045328543e-03 6.470862001347617298e-03
7.849449753850303024e-03 2.366211568053319322e-02 6.587632606854174067e-02 2.551025668545129493e-02 1.473771459615085683e-02 2.173326941442735132e-03 3.391966790616667352e-03 1.918923832884286609e-03 8.966289004139378627e-04 3.117659381107812031e-02 3.868157154672562104e-02 3.297296192423587735e-02 4.853084129485677953e-03 4.026166915767279142e-03 1.872329422105631748e-03 6.855254258892238238e-04 7.432962251206059849e-03 4.334590630725412147e-03 7.130091852605984805e-03 4.134594446914234903e-03 2.828132345101143537e-03 7.779384854643927975e-04 1.679431852186061627e-03 4.357640499721983601e-04 8.614378662076812437e-03 4.692424064175615070e-03 3.250871144873419914e-03 3.809487658067543456e-03 5.927678409554035244e-03 2.135187057313147208e-04
7.917943203965178284e-03 8.110726559955547602e-03 3.628674975203392133e-02 2.899867544847902628e-02 1.152663995238526091e-02 1.247579005986044088e-03 1.546765812115603574e-03 1.684882862173015233e-03 1.596218401890506927e-03 4.828852352073056964e-02 3.767496984248916436e-02 1.988762993227273859e-02 2.256829109637960296e-03 6.724827477333254148e-04 4.994056474205151681e-04 7.926206156385026983e-04 4.166068555226359882e-03 1.096938587225582389e-03 3.607354713653266806e-03 1.251246932262654356e-02 1.521836082284997067e-02 8.998043918995184479e-03 2.219551818929045833e-03 2.716881415961359850e-04 1.290994394373468426e-02 1.228194728360316665e-02 7.617211063608986601e-03 5.330730310028296108e-03 6.990769851276562238e-03 1.298223963590331223e-02
1.102128614623871941e-03 1.721274567682765880e-03 1.819042983643188484e-03 9.219114089553346117e-03 4.418855673253274489e-03 7.408468970023051117e-03 1.141928571846598239e-02 6.611827957165463017e-03 7.952187224701081844e-03 9.300036864497630840e-03 7.169002545117126625e-03 2.960457644368964542e-03 1.210470267767300469e-03 4.608363407683000292e-04 1.604033280351416235e-02 4.033050259939862216e-04 2.379392308724891710e-03 1.134948966875351257e-03 5.839627264680905677e-03 8.012062801782163582e-03 3.695593961737753293e-03 8.815582762537533309e-04 3.414071456649166040e-04 2.546211817878459667e-04 8.821229924400385974e-03 9.125438071925895400e-03 7.940933047230890052e-03 7.020520626828698901e-03 8.134692144874640721e-03 1.998469285966728015e-02
2.373407962302046762e-03 4.323765017558626675e-03 2.535260221232976501e-03 5.482046033072492629e-03 8.413968712106253273e-03 9.518984237747194627e-03 8.528289430636664878e-03 8.125421764263347779e-03 6.591080181515598588e-03 3.720652695931636177e-03 1.504123852995807023e-03 4.660749386323806767e-03 9.914522864356194523e-04 2.097659497074201226e-02 2.181096025012111556e-02 5.972427480876736205e-04 4.951625254585271564e-03 7.960599072859449871e-03 7.034235484786313317e-03 5.022575977165644016e-03 1.369052781972872465e-03 6.377431877413054350e-04 1.800142023949232936e-02 1.416291033235298966e-02 6.691722119999585563e-03 7.051940341552796060e-03 1.088066639486862455e-02 1.403343604154522195e-02 1.437018384497141567e-02 4.877163296493597475e-04
6.254214946797137346e-03 4.091577114536492157e-03 2.414485722616095502e-03 1.407998545581211347e-02 9.190683053920054024e-03 3.907556675198993468e-03 1.267192939262468988e-02 5.705785752601329024e-03 4.808798486312099510e-03 4.782756081091478137e-03 4.289572038456431792e-03 5.675643256738699058e-03 1.243938921281769958e-02 8.187570111908872711e-03 1.224166502022921771e-03 1.119890376387714520e-03 4.870086176974372690e-03 1.480545474418147947e-02 1.464495898526018899e-02 2.453095122655819717e-03 3.839495872625306168e-04 2.918409964292159099e-04 2.699494925464686855e-04 1.381799406114678046e-02 8.011381158282187415e-03 1.234536042149633056e-02 4.678559645990413608e-04 1.025654898227970277e-03 3.214097247768798495e-03 1.721183671720024917e-03
1.037831872609796049e-02 6.759065787846917778e-03 1.093270713170775219e-02 1.029363936009016281e-02 9.117884641068734267e-03 1.804998202104824128e-03 8.381159895985448166e-03 3.554160466715586969e-03 1.484382690190675464e-03 5.603107497830701108e-04 8.240915443049742425e-03 8.036915730683991121e-03 1.715621052087594467e-02 1.890169173959127535e-02 9.159207135082831144e-03 1.011843601938888781e-02 5.412051047619700905e-02 5.600612692746674559e-02 2.251236160673716208e-02 1.005731682009239174e-02 4.898590725115423844e-04 1.749482132960322039e-02 1.831183737813827511e-02 2.312222722704636649e-04 1.056003192551330759e-02 1.361461349018653830e-02 1.365636255052702416e-03 2.555197568531568115e-03 3.451555434902062961e-03 9.785003380599183696e-04
8.605240233192302385e-03 4.490086304728900871e-03 1.019070206967276002e-02 8.789870148969456537e-03 1.132477932007927915e-02 1.042885240268846608e-03 8.715196267413617866e-04 7.497850184364938594e-04 4.622353569140562205e-04 4.186853264498081352e-03 6.593924230209512183e-02 1.100089538527685151e-01 2.293304812098271306e-01 1.152045967451072461e-01 2.160595325949632786e-02 4.258016682969399669e-02 7.899665769391317482e-02 2.186731297248551559e-02 5.235387729437350132e-03 1.048998334923064097e-03 3.524793041763412847e-04 1.759880186071571817e-02 2.779669570208655378e-04 3.694531919254236889e-04 3.783181378715928778e-04 1.651294946856382562e-02 3.026676252946296675e-04 2.607859894116233549e-04 2.001385780126598360e-02 1.478000542246194274e-02
1.573357438979395423e-03 9.226660884885215692e-04 8.288620014707598002e-03 8.263582543308341244e-03 6.548886345987390938e-03 1.503217267686525992e-03 5.758230448526461664e-04 3.619179581980392626e-04 4.366158862444327192e-04 8.269014917997785305e-03 2.017751850969198499e-02 1.321622307661594331e-01 2.382712272555206345e-01 1.246953143542529618e-01 4.548751539174533676e-02 5.137900432370103715e-02 5.689243893863918378e-02 3.380341808609785281e-02 8.389157606215414190e-03 2.383465221119282149e-03 2.314452574496501935e-02 2.084936172842417890e-02 3.433490737995151731e-04 6.023832837789304308e-04 5.666167697684864040e-04 3.952498220983475369e-04 2.969630456441315096e-04 2.055431902053344792e-02 2.239871791645458091e-02 3.365835750248166616e-04
1.881667588718842835e-02 7.608177604343574138e-04 1.907237737589719982e-03 5.522560168342593480e-03 3.675506562971097950e-03 1.156288014953653440e-03 5.765437143494802838e-04 4.668991436776205313e-04 5.689225159043552861e-04 4.175390820900342671e-03 1.405506176219734494e-03 4.288989510842886738e-02 1.802760066217795054e-01 7.676004719045353974e-02 2.406742637340556629e-02 2.763784029340443302e-02 1.028021632058241305e-02 1.523738836466452876e-02 1.753924036248474816e-02 6.644498656218723875e-03 4.480774562813757598e-04 4.023338002558274774e-04 4.843483163429540073e-04 8.338869924752142539e-04 1.096062262829049184e-03 1.028326075166238664e-03 7.582389267868116286e-04 6.942707781965277037e-04 5.287181018745802392e-04 4.051299489250025435e-04
1.484310810880477838e-02 6.540395023449763028e-04 1.242371510040333246e-03 9.339154936196027721e-04 5.647747166010264400e-04 2.203516674774952909e-03 7.408846929055664179e-03 6.236323520412850180e-03 7.934803110692833410e-04 1.862083116388470183e-02 1.042167783513817288e-03 7.062646202786519896e-03 8.301661291288060796e-02 1.104655348752646010e-01 1.161880716015637471e-01 1.542768608777559391e-01 1.403212652643687219e-01 9.209602167982501586e-02 2.542895799040398863e-01 1.204084499114956158e-01 1.015773039589663168e-02 2.995259364187162314e-03 2.275077570481958463e-03 5.807918134921534470e-03 1.363410151748529336e-02 1.286919709763310014e-02 3.560476144699933898e-02 1.182622691670198387e-02 9.291067770341697191e-04 8.696481142834540032e-04
1.361427777239243228e-02 1.372813953156982493e-02 5.868460445902462345e-04 4.488054135348014916e-03 1.650896822453519356e-03 3.846676991010190404e-04 4.966159329504776267e-03 1.433075325499925771e-02 9.684781208211668338e-03 1.017097483184911362e-03 2.209200592826359756e-03 3.536334527460312238e-02 7.465888262675121623e-02 9.292542122342120625e-02 8.244209251845298347e-02 9.776124315459053249e-02 1.684244392967962356e-01 2.946987943931346776e-01 3.046620802745316769e-01 2.456840287294807523e-01 1.078686928961837196e-02 1.155666545696001565e-02 1.042357101582826011e-02 3.308152206570172393e-02 4.777571517841599363e-02 2.456792008410154382e-01 2.482562271470012960e-01 5.091190154113364730e-02 1.120019660477132497e-03 6.520959582548227105e-04
1.219866946532858348e-02 1.340158963425417890e-02 4.607833459073607885e-04 5.154889694835660535e-04 3.420745400379955961e-04 3.884879421625301449e-04 2.740811169314156127e-03 7.739495647876593401e-03 1.617358401044115615e-02 5.899486586726664442e-03 6.194279863083428095e-03 5.455641056680057138e-03 4.229410930268439478e-02 8.447147789884736080e-02 7.772257425203336900e-02 1.170288546862182921e-01 2.037573886682567115e-01 2.507424454838281247e-01 1.476319404852504957e-01 3.307575585118982531e-02 2.043472686572077660e-02 1.440007112141385714e-01 2.140194849860357074e-01 3.617252805774875957e-01 3.392047061919366002e-01 4.416486408183963319e-01 3.564366351982418690e-01 1.035029418867068063e-01 1.772178092983339032e-03 7.872561671880771430e-04
1.516366689766546899e-02 1.776242876999682002e-02 1.780914813237400793e-02 1.717336903967418144e-02 3.660573415626798685e-04 7.655861148750378251e-04 4.498736244356654063e-02 1.516021056202463413e-01 7.490683473329319553e-02 1.300887718142498470e-02 9.796624179284361966e-03 1.541484827073490334e-02 3.043201867059172616e-02 4.428881637298823226e-02 5.754914337074507058e-02 1.014502335673620192e-01 2.198439687859232161e-01 2.256260254438913204e-01 1.092650389791157139e-01 3.849004958292247952e-02 1.701265077362937306e-01 3.152200269300604596e-01 4.136183535992246085e-01 4.262788350731162024e-01 3.736455149275414445e-01 3.216383974346360697e-01 4.759084820949705530e-01 8.380398427234435343e-02 2.677895232470743625e-03 1.119993134538549689e-03
5.257068548940982454e-04 4.124779144875832760e-04 1.567761973811353932e-02 3.373511032627975669e-04 4.329757013889986433e-03 2.194244573986880997e-02 1.232427468489543515e-01 1.012475561329446161e-01 1.009151406721968125e-01 5.118912428599489001e-02 1.898306773592814065e-02 5.162067460688381758e-03 5.053151654595789549e-03 1.287294509690304310e-02 2.854319360142652112e-02 1.292924479429969908e-01 1.368243758855166303e-01 1.629102128349107781e-01 2.890438859237593958e-02 5.217747865341472446e-02 1.895532898148802048e-01 4.196049784690827344e-01 5.314953960691339852e-01 5.513900100171816865e-01 4.515282059305045781e-01 4.307101104212013309e-01 3.973566980094127010e-01 3.151619372213908532e-01 1.399379210887821863e-02 9.232075438432126718e-03
1.705547548113340445e-02 6.517115500667756793e-04 1.198438148756479811e-03 8.252494789032536332e-03 1.820820791564069924e-02 2.559840384801771035e-02 8.042130812054965050e-02 9.971279512625846886e-02 6.847876187862653174e-02 5.388336267554347248e-02 1.145895334975857716e-02 1.135308257866225789e-03 1.734681917496345895e-03 4.894803276327392913e-03 1.058780037254321120e-02 6.224102163775475927e-02 2.397125504368045890e-02 7.802060703047720286e-03 2.650637566571281169e-03 1.942711518818395627e-02 7.421336653817395268e-02 3.975116019517039856e-01 5.080582120962504611e-01 5.349460606413802832e-01 3.922625953673947174e-01 1.820968164389714095e-01 2.949909681672295281e-01 2.024641810492434912e-01 1.825579803091634604e-02 7.206225863310881247e-03
6.107692956344244750e-03 7.787080336388042465e-03 5.194912737387389311e-03 6.412829742413677508e-03 1.503054297016702748e-02 8.496661705484980301e-03 4.302091498056627439e-02 5.439231851356415848e-02 4.952896726495945035e-02 1.182409128428508691e-02 3.006909537757394054e-03 6.421455299129507580e-04 1.139966184368128473e-03 3.408130438891690019e-03 1.365966428725408702e-02 9.273836245791911709e-03 1.709640644749723520e-02 5.109463507622302551e-03 9.648910665002998974e-03 4.555533251321507854e-02 2.420440392175577382e-01 4.546225303321314026e-01 4.859092032320719845e-01 4.675212234694311464e-01 3.647478878325121632e-01 2.710462246124116237e-01 2.654759338218216635e-01 1.788606041317752082e-01 1.610272294615970948e-02 5.731827067057120376e-03
1.776907148048215840e-02 1.609358761899799470e-02 8.301318530802175022e-03 5.967298232915298380e-03 7.733530409770656387e-03 4.044243319453643543e-03 2.230706762981443658e-02 1.920773083875831205e-02 5.132894686962167531e-03 2.834228643166491687e-03 9.924597490140536944e-04 8.001032245985900855e-04 4.940424749865105023e-04 2.864069864783936638e-04 7.743286418108375662e-04 2.702156871888081527e-03 9.699976054797429526e-03 2.223504952010913610e-02 2.147619721554359581e-02 9.514176428413581577e-02 2.533514215503208655e-01 3.597287030024764465e-01 1.437896645309424959e-01 2.198418164693235477e-01 2.916921103843479468e-01 1.694719598684986950e-01 1.291568859881657982e-01 1.060744321885028485e-01 3.887884077249770254e-03 3.514223916177742525e-03
1.445835866172271583e-02 1.643830481701232665e-02 2.446438787660188807e-03 1.701611787036707299e-03 1.399123923628094526e-03 2.029751091616419090e-03 2.786014648592889317e-03 6.661822972017934210e-04 8.323130862857076352e-04 1.346855587586394030e-04 1.821802709681968489e-04 2.852176676540965497e-04 3.312922838048203687e-04 1.254990082816832483e-03 3.729537619100769998e-03 5.045232035674974969e-02 9.648944128749939453e-02 1.399992113869647226e-01 9.583693941881586686e-02 7.164827642706517175e-02 4.932866569029153991e-02 1.719087026803099369e-02 6.470745891410768086e-03 1.422543295385369708e-02 5.324819026730187588e-02 1.860438306277864551e-02 1.763253920179144035e-02 5.962367309847645472e-03 6.784053233835935382e-04 2.795777070269220982e-02
2.997587195139358313e-02 2.280066145030748906e-02 2.500088710699737912e-03 1.088683823428698719e-03 1.607613149075893481e-03 1.223140866388876388e-03 1.820495091215151417e-03 1.867714268583332035e-04 1.518637213673152938e-04 7.097534438805094652e-03 1.646328371843169662e-04 3.191468853130600817e-04 4.455424200771776304e-04 2.554455546133372647e-03 4.427039958956063663e-03 2.905211634020710143e-02 1.064206518584660255e-01 1.997840227641652922e-01 2.279801874134765871e-01 1.980572384395772878e-01 4.147779843968327218e-02 9.093378959616142676e-03 1.102998299167859408e-02 2.728148090737557430e-02 6.209947416241607537e-02 1.872671822954672868e-02 7.337247221931410615e-03 2.774913664719482094e-03 8.737788774283426242e-04 7.911029797374780114e-04
3.660400367620184753e-02 4.604448894234947944e-03 1.301407345850370345e-03 4.327151553593621683e-04 4.977111165326114335e-04 1.064091233176706975e-03 1.323227251009845024e-03 1.485114171052282633e-02 8.130385673245893452e-03 9.367983236722221552e-03 1.654769927325775228e-02 2.809838642547455721e-04 3.332044140401124472e-04 1.965628675509206377e-03 8.098429508631344378e-03 4.105939246752798866e-02 8.018189119204716109e-02 1.865725437747861315e-01 2.370865498855177222e-01 2.017633950642504503e-01 9.998583908488473115e-02 5.707366163479882584e-03 4.000358486978473904e-03 8.687299160308172008e-03 5.061139366301656978e-02 3.068538288251645985e-02 2.801672345235955291e-02 5.309850804782075689e-03 7.710782933410106812e-04 2.976315821674905063e-02
1.991503456586424595e-02 6.094491511181254935e-03 2.432757607518773804e-03 2.317843017692272113e-03 5.253819963194721748e-03 3.526990941516367287e-03 1.412490859987989861e-03 5.568206191425336543e-04 8.066623159486742151e-04 1.066127928499710324e-03 1.035935673426617055e-02 1.162566494152486932e-02 1.866535307955172977e-04 4.508367151627080027e-04 2.889416216098195447e-03 1.240289120568234191e-02 1.278003327851314624e-02 5.578196009158807589e-02 7.285708857911292469e-02 6.339635568226711926e-02 5.330925228126968951e-02 6.872076296224763001e-03 1.053358059171421567e-03 2.054098981400304634e-03 9.109981533141341473e-03 2.282245059487563246e-02 6.167662030483882230e-02 3.503190234705060024e-02 8.781069694337549766e-04 6.578340812710703218e-04
7.106396413428498968e-03 2.787018571509944885e-03 3.059587039346106999e-03 5.283583714947613814e-03 2.948552877183927175e-03 1.298550041555629692e-03 5.781377875282748494e-04 3.913520838257238989e-04 1.199578151721427928e-03 4.705042082621220187e-03 3.233718496385492181e-04 1.145308806246928685e-02 1.987418377645348551e-04 4.648625946223230282e-04 2.338818697439620266e-03 4.410897508643506215e-03 3.137318923207400769e-03 1.602755996258753424e-03 2.596659784433520603e-03 4.823675157454713688e-03 8.664286558862178966e-03 1.994194119682708537e-03 1.036034495598003738e-03 5.304816425420735490e-03 1.294781169996220803e-02 4.598716443594285525e-03 1.591184466688523938e-02 1.800812254048788502e-02 6.457973975146323597e-03 9.872096997946100232e-04
7.203095028835298369e-03 5.719212287191979827e-03 2.863938282491570834e-03 2.152232985059391278e-03 2.046878811395928116e-03 7.547425553086687094e-04 4.826790321645445378e-04 4.764245454082189453e-04 5.096272719446109456e-04 2.060224959924196377e-03 5.868400147472916436e-04 5.616263715911037728e-04 5.543415827298387452e-04 7.368633300895740916e-04 2.268264165116268619e-03 1.681089551982268247e-03 1.221795051828574114e-03 7.817305205850976109e-04 7.313365135355284112e-04 5.868541209023646604e-04 4.802015312271419524e-04 7.199330335680224598e-04 1.173536286992082423e-03 3.003092661212647310e-03 5.392024152297105952e-03 2.638887130217676402e-03 4.289358213918962465e-03 2.885315214180300073e-03 2.940572295674600059e-03 1.907069280703805421e-03
9.756198864111194705e-03 5.036748270570041812e-03 2.944444897603623861e-03 4.128609476152225385e-03 3.705945276663112110e-03 1.975401481301263928e-03 6.531933718630054085e-03 4.773280395770500978e-03 6.860266800489723833e-04 5.038968207149935666e-04 1.812580038803046655e-04 4.189016755274120639e-04 1.301638285007729367e-03 1.544718750644124812e-03 5.113870500756887739e-03 4.093272392317577092e-03 1.395756416205626771e-03 1.776230734275452026e-03 8.746112379434309823e-04 3.958159333014084780e-04 3.648886822349044277e-04 5.651777570632359263e-04 8.915238073593282318e-04 2.928449816531520852e-03 3.169271040709322612e-03 7.945867333111571434e-04 9.182017474549543758e-04 1.209455649374191477e-03 4.013765802341109218e-03 8.424191355218900012e-04
1.312720826537959809e-02 1.124867935316205096e-02 3.503584681296518892e-03 1.229650296694175318e-02 1.456354297583713209e-02 2.696462842098372448e-02 1.761503173374543915e-02 1.936636497284831412e-03 6.807092590557015229e-04 3.978755845887349584e-04 1.219897388896231186e-02 1.488798771894515643e-04 1.954969048402289749e-04 8.470888567110472283e-04 1.147204141022227942e-03 5.562679218979466999e-04 5.875943988914952322e-04 7.651913571305508531e-04 1.115183795994092314e-03 6.176154007534560971e-04 2.320228526778526923e-02 4.532088699948706072e-04 5.085025271846431395e-04 9.354895337652069072e-04 3.217232458654504992e-03 5.457879415343972656e-04 8.344485465096620732e-04 1.426635933262089019e-03 1.776498770835033877e-03 3.636073087890504853e-03
7.311844879293265438e-03 1.799482028508091538e-02 5.494031021119880932e-03 6.012794458057515654e-03 2.959750047264751022e-02 3.110361490374896620e-02 2.055281530474477661e-02 1.397966591649251996e-03 9.767747952899583693e-04 9.299265165567634824e-04 3.843595225864089582e-04 1.912708853838942147e-04 1.211252929235159641e-02 2.449872680387235450e-04 1.271438790924099820e-03 4.004278763988930933e-04 1.567806198913008174e-03 1.029796205523416351e-02 1.964106958092946831e-02 2.785464426920153391e-03 5.390149475900485147e-04 6.797536416948174627e-04 5.762222573752757548e-04 6.878994288756412265e-04 9.959469148542361445e-04 8.214069327981991450e-04 1.019530442179141655e-03 1.298032997403767395e-03 1.797759788188288410e-03 4.520410759967962572e-03
