3.091217978151507544e-03 4.478421608570141987e-03 3.360561162373578315e-03 4.216454410403614426e-03 3.183004642438849643e-03 6.946820159209133975e-03 6.868759585052315944e-03 1.852348893683363959e-02 3.348835828265822601e-02 1.497083603759544537e-02 1.058909879697366753e-02 8.871505492904087353e-02 5.529840104917114335e-02 5.282995825069629336e-03 4.485858546295181520e-03 5.820309518307114488e-02 3.576246558057030213e-03 5.093242111094057993e-03 4.633978981169552258e-03 1.890389745267926063e-03 1.765732859637760823e-03 2.685752254593368193e-02 2.113341156210151936e-02 8.153261619033981555e-02 2.117120843355461100e-03 1.228927631055090758e-01 5.812680830262240833e-02 5.082046545892558373e-03 4.805105157659777214e-03 5.983374382535306887e-03
9.114961070682296718e-02 5.164264031829265793e-03 8.216574049110570571e-03 6.687892194684004997e-03 4.643916165176805930e-03 2.289692734393892343e-02 1.188504653324205101e-02 1.471552084449063991e-02 8.700243520582432930e-03 6.802600691335973504e-03 7.094173507259178731e-03 4.598296729129733307e-02 6.591273223413698923e-02 4.265611343440782639e-03 4.387488512637210611e-03 2.796687575333243678e-03 3.502963721604443730e-03 9.431674896206833705e-03 7.106323198066881799e-03 2.596516346262851393e-03 1.010952736045629408e-01 2.555385143689711813e-02 5.457849880925164099e-02 4.706608832170647294e-02 4.142256663967334995e-02 5.532219589611062083e-02 2.013742206437035484e-02 5.104039809609200312e-03 7.217631024079592013e-03 7.167353084206034078e-03
2.875149817348427936e-02 2.821353937955706215e-02 5.345895883629925294e-02 4.347217104686049854e-02 9.229205019965418255e-02 1.035302103885503075e-02 7.565486953553310356e-02 7.918846740509401239e-02 3.420795386177111208e-02 9.610129040483288837e-03 2.605705391147770944e-02 1.950229664647087566e-02 7.201768145849294332e-03 1.136018281028239145e-02 2.139750924037636497e-03 9.048078431531115726e-03 5.068564596156841136e-03 8.600880968460573872e-03 2.838865142799687838e-02 5.781388459260437991e-03 6.364347881133433638e-02 2.104740253019267079e-02 3.279654006055918170e-02 1.139805933872239246e-02 6.743892135124046963e-03 4.449541585994038449e-03 3.981437813742591536e-03 3.121525340728000062e-03 5.305749391288734282e-03 5.926402840822599799e-03
1.184026156823118035e-02 3.329342311728785558e-02 7.303190384433813631e-02 5.899367369353041013e-02 2.696878085245068765e-02 4.585366696774521335e-03 5.755678827887771541e-03 3.617929872252077621e-03 5.195631460616928488e-02 1.221563000384453916e-02 7.272109304881619642e-03 1.459935371680715771e-02 6.601102927848899460e-03 7.592711345482164829e-03 7.513815739693187334e-02 6.572627742909049886e-02 2.492878472758906696e-03 3.335928721294191199e-03 2.329641158929057331e-03 2.119730639620303128e-03 1.206689430115124445e-03 4.232480530837375715e-02 1.448219565083476781e-02 2.824976121664620962e-02 5.476539897552535653e-03 3.956074621666866818e-03 3.408240297617877272e-03 3.217373121213365668e-03 6.498975095569398466e-03 7.024525471985691195e-03
6.829603394768339608e-03 2.090778380412323598e-02 5.833688582370202130e-02 2.262382273250584941e-02 1.565375802133250893e-02 8.698396949743900097e-02 6.567442211333391483e-03 8.339929994240556643e-02 3.245972107216040653e-02 2.921628665820319090e-02 3.221848221492860931e-02 3.165706743753832209e-02 5.644848019574660522e-03 8.372811484537437052e-03 9.851967544025438950e-02 3.993539816711003110e-02 9.575713847118975247e-03 3.455498776884954795e-03 5.513206391204786110e-03 2.755317854858034803e-03 2.196033730645326806e-03 5.495785966827280988e-02 1.753477692374680623e-03 4.446417610349905764e-02 9.872100130709665286e-03 5.326252908047467149e-03 3.726455576931482234e-03 4.274828394576801402e-03 6.632683717381518233e-03 2.419506692142654042e-02
8.986121796512714852e-03 9.557307469239812933e-03 3.729799917797128189e-02 2.720018253076086565e-02 1.239623738645797765e-02 5.046232258471382293e-02 6.328806116196820930e-02 6.667400074151816347e-02 5.603953585588265091e-02 4.232889716396791985e-02 3.083934200628729930e-02 2.149928184897092337e-02 8.663075328057832925e-02 3.232323142624200785e-02 2.678532526646193110e-02 4.498488105390442693e-02 5.594822749690956179e-03 5.872912498503148060e-02 3.138627244034179753e-03 8.509362409407915037e-03 1.201474000781064568e-02 7.652829838168901354e-03 2.523209821255927628e-03 2.619793395764893201e-02 1.474076440594116431e-02 1.403568800821355066e-02 8.852948161311572847e-03 6.037335765920406536e-03 7.880150539928939060e-03 1.401645025875701729e-02
4.851217085067165147e-02 7.248398311417401929e-02 7.302216447170219171e-02 8.680157859794791764e-03 4.211007412475827050e-03 8.194910257159224165e-03 1.423032955928443290e-02 7.853874981679316233e-03 7.852096331672334811e-03 8.670025457057950122e-03 6.425712642048223705e-03 3.770943053018504642e-03 4.892516314345071726e-02 2.306119944582966236e-02 1.330150131224165644e-02 2.233544805541088155e-02 3.138731406726386584e-03 5.546947309327629472e-02 5.013301588872587367e-03 7.024569511581626492e-03 4.426214659879201124e-03 5.576161529743177414e-02 2.590207694386693904e-02 2.449303138771049063e-02 1.005829141825867468e-02 1.051559715828694931e-02 9.382671855811526226e-03 7.981410151896416866e-03 8.993575854318203167e-03 2.108246627379886662e-02
2.802645823156680281e-03 5.426813872202289508e-03 2.714009880412090320e-03 5.223326171947601480e-03 7.384115996278739318e-03 8.187198800209839061e-03 7.099851256961169262e-03 6.557481136175820173e-03 5.123834898280702280e-03 3.335091516417315258e-03 5.755541085621974917e-02 5.571477582352206415e-03 4.142811582195868314e-02 1.510605943618210933e-02 1.694310067380094473e-02 3.042586393963754229e-02 5.461166236004294169e-03 6.381846216039582104e-03 5.569922993921916712e-03 4.782163965359039967e-03 8.070137458900930594e-02 4.748419478941636601e-02 1.903419792104757077e-02 1.602219397768020817e-02 7.699172158980880330e-03 8.034888422483727269e-03 1.245543937660731175e-02 1.394973665128940686e-02 1.323667618605277839e-02 3.800292151938899909e-02
5.829166344890621479e-03 3.833730833521960257e-03 2.210585692923633556e-03 1.264939909766802512e-02 9.110190575534948473e-03 3.789803534716833754e-03 1.195682865683033759e-02 5.670718875002027370e-03 4.786926142609792406e-03 5.417450528042473332e-03 4.041329341585036053e-03 5.877894905595536755e-03 1.193996477261959760e-02 9.375032445715230506e-03 5.454047686739932344e-02 4.538510175782329431e-02 4.359417030282153500e-03 1.091030992177410668e-02 1.068738138150924361e-02 2.626892919422758009e-03 2.173708519706813586e-02 2.255781330013848993e-02 2.430008698297763878e-02 1.590809099264135079e-02 9.344484900932264679e-03 1.308149575174693061e-02 4.645511844337475715e-02 8.322336255483080147e-02 4.041164260548666710e-03 1.699659752982098614e-03
9.919432782223484499e-03 6.502525596018990557e-03 1.016507208532446867e-02 9.382342415922319268e-03 9.977730506960713619e-03 6.708353376662000433e-02 1.237842782086215170e-02 5.371388720417757945e-03 6.657467040746373188e-02 2.426566359753725907e-02 6.752200246161960476e-03 6.516196316783302855e-03 1.380826257810734668e-02 1.634765012575054716e-02 8.136870397179222711e-03 8.732164427579573035e-03 4.246857348412732408e-02 4.175386801043932256e-02 1.814799524405962677e-02 1.093598110130747716e-02 2.820630499837773614e-02 1.770540268313387441e-02 2.004197637283641059e-02 2.196153841579991800e-02 1.224659722167817898e-02 1.465854766328752133e-02 2.485846150316682601e-03 3.272133789166547201e-03 4.258904881715122777e-03 6.103887901333456684e-02
1.368449958359739885e-02 6.972612597100432894e-03 1.077105986083458540e-02 8.061209683909397600e-03 1.522084607918303134e-02 4.224421880874436319e-02 4.045189296526265771e-02 3.646114911558154259e-02 2.462839711694958522e-02 5.135033079460959299e-03 5.382889826427784963e-02 8.857798835397213966e-02 1.835419333257216623e-01 9.044019906535120945e-02 1.663915190439739858e-02 3.260017969123626264e-02 6.076850783186309168e-02 1.678561962248265732e-02 5.392859288813322931e-03 4.765927109687961849e-02 1.979835114225387410e-02 1.743674785862394175e-02 2.219413815119476371e-02 3.089488773951432413e-02 3.293465342405702684e-02 1.722173542757128237e-02 2.548765431377111174e-02 1.878308486266119792e-02 1.702619227288404424e-02 1.229945947044683296e-02
7.527791648167493632e-02 4.096273417390314947e-02 1.501127928969445309e-02 1.063662294374111313e-02 9.505613153281135611e-03 6.641081452012878583e-02 3.172598689077323758e-02 2.185103276147594420e-02 2.578642241445526159e-02 9.121740335017211598e-03 1.647151824129523476e-02 1.076048501544603769e-01 1.890867732259020328e-01 9.869095501795885350e-02 3.577879603591826996e-02 4.063296991757749804e-02 4.498846195820965788e-02 2.653005747908018797e-02 8.965876092846412210e-03 1.100641555300920227e-01 1.922662152801869057e-02 1.932949350923562556e-02 2.257193877095528198e-02 4.012777104113877252e-02 3.800079823092284564e-02 2.690790096030864706e-02 2.050700249658268456e-02 1.830052043941687162e-02 1.969143861694276632e-02 2.098706992030684865e-02
1.756316942408884738e-02 4.128777456394364109e-02 8.991138868404635609e-02 1.201306394386212478e-02 8.047684866122256642e-03 5.496197069338248226e-02 3.151564175368645748e-02 2.774275073518659568e-02 3.537779239829719202e-02 4.994230246280643992e-03 6.670830077854536522e-02 3.532156852583000217e-02 1.399646708705141740e-01 6.092389412036358642e-02 1.943022978543508528e-02 2.280268196346324494e-02 8.455223619207913668e-03 1.243122484805144791e-02 1.754377711524272507e-02 7.497794137460166847e-03 1.866301176039541349e-02 2.024428650681872263e-02 2.513346111215353923e-02 4.147523936337804695e-02 5.229694950806572373e-02 4.599055467482408843e-02 3.373629438605733888e-02 3.129024251597175427e-02 2.709034113761142962e-02 2.215187775532931683e-02
1.490517621939286066e-02 4.094635690293922659e-02 6.318208376055287068e-02 4.331387873879558037e-02 2.541127799250376962e-02 1.114077186830347982e-01 1.490798595110326592e-02 8.163271347390553545e-03 4.936285492051089435e-02 1.582665948948237464e-02 5.576512955550477074e-02 5.737133446113307049e-03 6.341760067011868729e-02 8.794693099687204974e-02 9.587842200165717921e-02 1.322288846832447573e-01 1.197577483056565945e-01 7.807829418331106719e-02 2.141547069995116681e-01 1.009159895158801695e-01 1.176571267553176529e-02 1.223310477867602664e-01 9.022310006774876545e-02 8.114175466265976730e-03 1.460429984099310095e-02 1.200891822579326813e-02 2.995878304885195298e-02 1.199519887994528536e-02 3.724129666945225070e-02 4.243391334847503721e-02
1.403075745523914460e-02 1.357728593088447337e-02 3.245364319534809611e-02 1.891705367475728788e-02 8.343189613907563140e-02 2.099602425784870968e-02 7.535916513024481546e-03 1.318430299930971328e-02 9.978638754990658277e-03 6.072661305906938006e-02 2.072655990781666416e-03 2.812458384043469567e-02 5.722300621312685631e-02 7.415956490975625370e-02 6.829523728966589713e-02 8.406390104148743492e-02 1.448081104712236611e-01 2.524017730093710554e-01 2.590818138661236669e-01 2.041158366916721312e-01 1.107141319864889291e-02 1.318942562286385539e-02 1.133138879903575549e-02 2.824776662348565254e-02 3.468045309047637637e-02 1.754775864636544669e-01 1.728357654704102131e-01 3.961564295412360603e-02 3.833281715667914008e-02 2.898283236452177739e-02
1.304046113463381250e-02 1.380417142885285997e-02 2.692225268573790464e-02 2.838073804251144139e-02 1.840676164280053567e-02 2.219616980266598746e-02 2.700584279565610476e-03 6.552754836285515708e-03 1.460029358460541646e-02 5.209109400656817580e-03 5.345347809189682567e-03 4.205692007450886720e-03 3.275995704156617339e-02 6.724190045748500155e-02 6.350856029760131027e-02 9.845917265246822980e-02 1.726453230417112628e-01 2.125311508960652795e-01 1.243779016407709076e-01 2.725687063426022669e-02 1.620968672816247222e-02 1.102206258589990967e-01 1.590411661888133377e-01 2.634413774030677780e-01 2.445839286034663107e-01 3.149110983380919992e-01 2.484121087383850957e-01 7.634297180076202172e-02 5.545002373925820432e-02 3.222740059288091430e-02
1.685228975620939318e-02 1.912539853251165808e-02 1.791457726875324633e-02 1.615427816545408554e-02 2.348137072650651608e-02 4.126725688834834149e-02 3.998187674028445132e-02 1.278833767817617595e-01 6.225191039253330505e-02 1.057390384419381983e-02 7.775934955975801095e-03 1.197941742863102739e-02 2.362024488603333902e-02 3.505055648876619773e-02 4.658092500503466932e-02 8.395733122716422803e-02 1.841179707330718174e-01 1.885821801860904090e-01 9.077605396938401294e-02 3.139495473725257418e-02 1.339527137093342035e-01 2.403500426498666742e-01 3.049548537604493403e-01 3.085326537641653877e-01 2.675312483166202293e-01 2.276562351554181074e-01 3.308397330028622907e-01 6.008814249778174355e-02 7.231704133930749734e-02 3.881676700241467465e-02
4.209207851948385676e-02 3.295946750603984121e-02 1.590850926960816342e-02 2.217114085062120779e-02 4.989456972395347155e-03 2.000518363011540360e-02 1.061368959875653578e-01 8.559087945002283315e-02 8.401723916023615124e-02 4.185206352691583920e-02 1.655562693408344638e-02 4.453799972356954975e-03 4.319396456365197021e-03 1.009947187479327477e-02 2.273581977416080577e-02 1.041112427566291965e-01 1.118237135029861440e-01 1.372050773871717477e-01 2.437783469946247505e-02 4.337970640917489934e-02 1.477287855626495672e-01 3.155903797870627803e-01 3.842901189450990129e-01 3.913946725126237203e-01 3.168641766281506400e-01 2.995419392746033194e-01 2.730752491237833368e-01 2.195747534949278879e-01 1.146847267896040218e-02 7.836550692117822542e-03
1.654497498946471204e-02 4.569017369394334088e-02 7.966003074055703903e-02 9.319379915409103585e-03 1.566010005719851994e-02 2.115179438582069985e-02 6.678589190505862527e-02 8.350462584383921971e-02 5.719082798555982089e-02 4.430657588768441291e-02 1.117631392211263994e-02 8.343639485189241478e-02 2.180013904210332653e-03 4.954248355876272533e-03 8.130214275613150549e-03 4.733922650027114903e-02 1.841028894522045781e-02 6.212394167176283656e-03 9.370252668683475006e-02 1.549091834180009973e-02 5.658903627724676949e-02 2.977861025945059970e-01 3.723223747200224976e-01 3.844165242097883906e-01 2.765697226983226953e-01 1.260600976102096149e-01 2.013625329040962531e-01 1.369725697048126689e-01 1.231086504613541389e-02 4.797128921404368931e-03
6.099289028964166928e-03 9.045935830985363593e-03 5.714496476697038078e-03 6.078403200205185347e-03 1.183311118098050695e-02 6.781150548377083004e-03 3.484849406271361277e-02 4.498101383117096563e-02 4.136580675632298837e-02 9.716771247589373398e-03 3.928983453251704006e-03 5.707944592721037047e-02 9.695025328391164432e-02 4.406019999237374869e-03 1.092322926698072356e-02 6.843942674270404695e-03 1.226237113530282558e-02 3.851527810278572959e-03 7.347676326016263498e-03 3.496898245115658693e-02 1.810925652050845158e-01 3.390062319330462981e-01 3.599340601374702575e-01 3.386035115236934456e-01 2.571484054025154342e-01 1.861142690128523014e-01 1.783746800144729305e-01 1.264118696013756815e-01 1.803912296082359548e-02 6.984760090478878310e-03
1.301080099831532569e-02 1.199508981986078561e-02 6.167054135689095315e-03 4.438538291497005905e-03 5.759933682516873814e-03 3.086130169856411351e-03 1.826593038779035505e-02 1.626068818303468000e-02 4.590305739003690093e-03 2.583770540466071193e-03 1.635729905661416567e-03 8.699852658390405669e-02 4.788571541865416920e-02 2.162134958976973109e-02 4.513884371416906210e-02 1.883920211717137177e-03 6.615582458426891126e-03 1.538570663664206098e-02 1.509950250752239292e-02 6.807873697038140104e-02 1.842238626423669257e-01 2.641243584485560847e-01 1.064098802226851742e-01 1.589165467751124661e-01 2.043089274550015655e-01 1.150128089535471382e-01 8.524485685891150522e-02 7.664557847581482397e-02 9.542009163297408836e-02 1.040741094441486742e-01
1.049812387924327350e-02 1.214488435401101137e-02 2.178218232647008857e-03 1.567088941190503256e-03 1.325579895780705812e-03 1.512859607195851620e-03 2.347299940044553224e-03 6.449132407311118642e-02 8.616554272600041942e-04 1.552159097884219310e-02 2.288295939520513037e-02 3.627282212016785107e-02 3.358069716828287338e-02 1.020385840275345596e-01 3.778857508585809800e-03 3.407176916613817441e-02 6.418807371589758948e-02 9.470220928418161821e-02 6.591357681726754680e-02 4.993806100130823711e-02 3.497290815186653717e-02 1.236873517068165680e-02 4.755073989722797927e-03 1.030289478962555239e-02 3.730425420141727372e-02 1.258030426032406314e-02 1.387849781887700966e-02 6.738954739000179751e-03 1.828405481807873767e-02 1.711317294846026460e-02
2.242265354460088941e-02 1.907703665837812146e-02 2.628277059455256300e-03 9.709190812075367549e-02 1.927235160053302225e-03 1.072245775858921262e-03 1.784657176652131765e-03 2.268574235643282255e-02 2.149011176500906228e-02 9.311012066659282715e-03 2.340247287988186931e-02 4.250197446699276876e-02 4.335356985114889594e-02 3.920001353545452677e-03 4.206952957926214827e-03 1.949569191511258889e-02 7.267439910747920673e-02 1.380719957485836979e-01 1.592399546247748321e-01 1.386980607750941952e-01 2.906176954854655659e-02 6.402565614691023595e-03 7.884679909338738329e-03 1.949068965421217950e-02 4.340057742760080467e-02 1.280505339045404263e-02 5.843619651287314427e-03 6.665874254894640916e-02 2.522888714147670727e-02 2.433350823398484561e-02
2.820210794058380585e-02 3.981037310206391594e-03 9.841820647566884572e-02 4.056930107804615493e-02 5.144278562729052290e-02 1.137561174694902283e-01 1.371707090529263560e-03 1.845273260454739078e-02 1.079138074105395924e-02 1.232489013273197799e-02 2.233697834189755926e-02 3.744457802193417589e-02 3.245808430390353938e-02 2.526540205529435347e-03 6.393438575542683376e-03 2.804006842110508269e-02 5.533502567482156964e-02 1.297347751323530418e-01 1.659468356633361230e-01 1.411680102234903755e-01 6.957143777162934362e-02 4.554028159255611198e-03 3.531384321710265891e-03 7.419080849269094058e-03 3.841492102213515947e-02 2.130513975939576574e-02 2.252709144598632682e-02 6.130377854052154740e-03 2.036778615949182483e-02 1.842717823083620671e-02
1.565648265206710799e-02 5.456430979090294044e-03 2.304796826733343258e-03 2.334091729334410083e-03 4.965063823204648140e-03 3.403178514337371063e-03 1.578975016447941139e-03 7.167774308213500922e-02 1.084716386654792086e-01 1.389578890056232252e-01 1.312325061217868051e-02 1.554980431258133275e-02 1.951655679354274628e-02 3.621105467285758855e-02 2.773239086194394330e-03 8.691902535804154131e-03 9.496339248714650780e-03 4.099133845517081293e-02 5.316244686600991171e-02 4.379224929882363088e-02 4.213483215408270893e-02 7.654997335793999567e-03 3.487586169579313944e-02 5.637971006057496126e-02 6.926952704403184329e-03 1.593616020485977974e-02 4.271469263904193597e-02 2.839144278568489152e-02 2.290486020857825447e-02 2.002077643017309561e-02
5.604998611549957301e-03 2.233909386501765557e-03 2.382906114243129887e-03 4.016812939049774385e-03 2.283039019818463439e-03 1.133767087540901546e-03 6.919916555427514659e-02 5.069643401573615399e-02 1.562738539460246370e-03 5.979954012181658458e-03 4.190547195687050613e-02 1.531659530268365300e-02 2.234777858108205964e-02 3.861389930793192315e-02 2.696271061833625544e-03 4.670005961015851609e-03 4.614952637758584948e-03 8.150627702386079032e-02 4.100598530467152412e-03 6.301114507983577966e-03 1.220704342811203963e-02 7.851393200737448452e-02 3.770561992801271106e-02 1.034743708654619308e-02 1.794967001950516922e-02 4.034507208300027077e-03 1.952435198931696397e-02 3.111009554452996359e-02 2.147356341017003789e-02 3.083287104214004967e-02
5.680976826528831396e-03 4.578219706075000242e-03 2.229427755825217489e-03 1.630007612798802744e-03 1.581960492682193530e-03 8.347430808561090432e-02 5.750163514450852553e-02 6.060004879508598674e-02 6.676090857186259275e-02 2.495049776810802367e-03 7.678482626340044082e-02 6.991693430873265058e-02 5.566556770988057012e-02 5.484428389723176867e-02 2.389358796583493025e-03 2.913163977861791838e-03 7.205871535621602431e-02 4.590311392657801109e-02 4.044105371991101039e-02 3.028852053702201300e-02 2.381746003441447337e-02 3.362738154216485253e-02 4.757877381955361723e-02 1.023874927932291318e-01 1.301286315004566291e-02 7.708463424018090204e-02 1.184041128465510018e-02 8.889744610777136624e-02 9.227623695725969966e-02 6.078156837561850961e-02
7.716867412315484356e-03 4.038727939908432971e-03 2.292325420984695893e-03 3.120194476375530782e-03 2.852069946939974829e-03 1.591172554125999282e-03 5.618578455872597424e-03 4.779604802273700395e-03 9.210323606073886338e-02 6.719956622482249620e-02 2.454230627298565823e-02 5.191563076721672498e-02 3.480567589200724617e-03 3.500232659502220019e-03 9.921429405058780626e-03 1.038545914991700903e-02 8.214337169338693789e-02 9.970933397813601384e-02 4.583705818529466153e-02 2.026367745027710457e-02 1.929588474513933144e-02 2.925477812758201651e-02 4.187850054990494009e-02 1.124462858414057159e-01 1.101850087881983513e-02 2.654251520638854778e-02 3.290166347238914629e-02 4.168308874751229520e-02 1.331097173007971535e-01 2.706226110594110723e-02
1.038562606348034101e-02 9.023764737406472780e-03 2.732363974497088732e-03 9.298140937235717732e-03 1.068420751543426410e-02 2.003543441370401676e-02 1.335648207660731883e-02 1.953001632110659171e-03 9.274254005142941459e-02 5.442759064948428371e-02 1.624110413804731937e-02 1.854179689644957357e-02 1.999599575908265689e-02 7.039348019025375158e-02 8.180171725578956610e-02 3.464593011935504507e-02 2.917915929031980951e-02 3.198923486272794298e-02 4.296236884883320589e-02 2.476063587618860043e-02 1.738251248137882149e-02 2.561731542786194193e-02 2.773970647815785298e-02 4.129248775395878701e-02 1.687616703254377765e-02 2.054334138426266998e-02 3.171475911038523082e-02 5.067370205440428071e-02 5.688283954294820477e-02 1.103577383818202806e-01
5.684455021356475332e-03 1.419238252671324065e-02 4.218681449528824054e-03 4.475931030764648474e-03 2.142510223262372379e-02 2.247286896300018308e-02 1.484392459526387084e-02 1.254153137071988564e-03 1.237087389286695566e-01 1.172477002624221221e-01 4.810700913748112290e-02 2.403166485876275654e-02 1.426692030295265319e-02 2.231228003489540285e-02 1.010248579082311943e-01 2.631305058136451658e-02 7.165072461253110814e-02 1.612517982194365193e-02 2.131691326633379513e-02 5.748950831860936105e-03 2.445193710141787061e-02 3.409620819697812416e-02 2.881082362387699797e-02 2.862947284455392635e-02 3.708512971187410967e-02 2.931515988427814759e-02 3.606409784215634101e-02 4.329785561783763143e-02 5.342875842365652633e-02 2.610757473710994397e-02
