6.523028079404022961e-01 1.168665162183188475e-03 8.423874274971276943e-01 1.299115061970138214e-03 8.045307820264864240e-01 2.148761795194304401e-03 2.104456085334309272e-03 5.625686075793103966e-03 1.012823491103325910e-02 4.582325656964878272e-03 2.149612148370075304e-03 4.249880146419074967e-01 2.524834726504586735e-01 1.038908226547728339e-03 1.178981933088001782e-03 2.595573456182240779e-01 8.555403922053693216e-04 1.425804965916113286e-03 1.229139345917112849e-03 4.136284393247864882e-04 4.689148043228111851e-01 6.817836903859766928e-02 5.299240029346907743e-02 2.095306203917055299e-01 4.008194281918818769e-01 3.106569588683541494e-01 1.421355788357923089e-01 1.253308481174162173e-02 1.186768569356462522e-02 1.479151474501191367e-02
4.992104216090390567e-01 1.370471057294901304e-03 2.477557489156574644e-03 2.015844566339578241e-03 1.404515936956552986e-03 6.265396725528697350e-03 2.953083761251957748e-03 3.626027682179339476e-03 2.328461865023709332e-03 1.984817009905659457e-03 1.422423576862243653e-03 2.506530432967847277e-01 3.396823536901384943e-01 8.217229045481065468e-04 1.119656532529123352e-03 7.054655274597969317e-04 8.342854133600675686e-04 2.576820390211788294e-03 1.836500103017124803e-03 5.248109105776255744e-04 2.818581035574794780e-01 6.344415177692967756e-02 1.334288284740506314e-01 1.174138764109627364e-01 1.022036058270673065e-01 1.354406375418747976e-01 4.769583406315887342e-02 1.235356338901484261e-02 1.759085419934701411e-02 1.761422519743570392e-02
7.756275634559613164e-03 7.578025383591569485e-03 1.604753330939577560e-02 1.294737810771143596e-02 2.769568955357457410e-02 2.812030293589572877e-03 4.265920603852894066e-01 4.532064618107005671e-01 8.616362147298828322e-03 2.622430672726889199e-03 7.063716849175895665e-03 4.672620295193255849e-03 1.698392563070926214e-03 2.454111266392064797e-03 4.803754658305853242e-01 1.900035908193977276e-03 1.211548760669448228e-03 2.329084908468982695e-03 7.256201632100048836e-03 1.135757125496402158e-03 1.758720443275099410e-01 5.122528539428405914e-02 7.836003455595218214e-02 2.732195982426619679e-02 1.620531227432115209e-02 1.071080698215185270e-02 9.518155375640460075e-03 7.552131642410857271e-03 1.284858667154020924e-02 1.456118940592095005e-02
3.550788552418171137e-03 9.707984055174862306e-03 2.133980002452776081e-02 1.710358140892202783e-02 7.093514357855586726e-03 1.096967495274937940e-03 7.240735670849725025e-01 4.846188620223004229e-01 2.932272727319179539e-01 3.252485445986515351e-03 2.091516759699828514e-03 4.165678941076219471e-03 1.867915909937360643e-03 1.226451809827113718e-03 3.550473547157572130e-01 2.761998002698585752e-01 5.915266897091041587e-01 9.169226425984192737e-04 6.166172633672322876e-04 4.988791660532408516e-04 3.405339119756409794e-01 1.173074778111066474e-01 3.675956048029966478e-02 7.071245422883699894e-02 1.311697544578349119e-02 9.622823413524841940e-03 8.205529031894698289e-03 7.796715880391899209e-03 1.560919207824194854e-02 1.724966018721645067e-02
2.026959393585241707e-03 5.984331575121222199e-03 1.666532442377447604e-02 6.455404108231964713e-03 3.730261197182948261e-03 4.607279113371678392e-01 7.059805951030206916e-01 3.929189545653870574e-01 1.800262861977774964e-01 7.531135554105228280e-03 9.444458191305044048e-03 8.128232521301344965e-03 1.190131882231564584e-03 9.598985586219367303e-04 4.191781204948241135e-01 1.580179559770896192e-01 1.588634294436967222e-03 8.755819896898403391e-04 1.357590088214687823e-03 7.442663460947365750e-04 4.904571356976049779e-04 1.959126461544187237e-01 4.352452879725863255e-01 1.186770107625400861e-01 2.360930731566636409e-02 1.280350566632415879e-02 8.833748987187719365e-03 1.030938573209086440e-02 1.596881001465018379e-02 6.003862429700321940e-02
1.993268218307924118e-03 1.988561374794050630e-03 8.899821961855241756e-03 7.114521191172024778e-03 2.828518582905039692e-03 2.657039239682195686e-01 3.216125727150631608e-01 3.429336590716905997e-01 3.154520283706557238e-01 1.169328434619902948e-02 9.230258148120862663e-03 4.926076024590201122e-03 4.531002012680261926e-01 1.396779339438748713e-01 1.075587012673689669e-01 1.775463344594714055e-01 9.004609690400654839e-04 2.494189374519472091e-01 7.251151253981654018e-04 2.418871761616338094e-03 2.803104334537862528e-03 1.570358585858875299e-03 5.571945520196639468e-01 7.154868729285047968e-02 3.536321845432415650e-02 3.350665630158585623e-02 2.069730994688478987e-02 1.445572779300005259e-02 1.890989147625624089e-02 3.500886895812687499e-02
2.316321236098793646e-01 3.714360916867367468e-01 3.922269875085994673e-01 2.218645694936244826e-03 1.060630206815044597e-03 1.776850435395291826e-03 2.739565453252486554e-03 1.586193448310337702e-03 1.907088173166298284e-03 2.255989788277239401e-03 1.759130344454376722e-03 5.653665870390063297e-01 2.336066815049188394e-01 9.215377797396215320e-02 4.894383989857988698e-02 8.780050848834855537e-02 5.236026774203231815e-01 2.509205959977703904e-01 1.225567541615022252e-03 1.637943466187729473e-03 7.149064328691335114e-04 2.093697030798413183e-01 8.330998716430240703e-02 6.500429253636409721e-02 2.416701670100831340e-02 2.492557377647963007e-02 2.162126228001424316e-02 1.910201242823047346e-02 2.211122905086459686e-02 5.424381668480003638e-02
4.870992060047469874e-01 1.086701663440287546e-03 5.289591885872624299e-01 1.347064065091635237e-03 2.042898418518544063e-03 2.298483780589508432e-03 2.056922706899884205e-03 1.956539572158830058e-03 1.583915178773315138e-03 7.373085635827223427e-01 2.942097730201028716e-01 1.148858451203590546e-03 1.923756570556180434e-01 6.435788079506338244e-02 6.625624123301580848e-02 1.230213657392482118e-01 1.084299424008823001e-03 1.710255052318256433e-03 1.481875550405087946e-03 1.030125930773688166e-03 3.068227367333291600e-01 1.468647844181475981e-01 5.002865763754158618e-02 3.901714117833965378e-02 1.841770066612765863e-02 1.938169294862616618e-02 2.983794279862865551e-02 3.824022904682465585e-02 3.890991929019734646e-02 1.173965830581360503e-01
1.644579113276805216e-03 8.201893696701064718e-01 4.840295214607037155e-01 3.517228627737094791e-03 2.247524609797619827e-03 7.784954899546016049e-01 3.065815604512193288e-03 1.376614679803022214e-03 1.155569704661299100e-03 1.154749092043267592e-03 1.040995768996767594e-03 1.384944353713644678e-03 3.013640267959530154e-03 1.933809305994862353e-03 2.397063623257915110e-01 2.199275934806343979e-01 1.072060523884718706e-03 3.196882479702862351e-03 3.099267624730782898e-03 5.194788922967787936e-01 8.363022108771764329e-02 6.535949632711775259e-02 6.211977902156399362e-02 3.819910987694249971e-02 2.216208014942198934e-02 3.414525472909771958e-02 1.282011567514013683e-01 2.632279733257855692e-01 5.026294547071972303e-04 3.917152832101042925e-01
2.779785695821934254e-03 1.798381234192711169e-03 2.843656614432324425e-03 2.605826119809344192e-03 2.238597514875722509e-03 3.568293458746423230e-01 2.030049516270240450e-03 7.267647466476971907e-01 3.098625244748822172e-01 1.152179480883938484e-01 1.980584573768828967e-03 1.934550572695249888e-03 4.095950127752888241e-03 4.421785436336183456e-03 2.102508824608412263e-03 2.281584797369971829e-03 1.198346347594466538e-02 1.216348884279953510e-02 4.786711250570782790e-03 2.076036864406815945e-03 1.040912000401945231e-01 4.978904118316603011e-02 5.109884237358049142e-02 5.368902843677318681e-02 2.937221160029975658e-02 3.789686744724069661e-02 3.570575800685719114e-01 6.240679516765750279e-01 5.493588922536235325e-04 2.115994982099818067e-01
2.329179866136925001e-03 1.211562100222206631e-03 2.677583364156424939e-03 2.240131067268381643e-03 2.786691036404095444e-03 2.070049247165814954e-01 1.764763382354146704e-01 1.556950209579322786e-01 9.890532619341699250e-02 9.916578117343337849e-04 1.558981517587578955e-02 2.595987102392822293e-02 5.377795596875857564e-02 2.672958427431125494e-02 4.968858548027747790e-03 9.720857844206478443e-03 1.776233535458385596e-02 4.828783790253254882e-03 1.132988325836196920e-03 2.099026353334165762e-01 7.202921073852129596e-02 5.021244450277479593e-02 5.950794807533444503e-02 8.103460724960068196e-02 8.540333938913891032e-02 4.613479430731361186e-02 7.294565693782693871e-02 5.917749357807999822e-02 5.362054791857925190e-02 3.884387804479080136e-02
3.234408474997182426e-01 1.900115209191062249e-01 2.189622729549736604e-03 2.113557482892133681e-03 1.616361204943554935e-03 3.010714304049026957e-01 1.185551456080784771e-01 7.695011828129857956e-02 9.612241190999283591e-02 1.919389725086648136e-03 4.665138857132913354e-03 3.041979446974326165e-02 5.475597178580828006e-02 2.875049558173332909e-02 1.053505422547323413e-02 1.196853574520591323e-02 1.311341159545544380e-02 7.681227810736307622e-03 1.876610610330398327e-03 4.545780705337599814e-01 6.733026244303517982e-02 5.969965263063058136e-02 6.733546086404383624e-02 1.193513023599414996e-01 1.137253193119030781e-01 8.079443204133207601e-02 6.171128699324078537e-02 5.593363862841607692e-02 5.971936950285691714e-02 6.375286875495335404e-02
6.252149775070910132e-02 1.614100244003215667e-01 3.940824985576512063e-01 1.416500790858154796e-03 7.330797965186415244e-01 2.343459160823497811e-01 1.210315151311167070e-01 1.019962076096602305e-01 1.295220813989454156e-01 9.482792801478074100e-04 3.033919648567297012e-01 9.619610822998201499e-03 4.057567435602610351e-02 1.757919469490738795e-02 5.612441832794470668e-03 6.567896792547005605e-03 2.426764554767710594e-03 3.558133639393014445e-03 4.048577415816516020e-03 1.506334755736500738e-03 8.151120810109960257e-02 7.303632715458624469e-02 8.780682451250594600e-02 1.506842846187916307e-01 1.978669208389487455e-01 1.863425619160869462e-01 1.380894748871025202e-01 1.245685562217370840e-01 9.398813988789017637e-02 7.183246249717797904e-02
4.967583085170652196e-02 1.431486262785459096e-01 2.626541064741624854e-01 1.920079586899828827e-01 1.137837733592574896e-01 4.524661457500153694e-01 1.746818044643100223e-03 1.431901425535656155e-03 1.873131179661930434e-01 5.753834048453926320e-02 2.299349664315381014e-01 1.541236353350398068e-03 1.828437428509437079e-02 2.512073579701771045e-02 2.728164079356366206e-02 3.740868194446089756e-02 3.390642863276762536e-02 2.207438682018766224e-02 6.045223901802010413e-02 2.826331218876468668e-02 2.322986845616471351e-03 5.112158692246817626e-01 3.843518013338956818e-01 1.236258783088569312e-03 2.882153372343077957e-03 2.691455145397543547e-03 7.307168950861871182e-03 2.289528133145023528e-03 1.523832174423139230e-01 1.456823004976254277e-01
4.458876756057966045e-02 4.493790916432049976e-02 1.251520564579579886e-01 1.116299307538467416e-03 3.433951311260532435e-01 8.117364660263109988e-02 1.154097572002616692e-03 3.260028331457586089e-03 2.152417500022792054e-03 2.305055863982982123e-01 4.922921985653374577e-01 7.497619046264626316e-03 1.594780410484055583e-02 2.059165721639480071e-02 1.895688453755004638e-02 2.333090973836713169e-02 4.030561291938867391e-02 7.042192079080444866e-02 7.266258671011524561e-02 5.810299092624923722e-02 2.488792029866556798e-03 2.596816850427911307e-03 2.275485787155711974e-03 7.172840917513034938e-03 1.036032357856415953e-02 5.303929755436708610e-02 5.288709949909603525e-02 1.030465184511843331e-02 1.783141345918613785e-01 1.061116737471674842e-01
3.895347778545834444e-02 4.262651578145026932e-02 9.912116911367904737e-02 1.107784793505072196e-01 7.397258102951109748e-02 8.471445562492969927e-02 6.030908342286500634e-01 1.741140304319096143e-03 3.574377088866541839e-03 1.274541304741195948e-03 1.306011724221527517e-03 1.119443124031011287e-03 8.716922545804984754e-03 1.810648157459642665e-02 1.732935520626146045e-02 2.714171967635212873e-02 4.773895447366046513e-02 5.912273412397152372e-02 3.499144436564241567e-02 7.804081276685038634e-03 4.695759717151206346e-03 3.217663627993112146e-02 4.641404444995858580e-02 7.852412853799178860e-02 7.436292437327947369e-02 9.716833935963559155e-02 7.808870608519320744e-02 2.188684984098860503e-02 2.819735621333488429e-01 1.268287379362081635e-01
4.715811704558959400e-02 5.484612281910973552e-02 5.522993964441202941e-02 5.349778441265304330e-02 8.267468070777529709e-02 1.732918715010939026e-01 1.007397950576483826e-02 3.355899462044667492e-02 1.632529205990763260e-02 2.759313170892118815e-03 2.011928797718176738e-03 3.051531412878089045e-03 6.033480324678574744e-03 9.160586201217270352e-03 1.241651405304630522e-02 2.281884574122708398e-02 5.036384429422188086e-02 5.246198667478607636e-02 2.572332620203160794e-02 9.054346713832286259e-03 3.890594621007401055e-02 7.000827268912493406e-02 8.910390156948508333e-02 9.264728266086350028e-02 8.267512798111138761e-02 7.194075502228880481e-02 1.067233939219568717e-01 1.845493659859714225e-02 4.220903017324557083e-01 1.794758568513462049e-01
1.128128177465576309e-01 8.912164893717089420e-02 4.761979612995641264e-02 7.645935888917210210e-02 9.469248687894682394e-04 4.788931704501843759e-03 2.679915644294362381e-02 2.182284551891242041e-02 2.143358084290274135e-02 1.058066641743645765e-02 3.790840368645271609e-03 9.868881083465912488e-04 9.653076697983295311e-04 2.570461275837712493e-03 5.953178897717836641e-03 2.812538841212720853e-02 3.055960172425362109e-02 3.724029732176622337e-02 6.739358823833318385e-03 1.220576203881418298e-02 4.310387566577005697e-02 9.265506528131089992e-02 1.138166574614978555e-01 1.199516579841429925e-01 1.007581252096492741e-01 9.769218431731818697e-02 9.085159081806065684e-02 7.200035523501516210e-02 3.193132466725042730e-03 2.103385176924090112e-03
5.054517241868868027e-02 1.408476739786705678e-01 2.669023299739838873e-01 1.683417827032563730e-03 3.667550710986558146e-03 5.178017013873919411e-03 1.642975409016781546e-02 2.050465502172783144e-02 1.408932054891386121e-02 1.084902060500280742e-02 2.246490001100649378e-03 2.921362626613797642e-01 4.398754208329392901e-01 9.628082468579560616e-04 2.148459412133328032e-03 1.301534884133029833e-02 5.124807537300482205e-03 1.702965074316784141e-03 4.839773293237540353e-01 4.371713944010454170e-03 1.664573374947422163e-02 8.875391651405362126e-02 1.127283650859484121e-01 1.200698001437592866e-01 8.916067872309274556e-02 4.166174779893744295e-02 6.754337593543582874e-02 4.635551337242589665e-02 4.179498029494035927e-03 1.649652131330649196e-03
1.223041657482678559e-03 1.525342093447464454e-03 9.982748570320891263e-04 1.207007654880487470e-03 2.767112944421938614e-03 1.580313765647399938e-03 8.186544325967472224e-03 1.057867803643439825e-02 9.793713435931820921e-03 2.303816415797816514e-03 5.764186745394494528e-04 1.741508472679648145e-01 2.995071525084715414e-01 6.570567686441818782e-04 2.684443611239678562e-03 1.855418505331674680e-03 3.485427128479398270e-03 1.061348579573346065e-03 2.041800123586511983e-03 9.832271237766941618e-03 5.339800403124742023e-02 1.022960479854699845e-01 1.113058448392815064e-01 1.079047840687360621e-01 8.428442169944236340e-02 6.245884180473788849e-02 6.080871655746875742e-02 4.096785519439434531e-02 3.688146420704775056e-03 8.608758128863367443e-01
3.344827998406229956e-03 2.961906369145703849e-03 1.480804177175321350e-03 1.029802009215128027e-03 1.289002604689700685e-03 6.856018535956212535e-04 3.924152908882829437e-03 3.504304168610136456e-03 9.659554061972769898e-04 5.313057832275010130e-04 2.930546674744797242e-01 2.298005016440203829e-01 1.352125079608895997e-01 7.347418786269546698e-02 1.870656246449923787e-01 6.175579257967717117e-01 1.879651109822155688e-03 4.385098828018743448e-03 4.308575650324667633e-03 1.961869331028612967e-02 5.471036685521246667e-02 8.121104853770630405e-02 3.385472616652460132e-02 5.201102515662610337e-02 6.841407281332263779e-02 3.929095570146924621e-02 2.955597052945194148e-02 2.427325569447367007e-02 5.620975810187400779e-01 5.128036013776903213e-01
2.672134566546868501e-03 2.976865674289477098e-03 5.749765650788365434e-01 4.226646059462311755e-01 3.700380267386457200e-01 3.278076624991172524e-04 4.687004582324107377e-04 2.117777738694071599e-01 2.788355107997189108e-01 4.321870212208887840e-02 5.612650589503041798e-02 8.466369947716687050e-02 9.294359518562680944e-02 3.281097866103479532e-01 6.900645546045497836e-04 9.355346960571078035e-03 1.814939066418085056e-02 2.671042297310623898e-02 1.853394935619131004e-02 1.428631921154356610e-02 1.045471201209145773e-02 3.866067532084759874e-03 1.541597131473684172e-03 3.403689312786885475e-03 1.258360929749274132e-02 4.333192574755333204e-03 4.049462672551633509e-03 8.433720640127047030e-01 9.677284757705872931e-02 7.916502630593695577e-02
5.651894126483703908e-03 4.236577789564601251e-03 6.004792031140261388e-01 2.724267862601196244e-01 4.214251077402192402e-01 3.384465765823430061e-01 3.053147438013679884e-04 5.823911749535685967e-02 4.976821318758045676e-02 2.138547087271435582e-02 5.035558781937332640e-02 9.460830493970724675e-02 1.252743302251591584e-01 4.695229564494623770e-04 8.231092653113989722e-04 5.457344744273938744e-03 2.014014880506025812e-02 3.809071062923071599e-02 4.378450574626345515e-02 3.908469894366454339e-02 8.682084249982676555e-03 2.014161005901805076e-03 2.580639304901853788e-03 6.425712825092281047e-03 1.452222936669183076e-02 4.343451363092320876e-03 1.026545547823511484e+00 3.980817066834551610e-01 1.256385132533587301e-01 1.128149447827375140e-01
7.018230221697204299e-03 8.741562095750700367e-04 3.208393604604017346e-01 1.093452635249723692e-01 1.297320840791857388e-01 2.910536471769488709e-01 3.825979013357785896e-01 4.360871655391484331e-02 2.435305910128142404e-02 2.793683033891611323e-02 4.914863074984408831e-02 8.339771761903763680e-02 9.417749678498921195e-02 5.200948281003329177e-01 1.511412123593896357e-03 7.808953401962795068e-03 1.524701950056508645e-02 3.547459098671805477e-02 4.508230681888132640e-02 3.925074650554902234e-02 2.059073929292832075e-02 1.240671728725888708e-03 6.876215014531110725e-01 2.003720841866926065e-03 1.163114342687509781e-02 7.023507677358832232e-03 6.391255589361315159e-03 7.296776716546202746e-01 1.118877222672619576e-01 8.601183606302129081e-02
3.874330044462038700e-03 1.179563657081282623e-03 4.470662264922050690e-04 5.930721305793021925e-01 8.573625752226247086e-04 5.746810828991133100e-04 4.038635253353300425e-01 1.683736283742570117e-01 2.552810043784795035e-01 3.296924209028305186e-01 3.047229962385344243e-02 3.411956869673505449e-02 5.318859942650525086e-02 1.207031979920940856e-01 5.408057254819046908e-04 2.386407368893542994e-03 2.437486611137116600e-03 1.055002633947967235e-02 1.367414767374542858e-02 1.211942669369431985e-02 1.076914254666050917e-02 1.461229799437943231e-03 1.786534858641188883e-01 3.391643259304806257e-01 2.046688660684652886e-03 5.122790892034007754e-03 1.384169712853560580e-02 7.871777930638840237e-03 1.324733985663593683e-01 1.000927098228671652e-01
1.385646762422940680e-03 5.408040159030859037e-04 5.635763046305966670e-04 9.194061756028562571e-04 4.816859779878075254e-04 3.522569045413577182e-01 1.650186704515111680e-01 1.180560496590355446e-01 3.783026043838035868e-01 8.060529899344387027e-04 9.794056917986812549e-02 3.353589880202079154e-02 5.675988777639622007e-02 1.248998548833135380e-01 5.934079676413303028e-01 8.514686506721653178e-04 7.082293277217903693e-01 3.410315629276621796e-01 5.231298995807205365e-01 9.122619579281403875e-04 1.714858682014437641e-03 3.548551109568280904e-01 1.786198781257949120e-01 9.044750121596949466e-01 2.842893317239216216e-03 7.307011444297945024e-01 3.540442599223321118e-03 4.011819909632586070e-03 1.000195529158211638e+00 1.533896661216273549e-01
1.404765696950352341e-03 1.109235217988453108e-03 5.272585976238462020e-04 5.522514506673348311e-01 5.331107167259001578e-01 2.048402103959731657e-01 1.378440742114848960e-01 1.437986766978236741e-01 1.606804708658871039e-01 6.355046706519250632e-01 1.777080839888162955e-01 1.674499216856619177e-01 1.582167817892878581e-01 1.978482531245628895e-01 5.751290844237595401e-01 4.043514389663249164e-01 2.756104087096649669e-01 1.662249781604331900e-01 1.472482219031402417e-01 1.132931256721436963e-01 9.014084163645030845e-02 1.316644388997413873e-01 2.094655324495139082e-01 5.245885310867908213e-01 9.234859424471114631e-01 4.435239467878196451e-01 7.104397972406574224e-01 4.565320915453829898e-01 4.592062732820786364e-01 2.962346096672489049e-01
1.903045985444178426e-03 9.764052523501362980e-04 5.417943391847986935e-04 7.175832963787945979e-04 6.046346312224583613e-04 5.363816277626249907e-01 1.084227191335297973e-03 8.062276955071465221e-04 2.162516040439310672e-01 1.554059414601980105e-01 5.488052088404025974e-02 1.248795001660385762e-01 3.712781568727472337e-01 4.145203660118026434e-01 9.587332772760316950e-04 7.902281265587284735e-04 3.146583583794027028e-01 3.774727895921938248e-01 1.760022311206916323e-01 7.685570999398469438e-02 6.980829156395707003e-02 1.065625811458398298e-01 1.657252392181524370e-01 5.286408484913878159e-01 5.557704780309778991e-01 1.358102783110035072e-01 1.533058976104985927e-01 1.946070988633062382e-01 6.209932770672602631e-01 1.295484176814282185e-01
2.552176140753911315e-03 2.172869972918753390e-03 6.427976613957934581e-04 2.132384305373289345e-03 2.372519886168692263e-03 4.389005323719958468e-03 2.913656842536967856e-03 5.823937089035891024e-01 2.133439714408912335e-01 1.221639060359251960e-01 3.574137792657267054e-02 4.426853428675293911e-02 5.563432955980988914e-02 2.269340669256543763e-01 2.903890380854011188e-01 1.335830893691740684e-01 1.323511525450039028e-01 1.603416659632116159e-01 2.196793004717638442e-01 1.202923123989034782e-01 6.526759566110910959e-02 8.839673338222756027e-02 9.905908606983837572e-02 1.746200196614866029e-01 5.747790341726990437e-01 9.394914422039754576e-02 1.392748234870680724e-01 2.274289447242317519e-01 2.670763145246463077e-01 5.448234516860768206e-01
1.388369192704299974e-03 3.395257443053725701e-03 9.881897811287703847e-04 1.026639303410373412e-03 4.776216418626931526e-03 4.959915989158999138e-03 3.274858840256901233e-03 4.005154561194514962e-01 2.869674926361541756e-01 2.694855332697947969e-01 1.100595436799380045e-01 5.424069643798103135e-02 3.522771151599915496e-02 6.339830601983875713e-02 3.127876197147396176e-01 9.386763412468951406e-02 3.396631603037906233e-01 2.000792015838496682e-03 3.801723738464993056e-03 5.021017260181745989e-01 9.811225885581764672e-02 1.238041881103477820e-01 1.050135013631030567e-01 1.208740624656119422e-01 1.683698603668846439e-01 1.341960684526519176e-01 1.620376010067300920e-01 2.006308872903495022e-01 2.625436667466316543e-01 6.613824282114990627e-01
