6.149825979519583756e-03 9.083486535983556140e-03 7.858634672203851368e-03 9.852994472973374343e-03 7.429122936010251754e-03 1.618647650747602126e-02 1.597580727025937897e-02 4.303257827030217142e-02 7.770047033900064071e-02 3.446451925282722345e-02 1.572636485912759507e-02 3.533334559048766435e-03 2.049155739987857869e-03 7.602883757553472593e-03 8.784965067759298654e-03 1.912960243065444082e-03 6.664301025589858436e-03 1.154535286193212468e-02 1.033779693628682217e-02 3.598014204934402421e-03 3.216683277356221452e-03 4.029423397017638936e-02 3.186503280331191151e-02 1.756114404914425799e-03 2.916388049870786980e-03 2.398752586522162090e-03 8.791138223545144625e-02 7.907227654995449551e-03 7.500066211923357880e-03 9.354841422692055861e-03
4.912624371803248763e-03 1.090381481926421328e-02 1.950410586297005727e-02 1.588011830148016584e-02 1.101320885856271747e-02 4.890143285454657401e-02 2.298353516933498986e-02 2.874000371254854802e-02 1.857091289391557196e-02 1.570670103920409483e-02 1.094559089423601146e-02 2.109352988031905959e-03 2.766494685325671197e-03 6.252651647283800906e-03 8.628136411726135616e-03 5.451653569592411312e-03 6.646999933553325579e-03 2.146911493244569452e-02 1.597391421226504807e-02 4.731489205723957148e-03 1.895798500836327677e-03 3.810815571420057835e-02 8.234380641871885675e-02 7.152737231842155874e-02 6.167960832680837585e-02 8.367340074910684100e-02 3.019601479911079162e-02 7.920206393118436189e-03 1.124494448041964481e-02 1.119629276736537442e-02
6.006831947230836105e-02 6.109895213518027474e-02 1.291544599236900126e-01 1.050625322819083579e-01 2.227720093964320469e-01 2.248328052974905150e-02 4.112334170581207621e-03 4.349983709518118712e-03 6.895479844526648805e-02 2.095345317086510714e-02 5.580042499381745319e-02 3.668900313064449303e-02 1.329934070855631409e-02 1.910410120010231499e-02 3.594207207068033597e-03 1.477705010597338102e-02 9.754333637111247887e-03 1.965588074734083215e-02 6.429089840281276835e-02 1.048348647008208977e-02 1.181144701380902433e-03 3.140886399159643905e-02 5.046791319383003849e-02 1.763372468070512067e-02 1.045425749875812139e-02 6.885254924038021820e-03 6.138275941626772543e-03 4.834694920495599506e-03 8.250633649042516185e-03 9.250468397366011161e-03
2.793377325848593259e-02 7.978112785686061748e-02 1.751403176423861341e-01 1.415014002798114512e-01 5.769655396470321079e-02 8.824690303388402560e-03 6.857814783650853681e-03 4.691135517405468219e-03 2.830428414455410380e-03 2.649263772550576601e-02 1.652673209763349388e-02 3.252851239767332731e-02 1.453793358654388926e-02 9.473969598723560800e-03 2.992449836733131023e-03 2.252997731001995553e-03 4.654358561831183072e-03 7.603441266117823803e-03 5.281063017057189765e-03 4.416223902012826781e-03 2.203599942413736988e-03 6.405022098698261168e-02 2.208485173127229875e-02 4.375162873847201345e-02 8.463880115401263213e-03 6.089120017803866837e-03 5.215528455309868458e-03 4.948576122943655793e-03 1.004547616397389979e-02 1.091301883077205707e-02
1.608009722111436446e-02 4.957187060852098759e-02 1.383802769167621627e-01 5.362883207212582048e-02 3.042107051956046554e-02 4.386876467771833911e-03 6.607728323762346138e-03 3.753054073575217125e-03 4.979549368722564068e-02 5.984126217887212468e-02 7.323882274112041013e-02 6.170005911709318391e-02 1.041078424447422837e-02 1.019651428907539757e-02 5.606021511156698660e-03 5.785717579965340973e-02 1.620111602487303570e-02 6.987997328075027346e-03 1.101965154404625086e-02 6.220024697952955192e-03 4.510304944214805871e-03 1.261965145298503139e-03 3.393759079554769988e-03 6.873838805144365238e-02 1.516393244707534699e-02 8.123357808987910836e-03 5.640573919120207315e-03 6.512802916613297244e-03 1.016858903262256308e-02 3.732859585324921348e-02
1.849239894922175692e-02 1.881215552607169716e-02 7.418828399318748434e-02 5.942881033132545177e-02 2.343371717728742060e-02 2.491376869308347536e-03 2.992595786876997392e-03 3.264339785148779108e-03 3.023932142865033614e-03 9.161661682491277492e-02 7.007455207985766044e-02 4.138919630466243033e-02 6.581994649782334575e-03 4.706388717092532814e-02 3.932026922450402445e-02 6.615519233544236988e-02 9.818804283954042991e-03 1.772221642890912854e-03 5.640228141059898739e-03 1.919283830347508213e-02 2.291473512278208169e-02 1.420336095216448782e-02 4.502979962920994512e-03 4.038952732392100953e-02 2.250254807170935095e-02 2.120967908189481249e-02 1.324810264870768597e-02 9.105016262395897175e-03 1.197380909616907463e-02 2.146042796346668211e-02
7.544824110407281903e-02 4.001108481501597022e-03 3.669551073746217095e-03 1.856478165229878338e-02 8.877266666761064740e-03 1.462499891429219073e-02 2.191196700572800582e-02 1.233967510224802389e-02 1.453078632097742212e-02 1.691454893551369229e-02 1.301965898995611007e-02 6.571103804229833784e-03 7.249385476698429198e-02 3.424928758746257490e-02 1.993004959989605127e-02 3.369032591538174970e-02 5.665678197475268289e-03 1.825238469998627117e-03 9.186058516807652646e-03 1.242223448824501635e-02 7.121010369808681607e-03 2.057366928352517398e-03 3.970998668667672510e-02 3.760728652469860767e-02 1.526686178037946033e-02 1.573968702667135830e-02 1.385997746016369436e-02 1.188855836902413289e-02 1.352980487798729342e-02 3.202609754920233281e-02
5.556819155710590423e-03 1.010228820746803327e-02 5.096544982832109695e-03 1.092183163976567437e-02 1.668947580876310038e-02 1.866873214345250373e-02 1.643943880471421953e-02 1.541650536131291757e-02 1.222716416804893978e-02 6.807103136361949622e-03 2.722842105410681543e-03 1.061784284298288375e-02 6.177763726976998049e-02 2.257659194175230810e-02 2.540510365180683253e-02 4.584426788264448632e-02 1.067275172401390901e-02 1.280956600495083454e-02 1.116158292783392056e-02 8.429362014760053562e-03 3.511672151393754274e-03 7.130060319838478489e-02 2.905290162885267730e-02 2.460064702293693686e-02 1.172772336769022615e-02 1.208744477011399789e-02 1.796453202487504133e-02 2.045081775963122905e-02 1.963496105437604819e-02 5.777136929220950262e-02
1.280752033763375188e-02 8.416702169442727074e-03 4.869971546519868272e-03 2.795801666155963566e-02 1.791355551809655985e-02 7.560657409244158668e-03 2.427831488377102734e-02 1.088088283494718055e-02 9.178493144727037020e-03 8.965599009761369975e-03 7.929446485038143047e-03 1.126590132420127698e-02 2.551531006361055023e-02 1.947241628205235997e-02 8.168427639760252046e-02 6.814236396051298605e-02 9.322078569385803398e-03 2.411439583611314427e-02 2.368701633634349643e-02 4.694460688418700643e-03 3.273481722591051191e-02 3.410997715319580986e-02 3.733862296732644998e-02 2.444969336030021825e-02 1.428179543458901919e-02 1.981567947718312211e-02 6.842449622385562980e-02 1.924131576380012877e-03 5.644352518480542404e-03 2.787938341635511769e-03
2.115432054070416276e-02 1.389594538192927102e-02 2.191997781839429005e-02 2.032052248469540245e-02 1.903044701862865312e-02 4.379728127541592138e-03 2.356916902637330724e-02 9.950311674082603849e-03 3.719857546082642238e-03 3.740194732644654824e-02 1.532601095645104092e-02 1.454473712318816309e-02 3.036067030037168865e-02 3.518321351159982291e-02 1.729615513938605534e-02 1.854041704030239338e-02 9.178359566606732189e-02 9.134642768494502518e-02 3.914238495131371065e-02 2.245017024257460123e-02 4.285952416228249601e-02 2.707141279440203330e-02 3.082313165160024959e-02 3.378053177294956105e-02 1.876767250891899635e-02 2.234570488929174537e-02 4.201341618261125385e-03 5.585823131327048371e-03 6.094370198328059700e-03 1.527448617511633234e-03
1.926285167977625709e-02 1.011015354701980985e-02 2.231356051916512720e-02 1.739493191297131203e-02 2.360270148664612641e-02 6.174451835329666100e-02 6.026086305238346347e-02 5.575944458042144530e-02 3.836978979810951040e-02 9.286206643518301121e-03 1.222223524019533519e-01 1.983283266253912103e-01 4.045270976497953308e-01 1.971943343234222323e-01 3.594064194226231218e-02 6.991634801669394106e-02 1.305422735372334109e-01 3.615995603499176647e-02 9.188846901241110032e-03 7.034196436227968530e-02 2.949865397043544002e-02 2.645776413618557837e-02 3.389515579703386572e-02 4.722512582096700939e-02 5.025777935454790041e-02 2.623157850827899720e-02 3.875607863256533281e-02 2.850551899495203448e-02 2.551434133309855509e-02 1.835625969420481840e-02
5.642054313933228017e-03 5.715843458011508893e-02 2.232972294383884712e-02 1.647689433177221968e-02 1.587814014850306987e-02 5.649585869218681777e-03 4.718503765293403235e-02 3.334970078195719639e-02 4.008768031471243026e-02 1.953371055743486837e-02 3.649000026662071322e-02 2.363014455221300048e-01 4.188767293679201420e-01 2.149069174554205930e-01 7.664595939457137519e-02 8.577286553493033983e-02 9.478914006002132908e-02 5.588193034465720882e-02 1.471972826404732183e-02 5.228212987786906400e-03 2.815086462177414720e-02 2.879731059394206177e-02 3.386111662623851604e-02 6.031900809831997057e-02 5.711840659326944403e-02 4.043914336409122623e-02 3.078997207604257727e-02 2.732026104434213953e-02 2.922001941351734869e-02 3.094859800725513824e-02
2.517707438526571931e-02 5.785803957545558596e-02 8.696440769519269212e-03 1.390062935839459987e-02 1.026108414658079802e-02 7.896931674575256854e-02 4.572795329603455972e-02 4.195371560700203450e-02 5.421623957298619262e-02 1.015197479994424216e-02 2.580860031368001871e-03 7.488485291020834100e-02 3.117007960550561840e-01 1.324991215530577637e-01 4.130041614073970413e-02 4.743618283135431907e-02 1.749998617569972423e-02 2.565802095353999709e-02 2.917375367122622062e-02 1.225894259380437210e-02 2.656597783718860073e-02 2.906264871374552791e-02 3.642496511862263614e-02 6.094274625849205318e-02 7.745527269465378450e-02 6.818961940586748538e-02 5.000258400113553880e-02 4.596703408728280288e-02 3.941046128991888831e-02 3.191791420059020973e-02
2.202804668265024440e-02 5.929305974688399428e-02 7.588970047773410665e-03 6.015412696380521840e-02 3.564702645211664106e-02 6.290438762734775272e-03 2.146365952996032861e-02 1.687182586240387749e-02 7.418545831274382663e-02 2.376280170514834603e-02 1.901495614896998127e-03 1.216231376511804976e-02 1.421390682191224220e-01 1.910756397380247440e-01 2.022265258959277112e-01 2.712252049847779234e-01 2.436790534688981491e-01 1.580934498388330833e-01 4.317086482429558503e-01 2.022670013895003227e-01 1.810419427806743073e-02 6.192376956209191992e-03 5.226114893639151847e-03 1.345370264912365901e-02 2.820280349031534933e-02 2.374016445861860600e-02 5.990257868659011609e-02 2.293684691017127547e-02 5.311876848682907382e-02 5.974560140644996631e-02
2.079718994660530521e-02 1.988391156843943852e-02 4.705774620649876699e-02 2.242137568358176097e-02 5.854537508831056218e-03 2.924518278752660100e-02 1.031406922475824883e-02 2.898425167776587721e-02 2.013654253469767536e-02 2.057626922553580304e-03 4.014901972421837037e-03 6.055167449002949592e-02 1.274333584311228840e-01 1.609515412742991147e-01 1.446056767916914509e-01 1.738482791257064397e-01 2.962491364094737567e-01 5.118644056037198187e-01 5.210297712838370954e-01 4.084614036810956250e-01 1.731630846835366042e-02 1.793718707619647995e-02 1.588104224402808740e-02 4.938437522915492539e-02 7.039668920050148881e-02 3.566418229747147506e-01 3.511240313131013258e-01 7.752629472641804631e-02 5.412998303539772599e-02 4.045010806661524655e-02
1.938082077346497609e-02 2.039967963285307939e-02 3.967004704471372573e-02 4.067527025885928765e-02 2.610778428818683744e-02 3.141556116226403017e-02 5.684910365019951381e-03 1.456470022460394989e-02 3.011178496895275045e-02 1.062879411768066600e-02 1.086538917861142040e-02 9.373208540644448541e-03 7.233607906046511660e-02 1.458462642054543790e-01 1.354215338350387154e-01 2.066563713374494071e-01 3.574629478939026495e-01 4.343437855050085727e-01 2.509898216555415673e-01 5.457727085760679525e-02 3.256135953341569161e-02 2.221901784656492851e-01 3.218676172703061611e-01 5.329613354795543767e-01 4.940310190652606459e-01 6.353870534297938466e-01 5.000530208401201548e-01 1.471411902638677660e-01 7.791882233855025597e-02 4.493159081860706450e-02
2.495894516032955146e-02 2.813715405539113715e-02 2.633812794826741535e-02 2.373241003143621020e-02 3.450959838525859830e-02 6.110320938301429250e-02 8.714004019221832653e-02 2.832822087241410602e-01 1.382438623967818525e-01 2.341261278805423576e-02 1.719198099159302551e-02 2.640090232310560864e-02 5.172495230723026666e-02 7.601222013583561199e-02 1.001198839408253549e-01 1.790575448069819942e-01 3.859499887460797751e-01 3.882764560161204304e-01 1.837296489234699348e-01 6.289075626463359880e-02 2.691727382659077628e-01 4.846100771578953914e-01 6.168697601584974821e-01 6.225418689731714306e-01 5.375594961963985341e-01 4.557294358537044010e-01 6.589401909716898764e-01 1.157450103208281650e-01 5.719354260555164528e-03 5.411998867692312948e-02
6.232645454717737621e-02 4.824652978510613616e-02 2.328741854775544587e-02 3.248665267198173889e-02 1.036893013443119724e-02 4.345004421389384031e-02 2.336438234305865946e-01 1.894124089888341023e-01 1.863635015435194109e-01 9.232926511599186259e-02 3.344045507970876824e-02 8.863978337686685693e-03 8.577150498591834885e-03 2.193111504766331182e-02 4.930643311249512106e-02 2.257430203200939678e-01 2.373630883119094981e-01 2.763013145861485942e-01 4.807197531547938163e-02 8.455977652005591816e-02 2.970269616561049264e-01 6.362154092165888120e-01 7.765463335901036102e-01 7.870287371347881589e-01 6.327699379359442711e-01 5.937679392787417187e-01 5.382162117626660969e-01 4.225925313537246542e-01 2.143024364934417378e-02 1.447389264828830360e-02
2.495090138629640908e-02 6.799776332402521217e-02 4.713777771842246958e-03 1.699390868009750810e-02 3.413605605671970328e-02 4.674859249277263373e-02 1.483465032206850720e-01 1.864388456209937761e-01 1.282563905035102592e-01 9.892273891639878636e-02 2.050510324912090815e-02 1.986035940896023130e-03 2.983817657221042065e-03 8.323505282065999170e-03 1.790186694836335551e-02 1.043071684824043721e-01 3.967153617968815354e-02 1.263569047707663665e-02 4.226865878688333689e-03 3.060404204604598791e-02 1.159072847305423343e-01 6.138224316042562023e-01 7.719096388371184947e-01 7.886397497219624908e-01 5.584573736026297031e-01 2.505299174943773077e-01 3.952736583238490309e-01 2.686637354592696370e-01 2.411444762735866568e-02 9.390072724024686734e-03
1.321841704760022725e-02 1.691545244128025982e-02 1.055900859548345241e-02 1.122975659336188266e-02 2.615895848117076594e-02 1.505780053668999419e-02 7.798782116340555182e-02 1.014382278057277542e-01 9.389299248783442020e-02 2.194081263163117496e-02 5.468170481462327100e-03 1.358049932061976706e-03 2.444870816310169663e-03 6.882903483351355579e-03 2.323032668089549183e-02 1.479533241994493431e-02 2.685242824776309239e-02 7.901921483076366354e-03 1.480353450921289248e-02 7.017486676084210007e-02 3.782871113465856583e-01 7.149548155023441875e-01 7.658052138921664920e-01 7.082383016259697905e-01 5.247405164935297073e-01 3.710413846358490142e-01 3.488958123142052448e-01 2.330941718968351228e-01 2.089054534407880012e-02 7.352292349780665225e-03
3.031996512047546027e-02 2.770222241968243321e-02 1.403574153385896833e-02 9.964270674519683929e-03 1.275854022981213511e-02 6.869237272172541708e-03 3.939289202791647349e-02 3.549173842749317465e-02 1.003510656019865332e-02 5.748835164095801933e-03 2.303193545840303332e-03 2.400767741754360456e-03 6.785121874623990801e-02 3.175008078707530768e-02 1.287798196374873114e-03 4.140090468713610375e-03 1.472479867599812281e-02 3.341076457969149871e-02 3.201805913417508226e-02 1.429678789133903560e-01 3.921490939359839611e-01 5.692131677074460105e-01 2.319554023018276512e-01 3.385629902135607328e-01 4.214899121725589892e-01 2.300045191486606577e-01 1.662085795761308327e-01 1.392444554504053966e-01 6.542043390157805359e-03 6.190101998508822437e-03
2.475048191499547995e-02 2.838302301325636504e-02 4.105150116593714836e-03 2.790645528379771378e-03 2.250673066745993191e-03 3.366349973890288109e-03 4.985135635501747493e-03 1.308818608938134946e-03 1.812146276827699158e-03 2.377523863725257078e-02 3.379280524656867735e-02 5.326812385417861728e-02 4.899526462657704390e-02 3.285471982565736117e-03 6.131583414894269460e-03 7.593711487746938882e-02 1.447211419926641984e-01 2.080548029536017640e-01 1.412301648970564760e-01 1.060063605575693180e-01 7.542573046332108622e-02 2.706233671358485721e-02 1.055334877437964780e-02 2.231757591139552771e-02 7.802259378505492504e-02 2.541805270783806595e-02 2.259330154844765154e-02 1.027252605959561547e-02 2.524073720559465855e-02 2.372476361055647978e-02
5.276042175244589211e-02 4.033016709508652209e-02 4.412382090560896739e-03 1.963463088241242799e-03 2.865022301549773488e-03 2.114529780249049373e-03 3.327533219354336918e-03 3.432156181642471299e-02 3.251212714224507166e-02 1.419864127571661937e-02 3.553527256349402891e-02 6.421708014624789851e-02 6.455913802522574019e-02 6.328513155386869191e-03 7.188335430276603100e-03 4.547565148096761184e-02 1.648803048634918111e-01 3.044892867919558599e-01 3.416587688211566998e-01 2.945953823601938359e-01 6.276797430297567648e-02 1.403829125020274182e-02 1.754738078096112000e-02 4.265019687451699487e-02 9.259208451821061836e-02 2.662307986001694396e-02 9.867533703386416333e-03 5.368062212304845413e-03 3.620227348616874424e-02 3.501311001218362917e-02
6.611516171913452145e-02 8.347735719441118016e-03 2.348826204537536252e-03 5.998665096754175752e-02 7.520794939562391868e-02 1.858352746175671128e-03 2.615924610540788006e-03 2.783085784665653012e-02 1.609696546098728434e-02 1.837522036094897324e-02 3.355438459219172581e-02 5.657497002633884997e-02 4.937169151694772995e-02 5.255476085048118098e-03 1.455041265925265288e-02 6.590913264135105087e-02 1.261317009044279069e-01 2.867358321555611989e-01 3.560152591995102145e-01 2.996716545100859275e-01 1.503676664577913991e-01 9.699125508250637170e-03 6.930749228610676334e-03 1.473060883457607412e-02 7.678310724439582624e-02 4.573359199965066485e-02 4.040405241233279571e-02 1.063557451367346321e-02 2.984212862494999702e-02 2.703952915220636868e-02
3.659025610875141915e-02 1.124662676382810755e-02 4.504281080429937620e-03 4.350356784460390411e-03 9.503183440206407900e-03 6.464271536174296534e-03 2.942583167082112386e-03 1.077576948457223682e-01 1.793401544502521002e-03 2.296062278631599320e-03 1.962343173551663739e-02 2.332165280888799999e-02 2.951829301317923995e-02 5.561988591552016747e-02 6.111731523349602825e-03 2.057961472585354695e-02 2.043217414364628323e-02 8.576298787246935951e-02 1.081547691305009412e-01 9.285325662433849270e-02 7.896616238064466109e-02 1.368484605495432285e-02 5.286258060080336468e-02 4.009646155645644333e-03 1.400735588986768386e-02 3.518737413574876682e-02 9.377793477173286540e-02 5.953844674939071796e-02 3.425943839773535476e-02 2.980997794831979908e-02
1.309277429795002723e-02 5.161425495705409747e-03 5.443447261903829049e-03 9.032672076366838471e-03 4.771432099290133337e-03 2.309685449304830010e-03 1.040415206047319574e-01 7.614497547755989804e-02 2.632312213590911384e-03 9.264994839607104682e-03 6.038025274209173759e-02 2.214363021152339350e-02 3.260714742812159672e-02 5.850230650448499936e-02 5.037637529930354130e-03 7.374165749685191763e-03 6.340471550248690663e-03 3.779759765865758989e-03 6.487984785220749992e-03 1.121218586354984399e-02 2.114090202173157101e-02 6.764676542412648499e-03 5.503850597316064380e-02 1.337481590162667607e-02 1.991761946674183714e-02 7.142898709056805413e-03 2.466447720192107423e-02 2.895915082685945191e-02 2.106548737234646348e-02 4.379923959103405179e-02
1.327007162672929654e-02 1.057823243859537694e-02 5.093501636097841345e-03 3.665545228559089711e-03 3.293343399962412373e-03 1.345328598377016575e-03 8.645942504314782506e-02 9.136312408788301032e-02 1.008971889381604647e-01 4.484651117127630600e-03 1.656855126273661712e-03 2.088167903655716376e-03 8.163994849466316150e-02 2.007275248272572411e-03 4.500382395444853766e-03 2.851638525513034220e-03 2.494087498098407872e-03 6.227884747045711600e-02 5.577130956787046401e-02 4.376721774150264116e-02 3.486790941789132819e-02 4.911298064456481871e-02 6.708499141950595435e-02 9.968746979735756616e-03 9.993324187467246197e-03 6.652047503333508895e-03 1.366198437636875242e-02 8.130452352555423909e-03 1.111352274351601159e-02 7.878305503153079647e-02
1.802505421253026291e-02 9.331269918380446018e-03 5.236599564707650201e-03 7.015078607862048135e-03 5.958387900905082191e-03 3.298293495479307641e-03 1.161170142861584625e-02 9.175651595581750530e-03 1.554899506690131036e-03 9.990321042826014186e-02 3.551300916535058555e-02 7.566103277417113304e-02 3.976787864680646385e-03 3.641840704784193167e-03 9.967620333210905001e-03 8.761138821504095564e-03 3.680072833175339862e-03 7.308978106331114749e-03 6.345369471438788711e-02 2.923436465640113363e-02 2.816625649944620724e-02 4.248145257987381157e-02 5.901388175038918549e-02 1.506889011720941203e-02 1.066923403075534585e-02 3.944347859639318887e-02 4.772176660039671031e-02 5.611452181237597259e-02 2.412057130250028908e-02 3.361172392214635540e-02
2.421211162221061780e-02 2.081048977526276517e-02 6.234765521720870250e-03 2.088975879354785375e-02 2.349539244180560288e-02 4.414461946643701701e-02 2.968767678715048333e-02 3.362415464581160109e-03 1.433909045820400130e-03 7.952162736720820579e-02 2.408289499420852506e-02 2.764090739965104071e-02 2.884491557906319545e-02 2.176177082182437997e-03 3.223065009719467203e-03 4.726542697517847891e-02 3.977978225333113349e-02 4.329441640830705013e-02 5.953185436312551093e-02 3.579183916663189469e-02 2.522474102443903951e-02 3.697975414414449158e-02 3.931474142608823441e-02 5.897226022759585046e-02 2.378269037837011865e-02 3.055918551056298338e-02 4.670733240671507552e-02 7.074481664549241156e-02 7.512460008663919553e-02 1.566095938316520997e-02
1.309432771682813614e-02 3.234916052759316540e-02 9.546027026260346660e-03 1.000673122465105952e-02 4.714567120540445050e-02 4.951291250653613862e-02 3.290141881947660635e-02 2.255163037715350507e-03 1.742098278416857144e-03 2.102071729297974503e-03 7.181106420394518797e-02 3.610560852913608648e-02 2.035519411778555915e-02 2.932968889387797817e-02 3.700260549010459844e-03 3.577820930108419756e-02 3.907272657253456349e-03 2.115399112386772210e-02 3.994355516122263805e-02 1.034298976880133891e-02 3.554226628650327541e-02 4.940152548650584424e-02 4.163993255219222006e-02 4.172298147075417796e-02 5.462107759657590378e-02 4.317268899698421120e-02 5.253112282320704374e-02 6.155099910097010241e-02 7.191294072243877011e-02 1.779099984019085964e-02
