9.768361275558122905e-03 1.436532252459043167e-02 1.259118241027938970e-02 1.601574685176315738e-02 1.216569437524155778e-02 2.667251191819586947e-02 2.627340609648139841e-02 7.066699294552389321e-02 1.280634150197481336e-01 5.778549586536967098e-02 2.711427861702150194e-02 6.235011780085075034e-03 3.658760993153640541e-03 1.348877314688223111e-02 1.558193203840497337e-02 3.405953739454214632e-03 1.185425767818311903e-02 2.039584194793354205e-02 1.819373098442722547e-02 6.312767424096421554e-03 5.039070652211877915e-03 6.557563698024881926e-02 5.090125758098680564e-02 2.137232879969871036e-03 3.934831959307131741e-03 2.938598510290898677e-03 1.370872129611844237e-01 1.216788447184374844e-02 1.160588045663338286e-02 1.458037042352187257e-02
7.723477771603068191e-03 1.703195890036340518e-02 3.080472433907310154e-02 2.507903027529798795e-02 1.748828473327030883e-02 7.838623869340842487e-02 3.726724875952743682e-02 4.620989988535079140e-02 3.001076612515640729e-02 2.534012838099002768e-02 1.806239377368646856e-02 3.536875926763012774e-03 4.697627962484666846e-03 1.070282195254316018e-02 1.486699799445910172e-02 9.569788673251396552e-03 1.169376390854534598e-02 3.754013298460512349e-02 2.790264645260859266e-02 8.288195031874896757e-03 2.922702287772380690e-03 6.155752438674751831e-02 1.294473688807019074e-01 1.134419225403199005e-01 9.850853965373589094e-02 1.308597244832864770e-01 4.636803632087505012e-02 1.206920441483607179e-02 1.727586429495454184e-02 1.739483863520457918e-02
9.504035362566190526e-02 9.579830611676200258e-02 2.028268228055053468e-01 1.636205300721210176e-01 3.499547119099194470e-01 3.572397989236453936e-02 6.695314389585329228e-03 7.105172079409451981e-03 1.140551472859769738e-01 3.411092811002643110e-02 9.064121606125205566e-02 5.965207284421641248e-02 2.182832170682242820e-02 3.213557451193796433e-02 6.147163978418486614e-03 2.601632813063313801e-02 1.721938639795019682e-02 3.463664495373020014e-02 1.134954138423958647e-01 1.862608818373945666e-02 1.754510453733885023e-03 5.017016668789603395e-02 7.685251458802729030e-02 2.666291936706629423e-02 1.574786804221958020e-02 1.043197606366627790e-02 9.337024660335029036e-03 7.428571209478646367e-03 1.267416184073917595e-02 1.440641671270016452e-02
4.405012059033331512e-02 1.240449910145798723e-01 2.726436075835110273e-01 2.185077440292738649e-01 9.060967888105901646e-02 1.406827631788659487e-02 1.126197898964119079e-02 7.505224869166174373e-03 4.588035248702850705e-03 4.214662288682044511e-02 2.665501193313360093e-02 5.258432587924654483e-02 2.369950283466330451e-02 1.589815330293553250e-02 4.661169182708840841e-03 3.540740188786290106e-03 7.293763157298202224e-03 1.338969843529549605e-02 9.390402491410938801e-03 7.910358460721717000e-03 3.536544482453468207e-03 1.145732298640625008e-01 3.599125884932416475e-02 6.901034851546325455e-02 1.277315932858160211e-02 9.385686152245107869e-03 8.040809150163015159e-03 7.650070089166036667e-03 1.533645096841859158e-02 1.697300666561642885e-02
2.548993674133195539e-02 7.743088903800091072e-02 2.156033877482141370e-01 8.350387750160236100e-02 4.824867149281528156e-02 7.069329631443535544e-03 1.090765251435406313e-02 6.101797014038951375e-03 1.755835131141642025e-01 9.705743795619309333e-02 1.194347007998811661e-01 1.013041509025179310e-01 1.488655256309205470e-02 1.231047907683984789e-02 5.706915367880972118e-03 1.499813127009945180e-01 2.206497663505299980e-02 1.250141650222145497e-02 1.995793870832305791e-02 1.126969111196089203e-02 7.631232547599603629e-03 2.075616580391624263e-03 4.424185645401764767e-03 1.157690382826996184e-01 2.299149618364230638e-02 1.246928734817782415e-02 8.615807213399096637e-03 1.005891203516712587e-02 1.558820142179342776e-02 5.864175398875707407e-02
2.545689619571965198e-02 2.611688853570751090e-02 1.168642224843183947e-01 9.340747765839083061e-02 3.713402700406579632e-02 4.001706522429150127e-03 4.925673390312071062e-03 5.330029901218288381e-03 5.019273640741217339e-03 1.500753712329255252e-01 1.159767042300803297e-01 6.083886341692414101e-02 6.883848141583151156e-03 1.317858216458720755e-01 1.021100764066446565e-01 1.696925816535155285e-01 1.246048897455081725e-02 3.216858020935342826e-03 1.037493890439895872e-02 3.533088571084581214e-02 4.226806919615895553e-02 2.452422546410919571e-02 5.923948037954058360e-03 6.989074766653284587e-02 3.444667633678652474e-02 3.256476804765259803e-02 2.008208151221370016e-02 1.402790522788722842e-02 1.835494860530667224e-02 3.399550423853555520e-02
2.209073322667431394e-01 5.458712257619863055e-03 5.764602235338498436e-03 2.919614090845233656e-02 1.398556528531555952e-02 2.340240568553407161e-02 3.598934211371968006e-02 2.080580041464562963e-02 2.500240534065006903e-02 2.885479402491430284e-02 2.201129565398574767e-02 9.026217000299350396e-03 2.199864128256079354e-01 8.735953121219937334e-02 4.674101258089169431e-02 8.455442834321415246e-02 7.164625428822343073e-03 3.376230386665195551e-03 1.717630088843211805e-02 2.328025204243636820e-02 1.052007628326399359e-02 2.449674638892357197e-03 8.159204258541287447e-02 6.363867023924429933e-02 2.354381268049774573e-02 2.415631585247469959e-02 2.084064066996453579e-02 1.842691227417726091e-02 2.135005788808196428e-02 5.243944439704450317e-02
7.504747269192408796e-03 1.360838319261707674e-02 7.941936654390632094e-03 1.709239715196464102e-02 2.612097009521214055e-02 2.953118291753642488e-02 2.650865460337233082e-02 2.532044584684479613e-02 2.060357552724301211e-02 1.148853433492761852e-02 4.601051897344891201e-03 1.416110460446644292e-02 1.807538285504011466e-01 6.080578829985795741e-02 6.293360862030941694e-02 1.174981424063599178e-01 1.453996209502589690e-02 2.320302761695426305e-02 2.035914208905456602e-02 1.440695911427251896e-02 3.853264611700132295e-03 1.425877501392648905e-01 4.889073681883746719e-02 3.809587385301226037e-02 1.788531137263634635e-02 1.871673710205749505e-02 2.866127362618368229e-02 3.683474832717453101e-02 3.757254758641013354e-02 1.136136598293168987e-01
1.975272138557695317e-02 1.286609593185650616e-02 7.525922405737786244e-03 4.349768908052982497e-02 2.813877980971753526e-02 1.195017799812852534e-02 3.894201175039097018e-02 1.764603391489794407e-02 1.497249428945227057e-02 1.472328821874502661e-02 1.308631475789600457e-02 1.721226261499143179e-02 3.742448005033954112e-02 2.431304861922610125e-02 2.270958356391385435e-01 2.091942281411947047e-01 1.405392268607071581e-02 4.256964010166395390e-02 4.195922046791566995e-02 6.980919230448172190e-03 8.071250790183197299e-02 6.344718672424767836e-02 6.069753557423225587e-02 3.727929841846144843e-02 2.150934924636994233e-02 3.296288148617260855e-02 1.231753320283064390e-01 2.589311584595256708e-03 8.045482517651081356e-03 4.273070190811571745e-03
3.311318980989273048e-02 2.145716063075357727e-02 3.407849948756085795e-02 3.159965025494928387e-02 2.760776402810036917e-02 5.458546252333180276e-03 2.553616106841229139e-02 1.092632194162831277e-02 4.608576821676976104e-03 1.091786523311016610e-01 2.509925618933876723e-02 2.433834769546109472e-02 5.142629009811865159e-02 5.570872901121396575e-02 2.659290342440966820e-02 2.900904744468594393e-02 1.546911651501603757e-01 1.598837187485269429e-01 6.419378792039644177e-02 2.853179875462587625e-02 1.006850585260854053e-01 4.843027201614993199e-02 5.002544552983946569e-02 5.249917979042531546e-02 2.858061447640784444e-02 3.671290597203957784e-02 3.525050842073162993e-03 6.476998217160427097e-03 8.608258101085735844e-03 2.406323926034919462e-03
2.782812639162782209e-02 1.447335885085535359e-02 3.212774962774087029e-02 2.708775562933475600e-02 3.424181932319934896e-02 1.944136910661673490e-01 1.660619275354769941e-01 1.468734854152559943e-01 9.362780339420043174e-02 1.278109264647183177e-02 1.997822580490960509e-01 3.313084015225828405e-01 6.837259928446326462e-01 3.383344484462347257e-01 6.264529212062194818e-02 1.222765008913326984e-01 2.261376915465674597e-01 6.246636529971229257e-02 1.492797561022394040e-02 2.021868892952099761e-01 6.970663772098822930e-02 4.883734825534987584e-02 5.822459116858194617e-02 7.924230705243523465e-02 8.322347585966462236e-02 4.482530212634772138e-02 7.070840478386483663e-02 5.731787956712447452e-02 5.195237887105563779e-02 3.772322076704018312e-02
5.150549005686327203e-03 1.774544410333224187e-01 2.645207415197523004e-02 2.573559483116538704e-02 1.993129875270441276e-02 4.546952949159470576e-03 1.113699589739296780e-01 7.236534019684125185e-02 9.051485146586019104e-02 2.505438402309815432e-02 6.065902098137667536e-02 3.945254422922522264e-01 7.056796569016412501e-01 3.662524485637570493e-01 1.327469489678040071e-01 1.492468107057549620e-01 1.643813195367314905e-01 9.714228208253780639e-02 2.398228319282171700e-02 6.759218289242195296e-03 6.489615537641041376e-02 5.780506857788195868e-02 6.551355528679987661e-02 1.161269598110551970e-01 1.104170637862559035e-01 7.830318957460857821e-02 5.972129922795224588e-02 5.415102378354894053e-02 5.789130815409990888e-02 6.198635825099344659e-02
5.845377251966603349e-02 1.507558651976821373e-01 6.158465785002334957e-03 1.737994995395191269e-02 1.129166623034385912e-02 2.204492508610270962e-01 1.138369773879470692e-01 9.593672891512695922e-02 1.218660843872873545e-01 1.259594244013902478e-02 4.198933462295392251e-03 1.270387320799275244e-01 5.307798299624142402e-01 2.256375058852629067e-01 7.075128067278910193e-02 8.138959757127406380e-02 3.003567416975751192e-02 4.411995529570870295e-02 5.035086314925540929e-02 1.887979198897231370e-02 7.832671644396124733e-02 7.047189953984976662e-02 8.509135507632287210e-02 1.461401966373302719e-01 1.917422778096895264e-01 1.804590589004592127e-01 1.336651064987640636e-01 1.206548701649764466e-01 9.123270478999881417e-02 7.000839207453021795e-02
4.646851556960115981e-02 1.337275197485361389e-01 4.057104545599093427e-03 1.802755947429697803e-01 1.072179436867574109e-01 6.771545873366741249e-03 2.273482711107691068e-02 1.909629023569200251e-02 1.763925432079310185e-01 5.450729540259616202e-02 3.098995724732780954e-03 2.079380737364159432e-02 2.433977059660636932e-01 3.252225950938492094e-01 3.444110936914347443e-01 4.611643169160819511e-01 4.148260629257894960e-01 2.687627803505823199e-01 7.331969507434175082e-01 3.429690960583115511e-01 2.850016807793770424e-02 8.273351374382956896e-03 6.182499004497468524e-03 1.560142244087244986e-02 3.628584709302126732e-02 3.392329399508014348e-02 9.270140041980190482e-02 2.982067193899862884e-02 1.482428555292041039e-01 1.424750618897104859e-01
4.163360054419916467e-02 4.194252612840199124e-02 1.171541524914867516e-01 1.406730178791210095e-02 5.095328534480773539e-03 7.654958483913607004e-02 1.515711130848281310e-02 4.353432343534420490e-02 2.924855459351245399e-02 3.033077642176488110e-03 6.497434107557759422e-03 1.028596014195791719e-01 2.165473105466625969e-01 2.715837365105392975e-01 2.433192516809524197e-01 2.918681538607025283e-01 4.974773143152492194e-01 8.594698381527962061e-01 8.780042511002050798e-01 6.990551964029939613e-01 3.018267515797239120e-02 3.178427863003916581e-02 2.816170907733481568e-02 8.859080097063946890e-02 1.272565761024286868e-01 6.505364099239839826e-01 6.515234264665079600e-01 1.301662117244813122e-01 1.729527319069065205e-01 1.034431709931109833e-01
3.633571423258397798e-02 3.977923612566418993e-02 9.277060091053249136e-02 1.040230548101124253e-01 6.969272616150343214e-02 7.984368192334723169e-02 8.300921820222491657e-03 2.326136002045622875e-02 4.818696911943667199e-02 1.735664057294181509e-02 1.797608602970227412e-02 1.566316851636405383e-02 1.212250005721059454e-01 2.444758528775284323e-01 2.275855752419906897e-01 3.472985812160556129e-01 5.989268636115377964e-01 7.286887599051947717e-01 4.244852156537646803e-01 9.388538729090570301e-02 5.687513422659579848e-02 3.928794544257916410e-01 5.721959534919692780e-01 9.628117118163681543e-01 9.039117149790687478e-01 1.177126539566842434e+00 9.475425064530829111e-01 2.706368578634312794e-01 2.718988549690803946e-01 1.227344041710501932e-01
4.411547438576608748e-02 5.132534775959089052e-02 5.172904285949188330e-02 5.023516423067440201e-02 7.784889656585368412e-02 1.632086889642093697e-01 1.351680548159219231e-01 4.505651726213278918e-01 2.200049223510422425e-01 3.773782355890641094e-02 2.804223871889278963e-02 4.367921843381508684e-02 8.622813274739216105e-02 1.269686004292705783e-01 1.672527383468395412e-01 2.995323794412722007e-01 6.432402997994256522e-01 6.534607465962856132e-01 3.134769414046222891e-01 1.089915229400404140e-01 4.709759111210962690e-01 8.532771750414346323e-01 1.094813159568561289e+00 1.128320543170714840e+00 9.963110710624080157e-01 8.630052482016152826e-01 1.283996834543432053e+00 2.244991256540118385e-01 7.122529603909555883e-03 1.723844265664703224e-01
1.062189565252639190e-01 8.391966995902372384e-02 4.472584086524106217e-02 7.185894263525455239e-02 1.303734269820981673e-02 6.593901190418706426e-02 3.664028323165547940e-01 2.974202117838806725e-01 2.925959157259939714e-01 1.466518552527563135e-01 5.369738067500692824e-02 1.446301478893799279e-02 1.417513535894112872e-02 3.658455118273612472e-02 8.235287638313501524e-02 3.797888929364224286e-01 3.982451447960591584e-01 4.696741526797603150e-01 8.265669269348552284e-02 1.472879141705740191e-01 5.219884288628975355e-01 1.127610937074037256e+00 1.394160152142848830e+00 1.452123525506012536e+00 1.205032865946659815e+00 1.166376346170831635e+00 1.090392648149056232e+00 8.645080061294379004e-01 3.836622472106897275e-02 2.529526082386200983e-02
4.807409517015564376e-02 1.337912645820343860e-01 3.429045590881371966e-03 2.370407160172285921e-02 5.272362677161006317e-02 7.437238110064289809e-02 2.337849073194911420e-01 2.898680404059948423e-01 1.987438036183389600e-01 1.546288505490203691e-01 3.256140673504007155e-02 3.197361994879673996e-03 4.880126013757252537e-03 1.386092851955135485e-02 3.020738653582285757e-02 1.790824489007989129e-01 6.828207137490849288e-02 2.200209832538864430e-02 7.415206493498397236e-03 5.391702306903213560e-02 2.040193250313946383e-01 1.082234006101784773e+00 1.369389670659175051e+00 1.440532070674306331e+00 1.059052855742507626e+00 4.941782481638579139e-01 8.040687326181007455e-01 5.518986564260466299e-01 4.976658968215035006e-02 1.964581178724384564e-02
1.723983358746098565e-02 2.182719175913233611e-02 1.450115181400264686e-02 1.784773745380878809e-02 4.176384659330648064e-02 2.382400316791059847e-02 1.221760378035918471e-01 1.564669189910792291e-01 1.439445306867517260e-01 3.404458559793375333e-02 8.579369006060823602e-03 1.815787536275846343e-03 3.211355422537952049e-03 9.609654834653513431e-03 3.853611028973047414e-02 2.616648415087627702e-02 4.773384354502903382e-02 1.412433745238993177e-02 2.644384057909860558e-02 1.244892262064576510e-01 6.648020681987234504e-01 1.254330344094251926e+00 1.345978289881093026e+00 1.288284363664520704e+00 9.984744669476233181e-01 7.375488829836389648e-01 7.189248026722520057e-01 4.843923355650117668e-01 4.361194586954653812e-02 1.552470633265331038e-02
4.907899394806777144e-02 4.425701137001186725e-02 2.258613298193978824e-02 1.608477133261485698e-02 2.067678545575396543e-02 1.097906530455428076e-02 6.213589412452493604e-02 5.493683694660496386e-02 1.501131176583461041e-02 8.199584047680940138e-03 2.842008062761923731e-03 2.271514485037887110e-03 1.272843530716855354e-01 6.973197102670114500e-02 2.162356565585976751e-03 7.507896716478348019e-03 2.667085294104721421e-02 6.055819236096580960e-02 5.800193022555827360e-02 2.574083715267775907e-01 6.981744887435842317e-01 1.009633881326155169e+00 4.108167942469234668e-01 6.217587651493901024e-01 8.102604950773901749e-01 4.626885417326359051e-01 3.477035558098530155e-01 2.855774251656859608e-01 1.046762880061566370e-02 9.462124524024983704e-03
3.970252624133245589e-02 4.502952789339284556e-02 6.596402486991399805e-03 4.520025886384349163e-03 3.663696387870729598e-03 5.409498836722499010e-03 7.658114269474223038e-03 1.892685790826891239e-03 2.432238846320530345e-03 4.027547099402932484e-02 5.237629972774751619e-02 7.921534753623590830e-02 8.758252027486809754e-02 3.517588899126894344e-03 1.037415436618323306e-02 1.393540350049615739e-01 2.634263840396664502e-01 3.781662296124943534e-01 2.564247881411325092e-01 1.924957958541788083e-01 1.360681263237852323e-01 4.868227730374083406e-02 1.881476870588781602e-02 4.084792729430143654e-02 1.493553611287881666e-01 5.098708147039866800e-02 4.741476711090976404e-02 1.602503675089388124e-02 9.376414483364305108e-02 7.670941564457230133e-02
8.318496135129070657e-02 6.330273320105048174e-02 6.791878661391363009e-03 2.901258806633211923e-03 4.203934968975951876e-03 3.246861543607319940e-03 4.970956829466547863e-03 5.472002800222007524e-02 4.649852956625837030e-02 2.000754230743295031e-02 4.718612179241507554e-02 8.881081797646533937e-02 1.182739308285870733e-01 7.171778695607146717e-03 1.238054600688568221e-02 8.090657720996435875e-02 2.918088254352846356e-01 5.399401851664462626e-01 6.080809562330371509e-01 5.292574218644936490e-01 1.136030798645115969e-01 2.550943739781223046e-02 3.167932772837645655e-02 7.771955856566481469e-02 1.739691712447099248e-01 5.159266755543630983e-02 1.993460932439625188e-02 7.523153142125683923e-03 1.213996405859410765e-01 1.090275683893178471e-01
1.034367719576332473e-01 1.304911762956941466e-02 3.571469523508748797e-03 1.040724806521532708e-01 1.241802970901339787e-01 2.817090274309778410e-03 3.592714287612569935e-03 4.111392370828136772e-02 2.284752364547269765e-02 2.624891386992083200e-02 4.625057232508225646e-02 7.859599162070519951e-02 8.913687592986274666e-02 5.527737447073635506e-03 2.280664376909433827e-02 1.157205111613354570e-01 2.214830252036000813e-01 5.057860968697713844e-01 6.327964526885558882e-01 5.386886014261533795e-01 2.731830326206945436e-01 1.594160965146639714e-02 1.141154375707452255e-02 2.469062851567793010e-02 1.424120366177698827e-01 8.547803059474630427e-02 7.734878486504255524e-02 1.460090198917339023e-02 1.082341248661323613e-01 8.325589141989531150e-02
5.759824267758920091e-02 1.768115072158935042e-02 6.756705225329862410e-03 6.221230115382589236e-03 1.377825041721270939e-02 9.340674405613509992e-03 3.818504309457204995e-03 1.594580906321643732e-01 2.275690961180906052e-03 2.993500829491454757e-03 2.879999914284246676e-02 3.228681432965824910e-02 5.048314784958907175e-02 1.150825075651547569e-01 8.204536179070968244e-03 3.547943931926846040e-02 3.563547319777309735e-02 1.521121359419781993e-01 1.949207719514631232e-01 1.692870945510741298e-01 1.454735946057416074e-01 1.913780893145057560e-02 1.732048343391900391e-01 5.837844274258232463e-03 2.581498310984141689e-02 6.447362105974006885e-02 1.735886527654639799e-01 9.799291382538115325e-02 1.286595658535324982e-01 9.728625742048399583e-02
2.063993817678352188e-02 8.116405143698582694e-03 8.512974351969682107e-03 1.418943755248075478e-02 7.737469656560051409e-03 3.440267109444811611e-03 1.571701404673442604e-01 1.119155969747440693e-01 3.374746782288237310e-03 1.317511089156105097e-02 9.266910592673030522e-02 3.176956284181974705e-02 5.391640054831145501e-02 1.191339267712331618e-01 6.659088417946209398e-03 1.267944571254127351e-02 8.773551056320553349e-03 4.378653295352774935e-03 6.951221999199829263e-03 1.286163697129097221e-02 2.351373153662615623e-02 5.503562047992335837e-03 1.740113248567578541e-01 1.495471022849738374e-02 3.661211069075951535e-02 1.304163101469154457e-02 4.515897334968166366e-02 5.076036498467366431e-02 1.806812293152967180e-02 1.494631337236370650e-01
2.092688201791099989e-02 1.664746482777498815e-02 7.965647097829615247e-03 5.778329351001264963e-03 5.370370758385283570e-03 1.999905555031106751e-03 1.312819359705989231e-01 1.363132708143229288e-01 1.517773644747393014e-01 5.768818197605243142e-03 1.638103991346110365e-03 1.564080069064601071e-03 1.502963434393871367e-01 2.079035934146738172e-03 6.458860385137599192e-03 4.832276161019493678e-03 3.415927894183591780e-03 1.611587767311419284e-01 1.434076675625498565e-01 1.106311679620716054e-01 8.799556078051355701e-02 1.284797928391576416e-01 2.042874246696664009e-01 8.350320897449962920e-03 1.511801212594146224e-02 7.456963333604692094e-03 1.217266194566799312e-02 8.132394887889358645e-03 8.226543618252670637e-03 2.886527110466688972e-01
2.835260019622198174e-02 1.465382034089231580e-02 8.186530473430115445e-03 1.108139276489584178e-02 9.721512502436774339e-03 5.235328440261694319e-03 1.765288286800110670e-02 1.318848663871445386e-02 1.929802006861349589e-03 1.468787286559196659e-01 5.192794335737066502e-02 1.183047325598522992e-01 3.641229421631454743e-03 4.358731462431824841e-03 1.456307618073370176e-02 1.176280197478578836e-02 3.901316379652403424e-03 4.850654483549453333e-03 1.714192720082490240e-01 7.505351167476069507e-02 6.816200369048333596e-02 1.040324794973034039e-01 1.617600358386433457e-01 8.025093305979964092e-03 8.807743715162279913e-03 1.322621966643849900e-01 1.491954984518970850e-01 1.894311963344059158e-01 1.122814344658085335e-02 1.261953101059137550e-01
3.801003941092478966e-02 3.260773967813029861e-02 9.724135736101620700e-03 3.298789391788291975e-02 3.820864874177842818e-02 7.144353785153985392e-02 4.753989682583713988e-02 5.338437681898854786e-03 1.909045205779799290e-03 1.155678500647960294e-01 3.383629709583518136e-02 4.194855972800175248e-02 5.285452556563738358e-02 2.389781727391245437e-03 3.266742087738479239e-03 1.287534841771719452e-01 1.278476375477607119e-01 1.554696907733764955e-01 2.139832885693973563e-01 1.174712885655574968e-01 6.373981026092299940e-02 8.632699518855174725e-02 9.673888424726306834e-02 1.704521650865835070e-01 8.860258436949501951e-03 9.152027870276183141e-02 1.355410422346861044e-01 2.213578118672616668e-01 2.599181663443392298e-01 1.009064640864324597e-02
2.066828245782619672e-02 5.105112130211189592e-02 1.508362514159615649e-02 1.609977597484119755e-02 7.782639409751940240e-02 8.209601482799760985e-02 5.472820847803107347e-02 3.757283932591280393e-03 2.648112935375559335e-03 2.533774974165050632e-03 1.051475959366219709e-01 5.165953080220701127e-02 3.349563596894401113e-02 6.027622550154030506e-02 3.593006712892173396e-03 8.963332505005398854e-02 4.352758881301714740e-03 2.798159450047771335e-02 5.243394451385799404e-02 7.371309636719790975e-03 9.562405402772108931e-02 1.206667852526176477e-01 1.023542913469337734e-01 1.176673647684032542e-01 1.636188773811862729e-01 1.301515807164543015e-01 1.568915498038974954e-01 1.941860757295473250e-01 2.539099204428167944e-01 1.270995446811650983e-02
