9.716616765532011882e-03 1.446364321230325656e-02 1.254841185502935004e-02 1.576882416727164865e-02 1.194477352063419429e-02 2.621547576369416543e-02 2.617358129118058790e-02 7.131689716670604196e-02 1.300258643552545668e-01 5.763318562328343525e-02 2.618353557519098596e-02 5.863602457918439155e-03 3.416034504092559879e-03 1.290981890974428163e-02 1.517781369147299698e-02 3.359714673378299925e-03 1.208356776587015367e-02 2.176253456925782842e-02 2.025534711347758837e-02 7.279159284480075237e-03 6.136299617834957247e-03 3.103543286199917164e-02 2.434115982704686959e-02 3.054218390760621380e-03 5.503005840403136888e-03 4.515708862914570750e-03 7.272777129271852659e-02 6.592770027565612520e-03 6.308759342350496631e-03 7.942499139394706281e-03
7.859067315106398402e-03 1.769313793109380042e-02 3.167338897692732053e-02 2.587410081815987375e-02 1.797042529830148588e-02 8.036546399780411520e-02 3.827473248600515854e-02 4.878794636098253423e-02 3.204589718054508263e-02 2.704649458550018384e-02 1.871687304248596112e-02 3.588309938319026674e-03 4.715029372028961378e-03 1.080228279320164832e-02 1.512511103898740369e-02 9.674060235079010028e-03 1.218075880198274570e-02 4.094541706598372327e-02 3.170544122748371330e-02 9.712482906528532509e-03 3.645969705871118273e-03 2.947235734294398335e-02 6.341242089609420984e-02 5.574962609590725093e-02 4.928884178713538455e-02 6.862406476682852974e-02 2.544439198438000135e-02 6.694296005251088380e-03 9.542146527437738932e-03 9.539797857939815579e-03
9.724828642445415561e-02 1.009471531574328146e-01 2.135657229353536135e-01 1.740369945011533970e-01 3.681869733145288204e-01 3.742902392479666857e-02 6.950148766062523055e-03 7.524385148720604162e-03 1.220018258829693725e-01 3.690108523166876070e-02 9.743058520033134884e-02 6.369495395080031208e-02 2.309478554139442891e-02 3.350425198185533887e-02 6.371251765797088587e-03 2.642973576610738867e-02 1.802871668513757533e-02 3.782748821383004334e-02 1.289618780936845621e-01 2.181289795876076645e-02 2.269410868041213045e-03 2.440039653966912664e-02 3.920548996568575667e-02 1.389730585726942774e-02 8.455729312103444154e-03 5.731155929301032757e-03 5.267484576186332382e-03 4.143220282813790158e-03 7.062422962907547591e-03 7.908439652526313979e-03
4.618470324359019025e-02 1.360348812522374218e-01 2.988493309862200187e-01 2.417225947706568290e-01 9.812959122065467721e-02 1.502386957346929681e-02 1.172539264001629285e-02 8.033540441294038242e-03 4.916569007193952873e-03 4.589995508360415755e-02 2.879685309360742809e-02 5.632218812003961933e-02 2.519683558217182540e-02 1.657619246163454657e-02 5.094653142073645585e-03 3.853237912127342214e-03 8.179720727829962665e-03 1.458969206073274828e-02 1.052026422381181943e-02 9.113630895186686232e-03 4.363367441108931440e-03 5.042395305539414813e-02 1.743433495091177218e-02 3.499995806219607930e-02 6.916020294595243319e-03 5.092679739655015317e-03 4.470098262807559175e-03 4.229408154887527756e-03 8.563822841821892157e-03 9.277859809260024723e-03
2.710568405709729359e-02 8.707360213214297706e-02 2.433706677182926603e-01 9.426634879758093166e-02 5.317715975378130983e-02 7.631648738720537423e-03 1.144481340884468540e-02 6.396731500171034049e-03 3.724207697514580334e-02 1.024565551860451562e-01 1.266378195351260671e-01 1.058432283744882851e-01 1.682431056320733351e-02 1.549060977745509923e-02 8.104082352950051429e-03 4.338147831739223165e-02 2.673662585896072544e-02 1.330742414597258123e-02 2.170578432217924736e-02 1.268828077117682522e-02 9.151443193213646896e-03 2.590050418239008088e-03 6.448042953726348947e-03 5.589440784899406267e-02 1.249451775969914052e-02 6.794242324397346475e-03 4.790023586206761975e-03 5.514977475270139116e-03 8.589118034719282757e-03 3.144561773943501531e-02
3.002414701504710001e-02 3.227666020082175374e-02 1.342370685978002964e-01 1.075242489147717057e-01 4.227118817445978116e-02 4.450135835349974117e-03 5.261517140848642055e-03 5.579767399900369997e-03 5.120179358646843003e-03 1.552281273878038659e-01 1.200624972472931346e-01 6.692874568494272536e-02 9.405105403371548378e-03 3.526497158358228579e-02 2.948080955723293706e-02 4.967887272242098307e-02 1.571154005113636898e-02 3.365621856462710712e-03 1.105310847204749036e-02 3.890237114490251863e-02 4.801462137722876944e-02 2.977313348008093011e-02 8.651837859176178883e-03 3.336138092671023236e-02 1.868453660924688717e-02 1.772362365268026832e-02 1.113958585182732094e-02 7.637131933994023743e-03 1.002165333713469185e-02 1.791558384385674718e-02
5.754144588019965978e-02 6.892225124820208076e-03 6.713974611167631418e-03 3.407773812586626511e-02 1.634124910962687222e-02 2.656321322614769651e-02 3.879964164116808667e-02 2.129173963834758015e-02 2.448988890639687208e-02 2.857385366833584822e-02 2.204611508676489889e-02 1.022045463211107216e-02 5.444833591417191920e-02 2.572914758106533903e-02 1.498629240132498021e-02 2.538569660570769507e-02 9.009312066584977338e-03 3.460513183337092166e-03 1.793378600714166243e-02 2.503526723177684418e-02 1.347528894023644966e-02 3.706494044176655237e-03 3.313985676204618536e-02 3.146619586797110707e-02 1.274657018334340169e-02 1.311846406619024755e-02 1.152847830595392711e-02 9.875037162737248728e-03 1.122163506365296722e-02 2.649397136603738948e-02
8.770865500396430106e-03 1.652304089621841471e-02 8.931101631778669628e-03 1.938188434013927292e-02 3.004818561844009583e-02 3.335531258023183981e-02 2.866366776066146815e-02 2.620633046222298895e-02 2.021704735826948193e-02 1.132641172894317816e-02 4.559696819134538212e-03 1.630885277396286817e-02 4.637142809606967231e-02 1.704021375904490529e-02 1.927641988598712691e-02 3.498493065969415783e-02 1.759969966838867417e-02 2.419558247153755920e-02 2.153581805421701106e-02 1.614537121257333604e-02 5.849173150547074852e-03 5.800797903530905547e-02 2.386336231743780081e-02 2.024225558739448441e-02 9.627453778385492572e-03 9.904038024548556321e-03 1.470270740246230369e-02 1.682262858172262759e-02 1.621186455148012143e-02 4.781232292418620411e-02
2.071726108935405958e-02 1.395063722732636097e-02 8.240142804117842404e-03 4.836461358181438214e-02 3.167631643124304425e-02 1.331623417084559433e-02 4.169473225953252565e-02 1.824335536925128509e-02 1.483984805771038085e-02 1.465074032300894835e-02 1.309594814243036226e-02 1.820051056827371935e-02 4.105917004654161678e-02 2.999166705578125425e-02 6.259142379262436218e-02 5.272344570903560179e-02 1.621992924641305067e-02 4.556740473433690264e-02 4.533343608780989603e-02 8.441857107099116561e-03 2.603715649980049146e-02 2.735228853124129986e-02 3.021692180193519608e-02 1.980053881427368961e-02 1.152830144586590617e-02 1.597517778827868551e-02 5.515201700842457810e-02 3.812351906092331221e-03 1.138698139133878171e-02 5.741038660368237914e-03
3.336880457508136638e-02 2.219319369768445877e-02 3.578927546478794658e-02 3.421034016166361186e-02 3.189624087077557596e-02 6.910206254648706969e-03 3.439459786278791648e-02 1.419769131129513043e-02 5.356620498230945521e-03 2.685393641531910042e-02 2.529948868013770155e-02 2.464691480406437651e-02 5.251032120205029186e-02 6.022565121837585717e-02 2.970452060871245359e-02 3.273594406131791895e-02 1.691421029645047147e-01 1.723238259011672935e-01 7.199016967233887176e-02 3.758533630915484453e-02 3.363079900680351897e-02 2.139947900537060577e-02 2.458115149425894874e-02 2.694164499393879308e-02 1.490704336801774131e-02 1.770953929203380670e-02 6.790662860103251902e-03 1.017339932727961103e-02 1.198453510509375243e-02 3.134285909054798560e-03
2.880918411024420075e-02 1.529538021203320254e-02 3.454796457458299969e-02 2.871388093599582317e-02 3.875081941096584354e-02 4.659559784470904825e-02 4.442273353724927876e-02 4.013425621593393749e-02 2.696462165930088584e-02 1.411872992498561068e-02 2.032908533181405353e-01 3.404010691629049679e-01 7.105925006227912233e-01 3.550034142192243780e-01 6.614911168956039145e-02 1.319798822106973690e-01 2.476088950465664129e-01 6.851922278821985512e-02 1.689291269041108892e-02 5.490075398082526481e-02 2.313946539811575012e-02 2.086934664827912525e-02 2.692970951491332338e-02 3.747679457412304849e-02 3.968871067441231276e-02 2.063578499149995929e-02 3.045951335366703025e-02 2.279873232458123899e-02 2.074160825995628038e-02 1.516605929335857438e-02
7.095052668815906433e-03 4.061454445801105512e-02 3.167990887665290273e-02 2.683354281235637850e-02 2.423735099785822786e-02 7.475100434789476271e-03 3.438675196644900428e-02 2.389377802881148538e-02 2.825288765611451078e-02 2.931894858616812885e-02 6.210994476469700737e-02 4.124899386548374625e-01 7.485592497261766010e-01 3.926392471890438052e-01 1.428234825807622732e-01 1.633230302646136167e-01 1.810988496205836740e-01 1.066106264579875090e-01 2.721799582276036855e-02 8.858850905982554313e-03 2.247986366625752408e-02 2.308440420064243256e-02 2.726314812023640163e-02 4.843661201900929802e-02 4.559843642679987930e-02 3.210704804573261822e-02 2.438232340798599310e-02 2.209119977365900725e-02 2.412445044682931528e-02 2.608299425243304145e-02
1.765297797850346948e-02 4.062268263555880721e-02 1.039617781721972369e-02 2.040995783272175901e-02 1.468343666093889846e-02 5.765124675524854747e-02 3.303260202637142706e-02 2.998989308815001864e-02 3.838579874414451559e-02 1.520951179084649614e-02 4.377470744463060268e-03 1.323341501098712902e-01 5.644230920451792644e-01 2.453171249973492007e-01 7.798655316902934620e-02 9.136348390481117965e-02 3.381238934843169147e-02 4.959071340095658198e-02 5.636017540941339055e-02 2.255274431443083857e-02 2.162144866339645727e-02 2.369551479415577325e-02 2.977141626511221884e-02 4.960573137320863774e-02 6.260020043993005934e-02 5.472856675067536147e-02 3.997494832463795167e-02 3.761230034865725019e-02 3.305420671474417621e-02 2.743832555043824312e-02
1.529748504827637204e-02 4.118089866437178032e-02 8.421035499253836515e-03 4.278070587368563299e-02 2.563588571798768381e-02 8.854950979568280978e-03 3.015758055929618556e-02 2.440296602029759857e-02 5.271829756316869647e-02 1.722287549684444266e-02 3.257726817696906130e-03 2.179994112967286249e-02 2.611750075123360215e-01 3.582772663765401155e-01 3.863118439073902621e-01 5.272997401489082359e-01 4.758679004071903473e-01 3.097222238151896012e-01 8.477330718230573492e-01 3.953431065860489868e-01 3.415255800440230444e-02 1.098294192364727626e-02 8.959540820319427182e-03 2.278930847634913839e-02 4.907350659745813443e-02 4.262546246368462827e-02 1.104443054048835637e-01 4.080972452155184893e-02 4.522219266859962145e-02 5.232722774945892247e-02
1.484318000540270355e-02 1.422219727449137126e-02 3.373986906108797368e-02 2.716359776073289795e-02 7.810121403229347212e-03 2.104273039306268217e-02 1.646105257612121009e-02 4.719242599233954005e-02 3.254088792783087908e-02 3.383425879448995199e-03 6.957179120238807593e-03 1.099767459156442834e-01 2.373053352015618012e-01 3.046560114640756711e-01 2.777779445481018405e-01 3.386223923457788443e-01 5.800620571380438184e-01 1.006052831993401453e+00 1.026319632834933104e+00 8.044917344825855965e-01 3.418063257204805028e-02 3.556278709238304414e-02 3.184293012150742758e-02 9.889125199502171726e-02 1.404353151530836619e-01 7.094462724797149233e-01 6.996751758764685469e-01 1.512111635592364722e-01 4.637751217538589599e-02 3.550883501092098188e-02
1.424939542947286850e-02 1.507379320385754048e-02 2.912357519201735218e-02 2.968839670562337454e-02 1.893524103866689109e-02 2.266893064020180856e-02 9.160411435717502257e-03 2.469913634533883739e-02 5.149326045081965841e-02 1.857143605472324002e-02 1.943337583918301054e-02 1.730885351117741541e-02 1.366370228518081764e-01 2.782387625504780804e-01 2.606357770461754653e-01 4.014465192330999299e-01 6.984716283306011686e-01 8.518990985196464027e-01 4.931330966103157354e-01 1.072758835210494421e-01 6.430493456826287535e-02 4.420730146132347826e-01 6.470593585156082517e-01 1.071394136614459702e+00 9.924464701839046388e-01 1.279115091587244679e+00 1.011710284594088849e+00 2.964835633710756202e-01 6.689366862297786709e-02 3.918127998626513148e-02
1.896145583181886238e-02 2.151554401193118624e-02 1.979232343858551221e-02 1.756124974271171257e-02 2.512907548388076256e-02 4.423445552109324386e-02 1.465218488746309888e-01 4.877358646099637096e-01 2.398272183023523463e-01 4.150829267942147266e-02 3.121128593678681659e-02 4.951008301667603889e-02 9.896750400085814470e-02 1.461007227802561814e-01 1.933640400238000601e-01 3.476340397238995572e-01 7.527443291302514661e-01 7.588309090633943432e-01 3.595146995134816392e-01 1.233316724570489992e-01 5.320808708177857671e-01 9.670426378253831334e-01 1.242419078645059072e+00 1.255980140177107351e+00 1.087886205513447280e+00 9.284409872584172829e-01 1.357361535204283820e+00 2.377604569223205899e-01 9.979202324121343864e-03 4.693286821620480664e-02
4.849096627120680347e-02 3.783237396797218405e-02 1.783361871648215038e-02 2.436522861812699323e-02 1.624180161876315545e-02 7.356435186086703049e-02 4.061066499788424378e-01 3.332286989241424746e-01 3.301313767226244922e-01 1.665975941176497943e-01 6.167439849593010781e-02 1.687839846448059219e-02 1.661153443332841206e-02 4.243927954116877288e-02 9.555880785098914976e-02 4.382506704670010023e-01 4.620205666431916325e-01 5.381809103269239447e-01 9.386507293464477208e-02 1.657624327755039817e-01 5.873045439044777272e-01 1.268930641837391571e+00 1.560293186155697231e+00 1.588351521030502589e+00 1.287002375945693222e+00 1.226939088973017400e+00 1.131182192730934677e+00 8.852729394291182219e-01 4.223121665258493251e-02 2.811351396437959671e-02
1.921067078804171088e-02 5.265327968146250870e-02 6.501358103655007804e-03 2.945975404372166637e-02 6.155335063310822530e-02 8.547960141106371312e-02 2.697507201528443477e-01 3.378725337990090005e-01 2.318570226580796145e-01 1.815450813359046900e-01 3.831069115099412781e-02 3.795927994685672959e-03 5.776462769902190181e-03 1.613649619601677243e-02 3.482342889423187260e-02 2.033127003135284105e-01 7.770167279907277957e-02 2.482187303834191422e-02 8.347761843704112200e-03 6.070302205863398193e-02 2.299139947801582540e-01 1.216976540511257365e+00 1.527976719004591866e+00 1.574462101575638151e+00 1.132307474530600544e+00 5.190770217993467828e-01 8.365662319132816105e-01 5.667747043974514787e-01 5.074926472737794486e-02 1.967618891895792782e-02
2.223627300403122412e-02 2.889274602583059501e-02 1.868068348743900930e-02 2.150075678910700130e-02 5.069872965729450842e-02 2.899476484162231624e-02 1.479174696417203672e-01 1.897951099286648013e-01 1.735384728844188151e-01 4.103268504188977567e-02 1.035601752687105928e-02 2.430311313784906582e-03 4.352920599574317852e-03 1.243999294505574761e-02 4.472462302241632381e-02 2.899730829493227593e-02 5.300167258483090560e-02 1.569890113562195239e-02 2.966655903818215742e-02 1.412056747510558596e-01 7.538101461133620562e-01 1.409641594459735581e+00 1.493380896592594320e+00 1.399247270678136701e+00 1.061865411429845141e+00 7.703769255263515081e-01 7.416086467716281883e-01 4.941171866401322110e-01 4.418258520887300561e-02 1.549562452411444927e-02
5.608837679736466270e-02 5.209772810557398992e-02 2.717699891912848248e-02 1.989236026652458147e-02 2.627212346005914495e-02 1.400479777264367412e-02 7.829489165913751381e-02 6.892003384599990068e-02 1.884694419752409172e-02 1.058187580729468523e-02 3.999130415624427282e-03 3.813327798512810597e-03 5.150907296089364540e-02 2.436285943292484241e-02 2.501424003033817910e-03 8.232468867196474083e-03 2.960628084028375795e-02 6.786302773035950142e-02 6.571406370202523273e-02 2.933908816916708240e-01 7.882297572466584468e-01 1.119619086831928456e+00 4.465239517680434922e-01 6.627803019150282360e-01 8.500824223829203108e-01 4.782020205257543899e-01 3.546408143467674745e-01 2.928215756791074376e-01 1.243642970771502952e-02 1.155478974635824364e-02
4.538698348451514902e-02 5.292558734158902406e-02 7.992018240703323631e-03 5.683546761102152914e-03 4.804749827188121471e-03 7.118630431709682682e-03 1.006836971004907745e-02 2.513490350455838997e-03 3.291220993706440133e-03 1.767576554129303770e-02 2.524761511226828944e-02 4.003135447100460154e-02 3.716207320802574626e-02 5.426093734259744908e-03 1.194616850465217602e-02 1.515410387772203882e-01 2.933551337739963016e-01 4.273142326999440632e-01 2.937438551789528507e-01 2.195656496156468407e-01 1.514501902752249940e-01 5.266265142668840465e-02 1.994140680161863091e-02 4.301625512189530959e-02 1.552187507527018895e-01 5.213291324509748692e-02 4.742019864427037684e-02 1.914445774985423093e-02 2.192919519831652148e-02 2.062285503726671299e-02
9.476406006589165043e-02 7.369571195852332723e-02 8.329155867177112649e-03 3.829247585165891470e-03 5.880832135417324823e-03 4.427676025334458670e-03 6.720629332407154419e-03 2.622382936631630079e-02 2.435155294602816406e-02 1.067859444811625376e-02 2.683316993732072150e-02 4.873198336682252330e-02 4.932756877968023229e-02 1.068939182364980756e-02 1.417928891672342109e-02 8.962156371733739912e-02 3.307987482488770059e-01 6.204355143450249743e-01 7.058769185884669062e-01 6.040368120239484329e-01 1.237650660767250083e-01 2.667534582548905520e-02 3.229454972011063657e-02 7.971210899498662461e-02 1.771408113509398974e-01 5.211471548739179949e-02 1.960086393497438226e-02 9.253997025048728634e-03 3.023487672519083874e-02 2.931212743386416367e-02
1.172199678285032187e-01 1.508338927878430900e-02 4.389468349605566387e-03 4.694861014610930000e-02 6.127437924963128474e-02 3.936946557128776468e-03 5.172747624701574433e-03 2.155717570442123102e-02 1.222463942112037537e-02 1.400272034454949459e-02 2.565208112426556331e-02 4.340310519384276561e-02 3.799659498108922534e-02 8.657080016443139542e-03 2.746428320573662818e-02 1.279486007043484919e-01 2.499109945734326876e-01 5.785360362622333774e-01 7.313739352591006604e-01 6.110379268727649249e-01 2.935401548047261167e-01 1.740586306530627486e-02 1.203304929786801550e-02 2.593403845556541479e-02 1.422671563166788555e-01 8.616053410960521075e-02 7.699186329748489155e-02 1.766495862141454973e-02 2.398729484069311510e-02 2.182606776020969142e-02
6.411033859044314165e-02 2.008198407235345026e-02 8.339453802944164426e-03 8.436069337226043130e-03 1.985679772709559102e-02 1.350847538173920170e-02 5.730415085652616931e-03 8.466840867906706702e-02 3.336950775117807598e-03 4.313555951777941350e-03 1.520527779629042564e-02 1.809443307163499659e-02 2.288671568748690266e-02 4.292425847048268739e-02 1.082753054130450483e-02 3.941575436662241028e-02 3.999436391476542119e-02 1.714408191138584725e-01 2.206955954840627010e-01 1.880397064466235446e-01 1.525821064595218879e-01 2.271731330084035896e-02 3.977708047009471948e-02 6.529851406436850900e-03 2.518913696749759679e-02 6.371908245721207009e-02 1.707450536587322987e-01 1.030932707273546217e-01 2.649177250389292415e-02 2.319440531166722802e-02
2.289199205069072929e-02 9.202221728967181769e-03 1.030075291234305683e-02 1.833760539537731410e-02 1.053779390184252096e-02 4.900961648292372595e-03 8.375099347524297966e-02 6.000006260317442691e-02 4.948068943101526472e-03 1.822451436086771487e-02 4.698496006775959577e-02 1.724842341739619631e-02 2.533898487929731741e-02 4.517696183814857991e-02 8.863311432773206613e-03 1.405881859252221429e-02 1.120990208138825800e-02 6.357924399625281692e-03 1.078570035083625638e-02 1.888417736628565310e-02 3.391566660887622431e-02 9.661673779741006968e-03 4.171164068998193392e-02 2.015419494536753106e-02 3.584489284172951568e-02 1.279814462052840211e-02 4.413837469066807240e-02 5.113392129062123426e-02 2.920123277559576527e-02 3.358460875051187677e-02
2.320450104119159765e-02 1.886968180693953182e-02 9.645312117241271882e-03 7.443012430977704631e-03 7.274065168540412227e-03 2.841593854446657855e-03 6.957447072925605769e-02 7.199663883128530617e-02 7.823500849405935764e-02 8.419570748833352450e-03 2.799362923649128219e-03 3.228496285628564607e-03 6.349538370629331796e-02 3.330522417925205116e-03 8.259138505499346444e-03 5.460063631818509212e-03 4.444908553947492062e-03 4.912278089375329837e-02 4.475108153583185616e-02 3.524685440309308082e-02 2.769770271035528267e-02 3.850996710345550716e-02 5.194416713393048418e-02 1.435557341508803680e-02 1.722509879330554397e-02 1.004416435804995553e-02 1.904091203268784213e-02 1.205060733468440309e-02 1.522900073321966675e-02 6.060659772052156419e-02
3.153619120902510786e-02 1.666175886515143881e-02 9.923272423392767369e-03 1.424894500682336376e-02 1.316984250912890675e-02 7.196224363158944953e-03 2.435978636155725074e-02 1.839935337285003233e-02 2.872309892247426524e-03 7.749567703840196109e-02 2.761601899250740871e-02 5.900560925769263165e-02 6.466889379408441267e-03 6.384440368190663628e-03 1.848213798838184430e-02 1.531923293174907753e-02 6.036532952095302607e-03 1.069348013602490662e-02 5.093876418967842323e-02 2.361630727776412725e-02 2.259655265278858252e-02 3.385772047525038853e-02 4.672667492464079031e-02 2.032530980007584559e-02 1.572853600161424822e-02 2.983514410780419360e-02 3.570488606453292579e-02 4.243991672821131877e-02 2.954270271836719614e-02 2.590264200290218546e-02
4.262732910136811382e-02 3.739118821140680060e-02 1.187489092471213925e-02 4.257920622375029052e-02 5.205458125914656786e-02 9.777883075172300043e-02 6.418857617904241697e-02 7.105884502342265686e-03 2.743295818613990158e-03 6.180495380752311363e-02 1.873212211151749351e-02 2.155209455776581351e-02 2.243345643379506676e-02 3.693551537064617817e-03 5.218531046985102652e-03 3.599636788092688833e-02 3.088035360151082653e-02 3.425901733367251595e-02 4.790760503142136445e-02 2.902955785552280982e-02 2.045148183197049302e-02 2.999097646482160734e-02 3.188740689485385776e-02 4.691146118741198329e-02 2.949562152399515247e-02 2.322707281190345557e-02 3.497658772145517680e-02 5.350830128187347018e-02 5.738289288929109000e-02 2.113282901037524114e-02
2.392883460657092842e-02 6.020629328912159572e-02 1.869288832326836472e-02 2.079952828556022940e-02 1.050355758368214792e-01 1.111682254302292228e-01 7.320760984755149414e-02 4.974148813994453723e-03 3.639030836134996873e-03 3.893219632582987574e-03 5.663334586889080813e-02 2.821461829872619342e-02 1.584254283062099672e-02 2.276897821315797266e-02 5.905477722334659223e-03 2.754996671347459056e-02 6.513597831925800261e-03 3.830083393442241385e-02 7.251636946619262336e-02 1.539279383556501832e-02 2.878218057764797555e-02 4.002493034862222854e-02 3.375675407969475073e-02 3.335608652188855328e-02 4.295224904648250325e-02 3.336397039764059380e-02 4.016762429329923112e-02 4.748842606269350342e-02 5.598041482176324690e-02 2.456330622281646323e-02
