3.462027509470976816e-01 4.979204626664243127e-01 4.221533699101551740e-01 5.239196976470670286e-01 3.679913850402902198e-01 7.675367489221102124e-01 6.997048967987511414e-01 3.120565765360009888e-02 4.485255516962011885e-02 5.868213896232434695e-02 8.712310427961620363e-01 2.294529450919263192e-01 1.517405976668644851e-01 6.011774672521814633e-01 7.460152635981351921e-01 1.774116708550890764e-01 6.697484582573406398e-01 1.592979884217332262e-02 7.916243824934852957e-03 4.935564244048297189e-01 4.583329763042336413e-01 6.798432465769964350e-02 5.163779666364100296e-02 2.054179554803511887e-01 3.965565945555180605e-01 3.091340110455892409e-01 1.410670160818855989e-01 1.239555333863778634e-02 1.181206844965484309e-02 1.482854803409404919e-02
2.245008282375659525e-01 4.743248899847110622e-01 8.358583094651330647e-01 6.300588609644403038e-01 4.342109205597336485e-01 8.199681558625360189e-02 3.273026252936268865e-02 2.514160110517523264e-02 1.196615959707875848e-02 6.453620952278592560e-01 5.282578191507052434e-01 1.170795672176665053e-01 1.771291401616042482e-01 4.591471916438158440e-01 6.748780566065963882e-01 4.869843835267186893e-01 6.215956272426641505e-01 3.827737806557920258e-02 1.160956185756209166e-02 5.904793356120948689e-01 2.634089731286051728e-01 6.552227443720724798e-02 1.348215523256182935e-01 1.199950215645125690e-01 1.058351243206181597e-01 1.411656994457600178e-01 4.928848602215746971e-02 1.252340165289635675e-02 1.780849300607123195e-02 1.778826243966236467e-02
4.598375006716835106e-02 6.025159763445697703e-02 1.233011403048363402e-01 8.935838991920337648e-02 1.578817401809735066e-01 2.840127066539411757e-02 1.805560844625972994e-01 1.896557619367988390e-01 6.470718828197144501e-02 1.942992653688325674e-02 5.458901223184321749e-02 6.761334920581088537e-02 7.957055455794260768e-01 9.055386099187424931e-02 2.755492694299246370e-01 6.116760610485284799e-02 9.525202599825575156e-01 3.667032710873264351e-02 6.634051190285807087e-02 1.384376506452138569e-02 1.664947240869399936e-01 5.451623860161228241e-02 8.229577312613246820e-02 2.850053397522894078e-02 1.684999593878298840e-02 1.104502738955332256e-02 9.804059586018012279e-03 7.703417414023262452e-03 1.313979047676393577e-02 1.472985816554157543e-02
1.967070205808145109e-02 5.271967752068675017e-02 6.883357830295962210e-02 5.546785195459658091e-02 3.590889716275649790e-02 3.667591935449044382e-01 3.656070226323112626e-01 2.274791691529971238e-01 1.234411518219966364e-01 1.538464698268014741e-02 6.529329396604415248e-01 4.951892775704643673e-02 7.793917159045912202e-01 6.347581954975757279e-01 2.003138751429395792e-01 1.718688873065183920e-01 3.792841625471126132e-01 7.480703331189947347e-01 5.881894206236780720e-01 5.470056787934864939e-01 3.003472203039171951e-01 1.156476504012248774e-01 3.855066145708393316e-02 7.556175041231258382e-02 1.372563019693792859e-02 9.730075608714132407e-03 8.299551084494720746e-03 7.894975578392917151e-03 1.606586706995825550e-02 1.749249808154317368e-02
7.074301053943409245e-01 7.668842874945347443e-02 8.258629447283166725e-02 2.089866145755887167e-02 2.261287475915533043e-02 2.147653951671851524e-01 3.762623476329088890e-01 2.124422453884231010e-01 7.828325700544527810e-02 4.056233261688328012e-02 3.855683788987935429e-02 7.746105038934311682e-02 4.696802657277673876e-01 4.875848188591385135e-01 2.553977605921726735e-01 1.037830036488893576e-01 4.536854834096255146e-02 7.084483814050883677e-01 2.773210705984626920e-02 6.761189720086246968e-01 4.790277133490208339e-01 1.486299766467576722e-01 3.772509435138463596e-01 1.236376995341479934e-01 2.463674066629082532e-02 1.293090462021287065e-02 8.914108340416376092e-03 1.037094401847277712e-02 1.631585006005339955e-02 6.034265297111530979e-02
8.145112873400058850e-01 7.587196018196296077e-01 7.119095298843912401e-02 4.361834056815037941e-02 3.598713195611891180e-02 1.253404534379653767e-01 1.630617963135598536e-01 1.749142544299880919e-01 1.467732408993172866e-01 1.727170906634009351e-01 8.901283296426373837e-02 5.222715478417588181e-02 2.100154032933604364e-01 7.932410655958234413e-02 6.667522480773982463e-02 1.168415684080141848e-01 6.453211864439941658e-01 1.690259887473490874e-01 5.438231594219608001e-01 4.548582227679479062e-02 3.239309104883822399e-02 2.735855552820265144e-02 4.625187766452200089e-01 7.174280826452113236e-02 3.654001270092982478e-02 3.362474861741993060e-02 2.079495976234997656e-02 1.448480972844082282e-02 1.931698904550864515e-02 3.505016988145658041e-02
1.327408915736815465e-01 2.007070821579026165e-01 1.934073760924241714e-01 4.670048666149876487e-02 4.359587047672019988e-01 7.378491462855999439e-01 1.037814591060823993e-01 6.809277340128886413e-01 7.812240449423798472e-01 8.298354409002457466e-01 5.934658000878584305e-01 2.538651731124101918e-01 1.164427766398949682e-01 5.382260299242334900e-02 3.159017576429461183e-02 5.877354936308991362e-02 3.490853307523135163e-01 1.655870469012824531e-01 8.196350952354463093e-01 4.379073400567690122e-02 5.362448370114880625e-01 1.476983326816610487e-01 6.808496265248030477e-02 6.450601448272959282e-02 2.462529347061828341e-02 2.493400087599199899e-02 2.192560673029849555e-02 1.930429808144941764e-02 2.270697896439983349e-02 5.429104373842613684e-02
2.931386658472007190e-01 5.406588723559153653e-01 2.826339267316676507e-01 5.536371193241069744e-01 8.164696210594399872e-01 7.350474496811637559e-02 8.300613722000704797e-01 8.291242025320894049e-01 7.267771691671117695e-01 4.029304841945146598e-01 1.593912220231329668e-01 4.743000300553064097e-01 1.021814950317013193e-01 3.575089944088639254e-02 4.087826766293444630e-02 7.845380269051326072e-02 6.262945355869766750e-01 9.920469118457100333e-01 8.794253032781983448e-01 6.751490900030179265e-01 2.145004822230799912e-01 1.224826238591631006e-01 4.848235670761585903e-02 4.015722943774926307e-02 1.894375819939809677e-02 1.976779519140392516e-02 3.187954615313568635e-02 4.138871043719414416e-02 4.092999720586799894e-02 1.183284466173152583e-01
7.581363310865465444e-01 4.873265026385560916e-01 2.580196360427693958e-01 1.251728794760527119e-01 8.665674626199502129e-01 3.829938717793581748e-01 1.497898936017057203e-01 6.155886181044465388e-01 5.658331746519797978e-01 5.626415913313993489e-01 4.925506442437387333e-01 6.082620546490465907e-01 5.699688394394537144e-02 8.429181659497919643e-01 1.341202837404464332e-01 1.156933967370524230e-01 4.797997607462337610e-01 6.419628529857789034e-02 5.838596582717104494e-02 2.903672016218280527e-01 5.597575664106146237e-02 5.662506033093650526e-02 6.119654327593446186e-02 3.971182238597181779e-02 2.312638040692328867e-02 3.524920649728505162e-02 1.394510628044599576e-01 2.792411688540009651e-01 7.909268385925527500e-01 3.833502703487308705e-01
1.248288841261379734e+00 7.894372635304519603e-01 2.171889633201233294e-01 1.358103703288121578e-01 8.647811972629249055e-01 1.766709494089397925e-01 8.874844931776533219e-01 3.988092992098944412e-01 1.877912687328757158e-01 6.674968445972839781e-02 8.970633950323774197e-01 7.557133106616741314e-01 4.461314065304558540e-02 3.836033136014781186e-02 8.455196413563527136e-01 8.567530411700299275e-01 7.178064114515284033e-02 6.442766658518556122e-02 2.951975661446293656e-02 1.933857244244812160e-02 6.926837091075672970e-02 4.360952535478367781e-02 4.991163701054834867e-02 5.468954238268733392e-02 3.046667254795971599e-02 3.899611661622440911e-02 3.762755534633717147e-01 6.372731988810034220e-01 7.783031703152389902e-01 2.003252930968784096e-01
1.062924318396374801e+00 5.353236943762869071e-01 1.132470077749312631e+00 9.293737660955270208e-01 1.785259316419492148e-01 1.127645054267202018e-01 1.028018523416912855e-01 9.385170252809948988e-02 6.186330676227265457e-02 4.809669179598944355e-01 1.116350883716521469e-01 1.404890150148263017e-01 2.030684522556971405e-01 1.155354152088450964e-01 2.728332423318657884e-02 5.243955142414198634e-02 7.769125572236121324e-02 2.945335469926524397e-02 4.738044020414783342e-01 1.150148522371349513e-01 4.730281784187068822e-02 4.214649079131805448e-02 5.439111441326925644e-02 7.608374130668593693e-02 8.131646938126121937e-02 4.431860491839622468e-02 7.151844115839908755e-02 5.641882400091239452e-02 5.001793132357499477e-02 3.543626620829481988e-02
2.064085183962202641e-01 1.182968219457471160e-01 1.011119066899173191e+00 9.642289246272834902e-01 7.559883111229148689e-01 1.764610937593047435e-01 7.596056753401526918e-02 5.156501363216818568e-02 6.211423838301780714e-02 2.187197899683835864e-02 3.580565573743399455e-02 1.055427243417738220e-01 1.811647610723227109e-01 9.392218792898565649e-02 3.388535895826543659e-02 4.257382463940581618e-02 4.677331137146120699e-02 4.903212280495697351e-02 7.900306873891005388e-01 2.613155460910379091e-01 4.514122559479102209e-02 4.571433148353554882e-02 5.403792713154552396e-02 9.675980931957436915e-02 9.211665973868893298e-02 6.582857190942392744e-02 5.077911814528737744e-02 4.623335544024307492e-02 5.030591230420033977e-02 5.429283323631241276e-02
4.262209483052098458e-02 1.069963742048166272e-01 2.521453708888649059e-01 7.006828757458769541e-01 4.600481093912516251e-01 1.498998171146067593e-01 8.000245993841308134e-02 6.969795455071320367e-02 8.679235722226369409e-02 5.668917837432253526e-01 1.593986169833200295e-01 3.980282230461612558e-02 1.485942620367219913e-01 5.741022355191004872e-02 1.797146769923345377e-02 2.298285176221324944e-02 7.794268664952774817e-01 1.900816560363103452e-02 2.875729647939517797e-02 5.496969738678773032e-01 4.323340697443424363e-02 4.724269334612844068e-02 5.954143849462180393e-02 9.906679159365988641e-02 1.264670228217935344e-01 1.111675646673208062e-01 8.308148196429897270e-02 7.768444430817827984e-02 6.793173967356548604e-02 5.612545790246584870e-02
3.554441591326457095e-02 1.013721258192870622e-01 1.799287974511634691e-01 1.294277244704027385e-01 7.665690961680673987e-02 3.037089874676787149e-01 1.032496704118365471e+00 9.054602280019483640e-01 1.205510985543903069e-01 3.780515450205142181e-02 1.356942779512105013e-01 7.351622960407644403e-01 6.815815096124734629e-02 8.204405759478380911e-02 8.660793445334233343e-02 1.284800740461722046e-01 1.155358328003333046e-01 7.500275276483309161e-02 2.106121578789894588e-01 1.305330066434000624e-01 7.771105700218972068e-01 2.831544471867274426e-01 2.113458041814725297e-01 5.019468535147852961e-01 2.478255344211967998e-02 8.718639849562993538e-01 4.549061883874219031e-02 8.810378358455528414e-01 9.186066677643599243e-02 1.057020914633915315e-01
3.267050039057321775e-02 3.278647201416154400e-02 8.910564711193996734e-02 6.657705406212117705e-01 2.431173191898246544e-01 5.597017779775302626e-02 6.882848117721259706e-01 1.040080336723323284e-01 3.221606404158919301e-02 1.425512023745731660e-01 2.976258641644670133e-01 5.581245471962743843e-02 6.869726491922101275e-02 6.767498241950371807e-02 6.080879780733430134e-02 7.301777833134030782e-02 1.256230026497256735e-01 2.193004139431966037e-01 2.257907856373208566e-01 2.367015191538661412e-01 7.525241496979306888e-01 8.434601083615995698e-01 7.002412035661642609e-01 4.329068704655837652e-02 5.224101944360945438e-02 1.959568974154988763e-01 2.409875771983276960e-01 5.405573431747071750e-02 9.425567104663855333e-02 7.177427582775749992e-02
2.949512504423451240e-02 3.210043782971176707e-02 7.244678044906009695e-02 8.056127534038093341e-02 5.420788880895478778e-02 5.731443752186429763e-02 3.184260203108623122e-01 8.503669349259987964e-01 2.013275141555270764e-02 7.224588402230518458e-01 7.888661568202168795e-01 6.303508204720831287e-01 3.455686306092421722e-02 5.989039676806279244e-02 5.596510490319581144e-02 8.583168567917524860e-02 1.503877747681184318e-01 1.852867509396171064e-01 1.086888992387930603e-01 2.715904737216405518e-02 1.990840293693684968e-02 1.481011587180077749e-01 1.957525056400466201e-01 2.766218062033400926e-01 2.378640491256363565e-01 3.120322596604245824e-01 2.503716814824179515e-01 8.383390135485505046e-02 1.367094748070512011e-01 8.018044718678790650e-02
3.723669708206713003e-02 4.292094570997957020e-02 4.206062823006484486e-02 3.975315152642792949e-02 5.740246842608227179e-02 9.591434912247072397e-02 4.833978368555123806e-02 1.418742129253322826e-01 7.947749351920627148e-02 1.653492133574182080e-02 1.696294781006512514e-02 2.652194310994469145e-02 3.957937572007054483e-02 4.031834239328137282e-02 4.060258270376079087e-02 7.349032174191519329e-02 1.610496340400368875e-01 1.651719049380397930e-01 7.960507305117400789e-02 2.778196198731739536e-02 1.215310134018746241e-01 2.232381804973694317e-01 2.897774435389499637e-01 2.998243396485651968e-01 2.653857600748494860e-01 2.301278799665938957e-01 3.412839272130751000e-01 7.925157567899404620e-02 1.890105895081330700e-01 1.022304286563889553e-01
9.199470495861117314e-02 7.209231961820913859e-02 3.528410957903040102e-02 4.974233801098536939e-02 5.913189528562512454e-01 2.539578383922889981e-02 9.211643358656775027e-02 7.275394826335390697e-02 7.114676555927378077e-02 3.519494864114733335e-02 2.030709370157144852e-02 7.182530676299301309e-01 6.963671739212665690e-01 2.084639631657970657e-02 2.948444992246499960e-02 9.196816816575523190e-02 1.122346931336065390e-01 1.395331582377153934e-01 2.468734984174862646e-02 3.946063491775006482e-02 1.352257952074334968e-01 2.971524899677781550e-01 3.721133668536661943e-01 3.882928193343234136e-01 3.211900579431892222e-01 3.106598511556357134e-01 2.899743004543401947e-01 2.926296063387144319e-01 9.618773080944829079e-01 7.932826062029216807e-01
3.702951862854535203e-02 1.024366750889413868e-01 1.768417290922389973e-01 1.682421972628223364e-02 1.963276232013766096e-02 2.490033300924036214e-02 5.529444843620290317e-02 6.882063216984918297e-02 4.691311103585042719e-02 4.555954290901895881e-02 1.676095420663940849e-02 1.925265120266261287e-01 2.984527528938657470e-01 7.056575530019838505e-01 1.678445001186133073e-02 4.332272820053059692e-02 2.438753335619705392e-02 6.898493775641005854e-01 2.180029780397755301e-01 1.832774759825810118e-02 5.282622142674898297e-02 2.852684156224863932e-01 3.660186318586139409e-01 3.861370636074406004e-01 2.833730486148918759e-01 1.321641787918419186e-01 2.154011018404383693e-01 2.249760905567018410e-01 8.456703190373675294e-02 5.800171102502350573e-01
7.778763619939156326e-01 2.000470736658375992e-02 7.014363634049236573e-01 9.089792886811269568e-03 1.238115502773681244e-02 6.924976057307542614e-03 3.502404141584422592e-02 3.580620498548447994e-02 4.158840726398278786e-02 1.514924893288208813e-02 5.105573870480407672e-01 1.307603684996479498e-01 2.302381454644100989e-01 5.633279390044628743e-01 2.578653028202041592e-02 7.369212985909068779e-03 1.900522947021949377e-02 5.360497294219440656e-01 8.696205331854192089e-01 4.242382734578398901e-02 1.721801835762025168e-01 3.299917869585266561e-01 3.587011485176777037e-01 3.442928891998776608e-01 2.670448128476256011e-01 1.973595304949284923e-01 1.926946085499267880e-01 1.860871079796444227e-01 1.022003911775438700e+00 4.460840011863762555e-01
2.426610963540156221e-02 3.196513777748387353e-02 1.289142428786837873e-02 1.120845295154705018e-02 1.252248805438456632e-02 6.774124337393704343e-01 2.991272561452635453e-02 2.006047079041288483e-02 5.668162170393020033e-03 5.565391756722787298e-01 2.243930804851116401e-01 1.978486218220505688e-01 1.118422486348812223e-01 5.248577851857950949e-02 1.129262457899210537e-01 3.278465466882070078e-01 9.316987721414773937e-03 2.524935114989150520e-02 2.361455321282944844e-02 8.422856732543713976e-02 1.793382641794508403e-01 2.790303648835087968e-01 1.145689641118571023e-01 1.739902852564276237e-01 2.151555728666649236e-01 1.586201047633061800e-01 1.386442867842016258e-01 1.560595205111518780e-01 2.505996782614026697e-01 2.726288800277227309e-01
9.479332234988908576e-03 1.753517086423542204e-02 3.541641137287382390e-01 3.031395948464740142e-01 2.839664041508104253e-01 4.157844255469033135e-01 5.838635516534769199e-01 1.459294543588733895e-01 2.031882439473411406e-01 3.519840157555309546e-02 5.205005394808766284e-02 8.203681522351878586e-02 7.902315782144565814e-02 2.531977143310210066e-01 5.693116987701629661e-01 6.130941808966910989e-02 6.899883256380603958e-02 9.232644874229820053e-02 6.341344283270509974e-02 4.811834337199977218e-02 4.546855431343223286e-02 3.122059888344445866e-02 4.719017082195686719e-01 2.204968326427002301e-02 3.976156966346510585e-02 2.392047047465923823e-02 9.906254717364944007e-01 3.620554590630247760e-01 4.661732037499111136e-02 4.351610014703650997e-02
2.519631684660348162e-02 3.267602054732753059e-02 4.048245093168730824e-01 2.356330145756619365e-01 3.946051992128603025e-01 3.110068292775766130e-01 4.885059523238365897e-01 5.393915847794969465e-02 4.787469644210209929e-02 2.070144157010165090e-02 5.124272491002447583e-02 9.472517135655092457e-02 1.042409024614233959e-01 4.919214208018252155e-01 6.465795401839494749e-01 3.168168120306451285e-02 7.073280209163131105e-02 1.321473560079666210e-01 1.501272439850142304e-01 1.315534914414950018e-01 4.504681942677631057e-02 7.792389480272789992e-01 9.194907188891664473e-01 6.475060445531224951e-02 6.984703596451451169e-02 2.398991792178825286e-02 4.185259130506084890e-01 1.715284003934255119e-01 6.385831949376816197e-02 6.139681333852745060e-02
3.169441182789592415e-02 6.553341653221540497e-01 2.302110302815348619e-01 1.006226281939329864e-01 1.298751065857082498e-01 2.960578497380517704e-01 3.879914631726120167e-01 4.395331653262722627e-02 2.360578039520392149e-02 2.687974838388836746e-02 4.880178209726236671e-02 8.343801382169309389e-02 7.843520169423813526e-02 3.818003080917098391e-01 2.411861101305396576e-02 4.909112331460484258e-02 5.315990840277870499e-02 1.222825977697624411e-01 1.543204995150968817e-01 1.326782642883885810e-01 1.339712712150707419e-01 4.872241948250211618e-01 3.348514425283194429e-01 6.009331228605152564e-01 1.208824405000631513e-01 5.884946448261647173e-02 4.363625748142586913e-02 2.934612712768405740e-01 5.155054287178911093e-02 4.677846317988376690e-02
2.254384048150682301e-02 1.318961674963363764e-02 5.148359168029321697e-01 5.633969257247055662e-01 1.364131915896556579e+00 9.554778408097408526e-01 3.984594315779618756e-01 1.644165558359833301e-01 2.501043460284960718e-01 3.188810561278168088e-01 2.977748695252262212e-02 3.477258498553969374e-02 4.654664256871388767e-02 9.289224152554206859e-02 4.887046667697704239e-01 5.335332700208210432e-02 3.125954948251045279e-02 6.275796682870801724e-02 6.819847583765474563e-02 8.110484331360247323e-02 1.038287378158351537e-01 6.066438429401206367e-01 9.790626454001054302e-02 1.703252928094773910e-01 6.944966952657312120e-01 1.519564560989389024e-01 9.574599555885859870e-02 8.877821115542311459e-02 6.036974301936266774e-02 5.312032724751074297e-02
6.644263435885026936e-03 5.026829510921499988e-01 6.635807884939417534e-01 1.304092431496171267e+00 7.662127652368246888e-01 3.495721734838768135e-01 1.609109437135778919e-01 1.142409641091213374e-01 3.729913161663195864e-01 1.413032930024070488e+00 9.834880208213192532e-02 3.651883430077031145e-02 5.628921030732474823e-02 1.092377648412998226e-01 4.719245657650034120e-01 7.933743752767444812e-01 4.681593774193885671e-01 2.029863527984329119e-01 2.870513810274356037e-01 4.879836368917260803e-01 8.561818283793052320e-01 2.022615082995431190e-01 1.056341038343810712e-01 5.112323904233282423e-01 1.168567872470858582e+00 3.615025649998528379e-01 8.522017960165954864e-02 1.266982845839352556e-01 4.940378507262734309e-01 8.490281507704823538e-02
9.707295649461971515e-03 1.440289227191139665e-02 6.514281128744382476e-01 5.275512998768285833e-01 5.233365966863718910e-01 1.953149272130129677e-01 1.299149878013793891e-01 1.361632999737721339e-01 1.580953544960023160e-01 6.184967868357917897e-01 1.828589314420545064e-01 1.901623860717322201e-01 1.604222566217435586e-01 1.815600806932605449e-01 4.932556201570594823e-01 3.291704056066798723e-01 2.077358500959694265e-01 1.158408384899508592e-01 9.763347259371464582e-02 7.296072223803201640e-02 5.855408032171774413e-02 8.595502410908431590e-02 1.327906250565406565e-01 3.180443120422345449e-01 5.438502334719099718e-01 2.443352798331995257e-01 3.583694535215444232e-01 2.480694340675247966e-01 2.584029246296754012e-01 1.719853761346293308e-01
1.036094503609593515e-02 9.973964045441530146e-01 6.345108944901053372e-01 9.532614089795704571e-01 8.539368697087663662e-01 4.674253599973122730e-01 7.885151519879285420e-03 1.323046868036889645e+00 2.099630107098916509e-01 1.500586619369078112e-01 5.738704409834564923e-02 1.424159867704181126e-01 3.779295138810556121e-01 3.841241753675989634e-01 1.126823238225146628e+00 8.053667425183075324e-01 2.332868262219002509e-01 2.506216443134020033e-01 1.102894426997760996e-01 4.833343018324030155e-02 4.706826808030487724e-02 7.385338952082792785e-02 1.130198602036966565e-01 3.457144655767310226e-01 3.490008852373414072e-01 8.206170055471505298e-02 9.031184586118128077e-02 1.167293459373230369e-01 3.834355809144850413e-01 7.916034256953122239e-02
1.385381868513742634e-02 2.049278920677272825e-02 7.268791263814994297e-01 2.368532314391240054e-02 1.569504979252469776e-02 2.129515384561756972e-02 1.836490735224110757e-02 5.237699881004157509e-01 2.080773357350301223e-01 1.190177341729890120e-01 3.661706866594054838e-02 5.030341940027352465e-02 5.693115651701248503e-02 2.107285055880472879e-01 2.522585071014407099e-01 1.052274115805042626e-01 8.084592023815687090e-02 7.962157801603189644e-02 1.047285116863713450e-01 6.007376792237875684e-02 4.268713643459878110e-02 6.373143319251395322e-02 7.281188374014954667e-02 1.218030097020051661e-01 3.795449332671586018e-01 5.958274142608057516e-02 8.626103584627725640e-02 1.422719084704673065e-01 1.732082412984191910e-01 3.469532807897609539e-01
4.829229096406019439e-03 2.177832324817180129e-02 1.118436531920683707e+00 7.411463685245059559e-03 1.691142816818769906e-02 1.766022073156309560e-02 1.451561533300003981e-02 3.591867984863569840e-01 2.774480795114603882e-01 2.597131122567284400e-01 1.073350626780016914e-01 5.576145381911160048e-02 3.606075686888150778e-02 5.761874453922413708e-02 2.635951217574614702e-01 6.801332426685299803e-02 1.752933101020129891e-01 2.485454985689838914e-02 4.247531106551571956e-02 2.301678335536851694e-01 5.957461842767820814e-02 8.350832059791601925e-02 7.284600021478518372e-02 8.042387822626523297e-02 1.069057567549559773e-01 8.191699796157571323e-02 9.640798335106069705e-02 1.191008892683917963e-01 1.611035592004532724e-01 3.973984717102184150e-01
