3.488219468287883651e-01 4.949356512362439453e-01 4.020102667014693321e-01 6.439970689466782867e-03 3.428812336531709692e-01 4.798181723869451680e-03 2.246989223110561727e-03 6.026677444254875324e-03 1.086207040054999913e-02 4.913893222518238117e-03 6.765393149192448947e-03 2.107683467196166671e-01 1.344720999226189651e-01 5.440299292970044928e-03 5.639974990398605864e-03 1.442690032540398792e-01 3.355664583676980402e-03 1.531564518172937950e-03 3.120824904075227783e-03 4.784954636825585195e-01 4.442293677543168728e-01 6.735357956505103050e-02 5.151238063452692750e-02 2.050199006578218019e-01 3.957537857661254654e-01 3.086933820691598052e-01 1.410365151645769644e-01 1.234463542651087833e-02 1.171924231738594516e-02 1.464761950554925585e-02
2.264251208672356241e-01 1.731114584951146118e-02 1.748005239233990302e-02 8.217497802442521107e-03 2.887139539983301501e-03 1.631076216110337665e-02 6.269286791679202879e-03 7.598924277069844455e-03 3.649514935573877888e-03 2.178916186304192051e-03 4.255593836492866516e-03 1.073584602449571268e-01 1.572493669539024863e-01 3.764237751573480395e-01 6.197906421409898718e-03 3.958651119411763508e-01 3.122564870185112317e-03 2.804773060462682592e-03 4.501632466686052853e-03 3.548837885099543135e-03 2.542202873011404907e-01 6.441688888925438394e-02 1.335872855423836936e-01 1.190757699026642608e-01 1.051006163338626676e-01 1.404798942537442419e-01 4.917854297216862208e-02 1.244794767606806352e-02 1.764604127111902773e-02 1.756145226480631746e-02
1.406039517241007217e-02 1.339177106609570379e-02 1.729506723018702993e-02 1.402114002741047805e-02 4.410706212754798849e-02 1.434793796398485186e-02 1.848503984798919308e-01 1.936726816906902959e-01 2.623937437572998466e-02 3.559167327944769230e-03 9.250536599156068684e-03 8.598300200348484024e-03 5.709636039824743901e-03 1.268355786293983573e-02 2.440043073835673204e-01 1.258799132994325824e-02 5.777754059080259311e-03 5.163693360976413273e-03 7.876922986378013733e-03 4.510636065922501124e-03 1.560102297491460788e-01 5.278854124805957421e-02 8.066436191066855832e-02 2.802334924839927979e-02 1.659005913171851532e-02 1.090845935953302370e-02 9.731925013143079284e-03 7.629505717649723469e-03 1.299234877376362340e-02 1.452559031270108519e-02
3.777994441629891308e-03 1.050858852391082024e-02 2.304381040720850787e-02 1.861997763632174119e-02 1.636242615478858062e-02 3.754983279294332177e-01 3.733868115673933952e-01 2.315797046150977201e-01 1.251454760995443227e-01 4.944593916547599700e-03 2.272226056107331908e-03 4.520031458508732593e-03 8.159097443317012144e-03 1.192587379913326653e-02 1.883771788508411260e-01 1.629951739154971990e-01 3.480855926048269655e-01 1.927965141666651300e-03 6.694043917172715378e-04 1.312197197348653884e-03 2.730893236808755176e-01 1.090316543635843349e-01 3.760427171953512754e-02 7.417135181308634473e-02 1.353975543781837931e-02 9.640092105533109440e-03 8.268303264971845964e-03 7.841309623171701174e-03 1.592524259721088756e-02 1.727168781286772190e-02
2.151518544851889567e-03 6.468474510640712105e-03 1.802564941208794833e-02 6.997707806773048253e-03 1.069447724715892785e-02 2.189436151605677061e-01 3.817941528275792251e-01 2.146167061758402772e-01 7.868387739212484577e-02 1.336381427139184987e-02 1.027026200922001586e-02 1.430621386615357239e-02 7.218786604483828050e-03 4.611821894674571487e-01 2.437700004137613452e-01 9.782938589619906422e-02 9.032168503262027678e-03 2.322794791579806464e-03 2.395589842317845733e-03 1.430297792582768159e-03 1.541134667007285552e-03 1.424214788000017218e-01 3.672192251587422240e-01 1.214020324656888833e-01 2.443127577860166807e-02 1.291673353843644616e-02 8.967609360901252977e-03 1.037337781370880826e-02 1.624666914394345962e-02 5.969709305969685825e-02
5.854557602148510558e-03 6.294728141466492469e-03 1.852606465212677800e-02 1.031999287188177170e-02 6.833749005013831437e-03 1.228181671960104360e-01 1.567208500776081093e-01 1.667634005511708095e-01 1.348607836591212694e-01 1.767292967645754317e-02 1.655185758193091633e-02 1.616916704144863784e-02 2.075750464966428233e-01 7.808051135189165992e-02 6.568672255585965292e-02 1.106738291212369524e-01 6.964686234940223840e-03 1.461556971934275251e-01 1.697956873279223922e-03 2.621465883622424269e-03 5.737455960861111842e-03 1.179367640632137185e-02 4.497509131259950776e-01 7.048960549415593524e-02 3.640671702070388122e-02 3.384805875807714304e-02 2.112745758739818791e-02 1.458912705436822208e-02 1.930708378148093471e-02 3.471606461924035825e-02
1.195006562916320902e-01 1.807275124749981865e-01 1.770558423394021086e-01 6.391191463538704876e-03 1.659750898079151611e-03 4.716489960155865330e-03 1.039240610161635235e-02 5.714607329075100522e-03 7.740052235154437459e-03 8.264790777203932445e-03 1.106321540379174954e-02 2.503213805708255912e-01 1.165558155503166882e-01 5.406999087179964469e-02 3.155057913296903382e-02 5.453993622779432227e-02 3.081602514082874000e-01 1.377729820802951477e-01 2.639672575562864755e-03 3.852294759876231413e-03 3.457622705214533944e-03 1.409494460247702474e-01 6.597880492552810061e-02 6.343918508331260198e-02 2.463048451670659875e-02 2.525017945181234208e-02 2.226032318837952925e-02 1.926926423298776919e-02 2.214130840094883507e-02 5.264684394582710980e-02
2.472582016079880596e-01 4.586916146747663792e-01 2.531222683718347688e-01 5.142425609880366642e-03 3.873658418632928112e-03 4.329186457281244613e-03 3.867904866728754873e-03 2.144567939939758406e-03 9.265018533803398917e-03 3.494617183403182503e-01 1.483853121461025659e-01 4.567078062235953029e-01 9.869222986680735443e-02 3.510978318166997625e-02 3.976556960277108366e-02 7.400006308176632075e-02 6.806581591256687623e-03 7.326808629588728999e-03 3.479421331451200590e-03 3.666647592591732070e-03 1.985578311100912319e-01 1.165111735064378318e-01 4.694033050132691981e-02 3.942217332333579349e-02 1.885893167797070974e-02 1.976618872536558755e-02 3.111475963396764799e-02 3.483711423661191992e-02 3.486036040443366707e-02 1.002352369481270267e-01
1.801867955705102262e-02 3.753875645254619031e-01 2.171497476815573702e-01 1.137080843583272889e-02 5.282983780218123392e-03 3.195797844543478150e-01 1.246177784532503247e-02 5.577963255963448372e-03 1.109764033167132645e-02 4.980682972090393901e-01 4.614679074316354601e-01 1.180878272324269000e-02 1.471893363633839345e-02 5.991669981295234121e-03 1.271355194126659871e-01 1.074445274639396208e-01 4.307986417073224605e-01 5.188494513362763849e-03 5.338549114583775353e-03 2.651954950929237276e-01 5.270691237940675761e-02 5.480495359957980595e-02 5.939903847749423288e-02 3.893001916909927945e-02 2.291868814347579331e-02 3.474700598983993666e-02 1.323925047674930633e-01 2.458882013626497720e-01 1.622615512649126096e-02 3.292784237231799471e-01
1.191843025262842755e-02 8.905225895279346437e-03 1.426302251922683187e-02 4.969287475032365189e-03 6.194794630203268905e-03 1.519092687868039970e-01 1.403308736135288476e-02 3.407910168656921868e-01 1.662404474291790668e-01 6.079011133318954624e-02 1.646588994910177725e-02 7.290672057452104483e-03 4.407661133615022042e-03 6.669628926452319737e-03 3.709784116693505811e-03 5.050148953193910918e-03 2.127813180327621165e-02 1.916850510753467449e-02 9.905189136239028747e-03 8.310827906766895742e-03 6.744404465806236315e-02 4.255263183117533737e-02 4.865678268922495053e-02 5.360084406537608120e-02 3.008984455298837485e-02 3.834915284327127666e-02 3.573507960000063544e-01 5.635794193876215719e-01 6.786154481519063308e-01 1.729972232911212160e-01
1.212084168986697803e-02 3.727250778417110499e-01 7.644791068189592601e-03 2.468038966975318049e-03 9.026136321477806757e-03 9.489760596353648270e-02 9.354877030171639130e-02 8.562419809004725990e-02 5.918637476518406187e-02 4.678063214359205468e-01 2.997908455068631906e-02 2.795476055587967773e-02 5.782307921831226355e-02 2.862062458619952718e-02 5.295115636654384138e-03 1.042108728086198199e-02 1.917908751978212450e-02 5.218777288909505659e-03 2.921117417197063339e-03 1.101383295681829660e-01 4.639243945152773246e-02 4.139099197095672672e-02 5.333194527735361096e-02 7.482808684174192815e-02 8.036924132881000105e-02 4.372434781753167105e-02 6.901968345158050744e-02 5.302150378419905746e-02 4.666955804430712035e-02 3.313368126104076355e-02
1.668498571651907958e-01 9.124468317787108596e-02 1.511406721581164646e-02 1.297626443977717772e-02 1.149295574016142955e-02 1.540689202701244487e-01 7.221005231245952727e-02 5.005293055643693367e-02 5.995227606280114502e-02 7.097113969165290935e-03 8.970819453304719818e-03 3.584021339735662254e-02 5.926266047506000001e-02 3.093991052335312228e-02 1.123682344504790993e-02 1.276370398941691596e-02 1.401027659190001717e-02 8.185373832762240370e-03 4.855383681818454568e-03 2.511548335276446720e-01 4.438398106017605454e-02 4.514918632067201759e-02 5.330376894384609987e-02 9.555417006354312293e-02 9.112529640163782862e-02 6.509056710960849090e-02 5.011001364869805547e-02 4.517442945619800504e-02 4.899038447453378520e-02 5.256304661003875778e-02
3.969287559170611712e-02 9.543673774711058932e-02 2.119931454642421664e-01 2.419943382851700089e-02 3.783336998261048190e-01 1.297654050215769073e-01 7.215072598991074948e-02 6.287866633556611629e-02 8.062118279093516415e-02 3.104273235719739142e-03 1.540550637418258706e-01 1.296262024700159735e-02 4.370399280491128052e-02 1.892277536227918167e-02 6.013919221343302576e-03 7.030317243731331461e-03 2.595769712168764006e-03 3.800235753571725317e-03 8.197704259955855555e-03 4.172949401037530891e-03 4.249921076071687398e-02 4.658022877993069077e-02 5.893495349765737884e-02 9.802772012591731698e-02 1.245163213178436812e-01 1.090066684679069225e-01 8.052422395255563747e-02 7.534785865468084098e-02 6.606273991036831772e-02 5.449472265868229165e-02
3.443680438717628550e-02 9.746704230162901716e-02 1.700937448365143490e-01 1.215251641353273654e-01 7.161735340197623867e-02 2.763038191717832603e-01 1.511214668573603037e-02 4.994209479757352223e-03 1.112104394403494179e-01 3.646525774382891605e-02 1.300815441312513643e-01 2.940592548675064269e-03 1.969581660146860549e-02 2.703656419755652573e-02 2.924399503740310671e-02 4.000775811088547879e-02 3.623084633263672083e-02 2.362559249727562427e-02 6.479629124569402654e-02 3.184928110313502148e-02 6.713600937278471105e-03 2.769495807099356388e-01 2.083439597340386584e-01 4.962606160656648502e-01 1.240087685788324873e-02 6.407000552119812044e-03 1.422572044986077436e-02 7.656419398822009517e-03 8.923655412366038320e-02 1.026830514603990774e-01
3.231428827342590349e-02 3.232626961867843957e-02 8.730124723073756643e-02 6.491241623573972275e-01 2.356241327387383622e-01 5.199397637332101030e-02 7.285933423371160692e-03 5.426214330441458435e-03 4.614602118493221078e-03 1.389640223665506991e-01 2.861310844786582042e-01 1.396984565590356914e-02 1.717144445896084254e-02 2.220570091810134677e-02 2.042938868921738774e-02 2.511730557018095056e-02 4.340917016128880562e-02 7.592927329776788525e-02 7.824091145224845723e-02 6.203557537649099368e-02 5.451288262514863460e-03 7.787660574241605724e-03 8.933201704033069679e-03 1.957072612663338443e-02 2.060720537634037203e-02 5.683067427128023902e-02 5.660889058864136680e-02 1.826885056375071939e-02 9.182823181112627353e-02 7.000012335194923108e-02
2.963935094502814088e-02 3.216554586243423886e-02 7.160659319578285831e-02 7.902905788897722494e-02 5.277401601104978607e-02 5.488496073436408690e-02 3.033460745130333591e-01 2.220663915013435571e-03 5.166441937358831962e-03 2.685354424552529890e-03 2.833843607216813242e-03 1.893811986004489880e-03 9.408688009312198702e-03 1.951122485607495113e-02 1.862377148774937291e-02 2.915088464364222823e-02 5.145252587750569900e-02 6.375951558037899758e-02 3.758339985692329271e-02 8.312282039683319829e-03 4.991753415007274021e-03 3.421050813455746298e-02 4.962704402474205079e-02 8.393249189239543329e-02 7.974168063665029726e-02 1.046186834608432425e-01 8.384572963266136159e-02 3.220504101573301581e-02 1.337485338452549799e-01 7.817438624559835958e-02
3.776138160112322423e-02 4.340440187410632422e-02 4.197589773556392040e-02 3.912555029397628975e-02 5.622887264638163490e-02 9.481481257986681954e-02 1.578327673137971607e-02 4.242769932319268716e-02 1.753222841708218169e-02 2.955198470208206599e-03 2.150795631224786900e-03 3.272762454783717002e-03 6.485455084422785815e-03 9.845184002556739422e-03 1.336576339751415626e-02 2.458805581249653982e-02 5.448379609676089197e-02 5.644609393865705066e-02 2.746183136273892475e-02 9.605901503714736611e-03 4.146118473846030494e-02 7.510810437488425750e-02 9.613058520510575633e-02 9.982527003727878490e-02 8.902128053786055595e-02 7.752956084359043099e-02 1.148084490860081658e-01 2.402206988777302876e-02 1.755307901531320269e-01 9.449973768435059041e-02
9.330260285178608448e-02 7.302357191855514407e-02 3.551814084822602080e-02 4.954772344490199903e-02 3.176823058312681566e-03 7.260492097279473006e-03 3.084771396941705934e-02 2.365135394160957846e-02 2.317344572122013655e-02 1.138411951856240466e-02 5.525206535390469326e-03 2.422563538005352048e-03 2.339412785110282691e-03 4.804554248661730038e-03 6.401689692218591812e-03 3.025621808367645257e-02 3.294311883149939058e-02 4.419384745936040526e-02 7.910544174971034445e-03 1.418318106811631250e-02 4.597388825839688470e-02 9.950824959415394133e-02 1.226866875018625958e-01 1.289179162040602622e-01 1.078489171217581200e-01 1.046717885154534872e-01 9.737240178159378701e-02 8.308106127742403979e-02 1.356884349257129162e-02 1.061329207774919584e-02
3.676693161590390002e-02 1.009372317015937576e-01 1.754969749110802391e-01 4.941986239594096941e-03 4.874740781202950221e-03 5.582214806738390774e-03 1.772772811045957020e-02 2.223184685691066698e-02 1.524099469479946005e-02 1.170378911111094253e-02 4.672370533476539328e-03 1.882895424793029071e-01 2.828103827815033888e-01 3.299074910651856804e-03 2.312989995655315677e-03 1.399009803856778554e-02 5.498285382380309165e-03 2.043789892836347238e-03 2.128849758626849276e-01 5.105656549561369585e-03 1.778229465934654321e-02 9.545482457535899024e-02 1.216939515037248065e-01 1.292365220026768513e-01 9.559367792380543682e-02 4.465204547192176687e-02 7.256368024034988429e-02 4.953949817438663833e-02 2.488844136139469962e-02 5.372360147588088886e-01
2.993177960855657703e-03 5.174760759392395791e-03 3.059425203159501106e-03 2.551088443437561377e-03 2.992653867701504898e-03 1.710784687602683474e-03 8.844882046988643970e-03 1.147029747949340588e-02 1.058689143894786695e-02 4.299264579102022969e-03 2.965600291670427921e-03 1.307950702772728568e-01 2.224131534123335308e-01 3.559280219119712995e-03 4.546067124774117243e-03 2.662627978906161735e-03 4.392977730476779058e-03 1.301597387220201907e-03 2.450474202679242108e-03 1.157684286959537179e-02 5.730346146449430411e-02 1.101579965590830101e-01 1.200102784582102039e-01 1.159280060549510993e-01 9.026950372807887590e-02 6.679538789516775710e-02 6.504437034553738062e-02 5.515227658318158643e-02 3.423256732291896781e-02 4.306283786979279715e-01
3.597481757392692429e-03 5.014741828634190421e-03 4.138914585170940831e-03 4.218059929819100752e-03 5.869774426625121860e-03 2.154413323471605392e-03 8.586821526598717447e-03 6.190650716029449940e-03 1.937952069307414572e-03 1.809570205935930346e-03 2.252781474432324904e-01 1.988903106470397697e-01 1.100235743024078616e-01 5.070406819751264310e-02 1.082977497841127179e-01 3.183452655884244642e-01 2.386489551810212859e-03 4.687518888430170470e-03 4.596656188153813022e-03 2.096828667873042520e-02 5.870806211224383064e-02 8.700277184591997948e-02 3.616402945258917478e-02 5.543079271892299015e-02 7.284774179392917992e-02 4.182048288094096511e-02 4.460328222513867957e-02 4.818474559994122969e-02 2.426254165034482102e-01 2.638320946551121482e-01
2.885397560359115061e-03 7.925404202296435288e-03 3.532115924389480077e-01 3.037651701658963810e-01 2.827982628834200818e-01 4.119202809871703175e-01 3.345643619608530423e-03 1.479045992238084140e-01 2.072005547205693909e-01 3.572822406081462704e-02 5.257896497277596976e-02 8.391671131972862352e-02 7.994371238141775859e-02 2.483885158461095477e-01 4.459166074729957116e-03 1.368781453902586341e-02 2.305314832798713992e-02 2.876431860797541706e-02 1.994729916097415928e-02 1.532454195885926684e-02 1.118642686898034533e-02 4.116223558377787167e-03 1.639106870107228872e-03 3.632455827247714052e-03 1.341024407416696769e-02 8.998050644058671471e-03 1.414789729383729780e-02 3.507263554737337086e-01 4.549700750692663859e-02 4.243416703839995169e-02
6.098803791263470407e-03 1.395923694070100134e-02 4.027666013669755629e-01 2.371658903710263944e-01 3.977621729400998007e-01 3.095161836029900471e-01 4.867555892072171764e-01 5.395007468610548557e-02 4.951287977786784922e-02 2.139815957192336970e-02 5.300082929426098294e-02 9.751382389437190934e-02 1.055715298559078003e-01 4.838753528010663052e-01 6.301906428064569382e-03 5.906739137654650959e-03 2.186846018379493342e-02 4.132010165372276139e-02 4.744028917497466330e-02 4.204739148540356797e-02 1.316575247521358481e-02 5.467829750608536703e-03 6.657622523418525728e-03 1.258273773330808101e-02 1.549765614469999359e-02 9.001834218404615798e-03 4.072120119708947383e-01 1.667865894687493855e-01 6.257890010311721596e-02 5.996895373482099417e-02
7.595149121959928959e-03 3.440627284980232910e-03 2.284897933497130607e-01 9.874799088286258242e-02 1.249552439068192244e-01 2.855231217947360456e-01 3.850421237968719157e-01 4.501122079280136384e-02 2.437505523963915191e-02 2.773113584696543579e-02 5.034008123109113414e-02 8.565982741117643406e-02 7.930142825233328641e-02 3.777461351110692478e-01 1.183156064765914298e-02 1.535614964623930115e-02 1.646780940631955084e-02 3.833973331742105556e-02 4.882469388551749501e-02 4.235269422065198602e-02 3.141284671363431258e-02 4.564002149349727921e-01 3.101132543259310093e-01 6.530593904736794499e-03 1.840445384836396012e-02 1.457428107473197551e-02 2.295199152491910616e-02 2.870495912975544739e-01 5.042208882388526936e-02 4.549694079414469405e-02
7.421211533091145486e-03 4.743826814290420281e-03 4.894283940880243544e-01 5.158497863912566705e-01 5.555412333267628795e-03 4.603817562791685282e-03 3.945210338548432172e-01 1.685743855652966083e-01 2.462538576866590279e-01 3.139988758466811247e-01 2.940192980612028884e-02 3.534887756112919943e-02 4.641323971508933000e-02 8.999350066656598701e-02 4.512369419686307892e-01 1.287266486360574662e-02 5.500901105525217785e-03 2.584664601188945213e-02 2.951123650516498248e-02 2.232127560293068608e-02 3.037106340603232604e-02 9.905871425173219669e-03 9.105455749954849409e-02 1.469643170321287273e-01 1.736362157336599973e-02 1.108693319979531244e-02 3.910844695116800357e-02 5.408174862520065407e-02 5.881710736214151858e-02 5.133067644350794434e-02
2.792243255105508574e-03 4.973118641725446376e-01 4.551926053494106256e-03 8.376946021363853093e-03 3.389310662515100051e-03 3.252812519322121343e-01 1.592303520903063097e-01 1.171277295815085912e-01 3.675844168828839575e-01 7.454321918414937714e-03 9.649268761477593215e-02 3.573735299994116460e-02 5.283395287386393607e-02 9.720626476691944517e-02 4.019136696623535343e-01 1.125711018792630372e-02 4.169259349097817480e-01 1.942857216442057944e-01 2.817594029165568781e-01 4.738870795718952422e-01 1.211413458397594782e-02 1.930429369380716742e-01 9.925785144193485787e-02 4.594492584754982234e-01 8.480188609269338762e-02 3.226476923683282982e-01 4.617369503474165471e-02 8.352347631492046398e-02 4.806949023406679178e-01 8.178100740059789098e-02
3.017258003098133388e-03 4.865381175073893102e-03 6.081443941530700892e-01 4.847168076971380968e-01 4.851958009398144034e-01 1.920197975528020740e-01 1.309533683865218012e-01 1.375006104597182310e-01 1.538261499712376690e-01 6.094032714815272866e-01 1.787488203826041733e-01 1.787576041485872125e-01 1.436920312366410379e-01 1.456177864468710392e-01 3.656502330463884953e-01 2.475029713447631785e-01 1.745933152192940263e-01 1.093093579634551171e-01 9.515698633651080429e-02 7.127689925064251142e-02 5.707240867785664390e-02 8.327637461598598467e-02 1.272882341874905510e-01 2.968088837066882868e-01 5.058503480406405517e-01 2.273691867494065932e-01 3.494565143583637790e-01 2.439458972193645492e-01 2.522524970163674829e-01 1.659947845780359033e-01
2.054134167530777873e-03 3.246440527226674821e-03 6.162879970999973755e-01 4.674028950117490970e-03 2.669897495068004889e-03 4.727196146660758713e-01 3.272233214909085145e-03 3.164524689369662205e-03 2.122258122314636397e-01 1.537945050986159745e-01 5.764450966773178309e-02 1.333237252952054752e-01 3.347098533609970672e-01 3.061641914494338534e-01 1.895652231679047922e-02 1.406364676445241366e-02 1.979691972928658839e-01 2.362991622154082261e-01 1.075362712761110673e-01 4.769638073584440974e-02 4.637073174133928000e-02 7.243772374407249359e-02 1.101377089600808767e-01 3.366032590285472081e-01 3.387603033568916677e-01 8.005689380019051504e-02 8.904088180943275921e-02 1.153064929156139423e-01 3.766564657082108192e-01 7.681240902400407466e-02
2.755467784979143478e-03 4.275357761988429414e-03 1.342726036228485955e-03 4.849880235121672989e-03 3.337487573714725993e-03 6.268751649100678947e-03 6.651662120803181720e-03 5.304267705770296937e-01 2.108039875594266976e-01 1.224192972902359983e-01 3.715043235375398850e-02 4.739388732558069001e-02 5.073514561591166427e-02 1.736804121747685947e-01 1.985766547167167606e-01 8.382627832783072497e-02 6.958264023133363396e-02 7.556875496026106698e-02 1.024605092748221147e-01 5.951942873031584175e-02 4.239984293522097714e-02 6.324865888620874455e-02 7.213266762748961336e-02 1.203829458915335882e-01 3.739317025970828046e-01 5.894764024403141567e-02 8.576705190092190345e-02 1.411825879063264289e-01 1.710177898033377053e-01 3.385578167069236977e-01
1.492157039651204010e-03 3.661902914940020314e-03 1.065276228236872093e-03 1.104969172176135678e-03 5.164778738424133549e-03 5.377692607505074780e-03 6.202850019672298716e-03 3.659376535601349123e-01 2.835838737978308988e-01 2.656841098850164506e-01 1.094383739903543595e-01 5.529594236529687679e-02 3.314540940449228756e-02 5.202735875711615027e-02 2.372534164698310577e-01 6.213178108429547736e-02 1.668930980059697422e-01 1.178577010043057802e-02 2.381398981486507888e-02 2.275903135221259976e-01 5.888629438160163793e-02 8.247995616471019698e-02 7.187766438588573392e-02 7.906094984466272013e-02 1.047183226475127404e-01 8.042979866710424364e-02 9.501889685665600160e-02 1.175139996516528229e-01 1.591712406404304780e-01 3.900493756183269767e-01
