1.171345460029850696e-02 1.730962455313626164e-02 1.517668909069040846e-02 1.931186946822948877e-02 1.467610423871408207e-02 3.220243147247583981e-02 3.175363674630700406e-02 8.550019671331415827e-02 1.551237471304651727e-01 6.954742184782368442e-02 3.238734060950878429e-02 7.385731661598278312e-03 4.322891280393122496e-03 1.609312665849088608e-02 1.877472641921464416e-02 4.145006302566055234e-03 1.446477054457144702e-02 2.489638778027221042e-02 2.221676984384307607e-02 7.719209675573409160e-03 6.200685624431895131e-03 8.975090254636818379e-04 6.933585490356931414e-04 2.695036201997634377e-03 5.016971459499490818e-03 3.775112735465077900e-03 1.672826969626436087e-03 1.460578424655148584e-04 1.364301531172020703e-04 1.669617373291058143e-04
9.333823276708435451e-03 2.072922714747454931e-02 3.749555227973339760e-02 3.052982300811064517e-02 2.129276828351672757e-02 9.554237535102126644e-02 4.551322138600641387e-02 5.655547828768338336e-02 3.681557668931005611e-02 3.083277707364042927e-02 2.177070252346813284e-02 4.224119431636794153e-03 5.595109675941477290e-03 1.284472826738529416e-02 1.797942063061748474e-02 1.166208447815705179e-02 1.425919622868146962e-02 4.571120467050457381e-02 3.392681622454155055e-02 1.008070611318068362e-02 3.584811261078568734e-03 7.996024135702923304e-04 1.663398536497476179e-03 1.426668657249425317e-03 1.196442349863841926e-03 1.522536482277337105e-03 5.137667397663481413e-04 1.352585956418984056e-04 1.950253653859981341e-04 1.970588068038480779e-04
1.157043970225958424e-01 1.172420783656210330e-01 2.482267786018763356e-01 2.002449136702610100e-01 4.282891362025548765e-01 4.378356763245144084e-02 8.229697443631830284e-03 8.761757620099730470e-03 1.411564099857982590e-01 4.192267462594508054e-02 1.101550652464011737e-01 7.178739412863520408e-02 2.621871712941361426e-02 3.880797766311516739e-02 7.463562826846136672e-03 3.175801539317308492e-02 2.098856383062003284e-02 4.208023103304234236e-02 1.374354932011261909e-01 2.254152103791172077e-02 2.145676597871029167e-03 6.166340161555765699e-04 9.284366799626904681e-04 3.129432749563860984e-04 1.767490202304582841e-04 1.108179357854546793e-04 9.320878557166734730e-05 7.739532880256480584e-05 1.370824740793063698e-04 1.611283319278989778e-04
5.359701263967721341e-02 1.521022467542726964e-01 3.343051263404270834e-01 2.679216400622319583e-01 1.110975970922053746e-01 1.723995368139214987e-02 1.379125709696174366e-02 9.186859946404132490e-03 5.615520263826831622e-03 5.143465551010368425e-02 3.229970147384551848e-02 6.323456005434063831e-02 2.846280969114138581e-02 1.921596746355123259e-02 5.674314439545746769e-03 4.343459653335351132e-03 8.949147452589855528e-03 1.639956405833665337e-02 1.148148180915713017e-02 9.676648931554525726e-03 4.369197236845614313e-03 1.471526933945722536e-03 4.500182140306484019e-04 8.287821563755015447e-04 1.452119260960344296e-04 1.002264317544857323e-04 8.027528804876952876e-05 8.045677556836144896e-05 1.692400061375454135e-04 1.959264685561189743e-04
3.100035329625058442e-02 9.516847015447194025e-02 2.649865238702846515e-01 1.026275513255803795e-01 5.929713605905324175e-02 8.663408019333462828e-03 1.330268941180636974e-02 7.407596894371775223e-03 3.408540639636432629e-03 1.174483931874474030e-01 1.441267243355995320e-01 1.216015232818180580e-01 1.785459895791595419e-02 1.486787932405995126e-02 6.947270699731749287e-03 2.556010795776984292e-03 2.718054828341268450e-02 1.543346343266813886e-02 2.469148228456297806e-02 1.398845385143766482e-02 9.548251371809880414e-03 2.618269073362219836e-03 5.627211878012913261e-03 1.458241415344275994e-03 2.722590754289204982e-04 1.381450293412134320e-04 8.914333938006286772e-05 1.099846562960012780e-04 1.796051626144489508e-04 7.099099576654881389e-04
3.095642783754011529e-02 3.218985669004525985e-02 1.440340019590061471e-01 1.151205019827530041e-01 4.576512972740053031e-02 4.905424891556510285e-03 5.983475703225582185e-03 6.418674244804379106e-03 5.994449418994455235e-03 1.801824475665896319e-01 1.393952400164244210e-01 7.290766123874603544e-02 8.246972645642992178e-03 2.470594866394837819e-03 1.846080054372217826e-03 2.951535453081122889e-03 1.536797095044072081e-02 3.992196701480992156e-03 1.295314991401012861e-02 4.436925862891753780e-02 5.340245034644751365e-02 3.117504231966395506e-02 7.577783785330291511e-03 9.182411343482914769e-04 4.232746785172409416e-04 3.728643301898523885e-04 2.144169771823436566e-04 1.588773785577141779e-04 2.197971629072992326e-04 4.293412676857155750e-04
4.252465094660862026e-03 6.719419785304077755e-03 7.100137432038414881e-03 3.597988483687866723e-02 1.724378996472868825e-02 2.865971167329839711e-02 4.356065492908950398e-02 2.489879292631083652e-02 2.959623561195203617e-02 3.444398460497816866e-02 2.637252723980008581e-02 1.080332909961924728e-02 4.404103904663449545e-03 1.685707455665626806e-03 8.665383555623620273e-04 1.500085240615867035e-03 8.837858923911947467e-03 4.200830572738728855e-03 2.155038614547423459e-02 2.942041013114213288e-02 1.335632677688413684e-02 3.125522600909576374e-03 1.183728545731817369e-03 8.676201448433858111e-04 2.995104225044742884e-04 2.854251527923184692e-04 2.291083759402400954e-04 2.156365661116487224e-04 2.647647641093777825e-04 6.867081337559842198e-04
8.998712521436143252e-03 1.645741233809212486e-02 9.630599495332918883e-03 2.078275965887140669e-02 3.184670397726664659e-02 3.588555699502157109e-02 3.196303333197493546e-02 3.028355047662796909e-02 2.443654502540231963e-02 1.372209516600392601e-02 5.509470451413630253e-03 1.694091759073414888e-02 3.587006095138919968e-03 1.179715997014171326e-03 1.190989052188302878e-03 2.164672101384147902e-03 1.793792304947247271e-02 2.881349602206458027e-02 2.544500574715678407e-02 1.811070269287804249e-02 4.865671648334756773e-03 2.226878210445224025e-03 7.234489718868895598e-04 5.337931939446632435e-04 2.365310543333322153e-04 2.327244110700042246e-04 3.360654160920035463e-04 4.569969289483221688e-04 4.918818549766286680e-04 1.565742750447935306e-03
2.340591471607154916e-02 1.529751638625200319e-02 8.980676569893529873e-03 5.211782787955510088e-02 3.386439166917064314e-02 1.439049853531705440e-02 4.675518218534142206e-02 2.110065714360566391e-02 1.781468678656125681e-02 1.759813791366482763e-02 1.566266925395144033e-02 2.058664565306433242e-02 4.483783820552282584e-02 2.933391404954461407e-02 4.368525721262808865e-03 3.984491250400189893e-03 1.732059242344199945e-02 5.267062615586742824e-02 5.212383706531220628e-02 8.707681412620838640e-03 1.343797438715523419e-03 1.004969836560300938e-03 9.122263693876100487e-04 5.344236209018079576e-04 2.941149620771446181e-04 4.276317446565391076e-04 1.520310129532145404e-03 3.304835166937645022e-03 1.027805088022785800e-02 5.464134198038225407e-03
3.903438365014723355e-02 2.531301409162819288e-02 4.027820163186721092e-02 3.745170257879121278e-02 3.285790197914097155e-02 6.516345625323829820e-03 3.051677768313158789e-02 1.305647420988986264e-02 5.500464161042455460e-03 2.057528568775147081e-03 3.003120883283991877e-02 2.911261206057672024e-02 6.164841256329398056e-02 6.720907115719509939e-02 3.230945138066091543e-02 3.551080699697032467e-02 1.898003333264713099e-01 1.964608717441768126e-01 7.902032858111530944e-02 3.521378418937851779e-02 1.690801289299027031e-03 7.745353869444856999e-04 7.599814825072030971e-04 7.661072868311942421e-04 4.012527098260516151e-04 4.924685612032657454e-04 4.430600767711344833e-03 8.190611132196417427e-03 1.094430910661253753e-02 3.073309116501666584e-03
3.272499844811551512e-02 1.702768418438895329e-02 3.788185963131007750e-02 3.201394444098867864e-02 4.058259027401094760e-02 3.738018110187821177e-03 3.152788255341531024e-03 2.738311691073614350e-03 1.705367986131270126e-03 1.531167304054676867e-02 2.395219093379797326e-01 3.973007866750176698e-01 8.214101096699473192e-01 4.081840336042576456e-01 7.587876775903917848e-02 1.486482540185415646e-01 2.751217512310540347e-01 7.603389033455584811e-02 1.818370225971666782e-02 3.629198450689777311e-03 1.202306187007931484e-03 8.070487381844680761e-04 9.193658975446664149e-04 1.212707552515079629e-03 1.236046838687647953e-03 6.414632629624912943e-04 9.756004558658199974e-04 8.288718167115646015e-04 7.831103368613264327e-04 5.903381329960617936e-04
6.058458514608579780e-03 3.549227218439832045e-03 3.118281551403011970e-02 3.040121866379982829e-02 2.359655118063632914e-02 5.398115909809181323e-03 2.081369463018603507e-03 1.316763262871846561e-03 1.598199170439189255e-03 3.006778715006505967e-02 7.293072922706629602e-02 4.750531428129759481e-01 8.508598311489491417e-01 4.420069013596676921e-01 1.602384745126645138e-01 1.800644226136739467e-01 1.983373133785335252e-01 1.172476076221302538e-01 2.896006678177590749e-02 8.171938065638369858e-03 1.183111392987731911e-03 1.023839831047972755e-03 1.124805171042897499e-03 1.956210436284605558e-03 1.829234474422751413e-03 1.267341830839798823e-03 9.442899901282341335e-04 8.723492162140986193e-04 9.473296846964887521e-04 1.028630252617658992e-03
1.153119900679369604e-03 2.965936857610386099e-03 7.258877588923072152e-03 2.052199967353913329e-02 1.335664798596459743e-02 4.180479772332549443e-03 2.093019289013507787e-03 1.701422875940758039e-03 2.079241722822395156e-03 1.511212134882636976e-02 5.052265400141247621e-03 1.534504763683272044e-01 6.420579061006366217e-01 2.721865483854231660e-01 8.504608053951992486e-02 9.741030995261827641e-02 3.593099472687106416e-02 5.279104694839550915e-02 6.026442643881545214e-02 2.261508039986298915e-02 1.503476882670744339e-03 1.330087786203346546e-03 1.576636031573047311e-03 2.688087685993951342e-03 3.507728514844135094e-03 3.265653985902836239e-03 2.385607693969585448e-03 2.142515316718259476e-03 1.606749548237093941e-03 1.217469685765128380e-03
8.998412356174679931e-04 2.581460326653467127e-03 4.781436998605679070e-03 3.505365010083275230e-03 2.070435280994386423e-03 8.024415282958850815e-03 2.703108918118632409e-02 2.278505065490060363e-02 2.899238105272726462e-03 9.103260854781403382e-04 3.723222419407166105e-03 2.517348869193145738e-02 2.952602023476401105e-01 3.918225396913481151e-01 4.119307131993165672e-01 5.473524287928051013e-01 4.919106956512997453e-01 3.187455560454422465e-01 8.697089544794536220e-01 4.069826923795257789e-01 3.385656353540186098e-02 9.840070867041358221e-03 7.363005051642408823e-03 1.859439851003146654e-02 4.327398128297370306e-02 4.049624618311196272e-02 1.108973674713140678e-01 3.601775612229558832e-02 2.776007391390137354e-03 2.567001606745613132e-03
7.892389303868906254e-04 7.894957499113741846e-04 2.211837512747537055e-03 1.665192768463542167e-02 6.035247995795595816e-03 1.398678835528495770e-03 1.803597166557319165e-02 5.195086195281010955e-02 3.499683002789859276e-02 3.629579082021887945e-03 7.806443955919045025e-03 1.245116100431265804e-01 2.628963856308602631e-01 3.281012556768158062e-01 2.922792876161290909e-01 3.483182952917059927e-01 5.920351958829217498e-01 1.020600269453662445e+00 1.040444669512651243e+00 8.273836421244289419e-01 3.575385401873627106e-02 3.768712526495605897e-02 3.342856053696930535e-02 1.052719184146760911e-01 1.514169636881464442e-01 7.753812894101812514e-01 7.786136349568949511e-01 1.567526626500795883e-01 3.394497542410043756e-03 1.955952648984509747e-03
6.716404609403247954e-04 7.270398618838466980e-04 1.694250138202197092e-03 1.885934663021320706e-03 1.245570046720420598e-03 1.408654791577728131e-03 9.891126927247511497e-03 2.778009552883231592e-02 5.767097078381272501e-02 2.079622301846678969e-02 2.161894146341054174e-02 1.895507928429964253e-02 1.472254925897685529e-01 2.964331057713703865e-01 2.752392503734580886e-01 4.185299890403874068e-01 7.181510825424606281e-01 8.693891569416605236e-01 5.039816220565085381e-01 1.111215923134866723e-01 6.738358932447209571e-02 4.659733443260929975e-01 6.794557154162987889e-01 1.145093275899889518e+00 1.077425978515479832e+00 1.407166582201076821e+00 1.136821240331726823e+00 3.265477804011207019e-01 5.545567571660664496e-03 2.446390317642684401e-03
7.930463799199607760e-04 9.084388223753586938e-04 9.118793107650742524e-04 8.746306869503288079e-04 1.328367167495755116e-03 2.768805802931845195e-03 1.613365518760766226e-01 5.387514702837816749e-01 2.635769472383403533e-01 4.528904329768830561e-02 3.376550705114694795e-02 5.285433544002590689e-02 1.047541772468519317e-01 1.544498940334930737e-01 2.035743040299006767e-01 3.645317199477891568e-01 7.771131424485651085e-01 7.833026229717646727e-01 3.728999590495405414e-01 1.290116213114978760e-01 5.581224911656781362e-01 1.012366206247830913e+00 1.300696536412936366e+00 1.343288305238429459e+00 1.190141583344725529e+00 1.035692826818223500e+00 1.549141161255508381e+00 2.717102318214050793e-01 8.649759314477964423e-03 3.604983836601575314e-03
1.859103528278419678e-03 1.439843583720257572e-03 7.601593693299740990e-04 1.198235045905425913e-03 1.558787746235517149e-02 7.884826423571986154e-02 4.385650366899928043e-01 3.565284950293292066e-01 3.514187268576889345e-01 1.764571375295065914e-01 6.478060321112175113e-02 1.751275652263353105e-02 1.723288559532502179e-02 4.464301333827212781e-02 1.008686789766131686e-01 4.668949564308249034e-01 4.849801079437667806e-01 5.660101881073100749e-01 9.858883989497403688e-02 1.744927513227781946e-01 6.190363797766201825e-01 1.338830468967548093e+00 1.657459896015136547e+00 1.730886154489559292e+00 1.443226124490896822e+00 1.406785329933737172e+00 1.325450789618191072e+00 1.050917688397050576e+00 4.664430038962916192e-02 3.075865509801968545e-02
8.267093268401858996e-04 2.238198880470227813e-03 4.125013190203566729e-03 2.852589214235726200e-02 6.348526628944291261e-02 8.959776967092972222e-02 2.818146034161542191e-01 3.497222092398438731e-01 2.400762888357083347e-01 1.870887000653254084e-01 3.948338683173609198e-02 3.887914396881247611e-03 5.957057846656965000e-03 1.701127036276465707e-02 3.730326949518172897e-02 2.226086987534177664e-01 8.421421840043005758e-02 2.688931022839678719e-02 8.978446484132377586e-03 6.486368796984046114e-02 2.453049530137101919e-01 1.300624028624082662e+00 1.645342775327131246e+00 1.732552632000048165e+00 1.276905643124827128e+00 5.980765006843782317e-01 9.772020604163336177e-01 6.707397049980834414e-01 6.048348613718885353e-02 2.387668516620912451e-02
2.076793967788158682e-02 2.629361214741781499e-02 1.751254791149264162e-02 2.160642822901671922e-02 5.068277989417240004e-02 2.893948968578488601e-02 1.484611583427772885e-01 1.902002153125703643e-01 1.750704274685793427e-01 4.145004267793799685e-02 1.046041833425477921e-02 2.217767089612479158e-03 3.937164378201268855e-03 1.186238963034542265e-02 4.794606054020091740e-02 3.282129970694081661e-02 5.950094596903270083e-02 1.747291061003599516e-02 3.245282624701756324e-02 1.518491459232068075e-01 8.093698636394168755e-01 1.524413497350660673e+00 1.633157736443863861e+00 1.561436129568926301e+00 1.210185028858324241e+00 8.947378354746906570e-01 8.733271546684682196e-01 5.884278950519620244e-01 5.297910539912539102e-02 1.885928098459870028e-02
5.920101683686714023e-02 5.339251075390301360e-02 2.738324111960781931e-02 1.959504877759791694e-02 2.530839529925117334e-02 1.345387922231591066e-02 7.612416990104453607e-02 6.729143226679204504e-02 1.838588239995974857e-02 1.004688349000072006e-02 3.484325885511834787e-03 2.787077894979614941e-03 1.717844757897615381e-03 9.986825172768423221e-04 2.708554581397534019e-03 9.482488526517082392e-03 3.352672950009519953e-02 7.566902424095833801e-02 7.200313159897972493e-02 3.177825352418551796e-01 8.593949880303162203e-01 1.239219970841747509e+00 5.028869182302608820e-01 7.584545635045383261e-01 9.857876587874900842e-01 5.620924008906026392e-01 4.222561458930931266e-01 3.468113021844041466e-01 1.271217772559913098e-02 1.149106371567148316e-02
4.791791231645324556e-02 5.436460257747696007e-02 8.011091648318615505e-03 5.524807685053773759e-03 4.509232910435136306e-03 6.666225424600242568e-03 9.428271041686361181e-03 2.328138792204588383e-03 2.989842234102443961e-03 4.787096001475960212e-04 6.412007137339874666e-04 9.969813384906776269e-04 1.154664720027272738e-03 4.376713996869039530e-03 1.301939837664298043e-02 1.762542113883958650e-01 3.318369306196436441e-01 4.739071693496016979e-01 3.194801342878635375e-01 2.385628362717230888e-01 1.680263513906785910e-01 5.991134648808422308e-02 2.307902290578963539e-02 4.986820237275814416e-02 1.815808020416477264e-01 6.182592332981821925e-02 5.743860504585353299e-02 1.941296968385392008e-02 2.207804410788886691e-03 1.808325656994333452e-03
1.002575591161505020e-01 7.638710317116192972e-02 8.244923080540219815e-03 3.547903303847373298e-03 5.187254760798069159e-03 4.011298487300420448e-03 6.130486492039979168e-03 6.472274933047124021e-04 5.394802778561695556e-04 2.382760307485926304e-04 5.760157645434882314e-04 1.109842469421802418e-03 1.547403703109838076e-03 8.897384534093565750e-03 1.546717946143911539e-02 1.017812843023218061e-01 3.652623388421702977e-01 6.716456763864968593e-01 7.511314998787712582e-01 6.496678950771926919e-01 1.388876181727298764e-01 3.107024669230653777e-02 3.844881232774900737e-02 9.397997756678568015e-02 2.097406164442153220e-01 6.207553110089841786e-02 2.396509085862106453e-02 9.042378818644418101e-03 2.840639957005319880e-03 2.565816447205211508e-03
1.246688546946775333e-01 1.575793972978185159e-02 4.334011396517342858e-03 1.415798575045946637e-03 1.610513105301961644e-03 3.490926619692585973e-03 4.440262666893447091e-03 4.890769620811234990e-04 2.660470727103437637e-04 3.122359477795507592e-04 5.611723371408545947e-04 9.715141997637581975e-04 1.152990372774461694e-03 6.837925546281099255e-03 2.834908810946632635e-02 1.445871025696174872e-01 2.750125795969672882e-01 6.234083835143007235e-01 7.736128916682031287e-01 6.538479594026584962e-01 3.301032359249337356e-01 1.918618008125001079e-02 1.368514429081162456e-02 2.954660587163203053e-02 1.701596728040161433e-01 1.020131453769321378e-01 9.224502607878733162e-02 1.740556675588247892e-02 2.516111187218642194e-03 1.910458838779391724e-03
6.945323996614868878e-02 2.132586310860822704e-02 8.199403543409332362e-03 7.616464649442200412e-03 1.711457985723076336e-02 1.161521340022547699e-02 4.731369773456826390e-03 1.902768532708293487e-03 2.804699368756003938e-03 3.686609871957892588e-03 3.462448833220402962e-04 3.932242300386362124e-04 6.431970591992059502e-04 1.567463373716221440e-03 1.014137098617608201e-02 4.395944554857712794e-02 4.382103403125978125e-02 1.854729082245452354e-01 2.355034271173019333e-01 2.029195981567570584e-01 1.735257890602350805e-01 2.273496756464487428e-02 3.539985956747451930e-03 6.907362306617385352e-03 3.053723362403079622e-02 7.625072633310790715e-02 2.052367487008839031e-01 1.157944234883608314e-01 2.882300809554293360e-03 2.143732051091944233e-03
2.487765233901769943e-02 9.783394167169152597e-03 1.033152839304776402e-02 1.737547764799880767e-02 9.619618358006207931e-03 4.281083243188270500e-03 1.936263970734765708e-03 1.335670219438344838e-03 4.160609032053582887e-03 1.622950839393146397e-02 1.111083589115259736e-03 3.852136100518707001e-04 6.840321342232985992e-04 1.616169185785961467e-03 8.216914526924844545e-03 1.566652420230583986e-02 1.075309636563062318e-02 5.319035747265786311e-03 8.363913698599121857e-03 1.535509211283100917e-02 2.795088962889141077e-02 6.517569481930080878e-03 3.429487681321087382e-03 1.763871984074762839e-02 4.316158913010348375e-02 1.536763353151167702e-02 5.318695284696502157e-02 5.974206784903219464e-02 2.125315644267225870e-02 3.221750113769759026e-03
2.522244775632542443e-02 2.006877960385121049e-02 9.667745140764487030e-03 7.076642795523947239e-03 6.677839936410721183e-03 2.488598654843432369e-03 1.616838409418103802e-03 1.626330912857558691e-03 1.767489980029218494e-03 7.106154963074537596e-03 2.016278454881223654e-03 1.923662544387320841e-03 1.908125354112074831e-03 2.562067472029347804e-03 7.969891900713158353e-03 5.970550018954790678e-03 4.186279466799862001e-03 2.593559954033970803e-03 2.355000935612209557e-03 1.864941755654755300e-03 1.539807502760753843e-03 2.329285492164700003e-03 3.830515651533957910e-03 9.873603193253701130e-03 1.784816571444730951e-02 8.791860345775103294e-03 1.433664159022907808e-02 9.571344100588963233e-03 9.676659426837664821e-03 6.223201256262505393e-03
3.417092907750737818e-02 1.766729047299595359e-02 9.936310390082088440e-03 1.357290749893033319e-02 1.209032862858170666e-02 6.514371494872704151e-03 2.188391419624357778e-02 1.629727529809548228e-02 2.379146915252265421e-03 1.737960258825007416e-03 6.227507538935710910e-04 1.434767321309482480e-03 4.480866180442698993e-03 5.371485009930482279e-03 1.797028746379076419e-02 1.453253589353100360e-02 4.780733564323015952e-03 5.891317356436828051e-03 2.815582874149549254e-03 1.255584494755786380e-03 1.162845527241838754e-03 1.809559862359076156e-03 2.867949538478010291e-03 9.518072382030546771e-03 1.041555219701943528e-02 2.639487877482900400e-03 3.068765951958059464e-03 4.011783387162881284e-03 1.320724040570399674e-02 2.748783460371210206e-03
4.583137182455893077e-02 3.933825465201441773e-02 1.180431804067607823e-02 4.041887237852013343e-02 4.752694812652896034e-02 8.891710346881635807e-02 5.896340652616769568e-02 6.601061991571705034e-03 2.355052307670477910e-03 1.370123297387099322e-03 4.065581978012105299e-04 5.096741519021974172e-04 6.728947087485078523e-04 2.945403017309557083e-03 4.031382261596151012e-03 1.974163501684147917e-03 2.011937533016267075e-03 2.537213639325462764e-03 3.589047865567144592e-03 1.955464596041264162e-03 1.058664850365124413e-03 1.435571714895558836e-03 1.611284301116878764e-03 3.005051106252294626e-03 1.049724522032465489e-02 1.807749399387967998e-03 2.788661348796245797e-03 4.731823737814666586e-03 5.845092860345114244e-03 1.186341770905335186e-02
2.496066955285959274e-02 6.172172756139718275e-02 1.833890798610159079e-02 1.976842010937591987e-02 9.684218951792014640e-02 1.024366222778615304e-01 6.827754505747848923e-02 4.686664011370716976e-03 3.299771165184647165e-03 3.144947029251235482e-03 1.301586652960524601e-03 6.494322130770684934e-04 4.415573909868881304e-04 8.475310685779197106e-04 4.449934622066047119e-03 1.415069751440804031e-03 5.341884207848145681e-03 3.397943226950651818e-02 6.293614056999274897e-02 8.787186780172366596e-03 1.700463421337784905e-03 2.144531005170882253e-03 1.817963292189490616e-03 2.199915800498142802e-03 3.234725075455579212e-03 2.708481718331982868e-03 3.394039311281373678e-03 4.296644697307622739e-03 5.914058763634985789e-03 1.477347166426459107e-02
