1.347207642322998944e-01 5.322452875492112052e-03 1.618742102036614021e-03 2.022726495450656928e-03 1.525128708644880133e-03 3.330985958356746240e-03 3.299860993266214883e-03 8.914873371697988602e-03 1.615334043889658441e-02 7.205654011306102460e-03 5.790776385564909076e-03 8.072034352749639374e-02 5.035273210601795557e-02 2.925428533586424927e-03 2.302598133935976343e-03 5.406410030385492421e-02 1.884407437024614683e-03 2.481806267646970588e-03 2.257412331315296686e-03 1.519222148768083550e-03 1.697850675527874664e-01 2.612783367856511343e-02 1.991756817614519573e-02 7.943652926241000223e-02 1.546967165628552465e-01 1.217582925389783105e-01 5.615319315976561448e-02 4.904965189888318457e-03 4.645875192398591681e-03 5.797684998346685700e-03
8.854803931803813255e-02 5.591121824245036051e-03 4.024822714101305814e-03 3.262187957339689887e-03 2.265182073432287294e-03 1.202091902325787623e-02 6.618424416211706081e-03 8.169993938433948999e-03 4.580892132148282371e-03 3.329329340377026273e-03 3.880413239233300796e-03 4.216280386605535807e-02 6.036295748849858367e-02 2.702407857756126963e-03 2.751012331608727619e-03 1.815399382649631041e-03 1.832580253518556728e-03 4.580646123845939430e-03 3.450982399743208161e-03 1.989732991231940411e-03 9.734585615876643894e-02 2.493880874788886523e-02 5.171015825326003706e-02 4.620335491735063499e-02 4.106135461902239714e-02 5.527780984677732601e-02 1.950421149994766012e-02 4.934566782284099951e-03 6.987053203894369284e-03 6.948816906168616726e-03
1.534246475816108089e-02 1.503648365368307621e-02 2.657068014062942754e-02 2.157567089826263954e-02 4.591388960444537509e-02 1.049849100381308915e-02 7.529930150600111505e-02 7.895310334531965846e-02 2.519792548993853368e-02 4.950893244998633841e-03 1.304131727322262006e-02 9.975345203549364909e-03 3.670903352155658033e-03 7.196884249797381311e-03 9.215762494330137500e-02 6.979237483323424800e-03 3.326389634089356884e-03 5.617412248390996586e-03 1.374757173113109500e-02 3.915938875674675017e-03 6.097297640472073427e-02 2.049017448247181586e-02 3.130254958962377237e-02 1.091635689957482121e-02 6.501601410053597062e-03 4.302145866866821655e-03 3.860631800484136660e-03 3.024105635209034700e-03 5.143301488146677890e-03 5.748874750301812171e-03
5.903221362040721350e-03 1.672109654870995027e-02 3.667095154628643994e-02 2.960197852705809957e-02 1.514446980032919769e-02 7.792528145875767150e-03 1.519348874879216382e-01 9.367900262330416949e-02 5.047978576337417561e-02 6.400196783691034300e-03 3.566182011046418326e-03 7.070196476585379614e-03 3.174221799360739567e-03 4.900834531326323830e-03 7.041843552763132896e-02 6.230111796653334949e-02 1.346216034629535152e-01 2.133279605863909467e-03 1.134420535734917499e-03 1.366030634963624497e-03 1.067679876229775671e-01 4.239203088976005451e-02 1.456672328196127915e-02 2.879529709036762752e-02 5.301242406869512321e-03 3.817696695908170696e-03 3.291546993278631015e-03 3.108277958096606827e-03 6.281624934971281361e-03 6.792909152336240597e-03
3.433645896079669160e-03 1.060340708714344916e-02 2.956888956889048778e-02 1.146801822130750874e-02 9.345687622016027318e-03 9.045796805333308765e-02 1.552274274338417415e-01 8.630116233050193209e-02 3.136754016247628868e-02 1.562371063515508376e-02 1.583356824295079762e-02 1.631705021841930656e-02 3.066046384768935686e-03 5.121002766245958543e-03 9.139294979118879614e-02 3.735181122930462255e-02 6.558571726623387346e-03 2.265343628333486327e-03 2.901641032088913500e-03 1.700717082852263489e-03 1.461738622138544210e-03 5.436065231286429239e-02 1.393673695722279227e-01 4.495933002648645760e-02 9.594620869192002979e-03 5.133174773637128215e-03 3.579477249170776639e-03 4.109257511180154469e-03 6.381300090665341894e-03 2.329712239272555691e-02
5.226082740005552445e-03 5.635953077124765745e-03 2.071153779312586568e-02 1.433716317298001225e-02 7.531089330083219797e-03 5.126871240042580463e-02 6.401210955044145390e-02 6.678048718865854660e-02 5.314728302261443466e-02 2.198304230004986468e-02 1.851642351807264095e-02 1.360819512351795109e-02 8.065422704430603995e-02 2.987742788301964852e-02 2.478111606141692944e-02 4.236422340955986465e-02 4.697024876991067605e-03 5.666887600152148430e-02 1.741316702025443334e-03 4.245609946647817441e-03 6.559330150862778368e-03 5.909702843953249483e-03 2.108016717510834050e-03 2.650187219352219750e-02 1.434392907857074372e-02 1.350443570565726913e-02 8.452417489305981413e-03 5.773486582030613358e-03 7.549714160219315150e-03 1.344832762674434863e-02
4.747350378173364333e-02 7.214959970990307558e-02 7.088946483490005113e-02 6.041420531639881894e-03 2.311103940373405129e-03 5.016189899480962694e-03 9.341517736229440830e-03 5.014432264985129416e-03 5.832474354630068185e-03 6.127459584374322400e-03 5.160076230495845920e-03 9.765460523361013667e-02 4.559546098738999353e-02 2.132164912138653778e-02 1.230246571612891686e-02 2.104949164885882434e-02 1.193115983317231815e-01 5.351365990742595891e-02 2.770454501389050389e-03 3.945512395923913423e-03 2.760033798885927307e-03 5.465425893798297324e-02 2.562448642445974700e-02 2.413239791006240725e-02 9.793894251517106658e-03 1.010055201554389478e-02 8.904310317582360065e-03 7.604073755848649550e-03 8.617746963993203752e-03 2.024981588434905666e-02
9.749836961539375124e-02 6.067884718504529262e-03 1.000942704953793894e-01 4.207118848500565091e-03 3.747734699608240225e-03 4.131424143635701283e-03 3.548661794708519307e-03 3.244939682525288093e-03 3.637989785380621975e-03 1.291846738755598745e-01 5.442544795073245290e-02 3.718039904054446562e-03 3.865744903078620343e-02 1.400825000308062243e-02 1.575105678429747705e-02 2.891003448024285702e-02 4.519382122761572348e-03 5.351260019356909349e-03 3.616003210529309710e-03 3.266503558217453626e-03 7.902261502660536119e-02 4.650821610094802577e-02 1.878942598341299536e-02 1.574534491166134503e-02 7.493667314509231021e-03 7.765085431468762324e-03 1.194544050087318655e-02 1.335994945600072099e-02 1.317320110873480485e-02 3.787372894626995362e-02
5.064356061655697801e-03 4.334714841263163226e-03 8.609498952510595549e-02 9.818523331917265382e-03 4.757136203291053612e-03 1.970931954946605284e-03 6.174387274128049184e-03 2.982787775397918381e-03 3.409771342052712786e-03 3.942124080587537487e-03 3.014118672640269964e-03 3.218800161370168056e-03 6.303210612562329049e-03 5.293388926131562498e-03 5.098854548239732665e-02 4.259133234027858567e-02 2.404055428036821693e-03 5.509587065431834248e-03 6.622949161489867856e-03 1.069194393266714033e-01 2.123251277440695722e-02 2.205764421580545462e-02 2.392753249000123886e-02 1.559709906486632901e-02 9.093872596307601627e-03 1.334296739307297419e-02 4.677773859782561466e-02 8.282816353087289751e-02 3.885347975763538478e-03 1.151921771990648824e-01
4.727252974016630735e-03 3.782072649051589422e-03 6.012782273310657462e-03 5.581569826695969259e-03 5.302801835484048480e-03 6.285815938453996610e-02 7.130082215438433846e-03 3.105409155709767510e-03 6.072694636912143867e-02 2.221994548649846440e-02 3.309461336543906545e-03 3.167822343985394681e-03 6.763930245294673925e-03 8.460697234440197820e-03 4.352267308815663954e-03 4.711085397515855575e-03 2.213647539094553904e-02 2.131148884910088331e-02 1.143464072025796377e-02 7.427716979479277205e-03 2.747253254723571944e-02 1.725342050519876672e-02 1.967053139412512641e-02 2.147217102467194327e-02 1.189650939038612576e-02 1.468315715700170207e-02 1.262482898484027227e-01 3.327013504405718341e-03 3.960788793042741528e-03 6.003540777157054253e-02
7.492360334402611496e-03 3.796050464740481807e-03 5.401360076204950351e-03 3.915225350321981101e-03 8.772555504447429597e-03 3.948638703065722455e-02 3.754072667806433033e-02 3.350263928643156669e-02 2.243134383343525426e-02 2.840403178993300675e-03 2.631120072944078195e-02 4.302871124740976355e-02 9.010201364624045861e-02 4.521230771227639778e-02 8.460873396773236493e-03 1.682839791439508931e-02 3.136515249960580842e-02 8.644942731404989603e-03 3.079851473150517667e-03 4.568286529191986634e-02 1.911097931384317036e-02 1.694002842943364770e-02 2.170056439014709376e-02 3.009924099985544430e-02 3.185561373650500766e-02 1.690814082744348038e-02 2.509942795482173958e-02 1.840204596125402312e-02 1.622789213417920665e-02 1.171148238777536960e-02
6.836431301256321036e-02 3.724490284380995581e-02 8.601741233662012903e-03 9.231842322695412578e-03 8.551918093097493623e-03 6.355014474042537664e-02 2.941093155906699536e-02 2.005416202634555112e-02 2.348817263604401767e-02 4.917901699199724724e-03 8.071236739942491689e-03 5.301230302944416606e-02 9.334666654344080106e-02 4.956155480714390105e-02 1.826970743031998412e-02 2.105991279233480201e-02 2.336341021228888898e-02 1.377911985852226136e-02 5.178774930038273529e-03 1.056662668996741217e-01 1.854989623080581865e-02 1.873886493044596077e-02 2.198580552227176813e-02 3.894249553928872537e-02 3.662095781292266233e-02 2.576710655670734484e-02 1.952706410129424058e-02 1.741067685085476852e-02 1.871793905141139538e-02 1.994098582324227778e-02
1.598987806716331214e-02 3.760435755197320123e-02 8.251002659267345218e-02 9.884696323133553009e-03 1.515026056279776545e-01 5.255772314208173590e-02 2.924912273045657610e-02 2.543534890229276479e-02 3.224646728265307544e-02 2.760917082937087205e-03 6.179408843945557311e-02 1.780586077393933250e-02 6.953532431387834944e-02 3.074453459501302541e-02 9.957404770324107882e-03 1.185394779300202872e-02 4.413222866549033549e-03 6.503546200794156282e-03 9.913302924440578479e-03 4.418463222588484181e-03 1.801213528202295563e-02 1.959599498481522789e-02 2.440244567846461612e-02 4.011565707902960132e-02 5.023912759127978356e-02 4.387891669440549536e-02 3.198230144653210760e-02 2.966349538814516337e-02 2.569883659389479019e-02 2.102604283211722061e-02
1.360497342588180142e-02 3.735890437841941220e-02 5.794876955068559848e-02 4.076943997042895701e-02 2.418977138509589841e-02 1.060686845117203431e-01 9.629134984940513828e-03 4.507948546584141999e-03 4.499860516679508177e-02 1.469466809705734581e-02 5.225114435798966506e-02 3.389724909896918870e-03 3.169217386298455591e-02 4.459239517340452680e-02 4.931908518614445264e-02 6.891949810726001602e-02 6.279719389229497517e-02 4.112001060534949820e-02 1.132229055638883514e-01 5.391701645910174090e-02 7.071955088838947912e-03 1.182405027499584121e-01 8.731177217765544174e-02 5.188769489590425686e-03 8.834165666110860640e-03 6.999378313201432347e-03 1.696728348779338869e-02 7.266526601667366685e-03 3.525030217133470756e-02 4.021219705166975689e-02
1.290178473414049093e-02 1.248525341950036845e-02 2.992578594380670282e-02 1.231177189619054799e-02 7.772217586440978432e-02 1.955248861778995442e-02 4.776640269018013994e-03 6.979329634372018719e-03 5.201549459603937130e-03 5.650558421690996674e-02 1.161131886996937812e-01 1.671739155561408063e-02 2.848618857955086472e-02 3.742794879624888882e-02 3.493066003571618922e-02 4.353116332908829600e-02 7.558162198064823090e-02 1.326431629238124799e-01 1.370562417915648923e-01 1.086782946759849294e-01 6.444783423702672709e-03 7.997110820528306740e-03 6.854311977957119016e-03 1.602961330693781355e-02 1.856537592935221873e-02 9.329388981880107345e-02 9.129686876629350412e-02 2.221168230622673490e-02 3.617319921801558091e-02 2.738176348203152921e-02
1.208266651863674351e-02 1.280065273979097244e-02 2.495242002914064769e-02 2.633656598073968666e-02 1.709623188994267851e-02 2.062512178512583907e-02 1.255192007467925142e-01 3.386951576557018298e-03 7.327218718007869232e-03 3.111259887673552618e-03 3.235095450320821762e-03 2.470354758286591630e-03 1.619310923665213953e-02 3.369403969851397090e-02 3.223774431348341157e-02 5.056834116781462607e-02 8.952893815915247133e-02 1.112382409308173281e-01 6.570196198562702761e-02 1.451332989642346687e-02 8.668365067215666117e-03 5.917748614546922831e-02 8.568010375827167513e-02 1.415694826581942178e-01 1.306052335317001156e-01 1.668656520712678004e-01 1.307643909388459535e-01 4.172390796482837449e-02 5.214331328722924402e-02 3.032817120142296957e-02
1.575112789536487617e-02 1.789514254913873378e-02 1.671236244006573182e-02 1.503897405044371700e-02 2.182771352414660665e-02 3.837802391653669098e-02 2.109319788997238848e-02 6.634615872252783153e-02 3.047781706549819447e-02 5.170174562091906477e-03 3.794897480687967929e-03 5.837974906448373073e-03 1.158810156733402173e-02 1.743169503359401004e-02 2.345126325292538200e-02 4.273986226687599005e-02 9.482687382056478875e-02 9.833721309382643938e-02 4.789886492218278780e-02 1.671636118298908819e-02 7.156242425148658104e-02 1.287856304030246812e-01 1.639188437400224685e-01 1.653585440017440733e-01 1.424355327982843589e-01 1.202371929159564423e-01 1.735920415686323104e-01 3.229374545702917015e-02 6.776143298197150056e-02 3.638829482000743160e-02
3.962745642834700210e-02 3.107401671336374946e-02 1.492257175971969767e-02 2.072417093311149788e-02 2.694587799144690984e-03 9.966521295378297229e-03 5.195632657896976508e-02 4.188253034341481162e-02 4.131178916710123022e-02 2.048602580293937617e-02 8.380836761388184286e-03 2.852665204293787071e-03 2.770387739935228130e-03 6.342476966744235549e-03 1.136103210231127585e-02 5.259425155890383452e-02 5.726041968984633274e-02 7.211157225622158440e-02 1.297985160650359619e-02 2.330975145809684179e-02 7.883180241523610188e-02 1.688513333651438797e-01 2.061885411348692854e-01 2.093399001795779868e-01 1.683491620049373805e-01 1.578802664111612908e-01 1.429743701235185183e-01 1.161259784596994499e-01 6.454044646945792003e-03 4.474058310087300830e-03
1.558753670932147388e-02 4.309405662761200267e-02 7.495645563799202549e-02 5.149455801366328161e-03 7.782268148844882771e-03 1.025563077618325304e-02 3.239310663502444065e-02 4.048751982020429296e-02 2.771984961393320415e-02 2.144376858718095857e-02 5.925522221440491719e-03 7.902960266306628678e-02 1.183708317681421568e-01 3.319766858925605156e-03 4.055578561410242734e-03 2.387429758939118782e-02 9.403048033737645278e-03 3.257259932912104968e-03 8.987122324919774585e-02 8.273846963144596695e-03 3.000453844701974140e-02 1.583854939360744007e-01 1.986790999927529056e-01 2.052269310420906656e-01 1.474351353431193890e-01 6.707099990633118292e-02 1.068480819878246252e-01 7.277270533838813005e-02 1.193994600189811524e-02 5.201908279488386307e-03
3.370861017824812109e-03 5.186966458229834605e-03 3.216511943565071585e-03 3.237884755324660357e-03 5.793037949771164506e-03 3.296258632094937416e-03 1.682532233939558822e-02 2.155917345775948749e-02 1.971640103547025319e-02 5.771920645703849592e-03 2.617887007963211419e-03 5.448133453164535900e-02 9.212417146152977743e-02 3.050740351197789302e-03 5.619625283955403082e-03 3.490645357479456312e-03 6.238823975104227509e-03 2.014020949407154069e-03 3.872922958020607286e-03 1.852726408090320590e-02 9.528592398556261223e-02 1.791108748671914330e-01 1.909180586126507650e-01 1.804496998288125376e-01 1.376488029851835049e-01 9.994104744178067268e-02 9.594347286509337380e-02 7.042438952007398778e-02 1.708738397745089566e-02 1.619204863297543651e-01
6.529739389886101385e-03 5.986841029033617215e-03 3.951792597771507619e-03 3.547187346399722965e-03 4.775156326671242159e-03 1.972550347318710682e-03 8.948830875395755516e-03 8.861216421085922959e-03 2.527703773502353382e-03 1.828736369370077570e-03 9.315054081659923657e-02 8.214810978682191012e-02 4.489897364301645433e-02 2.032980027161758463e-02 4.257919108946668640e-02 9.569974639135333605e-04 3.344759821435750249e-03 7.855033191047841590e-03 7.780087464584547682e-03 3.535527132194552641e-02 9.625089879020121142e-02 1.387689437987369434e-01 5.617443706319597690e-02 8.467189441941531947e-02 1.098483840232189479e-01 6.230000654867829529e-02 5.327243252091079517e-02 4.986122387537784278e-02 9.334589354982107678e-02 1.015225064622266027e-01
5.239421311874626133e-03 6.028094754217084086e-03 1.514533294524073731e-03 1.261695814079196454e-01 1.191897633685971153e-01 1.847026850200236044e-03 1.575534019756115976e-03 6.043512318931191368e-02 8.540130320470742942e-02 1.475151694697331498e-02 2.168418069249005223e-02 3.440805666475850455e-02 3.147124581857414088e-02 9.599437075116407092e-02 2.142447872480586057e-03 1.729631945306169677e-02 3.236689243090744295e-02 4.815260662811921000e-02 3.377842327588995858e-02 2.579316061463581347e-02 1.819611288042405003e-02 6.477346843035242455e-03 2.501816514917035248e-03 5.476116436602751839e-03 2.005275760095563339e-02 6.832068658565670048e-03 9.262544357438850379e-03 1.344119344259821491e-01 1.754020831719837678e-02 1.636756438700573066e-02
1.105977303994967915e-02 9.778090716754263279e-03 1.878465263566390020e-03 9.738138984419307531e-02 1.658161605549989537e-01 1.259929826921559193e-01 1.591268796428809470e-03 2.172106306947753016e-02 2.041420426909441865e-02 8.847863759749007712e-03 2.187007265641530834e-02 3.988808878173202149e-02 4.164775299569736106e-02 3.137800808382976495e-03 3.217394216491257369e-03 9.796849547164903499e-03 3.678772416523380662e-02 7.041127804448915617e-02 8.176463071812466177e-02 7.171539625743142410e-02 1.512102408481863329e-02 4.650716877663703050e-03 5.668254248650729521e-03 1.337624217217010976e-02 2.307818831968169726e-02 6.864019693654643123e-03 4.508254533154329446e-03 6.389220211103605052e-02 2.404610030041296961e-02 2.302363464846566427e-02
1.375726756099054059e-02 2.027523050016572740e-03 9.287136085345151781e-02 3.968263289972796815e-02 5.199282979641065006e-02 1.168635213945366652e-01 1.552043748711883775e-01 1.786635649148098429e-02 1.009658818699162366e-02 1.152009647510059479e-02 2.089032288410729368e-02 3.528089334968468466e-02 3.142041085464382377e-02 1.469710851976506749e-01 5.123539335630766106e-03 1.416439006340676834e-02 2.814408747140617270e-02 6.642059991856689993e-02 8.551365526593569799e-02 7.315073523241749642e-02 3.619799961151161372e-02 3.345701744921114346e-03 1.206039740479449840e-01 5.214852129494293616e-03 2.104105979120901235e-02 1.128792744508435100e-02 1.525024503669630653e-02 1.096935655702563212e-01 1.924359691817965901e-02 1.731354339474545576e-02
7.560277447124394597e-03 2.771571564710907393e-03 1.239606478837713488e-03 1.328992121571405480e-03 3.336687092354584556e-03 3.265474560102347296e-03 1.662257158240263433e-01 7.051957850305169695e-02 1.028183525156879941e-01 1.314139153741722410e-01 1.231124725560511779e-02 1.469807977447662277e-02 1.906554734916086208e-02 3.536453472679168542e-02 2.304297719399687680e-03 4.417645891917384993e-03 4.996219974099854258e-03 2.365847607402331298e-02 3.060485307365733848e-02 2.476421303854507358e-02 2.361371394867861628e-02 6.010181983802084793e-03 3.322458997723720664e-02 5.362650643585285815e-02 5.095451498318755157e-03 1.129043433301369498e-02 3.503111722568374997e-02 1.912783159207352701e-02 2.160093275568740132e-02 1.874806791355004831e-02
2.701978575515301927e-03 1.075504980597059195e-03 1.430634651403182335e-03 3.002313672375793007e-03 2.042276507754430936e-03 1.385696888811984717e-01 6.734151028657589522e-02 4.915578075819369147e-02 1.511614164271350147e-01 4.031530122475254947e-03 3.990520267145362954e-02 1.494638520665178029e-02 2.184580871680286487e-02 3.857682833015431412e-02 3.237368147732953057e-03 5.146753507562985136e-03 3.610936114895213489e-03 7.888866992409390710e-02 1.156843015886450110e-01 4.255835013128548942e-03 8.422890589056703306e-03 7.614545195169850067e-02 3.722978283779081882e-02 1.739652460686312227e-02 3.778270283112057648e-02 1.244706582226107194e-01 2.798556652660657423e-02 3.745233514518069712e-02 2.160334397614070007e-02 2.990506850858909438e-02
2.738233023620588198e-03 2.204535333877338191e-03 1.356572271477927494e-03 1.999775510669050405e-01 2.070969049787818317e-01 8.176552902941541801e-02 5.542881147314649565e-02 5.779955317359609934e-02 6.327038571010941415e-02 1.674620707069827312e-03 7.391638136775074974e-02 7.484728331799878065e-02 5.962888798800014545e-02 5.878810845573430310e-02 1.453771965508003639e-01 9.682451661013127819e-02 7.027035981552719190e-02 4.444023840117766744e-02 3.908268015680179536e-02 2.930301615129342341e-02 2.320039926964741900e-02 3.335659208562585104e-02 4.936630196475895460e-02 1.144205499599969811e-01 1.940692470560756167e-01 8.808203225279737092e-02 1.347124509471796794e-01 9.199866210734541916e-02 9.428671602895367931e-02 6.175152800638133294e-02
3.718618527470565847e-03 1.944649378803351650e-03 1.394581997162077508e-03 2.384339724851704343e-03 2.400614693423223055e-03 2.016832089618277313e-01 3.229943160741243977e-03 2.646273688965356322e-03 8.656335699185931098e-02 6.312048074288639787e-02 2.377548454813442624e-02 5.585591751213874606e-02 1.392180671414939286e-01 1.256793114201245065e-01 1.278064444360081653e-02 9.383025544256644659e-03 8.004203773907464514e-02 9.642633337828748763e-02 4.428315469778280888e-02 1.969571720580719221e-02 1.901263157598032452e-02 2.939965975766155662e-02 4.421577532816204498e-02 1.330595861554754178e-01 1.326610618001523856e-01 3.105257009730907208e-02 3.423828685688760226e-02 4.376369480634813985e-02 1.416003592545058698e-01 2.880246084973232118e-02
5.009981517132337976e-03 4.349660347167778884e-03 1.334236696408171293e-03 4.601764986957408536e-03 5.779097519585533853e-03 1.078175323178805732e-02 7.712086665715748961e-03 1.163693413344455384e-03 8.759034925557931950e-02 5.114705771134598483e-02 1.553181192673549170e-02 1.985462975963338261e-02 2.112964565415320975e-02 7.138446251105985685e-02 8.070684517879947451e-02 3.361514700808006934e-02 2.819777725615848704e-02 3.090004573876282620e-02 4.225321946855398192e-02 2.461948971923896487e-02 1.745400467791402913e-02 2.594421187450205238e-02 2.943188235315042853e-02 4.827779693238148928e-02 1.477955488787741078e-01 2.292702693999405447e-02 3.289112631468135706e-02 5.350954303785674521e-02 6.420447133329122702e-02 1.267713138630834624e-01
2.764141256214599791e-03 6.894222744183326271e-03 2.068763727560167433e-03 2.216799921744673843e-03 1.071530545987863133e-02 1.118681443303748586e-02 7.964480739707766738e-03 1.533366395286993034e-01 1.177266807544840727e-01 1.107817280762065787e-01 4.558086020573005187e-02 2.300979139693243303e-02 1.377035634502882418e-02 2.148146181530519866e-02 9.734768058987003370e-02 2.532822212108027521e-02 6.865047648938239766e-02 1.028007960727700051e-02 2.035575656602518768e-02 9.464194132275313698e-02 2.441092404384533066e-02 3.412655011195229321e-02 2.967357850738540359e-02 3.217635373917290126e-02 4.210011457325316120e-02 3.187039247917210910e-02 3.719045210314655958e-02 4.555968298500332608e-02 6.099047601664647072e-02 1.491179934138833763e-01
