6.958432595988954875e-03 1.009653109662293075e-02 7.628059680401273052e-03 9.669929911356360888e-03 7.374888863853233320e-03 1.621408701923490736e-02 1.610474002910613003e-02 4.361360629983809800e-02 7.916211886860903546e-02 3.586054331982423821e-02 2.596664559236633307e-02 2.340971660669896037e-01 1.475835354702258739e-01 1.338805203383357581e-02 1.136229868831056984e-02 1.585021076660452499e-01 9.015769353328104488e-03 1.255190983268500947e-02 1.120998310934841029e-02 4.541416913275203235e-03 4.338446594392707939e-03 7.341176689840783753e-02 5.817087976054203385e-02 2.253305971675570174e-01 5.446213504595799268e-03 3.388628113991671853e-01 1.588192928423052264e-01 1.396844051516122308e-02 1.330089479913373549e-02 1.669615356786819174e-02
2.218307091264736242e-01 1.167337396465745018e-02 1.861011692302316431e-02 1.522600702479917287e-02 1.062749297557097350e-02 5.289623781496606558e-02 2.772117738930159406e-02 3.454817604661477443e-02 2.049898352530496806e-02 1.599217678951007568e-02 1.689113430803067598e-02 1.189774136460513138e-01 1.725349819308405475e-01 1.050746975843036210e-02 1.090663087388883158e-02 7.066738920464290218e-03 8.821085396660302905e-03 2.334391369157943000e-02 1.736044171431879238e-02 6.347463871624903567e-03 2.771598434618448015e-01 7.069477361392965953e-02 1.521466356883635074e-01 1.315499578010322357e-01 1.158525919362198009e-01 1.538134735869453040e-01 5.532565235202621667e-02 1.409722549812199820e-02 2.005040352598056602e-02 2.003159395306092216e-02
6.477175418191977174e-02 6.394747522990076871e-02 1.208452491080165420e-01 9.830125762508326592e-02 2.087664176281536221e-01 2.363697085979613727e-02 1.873656472462236489e-01 1.981059230301621399e-01 8.032867587468785209e-02 2.228548459208043106e-02 5.976511052100815652e-02 4.479589391588969377e-02 1.673417229933978068e-02 2.709877855293800486e-02 5.235401346532889827e-03 2.278196430545136389e-02 1.274794813727416279e-02 2.137605665980921860e-02 7.004741335872825825e-02 1.435876538834975936e-02 1.764271706760101588e-01 5.893274756305640072e-02 9.257530800292161632e-02 3.224811965910157063e-02 1.906258064502347471e-02 1.246398131935893758e-02 1.101541559971657910e-02 8.669937552786126725e-03 1.479490284831238602e-02 1.658863225029675453e-02
2.655603968788169955e-02 7.508109659032509431e-02 1.646966793372145743e-01 1.330484207613296388e-01 6.102185003157159504e-02 1.049034527637770359e-02 1.348357210806683769e-02 8.579462640167068166e-03 1.321302273340103917e-01 2.860873552074344114e-02 1.676712455079206257e-02 3.352134774905265319e-02 1.530493508842102092e-02 1.826260773801226256e-02 1.993329962148395751e-01 1.776249964261346070e-01 6.320090853806630861e-03 8.371698834169105652e-03 5.834673590819603600e-03 5.330120362627364591e-03 3.098746776584704841e-03 1.191501915781167653e-01 4.106959201624686695e-02 8.016861656179723183e-02 1.549286868761382170e-02 1.107657368792908104e-02 9.410929042658557411e-03 8.932032029824118341e-03 1.814097698026947286e-02 1.970656059552338205e-02
1.528728705049850478e-02 4.699665349269847164e-02 1.311336993118719374e-01 5.085804274694449845e-02 3.538476144970897908e-02 2.153796967718839550e-01 1.548220756897513567e-02 2.115327215972529484e-01 8.323249049242528730e-02 6.931473683819215637e-02 7.522326290098667323e-02 7.373145999269722917e-02 1.332100169504920120e-02 2.037793233889909419e-02 2.613927695577680788e-01 1.076444013519984311e-01 2.455959633240743442e-02 8.804979620317497993e-03 1.409553477265356770e-02 7.036841225605698462e-03 5.679812271335613061e-03 1.554018460478682195e-01 4.652693220328538680e-03 1.264150991090438048e-01 2.785193348683586909e-02 1.485948519135590548e-02 1.025794406095363598e-02 1.186429095924109410e-02 1.856083192819885791e-02 6.823490172395020592e-02
2.020627434885986784e-02 2.156214585205204134e-02 8.384154145660699387e-02 6.099253529438157517e-02 2.791194346090122499e-02 1.255492864581634893e-01 1.596153035503855844e-01 1.702592839020643511e-01 1.447596229826879355e-01 1.014056880195970956e-01 7.291830152615746963e-02 5.093328587121023765e-02 2.244403371071125863e-01 8.476157536907662216e-02 7.113139075598072514e-02 1.210175577870437891e-01 1.448340752638194867e-02 1.613207769615979115e-01 8.190109859073096618e-03 2.218294690381535789e-02 3.158200078572673958e-02 2.025087255328822042e-02 6.772113057944711273e-03 7.453199589567047201e-02 4.145928579596840080e-02 3.898419926278224451e-02 2.428657154829900328e-02 1.675134600894647233e-02 2.211326117781154885e-02 3.975390330645951070e-02
1.184560021178974465e-01 1.786968176149827392e-01 1.802595140745005264e-01 1.933658387109290361e-02 9.400954732007783810e-03 1.868405310215185897e-02 3.339926684355355724e-02 1.887235168530856586e-02 1.923425739149884142e-02 2.092137009023324959e-02 1.536396687438043238e-02 9.053575759437217443e-03 1.273679367031472776e-01 6.063737316312951819e-02 3.533950432664827862e-02 5.990606346006773636e-02 8.156278868925613199e-03 1.521029218402848437e-01 1.322053990882548179e-02 1.869837849144571559e-02 1.188696902210755260e-02 1.585069316036538389e-01 7.407331624746772702e-02 6.961279738425189823e-02 2.820632595405835399e-02 2.907210001256220477e-02 2.559524307481923430e-02 2.208900286704418292e-02 2.524615794771972038e-02 6.001322524558683202e-02
6.109128826072387705e-03 1.183861328260427982e-02 5.940364968557602238e-03 1.148388558543155316e-02 1.632495083633468333e-02 1.839894179893172138e-02 1.628298231093526505e-02 1.532388234994737884e-02 1.218267276569338919e-02 7.913315073344407563e-03 1.470954283943806395e-01 1.328900589654562203e-02 1.075553784168863936e-01 3.962206776595741942e-02 4.491611093785487230e-02 8.152919333482717967e-02 1.394238350369424000e-02 1.629154557724424301e-02 1.432942626251642974e-02 1.245189409468180561e-02 2.258163484078299921e-01 1.342195993308253621e-01 5.430462433898505803e-02 4.555174252855570538e-02 2.165416206220318815e-02 2.234359412188544752e-02 3.428600930599909336e-02 3.893729847240357672e-02 3.745433964585930670e-02 1.089897951227021405e-01
1.253961758031981594e-02 8.221844088162870087e-03 4.787572588551568080e-03 2.768977739842135022e-02 2.023523588272056403e-02 8.530447915117190388e-03 2.726904019372608165e-02 1.314938968372134781e-02 1.124996955643682572e-02 1.278027051756728920e-02 9.519044642462230060e-03 1.395586522865393392e-02 2.855916220985849768e-02 2.279371072990257763e-02 1.443514612333053893e-01 1.214176294075131196e-01 1.091556045452416607e-02 2.726024595428017810e-02 2.679667685669136906e-02 6.686716599415465714e-03 6.010912102359641102e-02 6.320639649139334071e-02 6.892717030860384675e-02 4.510305307847336381e-02 2.629983515860479654e-02 3.652784232535936232e-02 1.288738213099465402e-01 2.341159574336325877e-01 1.088678257130874447e-02 4.661047759872844962e-03
2.116188088632775174e-02 1.389371462014414409e-02 2.200326662026693553e-02 2.060699637262370515e-02 2.237278354164389665e-02 1.685527871841817626e-01 2.843769151597849709e-02 1.245385292808337888e-02 1.659136681772234723e-01 6.095640031138795101e-02 1.578878477682382764e-02 1.537568080634276954e-02 3.290695295701058509e-02 3.941769394153905870e-02 1.984075618054226275e-02 2.154196807850967954e-02 1.046026791329131844e-01 1.025986048259165534e-01 4.464483075962945302e-02 2.717560408625703181e-02 7.705472412657343728e-02 4.912161476769674739e-02 5.644165901712394628e-02 6.201999665506779946e-02 3.446596065121380892e-02 4.109863987538220353e-02 6.507683145912478498e-03 8.708486398428381958e-03 1.160396505810629489e-02 1.776027886605167638e-01
2.964519394792415261e-02 1.514189491718090190e-02 2.357799848314123120e-02 1.781661711494664582e-02 3.443757462996103330e-02 1.065317316762888211e-01 1.015868422036883822e-01 9.119478966402477793e-02 6.146103659364744731e-02 1.201730462646709990e-02 1.261597555026462425e-01 2.101087638612917363e-01 4.391776747408178139e-01 2.170229281362871521e-01 4.005112265645930508e-02 7.890385728595791792e-02 1.468244109526993246e-01 4.042589694249425908e-02 1.303090868571744540e-02 1.265577540016872282e-01 5.339773429409222505e-02 4.775852768058951037e-02 6.175221665460731146e-02 8.640735282430278552e-02 9.211356634224850126e-02 4.816305175143423961e-02 7.140812710420105236e-02 5.346524487470167425e-02 4.919720058546632468e-02 3.601165725013821123e-02
1.813719347343717425e-01 9.897847905091275433e-02 3.366541388398778395e-02 2.392680627562009110e-02 2.159372057529934663e-02 1.675131264573422873e-01 7.990859934188587754e-02 5.495299274403314671e-02 6.479124875397238026e-02 2.138198517089676121e-02 3.888140838026412499e-02 2.579347245028191793e-01 4.554422446029258165e-01 2.360580321520973635e-01 8.502352060088938512e-02 9.598425758965094257e-02 1.059647050382691025e-01 6.233095470191919729e-02 2.117141012843295339e-02 2.885946666385367232e-01 5.109345284405275578e-02 5.206032150089134197e-02 6.160040124658357902e-02 1.101477655179638887e-01 1.045528115793363799e-01 7.423067655743284532e-02 5.683164384714649298e-02 5.178895504549817924e-02 5.687472385777830181e-02 6.172556060609271644e-02
4.293860089624816634e-02 1.010629816770452494e-01 2.224510589130461735e-01 2.746044557709418146e-02 1.846559216918774310e-02 1.388018158813751901e-01 7.968130998924073671e-02 7.020901008438601432e-02 8.967580039049076468e-02 1.177985641259409778e-02 1.738803113135684586e-01 8.553223069483799346e-02 3.390183671408434352e-01 1.451358429811719919e-01 4.555315266128177887e-02 5.264515900093989786e-02 1.946060414791883977e-02 2.857433961494131036e-02 4.050495239482077015e-02 1.741380298957193040e-02 4.894637473722047993e-02 5.368829945037384421e-02 6.740950550745510028e-02 1.119943023727976161e-01 1.419189180184303734e-01 1.254557564776480061e-01 9.269120239546901896e-02 8.807084126958342196e-02 7.824259209725879793e-02 6.550484652149959897e-02
3.693799365258639000e-02 1.014062023307936156e-01 1.574094396883924940e-01 1.084422178552083005e-01 6.390788736240551882e-02 2.812433646528497144e-01 3.454187639220891032e-02 1.889753294434403166e-02 1.259805378772654860e-01 4.108508655053652592e-02 1.469232077092642863e-01 1.403620360330719297e-02 1.546259917809786333e-01 2.085001109914660922e-01 2.215877820859803449e-01 2.980849395966252979e-01 2.692613906284742065e-01 1.756155693123403472e-01 4.818765998257416028e-01 2.280231116745624065e-01 2.712706598260027080e-02 3.194930785102551019e-01 2.377940358398605292e-01 1.949216995297580260e-02 3.538630613385881224e-02 2.937669999078933170e-02 7.423711333556755332e-02 3.102783379693702104e-02 1.075835551747007651e-01 1.262385490837680535e-01
3.502329473118004355e-02 3.382562326841937611e-02 8.109294294679125770e-02 4.348767054171352731e-02 2.096223389245090440e-01 5.294017094217980113e-02 1.733246191687581872e-02 3.013176204872769839e-02 2.298361462400990915e-02 1.571284926562521722e-01 4.914808936019102181e-03 6.761382370604913927e-02 1.373412753910137618e-01 1.742415122664096039e-01 1.572431936782628104e-01 1.897355170887086717e-01 3.257627516037539528e-01 5.671365815504952890e-01 5.815411644940802205e-01 4.597238865686340548e-01 2.543302899569686859e-02 3.079523010282489773e-02 2.681350628128068708e-02 6.771359681670940933e-02 8.433517280759830759e-02 4.340407673847125336e-01 4.355670861102144964e-01 1.035895311090883342e-01 1.115031396520809043e-01 8.647328498206552361e-02
3.259306713694393870e-02 3.441583529022593235e-02 6.728562734737543460e-02 7.107598478351134785e-02 4.618682371909658968e-02 5.588578748212981451e-02 6.126055061571508351e-03 1.484941791320986901e-02 3.328946626879877857e-02 1.200320677963076163e-02 1.242880139770702330e-02 9.877417970806807654e-03 7.704477178108301572e-02 1.563844456648017522e-01 1.461225324479289434e-01 2.242091186508833878e-01 3.915030993177430751e-01 4.802636998135316748e-01 2.801268072226692496e-01 6.157356906840882882e-02 3.725509160189167251e-02 2.577529161580777162e-01 3.784729848312530787e-01 6.410358841076136960e-01 6.097522368511427704e-01 8.044291222972475008e-01 6.498977539073260701e-01 2.047008864128729289e-01 1.627946346539242972e-01 9.615399944578750802e-02
4.210301456679731158e-02 4.761760266090663690e-02 4.469666088030686824e-02 4.040013339368085654e-02 5.882676974752980292e-02 1.037103045578867955e-01 8.994950581299251957e-02 2.881627493480699020e-01 1.407321278818911559e-01 2.400433119415266298e-02 1.770928687428848999e-02 2.749139206801525306e-02 5.441056571338857145e-02 8.066424759675790146e-02 1.071125988267457307e-01 1.930956959005025453e-01 4.208293013324341247e-01 4.285107714212242902e-01 2.051069582147748149e-01 7.113033337223054198e-02 3.097853793141948087e-01 5.672331930085527940e-01 7.342686157774162004e-01 7.640002478761273030e-01 6.836251623785343234e-01 6.002245774053521776e-01 8.991653481118666580e-01 1.655162726595554579e-01 2.139450483847104567e-01 1.157210708907474850e-01
1.053024368189116461e-01 8.211332279461501515e-02 3.969094657293030515e-02 5.547795997139183533e-02 1.118105155722904330e-02 4.472926800573145956e-02 2.374468423068017142e-01 1.919185333182462927e-01 1.888699744117751100e-01 9.393050696477640849e-02 3.715985470769534588e-02 1.002370723952548948e-02 9.785246551893464137e-03 2.304309743810725036e-02 5.237703838372922971e-02 2.427101751092965998e-01 2.582305360060538346e-01 3.141278731652623613e-01 5.535815991506196770e-02 9.872425967421231963e-02 3.438920046510977047e-01 7.515002886528371340e-01 9.355543765989585703e-01 9.857693602573061042e-01 8.295396255043863132e-01 8.165955701838513159e-01 7.698610603522053619e-01 6.193698377684228040e-01 3.248944497876338905e-02 2.223045072733589866e-02
4.162616149647267727e-02 1.146626676117934729e-01 2.006654239599339751e-01 2.089089990924056228e-02 3.501551631845166435e-02 4.725040206051710906e-02 1.491384081894233937e-01 1.863648268893564053e-01 1.275218200679935632e-01 9.865494615050607319e-02 2.502131293136088119e-02 2.118689965499517269e-01 4.979227705436582545e-03 1.149899478405332423e-02 1.913759299083751114e-02 1.137869835712805311e-01 4.382733290745330357e-02 1.462825469559333492e-02 2.450868898537666707e-01 3.610458739997576133e-02 1.344447405046865218e-01 7.213447482995438698e-01 9.191659141266436128e-01 9.794307530440227172e-01 7.311017860790610667e-01 3.468032612801073000e-01 5.717964703307325536e-01 3.889180541482768483e-01 3.495408562333041091e-02 1.361866621874815650e-02
1.388936319745488063e-02 2.048042296103917692e-02 1.295939542515509718e-02 1.373677771737939757e-02 2.652165388057679124e-02 1.514878734605273544e-02 7.753921977663330578e-02 9.962862082130577446e-02 9.121579936291576707e-02 2.145311217297399958e-02 8.801391344391182661e-03 1.448425759791720224e-01 2.488300392493452140e-01 1.040100978883228694e-02 2.636940232538966672e-02 1.701733965518711228e-02 3.014496248875116885e-02 9.350924630169092297e-03 1.760174822411865458e-02 8.355218302864261815e-02 4.392851236415820093e-01 8.349812713238380368e-01 8.997401656599831599e-01 8.722926353662336929e-01 6.875901066382028581e-01 5.163125433243658247e-01 5.097594427719003285e-01 3.616863782161625074e-01 5.204328476883888360e-02 2.017389349510556942e-02
2.990025554257412163e-02 2.740980417712335013e-02 1.407316033876736261e-02 1.009749210362737362e-02 1.303661787567230931e-02 6.922542886651298667e-03 4.067473170062134435e-02 3.588156904183187335e-02 1.005996124440497810e-02 5.681231982841950315e-03 3.662026658676622443e-03 2.206528583155200618e-01 1.235122398591465137e-01 5.729837182059044354e-02 1.227650114066075049e-01 4.866701457553807529e-03 1.687319778006506413e-02 3.866703421761500531e-02 3.739530431744630956e-02 1.677166127621642078e-01 4.588730883449412823e-01 6.646009667436381108e-01 2.702803156142979391e-01 4.151532132041080292e-01 5.522195055627160398e-01 3.216332032743193237e-01 2.451598218319301359e-01 2.208598405547002319e-01 2.886753836686130059e-01 3.148397452491353277e-01
2.435612276110023233e-02 2.807770469535334976e-02 5.027972425419500319e-03 3.606016746976993363e-03 3.045071000227916967e-03 3.406836744440779746e-03 5.240804699578449806e-03 1.638487611740689354e-01 1.901097609587242259e-03 3.925131634986345208e-02 5.792969316491974191e-02 9.213527904794502343e-02 8.688023192272209538e-02 2.719536439740236622e-01 9.561859281309231795e-03 8.979461752801370933e-02 1.668490675907710608e-01 2.423709492791930320e-01 1.661552546100347749e-01 1.251872748210797748e-01 8.851862823578945938e-02 3.155860863224150409e-02 1.221440344862152576e-02 2.712347749981144224e-02 1.012144856312998942e-01 3.519288996216056453e-02 3.997758096589443255e-02 1.953488197387530378e-02 5.529548698433896931e-02 5.177777313368369522e-02
5.225026890166792337e-02 4.425859587223662794e-02 6.066435369149579190e-03 2.498418894741025742e-01 4.458934408171204636e-03 2.436419063444096762e-03 4.021433087520025554e-03 5.787161884021112951e-02 5.459252097562663358e-02 2.366343766089967771e-02 5.954952874860560547e-02 1.082871388973863924e-01 1.122179411639744884e-01 9.466363864830351638e-03 1.053815974420217738e-02 5.074622310231712702e-02 1.866217718725607377e-01 3.490289300637621217e-01 3.963150844900599212e-01 3.439211352540773592e-01 7.308496037163236814e-02 1.630010819952508461e-02 2.028929842854988383e-02 5.112497096359078924e-02 1.163656966135643428e-01 3.510788579352486921e-02 1.637922931973710000e-02 1.965550037554653628e-01 7.460246803082525024e-02 7.209553825201341082e-02
6.565746082887861934e-02 9.193105544027880063e-03 2.528641655933824284e-01 1.043734427594533998e-01 1.333380594820517684e-01 2.943985584646252596e-01 3.115583314554178172e-03 4.728801821794992311e-02 2.754918189564466158e-02 3.147363828409510678e-02 5.707974035034953098e-02 9.572370692998842523e-02 8.409739167326710230e-02 6.062527885413086445e-03 1.582473177021167382e-02 7.208087513867653118e-02 1.403140446317349410e-01 3.240222415795244171e-01 4.094611104500860965e-01 3.484279066700579630e-01 1.749355916017151236e-01 1.168239935202508052e-02 9.207975633729706053e-03 1.958025034098424128e-02 1.024727241546060930e-01 5.748573260497707310e-02 6.165966545461293302e-02 1.696134871714038983e-02 5.888912570953387660e-02 5.346642238632873245e-02
3.581961057323536368e-02 1.236605920768709191e-02 5.268073249799594925e-03 5.321487471471453637e-03 1.144368415257136957e-02 7.825352906359163765e-03 3.622728896369686348e-03 1.847337561429530373e-01 2.786455603608373743e-01 3.563988397741528757e-01 3.364484789419128208e-02 3.986322392511584128e-02 5.061582821666671395e-02 9.584787711433381818e-02 6.828850803488131956e-03 2.204771467589312917e-02 2.380844564985062570e-02 1.016001672235053582e-01 1.305057251018481856e-01 1.077361655593772338e-01 1.064071397392153534e-01 1.984038593792753977e-02 9.610985118505228908e-02 1.559208265219815814e-01 1.837936868980261443e-02 4.237917725017040227e-02 1.142132352969687514e-01 7.690542921595427961e-02 6.480388680275651903e-02 5.694567600063567270e-02
1.276612399524119576e-02 5.028220576896036062e-03 5.406303913552071988e-03 9.056177689261899616e-03 5.219890599255030614e-03 2.599980650647985142e-03 1.792039326389751053e-01 1.308201735881706906e-01 3.561269125260106694e-03 1.358303998405664334e-02 1.075155185078928988e-01 3.928819217995956070e-02 5.798357188642919158e-02 1.021613398194153449e-01 6.642346939288328034e-03 1.188326627316111522e-02 1.163736107821113953e-02 2.207293517520247106e-01 1.015930319773388282e-02 1.561933839462483972e-02 3.088358423530904173e-02 2.141550419461141774e-01 1.035324500044719903e-01 2.734161691204714528e-02 4.751356822831301341e-02 1.067625778084837530e-02 5.211286470426094997e-02 8.421971266722751148e-02 5.893185766971320572e-02 8.702122392622385627e-02
1.293551584402915719e-02 1.030678139860399800e-02 5.057831357911235851e-03 3.674862096434592176e-03 3.618156942184843142e-03 2.171430241799705563e-01 1.489005946385765222e-01 1.563556375620103744e-01 1.717127874915978236e-01 5.658534452143125677e-03 1.970113509259494577e-01 1.792879487089147350e-01 1.444304826010368026e-01 1.451118541170379195e-01 5.877350804577947604e-03 7.451920022614458815e-03 1.965536851640281857e-01 1.243379937130702356e-01 1.088070807634023418e-01 8.131421312718947747e-02 6.428426389195716906e-02 9.123136756879032805e-02 1.297153458223631040e-01 2.801622141902120333e-01 3.419657781724804585e-02 2.123569920002626454e-01 3.171821954695433488e-02 2.478388999020383343e-01 2.590062225679908847e-01 1.715570814425420310e-01
1.756661569838263021e-02 9.094093209867809904e-03 5.200340018843918090e-03 7.034517449968613265e-03 6.522618058934785863e-03 3.630777561314559032e-03 1.273253076344215903e-02 1.083291381855210414e-02 2.369207352294822322e-01 1.725513673600285736e-01 6.297904892664166199e-02 1.331229698171274567e-01 8.144995166772446907e-03 8.425828090252530933e-03 2.461930863779868139e-02 2.664841917539411201e-02 2.240581220600801338e-01 2.700808975234739728e-01 1.233226179532766753e-01 5.434560083473986836e-02 5.189447283447641557e-02 7.890341635526422481e-02 1.132840125867212860e-01 3.058328382974810911e-01 2.870879170483772724e-02 7.302346542804817597e-02 9.107115039036234316e-02 1.162647667181111732e-01 3.738825400008171651e-01 7.641361149163382327e-02
2.370161050314389256e-02 2.036545441881134483e-02 6.201422382726315755e-03 2.098713066348845829e-02 2.439074724785143117e-02 4.555059461061645304e-02 3.009516965758348220e-02 4.450934619052721551e-03 2.389896076146093840e-01 1.399618097078062506e-01 4.171942688741409055e-02 4.757809125795142008e-02 5.191884147486922063e-02 1.864103268335625674e-01 2.208272964362689439e-01 9.532055935431085758e-02 7.959018596719118210e-02 8.664240978613782507e-02 1.155643393082436410e-01 6.632151934832133944e-02 4.656564124313441327e-02 6.864666745839476114e-02 7.436763089088833933e-02 1.115736328401147059e-01 4.353540050962464297e-02 5.643982703353041253e-02 8.779161989329392624e-02 1.413403990827447054e-01 1.597094257350837876e-01 3.115098732496930367e-01
1.308583705667084283e-02 3.233736158664171634e-02 9.598137572210901566e-03 1.020381551798607740e-02 4.942557554409447718e-02 5.202368727184247810e-02 3.439679313083593426e-02 2.950081820685676332e-03 3.253178439855029525e-01 3.068768911061673932e-01 1.252941776716201827e-01 6.234657348152114476e-02 3.720467443025016197e-02 5.880809151112587757e-02 2.692749274450413344e-01 7.087747129044733030e-02 1.922576228745065396e-01 3.972643059308279823e-02 5.212516638738199509e-02 1.411194059902713162e-02 6.525732122744314079e-02 9.101957368687393912e-02 7.691991915905646571e-02 7.685926258164446634e-02 1.001930080678151008e-01 7.969657661605256127e-02 9.870152398710860253e-02 1.195334232675953068e-01 1.487517216308034684e-01 7.111444987102981397e-02
