7.699390383659747601e-03 1.156745199202079133e-02 8.663576116879763769e-03 1.094842381068119111e-02 8.324871861913657814e-03 1.825692762313034512e-02 1.809798351533668109e-02 4.891729640168847315e-02 8.862374907125636359e-02 3.856718758792412188e-02 2.717959865523311702e-02 2.467865693983081754e-01 1.520491038991053090e-01 1.319342255651034454e-02 1.107969490487953693e-02 1.626967497800423934e-01 8.821194538674836591e-03 1.221592682476933811e-02 1.095553981430689647e-02 4.492518824064311612e-03 4.331172215661000663e-03 7.572987878181691723e-02 6.003276433015226204e-02 2.455877317777577229e-01 6.563067917119761764e-03 4.680133020650338316e-01 2.402561892111023112e-01 2.161402478266942831e-02 2.034770798052027915e-02 2.457910622631498745e-02
2.762272063807538203e-01 1.456907703082482332e-02 2.307852279019126374e-02 1.884617335020070256e-02 1.312928970105933617e-02 6.541221608455592695e-02 3.428143139304144771e-02 4.261078982524267589e-02 2.515318288665049570e-02 1.841842243057645323e-02 1.847444655231639948e-02 1.275908777043497366e-01 1.782766418899036087e-01 1.041615343356229809e-02 1.067965896415670225e-02 6.898788645730985492e-03 8.630610873596579122e-03 2.270493686173501516e-02 1.693324328089708744e-02 6.277059377602085648e-03 2.849149336942872757e-01 7.262216362465419295e-02 1.561684888758949064e-01 1.448227047188405114e-01 1.474712241045467997e-01 2.230266865484281658e-01 8.570110733142118076e-02 2.148271889809413165e-02 2.991919840801585476e-02 2.911386118523432570e-02
8.173720686131311086e-02 8.657204372673682480e-02 1.628049093498019351e-01 1.323284825597270398e-01 2.807877214081941908e-01 3.182214950885457749e-02 2.683120436244013085e-01 2.830368427282738408e-01 1.073642850536865034e-01 2.748856310041587758e-02 6.770459585865234997e-02 4.676168297310302757e-02 1.663200166381489237e-02 2.688367234525117222e-02 5.170689280505572777e-03 2.238577163580422053e-02 1.246245957851219339e-02 2.077472992537463328e-02 6.817168875696894004e-02 1.416570705838095939e-02 1.808175098042933970e-01 6.027834909248985795e-02 9.448954964622993669e-02 3.587515743644487803e-02 2.514635555704568953e-02 1.877382441241411820e-02 1.611811272327589445e-02 1.260809657845604267e-02 2.137195577605622773e-02 2.378309583051003290e-02
3.349561789416333896e-02 1.014828141944487533e-01 2.226044997454718066e-01 1.798350691703221038e-01 8.277823485730792519e-02 1.424321880716327392e-02 1.842845022201836797e-02 1.167802398085148775e-02 1.892342022638222043e-01 3.548956560260049797e-02 1.902471103281612452e-02 3.487625139539703156e-02 1.523383542551494038e-02 1.863749580154042823e-02 2.135408425831870072e-01 1.928100857523178391e-01 6.558207619869922678e-03 8.580081603274159613e-03 5.976333867336709738e-03 5.479187293871803574e-03 3.215095993596552536e-03 1.284815907651115363e-01 4.419194531593083342e-02 9.353707475815595251e-02 2.077305155612082718e-02 1.656732392164571993e-02 1.417998801857976374e-02 1.343931343616728592e-02 2.726216300676570850e-02 2.956807363575896658e-02
1.933665701556636779e-02 6.355242639680722117e-02 1.773264382638725656e-01 6.877363461803595590e-02 4.814390878551670638e-02 3.100894185887910770e-01 2.118883374318563176e-02 3.027677374298925472e-01 1.187756780058861206e-01 8.591671960716190659e-02 8.511840061725735318e-02 7.705176596885464357e-02 1.350341580259415558e-02 2.149799514662085673e-02 2.951699144780992601e-01 1.264020802714951042e-01 2.777375488225470451e-02 9.810234982143145599e-03 1.568754283847526021e-02 7.773002069815479996e-03 6.306414601644778038e-03 1.818583413992086173e-01 5.229211345345721740e-03 1.562827688954412375e-01 3.769786902906263615e-02 2.170213247512664881e-02 1.577018846584398240e-02 1.822547044214537990e-02 2.849873823875299569e-02 1.046832539445644583e-01
2.585597706927222905e-02 2.945311514077342957e-02 1.140270742087672318e-01 8.271710086260967987e-02 3.802928816159841657e-02 1.805559329900962295e-01 2.287489216114834412e-01 2.431035465324226374e-01 2.059473382458661683e-01 1.251826762601783438e-01 8.226873238772591801e-02 5.330392490915826509e-02 2.386852048954984928e-01 9.514815846560190082e-02 8.500728719723378568e-02 1.542616795989687484e-01 1.778571179092312826e-02 2.073164008801305636e-01 9.905937016680722851e-03 2.651794277897483870e-02 3.790215149305029008e-02 2.434029841557379739e-02 8.241042992598370323e-03 9.744312512280565997e-02 5.659308684831433622e-02 5.534465666066736705e-02 3.566132980487415199e-02 2.457617703873863843e-02 3.242896885680078556e-02 5.825289993773445640e-02
1.531151988783644446e-01 2.463247795982820010e-01 2.503066585456342752e-01 2.552932433931251119e-02 1.249542928793656929e-02 2.495303119301414338e-02 4.457626161230974354e-02 2.506968204657179788e-02 2.534884951148701909e-02 2.557336859460163439e-02 1.725237164195090114e-02 9.478352374675341752e-03 1.361651101608618297e-01 6.952813652922547327e-02 4.394748391630583229e-02 8.076107345526885306e-02 1.058602323911110067e-02 2.075720200664415982e-01 1.690281837900719369e-02 2.391350727324167286e-02 1.535693066311363125e-02 2.159953175930953151e-01 1.009642882296960392e-01 9.503628116411995397e-02 3.860179489441931816e-02 3.987441494895407196e-02 3.519184460705915979e-02 3.035535555323398346e-02 3.467644971893138472e-02 8.233877414780861603e-02
6.514579612174796475e-03 1.326045080318757376e-02 6.820335578841945148e-03 1.353534760506319885e-02 1.975583649679778925e-02 2.251508138201573778e-02 1.992071650233579946e-02 1.874559116804118755e-02 1.490173461722906281e-02 9.155820235808045243e-03 1.684852276557973205e-01 1.374677698775100126e-02 1.140432428171566925e-01 4.403186461373617688e-02 5.275617055518840720e-02 1.015684509774512218e-01 1.667547810122862670e-02 1.926087699885671231e-02 1.692564195230762680e-02 1.480212709003152563e-02 2.837628554410090431e-01 1.686819735482760207e-01 6.825977303975133692e-02 5.736452713214520299e-02 2.734506818333230435e-02 2.828937002303919673e-02 4.358129451432850993e-02 5.060274996349889420e-02 4.973996600162360060e-02 1.477079187902964885e-01
1.213915501713982645e-02 8.052749434739983267e-03 4.815848153889518493e-03 2.896792294599579570e-02 2.226261929173479343e-02 9.600248651983023587e-03 3.083122823273035801e-02 1.497466525688294706e-02 1.286373653215241129e-02 1.409177463103406316e-02 1.003298882925567417e-02 1.419822583976141153e-02 2.864162190846538530e-02 2.356910244542781072e-02 1.602636752028321621e-01 1.393442836964056131e-01 1.194622449974706846e-02 2.959801923646625602e-02 2.908712486073439588e-02 7.363164751627801832e-03 6.944725895405863547e-02 7.304374513284282722e-02 7.966585765552280929e-02 5.222357983164417627e-02 3.053397212165675362e-02 4.250434726276589026e-02 1.507474342293684544e-01 2.867736580749229436e-01 1.340251114259022845e-02 5.935555454897424761e-03
2.336915072916031372e-02 1.489823229153945487e-02 2.169543227774468896e-02 1.989945456861309803e-02 2.257601406604237138e-02 1.823051717835859065e-01 2.999962022035497500e-02 1.326916128995384025e-02 1.851991822198589821e-01 6.673215509011623525e-02 1.604561545032265682e-02 1.529243986742469426e-02 3.241306697578538037e-02 3.923456226111331213e-02 1.992361680594965240e-02 2.176879059498531763e-02 1.054735952054284553e-01 1.032882227141695419e-01 4.513495145211827986e-02 2.779349303997145221e-02 8.237741603889031650e-02 5.257085792522776108e-02 6.044573690593261356e-02 6.652863520448649981e-02 3.704939828571387345e-02 4.426287288266143177e-02 6.881093656281294518e-03 9.683543743590027411e-03 1.376591042466471064e-02 2.352601747720340086e-01
3.582554143965309412e-02 1.790573922162148196e-02 2.511367126946933287e-02 1.748523825347396421e-02 3.337473619710303735e-02 1.085571777359051193e-01 1.047262748228950519e-01 9.503748756175182943e-02 6.462677679092765359e-02 1.209620700831546408e-02 1.246496454704377893e-01 2.063197729505775180e-01 4.297946372211802757e-01 2.122377602033989064e-01 3.914235039215717415e-02 7.696815902382637964e-02 1.432216802875072581e-01 3.944885913651836190e-02 1.287541366656145408e-02 1.303161863213537219e-01 5.504949635948322428e-02 4.929214643966379344e-02 6.377296259730226569e-02 8.931326322532387452e-02 9.531349695862900706e-02 4.988060942712935208e-02 7.431316460070762353e-02 5.946369263630592317e-02 5.939027341755608036e-02 4.722242937505736343e-02
2.252594883216088306e-01 1.210941338954520941e-01 3.742069164559525679e-02 2.492316560222508984e-02 2.148703653438746933e-02 1.703494281820413514e-01 8.184849346027300854e-02 5.666367393380523920e-02 6.711121530298878868e-02 2.090618916673133570e-02 3.755786834813844288e-02 2.506821030094379399e-01 4.452404567579063555e-01 2.311614287731056927e-01 8.339406684249436874e-02 9.429465454921476253e-02 1.041452670666380143e-01 6.127657809424796875e-02 2.106926815939356989e-02 2.980432041999264703e-01 5.278844701273210233e-02 5.380209908484261117e-02 6.368911809968193227e-02 1.139505842372005862e-01 1.082380306330367747e-01 7.688749415073892202e-02 5.915277775257139770e-02 5.741934637165895666e-02 6.818159087416221509e-02 8.007950041623923543e-02
5.320179728263169094e-02 1.242258414883986029e-01 2.636353264730320056e-01 3.060005190681338444e-02 2.000596399657004684e-02 1.533786678715673424e-01 8.831879523727625969e-02 7.803833159315191892e-02 9.957818526352577027e-02 1.177605841852973068e-02 1.741531329994200350e-01 8.242927048894391207e-02 3.311370180333793045e-01 1.423367970921818604e-01 4.485359183086976009e-02 5.204352159378870801e-02 1.924864465631465071e-02 2.826438546601753310e-02 4.040077094584111628e-02 1.743711375466077199e-02 5.065220067486769784e-02 5.553827449783733938e-02 6.970253571391166192e-02 1.157804438638174865e-01 1.467158941377558201e-01 1.296936065485276846e-01 9.627332625505533037e-02 9.722996589605875650e-02 9.308695336855395130e-02 8.400021886091128820e-02
4.565358861953414810e-02 1.252997857603859733e-01 1.934521881462016868e-01 1.325719528626258525e-01 7.811614289387891485e-02 3.436917022549428324e-01 4.098458573986587389e-02 2.227308694901057942e-02 1.525210311376737904e-01 4.481351871489526462e-02 1.472230659479741022e-01 1.339933585905462091e-02 1.507639487822899360e-01 2.048213627613904575e-01 2.190824488604108944e-01 2.966701669820737131e-01 2.681218909771168057e-01 1.748226456388733419e-01 4.795694756083636601e-01 2.268422412825530365e-01 2.726305326463087167e-02 3.308788964436158997e-01 2.459874710656588248e-01 1.955011407949144853e-02 3.519227957921905459e-02 2.905963606250527159e-02 7.346741749207491567e-02 3.266901542852145013e-02 1.268823697586499710e-01 1.598084442981689557e-01
3.910948732818503998e-02 3.810703207547126714e-02 9.391819719257508969e-02 5.064666646681117990e-02 2.572914767352701970e-01 6.562409834013645249e-02 2.078510199908832276e-02 3.568845086704897085e-02 2.712900968064599697e-02 1.731022096625235429e-01 4.746231607675704088e-03 6.468417184285699117e-02 1.343934550626700586e-01 1.714232900596111553e-01 1.554950677750391308e-01 1.886110706820045002e-01 3.241482644749218434e-01 5.645838451288038851e-01 5.791711208101351094e-01 4.575174186279228894e-01 2.547024241510573161e-02 3.087172011319393172e-02 2.677695337575843049e-02 6.730547650868029530e-02 8.386755506477527877e-02 4.346904280743658644e-01 4.414375180294992651e-01 1.111089281161025122e-01 1.335162878182031276e-01 1.095610305854020361e-01
3.329159821969018829e-02 3.561824721562667495e-02 7.311226768845380253e-02 8.164118941232270665e-02 5.620068513148934741e-02 6.929229224484004246e-02 7.282537041307860295e-03 1.754802550248654031e-02 3.909537402536288064e-02 1.266269189168598569e-02 1.199307570786577182e-02 9.476290035721195160e-03 7.570664894750714358e-02 1.540787020013711095e-01 1.443513377692886568e-01 2.220804845435246089e-01 3.883647983934482850e-01 4.770829608144996903e-01 2.786598648628209052e-01 6.123414892659564956e-02 3.690274640662175726e-02 2.543039605149978177e-01 3.719410125077913243e-01 6.376995253858053214e-01 6.205838045762978039e-01 8.404052864535644929e-01 6.988748746776848320e-01 2.292254110193331917e-01 2.003948204761943908e-01 1.228590725582547338e-01
4.231343730123357516e-02 4.769725674687939204e-02 4.613300101509945628e-02 4.485822173055087347e-02 7.100955665393049454e-02 1.286158246135370997e-01 1.067038033415722703e-01 3.408678096015078651e-01 1.647245818376606996e-01 2.526846983782387451e-02 1.707306997524427397e-02 2.651216069704519923e-02 5.368331673142139049e-02 7.959607971868098986e-02 1.057145594977980801e-01 1.905085607334625897e-01 4.162490032994209388e-01 4.247970049222583588e-01 2.038007769159089766e-01 7.068765931656433021e-02 3.064493294422471759e-01 5.586258092387818008e-01 7.199822885585899224e-01 7.663100337968770104e-01 7.151755850277780047e-01 6.583932783532767674e-01 1.029441922181528524e+00 1.932195032767752008e-01 2.705175644237836630e-01 1.490586429780462741e-01
1.100536584499412773e-01 8.448806049462873058e-02 3.982303738797144527e-02 5.938018837685066220e-02 1.275551565259894909e-02 5.225305823101393521e-02 2.767518460182573636e-01 2.235627821701263451e-01 2.178260980826983162e-01 9.816781085327197509e-02 3.593514286706788602e-02 9.762970617051870692e-03 9.738830391126209948e-03 2.282637260193813578e-02 5.180588909616286319e-02 2.392922587971262893e-01 2.555138529734835018e-01 3.121548052309195409e-01 5.515325243708171093e-02 9.835158542450589403e-02 3.403184746098354418e-01 7.396823278589588213e-01 9.160618590698111907e-01 9.983887817353569449e-01 8.945395255965095105e-01 9.405546472634643829e-01 9.337367244343481865e-01 7.519285989382492597e-01 3.973974505874344754e-02 2.725210660028176343e-02
4.435273108648485341e-02 1.189372678472940120e-01 2.023529979301420534e-01 2.061196524282502690e-02 3.615102483824366580e-02 4.968010793733444730e-02 1.569533256057263348e-01 1.963296816141338885e-01 1.335395285808060606e-01 9.744089354073084963e-02 2.426546693874075122e-02 2.173358545478151216e-01 5.082750274598739175e-03 1.182148607707941140e-02 1.978170407891316485e-02 1.195366881061063202e-01 4.624527929532150361e-02 1.550901767138597453e-02 2.729691211145022223e-01 3.836360742797458728e-02 1.419656453422166731e-01 7.579090891203911218e-01 9.611212333821699261e-01 1.054599179022513100e+00 8.221511301903773328e-01 4.063977639138278697e-01 6.924493875919593977e-01 4.709784392082720927e-01 4.233163032420623334e-02 1.649219425301755651e-02
1.450237437530332157e-02 2.073183480781925700e-02 1.280135038391473634e-02 1.330897878849915741e-02 2.540547011765595387e-02 1.464268404007184818e-02 7.508423428245243614e-02 9.666915445909732285e-02 8.841263218733068363e-02 2.070627092753642151e-02 8.739332905475474811e-03 1.502178899918935329e-01 2.650824820346919242e-01 1.110687102396455683e-02 2.880737803483517101e-02 1.930742853998708777e-02 3.434492580320205185e-02 1.070833844336251811e-02 2.021892453473972742e-02 9.597312458214651842e-02 5.017818638660136443e-01 9.497335569541788258e-01 1.019227857922640812e+00 1.002034940324288748e+00 8.044072015292980105e-01 6.147722863166199536e-01 6.155560869997055429e-01 4.380602139780759297e-01 6.428118194334202229e-02 2.498753835744366852e-02
3.145107533960986301e-02 2.746295388469551305e-02 1.392173879156370642e-02 9.875534348520943057e-03 1.262533373399108913e-02 6.705560460491328395e-03 3.956685493149180582e-02 3.499369258925735804e-02 9.863019450967219076e-03 5.637010521469183397e-03 3.745163242900399585e-03 2.312353873541836968e-01 1.331695836265969213e-01 6.546217796013743817e-02 1.498948735156459822e-01 5.949173814800955314e-03 2.072281713691164276e-02 4.763549413594532489e-02 4.621543648971766782e-02 2.074434243034136705e-01 5.656011725081925290e-01 8.165593125281092046e-01 3.311008427319865888e-01 5.064470099349448473e-01 6.705738075895411043e-01 3.887892339044254908e-01 2.952258681865205792e-01 2.672570338471388918e-01 3.726786104869296845e-01 4.064794697206494112e-01
2.398987911018020738e-02 2.654549379337048376e-02 4.916273568801724989e-03 3.617201639978517239e-03 3.131011894853024530e-03 3.458476910940936656e-03 5.321979324358996379e-03 1.717749239772191627e-01 1.936607939705012717e-03 4.109247866692286588e-02 6.086043567311846120e-02 9.695805386744618670e-02 9.386633525982743254e-02 3.127342722803357900e-01 1.125296569488659811e-02 1.112941410148324678e-01 2.079877402739377379e-01 3.035146788114689853e-01 2.090190129196665136e-01 1.578075059743802855e-01 1.113749465188997867e-01 3.965005795556841850e-02 1.533101483836249446e-02 3.361725461295438783e-02 1.233942423804972599e-01 4.218250636511394064e-02 4.763914934008214863e-02 2.358803358414597248e-02 7.012240631319383022e-02 6.569384036833224305e-02
4.603046276576672896e-02 3.870760502048990748e-02 5.631689358445282623e-03 2.587956291017264876e-01 4.934765027018098507e-03 2.659919601294147458e-03 4.283415604707850252e-03 6.175582044184489694e-02 5.714590448298536435e-02 2.479674303928190021e-02 6.246351575353925600e-02 1.135971268494959940e-01 1.197947149828145902e-01 1.020718550498850123e-02 1.168492792024548865e-02 5.814971810911975791e-02 2.151807945786003984e-01 4.044579418954599159e-01 4.616360676742856661e-01 4.013896474216172572e-01 8.505591459703740198e-02 1.892626399025227127e-02 2.351546065690642354e-02 5.869978303250195095e-02 1.320146473627413497e-01 3.934152428836595189e-02 1.832814300001637392e-02 2.329239828989760619e-01 8.851869048721566768e-02 8.556886651162527724e-02
5.802648777952422454e-02 8.332602860320375421e-03 2.294287943849189770e-01 1.078563539357306894e-01 1.621319686854367226e-01 3.563185142074647982e-01 3.477374922521271269e-03 5.136905697148019811e-02 2.891279889794732411e-02 3.298680521778617203e-02 5.974706657638888252e-02 1.000289314407993013e-01 8.865835865192354948e-02 6.321535874610604948e-03 1.652140333240835479e-02 7.639409442311730081e-02 1.494476852597731442e-01 3.467467763322120700e-01 4.394570182511708945e-01 3.740199563728462961e-01 1.870662582847044952e-01 1.254127964375498401e-02 9.892078280778393920e-03 2.087957082041492704e-02 1.080164871200862270e-01 5.994532888745393584e-02 6.447016743637451475e-02 1.797996028877057312e-02 6.522048535534796798e-02 5.921554831983621980e-02
3.726236294375327718e-02 1.305566104548531656e-02 4.395129296511500472e-03 5.335105265066169243e-03 1.444103222734383768e-02 9.812257540446060744e-03 4.239051754439141992e-03 2.040457868728188240e-01 2.925834860902636891e-01 3.732912152188615496e-01 3.513557177081483296e-02 4.149898376991917326e-02 5.270067640389110991e-02 1.001662478451209315e-01 6.857431289372335759e-03 2.187067736993925787e-02 2.376354885475158094e-02 1.015411904080948391e-01 1.304651661705172050e-01 1.073012947857567984e-01 1.061932366398424532e-01 1.996560391846591981e-02 1.006928643037222071e-01 1.631461923234528433e-01 1.808870255809937391e-02 4.146925444528771348e-02 1.115854783424781727e-01 7.568615719392313146e-02 6.752744504932020608e-02 5.932213039010311717e-02
1.374108166345518189e-02 5.412346803486004464e-03 4.435212704886011548e-03 8.966867370893603917e-03 6.606873303118448830e-03 3.284420103388758193e-03 2.155052269167826440e-01 1.449628417475292974e-01 3.713563845340158570e-03 1.407985599215678431e-02 1.122137014753238904e-01 4.085761902090272873e-02 6.017990895796229700e-02 1.059983304754063826e-01 6.631539309673696071e-03 1.178053118748800809e-02 1.164751764330128336e-02 2.283592536676418150e-01 1.017382381836495417e-02 1.556400663510630958e-02 3.072109114620105025e-02 2.199518476276477452e-01 1.061519487655433608e-01 2.703269745019840770e-02 4.667887096704215893e-02 1.035047769348502664e-02 5.102541686956271055e-02 8.293361054969869417e-02 5.854533969690665918e-02 8.884006151393866735e-02
1.395144435426880040e-02 1.105268134966190530e-02 4.152219303576791705e-03 3.647279621566821683e-03 4.589868973740343118e-03 2.841781576985213942e-01 1.789048034710263857e-01 1.731087230482316330e-01 1.802938594995951993e-01 5.853367835014229581e-03 2.056208817056591753e-01 1.863963146303924123e-01 1.498768696607154227e-01 1.505420896751716864e-01 5.848774422402721468e-03 7.461360890307203175e-03 2.037784533129098907e-01 1.287197097696822223e-01 1.124183459280442554e-01 8.387905210851909210e-02 6.622356248205447937e-02 9.387291135567851774e-02 1.333224727327887993e-01 2.875532786645681460e-01 3.391661086571891998e-02 2.175038482983547572e-01 3.146713475601207316e-02 2.535970872394388009e-01 2.648455680727747064e-01 1.752063216108955823e-01
1.898505876814141069e-02 9.715930462756603228e-03 4.272405821599042225e-03 6.998637183895906576e-03 8.288433655917125734e-03 4.550702389397746905e-03 1.474278522482915660e-02 1.170830739757267557e-02 2.487952197430192136e-01 1.807289738041308047e-01 6.574043297959844545e-02 1.383922746793287972e-01 8.364089676724540887e-03 8.552509680413952417e-03 2.477598182877090160e-02 2.679356680361940496e-02 2.323173271196404821e-01 2.796259573058147430e-01 1.274291967409596493e-01 5.608874218195444156e-02 5.353054237562332451e-02 8.135113496332235794e-02 1.167510708616094489e-01 3.145015143317771988e-01 2.863988542641536517e-02 7.485870621281835724e-02 9.329307534003986047e-02 1.190569707287212620e-01 3.826062066177067233e-01 7.808157004107006693e-02
2.476007692018820233e-02 2.108915817032544146e-02 5.131573872549700412e-03 2.106633876034109953e-02 3.093816729212672118e-02 5.681224211719985290e-02 3.469195686046560451e-02 4.860922084339799193e-03 2.530322727784423131e-01 1.475457788056851183e-01 4.375902014883962382e-02 4.962314927933043907e-02 5.398710118282266934e-02 1.937337314177262626e-01 2.293346932557603357e-01 9.893559013743691288e-02 8.253459995583123376e-02 8.969540080535506887e-02 1.193835617166714436e-01 6.847924783623829392e-02 4.812014407149698553e-02 7.097801490628581622e-02 7.691048607892579658e-02 1.150393904655468147e-01 4.379921850606627309e-02 5.795395067947561873e-02 9.003486052189976774e-02 1.448614460666798331e-01 1.634664039186128071e-01 3.182684847036273412e-01
1.137642995565532611e-02 2.852757296282165331e-02 8.464890840038923059e-03 1.078756505243565027e-02 6.309732398678244425e-02 6.682254323707971511e-02 4.271385116241648017e-02 3.602588239819631919e-03 3.972223853777144820e-01 3.649635576221916811e-01 1.452089533854379333e-01 7.040285569370324792e-02 4.098463663820504227e-02 6.341388607334511041e-02 2.848138325532729720e-01 7.381115740378947632e-02 1.997742339735052997e-01 3.976870181560336615e-02 5.166215161794733557e-02 1.415185934279338843e-02 6.734322693823011075e-02 9.396631760146216539e-02 7.941902863570646232e-02 7.920348398852025684e-02 1.030837498960385096e-01 8.190764563525423925e-02 1.012425045316086430e-01 1.220918557439949759e-01 1.512425038149390333e-01 7.013367264447563365e-02
