6.305489700050733587e-03 9.264429399265052684e-03 8.078547445170017327e-03 1.020608415889933014e-02 7.754391388292728067e-03 1.699130624252954275e-02 1.683940537852297858e-02 4.553053727878413059e-02 8.249871856416819693e-02 3.724385014425361101e-02 1.729491046037019350e-02 3.952173465187761373e-03 2.316692419493710138e-03 8.592821234673834671e-03 9.919994155728957194e-03 2.156550079859495886e-03 7.461090423209747712e-03 1.280921318976837101e-02 1.134885709544857998e-02 3.915043659906951995e-03 3.699806982700441782e-03 6.493343781568522433e-02 5.124522588131090461e-02 2.198573515982662086e-03 3.495401929757687483e-03 2.970947799233955751e-03 1.392812241105930438e-01 1.255405875913884715e-02 1.192764035303825118e-02 1.490011979268286539e-02
4.970818152126878914e-03 1.095099614658840738e-02 1.966658974770829280e-02 1.608260608639186517e-02 1.120053594964926652e-02 5.000777045980946134e-02 2.365038508974021472e-02 2.976291499130551479e-02 1.934067854850866561e-02 1.662026484871781395e-02 1.177634645729835200e-02 2.308521073210093814e-03 3.067234876620673900e-03 6.966399962021573369e-03 9.661429405789481034e-03 6.132186359186189012e-03 7.434440940448826945e-03 2.378455744715995968e-02 1.749786180298251378e-02 5.135512648924402124e-03 2.204632878933806151e-03 6.151813105494905592e-02 1.328697997913776130e-01 1.149107852066478253e-01 9.870781057137427428e-02 1.337261308051445052e-01 4.820111101015919081e-02 1.264748520909543018e-02 1.795131516907016306e-02 1.786049902199144529e-02
6.006036374196133815e-02 6.048090125871832118e-02 1.278700906925383241e-01 1.040808797882231684e-01 2.207417623625103908e-01 2.240163658697193888e-02 4.133645915880711577e-03 4.410340603474576307e-03 7.044441517743012249e-02 2.169559317012379612e-02 5.862713489772582165e-02 3.921143453504631615e-02 1.443594070329957436e-02 2.096888342058707277e-02 3.987864809152602379e-03 1.657847158703100454e-02 1.089317358503169575e-02 2.172391332263158212e-02 7.019174957882307053e-02 1.133763600471777815e-02 1.387789893016512250e-03 5.078144672929321007e-02 8.173198289730128352e-02 2.847636659432033895e-02 1.683443516508336540e-02 1.107314080453145576e-02 9.867388524179390372e-03 7.755049048448254059e-03 1.321134394458991362e-02 1.477008207511324410e-02
2.784424799383723725e-02 7.889905059567980938e-02 1.731835687592118145e-01 1.399564920488192143e-01 5.704177604038117300e-02 8.786525034218485575e-03 6.910178892971350836e-03 4.809825573817949965e-03 2.933808841896406745e-03 2.775219571700858479e-02 1.742206315221617868e-02 3.475824745181039371e-02 1.574878684434887974e-02 1.038205870899000689e-02 3.382222105431273353e-03 2.587613097322050051e-03 5.357092798780980526e-03 8.481592075896203856e-03 5.847814450448658198e-03 4.861953845100061566e-03 2.547664441804707667e-03 1.036738659587651268e-01 3.576954862499665683e-02 7.072313291344031749e-02 1.368285326389286939e-02 9.825222743342559156e-03 8.407828520273644482e-03 7.974284198979103913e-03 1.619659504125363358e-02 1.756806423476462223e-02
1.597754735302786555e-02 4.896845587861269056e-02 1.366931892792451197e-01 5.297692747860697354e-02 3.003614316491875699e-02 4.370950388113256993e-03 6.687548072796071011e-03 3.879883345259258886e-03 7.424697293164572720e-02 6.324611556898127041e-02 7.774930186174447422e-02 6.611778793174026558e-02 1.159234467013566319e-02 1.183738919846811719e-02 6.762141859411653980e-03 9.286785226919637426e-02 1.924348704963521270e-02 7.879248604148344354e-03 1.240904758365933558e-02 6.995940888971210851e-03 5.179023397697995676e-03 1.465324268915790297e-03 4.231900318447247983e-03 1.113489357393266793e-01 2.460715245581521562e-02 1.315582535025825416e-02 9.118245032243345663e-03 1.054959502617697741e-02 1.652588244265356873e-02 6.073881038842923047e-02
1.880144366681934381e-02 1.901248596423364690e-02 7.317110331441767368e-02 5.861892777134982552e-02 2.310897022096521786e-02 2.484903379941275602e-03 3.042181472100336827e-03 3.398719367919348332e-03 3.203225659403972480e-03 9.766824210026052444e-02 7.490198481520730922e-02 4.563462110360087809e-02 7.685605080966852881e-03 7.429567088329946944e-02 6.259931668408713623e-02 1.061474251705001176e-01 1.187792539415975790e-02 2.023275948016155321e-03 6.468534623310899165e-03 2.206696889754268184e-02 2.620344391922980326e-02 1.644819729479040510e-02 5.607534917087358267e-03 6.564577679132616028e-02 3.663535151827040232e-02 3.445205841026575261e-02 2.146969065890201936e-02 1.482812258769545567e-02 1.962410892897925932e-02 3.530359773272884194e-02
1.098732233621200483e-01 4.057460073120750486e-03 3.624372875192115664e-03 1.834649960964772342e-02 8.777643297789726809e-03 1.463536502996098596e-02 2.236117519602972767e-02 1.283265939659081374e-02 1.539322532030620513e-02 1.803089012772905383e-02 1.397596073149262770e-02 7.369369939700635627e-03 1.135295417466111040e-01 5.408412924544062084e-02 3.172554031521322010e-02 5.402699800038181233e-02 6.910079606075203440e-03 2.103006618271779406e-03 1.068070509231777362e-02 1.451963028621590553e-02 8.712506092465051311e-03 2.611434515804703788e-03 6.480348783860577500e-02 6.136205653012487965e-02 2.492635831416077641e-02 2.562979995354592797e-02 2.251015999592134026e-02 1.945517554746874558e-02 2.232541012103514758e-02 5.318096743082208200e-02
5.703435269018701168e-03 1.033189035477505638e-02 5.086552958021262408e-03 1.092035137820160200e-02 1.672958336046856745e-02 1.888498860770601237e-02 1.683922989414857879e-02 1.597440521157237822e-02 1.280466583869462049e-02 7.196663825901981199e-03 2.907583542952295579e-03 1.193020856987970536e-02 9.675368078435074570e-02 3.563650434428276143e-02 4.039131322199625979e-02 7.338066644211690970e-02 1.272211404615278436e-02 1.454221208414348092e-02 1.272499846178607591e-02 9.777815898758026800e-03 4.404246526236541871e-03 1.158821181258644084e-01 4.724978975381820961e-02 4.007636506327996728e-02 1.913143167383755255e-02 1.970251310838088202e-02 2.925367624875152908e-02 3.354182970696840266e-02 3.248104794942827112e-02 9.629012296329372833e-02
1.295848421744632065e-02 8.498441077022068219e-03 4.932084216564304457e-03 2.840875365018753762e-02 1.826368779331385278e-02 7.747136883113026236e-03 2.499555358305612790e-02 1.125654484047698863e-02 9.560615466871267079e-03 9.457564108250082410e-03 8.469276168668670585e-03 1.238461876580047340e-02 2.861718366838670452e-02 2.269188355851494560e-02 1.297378492372132097e-01 1.089112774286754987e-01 1.080746612384950352e-02 2.704567787848443164e-02 2.654476771998269188e-02 5.449359641741541825e-03 5.260482678724510280e-02 5.503118100605018659e-02 6.043018479059777265e-02 3.970925128681986049e-02 2.327430577989387378e-02 3.230823545262383190e-02 1.116861281329908084e-01 2.387368698733659863e-03 7.030400663366983757e-03 3.479555185545179109e-03
2.180411792794019823e-02 1.430500908270521988e-02 2.254248698972714793e-02 2.096476504075582559e-02 1.999586934232774546e-02 4.719883544326485166e-03 2.585066678659439857e-02 1.090099766339040939e-02 4.016489049974754193e-03 5.650439291521549418e-02 1.633180054648089574e-02 1.568520774440545704e-02 3.315544974702680503e-02 3.942725131965897634e-02 1.970831217279395489e-02 2.128069532062753719e-02 1.033183015555283468e-01 1.013231970407043742e-01 4.374871061917579018e-02 2.617061954496771245e-02 6.818550855347538242e-02 4.333669906754395590e-02 4.962768943356751089e-02 5.470412844820708026e-02 3.055561093558534225e-02 3.652313541878925846e-02 5.554811867969808650e-03 7.123763722364579581e-03 7.652439831828616867e-03 1.915674884350692308e-03
2.037219249205938013e-02 1.068058807419069826e-02 2.354880894983670675e-02 1.805977696455573003e-02 2.490948088568994273e-02 9.467611011184122460e-02 9.173685481080458282e-02 8.414761945376471319e-02 5.737673623321881688e-02 1.004647581664382984e-02 1.302458878119095720e-01 2.141374101465028934e-01 4.424220805101378162e-01 2.172652240886353281e-01 3.987136016473431105e-02 7.816822008951325451e-02 1.451861183938463473e-01 3.989025998682391161e-02 1.018096415290722402e-02 1.107112627442898706e-01 4.672565441308179635e-02 4.217898467535956958e-02 5.440519625559540190e-02 7.633281261519257732e-02 8.179408336205512553e-02 4.294404925337438200e-02 6.381525076239430438e-02 4.741390294185583720e-02 4.293232825840837680e-02 3.120681229396165060e-02
6.377453788804494754e-03 8.744025861999252247e-02 2.435734225226856425e-02 1.711199814253442503e-02 1.704031381776579396e-02 6.374213009563587003e-03 7.196226583904359597e-02 5.059145768746627081e-02 6.041582514050134606e-02 2.143751714389786553e-02 3.877772474960099885e-02 2.554215084108142908e-01 4.583401538087044091e-01 2.366837450643090035e-01 8.494268689355377600e-02 9.567411693534355610e-02 1.052782085082140801e-01 6.166369509586058090e-02 1.635020939082760388e-02 6.031858833389774910e-03 4.470036222056386621e-02 4.594080488691782566e-02 5.427395015390087257e-02 9.732337075992833486e-02 9.282007265498631865e-02 6.615252126109344433e-02 5.073248182127915173e-02 4.565364679481008492e-02 4.960614696022303677e-02 5.327258650613370811e-02
3.862546992082708380e-02 8.875507760539615154e-02 1.001116497711668739e-02 1.494082441294137392e-02 1.119951681221314360e-02 1.208478293085322869e-01 6.989708308445442830e-02 6.400957723314121273e-02 8.248134825097827583e-02 1.123533026084956241e-02 2.761886604123848024e-03 8.084612995763033882e-02 3.405432583064026963e-01 1.457112580995838236e-01 4.570393028303589011e-02 5.281948092745780005e-02 1.942990998707675582e-02 2.836354526039330110e-02 3.210492764385682735e-02 1.378670865694471039e-02 4.229048094848067429e-02 4.641308320719834957e-02 5.834591920205537546e-02 9.819597346473692145e-02 1.257052234894623644e-01 1.114283208809116049e-01 8.235286689819681927e-02 7.696909688760984747e-02 6.742398138216790238e-02 5.558898212799525534e-02
3.383534872408368310e-02 9.111522650249163913e-02 8.885846310302524323e-03 9.194929039321775299e-02 5.448214612772497856e-02 6.890186971411436934e-03 2.368093445438104738e-02 1.860376364964184265e-02 1.137742241675542415e-01 3.673390518454294762e-02 2.034516424463784969e-03 1.310747298995686844e-02 1.549857686931028211e-01 2.096224553620990860e-01 2.232477056336602816e-01 3.011163394600952503e-01 2.702329108787587253e-01 1.749793676106523588e-01 4.768733024087112859e-01 2.235643662850460844e-01 2.038668330811692006e-02 7.185028444994630108e-03 6.175137546268013276e-03 1.604967093652425597e-02 3.351991829795263056e-02 2.808627134969149744e-02 7.093557622563720355e-02 2.877098273385318011e-02 9.132702417847164689e-02 1.050457049747082483e-01
3.178051136505261748e-02 3.042372337071300517e-02 7.192599991081333188e-02 2.563834421616114842e-02 6.536085223724764047e-03 4.471739854541897236e-02 1.083157411006800339e-02 3.036208546111956660e-02 2.130031716303235761e-02 2.201758438134206273e-03 4.268386108165207575e-03 6.465989084005335785e-02 1.376547885000266036e-01 1.751637766537990637e-01 1.585045550528377534e-01 1.918240322565449851e-01 3.271608392015727396e-01 5.653635305692172874e-01 5.755078146039466214e-01 4.513531616519048661e-01 1.917994029331590231e-02 1.991771735878423294e-02 1.769080331119338156e-02 5.564319554347545854e-02 8.049506557374690174e-02 4.136626803846938927e-01 4.132107779834898742e-01 9.559484266999977720e-02 9.391295611148418876e-02 7.156971564708498879e-02
2.939402940508353476e-02 3.101671138671080463e-02 6.037283067279214377e-02 6.203469459173323319e-02 3.988692826232452526e-02 4.803969355705689503e-02 5.966103082938445552e-03 1.499348247175738384e-02 3.098487081662948395e-02 1.101682126696894477e-02 1.134220103827941577e-02 9.899042250456228931e-03 7.722201415290433357e-02 1.570956670629932994e-01 1.471064364984909500e-01 2.262892753910200894e-01 3.925856349941240775e-01 4.780799195551052594e-01 2.768192359708043226e-01 6.036531202279563080e-02 3.621812581702199552e-02 2.485436386586883095e-01 3.621673429004956812e-01 6.096644362318630606e-01 5.770506834909402416e-01 7.577267389324032765e-01 6.080574602324879674e-01 1.836893000843786705e-01 1.365166595706771846e-01 7.975153769059466213e-02
3.771353294850443572e-02 4.261209052101946199e-02 3.992797814691467079e-02 3.611332060467799254e-02 5.273235695526507644e-02 9.343777302745435998e-02 9.016705149847809020e-02 2.907867677671679973e-01 1.417446246622650063e-01 2.410872562676628569e-02 1.777246249000713138e-02 2.752996630584238560e-02 5.449740898606475481e-02 8.096846796464662877e-02 1.077800900272865015e-01 1.946993549682852209e-01 4.215589133531509325e-01 4.258378235105361731e-01 2.023038719716141187e-01 6.962402815831067460e-02 3.006574031610800279e-01 5.459883022451695878e-01 7.008021369419382696e-01 7.229326551987119709e-01 6.414280745959077823e-01 5.586762222459883409e-01 8.291115962285182661e-01 1.476440858601073547e-01 7.952748559171758311e-03 9.636193846986353118e-02
9.369919400725408576e-02 7.267637830021755896e-02 3.512981382940127961e-02 4.923929311301836198e-02 1.114939813178002399e-02 4.514052209123970566e-02 2.399102522829124340e-01 1.937775626007359753e-01 1.903297957917452488e-01 9.439312508475031227e-02 3.421989240372259877e-02 9.119613337771906303e-03 8.915083665287898418e-03 2.311022608005429066e-02 5.265356572795334283e-02 2.442268479353464639e-01 2.581513296657380607e-01 3.020929641241639207e-01 5.287337877737553066e-02 9.373259287356486280e-02 3.331194975711277984e-01 7.214503132973036914e-01 8.897821640779318697e-01 9.271987463913436978e-01 7.710206197744917667e-01 7.498703456264644851e-01 7.009529116472779098e-01 5.502110091818256388e-01 2.871202374714653532e-02 1.951186725481415460e-02
3.720728137118965023e-02 1.015764028435560545e-01 5.293091368388100175e-03 1.756750145409799110e-02 3.490331601155408081e-02 4.745665507729445592e-02 1.504022588423732654e-01 1.887777462286296948e-01 1.295841677862321351e-01 1.000184620419453940e-01 2.077315258448430429e-02 2.018894464793344681e-03 3.071630540212371904e-03 8.742747376533341330e-03 1.918113254958280986e-02 1.138559003276870402e-01 4.352822557592639363e-02 1.391942905671352156e-02 4.679449281712245133e-03 3.410198920242051013e-02 1.304119330126142784e-01 6.970904652341758378e-01 8.845550323426579764e-01 9.294484880270897920e-01 6.816985225629516032e-01 3.175475654052684060e-01 5.168509778619180262e-01 3.512019808518039854e-01 3.152192737191883420e-02 1.226799591012259390e-02
1.363924648061964548e-02 1.743989296116093060e-02 1.083052446798997426e-02 1.119548001905308100e-02 2.623346927969884626e-02 1.512066015645007443e-02 7.819443694404379364e-02 1.015293811461564222e-01 9.372082640752509020e-02 2.193418558031482932e-02 5.475457627214663434e-03 1.414845759165925731e-03 2.600964201212801075e-03 7.466021380600291503e-03 2.513533161616339148e-02 1.629884018866911005e-02 2.973096188326620343e-02 8.779001036200991676e-03 1.650505268936305545e-02 7.864411252898940996e-02 4.269667073542767755e-01 8.123617177866218064e-01 8.758267633644515326e-01 8.343300729941349747e-01 6.422116537480501153e-01 4.715104382376558712e-01 4.573630886472256352e-01 3.054822501214239927e-01 2.737759097158211710e-02 9.630395525655902414e-03
2.969691813766728306e-02 2.707558973964769439e-02 1.381720427037235605e-02 9.874830855214946843e-03 1.271941080425835827e-02 6.844579003259887960e-03 3.915123420635215068e-02 3.518011471842578258e-02 9.983844452241439141e-03 5.819135686291415643e-03 2.426703576528809175e-03 2.643201776729225180e-03 1.028789351055780926e-01 4.908442416125549657e-02 1.401780573668136472e-03 4.621531213347536589e-03 1.651896729000929334e-02 3.759331319123165177e-02 3.612692707296059902e-02 1.618253431255786690e-01 4.455186403161076059e-01 6.487053632313980467e-01 2.651037240599020128e-01 3.990874988356830633e-01 5.166048578726767371e-01 2.929070240257526936e-01 2.183380932306938360e-01 1.840686358363831654e-01 9.111455632600469479e-03 8.694695758282432185e-03
2.411710910352285117e-02 2.763937076893864878e-02 4.027969319735326924e-03 2.758345817490807407e-03 2.239927845782951118e-03 3.346101844738676775e-03 4.991297882661834689e-03 1.335316561395649823e-03 1.886945640900671625e-03 3.550728557205701241e-02 5.049977165592376555e-02 7.969577933353746979e-02 7.410536897991371053e-02 3.720222902953810272e-03 6.672036388910966044e-03 8.492785307902979419e-02 1.628439793082061549e-01 2.350488903978091015e-01 1.601520199674348888e-01 1.205535648986041236e-01 8.591007879144178794e-02 3.084906465375314780e-02 1.202729591933858477e-02 2.619704825653543234e-02 9.506355590848526715e-02 3.211783310479392195e-02 2.939586005674331079e-02 1.418283863975278343e-02 4.467114833206300289e-02 4.202285640649045667e-02
5.126131298035130346e-02 3.930343591496070904e-02 4.375454999191412744e-03 1.999195232074696751e-03 2.963927671215117222e-03 2.146507782327486836e-03 3.382087552908881641e-03 5.159526174167586299e-02 4.885171295047346235e-02 2.134381861918360768e-02 5.351555095780865384e-02 9.659663192944370480e-02 9.781057093761795496e-02 7.067067653742114056e-03 7.678092572039253716e-03 4.998927161095317873e-02 1.828050044892744752e-01 3.399506072241342269e-01 3.839411583938751038e-01 3.326649823895539981e-01 7.103547932091031081e-02 1.591671278097259168e-02 1.991301837656328858e-02 4.947334221293031575e-02 1.103443354308488444e-01 3.258731052774988673e-02 1.234736171073413241e-02 7.241616335367952358e-03 6.270558762220679316e-02 6.083295707335831248e-02
6.442185003490923101e-02 8.188715040912014284e-03 2.334749433913450422e-03 8.991987144634520923e-02 1.139417652655588531e-01 1.898183116160601005e-03 2.766696119581326958e-03 4.200963319256694611e-02 2.426391643997997255e-02 2.770808269185445066e-02 5.068961958948074026e-02 8.543400951490588702e-02 7.490647675509103098e-02 5.915598184074857997e-03 1.566567641895191820e-02 7.117615680577556170e-02 1.378080637907055372e-01 3.166000986855029842e-01 3.976479675806814940e-01 3.374577351699744598e-01 1.698756906685695567e-01 1.128467041247649578e-02 8.061727475810936960e-03 1.728980973515055128e-02 8.983988697470361717e-02 5.439641475739572657e-02 4.877746319281401483e-02 1.388074821183398269e-02 5.063386218581886894e-02 4.613185434585513611e-02
3.581356972171665515e-02 1.109760962618290374e-02 4.500100987259323705e-03 4.450028957605623239e-03 9.947642885117274208e-03 6.818159267274477575e-03 3.232169271048000031e-03 1.632504976965833410e-01 1.962164073284162341e-03 2.476170100276809186e-03 2.968622618760604487e-02 3.533966861848579499e-02 4.484761448768615627e-02 8.507403810013662582e-02 6.677522824935808003e-03 2.181884405351897094e-02 2.199855961522220738e-02 9.379777130660023332e-02 1.201989759286826442e-01 1.043490566273401060e-01 8.913965026043654816e-02 1.646883898094651799e-02 8.454651755018431636e-02 4.804099667175907445e-03 1.609959024801607685e-02 4.064901632024319617e-02 1.091462847554434956e-01 7.253874576636920590e-02 5.689570056051239388e-02 4.992497457245434478e-02
1.282346102034104263e-02 5.096920840765627701e-03 5.360816273841044477e-03 8.941266545434610469e-03 4.804065609790466110e-03 2.421044759721120015e-03 1.581229457891625279e-01 1.154814338459963091e-01 2.864402384644480163e-03 9.608989276083808664e-03 9.126565662327405792e-02 3.354000863083821810e-02 4.955252851550408927e-02 8.941813189899505687e-02 5.494273113553025528e-03 7.772784473853980823e-03 7.121010358071833135e-03 4.446018482358116489e-03 7.852899735673744136e-03 1.362743582909889915e-02 2.587819487018666251e-02 8.608753879892546215e-03 8.832927864381631688e-02 1.650226979737037802e-02 2.270826594607600751e-02 8.150623864138723321e-03 2.828200650136340408e-02 3.426831852756252739e-02 2.839231236858304891e-02 7.282229726267464009e-02
1.299793866535286363e-02 1.044464622912953840e-02 5.016097697257103361e-03 3.627895936202633551e-03 3.315094024305262430e-03 1.414189801965214013e-03 1.313625527351658939e-01 1.384772680876708850e-01 1.525339318409342504e-01 4.857446645671630384e-03 1.901123711411936527e-03 2.449737707050871852e-03 1.239533058701288298e-01 2.250172738670438120e-03 4.826378635896773697e-03 3.008272864827764292e-03 2.800484424088214852e-03 9.882846653765370304e-02 8.971194606236004843e-02 7.089750549327429596e-02 5.638359457291153981e-02 7.934295090877814538e-02 1.080460755558822622e-01 1.248439911254325269e-02 1.178445859104950907e-02 8.223831811077152512e-03 1.741072750443152170e-02 1.038821199460065493e-02 1.502473294149200313e-02 1.309438920608195778e-01
1.766055063076107587e-02 9.214197476845480128e-03 5.157289815426522976e-03 6.943036272241740955e-03 5.999047146787582496e-03 3.359910582288328472e-03 1.192602957798345048e-02 9.572936086762061716e-03 1.718557878065997196e-03 1.511244737819356643e-01 5.375872623394450933e-02 1.144342399334486726e-01 4.526277028678206069e-03 3.979680490362767081e-03 1.064297507122693304e-02 9.633366007563742145e-03 4.261914911291684802e-03 8.995855399168405445e-03 1.021356744310221443e-01 4.741944155883739964e-02 4.568547326913284523e-02 6.890678681209741474e-02 9.552904278731590149e-02 1.915396144756646712e-02 1.335650366697370417e-02 6.336814951462325929e-02 7.687342953545060753e-02 9.151336812671038989e-02 3.314041481685102430e-02 5.586915683274599337e-02
2.374331062894244337e-02 2.056268606812852381e-02 6.146438119881991215e-03 2.070046327867592142e-02 2.368360569123259887e-02 4.446986232540282857e-02 2.971893750282479305e-02 3.349979641184250550e-03 1.546472181990559249e-03 1.204444172301203098e-01 3.653460743835620916e-02 4.187444888017036876e-02 4.383243248083749238e-02 2.439577066256751886e-03 3.674590654499051024e-03 7.309211679726203281e-02 6.227213942089563498e-02 6.868419832960574734e-02 9.572266499588451272e-02 5.810395182427436495e-02 4.109848191849522353e-02 6.040614084199379119e-02 6.419905222684726964e-02 9.567089210923948595e-02 3.146584655186275559e-02 4.941275748688171016e-02 7.566600080051905097e-02 1.160203815786217257e-01 1.241390274683303041e-01 2.140150711445042500e-02
1.288563618679999974e-02 3.204932552109836241e-02 9.460647070899439945e-03 9.993926468709363187e-03 4.778560644304452598e-02 5.033965348673562906e-02 3.342150850139691959e-02 2.288849989904096546e-03 1.845417875260547654e-03 2.418805847020029636e-03 1.093818982159344422e-01 5.487200137823555063e-02 3.097000096738747668e-02 4.483039778266296321e-02 4.236518456525760652e-03 5.533129941096433246e-02 4.473808952246327054e-03 2.396548913527763586e-02 4.610989599802520905e-02 1.279711861302480075e-02 5.737196472149803245e-02 7.990145604422113634e-02 6.738846884019301930e-02 6.733246803826993532e-02 8.810594365666193917e-02 6.975423313070559794e-02 8.520476206298101263e-02 1.011157757197812812e-01 1.191285440729188821e-01 2.411081557818750207e-02
