21.6541706255315 21.6541706255315 21.6541706255315 21.6541706255315 21.6541706255315 21.6541706255315 21.6541706255315 21.6541706255315 21.6541706255315 21.6541706255315 21.6541706255315 21.6541706255315 21.6541706255315 21.6541706255315 21.6541706255315 21.6541706255315 21.6541706255315 21.6541706255315 21.6541706255315 21.6541706255315 21.6541706255315 21.6541706255315 21.6541706255315 21.7572490006224 21.9363749546715 22.115501197777 22.2946277296256 22.2971408106497 22.2971408106497 22.2971408106497
21.6541706255315 21.6541706255315 21.6541706255315 21.6541706255315 21.6541706255315 21.6541706255315 21.6541706255315 21.6541706255315 21.6541706255315 21.6541706255315 21.6541706255315 21.6541706255315 21.6541706255315 21.6541706255315 21.6541706255315 21.6541706255315 21.6541706255315 21.6541706255315 21.6541706255315 21.6541706255315 21.6541706255315 21.6541706255315 21.6541706255315 21.7589513743751 21.9380754778209 22.1171998703097 22.2963245515271 22.2971408106497 22.2971408106497 22.2971408106497
21.6541706255315 21.6541706255315 21.6541706255315 21.6541706255315 21.6541706255315 21.6541706255315 21.6541706255315 21.6541706255315 21.6541706255315 21.6541706255315 21.6541706255315 21.6541706255315 21.6541706255315 21.6541706255315 21.6541706255315 21.6541706255315 21.6541706255315 21.6541706255315 21.6541706255315 21.6541706255315 21.6541706255315 21.6541706255315 21.6541706255315 21.7606534587699 21.9397757119277 22.1188982541142 22.2971408106497 22.2971408106497 22.2971408106497 22.2971408106497
21.6541706255315 21.6541706255315 21.6541706255315 21.6541706255315 21.6541706255315 21.6541706255315 21.6541706255315 21.6541706255315 21.6541706255315 21.6959634257479 21.7384633295144 21.780028795365 21.7893270772422 21.7462768663061 21.7041601875192 21.6629755390423 21.6541706255315 21.6541706255315 21.6541706255315 21.6541706255315 21.6541706255315 21.6541706255315 21.6541706255315 21.7623552538218 21.9414756570057 22.120596349204 22.2971408106497 22.2971408106497 22.2971408106497 22.2971408106497
21.6541706255315 21.6541706255315 21.6541706255315 21.6541706255315 21.6541706255315 21.6541706255315 21.6541706255315 21.6541706255315 21.6541706255315 21.7435816950647 21.8346252872595 21.9247346845925 21.9446293091558 21.8530352157984 21.7623744119827 21.6726453962091 21.6541706255315 21.6541706255315 21.6541706255315 21.6541706255315 21.6541706255315 21.6541706255315 21.6541706255315 21.7640567595446 21.943175313069 22.1222941555936 22.2971408106497 22.2971408106497 22.2971408106497 22.2971408106497
21.6541706255315 21.6541706255315 21.6541706255315 21.6541706255315 21.6541706255315 21.6541706255315 21.6541706255315 21.6541706255315 21.6541706255315 21.7921361579623 21.9317224486517 22.0703747875158 22.0989983905451 21.9588614047431 21.8196574658925 21.6813850728341 21.6541706255315 21.6541706255315 21.6541706255315 21.6541706255315 21.6541706255315 21.6541706255315 21.6541706255315 21.7657579759525 21.9448746801318 22.1239916732974 22.2971408106497 22.2971408106497 22.2971408106497 22.2971408106497
21.6541706255315 21.6541706255315 21.6541706255315 21.6541706255315 21.6541706255315 21.6541706255315 21.6541706255315 21.6541706255315 21.6541706255315 21.821897803228 21.9919913567856 22.1630192058964 22.1979378854963 22.0283934626057 21.8579156504764 21.6865059505555 21.6541706255315 21.6541706255315 21.6541706255315 21.6541706255315 21.6541706255315 21.6541706255315 21.6541706255315 21.765279444271 21.9417006314292 22.1190422889026 22.2897277464427 22.2913763159834 22.2930230863529 22.2946680575384
21.6541706255315 21.6541706255315 21.6541706255315 21.6541706255315 21.6541706255315 21.6541706255315 21.6541706255315 21.6541706255315 21.6543111218674 21.7749247054385 21.8964738425751 22.0189570322356 22.0419924463844 21.9209926338657 21.799059674691 21.676195069968 21.6541706255315 21.6541706255315 21.6541706255315 21.6541706255315 21.6541706255315 21.6541706255315 21.6541706255315 21.7357792419645 21.8636536968435 21.9924483826207 22.1154477762813 22.1170960827812 22.1187425903972 22.1203872991159
21.6541706255315 21.6541706255315 21.6541706255315 21.6541706255315 21.6541706255315 21.6541706255315 21.6541706255315 21.6541706255315 21.6549451419444 21.7270155422485 21.8000212527663 21.8739607727964 21.8869800300427 21.8145238380505 21.7411347419679 21.6668142425625 21.6541706255315 21.6541706255315 21.6541706255315 21.6541706255315 21.6541706255315 21.6541706255315 21.6541706255315 21.7053569792104 21.7846856918384 21.8649343959661 21.9411677696082 21.9428158130729 21.9444620579402 21.9461065041978
21.6541706255315 21.6541706255315 21.6541706255315 21.6541706255315 21.6541706255315 21.6541706255315 21.6541706255315 21.6541706255315 21.6546423455965 21.6781705521642 21.702633825612 21.7280306655783 21.7329003987345 21.7089868376774 21.6841406150777 21.6583632313627 21.6541706255315 21.6541706255315 21.6541706255315 21.6541706255315 21.6541706255315 21.6541706255315 21.6541706255315 21.6740128909467 21.704796851099 21.7365005633696 21.7668877264288 21.7685355068631 21.7701814889873 21.7718256727883
21.6541706255315 21.6541706255315 21.6541706255315 21.6541706255315 21.6541706255315 21.6541706255315 21.6541706255315 21.6541706255315 21.6541706255315 21.6541706255315 21.6541706255315 21.6541706255315 21.6541706255315 21.6541706255315 21.6541706255315 21.6541706255315 21.6541706255315 21.6541706255315 21.6541706255315 21.6541706255315 21.6541706255315 21.6541706255315 21.6541706255315 21.6665940389664 21.684353841768 21.701194131815 21.7157336043147 21.7140860869056 21.7124403675192 21.710796446169
21.6541706255315 21.6541706255315 21.6541706255315 21.6541706255315 21.6541706255315 21.6541706255315 21.6541706255315 21.6541706255315 21.6541706255315 21.6541706255315 21.6541706255315 21.6541706255315 21.6541706255315 21.6541706255315 21.6541706255315 21.6541706255315 21.6541706255315 21.6541706255315 21.6541706255315 21.6541706255315 21.6541706255315 21.6541706255315 21.6541706255315 21.6997810734952 21.7660836499824 21.8314669530611 21.8900137204919 21.8883664661022 21.8867210094487 21.8850773505442
21.6541706255315 21.6541706255315 21.6541706255315 21.6541706255315 21.6541706255315 21.6541706255315 21.6541706255315 21.6541706255315 21.6541706255315 21.6541706255315 21.6541706255315 21.6541706255315 21.6541706255315 21.6541706255315 21.6541706255315 21.6541706255315 21.6541706255315 21.6541706255315 21.6541706255315 21.6541706255315 21.6541706255315 21.6541706255315 21.6541706255315 21.7338892288096 21.8487335899674 21.9626589170449 22.0642938731591 22.0626468817842 22.0610016878581 22.0593582913942
21.6541706255315 21.6541706255315 21.6541706255315 21.6541706255315 21.6541706255315 21.6541706255315 21.6541706255315 21.6541706255315 21.6541706255315 21.6541706255315 21.6541706255315 21.6541706255315 21.6541706255315 21.6541706255315 21.6541706255315 21.6541706255315 21.6541706255315 21.6541706255315 21.6541706255315 21.6541706255315 21.6541706255315 21.6541706255315 21.6541706255315 21.7689182700325 21.9323034270991 22.094769789397 22.2385740623129 22.2369273339471 22.2352824027436 22.2336392687149
21.6541706255315 21.6650875934353 21.7083580297315 21.7506874228753 21.7920772717071 21.8048749301089 21.803190733435 21.8015083333566 21.7970413625845 21.7552903313459 21.7144752407944 21.6745945919666 21.6541706255315 21.6541706255315 21.6541706255315 21.6541706255315 21.6541706255315 21.6541706255315 21.6541706255315 21.6541706255315 21.6541706255315 21.6541706255315 21.6541706255315 21.7810559067917 21.9601559810106 22.1392563440885 22.2971408106497 22.2971408106497 22.2971408106497 22.2971408106497
21.6541706255315 21.6780675319249 21.7698749042196 21.8607414784081 21.9506687529913 21.979149602955 21.9774656753059 21.9757835439656 21.9671241752046 21.8768353042714 21.787482130497 21.6990631552582 21.6541706255315 21.6541706255315 21.6541706255315 21.6541706255315 21.6541706255315 21.6541706255315 21.6541706255315 21.6541706255315 21.6541706255315 21.6541706255315 21.6541706255315 21.7827542308293 21.9618524588464 22.1409509757082 22.2971408106497 22.2971408106497 22.2971408106497 22.2971408106497
21.6541706255315 21.691989899033 21.8323332193683 21.9717359866262 22.1101996989676 22.1534243123819 22.1517406537525 22.1500587911444 22.1362715849804 21.9974458624191 21.8595555935069 21.7225992799594 21.6541706255315 21.6541706255315 21.6541706255315 21.6541706255315 21.6541706255315 21.6541706255315 21.6541706255315 21.6541706255315 21.6541706255315 21.6541706255315 21.6541706255315 21.7844522657077 21.9635486478368 22.1426453187973 22.2971408106497 22.2971408106497 22.2971408106497 22.2971408106497
21.6541706255315 21.7010755946509 21.8703735201757 22.040612345224 22.2117905713472 22.266582562914 22.2682659525293 22.2699475464101 22.254843891316 22.0840251444894 21.9122706004475 21.7395817577627 21.6541706255315 21.6541706255315 21.6541706255315 21.6541706255315 21.6541706255315 21.6541706255315 21.6541706255315 21.6541706255315 21.6541706255315 21.6541706255315 21.6541706255315 21.7860408118046 21.965244547997 22.1443393733694 22.2971408106497 22.2971408106497 22.2971408106497 22.2971408106497
21.6541706255315 21.6887451890051 21.8095054517545 21.9312063690062 22.0538464426507 22.0923077803403 22.0939909009471 22.0956722261058 22.08411630373 21.9618361232491 21.8386203890567 21.7144705993847 21.6541706255315 21.6541706255315 21.6541706255315 21.6541706255315 21.6541706255315 21.6541706255315 21.6541706255315 21.6541706255315 21.6541706255315 21.6541706255315 21.6541706255315 21.7515032334794 21.8827069933154 22.0148292180348 22.1272762512321 22.1289216646296 22.1305652822996 22.1322071042297
21.6541706255315 21.6754724839396 21.7476960717399 21.820860069039 21.8949629780667 21.9180329612007 21.9197158128037 21.9213968692459 21.9143239907551 21.8405813886849 21.7659034763887 21.6902917517589 21.6541706255315 21.6541706255315 21.6541706255315 21.6541706255315 21.6541706255315 21.6541706255315 21.6541706255315 21.6541706255315 21.6541706255315 21.6541706255315 21.6541706255315 21.7160453108419 21.7987086671836 21.8822902491604 21.9529958432725 21.9546409936918 21.956284348671 21.9579259081969
21.6541706255315 21.6612577198712 21.6849456202954 21.7095736852326 21.7351404172526 21.7437581055003 21.7454406881054 21.7471214758365 21.7454667137634 21.7202607024216 21.6941196243221 21.6670449770169 21.6541706255315 21.6541706255315 21.6541706255315 21.6541706255315 21.6541706255315 21.6541706255315 21.6541706255315 21.6541706255315 21.6541706255315 21.6541706255315 21.6541706255315 21.6796672787059 21.7137912194844 21.748833146667 21.7787153988631 21.7803602863098 21.7820033786033 21.7836446757303
21.6541706255315 21.6622401138625 21.6870869134945 21.7109937935816 21.7339622512137 21.7217222921309 21.6972615608193 21.6737383497266 21.6571900893669 21.6788427515146 21.699562384982 21.719350486995 21.7160305038637 21.6947614705497 21.6744230662363 21.6550137936324 21.6541706255315 21.6541706255315 21.6541706255315 21.6541706255315 21.6541706255315 21.6541706255315 21.6541706255315 21.6541706255315 21.6541706255315 21.6541706255315 21.6541706255315 21.6541706255315 21.6541706255315 21.6541706255315
21.6541706255315 21.6783382747498 21.7517187873714 21.8241596253978 21.8956622855797 21.8600376685545 21.7870427844671 21.7149851764337 21.6644779034254 21.734665449824 21.8039202106878 21.8722436829027 21.8631553066731 21.7933509525236 21.7244769850146 21.6565319071947 21.6541706255315 21.6541706255315 21.6541706255315 21.6541706255315 21.6541706255315 21.6541706255315 21.6541706255315 21.6541706255315 21.6541706255315 21.6541706255315 21.6541706255315 21.6541706255315 21.6541706255315 21.6541706255315
21.6541706255315 21.6953777734839 21.8172910122818 21.9382648214165 22.0583006972988 21.9974157275827 21.8758876775934 21.7552966595113 21.6727000742036 21.7914215179254 21.9092104192401 22.026068274694 22.0093497735961 21.891011085599 21.7736025419 21.6571226458877 21.6541706255315 21.6541706255315 21.6541706255315 21.6541706255315 21.6541706255315 21.6541706255315 21.6541706255315 21.6541706255315 21.6541706255315 21.6541706255315 21.6541706255315 21.6541706255315 21.6541706255315 21.6541706255315
21.6541706255315 21.7133583697107 21.8838033481242 22.0533091417888 22.2218772467757 22.1338567085465 21.9637964792765 21.7946730377847 21.6818563631296 21.8491107174998 22.0154327725729 22.1808240245555 22.154614142181 21.9877421070713 21.821799973935 21.6567862465003 21.6541706255315 21.6541706255315 21.6541706255315 21.6541706255315 21.6541706255315 21.6541706255315 21.6541706255315 21.6541706255315 21.6541706255315 21.6541706255315 21.6541706255315 21.6541706255315 21.6541706255315 21.6541706255315
21.6541706255315 21.7178611261584 21.8969344784906 22.0760081264359 22.2550820696803 22.1601253133896 21.9810507804888 21.8019759532311 21.6854404191324 21.8645158341622 22.0435915426062 22.2226675441518 22.1925377828155 22.0134611960104 21.8343843170465 21.6553071462385 21.6541706255315 21.6541706255315 21.6541706255315 21.6541706255315 21.6541706255315 21.6541706255315 21.6541706255315 21.6541706255315 21.6541706255315 21.6541706255315 21.6541706255315 21.6541706255315 21.6541706255315 21.6541706255315
21.6541706255315 21.7195968070436 21.8986683169432 22.0777401224416 22.2568122232247 22.158397002321 21.9793243119105 21.8002513271573 21.6871632026876 21.8662367751841 22.0453106410811 22.2243848000645 22.1908223694786 22.0117476252639 21.8326725889046 21.6541706255315 21.6541706255315 21.6541706255315 21.6541706255315 21.6541706255315 21.6541706255315 21.6541706255315 21.6541706255315 21.6541706255315 21.6541706255315 21.6541706255315 21.6541706255315 21.6541706255315 21.6541706255315 21.6541706255315
21.6541706255315 21.7213321920156 21.9004018597969 22.0794718231624 22.2585420817979 22.1566689859092 21.9775981376749 21.7985269951118 21.6888856925282 21.8679574228054 22.0470294464692 22.2261017632049 22.1891072486001 22.0100343466619 21.8309611525931 21.6541706255315 21.6541706255315 21.6541706255315 21.6541706255315 21.6541706255315 21.6541706255315 21.6541706255315 21.6541706255315 21.6541706255315 21.6541706255315 21.6541706255315 21.6541706255315 21.6541706255315 21.6541706255315 21.6541706255315
21.6541706255315 21.7203442947425 21.8929856963368 22.0665661899115 22.2410842798126 22.1403985290427 21.9673705951696 21.7934059669142 21.6898351110647 21.8656686408989 22.0424343778842 22.2201308262308 22.1816312513854 22.0054136327309 21.8282662048769 21.6541706255315 21.6541706255315 21.6541706255315 21.6541706255315 21.6541706255315 21.6541706255315 21.6541706255315 21.6541706255315 21.6541706255315 21.6541706255315 21.6541706255315 21.6541706255315 21.6541706255315 21.6541706255315 21.6541706255315
21.6541706255315 21.702866195398 21.8269752619097 21.9520231755343 22.0780084409564 22.0034570675454 21.8789619082882 21.7535302987326 21.6811775168041 21.8084775407918 21.9367095288667 22.0658719855788 22.0358702037815 21.9081865273072 21.7795732839126 21.6541706255315 21.6541706255315 21.6541706255315 21.6541706255315 21.6541706255315 21.6541706255315 21.6541706255315 21.6541706255315 21.6541706255315 21.6541706255315 21.6541706255315 21.6541706255315 21.6541706255315 21.6541706255315 21.6541706255315
