2.234902856352660450e-01 1.229495155612765275e-02 4.257242274014255354e-03 5.324625925755658261e-03 4.020273606497420417e-03 8.767589469130242577e-03 8.651367964393761115e-03 2.327877683876210246e-02 4.200792285860305286e-02 1.882118493328049924e-02 1.402697116592530394e-02 1.367011819838925279e-01 8.529589185978536658e-02 7.021657117193795192e-03 5.758367012877848440e-03 9.001878894572146184e-02 4.584903209135278088e-03 6.315438380905025878e-03 5.708037632063965409e-03 2.366147976048417305e-03 2.250825403293746623e-03 4.154411222329585512e-02 3.265766051768786288e-02 1.301933511160847934e-01 2.535767988559150532e-01 1.994661930247833559e-01 9.196404265315397120e-02 8.034185296571150561e-03 7.606873681226579594e-03 9.482998405789866414e-03
1.465079674147785893e-01 1.288509062944348353e-02 1.040578132545108211e-02 8.442437566822027367e-03 5.863331725752923308e-03 2.944267115100507662e-02 1.548264016758208253e-02 1.908189853899738136e-02 1.106362368474027476e-02 8.494621460480439312e-03 9.267933134024014877e-03 7.032196707404073099e-02 1.007044093807625135e-01 6.352483235923961705e-03 6.666807558608029913e-03 4.347525583089292649e-03 4.481916836988661390e-03 1.170507348781557426e-02 8.774587989311031025e-03 3.302708424221794531e-03 1.577937178957072584e-01 3.969504875187578052e-02 8.447131961506833264e-02 7.547694537275115301e-02 6.723540391203687572e-02 9.063564801384701997e-02 3.201958228542792217e-02 8.092431109990793139e-03 1.144328128319392450e-02 1.136386550844832935e-02
3.798667134527777128e-02 3.713710131056733449e-02 6.755755216930751927e-02 5.488047649702119252e-02 1.165580817039113953e-01 1.330930878472951981e-02 1.187208890323147165e-01 1.242646610212917585e-01 5.223924297972312725e-02 1.205344761801520857e-02 3.241539228187179794e-02 2.451676333146102921e-02 9.065367620620464265e-03 1.704071565300737875e-02 1.515185297766691863e-01 1.421823058856849786e-02 6.540954896057655024e-03 1.068711636066961568e-02 3.514609530556443012e-02 8.896034410253217395e-03 1.015819959467681999e-01 3.367656008220841490e-02 5.074660402015648830e-02 1.770766705241620664e-02 1.060448363374441073e-02 7.049296490630341944e-03 6.341447366523123540e-03 4.960125039960572302e-03 8.422792178585693235e-03 9.399782752459277801e-03
1.494082114893900519e-02 4.186945803301159175e-02 9.183928821546953614e-02 7.415803390888699165e-02 3.447019782234841956e-02 5.963757024126136071e-03 8.948259460704290763e-03 1.420121650215021847e-01 8.198513475786739502e-02 1.550453243741051028e-02 9.000164376501947408e-03 1.796193572934006583e-02 8.109667325919164144e-03 1.121567521949351498e-02 1.160186895549040337e-01 1.022366449718894593e-01 3.271033821724395572e-03 4.150274498417172789e-03 2.893636093295294011e-03 3.223509615192911640e-03 1.771752253766042118e-01 6.730834451410190600e-02 2.247818964813889930e-02 4.390141183478882270e-02 8.570593525525161196e-03 6.222568784397233300e-03 5.379487366008262397e-03 5.085028480100239195e-03 1.028457134354231368e-02 1.113035577024952365e-02
8.610492173712418554e-03 2.616340313104755996e-02 7.298384253457608495e-02 2.830330703891548519e-02 2.012105452329141994e-02 1.355952731738666039e-01 1.012174000203161853e-02 1.319355611049790877e-01 5.149302616762135854e-02 3.763617044739382689e-02 4.012516238763556842e-02 4.010654994704097864e-02 7.293765497869086033e-03 1.143623594176214862e-02 1.512676029798192545e-01 6.173263142385639751e-02 1.316509906453192623e-02 4.449067123024762378e-03 7.104855789079590062e-03 4.088278393958266060e-03 3.251998395028067416e-03 8.686140570569239605e-02 2.249227632755846761e-03 6.920155184879837884e-02 1.539712910542907244e-02 8.313875587606227649e-03 5.816113411636028574e-03 6.703060063717878464e-03 1.044823402807514012e-02 3.828984297177674689e-02
1.224423490216466036e-02 1.287620960858132033e-02 4.857467421575658445e-02 3.433825266162243706e-02 1.586586391210970115e-02 7.875389177306948985e-02 9.933626312458231078e-02 1.050930376608951999e-01 8.868094070786716743e-02 5.440235581144353683e-02 4.556954531800218311e-02 3.190015597817108528e-02 1.323978014574781481e-01 4.935825073875379360e-02 4.119757489462899658e-02 7.085247952016518469e-02 1.044504639502423157e-02 9.427752717320897480e-02 4.136996733827143571e-03 1.054801598135169348e-02 1.509425607747678574e-02 9.617235661225928198e-03 3.244512457063823598e-03 4.080195779695151154e-02 2.290529617842520030e-02 2.174100530601516881e-02 1.366766249360100265e-02 9.395783807941751262e-03 1.236457475182596404e-02 2.216942513047969604e-02
7.744451738945196118e-02 1.167409196255971421e-01 1.147734877224741434e-01 1.382711412799025354e-02 5.279916175193803858e-03 1.056848967940933123e-02 1.887373001169950423e-02 1.051904693086835527e-02 1.044961398366501051e-02 1.136488616557105799e-02 9.665299651630229402e-03 1.609159305032520360e-01 7.481079760079072105e-02 3.524950327467910038e-02 2.048757188729339804e-02 3.528935479069138237e-02 1.989885678718144590e-01 8.858158059109644267e-02 6.556999311430818621e-03 9.108631149226324719e-03 5.863816216050290499e-03 8.729704070798680049e-02 4.050129643032628068e-02 3.814451529447109718e-02 1.557151284904923633e-02 1.617696288354783865e-02 1.434943618088242376e-02 1.235650981009196910e-02 1.412395158211940394e-02 3.350064627456578875e-02
1.575995686795567952e-01 1.318436560219808824e-02 1.612741450111382646e-01 9.580419381998413544e-03 9.155745707601841560e-03 1.019595151021354326e-02 8.938525986735064432e-03 8.342123728873478833e-03 6.587198287305114433e-03 4.345159698162234969e-03 8.956189696170227532e-02 8.499251939486243343e-03 6.333356309469184708e-02 2.302051610571548973e-02 2.597029823283867472e-02 4.781919162002936513e-02 1.002986643022264410e-02 1.211537842010111492e-02 8.362361607002747124e-03 7.214988807531111728e-03 1.265153305726997857e-01 7.388582322635922628e-02 2.960639043620551247e-02 2.487786980989903016e-02 1.194493359888821118e-02 1.248307703901392618e-02 1.935878238269244517e-02 2.180869607555147721e-02 2.166382640167948195e-02 6.281395516219769048e-02
1.179230409123889142e-02 9.760607942652198624e-03 1.381115252031696328e-01 2.285040364839642513e-02 1.145965675202734527e-02 4.792731850630208359e-03 1.528726916512871542e-02 7.397110434893655953e-03 6.333299298311844544e-03 7.217106815220085923e-03 5.221116792154996585e-03 7.626016172444161599e-03 1.518057191988606697e-02 1.219100209422723652e-02 8.316328666863517793e-02 6.945327009378338134e-02 5.601133960654400105e-03 1.336675063201020648e-02 1.543604336535766078e-02 1.710184050136575040e-01 3.374272495824737900e-02 3.484847196674040887e-02 3.755636797816392508e-02 2.460985853876822976e-02 1.451355050507623784e-02 2.152226374051239427e-02 7.621014958086642921e-02 1.358492310077623888e-01 7.807400936286049489e-03 1.916501514254758121e-01
1.198595816261108227e-02 9.274997261021322714e-03 1.471174536243010159e-02 1.360401050977049289e-02 1.268021615849472539e-02 1.025800198602573182e-01 1.655103594291508148e-02 7.279100204519709481e-03 1.040711608497867369e-01 3.755647491122082737e-02 8.467051784177332188e-03 8.056181499221215514e-03 1.695526652490058142e-02 2.033472775910098382e-02 1.018694140162813323e-02 1.090956692677071127e-02 5.212613469372521374e-02 5.064519527216047867e-02 2.583542804586301880e-02 1.588071403949433552e-02 4.332670391144054223e-02 2.710573311087264778e-02 3.074818497391934233e-02 3.381788117328744098e-02 1.900018790264726767e-02 2.376014814614212795e-02 2.068317965368907940e-01 6.689051797319368192e-03 8.025243358119471190e-03 1.002536319176449003e-01
1.744269930961613035e-02 8.877097617763486659e-03 1.333036650273060515e-02 9.886905389817493908e-03 1.971373424587249262e-02 6.420377461858578494e-02 6.190368975736556395e-02 5.617665054724037960e-02 3.818316188040371539e-02 6.797010554699762716e-03 6.723238783242845018e-02 1.092725409188352315e-01 2.249788565684320008e-01 1.104919921043538145e-01 2.028171930492203220e-02 3.965282747293129989e-02 7.356790514129669944e-02 2.022844628436997610e-02 6.739391247620356469e-03 7.180216886724438696e-02 2.995089675738232121e-02 2.649921297300100037e-02 3.383606357163928408e-02 4.733955698647128452e-02 5.084011611921673834e-02 2.737418562475816761e-02 4.120283747305501093e-02 3.036866961777746898e-02 2.692955091794506720e-02 1.953768283510672749e-02
1.094906220696865301e-01 5.970715305129430106e-02 1.964806536614437799e-02 1.358033914017591284e-02 1.235949627936773140e-02 1.003238193219997687e-01 4.817333348505742352e-02 3.335223604272227055e-02 3.955130379237607047e-02 1.184732208011470868e-02 2.048133269630762407e-02 1.331020589298843593e-01 2.319194341974776252e-01 1.204757114678540325e-01 4.351153103599662841e-02 4.923569212750785601e-02 5.429845286782300495e-02 3.189841260164093945e-02 1.119523816928526261e-02 1.652660764569482965e-01 2.897084283004934535e-02 2.924045560384035472e-02 3.427212755800371213e-02 6.119416383143820581e-02 5.827448817802949321e-02 4.154111619860557242e-02 3.187456322929279467e-02 2.853236492260750531e-02 3.078171987638042909e-02 3.288694994984808079e-02
2.575069985844880005e-02 6.060689574292514592e-02 1.327400481222599515e-01 1.597565995185464688e-02 1.072554499390781027e-02 8.240476149335487777e-02 4.741024273683529938e-02 4.188123718642031146e-02 5.359669763961439487e-02 6.499253388060679051e-03 1.017128299514794831e-01 4.402867968341498545e-02 1.719700549417812474e-01 7.433524330084989584e-02 2.356708684728496192e-02 2.750669022592780802e-02 1.016612724988904745e-02 1.490202985862218270e-02 2.159151885090895492e-02 9.357251233537224738e-03 2.803247343105775072e-02 3.049952138616558728e-02 3.798728628495678245e-02 6.291071116763967408e-02 7.966860144077564376e-02 7.038781054705484097e-02 5.186649877652084462e-02 4.825888532247393087e-02 4.187731429191746124e-02 3.428334764020912057e-02
2.201510599942356830e-02 6.049059934784262182e-02 9.350073570957506686e-02 6.420167130912052267e-02 3.774208772347326796e-02 1.657856713326599229e-01 1.969967986406293697e-02 1.043763034084044077e-02 7.385527952273623908e-02 2.408255509399399169e-02 8.555615397544126532e-02 8.126537330215519508e-03 7.807131726415104944e-02 1.072607516621165713e-01 1.159942537991917183e-01 1.588072872469833696e-01 1.434443711584598158e-01 9.330616319793659519e-02 2.553394343481265594e-01 1.204847091030084999e-01 1.471552337115196625e-02 1.837434377018550558e-01 1.358990148396753972e-01 1.044106263528778167e-02 1.846484364442626050e-02 1.504304588191429475e-02 3.728580529622770728e-02 1.529074000741266308e-02 5.693947991230893790e-02 6.486383756299010650e-02
2.080178693428227921e-02 2.010645386114288599e-02 4.808696357969603069e-02 2.574526693108182551e-02 1.237907591167260041e-01 3.119938725475622163e-02 9.721084589851877039e-03 1.608028873551714186e-02 1.244056565217717056e-02 9.217587813924343898e-02 1.893689258382951768e-01 4.000184500994613535e-02 7.002847959809949119e-02 8.998782532094651287e-02 8.227042828422720389e-02 1.006091653392673924e-01 1.729581513054335717e-01 3.009946571603024368e-01 3.085315386735743015e-01 2.430467299308710638e-01 1.365848165122583724e-02 1.654465782819774730e-02 1.419011335054044635e-02 3.458467820111107288e-02 4.172145057414940877e-02 2.117544076886749005e-01 2.089931968822952568e-01 4.882082277663179343e-02 5.835146400499593294e-02 4.407396751690444148e-02
1.942787845029562283e-02 2.052579689125544685e-02 3.996802964682933529e-02 4.209066217248109282e-02 2.730082027230369690e-02 3.297082193035599795e-02 3.320823111285046807e-03 7.872514962131595476e-03 1.779584535313655583e-02 7.351946546497155517e-03 7.638975420661528286e-03 5.936784654943958947e-03 3.974709654718632662e-02 8.107113138094620974e-02 7.616586447966564033e-02 1.175191156370336693e-01 2.057799794388580905e-01 2.531058716068774195e-01 1.480436420975488609e-01 3.245925641090638414e-02 1.934004055471273686e-02 1.317148226898046115e-01 1.902598314476704466e-01 3.162364888726995060e-01 2.946062797360812779e-01 3.802163432140403532e-01 3.003516292181705460e-01 9.330570663965917499e-02 8.433276148305031417e-02 4.896313406070040147e-02
2.521534957151831333e-02 2.854622340677809636e-02 2.667824133833352970e-02 2.398548723024537116e-02 3.483027889618652700e-02 6.128476538208877528e-02 4.827929567637868902e-02 1.531548003848374473e-01 7.454487541683944840e-02 1.270768311171981482e-02 9.376311696260916997e-03 1.444389769717271607e-02 2.841085317028670468e-02 4.198317623260659076e-02 5.559848892639618345e-02 9.990328889963182024e-02 2.189603946774276444e-01 2.243205333165172455e-01 1.080183927519014347e-01 3.739328190824665193e-02 1.598472321433219157e-01 2.872949178742140730e-01 3.651314097519010038e-01 3.707458642244632618e-01 3.224543009094911206e-01 2.748217662846234033e-01 3.989871137013458191e-01 7.294682777893278514e-02 1.098543713107514308e-01 5.892411946476873441e-02
6.337297361623207836e-02 4.946961883256486420e-02 2.379786857089186830e-02 3.302878603331260016e-02 6.219208503555781649e-03 2.414608181214980206e-02 1.269539218313904816e-01 1.021433110917522591e-01 1.002944302922392505e-01 5.006955800958706043e-02 2.019597334478473796e-02 6.636228974826068917e-03 6.404434342796735090e-03 1.471307811386849546e-02 2.703978535807089259e-02 1.236656246155573985e-01 1.328400612911382617e-01 1.638623524360731942e-01 2.913100194009643831e-02 5.188799697609567524e-02 1.763817827275397376e-01 3.776113125587158281e-01 4.608896410813265176e-01 4.710286085867907424e-01 3.822134259216962704e-01 3.607974691062861283e-01 3.276710330604741261e-01 2.645068344460418941e-01 1.414774339002864388e-02 9.721230935360997832e-03
2.522263926829266742e-02 6.945673240013623684e-02 1.204990096098886992e-01 1.167693516058823829e-02 1.875518966867715381e-02 2.510589286212630208e-02 7.946433025448078336e-02 9.954434871293736664e-02 6.830061479508678368e-02 5.302521875581695660e-02 1.399873729175308244e-02 1.283870565200496694e-01 1.916762769578114756e-01 7.416679104402531565e-03 9.749494844584512612e-03 5.684682464717297906e-02 2.209980682050383463e-02 7.494195977479900343e-03 1.414436378171624320e-01 1.867795003125139949e-02 6.814046539643206502e-02 3.595049403067865357e-01 4.505988801444025249e-01 4.649588183228929861e-01 3.334463930565186862e-01 1.510511497065362141e-01 2.395984993106005656e-01 1.630764499867916606e-01 1.466275328626393502e-02 5.717844354444390209e-03
7.761753466018163003e-03 1.162710330833798857e-02 7.239892954723970396e-03 7.478344721224288241e-03 1.399750775613682607e-02 8.016156691274532384e-03 4.132045272460942165e-02 5.349755442826232416e-02 4.935549419839022067e-02 1.386601858682255661e-02 5.813068408147497798e-03 8.907113159513289913e-02 1.503379442505316799e-01 6.650273795753197659e-03 1.337286423433537395e-02 8.349614218746052516e-03 1.486377999876082462e-02 4.690698031811081636e-03 8.928021934087688669e-03 4.245892929739461530e-02 2.197653853623758036e-01 4.127896478617965603e-01 4.395471290023933997e-01 4.113669423506700062e-01 3.096818702009576096e-01 2.219013237141665429e-01 2.107093342098366739e-01 1.509189277690869135e-01 2.272373306957352693e-02 8.866983146587535669e-03
1.605967760893346405e-02 1.470967818014585170e-02 7.459501107131189662e-03 6.384169164812495550e-03 8.308436249712466623e-03 4.410005877301123936e-03 2.167990757739878677e-02 2.138205044518186673e-02 6.129231475737081415e-03 4.223096782326786654e-03 1.533803525514476074e-01 1.350547617034774661e-01 7.372833491696327568e-02 3.340256481209429029e-02 7.005545678911670460e-02 2.314359591349257096e-03 8.067027291301504671e-03 1.871858648646943304e-02 1.832544226495478809e-02 8.264974840202705952e-02 2.248019920783254355e-01 3.237444222778173009e-01 1.309019777234911586e-01 1.936927509110742684e-01 2.457268933850731418e-01 1.364644637919503745e-01 1.121507930066959341e-01 1.020362701455568011e-01 1.432133386892298077e-01 1.555688540270238895e-01
1.294395388327642879e-02 1.487388992665143392e-02 2.750043302774275462e-03 2.314630905606873592e-03 1.849519631951435095e-01 2.698206178259728028e-03 3.483716322776220665e-03 9.901424785054775690e-02 1.410188000670988817e-01 2.433426130510675869e-02 3.573322358142779626e-02 5.649710137079570760e-02 5.167551179845646797e-02 1.578920405614974432e-01 4.849214468152215039e-03 4.203889238414430796e-02 7.852452097908803330e-02 1.154825754153657319e-01 8.010942199457420088e-02 6.073105150708642958e-02 4.281584620831720145e-02 1.523202695208573758e-02 5.879379953514351359e-03 1.259580853857593906e-02 4.492719657292450208e-02 1.493393975455872824e-02 1.877213520243970965e-02 2.107985128266188501e-01 2.743527355999200029e-02 2.560437135257173993e-02
2.735608464070830859e-02 2.346093207026141159e-02 3.366895041146959061e-03 1.515932798169269402e-01 3.445687400283078180e-03 1.976899996509419444e-01 3.261143241162369356e-03 3.556564110649092225e-02 3.359671401109204369e-02 1.454367153300845095e-02 3.587300600058826450e-02 6.503930883672023877e-02 6.651692899258182523e-02 5.152478639855479631e-03 5.342335683539803023e-03 2.393509696269532222e-02 8.885267374493972803e-02 1.680910921111468947e-01 1.930620067727693290e-01 1.682916419648456952e-01 3.553517305267982207e-02 1.037851199628888124e-02 1.271130245056231733e-02 2.981509112512848933e-02 5.263196934334594262e-02 1.537577636482136828e-02 9.231359059800780392e-03 1.017298525471116710e-01 3.833002052160698614e-02 3.676780828208985052e-02
3.393464064884526427e-02 4.833088072428487827e-03 1.504277405186892069e-01 6.249887460677194806e-02 8.108466087956994750e-02 1.827854763729040710e-01 2.522223344104377873e-01 2.921960506957537590e-02 1.656644791320482923e-02 1.887589572582419259e-02 3.415070166392946555e-02 5.716057677548697091e-02 4.971328171987402650e-02 3.268565412385360421e-03 7.902734830972210980e-03 3.442692112046445013e-02 6.756807550967626474e-02 1.575562533245279395e-01 2.004304227831664731e-01 1.705180957298188804e-01 8.472106101259606337e-02 7.294345117306300780e-03 1.968225442557617888e-01 1.133990101528598374e-02 4.763160999794755629e-02 2.582146269005932901e-02 3.253548209563116717e-02 1.769883691530198255e-01 3.112718900429191707e-02 2.809519502571449293e-02
1.859216897019021902e-02 6.555382973905133845e-03 2.831771002998269889e-03 2.922098670848626793e-03 6.941925258064574750e-03 6.535058140957598731e-03 2.705173317741126904e-01 1.150659152059906459e-01 1.680316499551875453e-01 2.145817611012543480e-01 2.006347821375884313e-02 2.376360504795031053e-02 2.991080009669443499e-02 5.586278836836028328e-02 3.545876694282415736e-03 1.067042744880295109e-02 1.171324902475002865e-02 5.400125667776041472e-02 6.915966524185367115e-02 5.643308285435268135e-02 5.264633263116898221e-02 1.224693585571933786e-02 5.406265148017001115e-02 8.727215119192252568e-02 8.662932770602064722e-03 1.957412833668805904e-02 6.254508306128656048e-02 4.210248803874855339e-02 3.545444601317456618e-02 3.090549910857321239e-02
6.641825687271963805e-03 2.628117394548497299e-03 2.830141432466024790e-03 4.793501831405141272e-03 3.125681343906846956e-03 2.229537138095619708e-01 1.096763636891600197e-01 8.017033520705815763e-02 2.468010217631572412e-01 8.505435437938290225e-03 6.497445995002981700e-02 2.418273841448697475e-02 3.514827119353275409e-02 6.045490048111046288e-02 4.759599795733737357e-03 7.873240467509831295e-03 7.385023814748182223e-03 1.259284838283585839e-01 1.834986492984990725e-01 8.716974448753252169e-03 1.687904196255282652e-02 1.215276825094976365e-01 5.930588079534491325e-02 1.882712604387998256e-02 3.471955179780136097e-02 1.039118876772821172e-02 4.842276195401866434e-02 7.385004900739833289e-02 4.273857543429774447e-02 4.960862872128026652e-02
6.730653451908759181e-03 5.386675588819112015e-03 2.647987065419114220e-03 1.945151326898116647e-03 2.185834437642688796e-03 1.308592809954667313e-01 8.989051563651696830e-02 9.428368432597439286e-02 1.033078799269066539e-01 3.554318278898807148e-03 1.203243417828307599e-01 1.211806258335571401e-01 9.592344316631169765e-02 9.294998792597601589e-02 6.160395131560401395e-03 1.536643365604327405e-01 1.128352739446694813e-01 7.090130360684333832e-02 6.195985676309571227e-02 4.635164221771610749e-02 3.673769454025149067e-02 5.272897050584021000e-02 7.738282041456003013e-02 1.752490351754096010e-01 5.097755923726575433e-02 1.356750207575018741e-01 2.171941930839053070e-01 1.508119544321235572e-01 1.554772874977227159e-01 1.023618757841533305e-01
9.140327936844465026e-03 4.752010095790581284e-03 2.722856004888596099e-03 3.723574199508594869e-03 3.430433817404356100e-03 1.923195347994346820e-03 6.835897613338541047e-03 5.917495825780829180e-03 1.413299685755797785e-01 1.029647905629775678e-01 3.869733420502861898e-02 9.044279751772253684e-02 2.243403728807907838e-01 1.996299049075551946e-01 2.169341356009079833e-02 1.651713287071911174e-02 1.285193800480806114e-01 1.538235950790000361e-01 7.019321786700921662e-02 3.110471272547498528e-02 2.997066828123083962e-02 4.618434955714493390e-02 6.875656479588129755e-02 2.041990318755191325e-01 2.050791928780174578e-01 4.877506056021482100e-02 5.557789151875457828e-02 7.171592489225654676e-02 2.334061031290099453e-01 4.771825528622603702e-02
1.230523703256947675e-02 1.062149708364217536e-02 3.246169169140087057e-03 1.109485202227176830e-02 1.270794824592470264e-02 2.377597240350442023e-02 1.684343561396479255e-02 2.556139940953062236e-03 1.430015445584849054e-01 8.343565991932583303e-02 2.529350479956124151e-02 3.218966685827555352e-02 3.411132777285891954e-02 1.152427319103469378e-01 1.302494032821208680e-01 5.436568958564710896e-02 4.530621247866065820e-02 4.929825409090573402e-02 6.696741606097704469e-02 3.881486349633352095e-02 2.740191243559383580e-02 4.055789787635759314e-02 4.557365143761513832e-02 7.487706131605167958e-02 2.317704870774865977e-01 3.662456504322615658e-02 5.351710255425937840e-02 8.769737935952374996e-02 1.057721967525499934e-01 2.098537103804621884e-01
6.756931559929511485e-03 1.676051169271161947e-02 5.020207906759175179e-03 5.338603914299349697e-03 2.548225519482583828e-02 2.667916877873376807e-02 1.875517956342309320e-02 2.504409353420645190e-01 1.925670767344070944e-01 1.813168945555293232e-01 7.463673459492477236e-02 3.765181084659994376e-02 2.243796434857092334e-02 3.480447664681535908e-02 1.569618738236193412e-01 4.069720253772107083e-02 1.099013873436253674e-01 2.145762750882467332e-02 4.168676497714532414e-02 1.498482495339126530e-01 3.851075309652745443e-02 5.368058800816982029e-02 4.649006012487960637e-02 5.043562317330162192e-02 6.654054719042531985e-02 5.098611680733095008e-02 6.027022422418240599e-02 7.415623710419765036e-02 9.959974033733227927e-02 2.442276847931591499e-01
