25.8994796333476 25.8883739412174 25.7893819418609 25.6894463547396 25.5885686825112 25.5392529173671 25.5375649537844 25.5358787908151 25.5341944284721 25.460728041582 25.383062509955 25.3063336527206 25.2565094482294 25.2565094482294 25.2565094482294 25.2565094482294 25.3916546352266 25.5707785570715 25.7499027701744 25.8994796333476 25.8994796333476 25.8994796333476 25.8994796333476 25.8994796333476 25.8994796333476 25.8994796333476 25.8994796333476 25.8994796333476 25.8994796333476 25.8994796333476
25.8994796333476 25.8933638749703 25.8429171187543 25.7915270200281 25.7391950811091 25.7135270775314 25.7118393830486 25.7101534888917 25.7084693950747 25.5884667384518 25.4622566654293 25.3369830234192 25.2565094482294 25.2565094482294 25.2565094482294 25.2565094482294 25.3933699628007 25.5724920341426 25.7516143967278 25.8994796333476 25.8994796333476 25.8994796333476 25.8994796333476 25.8994796333476 25.8994796333476 25.8994796333476 25.8994796333476 25.8994796333476 25.8994796333476 25.8994796333476
25.8994796333476 25.8992987162274 25.8973962125907 25.89455061168 25.8907634154733 25.8878012743496 25.8861138489611 25.8844282236117 25.8827443983147 25.7152688564671 25.5405152324234 25.36669779603 25.2565094482294 25.2565094482294 25.2565094482294 25.2565094482294 25.3950849988168 25.5742052199696 25.7533257323517 25.8994796333476 25.8994796333476 25.8994796333476 25.8994796333476 25.8994796333476 25.8994796333476 25.8994796333476 25.8994796333476 25.8994796333476 25.8994796333476 25.8994796333476
25.8994796333476 25.8994796333476 25.8994796333476 25.8994796333476 25.8994796333476 25.8744649880038 25.8298994713727 25.7862725998595 25.7435828717466 25.6130041389372 25.4780676759465 25.3421946818183 25.2565094482294 25.2565094482294 25.2565094482294 25.2565094482294 25.3653505367706 25.5051438145827 25.6458649082649 25.767844111012 25.8077150534283 25.8466593771735 25.8846785842211 25.8994796333476 25.8994796333476 25.8994796333476 25.8994796333476 25.8994796333476 25.8994796333476 25.8994796333476
25.8994796333476 25.8994796333476 25.8994796333476 25.8994796333476 25.8994796333476 25.8467447649478 25.7536362664219 25.6614661688863 25.5702329709636 25.4846196640692 25.3982284710312 25.3109009902109 25.2565094482294 25.2565094482294 25.2565094482294 25.2565094482294 25.3281902376549 25.4194368150948 25.5116109671431 25.6037981165799 25.6922141023994 25.7797037103488 25.8662684420619 25.8994796333476 25.8994796333476 25.8994796333476 25.8994796333476 25.8994796333476 25.8994796333476 25.8994796333476
25.8994796333476 25.8994796333476 25.8994796333476 25.8994796333476 25.8994796333476 25.8180843521164 25.6764338615629 25.5357215278903 25.3959458500615 25.3571716398815 25.3193247265533 25.2805417687803 25.2565094482294 25.2565094482294 25.2565094482294 25.2565094482294 25.2901004565113 25.332801323941 25.3764295247348 25.4406782693369 25.5776383084695 25.7136722105159 25.8487814767692 25.8994796333476 25.8994796333476 25.8994796333476 25.8994796333476 25.8994796333476 25.8994796333476 25.8994796333476
25.8994796333476 25.8994796333476 25.8994796333476 25.8994796333476 25.8994796333476 25.795358050294 25.6162484503988 25.4371385558733 25.2580283670317 25.2565094482294 25.2565094482294 25.2565094482294 25.2565094482294 25.2565094482294 25.2565094482294 25.2565094482294 25.2619374663643 25.2677813188367 25.2726980791711 25.3141384392683 25.4868627288912 25.6605134952937 25.8350892368937 25.8994796333476 25.8994796333476 25.8994796333476 25.8993912774639 25.8978050798615 25.8971363586276 25.8973836123484
25.8994796333476 25.8994796333476 25.8994796333476 25.8994796333476 25.8994796333476 25.7936241380143 25.6145163865782 25.4354083405264 25.2565094482294 25.2565094482294 25.2565094482294 25.2565094482294 25.2565094482294 25.2565094482294 25.2565094482294 25.2565094482294 25.3018855013158 25.3562730838352 25.4097338154256 25.4788227651146 25.6030012835245 25.7281060379369 25.8541355271105 25.8994796333476 25.8994796333476 25.8994796333476 25.8968350389422 25.8467035036309 25.7974892060193 25.7491906450333
25.8994796333476 25.8994796333476 25.8994796333476 25.8994796333476 25.8994796333476 25.7918905206644 25.6127846173734 25.4336784194809 25.2565094482294 25.2565094482294 25.2565094482294 25.2565094482294 25.2565094482294 25.2565094482294 25.2565094482294 25.2565094482294 25.3427623080782 25.4456926310433 25.5476963442701 25.6425810705744 25.7182148077292 25.7947745401278 25.8722587668685 25.8994796333476 25.8994796333476 25.8994796333476 25.8933600349519 25.7946841516935 25.6969252674832 25.6000818815873
25.8994796333476 25.8994796333476 25.8994796333476 25.8994796333476 25.8994796333476 25.7901571982307 25.6110531427703 25.4319487927229 25.2565094482294 25.2565094482294 25.2565094482294 25.2565094482294 25.2565094482294 25.2565094482294 25.2565094482294 25.2565094482294 25.3845676499435 25.5360397240061 25.6865854295036 25.8054135915998 25.8325035372045 25.8605192373116 25.8894591913592 25.8994796333476 25.8994796333476 25.8994796333476 25.8889664996521 25.7417472579544 25.595444776671 25.4500575554081
25.8994796333476 25.8994796333476 25.8994796333476 25.8994796333476 25.8994796333476 25.8051050539607 25.6521440416732 25.4982452090651 25.3480351872206 25.3463553076643 25.3446772258919 25.3430009419163 25.3413264557513 25.3396537674101 25.3379828769064 25.3363137842529 25.4684253361244 25.624957865066 25.7824189015386 25.8994796333476 25.8994796333476 25.8994796333476 25.8994796333476 25.8870562199127 25.869296417111 25.852456127064 25.8248572986138 25.6640497709586 25.5023233475376 25.3396795290198
25.8994796333476 25.8994796333476 25.8994796333476 25.8994796333476 25.8994796333476 25.83420337765 25.7297839651107 25.624426976297 25.5223105199679 25.5206309085969 25.5189530947228 25.5172770783585 25.5156028595181 25.5139304382143 25.5122598144611 25.5105909882713 25.6024659295775 25.7104552565277 25.8193728495556 25.8994796333476 25.8994796333476 25.8994796333476 25.8994796333476 25.8538691853838 25.7875666088967 25.722183305818 25.6534192011471 25.5411564856582 25.4279751133172 25.3138765844535
25.8994796333476 25.8994796333476 25.8994796333476 25.8994796333476 25.8994796333476 25.8642410992572 25.8083622974295 25.7515461633546 25.6965858893003 25.6949065461094 25.6932290001284 25.6915532513704 25.6898792998491 25.6882071455776 25.6865367885695 25.684868228838 25.7355781516722 25.7950252658428 25.8554004046551 25.8994796333476 25.8994796333476 25.8994796333476 25.8994796333476 25.8197610300695 25.7049166689116 25.5909913418341 25.4828994726606 25.4191805799657 25.354543269316 25.2889890407
25.8994796333476 25.8994796333476 25.8994796333476 25.8994796333476 25.8994796333476 25.8952179793047 25.8878787994048 25.8796025312677 25.8708612952144 25.8691822201981 25.8675049421047 25.8658294609476 25.8641557767401 25.8624838894954 25.8608137992273 25.8591455059488 25.8677622390803 25.8786681294288 25.890501803001 25.8994796333476 25.8994796333476 25.8994796333476 25.8994796333476 25.7847319888465 25.6213468317799 25.458880469482 25.3132978790314 25.2981218200133 25.2820275819192 25.2650166643986
25.8994796333476 25.8994796333476 25.8994796333476 25.8994796333476 25.8994796333476 25.8994796333476 25.8994796333476 25.8994796333476 25.8994796333476 25.8994796333476 25.8994796333476 25.8994796333476 25.8994796333476 25.8994796333476 25.8994796333476 25.8994796333476 25.8994796333476 25.8994796333476 25.8994796333476 25.8888965204986 25.8540403038144 25.8201071315229 25.7870955044346 25.6757427530968 25.5311194250338 25.3855751669422 25.2565094482294 25.2565094482294 25.2565094482294 25.2565094482294
25.8994796333476 25.8994796333476 25.8994796333476 25.8994796333476 25.8994796333476 25.8994796333476 25.8994796333476 25.8994796333476 25.8994796333476 25.8994796333476 25.8994796333476 25.8994796333476 25.8994796333476 25.8994796333476 25.8994796333476 25.8994796333476 25.8994796333476 25.8994796333476 25.8994796333476 25.8736065846754 25.7902103981965 25.707737015747 25.6261849384777 25.5349367420979 25.4388556617246 25.3418538909142 25.2565094482294 25.2565094482294 25.2565094482294 25.2565094482294
25.8994796333476 25.8994796333476 25.8994796333476 25.8994796333476 25.8994796333476 25.8994796333476 25.8994796333476 25.8994796333476 25.8994796333476 25.8994796333476 25.8994796333476 25.8994796333476 25.8994796333476 25.8994796333476 25.8994796333476 25.8994796333476 25.8994796333476 25.8994796333476 25.8994796333476 25.8573921887316 25.7254570207087 25.59444441637 25.4643528772056 25.3950514542983 25.3475116329901 25.2990513608182 25.2565094482294 25.2565094482294 25.2565094482294 25.2565094482294
25.8994796333476 25.8994796333476 25.8994796333476 25.8994796333476 25.8994796333476 25.8994796333476 25.8994796333476 25.8994796333476 25.8994796333476 25.8994796333476 25.8994796333476 25.8994796333476 25.8994796333476 25.8994796333476 25.8994796333476 25.8994796333476 25.8994796333476 25.8994796333476 25.8994796333476 25.8415570596652 25.6638434649412 25.4852069667142 25.3056490637815 25.2569322416009 25.257087104243 25.257167342321 25.2565094482294 25.2565094482294 25.2565094482294 25.2565094482294
25.8994796333476 25.8994796333476 25.8994796333476 25.8994796333476 25.8994796333476 25.8994796333476 25.8994796333476 25.8994796333476 25.8994796333476 25.8994796333476 25.8994796333476 25.8994796333476 25.8994796333476 25.8994796333476 25.8994796333476 25.8994796333476 25.8994796333476 25.8994796333476 25.8994796333476 25.8562099933215 25.7270370948052 25.596941533124 25.4659248067361 25.3949767875063 25.3454370555461 25.2968172953544 25.2565094482294 25.2565094482294 25.2565094482294 25.2565094482294
25.8994796333476 25.8994796333476 25.8994796333476 25.8994796333476 25.8994796333476 25.8994796333476 25.8994796333476 25.8994796333476 25.8994796333476 25.8994796333476 25.8994796333476 25.8994796333476 25.8994796333476 25.8994796333476 25.8994796333476 25.8994796333476 25.8994796333476 25.8994796333476 25.8994796333476 25.8717872603435 25.791154069915 25.7095984566434 25.6271219186458 25.5321013146873 25.4340232880167 25.3368649935933 25.2565094482294 25.2565094482294 25.2565094482294 25.2565094482294
25.8994796333476 25.8994796333476 25.8994796333476 25.8994796333476 25.8994796333476 25.8994796333476 25.8994796333476 25.8994796333476 25.8994796333476 25.8994796333476 25.8994796333476 25.8994796333476 25.8994796333476 25.8994796333476 25.8994796333476 25.8994796333476 25.8994796333476 25.8994796333476 25.8994796333476 25.8882886248988 25.8561941546926 25.8231775019462 25.7892401644382 25.6683060579379 25.5216907241685 25.3759948831426 25.2565094482294 25.2565094482294 25.2565094482294 25.2565094482294
25.8994796333476 25.8994796333476 25.8994796333476 25.8994796333476 25.8994796333476 25.8994796333476 25.8994796333476 25.8994796333476 25.8994796333476 25.8994796333476 25.8994796333476 25.8994796333476 25.8994796333476 25.8994796333476 25.8994796333476 25.8994796333476 25.8994796333476 25.8994796333476 25.8994796333476 25.8994796333476 25.8994796333476 25.8994796333476 25.8994796333476 25.772513409335 25.6078407390384 25.4422500327907 25.303687892346 25.2887329052814 25.274694762523 25.2615719665129
25.8994796333476 25.8994796333476 25.8994796333476 25.8994796333476 25.8994796333476 25.8994796333476 25.8994796333476 25.8994796333476 25.8994796333476 25.8994796333476 25.8994796333476 25.8994796333476 25.8994796333476 25.8994796333476 25.8994796333476 25.8994796333476 25.8994796333476 25.8994796333476 25.8994796333476 25.8994796333476 25.8994796333476 25.8994796333476 25.8994796333476 25.8090346558677 25.6929012700345 25.5758500874604 25.4684183415478 25.4049257233784 25.3423497107653 25.28068880649
25.8994796333476 25.8994796333476 25.8994796333476 25.8994796333476 25.8994796333476 25.8994796333476 25.8994796333476 25.8994796333476 25.8994796333476 25.8994796333476 25.8994796333476 25.8994796333476 25.8994796333476 25.8994796333476 25.8994796333476 25.8994796333476 25.8994796333476 25.8994796333476 25.8994796333476 25.8994796333476 25.8994796333476 25.8994796333476 25.8994796333476 25.846475596609 25.7788805077542 25.710367861351 25.6322324200359 25.5202031579751 25.4090902627379 25.2988922374451
25.8994796333476 25.8994796333476 25.8994796333476 25.8994796333476 25.8994796333476 25.8994796333476 25.8994796333476 25.8994796333476 25.8994796333476 25.8994796333476 25.8994796333476 25.8994796333476 25.8994796333476 25.8994796333476 25.8994796333476 25.8994796333476 25.8994796333476 25.8994796333476 25.8994796333476 25.8994796333476 25.8994796333476 25.8994796333476 25.8994796333476 25.8848359967914 25.8657782176829 25.8458031202009 25.7951303617931 25.6345654428013 25.4749166519168 25.3161824926016
25.8994796333476 25.8994796333476 25.8994796333476 25.8994796333476 25.8994796333476 25.8994796333476 25.8994796333476 25.8994796333476 25.8994796333476 25.8994796333476 25.8994796333476 25.8994796333476 25.8994796333476 25.8994796333476 25.8994796333476 25.8994796333476 25.8994796333476 25.8994796333476 25.8994796333476 25.8994796333476 25.8994796333476 25.8994796333476 25.8994796333476 25.8994796333476 25.8994796333476 25.8994796333476 25.8596586585888 25.6805780101409 25.5014970739317 25.3224158502747
25.8994796333476 25.8994796333476 25.8994796333476 25.8994796333476 25.8994796333476 25.8994796333476 25.8994796333476 25.8994796333476 25.8994796333476 25.8994796333476 25.8994796333476 25.8994796333476 25.8994796333476 25.8994796333476 25.8994796333476 25.8994796333476 25.8994796333476 25.8994796333476 25.8994796333476 25.8994796333476 25.8994796333476 25.8994796333476 25.8994796333476 25.8994796333476 25.8994796333476 25.8994796333476 25.8579690428072 25.6788902371478 25.4998111437412 25.3207317629007
25.8994796333476 25.8994796333476 25.8994796333476 25.8994796333476 25.8994796333476 25.8994796333476 25.8994796333476 25.8994796333476 25.8994796333476 25.8994796333476 25.8994796333476 25.8994796333476 25.8994796333476 25.8994796333476 25.8994796333476 25.8994796333476 25.8994796333476 25.8994796333476 25.8994796333476 25.8994796333476 25.8994796333476 25.8994796333476 25.8994796333476 25.8994796333476 25.8994796333476 25.8994796333476 25.8562797150875 25.6772027519025 25.4981255009843 25.3190479626461
25.8994796333476 25.8994796333476 25.8994796333476 25.8994796333476 25.8994796333476 25.8994796333476 25.8994796333476 25.8994796333476 25.8994796333476 25.8994796333476 25.8994796333476 25.8994796333476 25.8994796333476 25.8994796333476 25.8994796333476 25.8994796333476 25.8994796333476 25.8994796333476 25.8994796333476 25.8994796333476 25.8994796333476 25.8994796333476 25.8994796333476 25.8994796333476 25.8994796333476 25.8994796333476 25.8545906754155 25.675515554391 25.496440145647 25.3173644494971
25.8994796333476 25.8994796333476 25.8994796333476 25.8994796333476 25.8994796333476 25.8994796333476 25.8994796333476 25.8994796333476 25.8994796333476 25.8994796333476 25.8994796333476 25.8994796333476 25.8994796333476 25.8994796333476 25.8994796333476 25.8994796333476 25.8994796333476 25.8994796333476 25.8994796333476 25.8994796333476 25.8994796333476 25.8994796333476 25.8994796333476 25.8608673796953 25.816325823869 25.7727006794504 25.7063101151309 25.572318685709 25.4374114583783 25.3015899289203
