4.023822287781309015e-01 6.108946425507372213e-01 5.272492019196081126e-01 6.620286201361755829e-01 4.972453982030030084e-01 1.091170905489095455e+00 1.082717810323761576e+00 2.938048899087056576e+00 5.390683059338869043e+00 2.424438434908294138e+00 1.140125620698566378e+00 2.633441457884123094e-01 1.580553034152878400e-01 6.194937740309465202e-01 7.660555659285934738e-01 1.805407505351685205e-01 6.918880399650666480e-01 1.324735918743147778e+00 1.326103997521285605e+00 5.109951875025128265e-01 4.154557132730872238e-01 6.111739701422541637e-02 4.823187676778674382e-02 1.977218938065595788e-01 3.987383890679088716e-01 3.271863743251365864e-01 1.593222203149323724e-01 1.435642943724826232e-02 1.397100300695582401e-02 1.803721233148801104e-02
3.056360806971440414e-01 6.993961358487316149e-01 1.254681583311408222e+00 1.013909463662450161e+00 7.031658746801596749e-01 3.166124288969581091e+00 1.524575841010159971e+00 1.918224115502948246e+00 1.278346191641571261e+00 1.093331932968874431e+00 7.934083224365574560e-01 1.588650235140696698e-01 2.181417027738942749e-01 5.222853639300036876e-01 7.657401922459552424e-01 5.237184479312738672e-01 7.068915033933063086e-01 2.548836154072014359e+00 2.147444091355427798e+00 7.164959322099223593e-01 2.617152328636893066e-01 6.006611479885168997e-02 1.293928907974653819e-01 1.196705413136688184e-01 1.119392341695267246e-01 1.602411660442540353e-01 6.129906153426834675e-02 1.559238303791208625e-02 2.192835105889161945e-02 2.181479719218718666e-02
3.646085674611482474e+00 3.838178924665048175e+00 8.117182988549183520e+00 6.551848544770668248e+00 1.402249245526734001e+01 1.446880836782707291e+00 2.771411824865795959e-01 3.011015855232813676e-01 5.018381448974653658e+00 1.536070855311353123e+00 4.213244457242785401e+00 2.889341444852558727e+00 1.103320398463718544e+00 1.687510592604378079e+00 3.360634117830093581e-01 1.493146843674142632e+00 1.092443832948693183e+00 2.491158873407392615e+00 9.356144496568438385e+00 1.744028446631237239e+00 1.722124000436574265e-01 5.154398285608540603e-02 8.150018254774374360e-02 3.034919355889191539e-02 1.972577027766242788e-02 1.439976452904601252e-02 1.422482071805693943e-02 1.058643073882817656e-02 1.703200775502323669e-02 1.837660508801459286e-02
1.730181577830034900e+00 5.123309516141055120e+00 1.125302961000209656e+01 9.040832470905435514e+00 3.743094322036841781e+00 5.842958465646843624e-01 4.732695118984105442e-01 3.174896420587229318e-01 1.969414396959971447e-01 1.818525120017414842e+00 1.166026132137693017e+00 2.345022224018302737e+00 1.096436059099893834e+00 7.837730100414257439e-01 2.446883801841659434e-01 1.988765783586597113e-01 4.474865130891083620e-01 9.092759790716146151e-01 7.131308159990698003e-01 6.688311416392551667e-01 3.194676015295813687e-01 1.141759459423748874e-01 3.725039688450139386e-02 7.689924483386952059e-02 1.568349479631410068e-02 1.274115091283859781e-02 1.208832880195453117e-02 1.065640485661970352e-02 1.991363194004031403e-02 2.066551266635434717e-02
1.034534080210453455e+00 3.326444020273737756e+00 9.257970569721223342e+00 3.585319476915522774e+00 2.076709893606274004e+00 3.045417175133425247e-01 4.657028806224886575e-01 2.588830609513791958e-01 1.182744671306444895e-01 3.994460358609084327e+00 4.868922063765846353e+00 4.099528347385466454e+00 6.217715497212401576e-01 5.616871846397227808e-01 2.840995201162636041e-01 1.132495917336096419e-01 1.291733469254915834e+00 7.868858980259683111e-01 1.359767486251503454e+00 8.315991471245529620e-01 6.079960136639809276e-01 1.798485887162268593e-01 4.196173349487162252e-01 1.228454461262242364e-01 2.670680966590580421e-02 1.592969961822674613e-02 1.212056148960365988e-02 1.311454134763528900e-02 1.891470312023013287e-02 6.660395756368682474e-02
1.078232918931692597e+00 1.183223161581459015e+00 5.283011390104777938e+00 4.222264540417427270e+00 1.688001386020341776e+00 1.790476603510848530e-01 2.143672937388211297e-01 2.265452916719783438e-01 2.073761357325991650e-01 5.944610655415071498e+00 4.440648059846478368e+00 2.260918248415183740e+00 2.628937652525911717e-01 8.707823027569329410e-02 7.184467716608994303e-02 1.272770186772674006e-01 6.972543706452892787e-01 1.883939172792659100e-01 6.398409792366305249e-01 2.312578132341187143e+00 3.014857158621618627e+00 1.923819322909546825e+00 5.155470743348153917e-01 7.093087538951453608e-02 3.805839137332505534e-02 3.943289464298042890e-02 2.666522359314699164e-02 1.722399368852037607e-02 2.093636582190967418e-02 3.621728077949108726e-02
1.497171816607438810e-01 2.516785579298065345e-01 2.666552260495491100e-01 1.356674841236624296e+00 6.537924536970803890e-01 1.071103184510778350e+00 1.586466229863975341e+00 8.869760910667701115e-01 1.030537067338823665e+00 1.122498047281899058e+00 8.131421014721731400e-01 3.193562388653596318e-01 1.328424469556525878e-01 5.628413736174071175e-02 3.221422428609804767e-02 6.266020860101213785e-02 3.818555536078243051e-01 1.846821438678670213e-01 9.697773263884010841e-01 1.375239564897017708e+00 6.801279497099634863e-01 1.757008908550008741e-01 7.436103299783902720e-02 6.192754742028016429e-02 2.480209877606846108e-02 2.783256788251250655e-02 2.631831182034467462e-02 2.143582839797986139e-02 2.302764871498362911e-02 5.276936543783123518e-02
2.959908555339688663e-01 5.677432868609474381e-01 3.373318983197244325e-01 7.398127234105219552e-01 1.152827944905233437e+00 1.296722738396104635e+00 1.143007024503062130e+00 1.075502970030500105e+00 8.656866958334548112e-01 4.605514827713432235e-01 1.767659684334855208e-01 5.234140432266298770e-01 1.111348915056180331e-01 3.883120778921118205e-02 4.195374807102153492e-02 8.198877936765754104e-02 7.033473406964202423e-01 1.162906403851980963e+00 1.063536839917205157e+00 7.945932030166027449e-01 2.333833611084787651e-01 1.177400627484762041e-01 4.244767070033027279e-02 3.502282746161354543e-02 1.758083446412592871e-02 1.983655440918860244e-02 3.272620993455917920e-02 3.920013382944217972e-02 3.746355061035947648e-02 1.067734665514620540e-01
7.227123637152749192e-01 4.868258032193695795e-01 2.933043894755985037e-01 1.756200613588821069e+00 1.181535180469641455e+00 5.078901809166407322e-01 1.649764783270472712e+00 7.498850021003106159e-01 6.440469839753734105e-01 6.096996552739045727e-01 5.242256612220421719e-01 6.693447732437337594e-01 1.446363225484360360e+00 9.656021347528869203e-01 1.472851535256600175e-01 1.375464008665988336e-01 6.176482849537444642e-01 1.956908669242577892e+00 2.030605331109160527e+00 3.601808862486079454e-01 6.080322413985012053e-02 5.005124177910900973e-02 5.025639230331786084e-02 3.241999301854549265e-02 1.975436782687665579e-02 3.226151914582743585e-02 1.282718705141159266e-01 2.486881084306980516e-01 6.968127102515493387e-01 3.362642549482314780e-01
1.134802246392804914e+00 7.432927849585526658e-01 1.228295500459327005e+00 1.195221164534576719e+00 1.110440395368432975e+00 2.256585609666787173e-01 1.067132997265092254e+00 4.670242721876362579e-01 2.042877330571042094e-01 7.416828587341478540e-02 1.057175311504809034e+00 1.003770220225226328e+00 2.081986660052389304e+00 2.220517977877696225e+00 1.048157151191521308e+00 1.130927654662588600e+00 6.251735491261649180e+00 6.798088091540467559e+00 2.904993469002407291e+00 1.389664621734873373e+00 7.273782577228560253e-02 3.654114770669131262e-02 3.956810887377572999e-02 4.322418809016795316e-02 2.456502422874062841e-02 3.329015810281909377e-02 3.294432277748276516e-01 5.487840435583074550e-01 6.684710647089401325e-01 1.726120890151530141e-01
9.486160341983187472e-01 4.939471115171914506e-01 1.129669400561260861e+00 9.947071162527650889e-01 1.336149467387560241e+00 1.272801583532450209e-01 1.103490546118276461e-01 9.962140792310418547e-02 6.547969599638303606e-02 5.749585437012999511e-01 8.786929974286403322e+00 1.430887304286725126e+01 2.879440716979661374e+01 1.365761506297179828e+01 2.436394012461413627e+00 4.581573991374996879e+00 8.669005159620667200e+00 2.495385860344720985e+00 6.294082534136729024e-01 1.338517416567792107e-01 4.766732479042819215e-02 3.460924642209832480e-02 4.295475829614307794e-02 6.011694558292213220e-02 6.505941011273855268e-02 3.650075648194951727e-02 6.016402053728621413e-02 4.730187219577118574e-02 4.183738468938517918e-02 2.974649296972351614e-02
1.822120166733404156e-01 1.066351427591828716e-01 9.453087464435729892e-01 9.431035704680760245e-01 7.611119898961524743e-01 1.813891054589574225e-01 7.327896894612996592e-02 4.899059016775777348e-02 6.362922148026044222e-02 1.169221772249347868e+00 2.759401817634222098e+00 1.757263692627901364e+01 3.052784513917282894e+01 1.509933893921604486e+01 5.240652375431420928e+00 5.641203994543942279e+00 6.211457371960631413e+00 3.720666140411209799e+00 9.401017358093637366e-01 2.739438270481231452e-01 4.146450499422454222e-02 3.765661051043928814e-02 4.370677015350556832e-02 7.847208762301759177e-02 7.556786810189797254e-02 5.481275921407487844e-02 4.291359448117600811e-02 3.879359412486128866e-02 4.147139428208337225e-02 4.452475516693715080e-02
3.619211083875232410e-02 9.313870492186723804e-02 2.246650270223560508e-01 6.373465698003666358e-01 4.231345450160802768e-01 1.386870381076263370e-01 7.397505252094052630e-02 6.490824746836373893e-02 8.650086496956506388e-02 6.134072830231873663e-01 1.991541428108952738e-01 5.874774642505553146e+00 2.373296068899050582e+01 9.547298830021622607e+00 2.844465042346739470e+00 3.114417412891887782e+00 1.121381841292470760e+00 1.621051731370019233e+00 1.834460650217981437e+00 6.913943242540568912e-01 4.716251586431929183e-02 4.269889512401255777e-02 5.205545647742514798e-02 8.936634710267438164e-02 1.170868317926745672e-01 1.109208022284196432e-01 8.314429388211630467e-02 7.621372852492784566e-02 5.873890715639288468e-02 4.638540928642645444e-02
2.960477630193072973e-02 8.498728595306592748e-02 1.513438560720347936e-01 1.088992037730028700e-01 6.441131912178717223e-02 2.629880660603886589e-01 9.615157618173263421e-01 8.940734774835913390e-01 1.266691112167245836e-01 3.869355439269337588e-02 1.538975988616718693e-01 1.009169037557918758e+00 1.134779540489303606e+01 1.418064077541348667e+01 1.414550106822828290e+01 1.790368772395432018e+01 1.529435201828462176e+01 9.474802500869339283e+00 2.491110599167699746e+01 1.140244197024089878e+01 9.550366219430980186e-01 2.795858640880541923e-01 2.114652893908569864e-01 5.264969207820402453e-01 1.196735392620462246e+00 1.110229846706835222e+00 3.076063717197106584e+00 1.051044828403630893e+00 8.735363501992951529e-02 8.831236404479209101e-02
2.730897519797741146e-02 2.741755680306974530e-02 7.414336563355262977e-02 5.487638319562639921e-01 1.989940414757733200e-01 4.784870527983447336e-02 6.533763103446406095e-01 2.013476052213032386e+00 1.460356139589032765e+00 1.530527201038218432e-01 3.322342164343299875e-01 5.328138857492763947e+00 1.091229966720294797e+01 1.271485134517783600e+01 1.063937855592891601e+01 1.195553244131374093e+01 1.891734615082372173e+01 3.056114495232973027e+01 2.941975962248831777e+01 2.252116804124906935e+01 9.668564214853230254e-01 1.013622334478902376e+00 8.938536454719704372e-01 2.737497604875060553e+00 3.825195173619114986e+00 1.942952530814014978e+01 1.973225429773775375e+01 4.178638885981034612e+00 9.765676928151710567e-02 6.104613387450733009e-02
2.460967869836732866e-02 2.685352785022834810e-02 6.065256541676235236e-02 6.668111574781490636e-02 4.430967360013882833e-02 5.123033625893640142e-02 3.694557448555172430e-01 1.073297689121923026e+00 2.323523829717472289e+00 8.775273954061763027e-01 9.556290939404569196e-01 8.788016252647409265e-01 6.725617905626954496e+00 1.252758197987973787e+01 1.081304166797093202e+01 1.533260738521917688e+01 2.398982145801891619e+01 2.668393535332531386e+01 1.434913945650257183e+01 3.004705882154369512e+00 1.787229397827416966e+00 1.209681497489337865e+01 1.734565173272976324e+01 2.841425739039291543e+01 2.621555520903370962e+01 3.434646613396347448e+01 2.822743609038576906e+01 8.430759834756512916e+00 1.512909250076009959e-01 7.009959725072868741e-02
3.092657586490965907e-02 3.588894593461486315e-02 3.513672009514288985e-02 3.352795682577289910e-02 5.161754510621787556e-02 1.080598973735492907e-01 6.292257378238033994e+00 2.126395695854985846e+01 1.068542495842284801e+01 1.955434716065921785e+00 1.577328281456695791e+00 2.695480490914033300e+00 5.340056251443851210e+00 7.190735411181656822e+00 8.704721541380539662e+00 1.441936876090015041e+01 2.737314052426642874e+01 2.473972677166652545e+01 1.074315374522973876e+01 3.480985802046657085e+00 1.453352624680614724e+01 2.550818419302060391e+01 3.195034190335109869e+01 3.209777318000698898e+01 2.819062728063827805e+01 2.494376291594701200e+01 3.828710565414748856e+01 6.856579828127960852e+00 2.244546020240991702e-01 9.598835729388867366e-02
7.679612777838965010e-02 6.062284917770770915e-02 3.148471635298718402e-02 4.996683392494955661e-02 6.669364804118570467e-01 3.353711305847881796e+00 1.841661734724562294e+01 1.505631204400663847e+01 1.524954606307127847e+01 8.159550680765763175e+00 3.268262044495880314e+00 9.908578170471744606e-01 9.826915720601905324e-01 2.297281376264517228e+00 4.717558329554272234e+00 2.010221611090745952e+01 1.814022338712591065e+01 1.858386851915901161e+01 2.903154288728913901e+00 4.730502535754438576e+00 1.593149822347963607e+01 3.298230502475649217e+01 3.945786501792155576e+01 4.010247725254447460e+01 3.344327378292781106e+01 3.362831781286092081e+01 3.298690427087947086e+01 2.623418132935356439e+01 1.171785256879676496e+00 7.774112974336077064e-01
3.481274666211999630e-02 9.754695400961888030e-02 1.841060947577626283e-01 1.323104080696338780e+00 3.108807949296139128e+00 4.436501531175609081e+00 1.392769098720814114e+01 1.747964683844156042e+01 1.235676938307647887e+01 1.003841532451132679e+01 2.245320770960867574e+00 2.365819991254680676e-01 3.553452671066756885e-01 9.173364755221995459e-01 1.828406748523792036e+00 1.002722558074303905e+01 3.338408445639597044e+00 9.475921255383287223e-01 2.840298467519229431e-01 1.882145679197295696e+00 6.698680725880580944e+00 3.376059815619863969e+01 4.089391950837512724e+01 4.122408242986193017e+01 2.973794788321833948e+01 1.392577734400533807e+01 2.311107759525620864e+01 1.590416795731124466e+01 1.439337754579171014e+00 5.709689244434877908e-01
9.001240096257046019e-01 1.202719958656312649e+00 8.497180402059097970e-01 1.126326283573384712e+00 2.880502262897843835e+00 1.704598155541211968e+00 8.906938622441705533e+00 1.168948607207158119e+01 1.109705373981815058e+01 2.655047519420673741e+00 6.805573441933533418e-01 1.467693535164903418e-01 2.487402668211178003e-01 6.784831385173314411e-01 2.501515124374698029e+00 1.576949368329271906e+00 2.549822981248371701e+00 6.710883120355014553e-01 1.121366873829083843e+00 4.784497656676134802e+00 2.383150879580263393e+01 4.233377111586597863e+01 4.304135777750020964e+01 3.862282648253719231e+01 2.847693104589099988e+01 2.043602709487153390e+01 1.974356672407480318e+01 1.332590581773158434e+01 1.203663673955254865e+00 4.292735627425237066e-01
2.671923329437516426e+00 2.601351045326857570e+00 1.463854087573935203e+00 1.167236055098713310e+00 1.706235755089184458e+00 9.650213704645809187e-01 5.684864623021239183e+00 5.259434837347377822e+00 1.499565134002835087e+00 7.876201344126050330e-01 2.630715624020441012e-01 2.034857257826673260e-01 1.168450578054038708e-01 6.151821650348667653e-02 1.526592119285977156e-01 4.919015061052055549e-01 1.557623279680256934e+00 3.170556016182742631e+00 2.737586700803511519e+00 1.106458397459184795e+01 2.772922403291263294e+01 3.733962382986172202e+01 1.424849003514824020e+01 1.965334958203521865e+01 2.357786303540038020e+01 1.264608410255698701e+01 9.191503931887448076e+00 7.566755883436989016e+00 2.779369494545697039e-01 2.508272989469716996e-01
2.238503791768739593e+00 2.750256998333438396e+00 4.538058071838561580e-01 3.555221707856784374e-01 3.344814296116329633e-01 5.332677624200701239e-01 7.950234664522858319e-01 2.081181899617874087e-01 2.802578654700909055e-01 4.190968818538240437e-02 5.254475096614072416e-02 7.696359162927302044e-02 8.184493361095533659e-02 2.802541174410689284e-01 7.602974214398727781e-01 9.423048261155356542e+00 1.598651625600360049e+01 2.076763807271836271e+01 1.284000996222111901e+01 8.836990785319430941e+00 5.726157941474885327e+00 1.891712032193296089e+00 6.781726045881012466e-01 1.318776609567666069e+00 4.350931519563760119e+00 1.365142475214664364e+00 1.203505054114524464e+00 4.065049457846137693e-01 4.606818420393992558e-02 3.751341078195161854e-02
4.850442606154190983e+00 3.944466693098869658e+00 4.778868420261088712e-01 2.327865387463990965e-01 3.895092710400049341e-01 3.227855245790507421e-01 5.168547044004259128e-01 5.741888939956759502e-02 4.967890076465079907e-02 2.058535581536305448e-02 4.683592859198839470e-02 8.536699979340804656e-02 1.088363270589323695e-01 5.592406309265394171e-01 8.744184114341357894e-01 5.195582116429434905e+00 1.695677817803940357e+01 2.864321413631301283e+01 2.960357889708532042e+01 2.352945775219693658e+01 4.578394710128537604e+00 9.389615415043491842e-01 1.062420417038664855e+00 2.377893924071153631e+00 4.917373989530109846e+00 1.359681020917670846e+00 4.992408050566057853e-01 1.861691661200144954e-01 5.769262654588994121e-02 5.148770876136872510e-02
6.334268370335928822e+00 8.443119549652291500e-01 2.592794661884342267e-01 9.519359846153435667e-02 1.229730176707291844e-01 2.833655229532976438e-01 3.754072475254901509e-01 4.323883356811015349e-02 2.429049807107700951e-02 2.689767718497666424e-02 4.576699411303761927e-02 7.530463930971538489e-02 8.137126104320153985e-02 4.265456724542959766e-01 1.573927472487890000e+00 7.178480564380961049e+00 1.247802285895347829e+01 2.611967308293144185e+01 3.020568920182833139e+01 2.343271544714022525e+01 1.062059852774066648e+01 5.593117380716436937e-01 3.612554035307106171e-01 7.328714062792879291e-01 4.024125621767593586e+00 2.306300572003533222e+00 2.008178495081980763e+00 3.702660157027102827e-01 5.259888413198130636e-02 3.929580382928798965e-02
3.772832034702318982e+00 1.207732290282478971e+00 5.113899815351918843e-01 5.288006261916087247e-01 1.338281834601744213e+00 9.584162983908155464e-01 4.044406482551349269e-01 1.693452517000223201e-01 2.567126018014200262e-01 3.194932707648471260e-01 2.856550291188147961e-02 3.103806841918139992e-02 4.601761068781769215e-02 9.795395460274664012e-02 5.587400721760777955e-01 2.154895508660641390e+00 1.974070168296218064e+00 7.755053045050491534e+00 9.232800822823437059e+00 7.290610796195627685e+00 5.519597511045249760e+00 6.493774594751245965e-01 9.137079947654304368e-02 1.724032434522958512e-01 7.503543259407031707e-01 1.843291124258943370e+00 4.863471982879086219e+00 2.652348393119326797e+00 6.439540836878696051e-02 4.702921629570724904e-02
1.368021357725341058e+00 5.605213490756365546e-01 6.497295128385562890e-01 1.215165127763905950e+00 7.568043385650504717e-01 3.546665535148325055e-01 1.660477900516471594e-01 1.191857878704398466e-01 3.812696610298987876e-01 1.409497423091420565e+00 9.200070900112825023e-02 3.058729938887472591e-02 4.911224986804355735e-02 1.010560882584782549e-01 4.518030543495740181e-01 7.671461136094634981e-01 4.866523002762113137e-01 2.243476455201604824e-01 3.315503424607527116e-01 5.616647307909103937e-01 9.164577447784471032e-01 1.934217148258560726e-01 9.288592449969763909e-02 4.627845747490823003e-01 1.113628599822699572e+00 3.896756927896353750e-01 1.320235282044334379e+00 1.426574093361553830e+00 4.934734650949701429e-01 7.341270009856863676e-02
1.386924641284972504e+00 1.150983992042159620e+00 6.086052258439739182e-01 4.957004890939949449e-01 5.263738023416316691e-01 2.063859477779270701e-01 1.387468034208679812e-01 1.451872642282695802e-01 1.618767915555136550e-01 6.168855408382941663e-01 1.668484420534389889e-01 1.526274828015453111e-01 1.366756002589131491e-01 1.594715204497406391e-01 4.359366608499960494e-01 2.908449835626511493e-01 1.885398061629068589e-01 1.089741058591798401e-01 9.307588868324441489e-02 6.907376813653584580e-02 5.277520665307804809e-02 7.418746293185324303e-02 1.137030711172494074e-01 2.778348821715944106e-01 4.807707354293032642e-01 2.276337231743240652e-01 3.574262987069337094e-01 2.288905295233759629e-01 2.245609363482831133e-01 1.414138365155261368e-01
1.878384698963546651e+00 1.013626124601364253e+00 6.260422824028789579e-01 9.521470116440938769e-01 9.542481759413455888e-01 5.403050498248354039e-01 1.878274383225100097e+00 1.455526263400678699e+00 2.178992736122384866e-01 1.508696531381234496e-01 5.152414679213258852e-02 1.137996367577261969e-01 3.204461295449058666e-01 3.338443900396382835e-01 9.819138308096387879e-01 7.073238180640621930e-01 2.150162345044808188e-01 2.470776514251982470e-01 1.111132564564791536e-01 4.721302632378870240e-02 4.192793421188630021e-02 6.256619654753606263e-02 9.506663135559383082e-02 2.904533525634492297e-01 2.941066301443338582e-01 6.961807793903390662e-02 7.654339777931526423e-02 9.587695681806024384e-02 3.057556725557691313e-01 6.228227262146653065e-02
2.529220673709377643e+00 2.265115002860182969e+00 7.456995493889427840e-01 2.839189164962490963e+00 3.747528334942126893e+00 7.353940180479404454e+00 5.049001403253059905e+00 5.883500084475481451e-01 2.150786990833530032e-01 1.185539527232136875e-01 3.353014483559673548e-02 4.029631564125694260e-02 4.794548249439797849e-02 1.823683229395552940e-01 2.195862972819892234e-01 9.576376534848421440e-02 8.985649075939018682e-02 1.054609898509741156e-01 1.407087377725239341e-01 7.445386283030969166e-02 4.027211170200122037e-02 5.435163072145964697e-02 6.063376111648244304e-02 1.004400933557129949e-01 3.116422420303169294e-01 4.851730178928297110e-02 6.939761180214251701e-02 1.128673769404500704e-01 1.350117722438188284e-01 2.681787663136600552e-01
1.418880018585306546e+00 3.653922681396435834e+00 1.184550384819135882e+00 1.404745060434180903e+00 7.624003237850491388e+00 8.405245740094510865e+00 5.779409790862850116e+00 4.113694017819015669e-01 2.950144882044397066e-01 2.640788050157967803e-01 1.031116473834195052e-01 4.878604178849722806e-02 2.982457009664904804e-02 4.995931943169300282e-02 2.308076232314262288e-01 6.514737819260058016e-02 2.194390465245873723e-01 1.260560636954805469e+00 2.142150754218091535e+00 2.865270467099231277e-01 5.562613011625999054e-02 7.011025850121931080e-02 5.943318038290829747e-02 6.483609891752924181e-02 8.564516542690130130e-02 6.514218111607025796e-02 7.597368831487677499e-02 9.325639996916097740e-02 1.252495992666063374e-01 3.081733925689236209e-01
