9.380653619462617776e-01 5.920042639506069987e-03 5.188912431632185240e-03 6.599150796610274081e-03 5.010601912345155964e-03 1.097271931299803258e-02 1.079255063425814745e-02 2.898389505864006760e-02 5.243758611617385657e-02 2.406006923357889571e-02 1.149011865426102612e-02 6.396693358948380981e-01 3.850745716797309703e-01 5.799099641982180357e-03 6.638381223661183814e-03 3.951036978638613473e-01 4.970738092815793832e-03 8.515689871604371908e-03 7.562220046208540172e-03 2.602990115645764137e-03 7.113289315788841050e-01 1.009860993609962843e-01 7.660670631989871526e-02 2.875222311856185931e-01 5.275020073137278720e-01 4.159978014112533651e-01 2.033209810275127816e-01 1.868053255588751627e-02 1.809192389248264268e-02 2.260371157321638264e-02
6.995691751517234547e-01 6.781879723013966611e-03 1.226581208099964369e-02 9.985338429763486803e-03 6.961864927515730786e-03 3.115658763731257025e-02 1.477319833918566694e-02 1.826480009451027231e-02 1.182323476774494245e-02 1.021753327842405898e-02 7.520046465194016837e-03 3.750136441308362656e-01 5.194982753011732068e-01 4.632178058309250474e-03 6.348687201285730698e-03 4.025261603044616443e-03 4.877122549102407001e-03 1.555143952281975300e-02 1.147431754439666787e-02 3.376243703085951564e-03 4.342996502359770528e-01 9.651496404128975803e-02 2.004306820196958827e-01 1.667728952323230263e-01 1.388899521788526381e-01 1.903176049716263363e-01 7.222246710823532201e-02 1.883807962638105182e-02 2.688904102541601893e-02 2.685659020599670543e-02
3.819598044512377555e-02 3.761421533751604929e-02 7.964070726793455457e-02 6.424684464403125628e-02 1.374131337148727650e-01 1.399824280600818309e-02 5.919804142720727080e-01 6.301594753701709184e-01 4.411729144228578037e-02 1.342692657471064414e-02 3.710140943520564422e-02 2.568480079955959283e-02 9.656636181887178622e-03 1.398885003931613774e-02 7.343965489384571832e-01 1.089996644301340079e-02 7.134984197347462621e-03 1.422060424009603460e-02 4.611356455680935829e-02 7.486672617182958157e-03 2.753948361582798099e-01 8.006004884599364491e-02 1.223086459409073318e-01 4.016093867147095542e-02 2.274616002618206137e-02 1.577287999936707180e-02 1.448436816806867970e-02 1.149057383554757256e-02 1.954027848573755902e-02 2.212770826008843977e-02
1.766066633583398410e-02 4.883950236818203339e-02 1.073430622992556649e-01 8.602448407195303903e-02 3.567198232474264735e-02 5.523294251299430691e-03 1.007584530131409695e+00 6.748899683720341880e-01 4.089944979551134452e-01 1.648336361127298103e-02 1.077180946168199843e-02 2.227885950020527805e-02 1.028269851017367918e-02 6.751366820415384030e-03 5.241540159415708500e-01 4.056512037729860798e-01 2.924898119302445955e-03 5.321459531342885227e-03 3.696059057654340306e-03 3.079506813681457799e-03 5.078765655102089882e-01 1.740879996433537524e-01 5.433116492087886051e-02 1.001993094476024831e-01 1.827257827595796247e-02 1.407049809394541121e-02 1.258411687746594301e-02 1.195338862086760788e-02 2.392538259986813631e-02 2.643615109613334582e-02
1.019595584221524506e-02 3.056607700577508580e-02 8.510798405942948675e-02 3.296185089674358998e-02 1.904450752356102658e-02 6.429096853679807655e-01 9.844591315297190892e-01 5.476129193642800264e-01 2.508561049218473449e-01 3.772599291473327510e-02 4.760242655594883188e-02 4.205278385366124222e-02 6.288918168318696766e-03 5.061040737960612046e-03 5.948280521747160154e-01 2.231577342291995725e-01 8.545127165274463837e-03 4.806943402530642652e-03 7.616828498615913282e-03 4.255549547814175063e-03 2.816782595974229048e-03 2.728666630863740838e-01 5.992375316964534404e-01 1.608155944562781048e-01 3.225597661753257239e-02 1.817821244185272370e-02 1.324027878820768084e-02 1.543163623837053196e-02 2.387508052710238943e-02 8.967295888239744384e-02
1.015480949361253354e-02 1.033313677386077205e-02 4.623709678777693233e-02 3.695557268439119553e-02 1.469057771902161288e-02 3.721215694254854656e-01 4.494232905764116159e-01 4.782479440316027564e-01 4.392503344696335743e-01 5.790619836474251297e-02 4.552009297166983992e-02 2.465324035317874654e-02 6.316226101631189360e-01 1.925995973916499737e-01 1.478691619208713781e-01 2.455512011003342931e-01 4.727640782953975059e-03 3.467227570163463057e-01 3.900757587588249246e-03 1.315409007763829879e-02 1.530427095692267134e-02 8.622687298966856886e-03 2.020063587351498061e-03 9.461553436242915727e-02 4.745298554930404283e-02 4.597869945486935533e-02 2.919909530256666053e-02 2.033940522671251819e-02 2.654181744753789443e-02 4.902991241214717938e-02
3.264829166184373133e-01 5.208205956201257258e-01 5.500847699582589456e-01 1.160981931700770520e-02 5.557960393856145424e-03 9.244424278589917846e-03 1.407893925798166766e-02 8.062307717468412266e-03 9.598101146951708990e-03 1.110396305560015437e-02 8.581694769573707665e-03 7.684122770362740162e-01 3.182431786445686361e-01 1.243104610318842146e-01 6.635920593244029608e-02 1.214464223516093233e-01 7.280480409899521277e-01 3.489100603174820070e-01 6.493821870152973429e-03 8.725920632436611618e-03 3.830734905300739457e-03 2.808752891853432132e-01 1.100494225494684369e-01 8.548113062046704125e-02 3.183995499035221360e-02 3.291831445393286759e-02 2.863098472432859184e-02 2.520194953004124133e-02 2.906569328497632387e-02 7.104329956720047134e-02
7.363257497838251453e-01 5.849647598262389635e-03 7.654368410072255324e-01 7.094805734708376638e-03 1.069881938503779856e-02 1.194522614540037206e-02 1.058258104257990204e-02 9.976167289195458573e-03 8.011518185467320780e-03 4.548793192710788927e-03 4.115292862170391586e-01 5.877243023598139812e-03 2.723041516300901965e-01 9.012589661580736045e-02 9.231411730552400996e-02 1.717324350075215278e-01 5.683901035343127614e-03 9.026694631487301723e-03 7.877408140059724909e-03 5.502067638810862089e-03 4.166149717296775412e-01 1.946405851882734850e-01 6.471071411105115689e-02 5.002456803943607089e-02 2.361536538190235970e-02 2.486529388175590452e-02 3.832127698873434574e-02 4.921193879974568308e-02 5.031658936854434966e-02 1.529249394159952480e-01
9.701989264947884217e-03 6.203850704801415483e-03 7.587906754306876778e-01 1.947942668334364316e-02 1.214704776631957139e-02 5.047831383093749451e-03 1.621464164515622891e-02 7.229119793341188746e-03 6.032690624074706250e-03 6.066562679727196573e-03 5.510376346443071269e-03 7.392559968888606434e-03 1.614793445198442479e-02 1.033708967899754985e-02 3.471761869938970180e-01 3.168794974308852819e-01 5.765445951878986341e-03 1.733994916978071413e-02 1.696139796123432783e-02 7.441188827899509750e-01 1.162801994077253126e-01 8.815680661736535750e-02 8.122979066583264907e-02 4.934695917855151659e-02 2.858491462148425588e-02 4.399430795146083706e-02 1.649570212754220278e-01 3.358484371458783646e-01 2.703796195830198042e-03 5.080911967413183072e-01
1.528370973323970629e-02 1.004000039852777880e-02 1.657633384976527763e-02 1.532391849476472286e-02 1.271168168803070778e-02 5.430588375998832706e-01 1.123681596962370494e-02 4.724153697836982677e-03 4.660728108821639570e-01 1.740253127097063646e-01 1.098112106681775613e-02 1.077816363494133768e-02 2.288489171707384223e-02 2.470310528467564368e-02 1.173960355751789246e-02 1.272664785723655670e-02 6.737188996174077460e-02 6.908315331542667914e-02 2.749262920293300827e-02 1.199116281315522684e-02 1.515165218395099211e-01 7.009544343033223546e-02 6.952406394166563142e-02 7.203075989321326700e-02 3.929021043333034285e-02 5.057255095324404010e-02 4.742867040738710238e-01 2.190593170146291815e-03 2.905933265144470048e-03 2.735662189611472450e-01
1.237215143672298727e-02 6.488747413002545796e-03 1.502090886105838206e-02 1.315994722983359136e-02 1.629230076494903728e-02 3.255364315022664656e-01 2.765808251199531886e-01 2.432092985022500931e-01 1.540033600863624508e-01 5.676561828351691166e-03 8.919450696056355210e-02 1.484628041899833106e-01 3.076748319349867922e-01 1.530776555016797880e-01 2.846952632248492959e-02 5.568366427810435976e-02 1.025768618466701698e-01 2.817847732010423517e-02 6.689539115673111269e-03 3.265168600686630951e-01 1.089410731321050346e-01 7.375570368001599375e-02 8.484425651093824294e-02 1.141041448759774618e-01 1.198598899987709243e-01 6.456583782488609091e-02 1.013948095007085604e-01 7.826860135262062035e-02 6.920293116942019540e-02 5.063534702085344119e-02
4.797139709373473559e-01 2.834062042547595972e-01 1.211018340516258063e-02 1.218980867254986639e-02 9.424852338492460679e-03 4.775846430874656212e-01 1.876016822089632274e-01 1.214757253945120685e-01 1.514491729283880816e-01 1.123349448667876165e-02 2.713435874743176657e-02 1.756945206599733744e-01 3.149609591174332701e-01 1.652940156314228193e-01 6.051554481331073571e-02 6.865897126680950424e-02 7.566658671453736773e-02 4.465878458045167976e-02 1.100216191885880490e-02 7.105052776469777953e-01 1.032770044018371802e-01 8.981619638759487378e-02 9.930753097334468760e-02 1.745434335821365868e-01 1.658562722096021125e-01 1.175340551881086659e-01 8.914390400435404094e-02 7.693524658232853142e-02 7.991038063337380093e-02 8.564442551082390720e-02
9.231777219396763989e-02 2.391500177717588993e-01 5.977214565981719963e-01 7.983691877070608206e-03 5.188539540787349622e-03 3.646609191047991971e-01 1.880263671960561433e-01 1.582040729025639969e-01 2.007891188438679642e-01 5.605832082197349450e-03 4.784008463248623499e-01 5.613833670616236865e-02 2.347864649640657997e-01 1.014981078288203498e-01 3.232961821558801019e-02 3.774104238225509805e-02 1.399574033304888838e-02 2.061945399324714712e-02 2.358460249258922600e-02 8.809873704595239108e-03 1.268068917356997283e-01 1.125005474334402622e-01 1.338908295741184362e-01 2.286549015820058539e-01 2.995291425179493761e-01 2.814454074193755706e-01 2.070610908390872196e-01 1.779094570367791284e-01 1.302375772835180634e-01 9.937437841470977973e-02
7.305726992193969926e-02 2.107262762655017219e-01 3.918884357368301319e-01 2.903389949481346433e-01 1.721317264954690951e-01 6.833198321607059089e-01 9.853419054987532302e-03 8.169427060082145794e-03 2.828435329842702295e-01 8.936802690999599841e-02 3.634379584008294861e-01 9.092073795196678465e-03 1.064830309711001510e-01 1.457098887840337920e-01 1.576423674651347140e-01 2.154078189057629933e-01 1.955372010794932391e-01 1.275876480639490107e-01 3.502666826933046318e-01 1.642558215654845999e-01 1.356718108925257169e-02 8.061218440714568167e-01 6.054948652731030334e-01 7.292651483280659236e-03 1.691988485530567313e-02 1.575426309317919105e-02 4.256878645983212112e-02 1.292586585903239202e-02 2.184191330877946757e-01 2.073962558966200576e-01
6.862387680118237077e-02 6.913909804135601189e-02 1.927784619164025770e-01 6.300037733917056987e-03 5.190764279342041654e-01 1.220949678670447264e-01 6.528798060196299921e-03 1.859935570094571264e-02 1.241868457713757659e-02 3.577268979404078508e-01 7.795128605182227721e-01 4.500400596498534134e-02 9.451281398512655085e-02 1.210719037016284028e-01 1.106291513748056676e-01 1.351992582545361588e-01 2.333535648638873916e-01 4.076990895245171664e-01 4.208011186315087637e-01 3.371227612796497963e-01 1.452291247586841132e-02 1.525130153338745409e-02 1.346525978462764263e-02 4.199557770398217038e-02 5.964121831920696226e-02 3.009808343650042795e-01 2.960990686043877274e-01 5.662081540727113838e-02 2.557878876398310131e-01 1.517983442333595279e-01
6.297135621734334388e-02 6.885978076568213813e-02 1.584383723867992533e-01 1.723187413432774318e-01 1.122285753000840658e-01 1.274952464877311398e-01 9.069743490191130020e-01 9.981082233230291478e-03 2.066359695980813510e-02 7.631951229348518141e-03 8.015873289282725994e-03 6.858591424068243014e-03 5.279037489233245201e-02 1.082985146968083595e-01 1.024311095386069986e-01 1.586257840392826801e-01 2.779914844919032513e-01 3.434584646016193843e-01 2.029256349004304183e-01 4.527673471545590883e-02 2.737730907120652576e-02 1.886706535828380771e-01 2.739757436525644407e-01 4.525389348243712972e-01 4.142988959048201636e-01 5.260028637163540743e-01 4.135381089614781347e-01 1.155693459338470730e-01 3.992444181454236629e-01 1.799882514195465522e-01
7.679390190358602319e-02 8.968029369243225857e-02 8.912634907468794387e-02 8.400616861773577138e-02 1.258335827564926457e-01 2.609407259944063195e-01 5.801218346634400003e-02 1.936988933424327319e-01 9.489215053118169041e-02 1.668663033063085693e-02 1.254575871350331259e-02 1.911762210415659038e-02 3.739884292869792570e-02 5.580452951292332042e-02 7.440400373624754538e-02 1.346113474659381692e-01 2.951829259418193852e-01 3.059251486642621254e-01 1.494317365373732664e-01 5.254207985604193026e-02 2.267161178819765976e-01 4.099748214955972747e-01 5.248342524370751550e-01 5.255903277891507130e-01 4.469919427735228323e-01 3.751392690307080446e-01 5.467903220871698222e-01 9.500483692461562935e-02 5.928689448254018668e-01 2.528198735194520652e-01
1.778436927799553202e-01 1.420328259972127027e-01 7.667737422687967430e-02 1.210635154723867790e-01 5.637400255498803414e-03 2.817120357598893246e-02 1.573302071515377265e-01 1.281217924542241426e-01 1.265842841780028538e-01 6.494480705181103486e-02 2.400071865188255216e-02 6.296513972754011999e-03 6.094616136761169846e-03 1.587338636431763483e-02 3.600817192517023063e-02 1.668411112034242361e-01 1.797419706565777653e-01 2.175080903428655843e-01 3.914895244170724098e-02 7.075365754000990937e-02 2.507201738478366804e-01 5.412921487995685510e-01 6.685056074934485615e-01 6.699949300384278050e-01 5.307442263739494681e-01 4.985960989150379219e-01 4.623692152758733798e-01 3.665466862015874794e-01 1.626471046768006995e-02 1.072182839309932315e-02
7.909945089798112172e-02 2.246389074206501801e-01 4.294775036635418708e-01 1.071110460908545128e-02 2.317562189771247422e-02 3.243797167987008678e-02 1.021990878680324316e-01 1.268574270862523612e-01 8.705243198148589212e-02 6.795063754540209278e-02 1.409695885020722031e-02 4.468809648991201589e-01 6.627462439340192635e-01 5.724685605233278615e-03 1.246649199872940615e-02 7.383826945238741724e-02 2.888396037630407143e-02 9.550204570718767022e-03 7.232187931711856477e-01 2.430615413368615238e-02 9.212033995774192296e-02 4.892618184365647993e-01 6.195747884264783956e-01 6.382662093626156885e-01 4.590620922731311615e-01 2.113939123799637998e-01 3.431677570456186377e-01 2.355267034278379079e-01 2.123645518105538380e-02 8.382497926672255462e-03
7.465981968397687567e-03 9.676303278223895993e-03 6.438015982640381447e-03 7.915832001886205851e-03 1.844152201609291705e-02 1.046013036839350645e-02 5.356820566802551753e-02 6.849399281934245853e-02 6.283317268001915867e-02 1.456312492695092768e-02 3.570520209879498967e-03 2.571998716200315505e-01 4.335491085391838806e-01 3.769922472690779517e-03 1.504271312818555167e-02 1.020573575055690706e-02 1.909060248011427985e-02 5.793555937254437835e-03 1.110895689062941886e-02 5.313228794142218353e-02 2.848361446838397759e-01 5.392256065961001932e-01 5.803458520492595918e-01 5.537457601058521917e-01 4.277018077181450328e-01 3.158152541850979267e-01 3.084986234944738226e-01 2.078457408242137539e-01 1.871198838975014073e-02 1.209111535714521457e+00
2.059780598515341399e-02 1.912732201600544912e-02 9.748608688182020671e-03 6.920927389961396836e-03 8.855386842126784785e-03 4.683870274546943907e-03 2.638116369993304816e-02 2.320679581397070562e-02 6.294235493399516143e-03 3.355967872765458927e-03 4.309421121147807843e-01 3.273765651464886073e-01 1.879534948496469904e-01 1.010230758085213509e-01 2.570617730102844889e-01 2.817704771743259010e-03 1.027222284851436566e-02 2.391309725038236883e-02 2.344748202982963048e-02 1.057989917238146421e-01 2.887814720514753075e-01 4.201854016245335499e-01 1.719501436652289272e-01 2.623953410907251538e-01 3.447956320011876796e-01 1.983633429326697173e-01 1.498278834157870665e-01 1.230509816656991107e-01 7.911229446513644570e-01 7.216441977188879919e-01
1.704630148917871471e-02 1.987158128507572619e-02 2.849745445169350050e-03 6.734512403801201641e-01 5.812275376039628405e-01 2.213690914208113220e-03 3.122289038345811216e-03 3.258172186180197660e-01 4.252418664629477596e-01 6.435141549113837511e-02 8.147749631668536885e-02 1.196845284397818343e-01 1.281179515476488229e-01 4.457712416546992795e-01 3.769252915242928166e-03 5.119633250859411538e-02 9.952506005925684796e-02 1.467293694390418013e-01 1.019962219748581922e-01 7.792852784109216557e-02 5.552295053481458992e-02 2.002254921467815779e-02 7.798843884018190863e-03 1.711305711279116626e-02 6.325325593349667708e-02 2.180866891455189235e-02 2.042782582982096556e-02 1.184698653051901696e+00 1.359272404200690954e-01 1.112001585440001994e-01
3.823116718313390727e-02 2.940704293195173930e-02 3.019600800341035087e-03 4.281654762973452488e-01 1.673636847598333581e-03 5.038789411504561722e-01 1.950264743214809304e-03 8.649157002158515406e-02 7.385354835653851202e-02 3.156725463009132232e-02 7.389168506585251650e-02 1.379247745838562689e-01 1.790958057619679300e-01 2.676066415948854735e-03 4.528419371506301958e-03 2.928210455916720883e-02 1.092591127076979335e-01 2.090671811946209213e-01 2.430637182276076669e-01 2.161637913897858643e-01 4.672963526531348499e-02 1.056769103747125758e-02 1.321771233313918069e-02 3.270609523596514079e-02 7.383989161677012580e-02 2.207609495871644054e-02 8.584810515577408901e-03 5.620471879840008844e-01 1.772804565896728968e-01 1.591248635690144519e-01
4.739978514327687631e-02 5.902078007206211160e-03 5.385965441637245998e-01 1.692724274454500688e-01 1.890722675092940119e-01 4.181853929857627938e-01 5.473923796149740006e-01 6.248818652195170520e-02 3.514308957669546457e-02 4.089709127554169710e-02 7.294820960417458533e-02 1.254195568623035495e-01 1.396103152953715731e-01 2.114904184788320412e-03 8.464154015533114500e-03 4.177925274357303931e-02 8.349844544721918282e-02 1.990138999240047279e-01 2.589579106182954282e-01 2.261704193998652634e-01 1.154202173842962809e-01 6.776972193803658048e-03 9.996923491608094015e-01 1.061915808306018900e-02 6.157618113147681621e-02 3.715073107582531758e-02 3.376248778851149990e-02 1.062307958597646484e+00 1.627739682935857579e-01 1.249867821066121543e-01
2.456812262793762677e-02 7.501314120806955831e-03 3.141555940080970836e-03 2.568136788784884141e-03 5.267973140966053514e-03 3.486247259584590412e-03 5.597041147414230089e-01 2.328860276004223739e-01 3.581381131895516323e-01 4.789432902893799859e-01 4.577928463434782075e-02 5.292689877938026866e-02 8.171657344043550819e-02 1.781240840551712445e-01 3.108154496569634929e-03 1.294376810122583980e-02 1.371433611461015181e-02 6.158762775540020662e-02 8.274024453811941460e-02 7.403254279775889346e-02 6.397477422109097700e-02 8.458833284870775210e-03 2.735519871563285021e-01 5.189039655328742118e-01 1.149789738377263865e-02 2.875835503488775174e-02 7.755530549408679031e-02 4.385975748486566766e-02 2.020609200260073401e-01 1.524396296271043338e-01
8.683891687028705633e-03 3.409006158132215671e-03 3.967874011744964083e-03 5.839581100422056026e-03 2.956661083681191068e-03 4.956252280828269408e-01 2.273508893597173675e-01 1.620232901051605889e-01 5.273732305095757411e-01 5.018510944052206532e-03 1.476449139253089293e-01 5.245698916688543156e-02 8.801396467041411320e-02 1.858607573864776985e-01 2.539031756618051819e-03 4.649027173594532866e-03 3.405745413445739403e-03 5.083988798728864555e-01 8.128644636983618499e-01 5.703696742252807247e-03 1.047909345244351156e-02 5.586839238507329553e-01 2.799709460079569112e-01 6.727804548474261223e-03 1.648157838398375472e-02 1.142515960293629229e+00 2.036209070623409487e-02 2.294107292434061779e-02 8.180492233151901577e-03 2.388471413621771344e-01
8.797484695609966709e-03 7.002438782597094485e-03 3.709239032161714290e-03 2.375181541051369586e-03 2.051938264670508279e-03 2.881303131364855163e-01 1.898894094894497120e-01 1.973615343713833181e-01 2.240843810019739757e-01 2.198251961682582550e-03 2.679912395302608830e-01 2.620164249267541989e-01 2.452412922734008571e-01 2.942960535630242402e-01 2.461882963304312926e-03 5.526325804309939471e-01 3.937743146660189208e-01 2.479027297736583479e-01 2.288898483364052439e-01 1.800798931771601941e-01 1.428434346778030273e-01 2.080103257429024577e-01 3.299288263851462011e-01 8.243030759551592812e-01 6.793386302802289535e-03 6.938474688766282927e-01 1.109087054308169451e+00 7.122498558320461415e-01 7.157117123596696828e-01 4.612724127593231249e-01
1.190961208828381773e-02 6.173018637231502542e-03 3.808436202696214960e-03 4.549555365726553474e-03 3.714147114061233657e-03 7.542721294110280583e-01 6.421061060023615895e-03 4.760175419495302380e-03 3.017014995475316153e-01 2.255954870307123328e-01 8.279213636281870792e-02 1.954720547573809419e-01 5.752696090471915991e-01 6.163459387120246991e-01 5.548906060240679783e-03 4.315240965513348660e-03 4.497500530541058694e-01 5.631778146484561764e-01 2.736921731160455451e-01 1.222369716725074384e-01 1.108545445158200526e-01 1.689527233631248349e-01 2.623335993421683221e-01 8.338798207600572887e-01 8.733301887142175257e-01 2.126077443417813961e-01 2.392570629939919369e-01 3.035254264924318046e-01 9.679774442661648326e-01 2.017515362480244157e-01
1.618670455075267578e-02 1.391436007824801285e-02 4.497867007729313728e-03 1.348635321381652132e-02 1.458902515810902960e-02 2.658400296955708286e-02 1.726114640366851333e-02 1.918256820864285310e-03 2.962558734477353517e-01 1.766622967765464347e-01 5.375409412561264755e-02 6.913172550606848377e-02 8.601939426840475578e-02 3.370080593289149773e-01 4.137297878849993116e-01 1.827382443744285379e-01 1.892529409673606167e-01 2.393932396981710287e-01 3.418878656073385258e-01 1.914606340732246670e-01 1.038661132505525331e-01 1.406609782968444855e-01 1.576088238812584641e-01 2.765488035728774219e-01 9.054541918340792694e-01 1.472258888442118940e-01 2.173573119003877618e-01 3.547706231427972812e-01 4.163086847048468320e-01 8.486094924839656661e-01
9.549251437951006977e-03 2.338002857643606963e-02 6.699668967772466968e-03 6.424700212603230362e-03 2.956684041866573798e-02 3.051716097489216850e-02 1.975797701464888922e-02 5.454152290006704096e-01 3.865012866196879671e-01 3.734995179360196538e-01 1.575908383362269460e-01 8.048211901446107597e-02 5.220782218461638563e-02 9.162204105657144326e-02 4.406484870879885385e-01 1.291422721999895828e-01 4.878268487865331515e-01 1.176960528540718642e-02 2.313751640046416910e-02 7.993731326417933269e-01 1.561579252073032054e-01 1.970496701076551171e-01 1.671418202327192848e-01 1.914960596903282630e-01 2.652914291792450308e-01 2.103026678875122291e-01 2.528438396956654843e-01 3.126853536072305983e-01 4.086798823675296122e-01 1.028139347120563762e+00
