2.195859606700735142e-02 3.296583774824093926e-02 2.855085801500579015e-02 3.581708199655019714e-02 2.709335530865367506e-02 5.925355775858030805e-02 5.883596537949151162e-02 1.594192671326044586e-01 2.889295479643570475e-01 1.274503744931873295e-01 5.767091330809286098e-02 1.287937526030092858e-02 7.465002330318042979e-03 2.790515215293977447e-02 3.246343916698875981e-02 7.112147699937472652e-03 2.493904917128860962e-02 4.354108763957566242e-02 3.924573547912421634e-02 1.377892467310033557e-02 1.119434846166581302e-02 1.643446106889331600e-03 1.282865260473303086e-03 5.133551239655168193e-03 9.911615055574250419e-03 7.691851506887902729e-03 3.501144566037438146e-03 3.046739154828901675e-04 2.846415710880476481e-04 3.480595062105644693e-04
1.782155669001482881e-02 4.067187287735941903e-02 7.278206778200670135e-02 5.944155675603107758e-02 4.126490831407809978e-02 1.836339361593876396e-01 8.667016541252639539e-02 1.094850780725835082e-01 7.121417814420814840e-02 5.941754972183006800e-02 4.068912481571028417e-02 7.739296967236803347e-03 1.010455576126415012e-02 2.298979137963247724e-02 3.201589942572190262e-02 2.039057293013056202e-02 2.507203971108485155e-02 8.173881349873547697e-02 6.133080646893789012e-02 1.834682456519819496e-02 6.491363635464854343e-03 1.464509187531753704e-03 3.061465869992904733e-03 2.712573219270845212e-03 2.377284411766540911e-03 3.147314353910152067e-03 1.099555225830760449e-03 2.867018958124480836e-04 4.114196034069391599e-04 4.125310461401004189e-04
2.217067264118060821e-01 2.347847693527190249e-01 4.967815880867778588e-01 4.048300893694985469e-01 8.562102001375386795e-01 8.648671604936201962e-02 1.586596469989953392e-02 1.696739756281654896e-02 2.714031984662628183e-01 8.052426967178670514e-02 2.089768456025019872e-01 1.348823190744032063e-01 4.854228801740178428e-02 7.020642460258423589e-02 1.333938072032709275e-02 5.545737711849003937e-02 3.700928306661779160e-02 7.535240623778656499e-02 2.490620819614434434e-01 4.110828961922334546e-02 3.876632661555083365e-03 1.122206352325226444e-03 1.692195614688570297e-03 5.890203691807014124e-04 3.495769931726482775e-04 2.296894012739326908e-04 2.024803099427520457e-04 1.659442846905339057e-04 2.912135648555783996e-04 3.374443764859762413e-04
1.034249838115151032e-01 3.075284029596359603e-01 6.759563243416757405e-01 5.469178751414780493e-01 2.220332008966896808e-01 3.397330359530111726e-02 2.645691219484817835e-02 1.774720236542471491e-02 1.083423889997696052e-02 9.939167118727862404e-02 6.222536469635924633e-02 1.199329213157763474e-01 5.327141471082935675e-02 3.510326947174251949e-02 1.027221745696157290e-02 7.756401793340811021e-03 1.609020452495479522e-02 2.987611857576213253e-02 2.093992747506901939e-02 1.771310237304718135e-02 7.927597670342522579e-03 2.689991901245734809e-03 8.292841240125051368e-04 1.577498791898127029e-03 2.884752585312832466e-04 2.072886998743300648e-04 1.734458134372025687e-04 1.712875508857929577e-04 3.573487722277145077e-04 4.065364738708958500e-04
5.951522114322102541e-02 1.909648202265107064e-01 5.343030323059906328e-01 2.070476111036816669e-01 1.167795619840530791e-01 1.685511280036822157e-02 2.551618580112130497e-02 1.407042901868110762e-02 6.532445781153707262e-03 2.242085143255340418e-01 2.765830871960181514e-01 2.273634787391285994e-01 3.294354284655025278e-02 2.700426632237529559e-02 1.255977595258473897e-02 4.648406351430672649e-03 4.942948119522148215e-02 2.818171810108019426e-02 4.480767471976496857e-02 2.560230400264187217e-02 1.771775121360665700e-02 4.906920530052486656e-03 1.060242734532936514e-02 2.820172275483128193e-03 5.449036033387822655e-04 2.859441004206826728e-04 1.912839682639916545e-04 2.315854530276345840e-04 3.741249438063590053e-04 1.450343476612931401e-03
5.913484619802741177e-02 6.369164443162939060e-02 2.860157776803515239e-01 2.292442407554036443e-01 9.012274939030440191e-02 9.608092700803242195e-03 1.160686214572227010e-02 1.231961871829070389e-02 1.156184061541230129e-02 3.441174109267780001e-01 2.654357597387963508e-01 1.350054455292187816e-01 1.509425440831827121e-02 4.497544161579197092e-03 3.381026838852309747e-03 5.495572995339697599e-03 2.841984213537707832e-02 7.370523384305502704e-03 2.362903223797818350e-02 8.131938218120136896e-02 9.960985097082929174e-02 5.893974832625513416e-02 1.449661844884214679e-02 1.798946671066294382e-03 8.525390737043597039e-04 7.718966062312852209e-04 4.570921051706982479e-04 3.314443943766977145e-04 4.532412085697883454e-04 8.664949287636461656e-04
8.103478653052793163e-03 1.314054939825660961e-02 1.394121681519171034e-02 7.085844550435771438e-02 3.398775944431366852e-02 5.623517880726612572e-02 8.467788538969488188e-02 4.790651199388709647e-02 5.680057493581126132e-02 6.488884881551784667e-02 4.907303428657981692e-02 1.964842306299931576e-02 7.945476923419785009e-03 3.051614247770585969e-03 1.590298476961779723e-03 2.809223076624774683e-03 1.643328043096412353e-02 7.756746258027551709e-03 3.931774547069651765e-02 5.374034858109408286e-02 2.500616473303532081e-02 5.950552685525477108e-03 2.294099196738068076e-03 1.717271841403148576e-03 6.060319852870616137e-04 5.904310670298222163e-04 4.849958606490878052e-04 4.452629361995388791e-04 5.375852663929127579e-04 1.363911345499305800e-03
1.666354154425232423e-02 3.106896492826023010e-02 1.833911837853051049e-02 3.987207931510668851e-02 6.186671929635999961e-02 6.981282187948933959e-02 6.167880806517733044e-02 5.801170592743221111e-02 4.605993219373498426e-02 2.530381517781353160e-02 1.000458443557498273e-02 3.043176446118308481e-02 6.419773103359665591e-03 2.103218092241500477e-03 2.118898296165913978e-03 3.868400148657556020e-03 3.206833736891657322e-02 5.169379117508021010e-02 4.540180017506369181e-02 3.222567745961420899e-02 8.808692604911235596e-03 4.115572878922670388e-03 1.373952594182492170e-03 1.034373278536605779e-03 4.665616975785364328e-04 4.667913471149035356e-04 6.860291571698891918e-04 9.173749036431689619e-04 9.745090555980748942e-04 3.036860229749233260e-03
4.231299454444485686e-02 2.830765623186815017e-02 1.675990841912290696e-02 9.857493861129125456e-02 6.465508811748614526e-02 2.749782786704458790e-02 8.812015935159107916e-02 3.957654596797869490e-02 3.279775963175328435e-02 3.183008237118258033e-02 2.800760004980079598e-02 3.661351104579699256e-02 7.920674586275247564e-02 5.106258165321343051e-02 7.504799543496646491e-03 6.851272743112652407e-03 3.020540121817322926e-02 9.299928015317318608e-02 9.205640651429604360e-02 1.529767440154575740e-02 2.394109215917753029e-03 1.827724997723462847e-03 1.703105365136024828e-03 1.014008862721522746e-03 5.654843956501882799e-04 8.349746980233431655e-04 3.023712168783589550e-03 6.524234228706914801e-03 1.996729633075217461e-02 1.037809349719557087e-02
6.715187956390945845e-02 4.458406379819188775e-02 7.207445750162430609e-02 6.899250501238345101e-02 6.116220284889855446e-02 1.213721643700844434e-02 5.574738937247585013e-02 2.377692634173862729e-02 9.864433588773674488e-03 3.674364239054713800e-03 5.348143124147498179e-02 5.221713376277228869e-02 1.093615402017403537e-01 1.162282371339233844e-01 5.430013798358628019e-02 5.906464166265416871e-02 3.208130464541083526e-01 3.367692247015793283e-01 1.357108462192795351e-01 6.051199831193930512e-02 2.946118610002444130e-03 1.381414406129293469e-03 1.390420858810145679e-03 1.423060196850185104e-03 7.531050745863241032e-04 9.366249788503309189e-04 8.537286333673028277e-03 1.569734883114056942e-02 2.068865649953968364e-02 5.697544650080771898e-03
5.488274192374937438e-02 2.929072797376809992e-02 6.618502358974963362e-02 5.784318015685883246e-02 7.392958221821717413e-02 6.812762242243516030e-03 5.641761744366710109e-03 4.879530116529610592e-03 3.007978323150553752e-03 2.688012349256797481e-02 4.233295127345000908e-01 7.112823922301017010e-01 1.456452189255515117e+00 7.041934791923293302e-01 1.272976138767343834e-01 2.473339885956789830e-01 4.647389093922634218e-01 1.294649888846746422e-01 3.090806717237211398e-02 6.164838687538861522e-03 2.068344341571128758e-03 1.414928127376450726e-03 1.647925950859926774e-03 2.198676443360044960e-03 2.257670682723074071e-03 1.182548482617339818e-03 1.814722803957544584e-03 1.533155232280334745e-03 1.437312106399461775e-03 1.067141505309735427e-03
1.009828913054661159e-02 6.050759591355220172e-03 5.412172021450480791e-02 5.432883903947408055e-02 4.249399095712310531e-02 9.666856575295847132e-03 3.670609193234493101e-03 2.321405375933139996e-03 2.826452058858578732e-03 5.274612202701413344e-02 1.286329834882953549e-01 8.464239366928484332e-01 1.507101875133957547e+00 7.674094665871633580e-01 2.713999804599922516e-01 3.022987549069405255e-01 3.343618281394624137e-01 1.971610679416731793e-01 4.832473869887744106e-02 1.362534559589832425e-02 1.997632510670989056e-03 1.757909019019404965e-03 1.960973929672702940e-03 3.428596905044812865e-03 3.207049191052422157e-03 2.221369904316381708e-03 1.655429831726675958e-03 1.530397436750789578e-03 1.671129605200265484e-03 1.803862909833188650e-03
1.919402672177925474e-03 5.029052226077554248e-03 1.250590056610101537e-02 3.594159824479706972e-02 2.355383123257708336e-02 7.390465215804461682e-03 3.701775440907426051e-03 3.013809924883805499e-03 3.692057661981898008e-03 2.631242396173594927e-02 8.756359109600700061e-03 2.669336389346702587e-01 1.117121412472757536e+00 4.725344324453188416e-01 1.464165328913924757e-01 1.674607810490978399e-01 6.157504321245441808e-02 9.000122512149931475e-02 1.019802850460450327e-01 3.796449922672791299e-02 2.509842985870330660e-03 2.235971848936397968e-03 2.679468706200110063e-03 4.548130960744821427e-03 5.892513635113709285e-03 5.448948796732744349e-03 3.968050015919434917e-03 3.595025273930890514e-03 2.747218164577371318e-03 2.087650528872123969e-03
1.508835523846645136e-03 4.384459799083552205e-03 8.268746335040594655e-03 6.115177180718240138e-03 3.630329125723339139e-03 1.402586206620792808e-02 4.778358542526021935e-02 4.076763449825696745e-02 5.211123835182013622e-03 1.592916728549452314e-03 6.410947104655339256e-03 4.330579288352152945e-02 5.090949385411180916e-01 6.804243786543286987e-01 7.171378513395997301e-01 9.590356909278896502e-01 8.562710820321034477e-01 5.525446931230275638e-01 1.500533267786577696e+00 6.911081458777883491e-01 5.642768964336571103e-02 1.618878692732680924e-02 1.214253159702496573e-02 3.033865257597274587e-02 7.021443817881278804e-02 6.554939744076991592e-02 1.784586291403637559e-01 5.835520287676724399e-02 4.568701757879979793e-03 4.284274487339288957e-03
1.369899952857550184e-03 1.383454859966587198e-03 3.891641759638747242e-03 2.923616750613991164e-02 1.057032863557299737e-02 2.442358439091693069e-03 3.188192415858674689e-02 9.291505541106313826e-02 6.259470659704539919e-02 6.378052278042987445e-03 1.354626942327994896e-02 2.164182211048150950e-01 4.596453476297813201e-01 5.777914656446504482e-01 5.169447525322273806e-01 6.195376947298742998e-01 1.047313856036296675e+00 1.794692773403153918e+00 1.810267442923571890e+00 1.406911477592416526e+00 5.955476590395137465e-02 6.173098894177028728e-02 5.507659083255694865e-02 1.725583011938121025e-01 2.486591881141520244e-01 1.275188373079916282e+00 1.275370057880144570e+00 2.563468509723052513e-01 5.565276849381262450e-03 3.245377697768512051e-03
1.206260435079958620e-03 1.313176562363233772e-03 3.045222368533290029e-03 3.361222634875714581e-03 2.195580090582033121e-03 2.460289773309072212e-03 1.752331698166556539e-02 4.998225217685006716e-02 1.037927399470475465e-01 3.700897778364291291e-02 3.833370151251178776e-02 3.383761654808794400e-02 2.638399156556058833e-01 5.287860955747213376e-01 4.881876865034124879e-01 7.421066994811507112e-01 1.271396322774502874e+00 1.527704223546222817e+00 8.720180851624653728e-01 1.877194729061536504e-01 1.120937994216624073e-01 7.676811129272226308e-01 1.119221104189005223e+00 1.886194248937453910e+00 1.793940680753069117e+00 2.374168646366631830e+00 1.922282877611693586e+00 5.460387591701736376e-01 9.159747681422331089e-03 4.062660011788940539e-03
1.473812592524867187e-03 1.690739425785884329e-03 1.653918742014390134e-03 1.556954346722169138e-03 2.331968855820491099e-03 4.883372624225844165e-03 2.883706168671861803e-01 9.738930342780569571e-01 4.757074935079926847e-01 8.170796959160639417e-02 6.101793374452518792e-02 9.621254613614273199e-02 1.906571706336227245e-01 2.783267901162256308e-01 3.647352322696433835e-01 6.502971653544923347e-01 1.381992843116741199e+00 1.367972585395397678e+00 6.372285423142882710e-01 2.159197675648841797e-01 9.276722034862668886e-01 1.679268026732993579e+00 2.148507814293818985e+00 2.230447743685881612e+00 2.006705349074430877e+00 1.778298849041556107e+00 2.685533339378500362e+00 4.635923680500554922e-01 1.460154312703325179e-02 6.040582258271173614e-03
3.511086420302983891e-03 2.718645398762998752e-03 1.405360660660048399e-03 2.180201182297819302e-03 2.797902400324978056e-02 1.424083348348394173e-01 8.014929714008703909e-01 6.574408127954901593e-01 6.466074065493324641e-01 3.248979596618728483e-01 1.197970711974618574e-01 3.268441547223744498e-02 3.199845146033990229e-02 8.120568880041899307e-02 1.819708401717381185e-01 8.324643201364472223e-01 8.577047333224994130e-01 9.768745810120389450e-01 1.669815675159590229e-01 2.906965184690296078e-01 1.025245686650612553e+00 2.205672958318884991e+00 2.700676099454141443e+00 2.847559261197107894e+00 2.423463260331693014e+00 2.425662973701173897e+00 2.331005952844876550e+00 1.822807633452245391e+00 7.999022530682685372e-02 5.200435960940561625e-02
1.557088625287413519e-03 4.224311882056751115e-03 7.690069078837414793e-03 5.302449863951182868e-02 1.173475535672440923e-01 1.671467175313562648e-01 5.287991565103424829e-01 6.634847704706006155e-01 4.556736667266367835e-01 3.562993128784417984e-01 7.505678542517363327e-02 7.425456801687961225e-03 1.128848304376463101e-02 3.155037478188298800e-02 6.824381159496742399e-02 3.997253531944743865e-01 1.491067365795315791e-01 4.645343105818623003e-02 1.527147482805934868e-02 1.096023202638988919e-01 4.163338579331558043e-01 2.210091868543524463e+00 2.782591001227069594e+00 2.931287916418994666e+00 2.170505816666801646e+00 1.026353630762268265e+00 1.698947351476447931e+00 1.150734482445947116e+00 1.029706191479176774e-01 3.990552685252821835e-02
3.914686288482016607e-02 4.995577327108451093e-02 3.316808537389737133e-02 4.108420604349104222e-02 9.621620026508852230e-02 5.542621131592927880e-02 2.861361940844927565e-01 3.712146648366224655e-01 3.424735676155556963e-01 8.098981256609880108e-02 2.043686630783710795e-02 4.362674762613263750e-03 7.664207779039292415e-03 2.244719648807431620e-02 8.846381890123242164e-02 5.909001584206951402e-02 1.052632555275607312e-01 3.034639217512796056e-02 5.590391137878708561e-02 2.628612722578754224e-01 1.416208500432680983e+00 2.672195491766244491e+00 2.855674891110115965e+00 2.699257755636554901e+00 2.071926628974091411e+00 1.523202777029156518e+00 1.483850953919731319e+00 9.884365140545312567e-01 8.831549698318996722e-02 3.096688374478219138e-02
1.124441631967733751e-01 1.024075847352365343e-01 5.234251748867091436e-02 3.756726020216513695e-02 4.866409441606645014e-02 2.618713094782411377e-02 1.495222749542599039e-01 1.343458536225987654e-01 3.687979528327039319e-02 2.012522557961861705e-02 7.006189613930879564e-03 5.660623887652648477e-03 3.439993101546978422e-03 1.934860478238015430e-03 5.092282023848323548e-03 1.741514884007104233e-02 6.095742897384973102e-02 1.357723358632015043e-01 1.279018669571433953e-01 5.643046087028276148e-01 1.538038368693760871e+00 2.215349579725635731e+00 8.955569853858768026e-01 1.323946288191512499e+00 1.687355600816720758e+00 9.457135242292986632e-01 6.999015241822976741e-01 5.685434144614360807e-01 2.072831666817863405e-02 1.857960275369933273e-02
9.102486050281879959e-02 1.042690459043919410e-01 1.537540933286472844e-02 1.068032563416491422e-02 8.818858396609235636e-03 1.320651416983456214e-02 1.882693431024590192e-02 4.710150475552609198e-03 6.079816744701524445e-03 9.752665694978943957e-04 1.319891447856575946e-03 2.063786207730275869e-03 2.337079246521530772e-03 8.520589694802183089e-03 2.461904659203759810e-02 3.267668975471876291e-01 6.147518187627173392e-01 8.690662906451327441e-01 5.803634342279431202e-01 4.291901933727211849e-01 3.017329191213183326e-01 1.068521647729381296e-01 4.118669439106181079e-02 8.786134388570827902e-02 3.117847352784327564e-01 1.032327645406300731e-01 9.280727353851643546e-02 3.110597859984278943e-02 3.554060926975780802e-03 2.907993962160362010e-03
1.877979075561445610e-01 1.439493117564814295e-01 1.567185596099776937e-02 6.879507626048693772e-03 1.028970558970620022e-02 8.060863357923584577e-03 1.240653180860792557e-02 1.323974731466795235e-03 1.113058679825274302e-03 4.901831349141447898e-04 1.186893728805894386e-03 2.273739919780477792e-03 3.097352285512160186e-03 1.727332547508642763e-02 2.947555398783903782e-02 1.911297753672788202e-01 6.836792100973407837e-01 1.241668516071768202e+00 1.369327402750367462e+00 1.160300329170844025e+00 2.432847510679586045e-01 5.357664452040766800e-02 6.621717860069151196e-02 1.624589911337110393e-01 3.566127847125295514e-01 1.037537851661534116e-01 3.863172889008787553e-02 1.442520952749980559e-02 4.552442125254706207e-03 4.104642623874955529e-03
2.300278731474169613e-01 2.931767130802725996e-02 8.233896187633099259e-03 2.785778377634186547e-03 3.262653053574203574e-03 7.184697747797362533e-03 9.179332882067637797e-03 1.018384058847896173e-03 5.541771748351648902e-04 6.429820337192845847e-04 1.148163316174260389e-03 1.966194805559176757e-03 2.276335633990353696e-03 1.317500438532644667e-02 5.369581926665780575e-02 2.699685836332821331e-01 5.093510530854987728e-01 1.138879218863514398e+00 1.394390231660419532e+00 1.155627297545121168e+00 5.703926096359409614e-01 3.252533542003192835e-02 2.305384805845078766e-02 5.024842782135698765e-02 2.879113175423891335e-01 1.731548501128387652e-01 1.535036742621854189e-01 2.848484945237620206e-02 4.047300465603187285e-03 3.043139770539930733e-03
1.248946710585028680e-01 3.888007107693556424e-02 1.558064725176061364e-02 1.515916280018030429e-02 3.502866436868247446e-02 2.403675981531338754e-02 9.844213212852366904e-03 3.980792938663080781e-03 5.904745604251064421e-03 7.614912556290849045e-03 7.045261159953745706e-04 7.860707538199736060e-04 1.254512681783149846e-03 3.005939859951367501e-03 1.925124405688930646e-02 8.238885398962346451e-02 8.042515410750079863e-02 3.323430324192044316e-01 4.135463683560158810e-01 3.497741841879312696e-01 2.926648346687467650e-01 3.763873101641232455e-02 5.815091921042100757e-03 1.152776063370433354e-02 5.116784282983429660e-02 1.294739089971432000e-01 3.455231016677795530e-01 1.920245969221665572e-01 4.658949607567813671e-03 3.388592123541891727e-03
4.454736718568168274e-02 1.780512889842990332e-02 1.973648636322552705e-02 3.475729702725414288e-02 1.976095246405635414e-02 8.869210224714013657e-03 4.029471828906699971e-03 2.795216557779373143e-03 8.791267000890707825e-03 3.359157773986308493e-02 2.262287956261454982e-03 7.687454647779335196e-04 1.336008984669224920e-03 3.101434175074649791e-03 1.558061328331549443e-02 2.930675736460698969e-02 1.948975818449925554e-02 9.364500282101031331e-03 1.436607558871479465e-02 2.590400225148964050e-02 4.650188600320531718e-02 1.075291290525167212e-02 5.646566782626130133e-03 2.937307019479927159e-02 7.198507250535085555e-02 2.589682634203911010e-02 8.939175770954334299e-02 9.932844160173767700e-02 3.453671507349450470e-02 5.106262689620106113e-03
4.515560676579669780e-02 3.650897926164624330e-02 1.848044570158996480e-02 1.410824416817463463e-02 1.364223949496577368e-02 5.123891239048313472e-03 3.356154901524743828e-03 3.403240322619897461e-03 3.734323443383709851e-03 1.469770190460795677e-02 4.109605274725783471e-03 3.852289947952554621e-03 3.748997358130788052e-03 4.994023231352064454e-03 1.536456443011922218e-02 1.135309641098977348e-02 7.686237521479624517e-03 4.609747340679083878e-03 4.070840251386665005e-03 3.157840042612389177e-03 2.589886669310217070e-03 3.907787316597077787e-03 6.449170956676461737e-03 1.675886194023305104e-02 3.008004243412594481e-02 1.467377772461230835e-02 2.353510670197493312e-02 1.573616369845310878e-02 1.575857975256625063e-02 9.961128695928692794e-03
6.136680038510442664e-02 3.223438298157473014e-02 1.901147023534015962e-02 2.700548326178699513e-02 2.469656887542904383e-02 1.344229692049502510e-02 4.552081226411383574e-02 3.411210226458902955e-02 4.999064351497541255e-03 3.577372478452643060e-03 1.265241522454068571e-03 2.871984289944961872e-03 8.808419704638083617e-03 1.047656881824506579e-02 3.460457772235818463e-02 2.757853727502364294e-02 8.765064325530768502e-03 1.047406811288383380e-02 4.865765012483057317e-03 2.129671690581970162e-03 1.974741819830411801e-03 3.081039468712111918e-03 4.901209133089296649e-03 1.631856560507583681e-02 1.764412803562735374e-02 4.422294718055753970e-03 5.039407048621525297e-03 6.592852284840433098e-03 2.167566963610237374e-02 4.440236444033375356e-03
8.290079488285646836e-02 7.226055096727951321e-02 2.274083399278305218e-02 8.069962475873981855e-02 9.766363182816918675e-02 1.851419724594419447e-01 1.234213235716293683e-01 1.387910707352210150e-02 4.961200706070298394e-03 2.833500073428567561e-03 8.280171784858881895e-04 1.021421318780019747e-03 1.322857884417616816e-03 5.771589926642099570e-03 7.801026992526964229e-03 3.771859701707802343e-03 3.733572390216074836e-03 4.660697262505850494e-03 6.418537590775178978e-03 3.404581452965683899e-03 1.824776727800091203e-03 2.495920197191611126e-03 2.816575127513478057e-03 5.216533635286416982e-03 1.791048991309240196e-02 3.049195973163800182e-03 4.626450724358336167e-03 7.851562326691379975e-03 9.765008781759570641e-03 1.945265204263444195e-02
4.636167912673366115e-02 1.155488129676886105e-01 3.570217800365437649e-02 3.947729460836624238e-02 1.980865777376369652e-01 2.117955819631290315e-01 1.415412322799532996e-01 9.764386309856976781e-03 6.905674394849170387e-03 6.497792800978584304e-03 2.652248732691436014e-03 1.302967239746525511e-03 8.680857655782045577e-04 1.642116714486436700e-03 8.477302557953415169e-03 2.653852327135709527e-03 9.703546308560609748e-03 6.103304289276444833e-02 1.094379287048703048e-01 1.486133292288114617e-02 2.839908925296416673e-03 3.610307385517566321e-03 3.069686897999371333e-03 3.687480305834411106e-03 5.341476144454029851e-03 4.439720754522658193e-03 5.498684956776371882e-03 6.960897050369133088e-03 9.707445889000942615e-03 2.396085142242721303e-02
