8.598473621349966844e-03 1.275163000338054922e-02 1.103020228733687762e-02 1.382559736177498347e-02 1.042472780009905640e-02 2.272004546777897649e-02 2.244246666883067606e-02 6.049582977370555892e-02 1.092801165589057238e-01 4.825720207351975183e-02 2.188952284253029359e-02 4.886330467317536591e-03 2.823039430497796543e-03 1.049729920504850929e-02 1.215670179323634706e-02 2.653391879909032091e-03 9.214763849104657192e-03 1.590628269387692542e-02 1.418713183327577863e-02 4.927107024481103791e-03 3.949537113749500630e-03 6.133397635816367939e-04 3.410862267563089661e-02 1.848593966391873147e-03 3.227057492533627787e-03 2.512793637977526421e-03 1.167148864855757119e-03 8.712129038810148551e-03 8.394513879914428794e-03 1.046011101571692713e-02
6.897736008920134394e-03 1.540597977983706492e-02 2.755651763162261791e-02 2.244528414459205992e-02 1.556818072401025023e-02 6.916146062534850314e-02 3.253508470483457149e-02 4.075457399864334390e-02 2.636550288127434069e-02 2.217612656030130275e-02 1.533417563792839784e-02 2.930096834700751749e-03 3.821567710637788304e-03 8.647866181574937958e-03 1.195280964115817170e-02 7.563952221375114943e-03 9.200385664062225508e-03 2.964342155637644805e-02 2.199098542100548156e-02 6.503915360652129558e-03 2.275006690053334342e-03 5.449080895228842038e-04 1.160660905576382101e-03 1.010934606096662016e-03 7.966339332552508984e-04 1.041630551014143587e-03 3.294984603155464570e-02 8.709768143811436394e-03 1.258747193817673186e-02 1.251963777599754760e-02
8.465008868439241607e-02 8.682234831423740751e-02 1.835381832280751357e-01 1.493481713233087149e-01 3.165483034489812164e-01 3.196823230350182704e-02 5.854169185648934806e-03 6.206530125405664185e-03 9.857230326516799868e-02 2.975113442245557252e-02 7.853306480676620904e-02 5.113496229481115374e-02 1.840945782420515611e-02 2.645445638169868080e-02 4.981447483697601895e-03 2.049965942482835646e-02 1.351183906294886779e-02 2.718904368801516175e-02 8.875599528864488996e-02 1.446245908014082843e-02 1.348381215965648418e-03 4.032130535860815662e-04 6.241830039116125130e-04 1.854447880672374996e-02 1.112916643193146912e-02 7.494234836796553716e-03 6.761792211328308128e-03 5.414725227320740797e-03 9.231281116519867574e-03 1.033900323696012279e-02
3.926318698472044955e-02 1.129011700082608455e-01 2.478842487080877288e-01 2.003412003347145587e-01 8.163266218930800844e-02 1.249116415462993290e-02 9.716089155982208722e-03 6.456770062023092956e-03 3.910841091496557696e-03 3.644867190693033832e-02 2.319306759399543047e-02 4.524238038784018923e-02 2.011218070312957226e-02 1.313956070780276757e-02 3.796689589868469401e-03 2.827451240359001288e-03 5.789109473697021460e-03 1.062324915111857553e-02 7.369563371486852546e-03 6.160195546969589667e-03 2.722415698626757304e-03 9.403903757396836569e-04 2.362786492832876298e-02 5.901870000726167640e-04 9.120602593149031850e-03 6.804951539139095402e-03 5.835216226741101429e-03 5.532914679475867820e-03 1.091908042012872636e-02 1.188377654271119931e-02
2.252639058992504661e-02 6.979892950182778333e-02 1.949667512422226245e-01 7.557117376452920920e-02 4.283357398290756762e-02 6.177254454452889461e-03 9.311852624655376706e-03 5.109299378455255287e-03 2.349109131104473464e-03 8.182686886828557937e-02 1.023148333274942479e-01 8.549910475578435809e-02 1.240653499358328193e-02 1.004908528033381446e-02 4.598122695425643780e-03 1.669085857240823522e-03 1.752635786661609074e-02 9.882839649199845825e-03 1.557709410641072538e-02 8.791402539410374251e-03 5.977213108005404417e-03 1.661785702782177113e-03 3.550036581425356549e-03 1.019566371939949504e-03 1.629058609460689797e-02 9.086633011309495217e-03 6.298060257000821956e-03 7.269596930896465511e-03 1.108484829212051138e-02 6.155217895376587263e-04
2.231352424036569734e-02 2.319955923976406431e-02 1.040589267757881103e-01 8.338421486993798093e-02 3.286814640188689268e-02 3.492927074880776330e-03 4.196382307660661941e-03 4.434719553104428738e-03 4.130735558383191210e-03 1.247242878160627066e-01 9.749808005274628042e-02 5.038343048687023845e-02 5.646484579978890660e-03 1.914894782937345699e-03 1.431700331317705419e-03 2.295660129596555424e-03 9.893082130815104500e-03 2.541036564230352100e-03 8.084266099082399945e-03 2.749796140294865146e-02 3.299823374341725318e-02 1.914110812247706017e-02 4.614030424628553541e-03 6.349699106052446220e-04 2.418640170833295105e-02 2.375695093943340150e-02 1.477676619853452757e-02 1.015144066103798245e-02 1.307981127857660471e-02 2.349322500321220433e-02
3.088316186732694216e-03 4.844759194020172022e-03 5.115852262323729305e-03 2.590268137708472140e-02 1.238691368529617857e-02 2.038876055419499775e-02 3.053774744388969287e-02 1.721783298796935105e-02 2.032691829167970754e-02 2.354876136376380519e-02 1.803067762893694609e-02 7.315974603359423449e-03 3.075608843436420173e-03 1.457587073357276622e-03 2.101850361562698777e-02 1.257431697473640952e-03 5.651721774087085405e-03 2.646021325842132059e-03 1.331731702932740201e-02 1.799777612473632896e-02 8.179670524722564007e-03 2.121780749136317409e-03 9.168873599203876748e-04 8.362373255200279080e-04 1.672573580499362583e-02 1.763882596657762383e-02 1.543500994062036759e-02 1.324556680008712704e-02 1.469363613925277721e-02 3.483603629479053998e-02
6.624497385312725327e-03 1.207326043330876619e-02 7.024901597423424161e-03 1.506199397431458829e-02 2.302084157630673866e-02 2.575150350511726596e-02 2.269029282455400920e-02 2.130555081144542076e-02 1.692857087201258409e-02 9.406323350523200164e-03 3.754535069145293474e-03 1.151857974171317973e-02 2.526604635019291927e-03 2.402507432053941142e-02 2.711184222704074789e-02 1.785289637733958107e-03 1.145399781584416007e-02 1.829211705566984730e-02 1.594577055127571058e-02 1.119725956188559468e-02 2.985668367523658991e-03 1.540602212562360799e-03 2.956800878903743934e-02 2.567119114665271026e-02 1.281051183935060823e-02 1.318890086946670689e-02 1.961996493629432348e-02 2.250244332183191226e-02 2.158527444107571219e-02 1.190667585840974544e-03
1.745903144464629533e-02 1.147194122790752384e-02 6.637530946858674792e-03 3.810930947927531481e-02 2.441169374522412019e-02 1.029165205778900805e-02 3.307227915497886611e-02 1.485117215104340624e-02 1.234109046363261915e-02 1.206575466608707584e-02 1.067788624074001574e-02 1.400074998004368493e-02 3.150739278464263771e-02 2.183441975253508360e-02 3.202843907445616835e-03 2.753854465277899566e-03 1.112769968863383876e-02 3.394552423552114895e-02 3.336180843571421445e-02 5.492068396622500591e-03 1.017660472195916141e-03 1.064005128981017519e-03 1.237591610110404380e-03 2.442675246467264361e-02 1.473619280669865444e-02 2.149597678369167750e-02 1.306340956539162350e-03 2.311000368744214103e-03 6.655940235282765439e-03 3.281552223917044275e-03
2.849270255739148189e-02 1.871539586268463826e-02 2.951262284995286034e-02 2.734973011545656710e-02 2.345612741589468350e-02 4.608910208468826319e-03 2.132669982199457415e-02 9.119475623871647202e-03 3.796027297091959535e-03 1.416368248861468422e-03 2.060065621950861112e-02 2.004019842312626531e-02 4.194542418460944777e-02 4.464353198338007200e-02 2.087442420435037943e-02 2.258103532163521429e-02 1.217002191630614377e-01 1.268348587518239035e-01 5.081903920644108286e-02 2.243049678280627235e-02 1.600375573941309427e-03 2.645933183074272721e-02 2.873153156124278601e-02 8.736774952433396142e-04 1.749825710888337424e-02 2.235939956077096988e-02 3.701054311891124101e-03 5.414617484838916452e-03 7.525053254576799175e-03 2.030615902078793111e-03
2.360063945253842999e-02 1.247940020397581701e-02 2.747825064913224369e-02 2.332284906221876800e-02 2.888163220247532900e-02 2.634626779268206542e-03 2.196659923163449876e-03 1.905211806464970729e-03 1.176022869720682283e-03 1.048165137044879125e-02 1.637594291671237157e-01 2.726399557094770776e-01 5.573122685514338981e-01 2.709299599998289954e-01 4.923664745741281740e-02 9.556720908828710004e-02 1.788127807354625842e-01 4.963861661754913335e-02 1.181936385735138199e-02 2.591761048772123210e-03 1.470101064257708446e-03 2.604060221461361457e-02 1.324500696129920574e-03 1.074803581556817286e-03 1.031988265074027791e-03 2.454366045281721961e-02 9.382967565008778132e-04 8.685451250486817768e-04 2.637563010420797618e-02 1.902163388827585525e-02
5.382716083149987826e-03 3.136688756799265506e-03 2.264350363552645323e-02 2.214913911427398088e-02 1.689920589538435047e-02 3.813289137533613059e-03 1.451307306260839593e-03 9.159691555820122103e-04 1.111470216708078818e-03 2.059554455045786714e-02 4.966837730612091301e-02 3.228762533671274415e-01 5.728075894079437402e-01 2.931897835985736722e-01 1.042996785799517045e-01 1.164761390227995186e-01 1.288210195994068386e-01 7.600996819670821636e-02 1.865685022200362295e-02 5.824634953822034784e-03 2.950063661427345871e-02 2.836086842507177033e-02 1.173008756881933120e-03 1.227372307398914494e-03 1.248795306871326337e-03 8.671172864522426081e-04 8.002682952069139566e-04 2.785377742136134829e-02 2.857374489812733453e-02 8.484207817768147373e-04
2.588652883133754981e-02 3.557945672117240627e-03 5.285075214339554975e-03 1.484089083700880843e-02 9.514942546581294305e-03 2.953304451919925005e-03 1.471542348424686834e-03 1.190111447455374392e-03 1.496729852019744065e-03 1.062016909728592459e-02 3.480660991209307779e-03 1.016460362839962522e-01 4.228881636329179239e-01 1.794501410340200998e-01 5.582996005725270744e-02 6.401992607572937199e-02 2.361142122350600586e-02 3.461246256375877239e-02 3.934358212234358859e-02 1.590367687615812722e-02 1.289438511405619631e-03 1.190136766670838201e-03 1.290143064052745635e-03 1.681900152297096654e-03 2.176545268534556352e-03 2.008519099017893987e-03 1.709204319456164188e-03 1.798686189942056085e-03 1.340146197522904892e-03 8.589418269165667976e-04
2.286238585014675403e-02 4.999417003272200143e-03 4.368255142100320801e-03 2.550055344177467199e-03 1.484390184063408323e-03 5.668516836428542927e-03 1.908546698282253748e-02 1.607271492999367418e-02 2.098187142576228657e-03 2.524908236304360815e-02 2.553577445017638208e-03 1.640632364413490904e-02 1.914065948616723578e-01 2.569154375138280599e-01 2.715393947085851245e-01 3.637875169890852356e-01 3.264592128810693827e-01 2.115914162226626705e-01 5.772357697240878549e-01 2.669939533503543627e-01 2.178473726905561306e-02 6.231981350599886949e-03 4.639131986819647162e-03 1.157504391436021789e-02 2.674372682914399543e-02 2.488792198057661331e-02 6.725576667685927157e-02 2.102512177751017508e-02 1.565080567802232259e-03 1.383304939763331954e-03
2.168760070663850945e-02 2.033359583977886395e-02 2.719584801553469582e-03 1.204697931508826210e-02 4.292816362598162946e-03 9.834533471617355749e-04 1.271715527863515396e-02 3.669204342001505803e-02 2.528638942179486232e-02 2.565457009100283615e-03 5.394224970516652701e-03 8.180232604040531263e-02 1.720216006330561598e-01 2.170367786620323314e-01 1.948070350321463862e-01 2.340170280778013923e-01 3.977621369296031606e-01 6.854207839960615445e-01 6.957671674135896822e-01 5.440629707756930999e-01 2.303865058361968809e-02 2.384722071861317128e-02 2.111898164309357340e-02 6.575746814079731772e-02 9.394684440750031285e-02 4.771104656627268015e-01 4.709710825835108916e-01 9.126169044123616514e-02 1.903119074127214341e-03 1.054893691860644403e-03
2.025608201028826841e-02 2.086533484996410184e-02 3.146627512308856293e-03 1.911535787949478248e-03 9.643625255807612793e-04 9.841057721521758415e-04 6.962045925245032539e-03 1.972058550297400153e-02 4.074650340306597285e-02 1.438566534475090031e-02 1.471076599361227817e-02 1.270295319519058712e-02 9.808254823325640581e-02 1.976938671877462306e-01 1.834920589049344741e-01 2.799173920287528206e-01 4.822221100028590279e-01 5.832972019390476603e-01 3.355115075829854243e-01 7.268001945009867903e-02 4.331442872329988036e-02 2.953899764105787362e-01 4.278981305345438413e-01 7.112891247093989788e-01 6.632875830170833487e-01 8.585456093668507593e-01 6.796503350177891534e-01 1.886630724877878251e-01 3.084845928552774289e-03 1.324360867081549259e-03
2.458419302548870908e-02 2.741736093137561378e-02 2.613466663970542836e-02 2.401988172035804392e-02 1.036008806405997037e-03 1.934635601756228051e-03 1.138514917442201013e-01 3.832281608808029150e-01 1.867713422588654637e-01 3.168538533647331096e-02 2.330634869289779920e-02 3.588010625304585699e-02 7.041964377186972490e-02 1.035511856996815527e-01 1.364866350743302037e-01 2.441988980835977097e-01 5.232016339580624065e-01 5.228247340227484274e-01 2.457902730123044388e-01 8.372678271522270010e-02 3.579633489016912917e-01 6.440506240376427938e-01 8.194266138712998915e-01 8.323690387752380460e-01 7.258416943776756503e-01 6.217801174805904774e-01 9.075678795610302441e-01 1.549997137074593800e-01 4.826266353436409542e-03 1.969331768095556288e-03
3.087334247709433432e-03 2.861980482578566597e-03 2.333991092065822864e-02 1.356503172897881564e-03 1.218888705731261020e-02 5.562405585383877610e-02 3.128528465659585756e-01 2.564454684860709155e-01 2.519551924597401849e-01 1.251029096138975560e-01 4.541809875425428800e-02 1.208015456102917023e-02 1.172222751259655200e-02 3.002595122559974933e-02 6.764123946529233822e-02 3.101588867030733998e-01 3.234509800253609346e-01 3.731792809202908456e-01 6.440171573753043777e-02 1.126198113530511719e-01 3.950127484436905534e-01 8.451128942934335031e-01 1.030365961192521995e+00 1.053821914852928865e+00 8.589389224058521233e-01 8.180405966476077539e-01 7.505029025098194362e-01 5.889215354809541614e-01 2.593157352431435872e-02 1.690732211458123233e-02
2.374729413907769593e-02 1.779766323633483411e-03 3.128747958951059050e-03 2.156901574167189098e-02 4.473811986255774725e-02 6.372542310465265092e-02 2.020951671242854908e-01 2.538795700930490673e-01 1.744824443610574483e-01 1.347841878942906135e-01 2.797371530779360280e-02 2.713925098298937411e-03 4.090098264382314996e-03 1.145932077382909135e-02 2.475867070550154606e-02 1.448092530833883229e-01 5.462106090689944349e-02 1.723891069370013518e-02 5.718452632676131707e-03 4.116954796742446077e-02 1.557777838180138541e-01 8.243608157644887191e-01 1.035973995616754184e+00 1.065046955594926237e+00 7.613311655418855128e-01 3.451125835972581601e-01 5.493102313240686430e-01 3.731791010140085296e-01 3.347376642852700757e-02 1.302575251146956270e-02
1.525588888839966156e-02 1.938950938681202260e-02 1.235354465990278448e-02 1.528333742433627199e-02 3.574992972851107065e-02 2.061375283945038675e-02 1.068063622382431493e-01 1.389609418180257350e-01 1.285279440857136635e-01 3.003957691860725462e-02 7.485215169701085573e-03 1.574569535172728888e-03 2.740520154511180088e-03 7.987990344442955429e-03 3.128874665697899821e-02 2.076307527755119967e-02 3.736204556830319268e-02 1.089256024644534408e-02 2.023018161558010411e-02 9.537017665965411006e-02 5.137472093510064841e-01 9.703247657750592170e-01 1.038768893275940686e+00 9.639547928880168870e-01 7.182186502241408865e-01 5.109265240954176113e-01 4.830936907091750165e-01 3.226235492975246810e-01 2.890105049743544458e-02 1.016731051357848761e-02
4.143606259218345078e-02 3.755079239351310355e-02 1.909472214066193843e-02 1.361242478082556190e-02 1.750641883618442654e-02 9.445598910043456753e-03 5.422113178504969766e-02 4.889687708364281321e-02 1.347574933232856785e-02 7.300646797491794869e-03 2.520214140438137903e-03 2.011120036957879387e-03 1.207059562907296640e-03 6.713491570987629390e-04 1.745423882287372571e-03 5.880086568882367942e-03 2.073010051843029652e-02 4.658503993752709932e-02 4.423455402124390479e-02 1.963422624171773934e-01 5.380875725631275586e-01 7.803283859228473673e-01 3.177361029137752979e-01 4.639586357872005351e-01 5.786316660876172913e-01 3.166217033353203036e-01 2.294537943803018065e-01 1.868865458089559173e-01 8.005998578554957695e-03 7.424507229608876512e-03
3.385338076654884759e-02 3.855981829645618864e-02 5.592900878612284965e-03 3.815895412440270876e-03 3.090828553529647790e-03 4.633775803892418478e-03 6.661623392546768725e-03 1.676325629556003893e-03 2.221334485913785926e-03 3.559780216539526238e-04 4.802094666201301722e-04 7.262521973955480799e-04 8.141191722252062940e-04 2.928591401790760305e-03 8.327404693349254802e-03 1.083531350107225649e-01 2.047318378101989356e-01 2.915352955061321083e-01 1.960894315767015006e-01 1.462971996346955350e-01 1.040131304386797129e-01 3.729218500018410126e-02 1.452988412922506106e-02 3.070506177754733432e-02 1.073178837482681863e-01 3.497662981603435334e-02 3.109378722120208563e-02 1.043660045743077108e-02 1.407847472506940090e-03 2.427552982729871620e-02
7.202364035455549596e-02 5.483920753114709945e-02 5.790379447420400220e-03 2.454686967292311547e-03 3.542381595371504963e-03 2.770376612531001790e-03 4.375726619502764113e-03 4.774993930216304213e-04 4.366834728673138748e-04 1.484144223978917272e-02 4.726744322815404462e-04 8.435968443219954080e-04 1.089077269621931913e-03 6.001658228085551307e-03 1.009732000680219066e-02 6.443438760761618922e-02 2.317231104549768994e-01 4.241241506861995192e-01 4.717161140484007475e-01 4.044415424708408535e-01 8.616953871620285088e-02 1.928006821686555766e-02 2.411637806799879491e-02 5.864593304049878220e-02 1.273217259189057537e-01 3.661858701531557625e-02 1.355148735754559998e-02 5.053634723352178060e-03 2.687926744695395831e-03 2.494111425471098268e-03
9.017749501542933477e-02 1.137424188564819562e-02 3.073564871513957339e-03 9.905117693706267951e-04 1.102029264426349986e-03 2.413888323668757045e-03 3.180333466894222100e-03 2.957653857716754930e-02 1.704858349407591470e-02 1.951151263983264689e-02 3.405259230274580717e-02 7.950214559317062652e-04 8.454619402199958691e-04 4.628649244301085743e-03 1.865970490597393741e-02 9.269432308049822822e-02 1.760083360515062589e-01 3.967573500250480278e-01 4.885744810174891817e-01 4.092947928317700601e-01 2.056309160956069082e-01 1.193248963437037666e-02 8.574600395835912589e-03 1.857970196931008414e-02 1.056467259849213081e-01 6.296722081939640225e-02 5.550964204980240319e-02 1.025362473874668473e-02 2.097888073168782241e-03 2.682778503710428128e-02
4.984979305961271395e-02 1.535147668819884618e-02 5.853861665865205122e-03 5.369512383855368394e-03 1.158570108866294537e-02 7.894384566379451101e-03 3.344521594565259912e-03 1.395564055308186596e-03 2.140202902314792231e-03 2.945373759677862545e-03 2.066552777245260486e-02 2.306919277530623813e-02 4.890897018229522445e-04 1.065499972959658937e-03 6.772311335654521147e-03 2.873183783493100593e-02 2.830693925087894233e-02 1.178377395913754871e-01 1.474064154736532684e-01 1.260179028211152741e-01 1.074476515224162126e-01 1.406775086979982804e-02 2.203951691977747672e-03 4.355647933627784275e-03 1.926131832190377743e-02 4.849150320604050934e-02 1.289636006186834216e-01 7.099221585025866643e-02 2.462793231283019225e-03 1.897213197119483087e-03
1.783383365996701886e-02 7.046612743141448393e-03 7.413845493547770865e-03 1.228961148798022110e-02 6.503221650286201624e-03 2.899591713382454212e-03 1.334899888906953104e-03 9.364210147278675782e-04 2.976251180501825796e-03 1.175886851428085272e-02 9.158197367057504482e-04 2.213817496721441277e-02 5.234257454469672804e-04 1.101210703873970864e-03 5.499919468945452597e-03 1.027019448987166045e-02 6.914357253059019368e-03 3.348728381458024490e-03 5.167390883897130839e-03 9.406005584451286247e-03 1.714036145062809019e-02 4.016684794275810454e-03 2.132282434650236910e-03 1.110620583420388573e-02 2.725971144413355876e-02 9.805400446801530376e-03 3.380906699955787270e-02 3.713323789757089904e-02 1.279328826073834399e-02 1.874362993642463091e-03
1.807658693649412049e-02 1.444179584277806641e-02 6.937594775512997622e-03 4.987673959428961384e-03 4.489325539328415868e-03 1.676551767841619580e-03 1.112305345886872377e-03 1.140221831223501127e-03 1.264378841908612734e-03 5.067574954536742220e-03 1.525242329380239667e-03 1.434442507082853754e-03 1.384724990714922147e-03 1.767728516637291853e-03 5.405336398758084880e-03 3.965471851576288578e-03 2.719898639603615404e-03 1.645400658148096339e-03 1.462946956152324325e-03 1.144615238386378865e-03 9.479050011341130658e-04 1.441741178354299501e-03 2.394602262890297654e-03 6.250766608610604236e-03 1.130054288033957924e-02 5.554552032230263524e-03 8.945950833391381335e-03 5.897562990513968012e-03 5.831875175712181170e-03 3.644327053827629576e-03
2.455694480107655994e-02 1.273988853681460448e-02 7.132450115911713635e-03 9.544801037421396170e-03 8.122406478524807003e-03 4.398253790226591166e-03 1.508571200481746699e-02 1.142988869341602862e-02 1.693735917059411298e-03 1.282687585606988702e-03 4.576415868645920294e-04 1.044199603283721151e-03 3.135030981013104540e-03 3.707330862910811816e-03 1.217341280550279792e-02 9.634280649959470200e-03 3.101688333853772333e-03 3.737426008840590008e-03 1.748571033710513527e-03 9.279437974651124754e-04 8.646668752360699714e-04 1.342129633326395299e-03 1.790787204143666879e-03 6.010156297457287106e-03 6.578898311031970703e-03 1.668649359302150229e-03 1.915679319594435544e-03 2.470593835998422493e-03 8.006203952062180759e-03 1.620301168521402985e-03
3.299985529155170100e-02 2.841220730871972869e-02 8.493291346231982356e-03 2.843122058221150827e-02 3.204337769833634497e-02 6.041257097925141484e-02 4.076802504624753992e-02 4.633580889171059689e-03 1.675084620491110610e-03 1.013157417922811582e-03 2.411208968751412177e-02 4.448847762097718505e-04 5.394282689528801487e-04 2.264675347054866030e-03 2.742260009874604009e-03 1.316433985189208742e-03 1.317664306209550629e-03 1.651837186777200660e-03 2.290849772989812533e-03 1.410362094411562192e-03 2.151644018658194907e-02 1.069858068198634160e-03 1.011460499172917461e-03 1.896316036633059103e-03 6.626222085106639806e-03 1.146146340725431173e-03 1.754869544405907337e-03 2.936282199616182219e-03 3.595319179368974133e-03 7.075918613593207979e-03
1.788206933764304937e-02 4.412910657408616877e-02 1.301210990925278678e-02 1.364861949826227938e-02 6.446044276805394657e-02 6.808713365063888412e-02 4.552854038018191302e-02 3.140156486747861918e-03 2.230108045132028066e-03 2.233355322713635564e-03 9.303677272949445161e-04 5.784043463326376177e-04 2.098313006185236265e-02 6.484262944822711573e-04 2.983777368446613888e-03 9.357529828018839105e-04 3.472459831919441544e-03 2.201277117665424027e-02 3.994157736265871450e-02 6.274595704590121489e-03 1.238204294333081906e-03 1.582393677644389684e-03 1.130154812282981296e-03 1.372460486167601445e-03 2.018113474079861504e-03 1.698779129613244270e-03 2.116560508474629992e-03 2.639543819859975320e-03 3.616304065736484705e-03 8.802649013470021169e-03
