3.574657546930268825e-01 1.358978675425326528e-02 3.682890472563942266e-03 4.639157163534701929e-03 3.528075681356524895e-03 7.731506458990488814e-03 7.648526167543473996e-03 2.062409376002019568e-02 3.728392026281392851e-02 1.687541819761241915e-02 1.493822812801035883e-02 2.301135396026131597e-01 1.446575380703277458e-01 7.748396373125731110e-03 5.780307363158006424e-03 1.551672434427833480e-01 4.640903952908174285e-03 5.544918324885353238e-03 4.845367199728080158e-03 3.739353281015524166e-03 4.707274281593177845e-01 7.333115455878710942e-02 5.641359003591863569e-02 2.246680294726307314e-01 4.334938962557464692e-01 3.380092430830352046e-01 1.544000901973971440e-01 1.352776280251983057e-02 1.285525007478996451e-02 1.608543124944858058e-02
2.329735825650846026e-01 1.391381612971163105e-02 8.966513549472627728e-03 7.299982753756356808e-03 5.093632492579686956e-03 2.786503032537738025e-02 1.562955786962678950e-02 1.922540836146065940e-02 1.051258490233144237e-02 7.507892246951486555e-03 9.588394185621408952e-03 1.169946349530898294e-01 1.688587276486442357e-01 7.017633853952734597e-03 6.949230341119327047e-03 4.654464844533318796e-03 4.498255324630241574e-03 1.024676331507061097e-02 7.426654867477467878e-03 4.929454196770184128e-03 2.714492170990604469e-01 7.030345668806690929e-02 1.466832184293114238e-01 1.307704813207228034e-01 1.152775317244609937e-01 1.539329120933434769e-01 5.385949421862440412e-02 1.364522302138358040e-02 1.936107788731637400e-02 1.928702158264848990e-02
3.472610241604542208e-02 3.393616662766147513e-02 5.805827112012881819e-02 4.716852634706803632e-02 1.004314589161239696e-01 2.525101358058100612e-02 1.997661767311552927e-01 2.107786731835082084e-01 5.895465845622449574e-02 1.093614838156194494e-02 2.890298176609513645e-02 2.289873323905225813e-02 8.570510089083589397e-03 1.777179467203747823e-02 2.577316409828887545e-01 1.838988072314136010e-02 8.387558406620324036e-03 1.341649913223464177e-02 2.963223437327746138e-02 9.403070689465910931e-03 1.709592420915684585e-01 5.792120350725107197e-02 8.879075885147991176e-02 3.083988411703968147e-02 1.822231664392259115e-02 1.196676597693320174e-02 1.066855489627389561e-02 8.369101269942905152e-03 1.426077251827324519e-02 1.595501925307499930e-02
1.270127398171817454e-02 3.566017934899446545e-02 7.821174137573541629e-02 6.316523666789204683e-02 3.351540790266370473e-02 1.905483505235750288e-02 4.037050180961647139e-01 2.517239102918860660e-01 1.366779675693148566e-01 1.443047207375209792e-02 7.838784106309235403e-03 1.559253097913585427e-02 7.079033451873707056e-03 1.240719605148041249e-02 1.969072611484473101e-01 1.770700926513487650e-01 3.823145254679534699e-01 5.128813367986879979e-03 2.497852993385645502e-03 3.202253949704302136e-03 2.998649851271831812e-01 1.194098020278401978e-01 4.106949170384653625e-02 8.088843817737620401e-02 1.480520450965230710e-02 1.058866021824422451e-02 9.075768348223565984e-03 8.609236220866534409e-03 1.748902427527597794e-02 1.897517339591976368e-02
7.267359381073396941e-03 2.206261369272574657e-02 6.153453820665869684e-02 2.387420453758180849e-02 2.059173745359438659e-02 2.362246130556994450e-01 4.130936675953035264e-01 2.335093258380270542e-01 8.602644061656967989e-02 3.631085472468717490e-02 3.529869496516357952e-02 3.753970246371364505e-02 7.355893296444086793e-03 1.327124354322723777e-02 2.560163845564685237e-01 1.062619185948808914e-01 1.742859151059079903e-02 5.631925868712602153e-03 6.843425857241435158e-03 3.957702362657099238e-03 3.507861861713605992e-03 1.523317285167600788e-01 3.893592389545847410e-01 1.253375750063337180e-01 2.668814172976192653e-02 1.420284209117686318e-02 9.854570151341937242e-03 1.139899847883897414e-02 1.785238253493617172e-02 6.560745016070178293e-02
1.160203330874886619e-02 1.228137033225343636e-02 4.379707787803727853e-02 2.963143047924959167e-02 1.628859995427216559e-02 1.332387924450192940e-01 1.703972180609110709e-01 1.817551014288072697e-01 1.476746664273630993e-01 5.141542396522918307e-02 4.337207813884852436e-02 3.300034803491250918e-02 2.196534518225131127e-01 8.262828317279910517e-02 6.955456086056178988e-02 1.206809517483498628e-01 1.279922604849746855e-02 1.611108726552542836e-01 4.296764810968300118e-03 9.641201932560317447e-03 1.525248988778592392e-02 1.438897474883572142e-02 5.330353757124946419e-03 7.344413521692907953e-02 3.972796815476463406e-02 3.726083272632717269e-02 2.324038090018104227e-02 1.604326317960218587e-02 2.122497820883646746e-02 3.816472457763150916e-02
1.217235877490653734e-01 1.836473408798770801e-01 1.803165488878154255e-01 1.283771162012110022e-02 4.754035923912280220e-03 1.103068743690951981e-02 2.195873295701807754e-02 1.224653640611606149e-02 1.491455670033668690e-02 1.532770275407814749e-02 1.283755722285990011e-02 2.662003689216050906e-01 1.243595015047167240e-01 5.897566844471681391e-02 3.449955199654024945e-02 5.983811620870798514e-02 3.395828645770619381e-01 1.520581182681997323e-01 6.874289610955649360e-03 9.717608772117318841e-03 6.983211761323771839e-03 1.524090152326071923e-01 7.088421617662475638e-02 6.658603523994231776e-02 2.702568928657118896e-02 2.780206069697450239e-02 2.446887454583831015e-02 2.116556097687762733e-02 2.431223362525748374e-02 5.782406254188549033e-02
2.485691874252974887e-01 1.395708981791164184e-02 2.541356262766540364e-01 9.192987287749030886e-03 7.563889260573160127e-03 8.545319965300239920e-03 7.650433953659631185e-03 7.289698012470706596e-03 9.036627774141691924e-03 3.582543130825058264e-01 1.495528527923102036e-01 9.236091668462185003e-03 1.051609207718735839e-01 3.845284338882827557e-02 4.363368194267282923e-02 8.083420674049218713e-02 1.175448587965631682e-02 1.347368262254548810e-02 8.727834035284608855e-03 8.054168693408877630e-03 2.191406709820474252e-01 1.286679516031561943e-01 5.182454821773018611e-02 4.346644458089655993e-02 2.073562341651715574e-02 2.150059902039939616e-02 3.312037887258498237e-02 3.741475273250371991e-02 3.736464809451595787e-02 1.086517596531022256e-01
1.147300836311020145e-02 9.894347881832191854e-03 2.186838494613589923e-01 2.149550590961638377e-02 9.994187083138188904e-03 4.228652734305480415e-03 1.373272326069156953e-02 7.059527298092586542e-03 8.714110973705595925e-03 1.007916648958293721e-02 7.491708681305255836e-03 7.725768037767906035e-03 1.481156734126447792e-02 1.288702681568417233e-02 1.394789287595000482e-01 1.170855422075222779e-01 5.647749978147138458e-03 1.217795023362321268e-02 1.510192582881451223e-02 2.921583148919169037e-01 5.814621512969816997e-02 6.054305242550707400e-02 6.572305083164964312e-02 4.303248726674607783e-02 2.524105471373520176e-02 3.717862055955839518e-02 1.308706981424910820e-01 2.338618133343380312e-01 1.016437801813366466e-02 3.325645992013266383e-01
1.000267551230553387e-02 8.200930687860949128e-03 1.298892386695776370e-02 1.202007423989070317e-02 1.151350900885524803e-02 1.643675116584809026e-01 1.706799884879468474e-02 7.771111680690814295e-03 1.695669525614764972e-01 6.144252934169703445e-02 7.592160955953866988e-03 7.156511984485868644e-03 1.512397968377882269e-02 1.922567585143022256e-02 9.921396996474146981e-03 1.063678369852385543e-02 4.842397481309583529e-02 4.566334039678988238e-02 2.572559624763585268e-02 1.752578378919322430e-02 7.433138398930623503e-02 4.697555253508807482e-02 5.380968698552095891e-02 5.921355911601957484e-02 3.311897018419689143e-02 4.120957260711569786e-02 3.566938983916866368e-01 8.701638481746591658e-03 1.037320848720516171e-02 1.746300567750686261e-01
1.770354859695402044e-02 8.926986529838185080e-03 1.188886289626583416e-02 8.300017695963146300e-03 1.986695692652285655e-02 1.037152945332549814e-01 1.005361371898838424e-01 9.145797081962446506e-02 6.238850823811512014e-02 7.117815000775107835e-03 6.008704425855664749e-02 9.696223990192548436e-02 2.005123656627654793e-01 9.859998139525218142e-02 1.811901212536186703e-02 3.548805198456880111e-02 6.569978852459849861e-02 1.801539270470834189e-02 6.884171982231949115e-03 1.209853433521883292e-01 5.104292180269474205e-02 4.561326556286471323e-02 5.886801725237438693e-02 8.252030340674870734e-02 8.838623843300268124e-02 4.744016482718992761e-02 7.113433215599003490e-02 5.260942560710098886e-02 4.688922141851400993e-02 3.419060119860531377e-02
1.789660153368000384e-01 9.753886774370619517e-02 2.072069774652242347e-02 2.186370311815154233e-02 2.018813246176453385e-02 1.673926334035526486e-01 7.870742669293061267e-02 5.452224210599170007e-02 6.481277100110754974e-02 1.199541856055397378e-02 1.828532868337924555e-02 1.196895822373310603e-01 2.066233171006780778e-01 1.069513829580178432e-01 3.849696689762437118e-02 4.341370423973775483e-02 4.774570805935993839e-02 2.797729100348743739e-02 1.128932658854160664e-02 2.754385095719716348e-01 4.874546172836053542e-02 4.961011416877589286e-02 5.864047208676049366e-02 1.050245660285030747e-01 1.000189678002586929e-01 7.123645808976712679e-02 5.462281136496990874e-02 4.918220077563421888e-02 5.349998946584491599e-02 5.758170456352694477e-02
4.260074506874556716e-02 1.002363357811962563e-01 2.184527085491662635e-01 2.426939432461658677e-02 3.967563021033061466e-01 1.386345024589306363e-01 7.811676273104185830e-02 6.877232414163662877e-02 8.823445097693144445e-02 6.742088786616279306e-03 1.690074414725339647e-01 4.044828209030811028e-02 1.529680000303264564e-01 6.560031049104469991e-02 2.064172904430562616e-02 2.391526857838470466e-02 8.812674978403576415e-03 1.289058804365557191e-02 2.065754579901631777e-02 9.421241729404066997e-03 4.660308276145917750e-02 5.106263401538485569e-02 6.403047986192829388e-02 1.064027930493486179e-01 1.350183804312176383e-01 1.195086395198330237e-01 8.826360772980228198e-02 8.269974102733898547e-02 7.263563014767242254e-02 6.006635015447334830e-02
3.679552685267641760e-02 1.010751715391404876e-01 1.552916973276820545e-01 1.082198831844229520e-01 6.363429645748119867e-02 2.799856971788100557e-01 2.341051138473736193e-02 1.075777052336007907e-02 1.219666712031539646e-01 4.000067237915134327e-02 1.427349841630616012e-01 7.880530134641221957e-03 6.929985747219653824e-02 9.402042231659736571e-02 1.005305323561525160e-01 1.360976669337267408e-01 1.225790653347738624e-01 7.961025777509871115e-02 2.175697155031826313e-01 1.036524343377796253e-01 1.479752946766067084e-02 3.032246102150382705e-01 2.253284415579022426e-01 1.139311702951624136e-02 1.908410941359247812e-02 1.507181979392661041e-02 3.659258866312746494e-02 1.654860462300477772e-02 9.836471193532633772e-02 1.135430423533190514e-01
3.439422389200436775e-02 3.323611727145476397e-02 7.925680946579977126e-02 3.048281632596194779e-02 2.037412429382768897e-01 5.143712893182143114e-02 1.127188399108919326e-02 1.544218693861794910e-02 1.182491905958985880e-02 1.523440729925283621e-01 3.137689489235890306e-01 3.797153926092171339e-02 6.103027106367901744e-02 7.793350573614908627e-02 7.082397097433323907e-02 8.608176657816667132e-02 1.476148439324870276e-01 2.564320280840545752e-01 2.624701104651924743e-01 2.070973332936209554e-01 1.315157562542729891e-02 1.679579592234600738e-02 1.440802001417947932e-02 3.272706582990769775e-02 3.721565556470839836e-02 1.910479318817052130e-01 1.906620310077324076e-01 4.883432273471616930e-02 1.012015999704890118e-01 7.738084881570188311e-02
3.163472674164604509e-02 3.338794756654599183e-02 6.507381359608885307e-02 6.871780159292251167e-02 4.459671527589499640e-02 5.406024308128113548e-02 3.307542329925327595e-01 7.183292134439649493e-03 1.572182331227648527e-02 6.928202582872095699e-03 7.243114514877363984e-03 5.420166278852699311e-03 3.387064009658736358e-02 6.924608103107163237e-02 6.519898483706702830e-02 1.007940346154532485e-01 1.761438250596665811e-01 2.161803597867500426e-01 1.262151956960852750e-01 2.773399178932319312e-02 1.669339154270073344e-02 1.147888524975215069e-01 1.673337091417391731e-01 2.824395936458780065e-01 2.677423055166781585e-01 3.514530879155438048e-01 2.820837474216535967e-01 9.300232826228205241e-02 1.472325005498369421e-01 8.624183104975670366e-02
4.054060163685121315e-02 4.577724347300902302e-02 4.295507638637349052e-02 3.884442866666189959e-02 5.666968782656971876e-02 1.001397833741355659e-01 4.470033456587300252e-02 1.380559719220876558e-01 6.227229670786585403e-02 1.057258347550289225e-02 7.766083175776802849e-03 1.195565620359628940e-02 2.365099200341759522e-02 3.535183627141440937e-02 4.732370483092355334e-02 8.594589638858092517e-02 1.879812917691031371e-01 1.920942833190988075e-01 9.228542645663888322e-02 3.203279149318700308e-02 1.386361343790869782e-01 2.520775154274836338e-01 3.239388217105427237e-01 3.355493881466853900e-01 2.986002600401350682e-01 2.603081795717541169e-01 3.864596722032235809e-01 7.328401738541409638e-02 1.929966467319943757e-01 1.040165615581699621e-01
1.008359928907405917e-01 7.840018117998806546e-02 3.795242279230328503e-02 5.312415470812213714e-02 5.956674612625536581e-03 2.088946859255991911e-02 1.061836438049876818e-01 8.460668785380143220e-02 8.290355757874838527e-02 4.103924113133713275e-02 1.717710113243809886e-02 6.099854040026715489e-03 5.915729455022508167e-03 1.330107867472271090e-02 2.292001415858287150e-02 1.069233640279225600e-01 1.145204709473440774e-01 1.429735116367225334e-01 2.531373446956979370e-02 4.517448032222073917e-02 1.537134979807311397e-01 3.335699324837524404e-01 4.123468230926062295e-01 4.320064438517839389e-01 3.607695023911397514e-01 3.511918544870800685e-01 3.281968569810638225e-01 2.681631937083889250e-01 1.555714009155144753e-02 1.088052534102652499e-02
4.014010678895662404e-02 1.100938026902935629e-01 1.919676213868589387e-01 1.112276190667459141e-02 1.579734775913928593e-02 2.052850825293485795e-02 6.493006525314011512e-02 8.121922365290308587e-02 5.558538834285520897e-02 4.287990877151816316e-02 1.249261260369629971e-02 2.057200159896486469e-01 3.089651071730258880e-01 7.384063897369961063e-03 8.342751583977675925e-03 4.986192091215489730e-02 1.930020382956296535e-02 6.624476480258763983e-03 2.329268483872323214e-01 1.639810535168715819e-02 5.997695105753096667e-02 3.216946449065540281e-01 4.097675678041779457e-01 4.333927583360092650e-01 3.197136448259286778e-01 1.494452195434694819e-01 2.435973440440228621e-01 1.659096102071447310e-01 3.018255787652138894e-02 1.330841856240978435e-02
7.253308909555476920e-03 1.130513031604908278e-02 6.939423230476816570e-03 6.738168038816213373e-03 1.127722012134531153e-02 6.451510084891739182e-03 3.321413061381850440e-02 4.291014046135234461e-02 3.946770626191239972e-02 1.208450100065213730e-02 5.943878790640478964e-03 1.426146237859399202e-01 2.426523554615671874e-01 7.088845140294910106e-03 1.208426560619156077e-02 7.580625940624568376e-03 1.317085408859439664e-02 4.215616495801740964e-03 7.931405449996846088e-03 3.762958851035976687e-02 1.954520635551835472e-01 3.738744031439945603e-01 4.053226186230321493e-01 3.892858015917223802e-01 3.019098101306657012e-01 2.230222712402670227e-01 2.172609186697053163e-01 1.627697253035363389e-01 4.486551396617096538e-02 4.634620527602412166e-01
1.322628039239924676e-02 1.194179053069128506e-02 8.183655093585099488e-03 7.530190269121020581e-03 1.011738745960476422e-02 4.030193810183413036e-03 1.765634595932567830e-02 1.826432632358777897e-02 5.345819472616320130e-03 4.054952582802267072e-03 2.451924588382648762e-01 2.159864479548210814e-01 1.192826827407270363e-01 5.510382688912390803e-02 1.177603487182520142e-01 2.148300738203286382e-03 7.286513823515251322e-03 1.673086066532975327e-02 1.621427836360778835e-02 7.317459673912357632e-02 2.029030531098145185e-01 2.977197892163817028e-01 1.225864654486300137e-01 1.864020782228525130e-01 2.435510873458651138e-01 1.392563352933072762e-01 1.235712403107481483e-01 1.185665618651603331e-01 2.667625308394440120e-01 2.900949723972835459e-01
1.069308709015116300e-02 1.213571967429684373e-02 3.314574921369538209e-03 3.267259000979363948e-01 3.060298315686800774e-01 4.196495422466601372e-03 3.383798300190254526e-03 1.581762531443733077e-01 2.254058845580312886e-01 3.889170658332855718e-02 5.717689045391485120e-02 9.065644358339061681e-02 8.383428160186803813e-02 2.614659461307986543e-01 5.079908178010231722e-03 3.949157761577604814e-02 7.164034830752361027e-02 1.041287486338296070e-01 7.143260889348101994e-02 5.421434198438646740e-02 3.902883083722005764e-02 1.416156497262443040e-02 5.571201105110419952e-03 1.224758236840773132e-02 4.488352469589403787e-02 1.531864244163901392e-02 2.232415067862196512e-02 3.828373453860989817e-01 5.015252090485145670e-02 4.679727273986085401e-02
2.261853139996550244e-02 2.042695891858559501e-02 4.225806060655385582e-03 2.522470521324765569e-01 4.261895776065119934e-01 3.246030489814619169e-01 3.700659908409259947e-03 5.683045694847490420e-02 5.387966337999988004e-02 2.332374965447641529e-02 5.766603703164306649e-02 1.048941516768057969e-01 1.104728456528805275e-01 7.634873284065969885e-03 7.741747688946799127e-03 2.188094008862552856e-02 8.036396277239583885e-02 1.502794561295614506e-01 1.707103445385274865e-01 1.492979150626243257e-01 3.231862769690237169e-02 1.091007371315609077e-02 1.351606615577121730e-02 3.172335143031572435e-02 5.206819621841479728e-02 1.550096253939952338e-02 1.115162250095533790e-02 1.819830588258082582e-01 6.889023484230843986e-02 6.604508639923274693e-02
2.823643103781503863e-02 4.264289403190994580e-03 2.418801634338137163e-01 1.026704502437700423e-01 1.335921438686551443e-01 3.011637946452858650e-01 4.027609865607074680e-01 4.671896783042695650e-02 2.657129787737576646e-02 3.027593403228410335e-02 5.489283224270363748e-02 9.250952083722434327e-02 8.295833771652716404e-02 3.945482166742696473e-01 1.201389989436709577e-02 3.121062201817505211e-02 6.063116385783759443e-02 1.399025908936236684e-01 1.764525232825596424e-01 1.511057599298631093e-01 7.725715020352659501e-02 8.070119667198952934e-03 3.384690742597230018e-01 1.291212515653183610e-02 4.922400949874435050e-02 2.575144751765843718e-02 3.745350388249947537e-02 3.129819549600748596e-01 5.531638042116394233e-02 4.991255482002394939e-02
1.558383032549209499e-02 5.883899043296382698e-03 2.635941175687822515e-03 2.837515699230896363e-03 7.250193291571115604e-03 7.694250386999199748e-03 4.307660881961348220e-01 1.839151849770431224e-01 2.690785881938743129e-01 3.434169647747280507e-01 3.216191108726936670e-02 3.840772517984841761e-02 5.012412198384352813e-02 9.430225751802676082e-02 5.451802978232989788e-03 9.600965670544336569e-03 1.083282624792454400e-02 5.106667503814119741e-02 6.464706073856704704e-02 5.174833956058186302e-02 5.287761220047905442e-02 1.518347541825991118e-02 9.388067168770770909e-02 1.520393774568422063e-01 1.260929262016756078e-02 2.743871946709381185e-02 8.728033683820506095e-02 4.807781975789748169e-02 6.232974007927753052e-02 5.435419232764077818e-02
5.573054945053891075e-03 2.197374228792511614e-03 3.010006404538603970e-03 6.489701003798476787e-03 4.553262309248910095e-03 3.566227087186067957e-01 1.743882502170305826e-01 1.280678752284246658e-01 3.950042159876043790e-01 9.736725043120631959e-03 1.041447053084424285e-01 3.903113742711538520e-02 5.741629675146551343e-02 1.027565051823868675e-01 7.915251485439707413e-03 1.274987531037898546e-02 8.755024077823875955e-03 2.122608259554211452e-01 3.085869246124480214e-01 9.853367177609376887e-03 2.035301498891258290e-02 2.103138639231577345e-01 1.044098852922725612e-01 4.608494277086599283e-02 1.005471909068136327e-01 3.533983085914253475e-01 7.567727788655950749e-02 1.030407161616234690e-01 6.097743646810085960e-02 8.701497335679599099e-02
5.647572208519259160e-03 4.502184096778368526e-03 2.863243488428169128e-03 5.163528300451202258e-01 5.315460986378276464e-01 2.104814353692968654e-01 1.434474389894494217e-01 1.503902790761467989e-01 1.652323167378764723e-01 4.017780183575552638e-03 1.930210256384805312e-01 1.953969673484514114e-01 1.568611219577876470e-01 1.567832302673282385e-01 3.929562239995698647e-01 2.659138400030089944e-01 1.911792087953458619e-01 1.198601443225264657e-01 1.044857448380626386e-01 7.827492700014176963e-02 6.265772611118931856e-02 9.112358293656912245e-02 1.364325311674569330e-01 3.193503278965865722e-01 5.455565781528302072e-01 2.494967815681700118e-01 3.845622809301303957e-01 2.652765773155416063e-01 2.737372981302517161e-01 1.798972248876572755e-01
7.670676739885163957e-03 3.970405401173891617e-03 2.942550473048273236e-03 5.175577517175278947e-03 5.279633968597090277e-03 5.183925011799680460e-01 6.768228631430696189e-03 5.845758017765626154e-03 2.261654507858038565e-01 1.648404338265559155e-01 6.215540485276022792e-02 1.458084452618303439e-01 3.663259484512966790e-01 3.354358564556828570e-01 3.166151400332153226e-02 2.377313259970748396e-02 2.178375131953703969e-01 2.601458808882872731e-01 1.184262337092999162e-01 5.254046216066075858e-02 5.103586500132645948e-02 7.945754405833979628e-02 1.204920126223698179e-01 3.681881370826295408e-01 3.712769531103229381e-01 8.797478230927764653e-02 9.805486692787573899e-02 1.267531821745146170e-01 4.135183258478773993e-01 8.429356063619285189e-02
1.031212662129722679e-02 8.859662692368069914e-03 2.631299669394383377e-03 8.792115665986303952e-03 1.104308509986539483e-02 2.070084689674277223e-02 1.548997701221676432e-02 2.646457434762207635e-03 2.292376799231665985e-01 1.338472148714864307e-01 4.065573931993227141e-02 5.187815556397299549e-02 5.562532362890665327e-02 1.908898438234772343e-01 2.188008434095499721e-01 9.253444071728215981e-02 7.675497578461264181e-02 8.333616425820540574e-02 1.129978879491305988e-01 6.561216711535236557e-02 4.666287727538023788e-02 6.951135843850514417e-02 7.911450283280893614e-02 1.320757166601145283e-01 4.108708960108594654e-01 6.488652757241361591e-02 9.449765277204516534e-02 1.553499417660449133e-01 1.880282141062539214e-01 3.720734939743457481e-01
5.604423793310006098e-03 1.383264154889952795e-02 4.053261951355409225e-03 4.245917711746947931e-03 2.009624861932342646e-02 2.106408201600790814e-02 1.569227737292989630e-02 4.007037567886272411e-01 3.098338616545520674e-01 2.918072923292084342e-01 1.201839952700599207e-01 6.071299005663386567e-02 3.643205862669701700e-02 5.726833201622079372e-02 2.615104045345096884e-01 6.856610088068473829e-02 1.841897598579468054e-01 2.368770635826609322e-02 4.661426415575292692e-02 2.507981022875789834e-01 6.480783589715606585e-02 9.070401338339639796e-02 7.897329418209728114e-02 8.682735352015608088e-02 1.150754082506205977e-01 8.843743829104519505e-02 1.045090898231781362e-01 1.291488477810224522e-01 1.747833259832919650e-01 4.280564388797847286e-01
