1.762118879942618788e-01 5.625898766326740616e-04 4.990581635630345677e-04 6.421714166192156632e-04 4.931727910860830887e-04 1.090072818104512609e-03 1.080419124323601108e-03 2.923821092810511939e-03 5.330554637432219356e-03 2.392653463639044485e-03 1.112233381879875610e-03 1.169013261377961910e-01 6.926951876975040445e-02 5.403561364779266990e-04 6.223193013396742176e-04 7.246000048172765440e-02 4.784372290958365534e-04 8.417694860977387996e-04 7.678414909361786552e-04 2.705828627466976021e-04 1.422140494367407360e-01 2.046968837432561888e-02 1.576469673717913883e-02 6.239533228053533581e-02 1.203457564641597644e-01 9.407578998004650916e-02 4.342993928401885084e-02 3.880959808064672265e-03 3.725123748307036884e-03 4.707980071439897031e-03
1.364539766306505086e-01 6.750473775518285764e-04 1.228041543130062438e-03 1.005580586570524416e-03 7.051857441337721711e-04 3.186137413387959624e-03 1.530400616527496926e-03 1.917081623117831155e-03 1.257306747811151029e-03 1.059241594281802850e-03 7.486879687102663498e-04 6.971374632991533815e-02 9.398359887377769062e-02 4.278354744755396405e-04 5.879628400250037999e-04 3.735306072890473474e-04 4.656385767063826709e-04 1.540790358805184564e-03 1.179857044164644682e-03 3.579550443132396799e-04 8.688159649720371414e-02 1.941588622225769514e-02 4.058727576039736218e-02 3.574125406090986057e-02 3.127231065334054594e-02 4.166869526020736125e-02 1.475633715949556737e-02 3.861617326616337623e-03 5.555812120046915367e-03 5.621106604631656220e-03
3.873205122302935365e-03 3.816861182271103978e-03 8.082694148059980585e-03 6.522015486150197286e-03 1.395449114881377670e-02 1.435558486148395384e-03 1.209542352022184852e-01 1.301730736007052358e-01 4.781239790942547196e-03 1.432736440905045105e-03 3.788274243127763910e-03 2.457747778423093055e-03 8.831380376575785531e-04 1.280208025965256114e-03 1.335058537341058948e-01 9.950508442074536535e-04 6.753036577943339041e-04 1.411503209882845195e-03 4.799512930577929520e-03 8.090249474020057893e-04 5.512040184332245296e-02 1.599032078835094933e-02 2.440006857027227777e-02 8.513909907846034519e-03 5.061540067083699496e-03 3.352855533418276635e-03 2.985910310412038561e-03 2.384878198109101170e-03 4.084122089106989942e-03 4.658792362008648894e-03
1.816750277232597778e-03 5.047277357778598601e-03 1.109121505921717085e-02 8.886723274327396754e-03 3.684440807427993153e-03 5.742070354500620208e-04 2.071189507167835731e-01 1.393966048081785869e-01 8.501153868931984880e-02 1.769249846859298481e-03 1.121063135984694693e-03 2.198543764048604618e-03 9.766300398430414424e-04 6.420563464074968783e-04 9.884974691529513358e-02 7.662679677112452237e-02 1.679695013954067284e-01 5.422574857457943725e-04 3.920952416864759192e-04 3.380057353397553413e-04 1.053809413637239734e-01 3.639564718114517150e-02 1.145001661191231111e-02 2.208719038581110489e-02 4.103401593734287006e-03 3.014931237226718512e-03 2.575151902047608833e-03 2.456029978613073587e-03 4.935714456223371481e-03 5.475509842339817621e-03
1.064326577022748363e-03 3.220357370776200621e-03 8.965037241317086458e-03 3.471454129697797326e-03 2.005314444798741037e-03 1.333200186351278793e-01 2.038279420077989124e-01 1.132036433411857668e-01 5.180843279623617570e-02 4.061394486061028521e-03 5.042617803890942635e-03 4.293642753159069257e-03 6.244956266162498583e-04 5.037332345125813612e-04 1.168286380080607867e-01 4.385136280316275642e-02 8.648458580902152479e-04 5.011891243888182308e-04 8.183389923021018673e-04 4.707636975915694896e-04 3.195477543042504580e-04 6.002425713217894587e-02 1.347674090106235067e-01 3.691727539247992990e-02 7.349433478844749276e-03 3.989312449950621967e-03 2.756217394619998179e-03 3.221545471966919677e-03 4.998561462609511785e-03 1.882846263670028691e-02
1.075858932245912043e-03 1.110375091651680420e-03 4.967606236479656448e-03 3.969642119230953892e-03 1.577665956909765632e-03 7.821602197324625805e-02 9.370219493385623100e-02 9.889186800859750548e-02 9.014742975907122369e-02 6.245276674866859570e-03 4.904981132033392997e-03 2.601891882520580325e-03 1.274610669710160571e-01 3.912268370789633021e-02 2.998134218594072919e-02 4.922692635462759536e-02 4.833310126573342035e-04 7.089562143078345646e-02 4.152411828665746431e-04 1.434877619529473496e-03 1.738957860923521018e-03 1.021023402613131445e-03 2.493199760327547971e-04 2.217617864395398514e-02 1.095598146596952517e-02 1.037936815709212396e-02 6.414404119503776952e-03 4.478842553442873367e-03 5.858787551016632345e-03 1.084939114655003242e-02
6.767144038678551965e-02 1.111409533941959266e-01 1.174666461508126758e-01 1.263783890470134789e-03 6.052143073067142243e-04 1.001906260891825612e-03 1.512018647027434408e-03 8.571580355378966357e-04 1.009308318388685418e-03 1.195088160681880528e-03 9.312689009973547025e-04 1.597204124764882716e-01 6.579243952046012756e-02 2.585611216080537650e-02 1.366914429457298519e-02 2.438602781898402405e-02 1.461470177863252728e-01 7.053157549770486257e-02 6.749486147829711433e-04 9.238844569857665358e-04 4.265026191850164548e-04 6.278672470535005823e-02 2.556545266576960157e-02 2.009169999762554226e-02 7.455898944688843510e-03 7.677642667342733304e-03 6.653331344378149437e-03 5.868812659777594698e-03 6.783670550454133988e-03 1.662196278720331349e-02
1.401978382217649310e-01 5.925225165074605570e-04 1.552005019842398192e-01 7.449341354910919179e-04 1.137927263254269461e-03 1.272878803893750469e-03 1.122194238791224393e-03 1.051456001249116787e-03 8.383110482171745063e-04 2.088194093409923013e-01 8.326639905307178791e-02 6.081077250883818982e-04 5.434666332373819242e-02 1.822186500971598525e-02 1.878795369231945483e-02 3.491944407903452285e-02 6.021258475627957844e-04 9.615959944791069042e-04 8.435691554061306319e-04 5.982854551923709333e-04 9.083832409861489210e-02 4.437327639893545728e-02 1.542489166465649264e-02 1.209324915116811658e-02 5.692020727260697736e-03 5.975699970298059896e-03 9.187600815703984153e-03 1.179237393892671251e-02 1.201688154444543327e-02 3.631375380091086957e-02
8.523035775090523000e-04 5.585327708590129454e-04 1.394869180309318835e-01 1.893519195183876198e-03 1.224916053480842523e-03 5.158350007821824483e-04 1.655375516919009495e-03 7.362746884735755452e-04 6.120082841927106370e-04 6.130719958381764326e-04 5.531139178037569734e-04 7.352417141505973586e-04 1.613537719292230119e-03 1.058642968849076100e-03 6.897406268862595058e-02 6.369747260134334121e-02 6.176265342579363108e-04 1.858618196420971751e-03 1.818443453700995709e-03 1.527048057836955242e-01 2.500825953694790077e-02 1.988330375091092520e-02 1.922983682614073930e-02 1.186650679900570424e-02 6.860176417895036231e-03 1.053980125923680705e-02 3.952192243660600235e-02 8.150824326859151814e-02 3.604852975354084360e-04 1.223166013747540026e-01
1.408745779493426713e-03 9.169745894166993466e-04 1.470983342400137249e-03 1.369385863138172571e-03 1.196444449576063293e-03 1.022432730726939853e-01 1.086125573710658692e-03 2.062720580513318636e-01 8.751732882653841250e-02 3.257894183479160405e-02 1.055386603016604703e-03 1.030815800308441292e-03 2.213056468376578979e-03 2.466980797845771782e-03 1.208033312832701217e-03 1.346832197063961133e-03 7.140002488194708077e-03 7.291624270829796112e-03 2.887507215866528740e-03 1.268962188003017882e-03 3.141541170352073892e-02 1.524169488611376230e-02 1.587102353089352505e-02 1.670778331756895413e-02 9.105253566717291802e-03 1.171405599672943089e-02 1.102745287134093005e-01 2.898940066329040916e-04 3.963193088268897454e-04 6.668871174776952460e-02
1.161440170254391443e-03 6.054485859170929138e-04 1.365052103604146158e-03 1.165998250222115068e-03 1.482248088621874842e-03 5.910512268884764164e-02 5.028925578119884665e-02 4.426898485701095953e-02 2.805733384158621418e-02 5.337933815989918430e-04 8.411432856886374293e-03 1.402204557943293600e-02 2.949731162485666469e-02 1.514732186239919377e-02 2.901212512435425057e-03 5.833407872444672584e-03 1.076191134898740916e-02 2.944217334179952648e-03 6.951786598737045783e-04 6.317369174478469629e-02 2.194348621511299502e-02 1.548343569136668985e-02 1.857252666369548985e-02 2.531941047402215539e-02 2.659160392332822823e-02 1.432953903619608657e-02 2.264717862439689922e-02 1.852583623891740361e-02 1.691684439723533176e-02 1.234314492348721065e-02
8.884867940766086325e-02 5.224068010066505036e-02 1.109432669863296165e-03 1.100373673471209332e-03 8.647318159065624579e-04 8.633197904406926526e-02 3.397440213172688017e-02 2.203650685565426703e-02 2.751291320852430888e-02 1.054051257827400348e-03 2.570223539762745736e-03 1.680709495359038880e-02 3.064414220571701555e-02 1.648186031487520672e-02 6.174616255690346459e-03 7.158675539481513909e-03 7.934383078976307846e-03 4.693548421906624732e-03 1.157629070088428413e-03 1.383833501816105760e-01 2.072461930830143961e-02 1.857817502014678240e-02 2.118272498931632331e-02 3.760289337898010953e-02 3.574556143333532110e-02 2.535345629734891276e-02 1.936096862400292495e-02 1.766636601272091739e-02 1.898277482079088058e-02 2.038793186275374147e-02
1.704064654581823740e-02 4.401012906636678906e-02 1.093089721772861761e-01 7.381817842800152520e-04 2.099602593002472262e-01 6.750303212927227792e-02 3.487937365791114741e-02 2.941207366472892853e-02 3.738382285285894724e-02 5.310109008701436196e-04 8.805671279777749216e-02 5.433653561533937498e-03 2.315091656564315092e-02 1.018811301705770805e-02 3.299158437641343689e-03 3.910935688172265633e-03 1.465916792753124915e-03 2.179376963874610565e-03 2.512654315671683687e-03 9.499086912363400442e-04 2.535874878248537551e-02 2.294373892959620381e-02 2.785126673037981865e-02 4.788670481112553001e-02 6.279347381141198170e-02 5.907490305928107810e-02 4.377148269527822433e-02 3.969093316165089175e-02 3.010282061223103905e-02 2.311985366195286329e-02
1.344552966763135418e-02 3.873643026407416062e-02 7.255577341415264669e-02 5.411332915586232473e-02 3.269280475182788359e-02 1.309637669720637720e-01 9.726055644750696352e-04 8.045420911272559107e-04 5.448737859332919431e-02 1.679957101461317104e-02 6.737970264751295957e-02 8.896049971475265524e-04 1.062949091556941728e-02 1.470995840274752497e-02 1.607307762719121375e-02 2.214518476487171289e-02 2.043769052160722757e-02 1.355483727883227338e-02 3.776519722053810202e-02 1.796716261167981971e-02 1.509541422187031306e-03 1.621888089217278506e-01 1.229863596128442649e-01 8.489337255655593061e-04 1.986350516890559876e-03 1.863321395938245112e-03 5.096057900363737750e-03 1.632928028384693321e-03 4.918148335491036999e-02 4.719335250160315576e-02
1.237212410900038334e-02 1.251009821552374543e-02 3.527511600194099123e-02 5.981474179174646770e-04 9.914023528841291177e-02 2.358471251939820573e-02 6.532255653246746676e-04 1.870113127331496546e-03 1.252005930011720024e-03 6.791453273446262928e-02 1.453508364808599740e-01 4.408066871591069698e-03 9.422219377944672861e-03 1.221361325042902984e-02 1.127565637749667130e-02 1.389854211438660073e-02 2.442243594515947080e-02 4.343477851838599413e-02 4.556578137568700893e-02 3.708393199433322740e-02 1.624828454974630056e-03 1.735026326665728511e-03 1.557161660799534714e-03 4.923740477134866574e-03 7.077654366719972161e-03 3.611215419492870560e-02 3.602834311553138741e-02 7.157552536057701018e-03 5.691063162730836122e-02 3.397547022732361199e-02
1.112463672314373958e-02 1.226313769706683168e-02 2.859400419203992835e-02 3.204445857757411836e-02 2.145770151915128016e-02 2.470071268124008831e-02 1.770029296057259449e-01 1.021449070881247714e-03 2.134747074516723728e-03 7.612890466056325021e-04 7.809208068998096074e-04 6.708490223826247796e-04 5.238569003665672144e-03 1.089908515866983875e-02 1.043912165464891233e-02 1.634415144103444975e-02 2.916547918219299096e-02 3.667014748357731724e-02 2.201328057955021997e-02 4.993253534291658240e-03 3.080258915720559057e-03 2.164713673866111923e-02 3.204280470161507965e-02 5.388169478371611365e-02 5.015865716184746137e-02 6.458405240341374975e-02 5.140215238775630580e-02 1.460051406961269949e-02 8.813966071147077974e-02 3.972908902748784055e-02
1.387185192428379288e-02 1.631288915647088542e-02 1.630834575711217344e-02 1.568820657755023301e-02 2.408804023003135661e-02 5.070299287355442552e-02 5.909640784669377075e-03 2.014998895178376700e-02 1.002042031516582263e-02 1.688316107977144188e-03 1.229492601612161779e-03 1.865707809083629824e-03 3.691970773158099756e-03 5.600708141264028501e-03 7.579007901468915592e-03 1.389159269246101856e-02 3.102754964049782294e-02 3.272431084261062662e-02 1.623531828339937894e-02 5.808208521086661268e-03 2.564701073273575882e-02 4.742069905447499067e-02 6.202835553732342910e-02 6.350624928600080710e-02 5.507114476097903222e-02 4.672514496545900758e-02 6.804253797727308206e-02 1.184799039589966123e-02 1.294144009055389066e-01 5.503186870984781709e-02
3.406648240396556448e-02 2.726325949923500899e-02 1.436720403423176473e-02 2.275875151422869155e-02 5.484826784049501476e-04 2.803447035071197826e-03 1.605713934453883995e-02 1.340558044208586819e-02 1.348074036650806495e-02 6.618035331347581728e-03 2.364065844951906883e-03 6.153305002276347919e-04 6.013668206838282838e-04 1.595502860983941855e-03 3.679926521229011371e-03 1.730164830584310365e-02 1.898242776556576319e-02 2.336378731013619842e-02 4.267908343700604380e-03 7.850181281336712086e-03 2.853496881938415164e-02 6.311996568157487997e-02 7.978230316439863246e-02 8.207901311242304931e-02 6.627861779019587896e-02 6.206509181395460095e-02 5.624060284599492060e-02 4.459299578592008234e-02 1.978889236045235610e-03 1.304512315870130258e-03
1.545203093239082281e-02 4.344292044139690112e-02 8.171705636409566653e-02 1.044871892623940425e-03 2.263110886053382610e-03 3.195260959657016293e-03 1.017616548251155592e-02 1.277076240056388562e-02 8.832063225897473710e-03 6.793669885883276902e-03 1.407720697773170515e-03 8.778629023465021886e-02 1.322156892020906471e-01 6.005312143529417147e-04 1.332406005223681468e-03 8.027493470660413549e-03 3.191893130369898371e-03 1.071123044726235082e-03 1.496729470656436023e-01 2.800929734547092168e-03 1.079629582130274199e-02 5.828320330498365509e-02 7.498202162501629853e-02 7.891188075284585879e-02 5.753660596930573745e-02 2.646520387014168751e-02 4.243929258642135244e-02 2.912240789573745936e-02 2.625382314066204356e-03 1.036109183483284240e-03
7.843217120708759378e-04 9.907136742838486450e-04 6.512750115281361806e-04 7.910815663635820203e-04 1.822504772092430753e-03 1.029718507726945986e-03 5.249551662795650699e-03 6.686542148103031755e-03 6.124116597325902911e-03 1.446547953348293822e-03 3.635983458988613359e-04 5.242787263508706663e-02 9.015721560546173519e-02 4.123696551578128161e-04 1.671679131177549208e-03 1.146643774099845997e-03 2.175172693503344551e-03 6.688628606896030240e-04 1.297871149211594823e-03 6.272455067589570790e-03 3.394547973224022741e-02 6.485045343906074844e-02 7.041661801109712349e-02 6.827930610764039454e-02 5.342487326607939235e-02 3.969911500372048929e-02 3.878906624609379516e-02 2.612936082464509258e-02 2.352000945704339416e-03 2.629106289720526402e-01
2.225314071890318723e-03 1.986059280802752666e-03 1.009424742971152568e-03 7.137467786570831675e-04 9.087231102558421692e-04 4.728843867748946310e-04 2.610296254660268364e-03 2.251142580493807784e-03 6.034086549818485365e-04 3.351138317839374102e-04 8.809486435385069369e-02 6.931733915335347440e-02 4.076351712303390856e-02 2.205715748514928271e-02 5.588669804220394721e-02 3.185512363092949739e-04 1.174882391359598297e-03 2.767753791369047950e-03 2.743122569424006826e-03 1.246749696646756202e-02 3.411829387599831648e-02 4.977947440074234620e-02 2.042081203459991667e-02 3.176205920885368655e-02 4.264647328067884546e-02 2.499564440950802907e-02 1.912888211126399438e-02 1.570790161123726547e-02 1.733063650997104244e-01 1.579852650262842662e-01
1.792833899356030374e-03 2.006245995589773633e-03 2.936358304589096915e-04 1.346477113162443673e-01 1.188945301308234476e-01 2.328830838499858192e-04 3.187558009290718643e-04 6.435597618704118339e-02 8.322743814747735058e-02 1.297305563258366670e-02 1.693527648320254653e-02 2.566757753979508755e-02 2.813981144072573784e-02 9.868356377198975182e-02 4.334521276465513927e-04 5.796404626367758668e-03 1.137566688935307685e-02 1.693817639086642526e-02 1.187727312045127118e-02 9.113422460689956164e-03 6.481399745718803215e-03 2.332904839427323018e-03 9.069668582347601045e-04 2.038915426726331005e-03 7.765444278927058352e-03 2.753195475244839957e-03 2.634659211674067730e-03 2.608299789808560254e-01 2.990175742547114546e-02 2.445806828158769014e-02
3.735391145583315600e-03 2.803863743199767975e-03 3.016955812485877172e-04 8.631203893501426805e-02 1.349690521515299335e-01 1.073126901519563664e-01 2.085855738805314301e-04 1.780798596009084897e-02 1.498803833064443411e-02 6.477513027914218527e-03 1.533528954928694774e-02 2.895973548583900825e-02 3.823933315915490488e-02 3.005967517692512136e-04 5.182984454233381232e-04 3.382722636137331946e-03 1.270617775083558894e-02 2.444993995295381001e-02 2.855015341901164308e-02 2.542501221012941764e-02 5.485731470000278914e-03 1.238616892252685040e-03 1.547704140620103893e-03 3.897120611127547450e-03 8.990339459553110812e-03 2.743892420907984627e-03 1.084570745920937192e-03 1.217989441146524882e-01 3.835900900786727574e-02 3.440854756894209943e-02
4.575597645953052156e-03 5.692222469014542301e-04 9.985830186308297662e-02 3.445315123356140763e-02 4.140353228727142176e-02 9.224830255835309023e-02 1.195422182788075383e-01 1.342445646437169862e-02 7.406845207804980263e-03 8.547546516061391153e-03 1.512381595983906639e-02 2.580436920833641817e-02 2.900421777104189580e-02 1.582498905225165897e-01 9.542305920804514292e-04 4.839138125340549344e-03 9.680525885172173994e-03 2.305484039961349860e-02 2.993249824965557582e-02 2.606581434603957512e-02 1.327355649644125675e-02 7.781382054557892591e-04 2.047036507863385646e-01 1.230688900655283607e-03 7.228954389767059882e-03 4.417232124176652570e-03 4.056369512051163397e-03 2.212604122118370098e-01 3.382980339228294775e-02 2.591124547761400679e-02
2.494522082246894076e-03 7.568416867568753936e-04 2.957288073852943483e-04 2.754754397539520175e-04 6.093728802367926953e-04 4.058416250464382110e-04 1.266153437976739737e-01 5.221144674775456129e-02 7.848461591250743830e-02 1.019974929304079264e-01 9.484726300211748437e-03 1.068351422007297880e-02 1.653741019842419960e-02 3.694129524541577003e-02 3.423702230470083161e-04 1.477445935524751390e-03 1.557364926729982568e-03 6.944647861872712061e-03 9.251448035166639355e-03 8.223469741511956616e-03 7.088066618456815779e-03 9.350777704608926547e-04 5.344831584453782480e-02 1.015443077043927111e-01 1.277567132361618913e-03 3.208925137644797962e-03 8.687216793030042017e-03 4.923622873996091540e-03 3.962353957555161260e-02 2.979229597142524222e-02
8.903641417547548953e-04 3.462808364641408159e-04 3.720413110076740797e-04 6.280177607132116351e-04 3.418989865615651197e-04 1.115611040946415111e-01 5.176980618550841573e-02 3.666797943170781171e-02 1.166202743638579953e-01 5.395534675201685369e-04 3.057961941113132229e-02 1.053583185811234231e-02 1.769284152660346998e-02 3.828403874103743221e-02 2.775675414593551564e-04 5.270156347814288454e-04 3.833401618804733535e-04 1.047788715524209102e-01 1.631400132893049415e-01 6.251780843356528243e-04 1.145640728272374767e-03 1.083855608728684639e-01 5.394270857061733010e-02 7.313290436739550409e-04 1.790859278059266481e-03 2.197198588731380520e-01 2.211874428435099856e-03 2.496338282372465110e-03 8.916167849387110576e-04 4.541493520642518600e-02
9.024734533448629421e-04 7.104510313292846171e-04 3.481756232019093413e-04 1.729095994977100093e-01 1.694051136600299712e-01 6.486792005430992714e-02 4.324050788361115394e-02 4.465917011744067328e-02 4.953647497142012190e-02 2.362743836400195679e-04 5.548848266002216062e-02 5.261010876746575332e-02 4.931016541364283134e-02 6.063458269173303827e-02 1.735098366655263291e-01 1.202453637160029731e-01 8.335362110616630071e-02 5.107860738927445104e-02 4.592622709075525056e-02 3.550602465673874386e-02 2.801411426083489503e-02 4.058515515576948535e-02 6.405233682571685738e-02 1.594493943869095265e-01 7.390408952069234001e-04 1.333991493946424245e-01 2.125429458536766125e-01 1.363212690388165005e-01 1.365952833636611685e-01 8.770544047924368203e-02
1.222347438508521091e-03 6.255492230811403494e-04 3.578864753968518438e-04 4.905034428724201496e-04 4.295060091319342129e-04 1.698439601686952960e-01 7.489657960532000117e-04 5.447449248838700121e-04 6.667278660789557887e-02 4.822304209560747401e-02 1.713720902660505543e-02 3.923743950633340472e-02 1.156941041413776239e-01 1.270183547912313859e-01 6.070212914036723657e-04 4.892608169411099628e-04 9.517786729197358353e-02 1.160090617797997770e-01 5.490204621222554565e-02 2.412770206991655259e-02 2.181993859367946723e-02 3.316385620406077372e-02 5.135242012818565932e-02 1.622767304053807091e-01 1.689168087535793394e-01 4.089001199564320371e-02 4.580652576808601217e-02 5.803872844773443063e-02 1.848082366159373435e-01 3.839320624317858754e-02
1.642423603740564330e-03 1.395121199475087958e-03 4.253065889581687711e-04 1.459049585972118507e-03 1.685745405679346231e-03 3.097907651065069483e-03 2.016152325604191400e-03 2.205731661743713591e-04 6.587460647968923499e-02 3.793491480004902022e-02 1.116199478232027600e-02 1.390495338957670364e-02 1.732844604251437826e-02 6.952291206943519986e-02 8.758624937760041418e-02 3.974053976477816275e-02 4.004028399297959034e-02 4.933820735547066877e-02 6.863486742236457605e-02 3.784402871629392179e-02 2.052311810177918916e-02 2.778891909405336452e-02 3.113038645617308836e-02 5.418020166018832490e-02 1.758225877443708729e-01 2.835749603808200570e-02 4.161283027312704524e-02 6.787541063275508157e-02 7.953227440787807856e-02 1.616577184548383395e-01
9.071925135190252870e-04 2.214292245505052568e-03 6.615533461708767403e-04 7.071491158913173914e-04 3.393842406781043090e-03 3.526198533988090644e-03 2.310661598898557795e-03 1.263723493811008680e-01 9.014009009808379713e-02 8.441601681894589371e-02 3.439146355739677863e-02 1.691249916935567282e-02 1.089579484515740444e-02 1.938503337998257608e-02 9.457455075911970488e-02 2.810177420700701520e-02 1.034837647511888115e-01 1.331913119907817940e-03 2.604304266746162045e-03 1.591895398311647947e-01 3.107235644112614492e-02 3.920645802917067935e-02 3.325360833508939767e-02 3.775822831829651893e-02 5.177637887277546785e-02 4.064245531081973895e-02 4.847717054687106925e-02 5.977422640474717996e-02 7.793611682815815289e-02 1.952381712521649437e-01
