2.683370208917844613e-01 3.894155512801388275e-01 3.281966648880002002e-01 4.049109531906852077e-01 2.827056213728079137e-01 5.867998221185091179e-01 5.329232583993057659e-01 1.671925340311654698e-02 2.376528439358021119e-02 3.140599772251170818e-02 6.287210231816104944e-01 1.614015061394567518e-01 1.048204726180239632e-01 4.139419208100388325e-01 5.121779355095260611e-01 1.215031385042986134e-01 4.558765105409357532e-01 6.880705682872592654e-03 2.961232608579600183e-03 3.307526981029782487e-01 3.109523269839668536e-01 4.672116769660750873e-02 3.597212643860346615e-02 1.445582521399506049e-01 2.814510714882944020e-01 2.212683963987557012e-01 1.019695888070498574e-01 8.896951414000091318e-03 8.411727278706529129e-03 1.047038302809586569e-02
1.769723250287577598e-01 3.783234995605875284e-01 6.647510829971444712e-01 4.995969131587865153e-01 3.432505073779547056e-01 4.281940086835774734e-02 1.655749466895816910e-02 1.381343068511574693e-02 5.486374580445784188e-01 4.938344538697526098e-01 3.915877592354986003e-01 8.458891723629917425e-02 1.253655929006033398e-01 3.215806125988566744e-01 4.675624304914096085e-01 3.336628077120213365e-01 4.223883590005566013e-01 1.710420202534036066e-02 4.231891796027099049e-03 3.945509390732891974e-01 1.779119760447466780e-01 4.477284040679689603e-02 9.326528367408008779e-02 8.385849048848914578e-02 7.447754308744992946e-02 1.000899901382105717e-01 3.525386990589128577e-02 8.915449301457866252e-03 1.261341616909231883e-02 1.253178570544680008e-02
2.136022937962969021e-02 3.003545369498221082e-02 6.083752547721286985e-02 4.276974152201856727e-02 7.141182734053945491e-02 1.478602166107176666e-02 1.441786785869541565e-01 1.514130232513383745e-01 3.661155803629327632e-02 1.075328254002212887e-02 2.481043740235524750e-02 3.316862750503557500e-02 5.768957146640002476e-01 4.580263149089575103e-02 1.926094151235922813e-01 2.926536031821100683e-02 6.462484839009499105e-01 1.635160085588528017e-02 2.647049492810749083e-02 5.900155533974022794e-03 1.119164142683611030e-01 3.701409472335424194e-02 5.648255904580558318e-02 1.973095400188134771e-02 1.174216662537027299e-02 7.747768689707129446e-03 6.929687585639518997e-03 5.435495329459175476e-03 9.254169552345247254e-03 1.035410229781787150e-02
8.917132096219179682e-03 2.344314978568715763e-02 2.259457628884795413e-02 1.819098840380075841e-02 1.557836480152853878e-02 2.933172433645705457e-01 2.898374686975464520e-01 1.788227948459073513e-01 9.626504924740071634e-02 5.912883449137372113e-03 4.949683154508178196e-01 2.358679877809179842e-02 5.674675803790631967e-01 4.565464828156225452e-01 1.421861560860314122e-01 1.202868730277528858e-01 2.623677963980401984e-01 5.122738110961838620e-01 3.987717182623937706e-01 3.682959309197110231e-01 2.037258733523466536e-01 7.908403028960156456e-02 2.659932756052742209e-02 5.252580520487361987e-02 9.580294813080508787e-03 6.822419256431914471e-03 5.844715158853584260e-03 5.541358989794458768e-03 1.123871538538044959e-02 1.219734359963669905e-02
5.616900541287264126e-01 4.223452823713670645e-02 3.543425839518705295e-02 6.801857370315183594e-03 1.055362259370872316e-02 1.705228946171288285e-01 2.956754239646809390e-01 1.653731284749721808e-01 6.039644980094890925e-02 1.628244184122577820e-02 1.327094344999818487e-02 3.557823838536496031e-02 3.426773917290552585e-01 3.540713355750561009e-01 1.844791252166850526e-01 7.453874804344955141e-02 2.235773111995352502e-02 4.953855163453463328e-01 1.280186411418294742e-02 4.620545575643024705e-01 3.293449452563925739e-01 1.027917184371056614e-01 2.625609976241866650e-01 8.648486460214428739e-02 1.729235474587441021e-02 9.103278832037245763e-03 6.289648123762902818e-03 7.265849168630288991e-03 1.134898748357833324e-02 4.167539282595406763e-02
6.486671373785499739e-01 6.071360622936600171e-01 3.875505449709371053e-02 2.470107534757632478e-02 2.471706373488645470e-02 1.002471478290539869e-01 1.280433312217680863e-01 1.349856926144377134e-01 1.122782120863141803e-01 8.667173512908828148e-02 4.153310803192963169e-02 2.459101874561769527e-02 1.533312438030814406e-01 5.808410291891036997e-02 4.895294989987127032e-02 8.587083215327655228e-02 4.678478088203126273e-01 1.204656671678818597e-01 3.811205186592259708e-01 2.049870156557721465e-02 1.361682018710445863e-02 1.238770910097415461e-02 3.242718714353265974e-01 5.047808827240649748e-02 2.578641813013069634e-02 2.377951466173301720e-02 1.472305386373311958e-02 1.014308624962720340e-02 1.337578736445625520e-02 2.399827592430048631e-02
1.082641988474294104e-01 1.644852978459054038e-01 1.590842110027320400e-01 3.920549177712617100e-02 3.707179809231169743e-01 6.154894122122830380e-01 7.989674049077434559e-02 5.237220342190149758e-01 5.933105891230229245e-01 6.241667790706156849e-01 4.407786198227879870e-01 1.860198432517691791e-01 8.496781283630421011e-02 3.960780900221232137e-02 2.342279123667356105e-02 4.381132483578289299e-02 2.568051209808670521e-01 1.196593984026599333e-01 5.816440726390856852e-01 2.038300121471691220e-02 3.765617239412554218e-01 1.039703138558840806e-01 4.800165277478010001e-02 4.559359600786482697e-02 1.745635582101569619e-02 1.771026273584506983e-02 1.557992808369808996e-02 1.351700127488771400e-02 1.566152309503772433e-02 3.687257034654160132e-02
2.375836780144500449e-01 4.419003541873010033e-01 2.328046953467392266e-01 4.645273190199140645e-01 6.940849157955788495e-01 7.541018002100630113e-01 6.595056470784839142e-01 6.327024620133524513e-01 5.504354324523006436e-01 3.017328039677991680e-01 1.179045713561103770e-01 3.468813648646326131e-01 7.432151861714354768e-02 2.603936067159702203e-02 2.981862729423322145e-02 5.726450431344068392e-02 4.526681481414029928e-01 7.083612738217480720e-01 6.203642635509232228e-01 4.719423014850813725e-01 1.501071319196265186e-01 8.574546823793520456e-02 3.392696626468695575e-02 2.816110966753311573e-02 1.333095469179581757e-02 1.395061994611934697e-02 2.252517113910064775e-02 2.877638354934475978e-02 2.798800585480099717e-02 7.956822417239983736e-02
6.041272281032104008e-01 3.967612500779889029e-01 2.184573986531368195e-01 2.018659252216470634e-01 7.508372402723149097e-01 3.104666184879897872e-01 1.077146610765960522e-01 4.645066765465327707e-01 4.252833949279927750e-01 4.181914774408476143e-01 3.623193387335965632e-01 4.432173050830936489e-01 2.871154843871622994e-02 6.069365957339792894e-01 9.604549964600664347e-02 8.238547565943067641e-02 3.398108683310853695e-01 3.043491423235664822e-02 2.720581429664577569e-02 2.027621210830385656e-01 3.905238740177840312e-02 3.942439400322495652e-02 4.248998127276905346e-02 2.762242455459527554e-02 1.615391905191657096e-02 2.471197398693465719e-02 9.793115439254795884e-02 1.926123922692827284e-01 5.357770130253880492e-01 2.550941509915483629e-01
9.742853554058461540e-01 6.280373013392368531e-01 9.514079233455470241e-01 8.446700882068520766e-01 7.191448119950195617e-01 1.380372612099458329e-01 6.610658914511606810e-01 2.957698972895836942e-01 1.396775336356403663e-01 4.920566845165826042e-02 6.558279937828120909e-01 5.483110406302809103e-01 2.087365087780743839e-02 1.690839016722251939e-02 5.940058424845331420e-01 5.941901500511828083e-01 2.707557406835135738e-02 2.298572899593557400e-02 1.117816363485991775e-02 8.281157825598069872e-03 4.822676497626791209e-02 3.022611319092581572e-02 3.440307982391241359e-02 3.775575427334413453e-02 2.114228176827616726e-02 2.718413403040962142e-02 2.628926696696559651e-01 4.361293868396886597e-01 5.223645751896583977e-01 1.319234357021604742e-01
8.257749587432714478e-01 4.235568182413981253e-01 9.175485852866031022e-01 7.555136164923670350e-01 1.638073124700287209e-01 8.592545612098917429e-02 7.585183764336433931e-02 6.912032797291535469e-02 4.610798781129944041e-02 3.572335937792581739e-01 7.014407403851830036e-02 5.433609666629195950e-02 6.361763908047135541e-02 3.912377094073882927e-02 1.020632976137805445e-02 1.913312679578834871e-02 2.554304442062533750e-02 1.130936930710253752e-02 3.303081802441839021e-01 8.049090505057437950e-02 3.292769145318313884e-02 2.918131345617413011e-02 3.740505307758432152e-02 5.235059455182865251e-02 5.618060545159493657e-02 3.072437301877420715e-02 4.960925854810607077e-02 3.824696061064133262e-02 3.322217256206011493e-02 2.307829256139044133e-02
1.604004038747452732e-01 9.265723675301107409e-02 7.911389411660252335e-01 7.487581305267220211e-01 5.794275916682836147e-01 1.335148464397163115e-01 5.617080399405093016e-02 3.787061678159256428e-02 4.640562987466162470e-02 7.254007358598888455e-01 2.350306514918884884e-02 3.062706251823678685e-02 4.947714108493739965e-02 2.568417101512855336e-02 9.287810479405692737e-03 1.271052578753466798e-02 1.399870596699455405e-02 1.956530073868430891e-02 5.513385009092061084e-01 1.827968621462543741e-01 3.142660932337434238e-02 3.167506081049190070e-02 3.728390643925036385e-02 6.663688601350244156e-02 6.338696641295375744e-02 4.519566384124643066e-02 3.469143138437476986e-02 3.094612073305922154e-02 3.303916449093375479e-02 3.498034992093609907e-02
3.272051112512915777e-02 8.273466462622956763e-02 1.940975023431945334e-01 5.364879058535719780e-01 3.481476630855803722e-01 1.120897250760312658e-01 5.883965782353098306e-02 5.094880852963278028e-02 6.435785711473485105e-02 4.176914445893626926e-01 1.153226686526864775e-01 1.287568824146690695e-02 4.325853966689040264e-02 1.559391889041208262e-02 4.943766741211022726e-03 6.954365650672290032e-03 5.414063053354458699e-01 7.272750410315491354e-03 1.213521753902783822e-02 3.839278011900379428e-01 3.007331373673955560e-02 3.273230979356055864e-02 4.113869930284482640e-02 6.854295620327895133e-02 8.698824270695884597e-02 7.594563345671132004e-02 5.571147357778273579e-02 5.132265561767795914e-02 4.415587692820679283e-02 3.583508626450331719e-02
2.719995597672448043e-02 7.768768426054831200e-02 1.364628701365335761e-01 9.723460427128911843e-02 5.695980231558776113e-02 2.243223254682799594e-01 7.562101494418059788e-01 6.601152993094787647e-01 8.788128882738198422e-02 2.705704848586709330e-02 9.515581524036034744e-02 5.013797550053046281e-01 1.960769320309610486e-02 2.216765813475528660e-02 2.396735109841338293e-02 3.958219575245078281e-02 3.560637158193139667e-02 2.304310373606879500e-02 6.592801364184429358e-02 4.792184169817439998e-02 5.401670160717437774e-01 1.961870663097300127e-01 1.461822656266286713e-01 3.470706523736620808e-01 6.949577073662064342e-01 5.876208114177937647e-01 1.699106221865375604e-02 5.740374482096909370e-01 5.916498492662872893e-02 6.702565767583403000e-02
2.477728649204947661e-02 2.483501851252774978e-02 6.687623670516389118e-02 4.949782095417654681e-01 1.790275886192323473e-01 4.101751836640216142e-02 5.030057758895063458e-01 5.722746243219414136e-02 1.630850214487981897e-02 1.017784951232692248e-01 2.090959742583515246e-01 2.259550077050342595e-02 2.179789415327327770e-02 1.829252096657116994e-02 1.680844642952463580e-02 2.066939624929117411e-02 3.577263205772732851e-02 6.265385641845379328e-02 6.471380448597544022e-02 8.187982037148039405e-02 5.206201567330189794e-01 5.799504445654350970e-01 4.788863608446053410e-01 2.122288014231086747e-02 2.450936249613648588e-02 8.436619698779632137e-02 7.804329351990396679e-02 1.815124065627117533e-02 6.061214663339874187e-02 4.558235098596679497e-02
2.222011247113183513e-02 2.411075523789845895e-02 5.407271254195142318e-02 5.966085711965461724e-02 3.984014946474069563e-02 4.192456745041443777e-02 2.315285302716006965e-01 6.184636992294757496e-01 7.928841985550518640e-03 5.186951995321522624e-01 5.599434722330629555e-01 4.405209162005024326e-01 1.043562485266602037e-02 1.621112391658979454e-02 1.542399620996206394e-02 2.409744891266945785e-02 4.252405963234213299e-02 5.270410037442856827e-02 3.109973209504434191e-02 8.524724942469875597e-03 6.870167350007007692e-03 5.196013440030964464e-02 6.400769684239432378e-02 7.965897946070191193e-02 6.271364011102543989e-02 8.100650692899521998e-02 6.397147898140569111e-02 2.407742113274176018e-02 8.811234337991306897e-02 5.123145575075557095e-02
2.787211755984144237e-02 3.200452818780091108e-02 3.121410278361923252e-02 2.929444163310170393e-02 4.196502285351844108e-02 6.979986003921788418e-02 1.805834794628624965e-02 4.890960529488926761e-02 2.951570230730532138e-02 6.624393735332592681e-03 7.391389166371087859e-03 1.133862902639682334e-02 1.538949327968863051e-02 1.334118801152501914e-02 1.114367575121901453e-02 2.041609874771549774e-02 4.518337866590226709e-02 4.678789042981307267e-02 2.274871275787764338e-02 7.925923188014730170e-03 3.383974712281643399e-02 6.064172663989455397e-02 7.680025034572759979e-02 7.857506464402955193e-02 6.889136917651363101e-02 5.895690801978791667e-02 8.578714232785950022e-02 2.427239786123515028e-02 1.221067357127250397e-01 6.574893754148262992e-02
6.853246141640872979e-02 5.340834942011676162e-02 2.605775367041675977e-02 3.647393526235068878e-02 4.299680214672358947e-01 9.946403953922612270e-03 2.701648617478047062e-02 2.074027853051886236e-02 2.030667879201804651e-02 9.946231160138686855e-03 7.647151259448754616e-03 5.171442876101531860e-01 4.984187936408140951e-01 8.827569102706236265e-03 1.056188802594273252e-02 2.521984920602532432e-02 3.463448180393755710e-02 4.475180251113020785e-02 7.945568572455456377e-03 1.167970694042666686e-02 3.732533775681843441e-02 7.967245680676358910e-02 9.696765093980945494e-02 1.001834086274009106e-01 8.227366521639278840e-02 7.812130809035514045e-02 7.129461304299061775e-02 8.618231273149268290e-02 6.228304169717896466e-01 5.135522746238202485e-01
2.751192113298352171e-02 7.561653680823784973e-02 1.317289846941238074e-01 1.052617365559395564e-02 1.220992928141651640e-02 9.124398550336483560e-03 1.559162579693576522e-02 1.953649814035450863e-02 1.338786902322998233e-02 1.545910607144747838e-02 7.226078758970004394e-03 1.404691040040146888e-01 2.161841379248594652e-01 5.060483684278221927e-01 7.017839557448423901e-03 1.164197163720592267e-02 8.530286993203056028e-03 4.795213095384707191e-01 1.508566092270545722e-01 6.171015977720054405e-03 1.442438126704778667e-02 7.666483671215901241e-02 9.684051800387802333e-02 1.009275698405480703e-01 7.295600748677914804e-02 3.319123818917493751e-02 5.279393828154362034e-02 7.252176709324827109e-02 3.696342418265303326e-02 3.734079182066082914e-01
5.763838789070201418e-01 1.034968976780094307e-02 5.228798808336915238e-01 6.572369793079730904e-01 8.101169032708729900e-03 2.319316440050749398e-03 1.176172370360374468e-02 1.010892788693867894e-02 1.433145886059440308e-02 6.429907185286104498e-03 3.782681470432497917e-01 9.671716315613677895e-02 1.687843296554526196e-01 4.064356607326027326e-01 1.120967786015364398e-02 2.204262404623263515e-03 6.866442623287788947e-03 3.697949560191460816e-01 5.970397993582116092e-01 1.402848491419176301e-02 4.643594100486529708e-02 8.881112287929285309e-02 9.633043892123370477e-02 9.101787008960715575e-02 6.887131107213467773e-02 4.951128066775405817e-02 4.713491963800674894e-02 5.821874361609704479e-02 6.537418782476730472e-01 2.853735409376985110e-01
1.058004995450738915e-02 1.549269712561336491e-02 8.007715134761327416e-03 7.063278387266631181e-03 8.014713875263380569e-03 4.984164960587298410e-01 1.300560217781593711e-02 7.981778997775072770e-03 2.320139233592248985e-03 4.170124210623399885e-01 1.682201984485686141e-01 1.482314295790672920e-01 8.277404058647659657e-02 3.802929078011631214e-02 8.004571620389393238e-02 2.269217692721673951e-01 3.078422916130176858e-03 9.023562883315820390e-03 8.308697922700778934e-03 2.651847495415566441e-02 4.733672517192352713e-02 7.839974862495374675e-02 3.250330178304799977e-02 4.839805028211643240e-02 5.559269203758101380e-02 4.764218795479945728e-02 4.382706331641047365e-02 5.569841808411341716e-02 1.592575481577098162e-01 1.732755813491079488e-01
2.668989094103684564e-03 6.795296772800714195e-03 2.587125899560885900e-01 2.215867046372458349e-01 2.077877537700566213e-01 3.060635532110173029e-01 4.330114620383678781e-01 1.089656599594829717e-01 1.526851067528771644e-01 2.648821527483256541e-02 3.923267902079408120e-02 6.179515332513575709e-02 5.874784215116714975e-02 1.839165087576361546e-01 4.035567669497661658e-01 2.217245745871743515e-02 1.853839030770297602e-02 2.319460272752145447e-02 1.599792689939971702e-02 1.227185990346238258e-02 1.451720681652829067e-02 1.288742985997920129e-02 3.263782153473713254e-01 8.523355684823163275e-03 1.034835215885070679e-02 8.351153928310151020e-03 6.316554452086187155e-01 2.304594466203427339e-01 2.961875228628605902e-02 2.760788561122405269e-02
8.619556217671717896e-03 1.422536707620770773e-02 2.959428576795075094e-01 1.722876262107494727e-01 2.887226072522757203e-01 2.287750849725651570e-01 3.619306169296939713e-01 4.023683906314987763e-02 3.592688365201569117e-02 1.554314862854421810e-02 3.848146648044256657e-02 7.111488981198982318e-02 7.733817715701482576e-02 3.575177429223974634e-01 4.601219111548003338e-01 1.113915134400651590e-02 1.800403207371905831e-02 3.364444833932540846e-02 3.826965259434457478e-02 3.385040459238462807e-02 1.594848052689407797e-02 5.361401493910897820e-01 6.377013872162574648e-01 2.809334500810177146e-02 2.396172994123698871e-02 8.616197468850034236e-03 2.744960914280050734e-01 1.116920504839834932e-01 4.127733790285655069e-02 3.941458570861760408e-02
1.092103514726162558e-02 4.778378281030449259e-01 1.682697285541159549e-01 7.360905835509076733e-02 9.502226649281149407e-02 2.175950920054297855e-01 2.870169068936803680e-01 3.273148130670976846e-02 1.768013028705927442e-02 2.011905352612323311e-02 3.649676397905503300e-02 6.234723354435627724e-02 5.802362336641176538e-02 2.777176669795252129e-01 1.158590714236971096e-02 1.846466756525686967e-02 1.376101295740566818e-02 3.152244754822444706e-02 3.954104961107218069e-02 3.414978565248212583e-02 5.191832125357073724e-02 3.355919386172069863e-01 2.324325421608656739e-01 4.149802311847823333e-01 5.240421675447617250e-02 2.411895833554739479e-02 1.682456049837137424e-02 1.946683477037813581e-01 3.375991706718031726e-02 3.025454863696303356e-02
9.237411047255682933e-03 6.749937640334802667e-03 3.771274263344648880e-01 4.131820726314918701e-01 9.955904825936984226e-01 6.999605495848129078e-01 2.939456635642949123e-01 1.220074080059956462e-01 1.865184977262695498e-01 2.377732737426083987e-01 2.217516503018444191e-02 2.585705036546049468e-02 3.432079659811203276e-02 6.759190166960821200e-02 3.507594861716099022e-01 2.680664581539914798e-02 1.452718561828699080e-02 2.356053417062362737e-02 2.328013746473279327e-02 3.141744013251093759e-02 4.488447414631267091e-02 4.187130727331498381e-01 6.809594533355024792e-02 1.184062057394957568e-01 4.816288268722834220e-01 7.509213594084623855e-02 3.743240473046859779e-02 3.856279156589583618e-02 3.999565173858985606e-02 3.455466765641834054e-02
5.147400730702765548e-03 3.761346914940506547e-01 4.973299640367841445e-01 9.580513551502602976e-01 5.589096248115346111e-01 2.559210266367774600e-01 1.186401712673311876e-01 8.471181479011338777e-02 2.778861030211524641e-01 1.052584433408639386e+00 7.315933223147789988e-02 2.711963410695777954e-02 4.146562701560994879e-02 7.949206926702474807e-02 3.392154610115721836e-01 5.630541337398902169e-01 3.286242724671719073e-01 1.408396372304392408e-01 1.968639006851396200e-01 3.329939528599341614e-01 5.868202932847415010e-01 1.393580179311327549e-01 7.322456807929732248e-02 3.551191996378248450e-01 8.128728341125227574e-01 2.518204639913687037e-01 4.176743445765534329e-02 6.210998644751368480e-02 3.288878340314888571e-01 5.535658693304137262e-02
7.574044363844136506e-03 8.612187840620837420e-01 4.905949237708173150e-01 3.881830403665973428e-01 3.817461951823013511e-01 1.429763937257664264e-01 9.577477927172990679e-02 1.009562143432206766e-01 1.177815472306055072e-01 4.607248937086877993e-01 1.360219598107131611e-01 1.412105054912609903e-01 1.181521155286320846e-01 1.320852332718557010e-01 3.544416865983675557e-01 2.335796149059422844e-01 1.457756882402135856e-01 8.036005501464921208e-02 6.694662039736551384e-02 4.976386430597288385e-02 4.004921061352705730e-02 5.897941664522640681e-02 9.144244403897505702e-02 2.196158099685892873e-01 3.768461639878298852e-01 1.699185716838395033e-01 2.487675562529666484e-01 1.686401899231995682e-01 1.720181834081533356e-01 1.121578055806217444e-01
8.504652603837759006e-03 7.504948793332494317e-01 4.787640198839159811e-01 7.000182323838195497e-01 6.222312136534329241e-01 3.419994606733458009e-01 3.525089509011425804e-03 9.807865318010641209e-01 1.564243680594613051e-01 1.117824791646099269e-01 4.268834523494779293e-02 1.057536481576286519e-01 2.783088561209980938e-01 2.794190435413825280e-01 8.096536680496223548e-01 5.714636757189429650e-01 1.636968136982033251e-01 1.738371182268552140e-01 7.561558493590120333e-02 3.295097944893515818e-02 3.213443308634851558e-02 5.049975269428322311e-02 7.740623494934449622e-02 2.375747756947562961e-01 2.410680068241198848e-01 5.698968824265467775e-02 6.269205228155723397e-02 7.934709105221825209e-02 2.551946887340574288e-01 5.163636327314673202e-02
5.767236878042931135e-03 1.049087501117109376e-02 5.366767709108349882e-01 1.418529124889437651e-02 8.827231339134629720e-03 7.547150057391952167e-03 7.696441632171245086e-03 3.881551405587704284e-01 1.549874511443463665e-01 8.863438468275358639e-02 2.723158957369829075e-02 3.734442639295042221e-02 4.191517469952626973e-02 1.532606548489463261e-01 1.812361634893495388e-01 7.465786670369858880e-02 5.672265652007816433e-02 5.521518785041856781e-02 7.179141187990638329e-02 4.093691340133445017e-02 2.909754331519510615e-02 4.344965972536308368e-02 4.963721760705173264e-02 8.334343878412010798e-02 2.613796931333254303e-01 4.132917837217819218e-02 5.989751052304933404e-02 9.671221497680466961e-02 1.151720094228896041e-01 2.262467774000066489e-01
1.345981305092812993e-03 9.456628257210414334e-03 8.244100851636803062e-01 9.589076200799140359e-01 9.046868196778523608e-03 4.600868879944998088e-03 4.762050217575530819e-03 2.657278631641492028e-01 2.064256051433575601e-01 1.929373505775695274e-01 7.960281980022258785e-02 4.123268817056278263e-02 2.650641799522749156e-02 4.204594045616322218e-02 1.908865805060134813e-01 4.889357109405942370e-02 1.239583112951486848e-01 1.122653699197273709e-02 1.852155703280898569e-02 1.563832779139266715e-01 4.047887154690454209e-02 5.674340993677455536e-02 4.950201411097733539e-02 5.473472485145972760e-02 7.298027319968940219e-02 5.611552684438338157e-02 6.598107250096506282e-02 8.017272459470345392e-02 1.064495158555184562e-01 2.584138576210747162e-01
