2.285742692750119404e-02 3.421810249053839487e-02 2.987972678174018182e-02 3.778886997060441899e-02 2.881356364455291141e-02 6.342439642651725995e-02 6.330376492928720122e-02 1.723962723453972001e-01 3.140306369067695225e-01 1.398694951241609696e-01 6.396726665297580716e-02 1.446939854235155393e-02 8.489690540811473118e-03 3.191069633441701719e-02 3.730372043657730757e-02 8.207199410632397968e-03 2.895789248534295923e-02 5.093047819944798021e-02 4.626568195515388254e-02 1.631623869064556531e-02 1.383923013739414391e-02 6.405471034650493667e-02 5.013625106382127439e-02 5.965634831755547290e-03 1.102774711860802712e-02 8.781010386443749080e-03 4.133956627931903785e-03 1.394640342581991883e-02 1.362705637232947305e-02 1.722130252767918590e-02
1.850224685277626624e-02 4.191838013863008472e-02 7.530366197728943778e-02 6.174615299841667432e-02 4.303759004777095443e-02 1.927754201116472499e-01 9.176396364654026971e-02 1.169005262100263620e-01 7.667374809953521331e-02 6.460718709817277194e-02 4.459054057022451834e-02 8.569809001833907439e-03 1.135657789505032690e-02 2.606820827596662352e-02 3.660354994780312676e-02 2.349177435575224362e-02 2.913174962128831785e-02 9.586599119835258198e-02 7.265401298589237167e-02 2.188886901941696980e-02 8.221989982908387354e-03 6.091557103982443017e-02 4.306231373462659009e-03 3.444164249511133969e-03 2.774503035876792201e-03 3.749222476526764634e-03 5.324703142000301870e-02 1.417478778054121619e-02 2.064135742125915163e-02 2.069310634992894624e-02
2.287104216655737599e-01 2.375927040629990383e-01 5.028394324570157892e-01 4.099504543846879678e-01 8.674507044064414529e-01 8.822844947481561784e-02 1.637985745563913520e-02 1.772269451143226870e-02 2.867760283291823087e-01 8.656229175382434970e-02 2.264160722473952392e-01 1.471290657012400138e-01 5.386423511601062808e-02 7.889622310057742283e-02 1.517178933377931471e-02 6.379405805811756702e-02 4.302791332984730321e-02 8.859283552036133214e-02 2.964206398007597776e-01 4.941121559623420922e-02 4.835620807510669986e-03 4.985344180247722190e-02 7.902754498646831494e-02 2.807887762228915979e-02 1.733358046787636386e-02 1.202595856568088387e-02 1.116239220889052135e-02 8.952892764931590780e-03 1.529584035146101285e-02 1.716028809035315822e-02
1.073039714077390072e-01 3.139055074791473610e-01 6.898268652525884059e-01 5.581243445794428215e-01 2.265527030867192648e-01 3.486761272283020463e-02 2.743686693019935230e-02 1.859200832419817540e-02 1.146490321272404869e-02 1.068510958882419593e-01 6.733601535534199101e-02 1.303839161586257955e-01 5.867415131161728137e-02 3.904427355197929994e-02 1.154281356752129804e-02 8.804290533950820397e-03 1.845426666275138544e-02 3.465518512951097641e-02 2.458406243636771307e-02 2.099256304595002731e-02 9.497446009214276577e-03 3.390818192596118611e-03 3.568229852171769800e-02 7.240971980709140499e-02 1.437312554712406355e-02 1.095786575642307414e-02 9.639287608333055660e-03 9.152742920826201917e-03 1.859471088152330615e-02 2.020543637030014494e-02
6.213771842845686871e-02 1.968346247322766973e-01 5.506272635282403183e-01 2.133587794920100422e-01 1.203295410507387309e-01 1.745137875222363757e-02 2.664289777415199470e-02 1.481545956481471367e-02 6.935579941292605369e-03 2.412874567754236255e-01 2.991787828511149328e-01 2.466577348052017560e-01 3.605764648486753376e-02 3.293837763178740496e-02 1.563324466883288591e-02 5.914249205481999366e-03 5.619159463613418448e-02 3.239783382095602626e-02 5.211034061063152256e-02 3.002666273380068251e-02 2.065771778692787955e-02 5.765872802652724678e-03 1.333662366955307155e-02 3.860918330962643651e-03 2.621855909101247425e-02 1.460154772605438446e-02 1.031148742719065724e-02 1.193521171282475174e-02 1.868414806098252570e-02 6.874233240024436864e-02
6.214941265910395307e-02 6.630802815138958639e-02 2.977169760929003206e-01 2.386054815386543237e-01 9.379747088610755623e-02 1.003467537324389744e-02 1.219674030606330249e-02 1.302793662195800804e-02 1.230653417489069312e-02 3.705215097875949604e-01 2.868603506361098177e-01 1.460869730561808466e-01 1.865103152043936369e-02 6.856918767874572995e-03 6.234070940083617091e-02 8.160453622381371938e-03 3.428056351403155344e-02 8.451088970369866754e-03 2.741392135500056448e-02 9.509076295937450574e-02 1.156881778623879420e-01 7.045768490481435498e-02 1.913398340673726911e-02 7.088955882845410228e-02 3.951521503277420633e-02 3.809388850676294347e-02 2.394188529999270384e-02 1.651742859637183106e-02 2.178751363923551315e-02 3.922050527030856992e-02
8.585437977752775895e-03 1.385804452179721820e-02 1.469566173146679214e-02 7.466436589450717309e-02 3.580086869495973517e-02 5.933780313354951319e-02 8.965718181065945869e-02 5.091985939030550801e-02 6.063572623508619447e-02 6.992955678911240425e-02 5.303205938144834458e-02 2.124013264501651427e-02 1.013546117790482468e-02 5.357507409412944066e-02 3.200651367749762777e-02 5.634097670940603486e-02 1.972056048542743939e-02 8.886159760151763828e-03 4.557637316626556023e-02 6.275679076115636690e-02 2.899828448880924572e-02 7.691716756075264380e-03 7.039943843410906288e-02 6.786043692809125283e-02 2.745867747046170509e-02 2.820473455079515815e-02 2.477567153903809799e-02 2.140166261910245171e-02 2.391096590631613603e-02 5.701756680629227469e-02
1.779544083995047293e-02 3.315147088757935956e-02 1.954935359932638561e-02 4.246586920988951880e-02 6.587912708728554945e-02 7.448167621364831792e-02 6.598271615199061135e-02 6.221067910239209964e-02 4.949954969642632319e-02 2.740502469518080880e-02 1.087553297695639277e-02 3.317655035564395088e-02 8.330644995696448799e-03 3.506839837343590088e-02 4.043399537846277536e-02 5.536351397113147173e-03 3.865821516861096124e-02 5.940045590948292431e-02 5.251134278721690529e-02 3.886289221612448941e-02 1.210632296240988018e-02 7.654330434522104917e-03 4.952988293582742674e-02 4.294045284410497737e-02 2.059044833868356808e-02 2.079811121218502756e-02 3.104961140204186981e-02 3.612527707802413307e-02 3.514467124258700143e-02 4.167230692545645897e-03
4.620140958315176183e-02 3.066758206487978089e-02 1.804306511510167868e-02 1.057203412263215681e-01 6.920611479630224550e-02 2.951684509613369117e-02 9.499785509466986133e-02 4.279226768252764740e-02 3.589873886270451842e-02 3.508951993701809463e-02 3.102515483043225691e-02 4.028660619891218791e-02 9.030656099845640883e-02 6.222512363629752186e-02 9.297553377628485841e-03 8.310073959481341019e-03 3.483114109606244568e-02 1.073508533192481240e-01 1.064584829444445158e-01 1.956218846094593192e-02 5.373282908281841463e-02 5.613450600261098156e-02 6.177222931498554948e-02 4.122626105638435567e-02 2.430984400579448701e-02 3.371185337831995865e-02 4.318358615878696571e-03 8.235824850097972147e-03 2.465927854560303820e-02 1.259150217132024713e-02
7.905793436067887203e-02 5.190850838137235634e-02 8.132436381834305672e-02 7.601467370086828490e-02 6.641633792042078710e-02 1.317259179782921327e-02 6.075823613471186685e-02 2.698547643191381851e-02 1.139566478689782447e-02 5.611685469228569478e-02 5.978425127770333608e-02 5.806591948993151953e-02 1.228661531081123859e-01 1.325460230438852693e-01 6.280787180353618326e-02 6.924071876924400848e-02 3.756854176687587366e-01 3.927770362647096114e-01 1.577355218342966492e-01 8.135606197529263173e-02 6.876124274201791953e-02 4.358798937895544401e-02 4.957120579660505288e-02 5.421626492928734165e-02 3.036598714803307592e-02 3.678080539443244479e-02 1.421103153049489871e-02 2.233438609580447320e-02 2.877232979760999815e-02 7.650724861078238466e-03
6.662214604585961486e-02 3.532648521834212685e-02 7.748297666146584939e-02 6.574793123814429152e-02 8.209991513497001681e-02 8.628406564350050989e-03 8.163007439821739694e-03 7.608421336250069215e-03 5.534987755737048182e-02 3.298254732433301278e-02 4.791131469664811071e-01 8.012260767022757468e-01 1.658275203811111931e+00 8.146430205818954162e-01 1.494723321308253083e-01 2.944621937339734208e-01 5.521712579293928114e-01 1.530016279175543670e-01 3.634593635635832709e-02 8.641918033482381967e-03 4.690593148207364282e-02 4.202546380073764187e-02 5.243239059368946103e-02 7.132833337844000920e-02 7.572676633282093839e-02 4.144514009876636151e-02 6.570286857258358926e-02 5.009034499331769391e-02 4.614516222033149262e-02 3.429960720450771910e-02
1.401827601679706513e-02 8.229857377511988828e-03 6.377433020992417934e-02 6.263552219736570614e-02 4.802166478103746944e-02 1.258026076128951343e-02 6.729041179856826149e-02 4.746729332442144178e-02 5.764647104304021497e-02 6.493187372592680584e-02 1.458610332871841664e-01 9.665306003709199789e-01 1.737478919622104989e+00 8.956633047548077098e-01 3.205273984694957945e-01 3.611061822617552264e-01 3.993802842261862107e-01 2.349670780606541443e-01 5.745922860836762125e-02 1.851690978917285013e-02 4.527431958351580549e-02 4.618931011537150133e-02 5.239129295842658712e-02 9.361048903368142729e-03 7.238609207714449822e-03 6.369249068076551779e-02 5.147577500530833849e-02 4.749643662812305656e-02 5.236196759450055527e-02 5.777850532841190268e-02
3.602198742873487236e-02 8.475542211354741839e-03 1.487601230492606973e-02 4.416870570214078556e-02 2.861074019884924519e-02 1.040153041868054767e-02 5.949534017485685888e-03 6.163041374786078219e-02 5.592806967766577458e-03 3.222839927167242546e-02 1.022810098065472795e-02 3.084684308705217815e-01 1.302126136237051535e+00 5.559347756672885499e-01 1.738526047052071921e-01 2.006725583579671568e-01 7.396433440628885636e-02 1.082315620982674392e-01 1.227749574917331166e-01 4.884490984067306474e-02 4.360172278198810175e-02 4.751674844411154369e-02 5.737780506414502657e-02 7.384377334994257289e-03 8.355900925023829542e-03 8.588561557660521692e-03 7.036420897352423098e-03 7.231164757011502089e-03 6.808670649212333892e-02 5.735592391942239548e-02
3.161349127347414661e-02 1.078054664471840389e-02 1.163799074748887025e-02 7.712976186130681908e-03 5.368489581825211521e-02 1.807392827088064730e-02 6.112593760741347193e-02 5.035616919728744950e-02 6.589272866767807019e-03 3.599874574696462770e-02 7.592992564614459150e-03 5.057206602899209230e-02 5.991792525286696591e-01 8.063192211549785604e-01 8.557480810889723788e-01 1.152566965503254881e+00 1.034629572987955992e+00 6.708813622546596633e-01 1.830381272046492924e+00 8.520149442431347309e-01 7.341907361237215435e-02 2.313931870650492648e-02 1.721717239798701421e-02 4.093123510620337580e-02 8.880447200953008047e-02 8.382134177151215337e-02 2.301576237686787652e-01 8.093195325154153852e-02 9.527541427667854737e-03 9.864738440120455337e-03
3.002226668523252928e-02 2.854065338101963167e-02 8.423320820199533057e-03 5.139077541353972989e-02 1.677795857114066855e-02 4.489920332591976204e-02 3.942276057714057258e-02 1.089499016785493574e-01 7.473765725402178872e-02 7.586687355648082977e-03 1.603296895232194166e-02 2.517289483633616265e-01 5.379122596849594817e-01 6.799832837435659805e-01 6.117890350604944238e-01 7.373244882813712042e-01 1.257486533842108178e+00 2.174306750724863235e+00 2.212541111049888265e+00 1.733552994582227669e+00 7.391574339130482785e-02 7.716452060706301130e-02 6.933559923978030448e-02 2.181839368101375909e-01 3.154303230845083572e-01 1.622636265204659312e+00 1.626187791124121595e+00 3.255779471552558424e-01 1.040519250213978522e-02 7.359234937498562723e-02
2.836200341383425527e-02 2.973752506514910215e-02 5.840890155872176248e-02 6.060969830478037806e-02 3.991923209609108542e-02 4.820519448820340808e-02 2.160685172245673663e-02 5.865690903153354674e-02 1.217502783176255682e-01 4.304544953186194289e-02 4.425102746011201627e-02 3.905157850655256724e-02 3.057106033637193576e-01 6.156002787912822072e-01 5.709239043379616962e-01 8.716814160907502274e-01 1.511467296073936595e+00 1.839568728044645773e+00 1.063484038050943603e+00 2.317254402743418318e-01 1.398671219976528046e-01 9.681213092539862064e-01 1.426560476923711906e+00 2.395341108620061110e+00 2.259330735032496484e+00 2.969113539355079379e+00 2.391495289776272237e+00 6.802049423977204468e-01 1.658511424329142322e-02 8.561376767108444530e-02
3.666244301613537371e-02 4.142602664214097008e-02 3.907178139589944504e-02 3.573681375687688677e-02 5.264328600780029954e-02 6.510480291765676636e-03 3.428681586091059663e-01 1.144274811391484015e+00 5.589427866508530629e-01 9.488269524585291048e-02 7.008951977789830423e-02 1.100820850388624650e-01 2.185620088857888610e-01 3.204403601362982856e-01 4.215650982122344237e-01 7.542731429295060908e-01 1.627456433154676585e+00 1.637554925826222973e+00 7.755287137173199064e-01 2.670490001107241884e-01 1.164024860814035556e+00 2.136995090223001714e+00 2.772251361674161085e+00 2.843739071477358049e+00 2.511361641781350240e+00 2.193151271195627583e+00 3.288033820845441824e+00 5.693413105098125149e-01 2.159530278899728789e-02 9.471131297166646146e-03
9.224384393711942964e-02 7.151455304522538747e-02 3.448289509991445123e-02 4.892455708368136091e-02 3.711702378398704094e-02 1.706972539238003073e-01 9.384124906291866353e-01 7.707174108795042944e-01 7.580482759446782737e-01 3.754584887995283671e-01 1.365893748526441631e-01 3.699910764172203298e-02 3.623572813532260906e-02 9.237503154110013326e-02 2.078132777898791250e-01 9.538835551673938706e-01 1.000487945261163247e+00 1.161926950829605731e+00 2.026354202943954630e-01 3.598561440856622440e-01 1.292124917197834622e+00 2.828589029891964923e+00 3.522654501956066220e+00 3.641917603737709452e+00 3.016385142565519928e+00 2.967623545393502038e+00 2.832299636375826157e+00 2.215491650982726046e+00 9.728369520047606966e-02 6.327731908741816846e-02
3.703013923939985075e-02 1.084288240317197484e-02 1.272812031383137310e-02 6.393407432686248892e-02 1.373737812694655891e-01 1.924596672566943334e-01 6.074456910646486296e-01 7.606763071388845665e-01 5.208021796696048478e-01 4.017465897011044396e-01 8.381293378199111688e-02 8.242501740304594704e-03 1.255169486659050287e-02 3.533870929662533134e-02 7.702551014887225322e-02 4.548454507561299209e-01 1.722631098936873439e-01 5.455686968034504508e-02 1.824714665319703694e-02 1.329687242828706539e-01 5.100865367476601353e-01 2.733787961339784189e+00 3.474172464952745454e+00 3.636218836600662918e+00 2.669633224654826442e+00 1.258012354618238238e+00 2.083679991934101139e+00 1.411268555495183374e+00 1.262855078434434175e-01 4.893713757177189927e-02
4.463354223407275251e-02 5.719567725496406407e-02 3.693106408490635928e-02 4.618532471908085024e-02 1.093323848870273729e-01 6.291210029961090411e-02 3.227672613767564869e-01 4.162865780390866410e-01 3.816205029951872385e-01 8.940277199722621027e-02 2.239348241939285999e-02 4.753814351818587587e-03 8.586560531200059659e-03 2.536230680043303348e-02 1.009893525986794993e-01 6.721354704640453148e-02 1.212455585624683529e-01 3.541728543771235915e-02 6.616587251833322414e-02 3.143303255716373146e-01 1.697010895872672398e+00 3.208650539676964897e+00 3.436199283402100235e+00 3.266128059189146171e+00 2.525009274111241098e+00 1.871142746022449010e+00 1.837028398500243576e+00 1.223731915776067325e+00 1.094038961712040514e-01 3.835898228268082993e-02
1.240597703630421378e-01 1.130885927408716851e-01 5.833790642843180579e-02 4.224894227706114253e-02 5.521237166229194665e-02 2.954512670807976638e-02 1.668451715881067721e-01 1.483116444756051866e-01 4.082087131537580349e-02 2.268350883268338558e-02 7.889810283630298640e-03 6.250829724244337526e-03 3.804358803288561408e-03 4.909578770484285259e-02 5.806419980925530203e-03 1.993203544779558606e-02 7.046961086990290168e-02 1.585610799875450116e-01 1.510218656225931488e-01 6.699643655029557943e-01 1.815795180176216439e+00 2.601920106348916129e+00 1.046800437164574049e+00 1.570883252241845884e+00 2.040984362720978051e+00 1.164564834315477526e+00 8.744111909320531062e-01 7.213284977190469460e-01 3.044411258004084755e-02 2.825388813532299370e-02
1.005565857883762432e-01 1.156230170829651849e-01 1.715428327312755463e-02 1.198657453666122225e-02 9.954022955074286888e-03 1.478996140735659368e-02 2.114053110993698720e-02 5.336033360120277791e-03 7.043806693377159187e-03 3.483620849413793935e-02 4.820609299269073417e-02 2.372714220633674684e-03 2.578031162044765352e-03 9.539321629859962709e-03 2.800990081257676706e-02 3.732214008650827086e-01 7.098046100998632868e-01 1.014473596140163858e+00 6.855318975449297136e-01 5.090854403163527220e-01 3.543427581598997400e-01 1.242937177449591757e-01 4.747982919327968510e-02 1.031581488082446707e-01 3.749010728646554047e-01 1.268767432668007067e-01 1.161118888414759825e-01 4.656957608152771655e-02 4.945022138150657887e-02 4.652452033305382734e-02
2.100600762480022421e-01 1.630635807658353253e-01 1.752047680882062169e-02 7.663174937849511620e-03 1.148421505676054319e-02 8.932175324143250966e-03 1.401304856741857063e-02 5.129012401907660779e-02 4.798808983502748926e-02 2.096037884363916720e-02 4.896105410346757170e-02 2.745150730914921924e-03 3.361496297491765005e-03 1.891483695699532758e-02 3.264593787242262013e-02 2.145542580354789231e-01 7.804827840330483824e-01 1.443040829519899537e+00 1.622179266169742506e+00 1.387360992619703692e+00 2.884208959092713354e-01 6.300828261512193829e-02 7.727443224056085302e-02 1.918574224629556180e-01 4.279882438810331813e-01 1.264235377650463343e-01 4.769936564214686398e-02 2.236061712410288699e-02 6.762309293756568751e-02 6.565924544740738000e-02
2.673857676708899511e-01 3.447576667988090648e-02 9.272336981275204268e-03 3.079278911653916383e-03 3.610806552316409013e-03 7.902849153567252649e-03 1.036969639412160110e-02 4.183197766235885462e-02 2.384330200674497635e-02 2.741041558648216539e-02 4.764367514978593704e-02 2.655342283815077982e-03 2.739566714217237138e-03 1.527552502035947612e-02 5.914911280420571960e-02 2.984760807111552783e-01 5.770026575318101258e-01 1.324185831040765260e+00 1.666530799647385930e+00 1.401858750289854294e+00 6.870259819139996615e-01 3.891495502701065173e-02 2.740315850264001679e-02 6.010136602951336032e-02 3.475483357343256974e-01 2.109389324051144099e-01 1.888658975186904010e-01 4.306596745353911959e-02 5.378625721871998361e-02 4.906111247069143422e-02
1.519632997747670800e-01 4.739476962927263726e-02 1.773992581510970556e-02 1.662116583096086286e-02 3.859815574405262711e-02 2.635282545007469959e-02 1.079388965780760275e-02 4.376419324616073053e-03 6.550574286566598556e-03 8.804235543921221097e-03 2.891660195021016760e-02 3.345121250713370409e-02 4.277600430796304337e-02 3.722898360215848561e-03 2.113432251566940701e-02 8.994757800573874307e-02 9.080821570464525649e-02 3.887400410998476108e-01 5.018739863697616599e-01 4.335834552376431339e-01 3.607921067688183436e-01 4.615656850763406871e-02 7.088626824845716684e-03 1.406144383013336469e-02 6.255775655290002346e-02 1.587374159372397786e-01 4.259800734100458453e-01 2.569784572068194439e-01 5.995543959894997221e-02 5.267036330155974722e-02
5.454531297328145401e-02 2.179928397193381384e-02 2.250989820432673649e-02 3.804832429380412828e-02 2.176522211861039655e-02 9.718833569539278225e-03 4.361089685299839730e-03 2.998553208879661553e-03 9.398657256505408425e-03 3.674200503661549655e-02 2.727379678621136543e-03 3.205391442137702634e-02 4.717928011161207080e-02 3.852829644815669932e-03 1.709323340097722993e-02 3.189389444991400785e-02 2.201307986384867799e-02 1.099721052764127127e-02 1.899616000223232001e-02 3.758886690571701383e-02 7.465091844589881453e-02 1.614391122735694614e-02 7.820147836228769772e-03 3.631759867347589266e-02 8.887881951682380377e-02 3.198882984593130058e-02 1.106943722139502595e-01 1.280372993384470692e-01 5.949749686093415424e-02 7.493984144051385465e-02
5.530744289888051002e-02 4.467140388135984463e-02 2.106323921131239910e-02 1.544139318804612152e-02 1.502771332672234172e-02 5.613381846212473977e-03 3.631800373937095830e-03 3.650384815459523265e-03 3.992702701252472640e-03 1.630217853099092534e-02 4.784629824349335633e-03 4.927602661193169337e-03 4.595578531571262171e-03 5.843693062343103400e-03 1.685621431244884241e-02 1.235657632242153151e-02 8.684769773917445923e-03 5.421920007550515980e-03 6.584760411268592364e-03 7.128456922162215714e-02 5.806971116042421166e-02 7.864558984459525670e-02 1.218589162526381893e-02 2.101578634518579472e-02 4.086313637765848911e-02 2.272085611112681369e-02 3.657359618668893503e-02 2.269422029941671470e-02 2.531181537335692316e-02 1.638055723289499194e-02
7.519111249566226562e-02 3.941888526420327110e-02 2.165445431637906537e-02 2.955307576280336024e-02 2.721065597626716459e-02 1.472529849206359598e-02 4.925740980719421624e-02 3.658684092383435865e-02 5.345139647327366676e-03 4.072800774185430725e-03 5.201975293201337169e-02 3.772284748047635000e-03 1.089918501674844858e-02 1.222161636959842416e-02 3.798829729188880205e-02 3.004631572583759888e-02 9.909796351998371652e-03 1.232884883106280527e-02 7.759369928866915143e-03 4.738744309452910808e-02 4.673642312612352051e-02 6.901415095172376557e-02 1.508487342699568745e-02 2.735129596773543115e-02 2.795285737262483139e-02 6.416963964069019588e-02 7.401331292072367563e-02 1.240277200603258356e-02 3.062272787188173584e-02 5.537760448069425218e-02
1.009389339898020821e-01 8.790613696506899277e-02 2.580836872988513317e-02 8.830536662530322212e-02 1.076703102985641231e-01 2.029913039422380772e-01 1.337058004606540562e-01 1.490315283796876319e-02 5.309343019853765555e-03 3.227676033786893058e-03 3.486896104384144129e-02 4.094568640448460750e-02 4.356047433917217826e-02 7.934284078913167448e-03 1.069453622635697931e-02 4.667911210731124673e-03 4.693436863216871729e-03 5.487305523805692878e-03 9.102351501702434650e-03 8.683915607828180533e-03 4.207497097336869440e-02 6.107082276723077574e-02 6.406613750995583667e-02 1.526237596032907484e-02 4.302180664419229250e-02 4.793570724250232479e-02 7.013454938071300715e-02 1.960031503061548247e-02 1.374706994312858629e-02 2.710288482656345033e-02
5.383276138346895778e-02 1.354890296218174695e-01 3.977760473110297096e-02 4.324211173291442334e-02 2.190116370162818182e-01 2.341404230002692710e-01 1.556914173597456486e-01 1.068335893694270962e-02 7.524159575178593004e-03 7.264813951717540019e-03 3.591721660520814235e-03 5.491142732463855092e-02 3.133660738074658253e-02 4.555461035667249942e-02 1.202755225705340325e-02 5.562521426530729618e-02 1.235813123889070372e-02 7.251244101978919498e-02 1.357291843759744765e-01 2.997228707576747586e-02 5.946829230584183695e-02 8.251410931249839043e-02 6.866327023202076218e-02 6.683448402607419792e-02 1.256923505578033326e-02 6.816526109692391810e-02 8.004753160226035780e-02 1.656949889339062038e-02 1.243895074338883036e-02 3.011740535820766479e-02
