3.605443526125246478e+01 5.437523047806308796e+01 4.694218858436767050e+01 5.893877715024123631e+01 4.430879343447972474e+01 9.740812858897314186e+01 9.722877307047576778e+01 2.653291302282860897e+02 4.887032832166362368e+02 2.210726354175058646e+02 1.040672979757828358e+02 2.402048240675247825e+01 1.442451621223001723e+01 5.662979940961140102e+01 7.000085956944022314e+01 1.646522751770351789e+01 6.294101137577210636e+01 1.203021693815670687e+02 1.200614891687947647e+02 4.610796292338201141e+01 3.742443219410724708e+01 5.495538997721589602e+00 4.324091237017084310e+00 1.755445768713804000e+01 3.486825408021022099e+01 2.817063788501171473e+01 1.347972209820379064e+01 1.211819984745130752e+00 1.176245951765377384e+00 1.510718184346581783e+00
2.689896590382043229e+01 6.106107916081092668e+01 1.095831620522993290e+02 8.856587252551325662e+01 6.135133416172446630e+01 2.766204135043501537e+02 1.340436063337116650e+02 1.701544146708692722e+02 1.137241389776177414e+02 9.844071197470972834e+01 7.215717733021297420e+01 1.455972873700070203e+01 2.005357807884571741e+01 4.797712929502634438e+01 7.029397627766370249e+01 4.794962875949029524e+01 6.446306081120715703e+01 2.316400698222869039e+02 1.941538086446590796e+02 6.439606765562234614e+01 2.346895880677220703e+01 5.390946502981402766e+00 1.160537264776230160e+01 1.059297211935363237e+01 9.683072527120469175e+00 1.354105761684347087e+01 5.051216163425766403e+00 1.291776879152627400e+00 1.826028368224194010e+00 1.824111081517397093e+00
3.153088787490250979e+02 3.292441397710405226e+02 6.970644696749532159e+02 5.622685054655946715e+02 1.202285197976224936e+03 1.239176018757368212e+02 2.378696375557910869e+01 2.606384547142244656e+01 4.360337203090349476e+02 1.360372454617357505e+02 3.799478355309066728e+02 2.646956981742797552e+02 1.018227855041643437e+02 1.550381041059480651e+02 3.082458732593975270e+01 1.364665136599451500e+02 9.940526824999932387e+01 2.251771677063509287e+02 8.390479285910225826e+02 1.552547558981781322e+02 1.534245378198932208e+01 4.609173511446286398e+00 7.304471096026976085e+00 2.672455501322925642e+00 1.684295152054812839e+00 1.191009591452489191e+00 1.137968453115084211e+00 8.590755823677147518e-01 1.400767684148850556e+00 1.529467512423208442e+00
1.504520268748381682e+02 4.423095913800275412e+02 9.717862109191335094e+02 7.785684849745421161e+02 3.227024013371467959e+02 5.018579156371214367e+01 4.050263894069705373e+01 2.735939728537575277e+01 1.704902415975104546e+01 1.610165822647849154e+02 1.054679732478274730e+02 2.165722836373899440e+02 1.020662020041399529e+02 7.194150971911579973e+01 2.225952510693319653e+01 1.793447694675634807e+01 4.022177321675039963e+01 8.150168705946074965e+01 6.355824895464722601e+01 5.934717920393018176e+01 2.833130757050841453e+01 1.014432012347599077e+01 3.316290017710112004e+00 6.745521047401117798e+00 1.340470519318777365e+00 1.059413118919262153e+00 9.764467417141466932e-01 8.716351952966380212e-01 1.649412046058790438e+00 1.730692347457631231e+00
9.018254497371566458e+01 2.892932624750188211e+02 8.051306444555470989e+02 3.116733581463062706e+02 1.800134964962078357e+02 2.616300200412474908e+01 3.993032475488231370e+01 2.217568848662752146e+01 1.021201660437648684e+01 3.543234355572540153e+02 4.421292513999152334e+02 3.815514797545864667e+02 5.811842594680351226e+01 5.131329583924650706e+01 2.551507824603515218e+01 1.003161008214713767e+01 1.141189677114137169e+02 6.957344577543881314e+01 1.200799444808291412e+02 7.350203845751779852e+01 5.380807148659855699e+01 1.590682276963777397e+01 3.704209822897875881e+01 1.073018880173360756e+01 2.293335574725693604e+00 1.343064467977820531e+00 1.002122460369975654e+00 1.092288821662602771e+00 1.587863950456320561e+00 5.628911983591011747e+00
9.392810112652500720e+01 1.031199119140207188e+02 4.611287918384006161e+02 3.683661374117423293e+02 1.463911184443352056e+02 1.546530499337086084e+01 1.844446090682585648e+01 1.941775655308653725e+01 1.784505029521062980e+01 5.272049023224926714e+02 4.044608075815723964e+02 2.113768406567969578e+02 2.460152756398026241e+01 7.915504787010402055e+00 6.383214907083860190e+00 1.107661273831192617e+01 6.056075572871606738e+01 1.643374606582409925e+01 5.594045223080977536e+01 2.028499813774266443e+02 2.646669740974841716e+02 1.686241895100596082e+02 4.505311890950681430e+01 6.168919309217145042e+00 3.281908227402734468e+00 3.365784603374842199e+00 2.250930063669066339e+00 1.458253982420984585e+00 1.778393141195836247e+00 3.082512909757781028e+00
1.316005400496926292e+01 2.204817958111473075e+01 2.335810513302575941e+01 1.186749625178266854e+02 5.702251829690278839e+01 9.308600330471095674e+01 1.372495587107414963e+02 7.633181423601391202e+01 8.857068913397978349e+01 9.936635186966988442e+01 7.406587264256191361e+01 2.978347294203882711e+01 1.238489483897776822e+01 5.102808296864321136e+00 2.845131749492293416e+00 5.386502967918024076e+00 3.279916311454682898e+01 1.595375869068121233e+01 8.412942145602164601e+01 1.197786582200208159e+02 5.932061295463655171e+01 1.529214162976880687e+01 6.450822493732267127e+00 5.374624633146018127e+00 2.149921756211318868e+00 2.403959124065994768e+00 2.261578742905874684e+00 1.839853442486033108e+00 1.973593298357154247e+00 4.509541382890585481e+00
2.685117524866321403e+01 5.122040196543145640e+01 3.020182764503418582e+01 6.577327751946725698e+01 1.018815738614578521e+02 1.140972986426380515e+02 1.001004448485275020e+02 9.379797989445695805e+01 7.514412610569578987e+01 4.087286539418791165e+01 1.603031270195208435e+01 4.844227662877130314e+01 1.034870241955854908e+01 3.560584148313898023e+00 3.782349070439813499e+00 7.269547306021831190e+00 6.237556866594854199e+01 1.034902324130726043e+02 9.470918470005710788e+01 7.077912032194129210e+01 2.081568925362331868e+01 1.050884318249696747e+01 3.793997617438582104e+00 3.127737153107521095e+00 1.563244409135766455e+00 1.752604836685335510e+00 2.870941142569859661e+00 3.424166097027716127e+00 3.258080830291030683e+00 9.225963914975466196e+00
6.778899674308260614e+01 4.548899445714056355e+01 2.703092776169076572e+01 1.594825362294860724e+02 1.058167277894659719e+02 4.514379858056772576e+01 1.461788171480866367e+02 6.623662198995599226e+01 5.655359905700208856e+01 5.441224253133090372e+01 4.749885085365782800e+01 6.153788867433208054e+01 1.338739132967228898e+02 8.893901002249276644e+01 1.349624917970433913e+01 1.258795816682322410e+01 5.668487386952722318e+01 1.796498758380718641e+02 1.859245091726228338e+02 3.287980591621191451e+01 5.566233112058623256e+00 4.593729746713838047e+00 4.628601118998055597e+00 2.979049336270738202e+00 1.802426903805939951e+00 2.917510565226035801e+00 1.149620911965296521e+01 2.213415337396846283e+01 6.148253446584284632e+01 2.936668516163568299e+01
1.096611126352763819e+02 7.177825467418131211e+01 1.161484697242128306e+02 1.109181334435014179e+02 1.006851221357219117e+02 2.025557216460027377e+01 9.555819631932104130e+01 4.167906699941100612e+01 1.813240371831717113e+01 6.645947377296806735e+00 9.563520526476051486e+01 9.186065667127007828e+01 1.922696118202309208e+02 2.060390567102400894e+02 9.770833737605977376e+01 1.063582279811110141e+02 5.891370710673631947e+02 6.400788178336468945e+02 2.720369551386398825e+02 1.295754014558903577e+02 6.820241092015249862e+00 3.446470904124021573e+00 3.753010250479418719e+00 4.087546775959582490e+00 2.301654827700558847e+00 3.083340019155230038e+00 3.012754511435593940e+01 4.963434296047101668e+01 5.969470077045134815e+01 1.520556245901200043e+01
9.237414425533189899e+01 4.816456177634373148e+01 1.084493892840065996e+02 9.401634785481057577e+01 1.236241381573639728e+02 1.166257343396754820e+01 1.006500963628763756e+01 9.064393943491580785e+00 5.930839434176217395e+00 5.218521193923956503e+01 8.036388726304371630e+02 1.319345591568943291e+03 2.669908717182524015e+03 1.278116575995344647e+03 2.297123263588451891e+02 4.366300900243103342e+02 8.279906948911292375e+02 2.380289174471164984e+02 5.970909293767559944e+01 1.264194473440457855e+01 4.535005647363288261e+00 3.317699424043080825e+00 4.145320829309509847e+00 5.793068099498328571e+00 6.218503287289735226e+00 3.449926713177906112e+00 5.611849439080739188e+00 4.342947490458319848e+00 3.778216512507242442e+00 2.640759151485945644e+00
1.760896690756198524e+01 1.034434796370549314e+01 9.110713406082012966e+01 9.028083814811134289e+01 7.209097942269849568e+01 1.706116170333784865e+01 6.867926270714849402e+00 4.592675787524641784e+00 5.949707033890632601e+00 1.089851571605336602e+02 2.582670666445012557e+02 1.649969790696527525e+03 2.867647710635094882e+03 1.425336924025871440e+03 4.960728103972710414e+02 5.367909249012960800e+02 5.916635960483786221e+02 3.536870970528312910e+02 8.886063613401883288e+01 2.581332722037636529e+01 3.937726082732942778e+00 3.604931930264188455e+00 4.209245740072843134e+00 7.566339369773926293e+00 7.266706877161482225e+00 5.240623699936696411e+00 4.065951186589980004e+00 3.602547683320347360e+00 3.776602088272254854e+00 3.971519016650696621e+00
3.474703989606906962e+00 8.966606954444351629e+00 2.172841667416213340e+01 6.176820510564347444e+01 4.100079074146842117e+01 1.340725558832858866e+01 7.149763944076878985e+00 6.271038058536140269e+00 8.337147008860533504e+00 5.857908917011910432e+01 1.897425225960301987e+01 5.601987155928827633e+02 2.253861319164015185e+03 9.068456066624140703e+02 2.699882876022371647e+02 2.957890326804746337e+02 1.065650425597424942e+02 1.539438944361378390e+02 1.736407394281178824e+02 6.523061453154895162e+01 4.456669907317035495e+00 4.065378253135776276e+00 4.986330759073847929e+00 8.591540452750344059e+00 1.127314504043297028e+01 1.067357703963215343e+01 7.968707326428011051e+00 7.144164445360441817e+00 5.391468287878018906e+00 4.155187612959036159e+00
2.828863720749754229e+00 8.140960249414451511e+00 1.471543506987276118e+01 1.071930704159210457e+01 6.404729636799702419e+00 2.617418224565238916e+01 9.581422594418133087e+01 8.910122393620935100e+01 1.259300266555529646e+01 3.793016039628450464e+00 1.490369449291849335e+01 9.714428043123268708e+01 1.084915169799262230e+03 1.353033778091400563e+03 1.344948474668304016e+03 1.699092036188975726e+03 1.454432988632933075e+03 9.015115947684573712e+02 2.365789266665616196e+03 1.079497754781347112e+03 9.016945365904922483e+01 2.642320645640963050e+01 2.004474683090205644e+01 5.025264914667133098e+01 1.154701942683130369e+02 1.079791532102650535e+02 2.991818089222065851e+02 9.955527807187669964e+01 8.054042807345066279e+00 7.930541961040749044e+00
2.580512810317865835e+00 2.604601430941211326e+00 7.160462662892498997e+00 5.375835117633450722e+01 1.975042206811017564e+01 4.772150154069669803e+00 6.537115676060425074e+01 2.019906594614263327e+02 1.463879091714336766e+02 1.507943334462382978e+01 3.220906105440754175e+01 5.106976518179577624e+02 1.038533723655441463e+03 1.207598716484127408e+03 1.008222531401163678e+03 1.132019038181140786e+03 1.797667821633666790e+03 2.906137476100573167e+03 2.796449128072923486e+03 2.134889511314472657e+03 9.145410224858906645e+01 9.594048319580596740e+01 8.523614626937923333e+01 2.628911293166869427e+02 3.692700776575367172e+02 1.873135403900705796e+03 1.887474162288669959e+03 3.897551054182472399e+02 8.849212957100665022e+00 5.410532745032850421e+00
2.299054266871110030e+00 2.528475325015272279e+00 5.810483981961588995e+00 6.485657526263840289e+00 4.368166140448261459e+00 5.081465005247170375e+00 3.689057590354315153e+01 1.078221367021151877e+02 2.336836894215388440e+02 8.647638649419364754e+01 9.248574201217064683e+01 8.368354397357700236e+01 6.348614995003963486e+02 1.179226783565884034e+03 1.016167476477619175e+03 1.441692542395982400e+03 2.268077911852625675e+03 2.529308350220094781e+03 1.362480103673190570e+03 2.848246476756446555e+02 1.696759562160672203e+02 1.157526338839907339e+03 1.673365858366444172e+03 2.737215752703105863e+03 2.498099083754224466e+03 3.219168831406361278e+03 2.594645773924696186e+03 7.614313130133641607e+02 1.330639802954052797e+01 6.075937629475834711e+00
2.857822002548080498e+00 3.350690315287204069e+00 3.327833369229566962e+00 3.221397203700207434e+00 5.028268903820892533e+00 1.065127918756782321e+01 6.270627652857831436e+02 2.135948988422062030e+03 1.075432247292109196e+03 1.923531701724573679e+02 1.518685105613511723e+02 2.542076508902751755e+02 4.980472409874998903e+02 6.691092393053423848e+02 8.092867754884687201e+02 1.338982041384999320e+03 2.562887394880630382e+03 2.333802018845856310e+03 1.016536395544423840e+03 3.294159486454158241e+02 1.387330733238670291e+03 2.459735224385342008e+03 3.102246315584461627e+03 3.081570727668051404e+03 2.638200478200319139e+03 2.261057444683438916e+03 3.370383480454343953e+03 5.976442764298117254e+02 1.926717438518283032e+01 8.144061521898885658e+00
7.019117601231270598e+00 5.611528099038642026e+00 2.958339627623510992e+00 4.758838768543051323e+00 6.440170382868078036e+01 3.287250520422728641e+02 1.828831073398539957e+03 1.509576490245017794e+03 1.532319162218453812e+03 7.996733451238477528e+02 3.126588994781851625e+02 9.257207413387075690e+01 9.058168512488393276e+01 2.109676265047511095e+02 4.325800274850924438e+02 1.835952526624789016e+03 1.677834732887544533e+03 1.736601244629417579e+03 2.726722534736094872e+02 4.468307923688267920e+02 1.524774550235332299e+03 3.188707614895392453e+03 3.838136930955116895e+03 3.822926811960711348e+03 3.070707105090090408e+03 2.948217466405472805e+03 2.773993671213519519e+03 2.201098996809737400e+03 9.779804710970768156e+01 6.457267364635180229e+01
3.167334682385983591e+00 8.982422861324685925e+00 1.716171902076927225e+01 1.249687518444621617e+02 2.970465208224038633e+02 4.296579931233135881e+02 1.364957531376774796e+03 1.729067128701723277e+03 1.225328925070014975e+03 9.784958950409862837e+02 2.149383696941677044e+02 2.226974229031929653e+01 3.303719916365363218e+01 8.444699839612334813e+01 1.669453509423509274e+02 9.058417527851580644e+02 3.042760741483698439e+02 8.682709129525542835e+01 2.615633588529975384e+01 1.745728051011161597e+02 6.274666518636148567e+02 3.173375830031258374e+03 3.846285783337934845e+03 3.816771532078174459e+03 2.671214204706856435e+03 1.206314165245832783e+03 1.935964850553339147e+03 1.329582096909360644e+03 1.199667389937177120e+02 4.738911091735148062e+01
8.146233561922208821e+01 1.100440119925758609e+02 7.856508722938359313e+01 1.053591911065837792e+02 2.720874082197815369e+02 1.626012677014157930e+02 8.566463163225082553e+02 1.133954073330935444e+03 1.080280858346155810e+03 2.558506396117724648e+02 6.489591510000209951e+01 1.388258626680707408e+01 2.325306141719004316e+01 6.237587334200064504e+01 2.260686344379500383e+02 1.399722920948612739e+02 2.272129144494866750e+02 6.008329001101573397e+01 1.011493195868538209e+02 4.351119909865501540e+02 2.173179106591968775e+03 3.854177244111126129e+03 3.903578690688882034e+03 3.464038526789046500e+03 2.501410407975935414e+03 1.746378365679778199e+03 1.645335966901082884e+03 1.109140170260363448e+03 9.991412520908100703e+01 3.558480903442231380e+01
2.401616268315929688e+02 2.358794313677029209e+02 1.337757704553050644e+02 1.075250929374356161e+02 1.582595787583764775e+02 9.011776070101828395e+01 5.337373586931357750e+02 4.969057046430681339e+02 1.420234306277037035e+02 7.450047917083853122e+01 2.488791837138607477e+01 1.924550307397845117e+01 1.091625443264692130e+01 5.615776230411294812e+00 1.359874214093663269e+01 4.291835861044788203e+01 1.366945723537022559e+02 2.797205836418982585e+02 2.427993031160887085e+02 9.843390932545732994e+02 2.455994399043141129e+03 3.285724346673200671e+03 1.244414344920167423e+03 1.705422905956127579e+03 2.020750544314671060e+03 1.066176522051277288e+03 7.624788270285001772e+02 6.265221126733160872e+02 2.297465359813129737e+01 2.077432107954262364e+01
2.041274884628060704e+02 2.528011879510516167e+02 4.161222246616576825e+01 3.252946328258499165e+01 3.053303598745807790e+01 4.882614333853820199e+01 7.309903440440955080e+01 1.922145985358008247e+01 2.596224164402548240e+01 3.905346384958947148e+00 4.931487317797448533e+00 7.254545440488353591e+00 7.627004144478719994e+00 2.545708745116545302e+01 6.729502885067211082e+01 8.177136548187600056e+02 1.399891179823353923e+03 1.829757305526900382e+03 1.135953907083969170e+03 7.800554568818981807e+02 4.999702258885020001e+02 1.632960942153390533e+02 5.800033824346611766e+01 1.129129864346328418e+02 3.711654218715220281e+02 1.155782153617818437e+02 1.008549718324655373e+02 3.399056625319330749e+01 3.855363079757836431e+00 3.149769962936617596e+00
4.566065741516746357e+02 3.744030702697999686e+02 4.449426981266084624e+01 2.131125340981071759e+01 3.505537827263204065e+01 2.904772110059541745e+01 4.679895401554382772e+01 5.230496586857720231e+00 4.554623474461864774e+00 1.902324003407721786e+00 4.361054220831048767e+00 7.989386333889239467e+00 1.009961543888297086e+01 5.085426312923885916e+01 7.799287086208184405e+01 4.565862864990754133e+02 1.508040946465731395e+03 2.566081090139039588e+03 2.668839828072309047e+03 2.122836876518512327e+03 4.092178703774735027e+02 8.311887273921840347e+01 9.394966371170697528e+01 2.115445175561072233e+02 4.375011125259804885e+02 1.206213831712397564e+02 4.404028865624886180e+01 1.636617827093346733e+01 5.067338742839536891e+00 4.517770419016866157e+00
6.139294926095865321e+02 8.242856264689844181e+01 2.449267112847357097e+01 8.717120837556700863e+00 1.090844606959629814e+01 2.509470708330547595e+01 3.350727176689559172e+01 3.888736898612783932e+00 2.199587475851655149e+00 2.455360917273802457e+00 4.210241297491215562e+00 6.972688389417609045e+00 7.489066288982971997e+00 3.867359959779389555e+01 1.405938511439685783e+02 6.336646877785717606e+02 1.120576545623977609e+03 2.375369964960682410e+03 2.768038404812844419e+03 2.155704926224950214e+03 9.736699760010874343e+02 5.107373248815112987e+01 3.314384694115023677e+01 6.768631107506008959e+01 3.723743403931925968e+02 2.135278253864134967e+02 1.855224323770574983e+02 3.406402959690355203e+01 4.810130588852139510e+00 3.576073869946273298e+00
3.745996103303344853e+02 1.206683882483127093e+02 4.886488294382405684e+01 4.831057597194170228e+01 1.166814680387834926e+02 8.323318291291022319e+01 3.543776007899887759e+01 1.496336580642698344e+01 2.286804053888126020e+01 2.873165722062174510e+01 2.590500591918370343e+00 2.835450614902340849e+00 4.186604781862364177e+00 8.826308923632323555e+00 4.984106411787475110e+01 1.904413191129804943e+02 1.780356006960926436e+02 7.109314826871112700e+02 8.560382066367718608e+02 6.810099518493832420e+02 5.175542122249917156e+02 6.111353784253338972e+01 8.692351128448422060e+00 1.650846223111310351e+01 7.201287830093525599e+01 1.773369853298750058e+02 4.676127062840198505e+02 2.536017156361725711e+02 6.105854423884389703e+00 4.412007129624334389e+00
1.363572113514695729e+02 5.618668669717223452e+01 6.222302263132441169e+01 1.109408798689922691e+02 6.574477556505601683e+01 3.068134059428606264e+01 1.449103334402668253e+01 1.048853486600102869e+01 3.383312311857167032e+01 1.262822095722288793e+02 8.312912473851861606e+00 2.783898742695630535e+00 4.455317577076831626e+00 9.090027499789341547e+00 4.029195011553294137e+01 6.777015356814185054e+01 4.374254095820990074e+01 2.047217830587718268e+01 3.063688588889420572e+01 5.244766718187374721e+01 8.628971611391524732e+01 1.838536471561739916e+01 8.935176697719903416e+00 4.477931060464442936e+01 1.080295866328949757e+02 3.795116086185458926e+01 1.286750608969664427e+02 1.383261899718744417e+02 4.745752536992181092e+01 6.977591296411263855e+00
1.383162968298973965e+02 1.152998793659371444e+02 5.825605263463447869e+01 4.521182402904364750e+01 4.567312332310798695e+01 1.784261122208639705e+01 1.210591537379279359e+01 1.277721147895707254e+01 1.436630518685717739e+01 5.527123132416853224e+01 1.507997044166637224e+01 1.389761305123739632e+01 1.240965003928316079e+01 1.438904360313999575e+01 3.902595947854718617e+01 2.579893769123464153e+01 1.701747141148873865e+01 9.975987422947717675e+00 8.621664498369828067e+00 6.456445635815103223e+00 4.969084650048301910e+00 7.041028484137311416e+00 1.089435936021561879e+01 2.679726025336567119e+01 4.650089670210596182e+01 2.207280759596511999e+01 3.467512800949563001e+01 2.215477689683551077e+01 2.160061654829583233e+01 1.347343370989814204e+01
1.874806291366255664e+02 1.015390720039547432e+02 5.990578695553888622e+01 8.676925224521571067e+01 8.275144936079692570e+01 4.672453276287891555e+01 1.639248662964467087e+02 1.281012621727073224e+02 1.932951991227390920e+01 1.351257947282620187e+01 4.656018022158955993e+00 1.036235572217057488e+01 2.909893071953998600e+01 3.012619009472557252e+01 8.788373383338358735e+01 6.275701087647505005e+01 1.942267114797184391e+01 2.264828583834455245e+01 1.030303939044710759e+01 4.410440230369005121e+00 3.936050870702179072e+00 5.905948006970678676e+00 9.033790104601948201e+00 2.785825515986276457e+01 2.834323766778427611e+01 6.737338554379287636e+00 7.419110285704166863e+00 9.282529606680148149e+00 2.946995102931905564e+01 5.949100635124814573e+00
2.514573603939500686e+02 2.260745111798400160e+02 7.120136330134866398e+01 2.584005089391395700e+02 3.251093958139232996e+02 6.364660866532898353e+02 4.403268362287346349e+02 5.168304243169644963e+01 1.903105283330783237e+01 1.059816567287161249e+01 3.024840201479891633e+00 3.664252404673920438e+00 4.349131784573591730e+00 1.646116746593826718e+01 1.966414647387458814e+01 8.513738728920280607e+00 8.166392479664153825e+00 9.746197527749043132e+00 1.312501709402258143e+01 6.974714114707349921e+00 3.770464524489672620e+00 5.101269930576869172e+00 5.708713003782198925e+00 9.566144446170557814e+00 2.992926906068426973e+01 4.692502822588963340e+00 6.738360509972550538e+00 1.094384965483225436e+01 1.303729042365349500e+01 2.566697126883745739e+01
1.369583428645391905e+02 3.551238238849980462e+02 1.109233023150360964e+02 1.264251227870344678e+02 6.599216797480740979e+02 7.215063816318995578e+02 4.946787212597620282e+02 3.507193876971339108e+01 2.512260473672217032e+01 2.275938785231882022e+01 8.988810466311942804e+00 4.296845445563013399e+00 2.635521122552068718e+00 4.418461978778431387e+00 2.040382835905502645e+01 5.766936872205122633e+00 2.003098719236470160e+01 1.179286790930116808e+02 2.033823043293685942e+02 2.737817226232053969e+01 5.305088127499926642e+00 6.698469993485216989e+00 5.685345910389157709e+00 6.253380695850731641e+00 8.306663538470218100e+00 6.353316866856373757e+00 7.426855249939466219e+00 9.087875406564643654e+00 1.215589293624796952e+01 2.962022130206455017e+01
