2.423130141339039853e-02 3.584492902775360257e-02 3.127279200521793784e-02 3.952941431619425017e-02 3.012377576673200275e-02 6.635092503482434290e-02 6.630577038134143064e-02 1.807905995698374513e-01 3.297730513175136657e-01 1.483045558803559039e-01 6.839795817249620657e-02 1.553440489961812471e-02 9.077421390290132258e-03 3.376796347124502717e-02 3.910136685611331764e-02 8.528113074363583360e-03 2.984613203182302082e-02 5.203218987498475778e-02 4.682251494210815795e-02 1.638543191813873062e-02 1.396053301388547330e-02 6.059441780627647378e-02 4.796195685219872828e-02 6.966384736775328192e-03 1.213128727372350321e-02 9.499825430548449259e-03 1.270056212129171969e-01 1.145983937736138984e-02 1.091993311090997190e-02 1.369019869012031917e-02
1.912242558923458666e-02 4.261762854376956872e-02 7.654098955375018831e-02 6.272929603807669841e-02 4.371424588238344289e-02 1.961215606760911279e-01 9.364054816273502391e-02 1.195707030671494531e-01 7.862885743348643763e-02 6.716208706123680261e-02 4.722041918155143320e-02 9.212997455815431086e-03 1.220535487077836247e-02 2.770227773965158735e-02 3.848421378026541800e-02 2.445873217051255585e-02 3.004595071239695575e-02 9.786921980349859440e-02 7.335241051879994034e-02 2.189253666581522650e-02 8.254558140419471571e-03 5.754602762545591582e-02 1.245425819998899203e-01 1.077721745742003800e-01 9.202953712763148331e-02 1.233596207128574984e-01 4.405027030448476627e-02 1.156493800766110816e-02 1.645212528386380199e-02 1.641709684245827583e-02
2.314801353120475302e-01 2.377307546445001640e-01 5.031206088531386955e-01 4.101359950552766476e-01 8.680980295708525807e-01 8.846734733237576753e-02 1.648053184691459713e-02 1.787546477015411472e-02 2.899989349009702289e-01 8.844008728938307362e-02 2.368353047449583415e-01 1.581545631508486094e-01 5.819244814496469381e-02 8.422787192559201552e-02 1.600981420454569010e-02 6.659891255490818507e-02 4.443819660551596995e-02 9.043987128484916316e-02 2.987035167697112970e-01 4.923457293482619290e-02 5.113826675194856758e-03 4.763940924233642932e-02 7.672149842363890082e-02 2.671971598347872706e-02 1.567747554260002368e-02 1.021465887659170520e-02 9.039144013969858948e-03 7.114222859075989072e-03 1.213090854565158916e-02 1.359055128014561263e-02
1.081274274505256011e-01 3.122094712557093588e-01 6.860720802617056302e-01 5.550405427592741692e-01 2.254009563140906558e-01 3.482451341341064044e-02 2.759847917080098662e-02 1.916637078099564170e-02 1.188092289344122067e-02 1.112866772444900398e-01 7.044232149178542013e-02 1.399312730298526708e-01 6.339468214468738094e-02 4.181957990093467664e-02 1.289292878172765798e-02 9.821126649488944732e-03 2.042403843384608605e-02 3.547015662935069230e-02 2.481912151804735456e-02 2.094988232339262818e-02 9.938539950717856578e-03 9.781532853823242391e-02 3.373021118573799049e-02 6.652080569477947236e-02 1.275302222696157728e-02 9.086438933359541198e-03 7.721843851361978248e-03 7.332779319356519734e-03 1.489529302780513709e-02 1.619355310020323402e-02
6.241009903926257596e-02 1.947244192750890168e-01 5.443935199900620248e-01 2.109144981246960648e-01 1.190230624643347224e-01 1.736814065548116653e-02 2.680870751984263181e-02 1.540496294918926312e-02 7.296830548122511251e-02 2.531346650864059744e-01 3.139865395503018131e-01 2.646204106639419296e-01 4.235551747267469330e-02 3.913498485270813787e-02 2.057760788342677047e-02 8.896617923886163126e-02 6.763680715876965732e-02 3.293513663881197234e-02 5.225029927723592871e-02 2.975518316039708899e-02 2.107335924283754505e-02 5.866494464385195104e-03 1.426744968060139791e-02 1.049244628521228129e-01 2.294232817836280511e-02 1.218367004160882290e-02 8.388759266602738990e-03 9.724865590862941112e-03 1.524237476446106340e-02 5.617510601724738650e-02
6.781587968098597152e-02 7.018489685648654497e-02 2.925541223107593347e-01 2.343915865449743285e-01 9.217502219775045025e-02 9.945297152238161825e-03 1.227429751764173849e-02 1.358265567789064196e-02 1.301315332678048414e-02 3.912601077720147535e-01 3.019773093512106987e-01 1.683484561775684396e-01 2.366960876433377853e-02 7.165356136278144827e-02 6.031319073343065218e-02 1.024646824277071488e-01 4.027834911926354844e-02 8.472468958135120215e-03 2.712673291813250120e-02 9.301517922099361568e-02 1.118596466418054491e-01 6.754740267459108383e-02 1.900345106149239210e-02 6.189872597991132736e-02 3.419272976607264786e-02 3.197136080116661644e-02 1.981341016502504923e-02 1.371098053294377180e-02 1.814762117171120695e-02 3.272933705744057037e-02
1.037492090247506549e-01 1.483848373856767357e-02 1.446688315734532410e-02 7.333332489030422452e-02 3.512323316442485938e-02 5.880074402674820289e-02 9.051243852782578370e-02 5.240455168090110000e-02 6.366558560097815289e-02 7.329393083661926711e-02 5.614806129866432849e-02 2.586403835129275769e-02 1.101751967419470346e-01 5.237598581736579995e-02 3.069758282138898217e-02 5.237074937375495176e-02 2.322636866228969948e-02 8.797651253311077058e-03 4.460486189516685296e-02 6.073565527799168473e-02 3.143603270460620241e-02 8.331550717303036480e-03 6.153190531197252899e-02 5.784285673396609428e-02 2.328840869688626747e-02 2.383684647862767403e-02 2.086109657995520797e-02 1.806052240236017542e-02 2.072606076291542629e-02 4.941010254042750571e-02
2.032023058262655626e-02 3.703336883646456135e-02 1.992786353048471570e-02 4.295352281020632657e-02 6.617679792920773407e-02 7.526843429315270562e-02 6.773092104789255052e-02 6.492941124545155429e-02 5.258679756658111992e-02 2.912491488238819204e-02 1.164870405936539038e-02 4.132405656851248499e-02 9.369300914419145809e-02 3.442189653183316128e-02 3.896153390809056760e-02 7.082184764611443306e-02 4.383960417555020361e-02 5.966236086895177620e-02 5.227167757236594881e-02 3.842833478327140062e-02 1.344829225267821574e-02 1.098600417338420621e-01 4.463073369975661259e-02 3.761135864327017769e-02 1.783091394538940944e-02 1.828705322573047354e-02 2.708596619060588129e-02 3.122946673201503279e-02 3.033232264434857287e-02 9.021037705023708664e-02
4.955678740515713498e-02 3.273521156475526356e-02 1.911706949668290703e-02 1.109397287786449970e-01 7.184747997807221231e-02 3.075575334282395351e-02 1.001162130341004819e-01 4.564401131880112261e-02 3.871261411441404010e-02 3.782691570781370610e-02 3.357315709785561181e-02 4.639425350607064014e-02 1.036953028415207312e-01 7.434260261603628517e-02 1.247020424420979823e-01 1.045624150804910918e-01 3.908307961284704368e-02 1.091708822392482570e-01 1.076841915518940013e-01 1.976371258182703025e-02 4.991970267137844225e-02 5.202138244013308765e-02 5.699966661878977381e-02 3.721621899261217531e-02 2.163532568356894836e-02 2.992022933653490369e-02 1.031272587929792095e-01 8.269716664727783106e-03 2.489448949032253139e-02 1.265937116814380183e-02
8.212366899266818066e-02 5.415962776909701015e-02 8.579048800318977985e-02 8.075944828325415381e-02 7.415687803600895522e-02 1.625704349538295568e-02 8.347500499374892191e-02 3.568595679948853572e-02 1.398241910668328661e-02 5.512459264871151510e-02 6.515217454846193579e-02 6.320154426766042000e-02 1.326778515793415880e-01 1.476312120477621392e-01 7.093065247417063013e-02 7.647636173151500794e-02 3.939186623526984010e-01 4.012901005032130097e-01 1.673874023845325354e-01 8.675476685828985290e-02 6.450862807052333558e-02 4.090073089648953164e-02 4.680952735685228738e-02 5.120350864046466222e-02 2.829850199752608972e-02 3.355304801458419695e-02 1.469260065400247381e-02 2.227018102980075562e-02 2.648206718120099668e-02 6.989661531842506978e-03
7.222277834787313444e-02 3.820610471701427202e-02 8.464643702710210327e-02 6.909311225131820056e-02 9.163245810532544278e-02 8.923974115507327109e-02 8.719354814632898631e-02 8.077610729439634041e-02 5.566417784426973270e-02 3.627282247499379053e-02 5.197920329154659402e-01 8.650680704275746091e-01 1.771098871387700058e+00 8.536189337365870378e-01 1.537747544664200550e-01 2.974517670328241659e-01 5.562644732362006517e-01 1.543350035856408953e-01 3.815037205365615081e-02 1.040264636624694122e-01 4.381244075836079194e-02 3.948930812027226511e-02 5.093728345404456570e-02 7.093788795680198989e-02 7.519057871252175784e-02 3.911342825789380917e-02 5.775495051392252888e-02 4.358357027109446835e-02 3.998052825562092849e-02 2.951849444644418299e-02
1.794129015335599667e-02 8.049755654732590471e-02 7.866164180540291540e-02 6.563966075971418290e-02 5.802450518721433137e-02 1.788329742536045805e-02 6.773599612258134062e-02 4.795331812367229635e-02 5.772953062318955664e-02 7.391266364058893257e-02 1.557645301104278179e-01 1.024580289745165684e+00 1.818897294175998880e+00 9.195037261694838371e-01 3.228486261771410515e-01 3.568659986097819647e-01 3.934835252283498397e-01 2.315597341671036813e-01 5.907320545352069685e-02 1.913324236988274418e-02 4.126418377880011062e-02 4.238412280270181798e-02 5.005855815066462960e-02 8.938459467442692874e-02 8.476165537904656322e-02 6.011770385975875874e-02 4.596804280383172403e-02 4.191469339816366463e-02 4.606158223262849655e-02 5.020490674276170684e-02
3.542711535145783019e-02 8.142258377806593783e-02 2.606158659897303900e-02 5.055869050503168649e-02 3.566418567603708845e-02 1.127750102192681403e-01 6.539144342928993048e-02 6.007508905167627949e-02 7.773437567624846833e-02 3.763507901921067655e-02 1.073804285822327342e-02 3.209154641535719721e-01 1.336094393476109143e+00 5.591571719652134176e-01 1.714479173587014627e-01 1.940401446427790777e-01 7.124098635934365820e-02 1.041220447580501196e-01 1.180119598614568638e-01 4.700272038923304641e-02 3.854330918309319814e-02 4.228238880303222119e-02 5.317392530744066703e-02 8.947390883963726727e-02 1.144935745773051489e-01 1.015181425545124277e-01 7.511876063742525811e-02 7.090713451927402322e-02 6.254774370749001389e-02 5.226184159380731220e-02
3.098167701276564878e-02 8.333242474570269620e-02 2.135968743008267307e-02 8.522403775316481078e-02 5.065606806633426995e-02 2.176508610112603062e-02 7.437947808674402750e-02 6.042789365462146456e-02 1.056930573359820547e-01 3.405040517084610696e-02 7.808661424636183582e-03 5.158549561137883849e-02 6.022871363603178319e-01 7.943493696158808737e-01 8.262638567045506033e-01 1.090553957884782710e+00 9.738858007778292691e-01 6.296269154215982100e-01 1.713292134721348114e+00 7.956638272113272237e-01 6.848449732614050878e-02 2.191155855463782637e-02 1.780075517006265637e-02 4.584756352945033864e-02 1.008353544855701001e-01 8.948936398812003257e-02 2.362752783739738849e-01 8.693339455182080844e-02 8.493164179894033272e-02 9.877406397995067144e-02
2.921631159861805965e-02 2.790338167527500746e-02 6.630930897636443111e-02 6.639529007465946875e-02 1.906427144869807244e-02 4.150538599093538811e-02 4.038404154722287365e-02 1.156726546843739045e-01 7.946369047938475760e-02 8.115628503126791696e-03 1.643405531470008146e-02 2.568290183345682820e-01 5.422396903334373297e-01 6.738357484158545851e-01 5.959886724845742112e-01 7.060346357646591908e-01 1.192415011661539737e+00 2.044228723995526575e+00 2.063321465126497056e+00 1.606588492489757325e+00 6.830298403007011021e-02 7.109323840837500352e-02 6.365540071083139462e-02 2.008563945187151756e-01 2.917918338306654258e-01 1.508351131845823145e+00 1.518144674819108753e+00 3.269881731493697874e-01 8.760614512924361219e-02 6.731858319978220595e-02
2.710171744305738678e-02 2.850727198227127196e-02 5.575457163054525767e-02 5.745550770404365959e-02 3.702010337282776731e-02 4.450857137956860943e-02 2.216492203840736419e-02 5.953771256780975019e-02 1.233279148969551597e-01 4.389812210200834397e-02 4.534783762924907841e-02 4.002408705259065391e-02 3.107924030578413377e-01 6.180067456777760260e-01 5.660264015863851750e-01 8.533557906060514897e-01 1.457802606765480569e+00 1.748127320752444147e+00 9.960447256227809021e-01 2.147288770512378320e-01 1.292565846421929454e-01 8.921466433014246800e-01 1.310669157006222774e+00 2.211273607282365994e+00 2.099398013510089811e+00 2.772977800904218526e+00 2.240414202932953014e+00 6.560175185823325927e-01 1.280169628087216571e-01 7.516345558649528691e-02
3.477922788164226897e-02 3.918246609231991473e-02 3.688764253883652922e-02 3.344517566087049087e-02 4.882522317782692078e-02 8.644359308366389438e-02 3.500886824037283684e-01 1.155070090948746131e+00 5.626340016557620505e-01 9.648415026688990370e-02 7.188425304886793266e-02 1.133586170509463253e-01 2.241372952270955510e-01 3.258743238076848292e-01 4.251836700909050748e-01 7.545226681277977798e-01 1.595936900766553146e+00 1.572805515852018443e+00 7.295360290600114705e-01 2.474555216672950086e-01 1.075905496900301239e+00 1.970689392338129009e+00 2.551438352027106227e+00 2.635092997045767049e+00 2.342965607752111268e+00 2.051808033689864086e+00 3.071853583008826494e+00 5.384479442258671700e-01 2.239385532662282324e-02 9.103247693828057929e-02
8.661448924977060981e-02 6.706801873640377831e-02 3.253947561800765026e-02 4.571011470121317394e-02 3.838043742530798663e-02 1.748773650568285487e-01 9.555202611996945761e-01 7.755963257269801181e-01 7.603962962743604503e-01 3.813033856553618151e-01 1.402415794587869580e-01 3.825054188274297495e-02 3.743894151984444862e-02 9.502677328410774615e-02 2.128498289354411321e-01 9.730547858888822788e-01 9.963736938352576455e-01 1.127497234600827625e+00 1.914600549868900048e-01 3.335728626371403660e-01 1.195249533354400651e+00 2.612679441959711024e+00 3.250845599249350570e+00 3.388985635597990154e+00 2.822380548822272406e+00 2.769651367781278850e+00 2.619557903425723921e+00 2.049930800843891454e+00 9.744520155311230114e-02 6.481794621098227460e-02
3.465544414687413838e-02 9.450937648121890411e-02 1.416407373919525287e-02 6.588271733822910481e-02 1.405180440674330955e-01 1.962112726683385711e-01 6.183669288302205969e-01 7.729482729765069227e-01 5.288220995842556338e-01 4.110585423404784500e-01 8.621959849315136148e-02 8.495708592434796785e-03 1.291280193101038837e-02 3.620603175010601166e-02 7.853042326953701968e-02 4.613017806046290081e-01 1.712460334956955044e-01 5.304853205293899587e-02 1.733014688840051054e-02 1.242121439287550422e-01 4.763459763691366700e-01 2.553707783416709454e+00 3.248070857028144687e+00 3.398648494929418451e+00 2.485884406243126676e+00 1.162305267710506129e+00 1.905191524619448407e+00 1.291065906095292926e+00 1.156219011958367626e-01 4.484207515767595076e-02
4.883495814664827461e-02 6.288134063322040057e-02 4.079740592307137814e-02 4.715697450461688728e-02 1.113070136953112632e-01 6.408427442270542285e-02 3.296522055677535423e-01 4.260778581788342567e-01 3.914447069268442991e-01 9.187234912693673095e-02 2.301434544415080843e-02 5.342536593249316151e-03 9.598863450872062789e-03 2.785785998097078942e-02 1.019776271229659859e-01 6.722916803520176399e-02 1.193805823289863371e-01 3.425618354017603839e-02 6.274463612208713847e-02 2.940824192027792217e-01 1.589799878000002220e+00 3.011019234784391596e+00 3.230837162420651776e+00 3.051760915925549433e+00 2.335821716413203131e+00 1.711200745015677205e+00 1.661562077060618980e+00 1.107295032254310474e+00 9.902662494362537982e-02 3.474069475091887821e-02
1.248428851895165281e-01 1.151041787339916883e-01 5.915824631429743297e-02 4.266971106672123870e-02 5.552252252472000826e-02 2.984009134043602574e-02 1.697965742650102416e-01 1.519899482903388777e-01 4.206704263637688068e-02 2.334149204794781080e-02 8.701730481607734130e-03 8.190799421400515520e-03 9.508121679319336828e-02 4.585885042550315316e-02 5.772264655908933111e-03 1.955148475909245301e-02 6.831538235649652069e-02 1.516359865282690678e-01 1.422024871910329002e-01 6.246272252402867986e-01 1.698158421810844532e+00 2.440761259896073732e+00 9.848727676191730840e-01 1.462429764050639402e+00 1.873360723801096528e+00 1.054309471738241299e+00 7.827500930378747945e-01 6.459234023367708133e-01 2.723891451549273479e-02 2.527813795838624450e-02
1.022037133684523258e-01 1.183468649166610764e-01 1.738067140065908955e-02 1.202511158976826873e-02 9.888703337659954240e-03 1.477080860977395514e-02 2.133324290793181532e-02 5.433482880653288903e-03 7.222535179483404247e-03 3.246832878481931833e-02 4.612221638865923734e-02 7.283614719164957507e-02 6.825443410816282863e-02 1.206331265856292433e-02 2.762290777995831184e-02 3.626279890855051424e-01 6.827296535807143574e-01 9.644303541622467613e-01 6.428299635757771524e-01 4.736401917405835271e-01 3.311964565823475315e-01 1.166857009599039374e-01 4.474090843587587990e-02 9.605758897110183714e-02 3.439731296756161072e-01 1.148564919623353414e-01 1.040558147524636157e-01 4.171950944745433931e-02 4.159855878851435873e-02 3.914799017836651657e-02
2.163344600372591464e-01 1.671151070781107806e-01 1.816695098541092068e-02 8.044048400430830678e-03 1.191144787035475217e-02 9.038888295784639967e-03 1.401958579956406187e-02 4.738734562430371722e-02 4.459647366849725514e-02 1.947865273007006598e-02 4.877514665038705510e-02 8.831518764675065636e-02 9.010400160520998236e-02 2.358675197258398512e-02 3.235615484184488355e-02 2.102239671626199846e-01 7.562700876445244136e-01 1.379800042054811993e+00 1.526879582922810785e+00 1.294854058504318450e+00 2.708716685896793153e-01 5.951872350130466699e-02 7.335339734301260517e-02 1.806595790985618954e-01 3.989198349324946102e-01 1.167156596866876506e-01 4.374972565385277373e-02 2.052280927417902273e-02 5.810759368942779168e-02 5.654384801670696986e-02
2.722971612396648533e-01 3.477510289719444592e-02 9.625940354481877376e-03 8.349520060858151016e-02 1.056684253894915465e-01 7.923162449855324085e-03 1.060309754481294185e-02 3.856128337048904398e-02 2.217398840302809565e-02 2.535397779171282701e-02 4.637040662679324521e-02 7.834666911747562024e-02 6.904270722407088168e-02 1.889681560261440366e-02 6.172965606462187810e-02 2.946710352662289534e-01 5.621874387390262129e-01 1.269873463028994509e+00 1.568588189969060798e+00 1.306581060682020734e+00 6.452015633213827872e-01 3.913119506462506281e-02 2.769876687247138300e-02 5.977791690725631907e-02 3.272213968288694708e-01 1.973488047969823023e-01 1.759995499392438822e-01 4.022247643002137274e-02 4.690357748211066574e-02 4.295361747247707085e-02
1.513181691861060774e-01 4.691145999945103839e-02 1.839693213499733054e-02 1.754918720127551790e-02 3.930810291810490908e-02 2.681214768531791151e-02 1.155345055885218658e-02 1.500263057209251516e-01 7.011068815766725512e-03 9.076681372282676546e-03 2.731717785103026166e-02 3.251155612148561719e-02 4.135745038350206043e-02 7.840212374196157963e-02 2.394967706774076346e-02 8.921779010839470114e-02 8.862434571742419664e-02 3.722512771757947592e-01 4.700536348255482944e-01 4.014749413366945907e-01 3.371029888579585299e-01 5.142968228267458947e-02 7.760149665211862891e-02 1.531059798721125589e-02 5.931394535002425944e-02 1.497853587394433472e-01 4.016173156071762840e-01 2.435492967947880949e-01 5.289788515666856566e-02 4.672761174434487963e-02
5.414605305559790083e-02 2.152541408226169017e-02 2.276773244816859137e-02 3.821742945313981454e-02 2.088249241468200998e-02 9.714346997792768987e-03 1.455926215715151462e-01 1.060983196904781434e-01 1.037229905425051182e-02 3.841799867050723488e-02 8.428198174474135773e-02 3.095251957835754714e-02 4.572541501702970940e-02 8.231674385365900237e-02 1.952996698965859396e-02 3.166591945945339270e-02 2.459740133817144361e-02 1.363760212543576635e-02 2.269062023066436076e-02 3.983519850086687797e-02 7.366842052780704642e-02 2.145329864606171019e-02 8.073669676229897063e-02 4.670655551274684181e-02 8.443825819565665969e-02 3.030095591014157069e-02 1.051383796162011358e-01 1.227690272977799701e-01 6.930245190138002720e-02 6.839416111464545478e-02
5.489324724314841031e-02 4.411791228609814042e-02 2.130706680472642736e-02 1.550492226475248120e-02 1.441010562259510165e-02 5.632448734533713336e-03 1.209747322037118406e-01 1.273429471526193457e-01 1.403785656646826807e-01 1.766014305940978926e-02 5.834533586036964870e-03 6.717587523120795504e-03 1.145745530092327075e-01 7.184845514707669314e-03 1.823195547018632151e-02 1.229620145074496705e-02 9.751152738623253616e-03 8.977369413356915684e-02 8.105463088918807291e-02 6.388449231246937088e-02 5.093855794612092702e-02 7.182806089787624471e-02 9.830478171084360006e-02 3.239305162674704919e-02 3.980760604329879049e-02 2.337000928237540145e-02 4.463290558730576008e-02 2.861072377442253761e-02 3.613082734907200472e-02 1.234626854769500515e-01
7.460745484672033634e-02 3.893398143074826984e-02 2.190846768073174272e-02 2.966784954202134061e-02 2.607789472355652449e-02 1.430644143349772864e-02 4.936117850878130042e-02 3.805825746286070621e-02 6.010443251570634846e-03 1.389691537201394600e-01 4.953145491031907960e-02 1.058672232646999944e-01 1.367675990144169920e-02 1.381819042134902094e-02 4.082410217297151311e-02 3.434650378608077037e-02 1.319033459269511321e-02 2.275317205694311548e-02 9.223381939222663473e-02 4.266402202519538334e-02 4.111639642713840748e-02 6.205308520902178687e-02 8.632537473206776391e-02 4.459153860381061263e-02 3.547501746863048616e-02 5.803539996792092537e-02 7.045354992254594662e-02 8.466038312495310914e-02 6.968440019257587936e-02 5.277423915108819807e-02
1.003705312558807461e-01 8.697234272391354826e-02 2.613407198229928535e-02 8.855091636808622158e-02 1.031084992857870947e-01 1.947058739573416242e-01 1.303551783251783724e-01 1.475205663600273609e-02 5.750804846680143516e-03 1.107260898183230202e-01 3.357535630858839854e-02 3.866043772307611176e-02 4.048234142640621397e-02 7.969559595687686002e-03 1.143664464512772830e-02 6.699943323029206033e-02 5.693846127216915798e-02 6.260176495809434416e-02 8.676582660647114142e-02 5.227013336348637629e-02 3.678084586927790611e-02 5.390316697078456620e-02 5.735215062421297749e-02 8.639037074340594202e-02 6.452353371264431259e-02 4.487749736583929172e-02 6.887897047458692301e-02 1.065310513887694210e-01 1.155985431614420522e-01 5.054217427034817661e-02
5.450625066983132150e-02 1.359553590384303123e-01 4.035506676556795125e-02 4.306352317314708633e-02 2.095602078990752570e-01 2.225017228068479902e-01 1.484117027204399641e-01 1.021750857460497139e-02 7.535545453895210744e-03 8.046415343907048143e-03 1.009408563495164390e-01 5.062684197018555571e-02 2.861112197325079917e-02 4.137514097836091781e-02 1.284998467102694067e-02 5.073062344361159437e-02 1.409568888066245300e-02 8.175434324760297300e-02 1.522923080839738708e-01 3.177277499143963541e-02 5.180520797547497058e-02 7.199284397348856834e-02 6.071016360246227206e-02 6.114888591181982802e-02 8.043359375967024105e-02 6.375367029921538697e-02 7.807022780449383859e-02 9.306956739510877097e-02 1.106961769888586689e-01 5.739825883004001650e-02
