2.454897953406456196e-02 3.596956300963975728e-02 3.139107588126491266e-02 3.967626948863589575e-02 3.023801544059920646e-02 6.656542833099467205e-02 6.648588705654558118e-02 1.811935518552611202e-01 3.302744667963345426e-01 1.499586387209429494e-01 6.988957716642917040e-02 1.605179274573719991e-02 9.484922588343023403e-03 3.562738629621349518e-02 4.162410824141149490e-02 9.153248071721849927e-03 3.234699363380084264e-02 5.703601010029911433e-02 5.195762815026974679e-02 1.835912225102794004e-02 1.464522087425682885e-02 2.111331683598686917e-03 1.618191140776622074e-03 6.261692320137236291e-03 1.163805356777150926e-02 8.842666953107182481e-03 3.972179668951132496e-03 3.477619877395662245e-04 3.269415627413649805e-04 4.021679535560391291e-04
1.910044977999936222e-02 4.223891687236237813e-02 7.585822006342712864e-02 6.218872136132230777e-02 4.333343477672800537e-02 1.940972020376532658e-01 9.242294046266191776e-02 1.178135655220903244e-01 7.731708229702079216e-02 6.689409204660255737e-02 4.785176438183479097e-02 9.499475315176796400e-03 1.275391919110973465e-02 2.921949215755979823e-02 4.095412506963075350e-02 2.623417308172023774e-02 3.256766780344250850e-02 1.074207454455975846e-01 8.162286303773205742e-02 2.463801513858310602e-02 8.613411335263497157e-03 1.921130410099823084e-03 3.970570231664393053e-03 3.389506514912252622e-03 2.834845079727615902e-03 3.660384693786140550e-03 1.255837788627182320e-03 3.288188584158035360e-04 4.739642249685024357e-04 4.773286602652745373e-04
2.295597234060889613e-01 2.362433500177124057e-01 5.000061989416013652e-01 4.076511896100507570e-01 8.624786917240504502e-01 8.770328854714454225e-02 1.627901376935338498e-02 1.761813584528135884e-02 2.851780111917266991e-01 8.733221568760703157e-02 2.384049166798953012e-01 1.629243981410776754e-01 6.079621892344892753e-02 8.877364582125528425e-02 1.701815454873135958e-02 7.132083533730798619e-02 4.813709622952443146e-02 9.931985882915472796e-02 3.331170488283594633e-01 5.563610605088266381e-02 5.219767483282089851e-03 1.504488544419928632e-03 2.259905857446267187e-03 7.548606831959237635e-04 4.236057542728259139e-04 2.704974598369797685e-04 2.325191630321030232e-04 1.910963183875479085e-04 3.363725355072168959e-04 3.909311805712768588e-04
1.076781470878551972e-01 3.122553897280579416e-01 6.862446639246390090e-01 5.552430635978192752e-01 2.253517192353657328e-01 3.473387535133963533e-02 2.740770193945095759e-02 1.863349358821701773e-02 1.152842346222704428e-02 1.086040821312335564e-01 7.092866773184021423e-02 1.438168660159275802e-01 6.593666191484573447e-02 4.358612763749074998e-02 1.278484928581304428e-02 9.668771557265008060e-03 2.025728667936598990e-02 3.811423335568991932e-02 2.709288748899562824e-02 2.317827396101092979e-02 1.032707933299849799e-02 3.491514876364447406e-03 1.073229128729067533e-03 1.975853210336405916e-03 3.474570951454459015e-04 2.442965738529545962e-04 2.010776039862687133e-04 1.990375238005187997e-04 4.163509822328320805e-04 4.748016109127570238e-04
6.234921478172093801e-02 1.958347165270248602e-01 5.478749583384353583e-01 2.122891554500867528e-01 1.197001509550563308e-01 1.742062440488175573e-02 2.676790106155910870e-02 1.498343228124722308e-02 7.063006982314497251e-03 2.477570891241251405e-01 3.160498321422077761e-01 2.708830280106050425e-01 4.022217998939087852e-02 3.278458685809622353e-02 1.514771065897502038e-02 5.570446860582887669e-03 5.974542269230794650e-02 3.450179437045641784e-02 5.557963871425625202e-02 3.206845764677294236e-02 2.206953214985410763e-02 6.081115054624610175e-03 1.307831945243146179e-02 3.418228287074045243e-03 6.477462958009262218e-04 3.354651792075141856e-04 2.224678122706148743e-04 2.700026238021347651e-04 4.373756948801205049e-04 1.699536200674171046e-03
6.234983131647754695e-02 6.597168023624287725e-02 2.962252655258025835e-01 2.374118258376453905e-01 9.331553947563893392e-02 1.004082337382015619e-02 1.232936284396958515e-02 1.330543046660986883e-02 1.270144717125679286e-02 3.843344775267411029e-01 3.039487794583289326e-01 1.597660151870308187e-01 1.816146167912825390e-02 5.334394793190640020e-03 3.954209261892757676e-03 6.367614215888738050e-03 3.324019661475371978e-02 8.734694361910530502e-03 2.836015035216292446e-02 9.844756749400225548e-02 1.198249456532655133e-01 7.048529385944860004e-02 1.724198904774974436e-02 2.125759446137516322e-03 1.000539692895160895e-03 9.003229868383933951e-04 5.304333211810566533e-04 3.858114310525673479e-04 5.292270457241664847e-04 1.014290348926862604e-03
8.708712485971090156e-03 1.384784912489437844e-02 1.467597405969214494e-02 7.452577741876358075e-02 3.571861202866206259e-02 5.963053846757419840e-02 9.125597541465486906e-02 5.249603789154598521e-02 6.332943235745304433e-02 7.326918079791425176e-02 5.647372668598759499e-02 2.319149989308966209e-02 9.470325878778216785e-03 3.566963958951551231e-03 1.828061508509254852e-03 3.198638942262094480e-03 1.889206880236524860e-02 9.031554503719591009e-03 4.632881906776152581e-02 6.377966183846467407e-02 2.946621545348064239e-02 6.965040313102747321e-03 2.668868263869110177e-03 1.993830253120658803e-03 7.034028522024773130e-04 6.845480374282582933e-04 5.613833372618114029e-04 5.174954822736667261e-04 6.271016818554773792e-04 1.595760554585284267e-03
1.918764168579551246e-02 3.501615329973023494e-02 2.044764261490155527e-02 4.401726479997085384e-02 6.774079717522181465e-02 7.666567953515761313e-02 6.839419306222375983e-02 6.495263995600138174e-02 5.206707318478984159e-02 2.907505425056897824e-02 1.173544094052513496e-02 3.654408669895043565e-02 7.800363191036505453e-03 2.531449172190698618e-03 2.524219264185252956e-03 4.573244688235072845e-03 3.808966350192122957e-02 6.180965315550375483e-02 5.462970115555959572e-02 3.888112874140534081e-02 1.054483550116340831e-02 4.892154945174748484e-03 1.623278414659940633e-03 1.219306511304190472e-03 5.497641413653904258e-04 5.498330775043505994e-04 8.078595360013900465e-04 1.082116858358136676e-03 1.151629114388740818e-03 3.595328922097382890e-03
5.178304119331750277e-02 3.442838633542883581e-02 2.010304424456078876e-02 1.163243028106854815e-01 7.497228891162156794e-02 3.168082140609364272e-02 1.015652431823347024e-01 4.561810664196354337e-02 3.779620038559756978e-02 3.734526572728224386e-02 3.350624626403218148e-02 4.472913763982025448e-02 9.811697867173624354e-02 6.331702557502827400e-02 9.298661355501201126e-03 8.475534025669115984e-03 3.739373027327385496e-02 1.152562806053098882e-01 1.141821492616486716e-01 1.894143447211522890e-02 2.939548143201286927e-03 2.227203870352729639e-03 2.061809732905818884e-03 1.224276565003319574e-03 6.823371324701516926e-04 1.007443667042967096e-03 3.648205408639630665e-03 7.836851954346165175e-03 2.392684793538446195e-02 1.242510158787364302e-02
8.687045395104621426e-02 5.734429044377176848e-02 9.118939358615164859e-02 8.615864558053355771e-02 7.507996988262705118e-02 1.469640869265164025e-02 6.684253541470533411e-02 2.822382959421463472e-02 1.159329210866356062e-02 4.397052508880959325e-03 6.519695863183462559e-02 6.488512248190644871e-02 1.381324447643810793e-01 1.484131694616244723e-01 6.996514023652414260e-02 7.667666193743437331e-02 4.157101129936549011e-01 4.346849137259563012e-01 1.743836441512256474e-01 7.730258669424081019e-02 3.734077840572455100e-03 1.738402005969232706e-03 1.738714866008606984e-03 1.773719535592682391e-03 9.373263922918835924e-04 1.164923370568313882e-03 1.060747424875861135e-02 1.927097483183694976e-02 2.515835273707738018e-02 6.895257276180337402e-03
7.287972536624005848e-02 3.872015300760411199e-02 8.588844955382449187e-02 7.391624234880272981e-02 9.331392474620686661e-02 8.485515342648755621e-03 6.935439401577049232e-03 5.919189071645682490e-03 3.602770533093315949e-03 3.278886139240994729e-02 5.256104189291340711e-01 8.983786259036963262e-01 1.868213741538894190e+00 9.154469782197293126e-01 1.675338891973475741e-01 3.292455436842657290e-01 6.174878084848458570e-01 1.711752745584596280e-01 4.063029417903371576e-02 8.052951378021153475e-03 2.687366056668822473e-03 1.829251147614067291e-03 2.120994483018434455e-03 2.823204732116290933e-03 2.896174981658946896e-03 1.516425894902713196e-03 2.324999176466488460e-03 1.934541582040913421e-03 1.787263208443377882e-03 1.316067277780105750e-03
1.335356322993743253e-02 7.968088010887056788e-03 7.034219464566884850e-02 6.984301796199024470e-02 5.412589672409787167e-02 1.219223742906164892e-02 4.582985684105206868e-03 2.869413678865351865e-03 3.462267765884913424e-03 6.572955245176952122e-02 1.627750345366693052e-01 1.085516762828357962e+00 1.953806166400116950e+00 1.004108714539604374e+00 3.582058399504087220e-01 4.023212567030136078e-01 4.449036595982195363e-01 2.618108251784805884e-01 6.400884922992886028e-02 1.799779182576287384e-02 2.633022355608060413e-03 2.312570004253835902e-03 2.575343658501111181e-03 4.505327990922718823e-03 4.221469611157872837e-03 2.929739848185693336e-03 2.185891163634470693e-03 1.998018883075396504e-03 2.154173903985926158e-03 2.306267725257933002e-03
2.529087136264033218e-03 6.601557326760314204e-03 1.628602690631939659e-02 4.648576813096227944e-02 3.031651325697548582e-02 9.459357150116004531e-03 4.709528611872871966e-03 3.811436371525773765e-03 4.645715951660278273e-03 3.350975818437121334e-02 1.128164455927466170e-02 3.470318727564621342e-01 1.461552241994581225e+00 6.217993506654204694e-01 1.936201232033460951e-01 2.223930911318528492e-01 8.191921140597094309e-02 1.198804994315188499e-01 1.359569335840759008e-01 5.064126957863859801e-02 3.350034593252130145e-03 2.986855374362612156e-03 3.583027427201473762e-03 6.104826654843360789e-03 7.947702505019632949e-03 7.384479274742648119e-03 5.398811142074794525e-03 4.859388794493537007e-03 3.674559606147579597e-03 2.769069039265924150e-03
1.982389891035282216e-03 5.740955676187576261e-03 1.079569015506325058e-02 7.961296369957659644e-03 4.720763515721209010e-03 1.820847304412353054e-02 6.193191698136450013e-02 5.276390085361727655e-02 6.739242028690999552e-03 2.076594876647903758e-03 8.403182778689987850e-03 5.700097823917087136e-02 6.714139093805471248e-01 8.997911655182693202e-01 9.490953305470237744e-01 1.268051818540511855e+00 1.136927175546449842e+00 7.371227589478562825e-01 2.010576771786642514e+00 9.294215319869973957e-01 7.611931867474763802e-02 2.190850261320873710e-02 1.649168526634255810e-02 4.150413914899965528e-02 9.685601535299942499e-02 9.112826386741049167e-02 2.498443937489583933e-01 8.164966870159534595e-02 6.343637087362530465e-03 5.898063494866174344e-03
1.766634842104568585e-03 1.785225976850641052e-03 5.037629269604831581e-03 3.794285125116927948e-02 1.375748048563187921e-02 3.179234587081638912e-03 4.148163416188084540e-02 1.208783288507901676e-01 8.146917249807231198e-02 8.341427381077851783e-03 1.776430839509589299e-02 2.845051003448831883e-01 6.046052554845606775e-01 7.612873194765938933e-01 6.813708337095103484e-01 8.158905163365131052e-01 1.387315976269273943e+00 2.392604747325783876e+00 2.427918472566862107e+00 1.897750070511027953e+00 8.081995818618498140e-02 8.429827486121127533e-02 7.571580920296115680e-02 2.385118200774817565e-01 3.451964724474491653e-01 1.776755773603776234e+00 1.782193698379394009e+00 3.574338606061615020e-01 7.714538860290446470e-03 4.467017091502741358e-03
1.529962423532183445e-03 1.673694363173392060e-03 3.910363165062708327e-03 4.346464477024433379e-03 2.855972040828746658e-03 3.204756833328247130e-03 2.282996601083145047e-02 6.515844342720972238e-02 1.354272317489108313e-01 4.836123935618356212e-02 5.010546939025592450e-02 4.427308559781761160e-02 3.451047947809584571e-01 6.924230398312811730e-01 6.396121175579176921e-01 9.724189981999219468e-01 1.678981385694606310e+00 2.033557955413239693e+00 1.169200834356570518e+00 2.535766237079243313e-01 1.528260416891913387e-01 1.056481537632820045e+00 1.555113437886334049e+00 2.622739989999020693e+00 2.483172718155737702e+00 3.265282850153084837e+00 2.624307680092843320e+00 7.425800771580404191e-01 1.240261500433290087e-02 5.474067506727010174e-03
1.842637682918397881e-03 2.133535965948201406e-03 2.108415281281061579e-03 2.005476359226860891e-03 3.030334862744919755e-03 6.364459510319507400e-03 3.762002421511855266e-01 1.272181187668129043e+00 6.221826950340054729e-01 1.066761663062292531e-01 7.947195732321374328e-02 1.251980584643208605e-01 2.478250244014894577e-01 3.621147981534823534e-01 4.747559929248945654e-01 8.466067093871527671e-01 1.817807935376254180e+00 1.817392020511236606e+00 8.539985191482628579e-01 2.920865164643528522e-01 1.270638953727374787e+00 2.328536065655699261e+00 3.015487496021700853e+00 3.116429865678840727e+00 2.762407938034617594e+00 2.402695197823741413e+00 3.568641411079251924e+00 6.146886771301601771e-01 1.931599976672733823e-02 7.971200805412317902e-03
4.312317869139882000e-03 3.387984189939869089e-03 1.777441496462288210e-03 2.795108080269113112e-03 3.631134501110521579e-02 1.855629422667304240e-01 1.045563760476146076e+00 8.589538711444992813e-01 8.457673780778112160e-01 4.229178995645829220e-01 1.551672746578923734e-01 4.219537592812695748e-02 4.123863462147106529e-02 1.047607928745670769e-01 2.347973905080444901e-01 1.073483263496841866e+00 1.121150935192792630e+00 1.293327096413941391e+00 2.234744976097071956e-01 3.935004480492873546e-01 1.409319195013169601e+00 3.077578705153754424e+00 3.823564746651912039e+00 3.992125036918488412e+00 3.309408417444589467e+00 3.215612511795311601e+00 3.012134614798830601e+00 2.355610845748492110e+00 1.033794168309076361e-01 6.720513516566083145e-02
1.887013426523640510e-03 5.201695502630521509e-03 9.626727794038589942e-03 6.743826078148221215e-02 1.518771561087111921e-01 2.169980376930232824e-01 6.846594050875609572e-01 8.570492599376722254e-01 5.870622990365340632e-01 4.559756481649558379e-01 9.549825228026045942e-02 9.384794970204087330e-03 1.421659851005604470e-02 3.970511735876392639e-02 8.571223730842411626e-02 5.005247402475601071e-01 1.896937770672168788e-01 6.001354481097689875e-02 1.999662495523964884e-02 1.450251455840462778e-01 5.551182203523991054e-01 2.968754447432147892e+00 3.764652259944438306e+00 3.950538963586556207e+00 2.893923699548477835e+00 1.352201092256098747e+00 2.214408086461041592e+00 1.499574556681222415e+00 1.341704171292968928e-01 5.198073356818423002e-02
4.688016538406987455e-02 6.081321745277431384e-02 4.115376850344079629e-02 5.199130582209172957e-02 1.242200606732140333e-01 7.163805713417041587e-02 3.674236528954269998e-01 4.737480496654083995e-01 4.343629968261646379e-01 1.019843828365430971e-01 2.552279674098847234e-02 5.398669542214165964e-03 9.433558961748925165e-03 2.754072423630982147e-02 1.080331271024502909e-01 7.179907084369333004e-02 1.299575726475809545e-01 3.806846769199686425e-02 7.116262232335986149e-02 3.375840104854550550e-01 1.819191479370102726e+00 3.433254708150253798e+00 3.669887968276182022e+00 3.490608705019561331e+00 2.697954178422284244e+00 1.995059188618640844e+00 1.951750708384891508e+00 1.299877736589854615e+00 1.161286280711449764e-01 4.070704120493717076e-02
1.332494864131225087e-01 1.233145396896237200e-01 6.446317546210665606e-02 4.733040583878841967e-02 6.273025878564120195e-02 3.373133195804386975e-02 1.906913436910023796e-01 1.696992805718089414e-01 4.613921782227058815e-02 2.492162858914334644e-02 8.584063710340927855e-03 6.859933936493627787e-03 4.139783589894040043e-03 2.315814360906745268e-03 6.060250241908811224e-03 2.068208707837336513e-02 7.335165434441799637e-02 1.655936875450502999e-01 1.580300334648794269e-01 7.010837060022019340e-01 1.897616662170290347e+00 2.714892953425108502e+00 1.090439974108444066e+00 1.642508557336845865e+00 2.146243555972163986e+00 1.231632366507448673e+00 9.287037022997457480e-01 7.542719674703557420e-01 2.749699045743682693e-02 2.464050356019769142e-02
1.088125593787593326e-01 1.261665078101481818e-01 1.898108596897528366e-02 1.341017480244160315e-02 1.123264262833844479e-02 1.677134676361737020e-02 2.369227958136302034e-02 5.873308248576828219e-03 7.511550914588056849e-03 1.195323690870782980e-03 1.604321001853158818e-03 2.486640540397368811e-03 2.795619560181805078e-03 1.011641605375515791e-02 2.904075595027891601e-02 3.846282672969444372e-01 7.334310143565723195e-01 1.050953460903047976e+00 7.111121395992976435e-01 5.278010648491398005e-01 3.666866676052925045e-01 1.283636036434892269e-01 4.892989031301651914e-02 1.070286508446855883e-01 3.928974179741191453e-01 1.344185370551906622e-01 1.240762800101853219e-01 4.159260575936659515e-02 4.753509907554275167e-03 3.889681561420820725e-03
2.294567877998699990e-01 1.778795258795513867e-01 1.955803560222124649e-02 8.609258574266882152e-03 1.281451310040617429e-02 9.996193825379919365e-03 1.533164919250871831e-02 1.629488735680801118e-03 1.364144535134742152e-03 6.005054271315388896e-04 1.453000417017610846e-03 2.780204252632286280e-03 3.768091470039546670e-03 2.082201087143589757e-02 3.519993515766460523e-02 2.264452300637768700e-01 8.279302730440377678e-01 1.536673674456076721e+00 1.730120381343770442e+00 1.477956358016929928e+00 3.065256377818009748e-01 6.681114543875824041e-02 8.177288814100040770e-02 2.041482976375657565e-01 4.590071543349716898e-01 1.367327961357149291e-01 5.188119228980751091e-02 1.939421815268509153e-02 6.127956880174630604e-03 5.530792202142286937e-03
2.884095009823464117e-01 3.734028367878103327e-02 1.040833230011057112e-02 3.473934461285233671e-03 3.970658091832512254e-03 8.702121368597425313e-03 1.113998479404927633e-02 1.237467310719224780e-03 6.741998267768798151e-04 7.878495733804353335e-04 1.416619726814157508e-03 2.441772075143580200e-03 2.817508664815203574e-03 1.612533136713489856e-02 6.498357789228843828e-02 3.231329813707831122e-01 6.277560618898632150e-01 1.443713552700392366e+00 1.814599955099963635e+00 1.520955166349389209e+00 7.434828832587907499e-01 4.201633254391320960e-02 2.953137552531886686e-02 6.500305894140274987e-02 3.777758681465883117e-01 2.304605594498098098e-01 2.067111384639779281e-01 3.844779483531925862e-02 5.474560012243044095e-03 4.123788199544601088e-03
1.634352209337918693e-01 5.152800780468751174e-02 1.995564653904156188e-02 1.882594776173547590e-02 4.174257604056848259e-02 2.851620926154070298e-02 1.173582786257534177e-02 4.776355034622613294e-03 7.134991729124229992e-03 9.339041829825060412e-03 8.767712152340730080e-04 9.922851986455835747e-04 1.580438401045650230e-03 3.734450769203550083e-03 2.359173556789390114e-02 9.961687839271640699e-02 1.007067156204493330e-01 4.299787241870618448e-01 5.513942207249794558e-01 4.727855313593607445e-01 3.923383958339502486e-01 5.007595110962532320e-02 7.681955521115012980e-03 1.525813133274581124e-02 6.800219421646913620e-02 1.728209389362750092e-01 4.632040219845332540e-01 2.584538251153367661e-01 6.291091111307001334e-03 4.588063693799501221e-03
5.878425969203422696e-02 2.374851876039047599e-02 2.533355728725784906e-02 4.311579680212644650e-02 2.345062216289025767e-02 1.048146665269860181e-02 4.786267883988267434e-03 3.344717016310205012e-03 1.060872722152058668e-02 4.121688187772189205e-02 2.822296680804245190e-03 9.748384912978446445e-04 1.691135706859546884e-03 3.868381892933503777e-03 1.915279135520712647e-02 3.551784547364539302e-02 2.450709028241796969e-02 1.218222022239849774e-02 1.928397465794758417e-02 3.529510070014048317e-02 6.296403358500687886e-02 1.447524063702767053e-02 7.559812810324161025e-03 3.925695416647764086e-02 9.610649221064550274e-02 3.454282208477842120e-02 1.192852903148868687e-01 1.331693298175078422e-01 4.647589567484605722e-02 6.891836081229892746e-03
5.961560229183331117e-02 4.866638165773153751e-02 2.371652641046122917e-02 1.749186147410813214e-02 1.618204583570935148e-02 6.054622704625137707e-03 3.986521968949555822e-03 4.072546257230052168e-03 4.507078907119616701e-03 1.803673049062662001e-02 5.127805152966333213e-03 4.886256350713161917e-03 4.745428014651957918e-03 6.229437738243199206e-03 1.888841187932661231e-02 1.376230791193110668e-02 9.669576125425745350e-03 5.999214828376451744e-03 5.466223258674513322e-03 4.306136796702313835e-03 3.516504615164654617e-03 5.284505156694980881e-03 8.687920100231314585e-03 2.250906940940098494e-02 4.028227275244686267e-02 1.959561529193858814e-02 3.139975220578836157e-02 2.109631894459158830e-02 2.120725432478682074e-02 1.344595286283103985e-02
8.106397693719871733e-02 4.294600265727550881e-02 2.439351093558499162e-02 3.346588847578163550e-02 2.928515672617694812e-02 1.588573759217803971e-02 5.407825712547769531e-02 4.082407416822853019e-02 6.033599147109217770e-03 4.390210806944521912e-03 1.578823825919901079e-03 3.643383717878061721e-03 1.114806498901395326e-02 1.306636184106998305e-02 4.253383768955346089e-02 3.344202061437587942e-02 1.103016865101374283e-02 1.363542105873958958e-02 6.535518764677786079e-03 2.906633038367131567e-03 2.689223211932038025e-03 4.186706846802926499e-03 6.646040152766638509e-03 2.202820382385555290e-02 2.370093042723023929e-02 5.913038139489150934e-03 6.723691158663258269e-03 8.838792960561215467e-03 2.917308597086929259e-02 5.994234663595753194e-03
1.089151077103570064e-01 9.586091378697583765e-02 2.915339569571097703e-02 9.986644401107695745e-02 1.157875518244178281e-01 2.187547207250237769e-01 1.464446178128036569e-01 1.657874661833841010e-02 5.976051673609515842e-03 3.471387224542343743e-03 1.031671367627430081e-03 1.294087409380001875e-03 1.672344279356949553e-03 7.194447331106143886e-03 9.586599093267846039e-03 4.576057528266870914e-03 4.700878825715388773e-03 6.071928939187548786e-03 8.627241276809111126e-03 4.652597109855381372e-03 2.493173951278663050e-03 3.409929404965685463e-03 3.847596081812588824e-03 7.079847928651811922e-03 2.413553143364515971e-02 4.082449482429252943e-03 6.173830517431306078e-03 1.052803807592291550e-02 1.314597830731966538e-02 2.626605604574019232e-02
5.943025294429584576e-02 1.503893923421366352e-01 4.535931781367804477e-02 4.843515120055898876e-02 2.347723288755846627e-01 2.493129114993905548e-01 1.660970881036292757e-01 1.142019750338360215e-02 8.077211028726799524e-03 7.714486644531034880e-03 3.200915652642720606e-03 1.599751209540108956e-03 1.069663270270637678e-03 2.013161040479729668e-03 1.033552437673698407e-02 3.222475692631428593e-03 1.225384245435610919e-02 7.989625011085446649e-02 1.480275822314157663e-01 2.044761716631927906e-02 3.906718603336783308e-03 4.966430573499474449e-03 4.222557794111759036e-03 5.043980378483376575e-03 7.259695335991100430e-03 5.996344653889214282e-03 7.401131696272410417e-03 9.413426151158178767e-03 1.318345475194214814e-02 3.265491944105316374e-02
