1.572522008879559952e-01 2.227903653610221746e-01 1.865677696530785856e-01 2.294071904050761779e-01 1.583773175542400324e-01 1.447103983202456534e-02 9.716545451962224633e-03 2.613673024629362823e-02 4.736870285632794469e-02 2.516085027539246774e-02 1.690837625492574645e-02 9.034580271061021239e-02 6.153493761062409778e-02 2.428524710065502190e-01 2.986156766337778046e-01 7.039314384966255389e-02 2.663318280065167243e-01 1.435098288372811150e-02 9.156973362524259419e-03 2.022304629732601666e-01 1.867180432359739906e-01 2.756735093936146450e-02 2.085793809969412049e-02 8.267306503764276782e-02 1.593934592177636278e-01 1.243327556571669767e-01 5.689909403284951900e-02 4.965610825120965119e-03 4.698342052727421704e-03 5.855239220830788481e-03
1.021301138967378730e-01 2.118726940987046281e-01 4.327714849143896730e-02 2.778211572181317757e-01 1.890814612207528389e-01 4.466800917004563887e-02 1.708812219164264692e-02 2.112324765258937961e-02 1.243806162607892334e-02 1.132069378559248836e-02 2.138222039206257585e-01 4.689148881287449194e-02 7.347069020389496163e-02 1.885054723823024192e-01 2.744012408135468317e-01 1.923063118816653039e-01 2.424552953391378440e-01 2.539784257554661070e-02 1.370080346229629598e-02 2.392199884889653072e-01 1.061477846238301770e-01 2.629403214085820548e-02 5.396487049516228429e-02 4.791312279340979863e-02 4.218899467078943144e-02 5.633485526654177095e-02 1.973721885079742985e-02 4.990042737970708069e-03 7.059969889375879507e-03 7.014982709063670961e-03
5.102930202299481993e-02 4.952715874048199685e-02 1.017921470894977420e-01 7.624960469728157830e-02 1.778320059180190926e-01 2.672652112692323195e-02 7.992957976267446585e-02 8.310938936762353457e-02 5.949875678839047777e-02 1.602915936756694679e-02 4.380106673575802356e-02 3.390854891371727908e-02 2.316330100921434876e-02 5.270466360039917364e-02 1.130565176155729074e-01 3.925915389918288589e-02 1.615537095132699164e-02 2.348502823578218698e-02 6.768565329500118855e-02 1.329193102573402591e-02 6.634254295148994673e-02 2.165073636847252361e-02 3.265077629883413740e-02 1.128279316768012255e-02 6.663157919093326900e-03 4.374923433174336858e-03 3.899295887118764403e-03 3.053696466708518461e-03 5.192007311782601692e-03 5.801316036023404683e-03
2.141208566529162471e-02 5.878437769847730254e-02 1.040936814237626851e-01 8.437692371137288372e-02 4.382806727473550351e-02 1.636045282109013788e-01 1.608906250775731794e-01 9.892012821989108751e-02 5.314976061421194248e-02 1.733683690823117213e-02 1.037500629354651087e-02 2.616259588344111570e-02 2.635782525827354283e-02 2.623604813141987568e-01 8.264041216352040198e-02 6.842105781718967050e-02 1.488555672852370781e-01 2.914188077056723558e-01 2.338257049906622698e-01 2.171713350608258097e-01 1.188029749897979298e-01 4.563956904084963406e-02 1.520239963330318432e-02 2.986177181466571212e-02 5.443748850421493632e-03 3.882759775430870940e-03 3.335819606421259846e-03 3.148534602309262069e-03 6.359238212186004574e-03 6.872885580924391509e-03
3.000908595196766782e-01 3.726627318640057113e-02 8.302611165394339909e-02 3.218112715733779244e-02 2.564948916545620183e-02 9.531359515247452008e-02 1.644189162833378237e-01 9.154918586358037902e-02 3.334841509885418803e-02 4.191456841426682844e-02 4.617165950431234567e-02 5.562386060578453778e-02 2.012166251858793775e-01 2.053340000925371056e-01 1.063345173680975975e-01 4.252687321666184794e-02 3.202072493329677361e-02 2.832991812501071682e-01 2.148837427445877621e-02 2.665837418340119003e-01 1.887144263022273727e-01 5.841393172931091254e-02 1.480714791218994963e-01 4.882158313451413767e-02 9.836237191407548944e-03 5.227628106908808851e-03 3.649120857844417084e-03 4.183986414643235327e-03 6.488719363894994430e-03 2.365803046257107176e-02
1.768068877361411023e-02 1.832499838052508573e-02 5.722896343851861106e-02 4.663906271539326048e-02 2.147899250203439206e-02 5.391796003165155726e-02 6.889804647842526220e-02 7.358024213610128705e-02 5.971112331086896735e-02 1.012359855336601999e-01 6.158274843032782164e-02 4.657013535347210437e-02 9.115879381303435003e-02 3.392670513340788341e-02 2.809683459069504605e-02 4.834884590094556261e-02 2.619684548670259683e-01 6.710158227172323409e-02 2.131643936778664927e-01 3.268564450408217859e-02 2.926064391820071275e-02 2.239393895147952576e-02 1.804754411325102947e-01 2.830489772303739632e-02 1.468681112859024536e-02 1.377672749875536590e-02 8.675127846651914734e-03 5.915918318769393738e-03 7.725844489932892807e-03 1.372757876263372076e-02
5.477974433879915367e-02 8.263575313143127488e-02 8.147262473228537860e-02 2.457341833222788027e-02 1.810119094688104335e-01 1.442830578125540303e-02 3.318689286876914252e-02 2.685282246309420029e-01 3.059060019633950134e-01 3.716264218463154884e-02 2.484844460895021534e-01 1.097860963527817896e-01 5.056181389133342086e-02 2.316336106007337373e-02 1.343351152993916414e-02 2.442852818930593695e-02 1.387921731250796042e-01 6.338466490061751835e-02 3.029404212401585750e-01 2.308323650917687431e-02 2.081403923956385293e-01 5.746586219812999108e-02 2.643529217922980720e-02 2.542953952863851591e-02 9.958373331952437291e-03 1.034264423564672242e-02 9.303122541908756191e-03 7.974798113494975527e-03 9.133411030565379354e-03 2.125405913866702454e-02
1.202220232043351850e-01 2.217388826865466511e-01 1.185060133326211046e-01 2.308360153702484485e-01 1.917501708391674414e-02 1.630427209401332997e-02 2.519230075022908105e-02 4.332623485718131717e-02 2.867242374740352484e-01 1.648521864778615120e-01 6.676659881198054869e-02 2.045076520262164854e-01 4.435165549864449747e-02 1.537922471607969070e-02 1.734003418496504398e-02 3.241572666086863647e-02 2.474776877907549633e-01 2.557393453669955588e-02 1.646414032060172783e-02 2.584463412028158436e-01 8.435908554382014202e-02 4.815215097090536772e-02 1.896285232238803520e-02 1.586425085941832805e-02 7.622962379545416417e-03 8.100256739269453068e-03 1.326816533063590771e-02 1.682453203773979361e-02 1.624822473334158052e-02 4.583355355330544223e-02
2.921991338928307536e-01 1.876335611001834491e-01 1.049113028337043535e-01 3.721042735065250434e-02 1.974781621689244288e-02 1.407923418964993068e-01 3.712961653428942244e-02 2.370491089468736712e-01 2.259582688315531773e-01 2.320602650395503230e-01 2.075053304473924998e-01 2.599361819396256990e-01 4.305460269449017802e-02 3.592563818698862876e-01 5.582301245841808646e-02 4.706951078251810083e-02 1.883483859781629188e-01 2.709995297814562706e-02 2.406431441526623791e-02 1.137968382117032773e-01 2.237163325609410267e-02 2.253302002587254105e-02 2.414064542363724211e-02 1.572986099031049509e-02 9.262489587220344017e-03 1.427714399283878770e-02 5.699464187897042983e-02 1.117474116055822558e-01 3.097390152639333816e-01 1.468763679378634612e-01
6.262792583577996008e-02 2.823022644371528944e-01 4.580115771355625087e-02 1.855179877875814606e-02 1.720838364621019023e-02 6.748161670397301304e-02 3.172970211113940869e-02 1.580954363788513728e-01 7.655195423893909612e-02 2.772120924989939644e-02 3.475561010911436960e-02 2.034081975432729464e-02 3.759363169232887020e-02 3.297261924963752061e-02 1.637671288049597981e-02 1.367105046446154097e-02 6.741956747481689383e-02 7.400176369114204455e-02 3.257427173148318145e-02 1.858730558067227950e-02 2.829852992463940953e-02 1.759477721402240291e-02 1.987766775862525453e-02 2.174216484044370554e-02 1.215955959603934669e-02 1.563194842370342966e-02 1.512115929871716835e-01 2.508915032464969497e-01 3.004824252445868482e-01 7.589299430384778555e-02
3.541452537060559014e-02 1.933886749659357585e-01 7.467493847103408300e-02 6.254957845759664958e-02 6.726524918009606224e-02 4.525014466083063930e-02 4.158930874157963642e-02 3.755821874611307842e-02 2.570882765005615481e-02 2.027019097420110494e-01 8.862044984495030808e-02 1.257248556074976042e-01 2.598927407651228094e-01 1.280611241575779491e-01 2.354951504952285460e-02 4.619656805983132081e-02 8.659527040476157345e-02 3.348784136750763279e-02 2.009869230036520349e-01 4.879191333372694811e-02 1.975383680504999573e-02 1.732738714980536915e-02 2.202550023902577828e-02 3.061877100448886016e-02 3.265907522693670129e-02 1.776726230352971420e-02 2.856060495438053973e-02 2.207150528886564142e-02 1.920931443832280677e-02 1.337818784023486057e-02
7.817457610312816829e-02 4.556338931830039574e-02 4.096690133282731572e-01 3.934703239630027993e-01 3.139111910611352974e-01 7.465074199576136882e-02 3.224670478765322146e-02 2.181822198754585634e-02 2.636125525086769825e-02 1.898243097950978384e-02 3.602422490497243779e-02 1.522442243311817323e-01 2.680538809618028817e-01 1.397988586514034848e-01 5.062792656522318441e-02 5.748690544465633046e-02 6.385983374468910678e-02 5.357837885880502998e-02 3.416998637221124735e-01 1.130105357352862855e-01 1.924045052228820843e-02 1.921803283310455357e-02 2.242369367985264095e-02 3.982734417838135893e-02 3.767827746376999770e-02 2.673174110380826043e-02 2.045257562783464253e-02 1.827259314595562970e-02 1.956728639891675350e-02 2.076855823245099542e-02
1.821497657672772885e-02 4.565376640871604552e-02 1.076168492172708130e-01 2.973996196375465195e-01 1.953285696586694320e-01 6.261094180279101751e-02 3.252971204467004079e-02 2.754779427452525714e-02 3.583997822204413458e-02 2.434380228019706882e-01 6.759960833363927446e-02 4.990422925752726474e-02 1.986970305586746310e-01 8.641033502386595566e-02 2.752401909141473021e-02 3.227307257164437060e-02 1.198145836820527221e-02 2.260404584615859080e-02 3.212343473114568498e-02 2.406622602609417849e-01 1.865407392959130689e-02 2.014668734453440788e-02 2.523786822883773012e-02 4.160761616314893885e-02 5.237078534496546894e-02 4.545138234141323647e-02 3.327520860857903495e-02 3.087128120117661745e-02 2.672219219262948406e-02 2.183585804105052375e-02
1.549670994452291214e-02 4.430960519137984444e-02 7.884120672959173126e-02 5.667259073469373826e-02 3.347603346079028319e-02 1.287981131461817808e-01 3.278181142746364879e-02 1.536133754754142461e-02 5.006339983020998557e-02 1.622119100334766875e-02 5.701177638288990740e-02 8.968885317279979424e-03 9.025046062576878858e-02 1.249204010040331631e-01 1.359334494520615666e-01 1.871936307071024874e-01 1.693403657955481201e-01 1.103655996190423955e-01 3.201329167908928963e-01 1.506040023465919364e-01 1.657630083292126189e-02 1.220179981378940459e-01 9.109961973911977207e-02 2.150341275704992505e-01 2.329405708832765071e-02 1.630467667409859350e-02 4.074885052467087238e-02 1.580398962179316996e-02 3.673698470176785941e-02 4.187826659102936167e-02
1.453067152340811741e-02 1.462770450559090774e-02 3.966154097783376048e-02 2.953880695713640425e-01 1.072996139279995681e-01 2.387767609796914367e-02 2.761450444034065921e-01 2.849209853267674689e-02 1.587122588825838967e-02 6.092189896257717979e-02 1.247845526923526543e-01 4.782524308254806900e-02 8.770201844627668886e-02 1.057006945785796542e-01 9.714929401335865855e-02 1.193868936956577198e-01 2.052117435351441810e-01 3.570483168483135072e-01 3.657540022810221170e-01 2.874987551506530958e-01 1.508720597582395399e-02 1.861025606321475498e-02 3.009510684697335736e-01 4.867162451383566513e-02 5.866755869542109036e-02 2.465091510435964695e-01 2.427537252745674279e-01 5.427509954855734564e-02 3.786308209247449263e-02 2.864508559638162880e-02
1.336612919588793698e-02 1.459067662927789229e-02 3.261753027979343023e-02 3.597834108024312860e-02 2.402875294943656106e-02 2.516425864598160339e-02 1.385492953622710077e-01 1.401465620589860059e-02 2.325675765161603833e-02 3.128203233854392473e-01 1.025048017634030452e-02 2.668944890713969009e-01 5.057217142028826856e-02 9.622858479444329483e-02 9.066257742652671092e-02 1.403189011693481147e-01 2.453236466872834587e-01 3.010231018464339936e-01 1.755512368150833336e-01 3.835130358666391515e-02 2.279415795524964219e-02 1.631866731802582848e-01 2.350113804788158955e-01 3.883789988785737446e-01 3.436746061106450978e-01 4.424223639122428775e-01 3.490859232277230273e-01 1.060972234445452106e-01 5.494793028527603096e-02 3.195677550535746397e-02
1.710508183715843053e-02 1.979901358488625820e-02 1.918934051138656768e-02 1.794009840183121221e-02 2.570926839616142351e-02 4.295007761296769366e-02 6.003997059918967510e-02 1.893395946436916832e-01 9.990666739821191245e-02 1.721533744491637527e-02 1.391728450570263974e-02 1.880160528903170036e-02 3.692168733548663317e-02 5.039220896648510112e-02 6.681583191061876703e-02 1.202206475468204638e-01 2.625461202009947703e-01 2.675733250003484720e-01 1.281554538686890676e-01 4.415126778757898218e-02 1.883054958845687965e-01 3.379190819426594605e-01 4.288637651498348191e-01 4.334198274549304064e-01 3.756645915808019542e-01 3.198160833772518696e-01 4.653806464765070650e-01 8.410392638871093396e-02 7.508504618229967786e-02 4.042484578109656335e-02
4.241873380705440261e-02 3.344612805130466049e-02 1.623244119773635183e-02 2.268701333799867312e-02 2.678610347490980592e-01 3.348463611789648936e-02 1.512799888349849187e-01 1.220671795269770155e-01 1.198694333384651700e-01 5.983573203974014432e-02 2.359962457698805416e-02 7.629021872212313378e-03 8.926631579414564047e-03 2.098972770605634849e-02 3.984048888799804344e-02 1.497611677651272954e-01 1.698987932948776980e-01 2.057100146944552677e-01 3.634753797466071246e-02 6.078528733170235343e-02 2.075656613570778519e-01 4.431679728832407794e-01 5.392313908510216747e-01 5.487105133310696825e-01 4.442717714015950725e-01 4.208183696518738026e-01 3.845680788317558663e-01 3.095466127752160568e-01 3.695166690870185788e-02 3.132207698880115632e-01
1.676897087329094066e-02 4.669420292945399009e-02 8.038038606531361374e-02 1.807843153381101173e-02 2.687724466209649374e-02 3.593906304954754688e-02 9.584093846695473928e-02 1.197511041186487268e-01 8.200646975708987541e-02 7.119147164129531469e-02 1.780372063811182931e-02 8.470836235755832555e-02 1.303834165792489008e-01 3.053122501049999049e-01 1.863808083170140004e-02 6.823462045611167204e-02 3.162779593690138308e-02 2.933668965454584443e-01 9.393913834418554654e-02 2.175255584399589728e-02 7.968869712240822523e-02 4.190175027786943174e-01 5.233569083021000212e-01 5.398091825832080914e-01 3.883253405071608877e-01 1.772566229104962088e-01 2.837510373421718302e-01 1.934027307483492109e-01 5.190632844839043053e-02 2.273041982436876107e-01
3.460443327551108172e-01 1.957307518577814515e-02 3.145317548747575964e-01 1.096828682898021677e-02 1.718967762048920558e-02 9.837836825548099476e-03 5.044441393155654763e-02 6.502798441063355195e-02 6.701358003907899319e-02 2.003393311022929474e-02 2.300881593309591910e-01 5.882673996761755841e-02 1.020455473051326278e-01 2.428605310437861042e-01 2.636463653849722630e-02 1.031438012723015149e-02 2.265724043969997298e-02 2.218891091169481189e-01 1.253798627303274321e-02 4.924833858343039689e-02 2.557795689335452538e-01 4.782134383064784444e-01 5.070003409107526338e-01 4.763122786035298151e-01 3.616670850180311869e-01 2.619714265569204059e-01 2.514759646370847146e-01 1.778968599596080502e-01 4.163676546925099142e-02 1.747787172216121732e-01
2.752634377379500549e-02 3.283478074772787358e-02 1.464822510793101912e-02 1.209420393245595575e-02 1.315556689674059546e-02 6.779419985607531424e-03 3.463342672585676546e-02 2.907615984187160788e-02 8.172484387579554213e-03 2.518361903017849457e-01 1.014865752478925076e-01 8.932576956958622472e-02 4.945751106288472088e-02 2.238783181549851287e-02 4.646116667644846487e-02 1.299995956714016798e-01 1.139746990550974046e-02 2.521250380279721481e-02 2.439256135544737997e-02 9.668241549580625094e-02 2.611791124683989773e-01 3.836476931401802681e-01 1.541192330218264794e-01 2.296878437683421426e-01 2.877617306773813666e-01 1.620714461363492176e-01 1.311830754662502152e-01 1.167267407189098022e-01 9.801976536561818332e-02 1.065930254488085815e-01
1.515295127216181696e-02 2.262147536706332965e-02 1.559740387546557916e-01 1.345524198113547121e-01 1.259860942984059595e-01 1.852984418365545283e-01 2.607513790087152561e-01 6.595495864110374751e-02 9.205348537779495244e-02 1.594473798505023632e-02 2.357297953366533153e-02 3.706144862789902822e-02 3.488439749011609109e-02 1.073765511684026952e-01 2.318530255273891783e-01 6.632481278749918774e-02 9.635662125759580920e-02 1.359230974510340917e-01 9.424027192837589051e-02 7.117515533785054305e-02 5.609330493926581451e-02 2.035154588218289831e-02 1.854868996732320641e-01 1.501825735615914745e-02 5.279748173632218405e-02 2.159497310472170001e-02 2.473849470903482367e-02 1.419656199035136401e-01 1.834381062081078678e-02 1.711085599407411242e-02
3.625167270788946100e-02 3.803627792331579910e-02 1.793474932318413484e-01 1.048273810189016969e-01 1.763698723799785040e-01 1.393822643478160039e-01 2.194802236706410170e-01 2.429752030951856656e-02 2.161337481222089935e-02 9.352044546348354040e-03 2.314685289160576739e-02 4.276771211972096864e-02 4.608842899811183697e-02 2.094330123919141140e-01 2.649867418864885749e-01 3.652573460929434829e-02 1.048537000699312910e-01 1.983511955281804517e-01 2.280693247732254736e-01 1.981977099223793670e-01 5.113637253843526104e-02 3.087000984453128760e-01 2.065557994728371358e-02 4.147624263941394884e-02 7.578816158318660290e-02 2.210181493198755051e-02 1.660496096836607816e-01 6.777871719461901756e-02 2.528035216881644939e-02 2.420068152273357337e-02
4.589324354777749027e-02 2.901598330996179032e-01 1.021297650718860361e-01 4.372909649529542475e-02 5.617706125357901231e-02 1.284775173191955999e-01 1.736940144832597732e-01 1.975220762868805033e-02 1.060689101808464860e-02 1.208793197450561997e-02 2.197971716988771779e-02 3.763599841533880885e-02 3.471608620040425586e-02 1.631999668939869419e-01 2.137366366534778489e-02 5.492256582365950823e-02 7.992091550008736944e-02 1.866023921024902721e-01 2.383544731304213515e-01 2.026426548920965687e-01 1.402107467113305472e-01 1.942488754790875904e-01 1.329268569655117083e-01 2.389386678482979809e-01 1.031307945554779532e-01 5.365126235951910710e-02 4.176556684874169201e-02 1.170318603263048457e-01 2.038824177933331802e-02 1.834331113932468130e-02
2.912834860797329853e-02 1.312039427402185432e-02 2.231639335692127135e-01 2.361917893242032329e-01 1.302844722497666953e-02 4.082223586951368444e-01 1.776924469864782918e-01 7.359336321470776043e-02 1.073508457598946197e-01 1.374655635248474284e-01 1.291905209004167582e-02 1.567638391140023860e-02 2.062345285636035808e-02 3.985426583718209431e-02 2.030190594286948869e-01 4.147316608006080402e-02 2.780012004921397079e-02 7.388164447340173080e-02 8.796445526021647032e-02 9.107938179025883152e-02 9.727674408585917920e-02 2.492694728598531806e-01 3.983720787069974789e-02 6.924968396046307650e-02 2.824190654121602195e-01 1.051358900784150480e-01 9.535850481719404526e-02 7.303317837467233897e-02 2.380094681488524946e-02 2.065908115526990038e-02
9.374388049969231002e-03 2.238626123531711198e-01 2.866449913888973744e-01 1.613514101636201459e-02 3.160177169690684962e-01 1.490008900619971266e-01 7.177667078569326120e-02 5.107442700682848086e-02 1.602123982158825399e-01 1.015513617425208535e-02 4.280682863197993182e-02 1.645085321016685406e-02 2.493055207781501997e-02 4.689590732694910030e-02 1.964002254901773270e-01 3.200025966163222990e-01 1.917122107418393062e-01 8.436921711059962303e-02 1.210402409441800470e-01 2.066233320867899570e-01 3.585547910448912412e-01 8.384133258066113481e-02 4.338592551386076523e-02 2.094100090718835350e-01 4.777884239735750715e-01 1.475325115760806050e-01 6.126539699495078817e-02 8.433351222467456998e-02 1.942797380090653947e-01 3.287464635413381991e-02
9.681436343042601131e-03 1.193358191760698211e-02 2.774599104386537007e-01 2.263526111996533585e-01 2.224642670648575848e-01 8.685712579527504751e-02 5.733987641910483213e-02 6.002265074464917249e-02 6.710899516655367825e-02 2.669261252225089698e-01 7.983042266883448590e-02 8.570338734038031314e-02 7.105315795644889798e-02 7.796434170917951323e-02 2.053623617500489329e-01 1.328663122985847267e-01 8.510158139612260253e-02 4.816814891865136422e-02 4.117640549459598148e-02 3.093862612867049472e-02 2.464630551362576028e-02 3.592985244589597810e-02 5.517429336285287894e-02 1.314570149597879267e-01 2.236194916132553945e-01 9.992715526524435787e-02 1.454333247821303354e-01 9.908266794103894048e-02 1.016072247979193516e-01 6.661116813432581274e-02
1.112300965032657525e-02 8.528358175394244040e-03 2.781868850951446648e-01 4.249674996829791995e-01 3.817834905358124531e-01 2.093521061529072802e-01 8.813218124480175567e-03 7.002056634053577429e-03 9.244190440569834133e-02 6.724063141676044075e-02 2.578471475199834925e-02 6.419427339641957386e-02 1.673494434463428382e-01 1.649086411230714089e-01 4.690020971627505419e-01 3.251061044898230779e-01 9.558176285287238449e-02 1.042319126531994072e-01 4.652408723713408883e-02 2.052824677947411372e-02 1.991790855337301561e-02 3.114626276847853176e-02 4.752946058252333766e-02 1.442379048228045468e-01 1.443373284234051313e-01 3.364535627730760176e-02 3.664712581709891892e-02 4.663343741987246299e-02 1.508418342537442836e-01 3.068889775933818578e-02
1.496540174807466095e-02 1.622675601754014138e-02 3.159055105954640674e-01 2.146463963768206404e-02 2.082280516355854150e-02 3.352148517927002608e-02 2.218728690637826809e-02 2.318427786837008731e-01 9.171894783865329470e-02 5.343348504850273933e-02 1.647436479684345756e-02 2.266537532301108465e-02 2.519603562209459316e-02 9.047921712342194001e-02 1.050307053546157138e-01 4.251271115633691727e-02 3.313588558000023915e-02 3.313232449072407021e-02 4.421815915721152845e-02 2.557738805102974938e-02 1.818501515339279381e-02 2.716051476979022827e-02 3.104515647136112111e-02 5.133216360715714410e-02 1.579432041593652469e-01 2.450552715119723099e-02 3.504800586740611235e-02 5.691400984289350651e-02 6.824353735867154380e-02 1.347761545618183510e-01
8.201902117252569263e-03 2.296889341313418376e-02 6.916698552737039936e-03 7.476125028605166978e-03 3.139193181701117885e-02 3.296495597153816653e-02 2.375273558376893648e-02 1.589334908817381653e-01 1.224575472722594094e-01 1.150433007522988355e-01 4.770568613947808595e-02 2.483338346631263488e-02 1.588352031967277950e-02 2.493060418128202962e-02 1.119607052284251197e-01 2.840204140791258852e-02 7.371250955184306675e-02 2.371801542827017828e-02 4.198537915987491514e-02 9.846357265851786444e-02 2.547741029388536291e-02 3.571545277981327815e-02 3.116174386866929144e-02 3.403851727200991883e-02 4.470755451000774788e-02 3.386762533354360089e-02 3.945776738963262253e-02 4.834094423995132644e-02 6.475497016287334873e-02 1.585287948435310235e-01
