7.350344111212860077e-02 1.993297342852845284e-03 8.516741351202324062e-02 1.222328556812085978e-03 7.838191214951389929e-02 1.095537119952756221e-03 5.536381673156862224e-04 1.497484534264723272e-03 2.721592041371608938e-03 1.244371190588123167e-03 1.593336604586371519e-03 5.009878698452598089e-02 3.206085749565187187e-02 1.267773941205422661e-03 1.311675418120321996e-03 3.417942598773231894e-02 7.801589518486525031e-04 3.942736087786866388e-04 7.473848526533809775e-04 1.168913043835881072e-01 1.083098118681717625e-01 1.640320989004385999e-02 1.254513386085310059e-02 4.933891720518410184e-02 9.334853981776636278e-02 7.139387264573436587e-02 3.200406597206729986e-02 2.822126357268680674e-03 2.703009281296628059e-03 3.413499640557883172e-03
4.785492267708776892e-02 1.948632288145068408e-03 1.446329955505079243e-03 1.556352283485733365e-03 6.383930025812147675e-04 3.588831265071581230e-03 1.408226785343587089e-03 1.728204225368214870e-03 8.601076745526343818e-04 5.363272982826636139e-04 9.814868827921732937e-04 2.512341061099274478e-02 3.692316436206921626e-02 8.879112703445495025e-02 1.427138957702869370e-03 9.423969256658862315e-02 7.324987416549086491e-04 7.339457799202025925e-04 1.098585364629911347e-03 8.285477163703950862e-04 6.319863453478673232e-02 1.604729217667580018e-02 3.343849890364773009e-02 2.940808344523195006e-02 2.529288516995919014e-02 3.295340523331892479e-02 1.125382479989042901e-02 2.867388769645682484e-03 4.092304323603353049e-03 4.103222623816104794e-03
2.797023815144407746e-03 2.638476416067969416e-03 3.857760188337910814e-03 3.135114091042631376e-03 9.574097798953526764e-03 3.007671422417296410e-03 4.164729116234516804e-02 4.408420102096055615e-02 5.841754495351885595e-03 8.332374334772730835e-04 2.174301950936618523e-03 1.974294736791813026e-03 1.284988252223021044e-03 2.869640098370414803e-03 5.769606977532860254e-02 2.920825799543242535e-03 1.361953220867337172e-03 1.280201135195845746e-03 2.147511164797652906e-03 1.114964301053030134e-03 3.961916445379621426e-02 1.349386433213554948e-02 2.082224325777325830e-02 7.132335451522290107e-03 4.092965832014545426e-03 2.608394310917267183e-03 2.255179485601818690e-03 1.774506668610814630e-03 3.032041443395465385e-03 3.403903607897521173e-03
8.677264104848964868e-04 2.366633310682223802e-03 5.190796773151973992e-03 4.193040875684236370e-03 3.494020368630114740e-03 8.395578456345179075e-02 8.437993964096164590e-02 5.294690798254499120e-02 2.900728079139197266e-02 1.170365595438896790e-03 5.574581093768982056e-04 1.112685072516937310e-03 1.876503840384130626e-03 2.733111191660492906e-03 4.481930227406812073e-02 3.920224794315822769e-02 8.467591615704964103e-02 4.853059729863950155e-04 1.838425309968494696e-04 3.347869056489064031e-04 6.914371612109236620e-02 2.781728190319435190e-02 9.682376735616936639e-03 1.889389920657295191e-02 3.364251153422713296e-03 2.337453345736725894e-03 1.954691945606191160e-03 1.855012190059504009e-03 3.768327086788585568e-03 4.093550147903963002e-03
4.979620851579521015e-04 1.468660686023356282e-03 4.092761537442829271e-03 1.588455960647822043e-03 2.275133861280143489e-03 4.914877536594613322e-02 8.673452277230950247e-02 4.939639739366495641e-02 1.838370584729301024e-02 3.198500042620625733e-03 2.601729900678575666e-03 3.504170999106737475e-03 1.694428777280608794e-03 1.099215997274912843e-01 5.842018690409920417e-02 2.362182071721518131e-02 2.173980479762336031e-03 5.807896001253259107e-04 6.221409216904752199e-04 3.737377803326593999e-04 3.934760461066662534e-04 3.597353547552531450e-02 9.352929925560074520e-02 3.068924499509467774e-02 6.076734604982359650e-03 3.165460879601806037e-03 2.164340635278173223e-03 2.500657611458301406e-03 3.909904036539872327e-03 1.436335689562765090e-02
1.275528144926366212e-03 1.348150276544559170e-03 4.044573471060696618e-03 2.303968419203432372e-03 1.474493852739296824e-03 2.772696635689275713e-02 3.585458154957237020e-02 3.869245850737044329e-02 3.176540075394407303e-02 4.383180345776097400e-03 4.110010896701531483e-03 3.927062783461440949e-03 4.988485362489874370e-02 1.878389221590478358e-02 1.583852218602303449e-02 2.679627132355207053e-02 1.673433748273630986e-03 3.582847050642386927e-02 4.323324503769607760e-04 7.284719926675060951e-04 1.503460074183487127e-03 2.930233631331480553e-03 1.131903020033803164e-01 1.769742308451260557e-02 9.070303668269174419e-03 8.385474024974247029e-03 5.203093344252849098e-03 3.582075086997226366e-03 4.723009172783489140e-03 8.475882295715764930e-03
2.713142297351817112e-02 4.073844510513027067e-02 3.996011382600479778e-02 1.397237401228826163e-03 3.730467607037661788e-04 1.044329969270770724e-03 2.325018552290223847e-03 1.310494593155868762e-03 1.704297757782019225e-03 1.792713696971235315e-03 2.479278631196727388e-03 6.045990975032575904e-02 2.828344541280575913e-02 1.312324777279785977e-02 7.654026484842597032e-03 1.323956590025113234e-02 7.508281427379780160e-02 3.371906908362990590e-02 6.798396217919268738e-04 9.886388587876063661e-04 8.557462071103902551e-04 3.489530227373835447e-02 1.644161924017240040e-02 1.583953334854010936e-02 6.150882401939634231e-03 6.319280943678002097e-03 5.583087452510474002e-03 4.810997115004819052e-03 5.500493672570962861e-03 1.303310726090371394e-02
5.688972532727352982e-02 1.049423904589241591e-01 5.804132824249989137e-02 1.145888852120264612e-03 8.982199929890956943e-04 1.015431288747694607e-03 9.223255288754303102e-04 5.409546756484569533e-04 9.522238784038556010e-04 8.041744676658255098e-02 3.454258547444295779e-02 1.099355540378667423e-01 2.397901191263984710e-02 8.544123962687283011e-03 9.679758287021297467e-03 1.793303503830915094e-02 1.476853277002385632e-03 1.555791260069864460e-03 8.979732868047405909e-04 9.275108913892207794e-04 4.931884955574220020e-02 2.910647561317850768e-02 1.181545551234073829e-02 9.934824312015821252e-03 4.741613900346765449e-03 4.952784683331344640e-03 7.694194822301468790e-03 8.653594381141962305e-03 8.566929262691910796e-03 2.477852028867828099e-02
4.035920631663079614e-03 8.739638273810369784e-02 5.068803959773506701e-02 2.623584227638328312e-03 1.252777533983060951e-03 7.539492976180001138e-02 2.906638397418333502e-03 1.243197948853611056e-03 1.551028051380029440e-03 1.970544575907938814e-03 1.072658938703551085e-01 2.621684449842597193e-03 3.564389678920630057e-03 1.495401233893933670e-03 3.104727081921132906e-02 2.611969639490416620e-02 5.669932168266612373e-04 9.663247782827040847e-04 1.424036475095340074e-03 6.600045232784963745e-02 1.319139727064755699e-02 1.381301683947970538e-02 1.511018476146438853e-02 9.902746340033564271e-03 5.799572147964292962e-03 8.705173285797219301e-03 3.240739979800864867e-02 5.722360942776861387e-02 2.191122809311717677e-03 7.670493294204919210e-02
2.794141696465432187e-03 2.076400967421615854e-03 3.329137979949857180e-03 1.220871753156193337e-03 1.505926634474963116e-03 3.646375012080440431e-02 3.288869701864943589e-03 8.118473461441690076e-02 3.826422716049337341e-02 1.400332894612368005e-02 2.080547336810981748e-03 1.607847367942719834e-03 1.221567553729967703e-03 1.763668952774204070e-03 9.593861491574998341e-04 1.018437859107751810e-03 4.168898837005975688e-03 3.665092773623575793e-03 2.613101344012059343e-03 2.128350481931312339e-03 1.701272399376792255e-02 1.082373559044759979e-02 1.250596838864909306e-02 1.375581241027584202e-02 7.664397046572257212e-03 9.658303023304297755e-03 8.784056079614221968e-02 1.325376558057833887e-01 2.258664064714964361e-03 4.075220223600625052e-02
2.851577393600827383e-03 8.913073728954896968e-02 1.846836449625192033e-03 6.518448893442817596e-04 2.230505412476322009e-03 2.299602186849320287e-02 2.253215784948141981e-02 2.049205844615635541e-02 1.409860269313311168e-02 1.120598243416082718e-01 7.460198789570758084e-03 7.678412963493666706e-03 1.599695996205068721e-02 7.868734399065911017e-03 1.443772003859057238e-03 2.810907740584625818e-03 5.218262681033225894e-03 1.439709838038191964e-03 7.468807163717700688e-04 2.753611198724154399e-02 1.168884348797846230e-02 1.052729663365538013e-02 1.370820543657566906e-02 1.920770083591744753e-02 2.048773341799729752e-02 1.104672203637385025e-02 1.715707200587976780e-02 1.272937624946366385e-02 1.128531557824775412e-02 8.049575155889627381e-03
3.978288519942753398e-02 2.170807066415295083e-02 3.563471940300167937e-03 3.135362099570633033e-03 2.802845826995472092e-03 3.743714814703903715e-02 1.746389373410522569e-02 1.205197527154837009e-02 1.437822269463983477e-02 1.695108001398150334e-03 2.257100797947845985e-03 9.707262483135449538e-03 1.625250757243157027e-02 8.365734886953227548e-03 2.990788443750841061e-03 3.338495008477251370e-03 3.699949846627634872e-03 2.193837127817290303e-03 1.215825225244537670e-03 6.205881682307558961e-02 1.105215712061021101e-02 1.134571462967196714e-02 1.352480734077964562e-02 2.426667855445209174e-02 2.307292143855970562e-02 1.643947794185987923e-02 1.262675013037748567e-02 1.148352121291748573e-02 1.257666947606202006e-02 1.366249501886341276e-02
9.432685597828718502e-03 2.258898093124645651e-02 5.072021608045236551e-02 5.849503794734343259e-03 9.223872514584662008e-02 3.164543950698704700e-02 1.752618435363348728e-02 1.521340292579616976e-02 1.943538421184369536e-02 7.539742237023120200e-04 3.741135169452998455e-02 3.439352461868903921e-03 1.187748109016845133e-02 5.028764648494363915e-03 1.561108583391968702e-03 1.780683442516836678e-03 6.646686064695319154e-04 9.890013076059441747e-04 2.040650778780333813e-03 1.033756499112797574e-03 1.046674200703884630e-02 1.156872700883056389e-02 1.476455857152029691e-02 2.465639652695037279e-02 3.135320990789957490e-02 2.749879152314467848e-02 2.036875572409559132e-02 1.932427312946523659e-02 1.715597353152281332e-02 1.436512109615030279e-02
8.158728338063735500e-03 2.294973164365467222e-02 4.048514420786675228e-02 2.923396395829999661e-02 1.741459390132333446e-02 6.762927802605693539e-02 3.690929617478456298e-03 1.222988850100100930e-03 2.696079507445463611e-02 8.851851876048078688e-03 3.165264697667225652e-02 7.512617647653486259e-04 5.301265985777350691e-03 7.057130016594679624e-03 7.399433722199394436e-03 9.809181059321469762e-03 8.997351884913396686e-03 5.975052648500243750e-03 1.667979507175713569e-02 8.292473571445696176e-03 1.647188073934131121e-03 6.808280999282578794e-02 5.164664994443535911e-02 1.238131243123316294e-01 3.149603146923294229e-03 1.686938860927211922e-03 3.829046873443126432e-03 2.074876977256841660e-03 2.340927093789504226e-02 2.742242098237002504e-02
7.660636114190098531e-03 7.635320646534573402e-03 2.082897017248320701e-02 1.564849147331756063e-01 5.737849748984393677e-02 1.272388969856213560e-02 1.785090658780407206e-03 1.385602827431867048e-03 1.143849883177357803e-03 3.365536667560899142e-02 6.960029144425158854e-02 3.574786103159084943e-03 4.634465890414905809e-03 5.791509073004491581e-03 5.148307231840764005e-03 6.116309983479654815e-03 1.071580629421076993e-02 1.910144121080216417e-02 2.004945082487747526e-02 1.619731102347560583e-02 1.356517215454027241e-03 1.936483866602232160e-03 2.234287395736411254e-03 5.042044716213282124e-03 5.454307422921409083e-03 1.612067609176188326e-02 1.621160244629718181e-02 5.155569200142400520e-03 2.392835711184630731e-02 1.852998261579090131e-02
7.043908151125892816e-03 7.637907060808293500e-03 1.715939070764611191e-02 1.910740851191769507e-02 1.287351269852752764e-02 1.340585421444488376e-02 7.360032595453266935e-02 5.743881862116186109e-04 1.303505843257132899e-03 6.639858278725264658e-04 7.067934398556543346e-04 4.896627041898017141e-04 2.554957905592878092e-03 5.110553068056525143e-03 4.705912811453981728e-03 7.108009291083267935e-03 1.272659666789349026e-02 1.607814624507647450e-02 9.659904785957736800e-03 2.180691049414951090e-03 1.343055890656645992e-03 9.446171762314081385e-03 1.407214672909812107e-02 2.398181259269746221e-02 2.279231629454070776e-02 2.993907369564359836e-02 2.411980357913517600e-02 9.150798062462382407e-03 3.432568141423181923e-02 2.027397659883712136e-02
8.994746319726916461e-03 1.036129873175326184e-02 1.011937708018858378e-02 9.507464187300454853e-03 1.374498514057967587e-02 2.308004873441143676e-02 4.008096315764006143e-03 1.080298087159594494e-02 4.478624472730109891e-03 7.722130519240055693e-04 5.758796777542774577e-04 8.993745171171959457e-04 1.772620589767897855e-03 2.590206480706520875e-03 3.386370572303214893e-03 6.002825124679357811e-03 1.350231208441488549e-02 1.426662960486371062e-02 7.077777250817712459e-03 2.531375289133492960e-03 1.125427600202652881e-02 2.100254167820391274e-02 2.770010743697413208e-02 2.892727994858352095e-02 2.572262211344514618e-02 2.236141885378900573e-02 3.314986791290713830e-02 6.851787107108239620e-03 4.436087523622038453e-02 2.400938333391901963e-02
2.238862864691226057e-02 1.759330094377218115e-02 8.609985121437204597e-03 1.206738009879385759e-02 7.832403232638569151e-04 1.867924032253168425e-03 7.993055148181245698e-03 6.028052082755094333e-03 5.798771454807533955e-03 2.931223540526417624e-03 1.417061798659853371e-03 6.085709937505461627e-04 5.879373661575054309e-04 1.199611049589600388e-03 1.627289106112522711e-03 7.412621735464426653e-03 8.198254026959573768e-03 1.109359546131528235e-02 2.024815840037566539e-03 3.716879960673568229e-03 1.258572826534241559e-02 2.815229448679389818e-02 3.587313630584106766e-02 3.785126174844603841e-02 3.148160314093739753e-02 3.040334732306391313e-02 2.818983229813657246e-02 2.380082805655104120e-02 3.463153907303285085e-03 2.690449424931182828e-03
8.963014978149446907e-03 2.470063394075144858e-02 4.311098772495260134e-02 1.233628586011120774e-03 1.310913962979318821e-03 1.513428559155471313e-03 4.645125143075939066e-03 5.625254572496851679e-03 3.744465529503869343e-03 2.943065620600175333e-03 1.130366461686455612e-03 4.533161161303531084e-02 6.817049094042179624e-02 7.854119558978940076e-04 5.937542923444797272e-04 3.533396526699156357e-03 1.414408313958208634e-03 5.284670991458952907e-04 5.179146647931062719e-02 1.369537402251771920e-03 4.885188236065522542e-03 2.653954356701098208e-02 3.426505716572376264e-02 3.670232438515108608e-02 2.735329431662601729e-02 1.287912734214513924e-02 2.108007132425852512e-02 1.438915173207442125e-02 6.260396008560029958e-03 1.335273909882689347e-01
7.754696255561181750e-04 1.311158552166548363e-03 7.780225672048249504e-04 6.660249882964136515e-04 8.495343528842760417e-04 4.700595785252637123e-04 2.324374920526237846e-03 2.876331443630622455e-03 2.548706226537514417e-03 9.982580885616444775e-04 6.648371110431739416e-04 3.091278101199263634e-02 5.282792505265521826e-02 8.255371935954225644e-04 1.129840506590664827e-03 6.750735987928229353e-04 1.149443531701279568e-03 3.465059926006062454e-04 6.660252032989090595e-04 3.180288140600752260e-03 1.579727931507077243e-02 3.007488727518722524e-02 3.248711273760400420e-02 3.183179750289618498e-02 2.531685010649221620e-02 1.913132465001616059e-02 1.895894614333702016e-02 1.551239151129429894e-02 8.522106325113557382e-03 1.070807083885388367e-01
1.072166460783759503e-03 1.407949227563041680e-03 1.100412688210215643e-03 1.072583867916703133e-03 1.181911334295930680e-03 3.857300315331602873e-04 1.300934763226309744e-03 1.446913868187439233e-03 4.294737567655212192e-04 3.952918929902800088e-04 5.204972812746370275e-02 4.614247614213568688e-02 2.577170744672288918e-02 1.203544099449589677e-02 2.602323121334336811e-02 7.734017815401281193e-02 6.457230112238284640e-04 1.320892961631595260e-03 1.318673472722096951e-03 6.005950650064702072e-03 1.625648207458627037e-02 2.332698730331372178e-02 9.402023932965257805e-03 1.471367617205593219e-02 2.003017478143940058e-02 1.189920335088751058e-02 1.240393346071228149e-02 1.299851770633517721e-02 6.043925466743630542e-02 6.572995388039509779e-02
8.687192261858217015e-04 2.138486574899031364e-03 8.932286773163883309e-02 7.640272198899467071e-02 7.007872758745049835e-02 5.404656024303981657e-04 3.441664542217459069e-04 3.393230764079491896e-02 4.735883450819584201e-02 8.196242811742410553e-03 1.208972311927558607e-02 1.936619653696130053e-02 1.867688879539370836e-02 5.904005433460447066e-02 1.056695537749901539e-03 3.657042169357123916e-03 6.397816895819741050e-03 8.322506135149626214e-03 5.874261984750704137e-03 4.488943782381246174e-03 3.137219534814294965e-03 1.105787035090062369e-03 4.220131457314453029e-04 9.567878769133076602e-04 3.678159628925112366e-03 2.374858076096635160e-03 3.696071639200887091e-03 8.777885151289209487e-02 1.136910614562507658e-02 1.061441022528192626e-02
1.805937727375625957e-03 3.639690433744138375e-03 1.005523413583318953e-01 5.885699212249662082e-02 9.677931838998844738e-02 7.242588323655423099e-02 4.532596283886772661e-04 1.223844559981442960e-02 1.141915966821495723e-02 4.964109889534010223e-03 1.233814621884938081e-02 2.283276078658644237e-02 2.497829619697543302e-02 1.159278532704229869e-01 1.503168212327737896e-03 1.654835040893855042e-03 6.256719347831886553e-03 1.205087821437990717e-02 1.408510882505641625e-02 1.248441320511463511e-02 3.606669618739636197e-03 1.382264489301282236e-03 1.659342808152963452e-03 3.248220102926427811e-03 4.413363659363208139e-03 2.424816752968221838e-03 1.024913965348618755e-01 4.210131017535448383e-02 1.581376681635304413e-02 1.521439858322357411e-02
2.211555118215504691e-03 8.542197835982510935e-04 5.627861059623932155e-02 2.418893446330209682e-02 3.045053580658370687e-02 6.673085539092728224e-02 8.813702080095317526e-02 1.010150991594211192e-02 5.693090836315069757e-03 6.522614391291751100e-03 1.189884397964064734e-02 2.037336754745242354e-02 1.900913036062773509e-02 9.121279473122949344e-02 2.847389617430987063e-03 4.024595013202260201e-03 4.743142953587505505e-03 1.127378428241635269e-02 1.463247874980388649e-02 1.276917771559301154e-02 8.840951593496111302e-03 1.136439851113621030e-01 7.641280004120873381e-02 1.695834813322054250e-03 5.164245642573537382e-03 4.014326762571613846e-03 6.133771187655475896e-03 7.321352316772040958e-02 1.290885880793260498e-02 1.172533594627763257e-02
1.197150061972588426e-03 9.117170298324894914e-04 1.176732350357488077e-01 1.251515685407913192e-01 1.254126919660795590e-03 9.879307231021609761e-04 9.421046899452545365e-02 4.000105907569385943e-02 5.834829540842685625e-02 7.497753988728785013e-02 7.065049824720118915e-03 8.542066055111742495e-03 1.127168709201743779e-02 2.188890810712682683e-02 1.099483517373771313e-01 3.186766575967227202e-03 1.455676586196831025e-03 6.938203765901088636e-03 8.151829412729608496e-03 6.347343965557012899e-03 8.270832399762888254e-03 2.577250870616311362e-03 2.303787849711256761e-02 3.722656599769972458e-02 4.582957410065994532e-03 3.148257375445359055e-03 1.085082037248891879e-02 1.449353820727971101e-02 1.527794646454038938e-02 1.345620488719239012e-02
4.267393856749972909e-04 3.479359859631147092e-04 6.974118575546045789e-04 1.510675689390047821e-03 7.586957443633744183e-04 7.839753892104853183e-02 3.814363944202390361e-02 2.789834738709102979e-02 8.735845327812503947e-02 1.635948566745967347e-03 2.326808601560559700e-02 8.672513589508611814e-03 1.287098623401314833e-02 2.368133682856278510e-02 9.792785986057134240e-02 2.739913723566727004e-03 1.031435913443997238e-01 4.878278786121052063e-02 7.181381904515678205e-02 1.218340147936517043e-01 3.205208109095257756e-03 4.948159973679561868e-02 2.538915287161362666e-02 1.174629276118868276e-01 2.240951555429920861e-02 8.250288990986630322e-02 1.221207455100304859e-02 2.221041702163398593e-02 1.255894823493038936e-01 2.159826751639971551e-02
4.322585949911517600e-04 3.379963343789920728e-04 2.687560499213169580e-04 1.140992282364746147e-01 1.173367904403966877e-01 4.627157517239670337e-02 3.138752746954204254e-02 3.278665322310155700e-02 3.657688123872230440e-02 1.459948970709951110e-01 4.309197694256095695e-02 4.338946925523806675e-02 3.498095203962713062e-02 3.544821328310932690e-02 8.907895011939069574e-02 6.025978555877106041e-02 4.311716842745883654e-02 2.738952879530845430e-02 2.421304715681648137e-02 1.830055449455988970e-02 1.464185872434960178e-02 2.133608486584548727e-02 3.251624864695811662e-02 7.572509551219025470e-02 1.291141725501082360e-01 5.809676508247327981e-02 8.947246087268310999e-02 6.298884035765338341e-02 6.577189677796010936e-02 4.376477530357064660e-02
5.867301139036364566e-04 2.977396988981178085e-04 2.758497919085642716e-04 5.562789348995630413e-04 6.029276426423504226e-04 1.140514495049079480e-01 7.584665826929133008e-04 7.110520199682939402e-04 5.044111189673682744e-02 3.682182177876224677e-02 1.388691671132476040e-02 3.236508687906478055e-02 8.147644103120391113e-02 7.452566872732331593e-02 4.581358127554912597e-03 3.426265808050870092e-03 4.888857032728139568e-02 5.920746870685657942e-02 2.736140183732713865e-02 1.223992802746304634e-02 1.188694655303279731e-02 1.853853958878537433e-02 2.810237467846504744e-02 8.562720125098115254e-02 8.624857895492014925e-02 2.038501558886075121e-02 2.274686449556329731e-02 2.968254455264762726e-02 9.776252426414931695e-02 2.016777659746015958e-02
7.892504581647426026e-04 6.650388428431638172e-04 1.932928966749034277e-04 6.311537845730493977e-04 8.639111651911117419e-04 1.600702615572895896e-03 1.588911618606471312e-03 1.268393124342332978e-01 5.018592473081952970e-02 2.932949604367142415e-02 8.953650420288259554e-03 1.150472319101353974e-02 1.235068853746803912e-02 4.222406856155871968e-02 4.829059680300366170e-02 2.037746913583644154e-02 1.718264158911805839e-02 1.894257027213228778e-02 2.606382989650139065e-02 1.524891956985206277e-02 1.082497529587463959e-02 1.611305593859584107e-02 1.832921980281162350e-02 3.055055714178519718e-02 9.497691673376840171e-02 1.495386593097844559e-02 2.179941404668151589e-02 3.616023652487164453e-02 4.409624708177874164e-02 8.829169757739252500e-02
4.321317160201051727e-04 1.050228899215411389e-03 3.023483691222405038e-04 3.108491441439689283e-04 1.441313479466524916e-03 1.493204342816023111e-03 1.564516753961985246e-03 8.937431872088559548e-02 6.905834880395199382e-02 6.467690491528919894e-02 2.663139359815617016e-02 1.345762929639204505e-02 8.076504225574368187e-03 1.266464066774088300e-02 5.771711144599368098e-02 1.510881890550896077e-02 4.122625709612027373e-02 3.051475471863596047e-03 6.219192407812856524e-03 5.811976875489988092e-02 1.501994130387191741e-02 2.102132816540676699e-02 1.830108966057832770e-02 2.010805329611825218e-02 2.663735483712946495e-02 2.042136416810985330e-02 2.415264887169662686e-02 3.008456912872952208e-02 4.099252716322535767e-02 1.012628556224030585e-01
