2.457475349877673576e-01 3.556967966874996501e-01 2.994205540830515155e-01 3.689881516726503663e-01 2.573664041017615922e-01 5.337506815734679444e-01 4.843830567960825118e-01 2.254071444015707387e-02 3.226445294847057194e-02 4.107119524654255505e-02 5.718609986978150372e-01 1.472873938442432751e-01 9.588048094067680438e-02 3.781637739250255370e-01 4.671486308847906388e-01 1.106098544916637727e-01 4.169401366681559917e-01 1.053837338818979646e-02 5.289106429024802679e-03 3.077230824221405814e-01 2.868040262578198107e-01 4.273027576633559727e-02 3.262876415871193703e-02 1.303156969109121877e-01 2.526000551854151177e-01 1.976392283432238106e-01 9.057678620943952763e-02 7.917419140192694452e-03 7.500138598638557939e-03 9.354842695798828642e-03
1.614916153110523556e-01 3.437532087239050793e-01 6.035747123494570321e-01 4.533216943671877774e-01 3.112596593454364791e-01 6.120963111986357785e-02 2.418551551345267045e-02 1.842894041170266978e-02 8.708047262618406198e-03 4.430591868743504746e-01 3.556545616583771108e-01 7.727381118192866438e-02 1.149737649022921915e-01 2.944422146369251592e-01 4.272986318946614404e-01 3.042282716218376315e-01 3.867069976939665477e-01 2.523990982524495705e-02 7.726448440149020006e-03 3.668009657170939186e-01 1.639443964670078413e-01 4.090143112069948711e-02 8.448966440971020231e-02 7.551457504176900537e-02 6.678704377403915649e-02 8.934751888721804980e-02 3.130364437527605875e-02 7.931716257884866353e-03 1.124506286014991495e-02 1.119629442269300286e-02
3.543463838176327818e-02 4.624345949972107073e-02 9.462992237845085919e-02 6.858469506662188964e-02 1.212130799422316690e-01 2.155278352511575540e-02 1.298005700084184644e-01 1.350059614857604118e-01 4.711801608485688408e-02 1.422387129150627996e-02 3.985722704142222877e-02 4.878161168996507369e-02 5.307260767407158131e-01 6.273286951266127121e-02 1.763737813396266951e-01 4.017493927932220404e-02 5.920992010670587113e-01 2.409436073338570156e-02 4.380953615577024007e-02 9.122668420295887079e-03 1.030190795220776862e-01 3.377215984156299589e-02 5.109765477354605984e-02 1.774816346417336030e-02 1.052305920455679639e-02 6.915034071157259363e-03 6.155538057269911364e-03 4.836699750477633890e-03 8.250678094105023258e-03 9.250469369932847255e-03
1.515154407728928725e-02 4.051993484667788109e-02 5.318482632333627197e-02 4.285737785864784932e-02 2.761687568847946694e-02 2.654263068404816295e-01 2.615511964889405960e-01 1.609150892856436033e-01 8.637143720217539677e-02 1.117006647125377838e-02 4.498342073637438543e-01 3.563744048079078158e-02 5.208631852391988337e-01 4.167415556505844054e-01 1.290737564134332716e-01 1.085402798956840720e-01 2.372964150236089309e-01 4.651610115422840086e-01 3.636141339419493579e-01 3.366686175630004274e-01 1.849495239857194273e-01 7.130611495609986972e-02 2.381980712230887323e-02 4.690441051725404570e-02 8.553341142056979790e-03 6.090332622856228784e-03 5.215630041741566546e-03 4.948605767174138470e-03 1.004550363143947439e-02 1.091303906621504498e-02
5.118827714756660763e-01 5.870830271999355476e-02 6.356073146861129786e-02 1.615497764280639584e-02 1.737712502647439233e-02 1.546754614230619884e-01 2.675404689857955876e-01 1.491613214285487932e-01 5.428257175235295939e-02 2.900293683733490974e-02 2.766933411970065246e-02 5.522584266980789386e-02 3.133929444131522968e-01 3.209458152863141622e-01 1.656899728304430386e-01 6.631911123767150751e-02 2.943018378034071431e-02 4.423013668867157300e-01 1.771090131672683685e-02 4.143750483955018771e-01 2.940340880735703433e-01 9.134484128903710976e-02 2.322556235763733323e-01 7.654454567799311160e-02 1.536679516088701111e-02 8.126293859590329183e-03 5.640662380872296655e-03 6.513022589771272006e-03 1.016930064190735110e-02 3.733088393092859336e-02
5.879737529525027595e-01 5.480504538338126785e-01 5.466860808160218382e-02 3.353759961955134206e-02 2.757497622966489231e-02 8.983373027103243313e-02 1.152494456032690795e-01 1.219169058491757357e-01 1.008757981937880577e-01 1.212301891152654382e-01 6.262715675054633668e-02 3.666776874784200002e-02 1.396883552834851105e-01 5.227522510190290433e-02 4.351933500426171525e-02 7.540208363739873965e-02 4.102216658539481475e-01 1.057878621036397043e-01 3.352338740791008243e-01 2.817638456851538978e-02 2.012374608281329233e-02 1.695773404167369436e-02 2.834090018067229044e-01 4.429915122532768201e-02 2.281355269584311313e-02 2.122079465248029317e-02 1.325383025263661418e-02 9.115808090999500887e-03 1.200361377087468852e-02 2.150736578211409622e-02
9.551565250859218870e-02 1.445061335714207251e-01 1.391467089090598352e-01 3.581630367148208594e-02 3.132108963012519287e-01 5.258850176854169556e-01 7.595719665404480903e-02 4.724437653335390452e-01 5.345729137788918228e-01 5.650167584515624064e-01 4.006350479109129781e-01 1.696394841024695954e-01 7.718602721909147146e-02 3.546698117598705985e-02 2.067556530474558979e-02 3.813109125337191957e-02 2.228073854514767693e-01 1.037895609048283818e-01 5.045039534781677881e-01 2.660331730445177761e-02 3.262763376393792436e-01 9.002005357876216585e-02 4.155196509171897590e-02 3.974305489348588238e-02 1.538778861852111227e-02 1.579590417691989143e-02 1.405731538902390068e-02 1.216524767472085787e-02 1.406530127736983771e-02 3.305729760103112008e-02
2.081214443378248402e-01 3.854610819609817773e-01 2.012515005783969690e-01 3.935924425358773293e-01 5.791937789626547817e-01 5.517003118435737791e-02 5.813970466427035300e-01 5.765928202648150647e-01 5.016517063665471010e-01 2.756263794148695601e-01 1.078388438284678397e-01 3.174373256596557669e-01 6.771684593339118152e-02 2.346520030954452399e-02 2.657250564564962031e-02 5.046486826165862138e-02 3.981598448282758773e-01 6.231512064588735633e-01 5.458496848420693048e-01 4.151858092223025820e-01 1.318935604324307509e-01 7.525743716534039063e-02 2.975216888873968499e-02 2.479261776357674293e-02 1.181352747605030583e-02 1.244711899233377252e-02 2.023235717801491820e-02 2.581934735113723678e-02 2.509431315834546525e-02 7.131445057286348033e-02
5.303321458496522700e-01 3.414747638229965188e-01 1.803692354460107727e-01 9.425577704441270854e-02 6.023284075470317633e-01 2.658883786818714845e-01 1.098806902208579184e-01 4.270223409869062237e-01 3.922466786116445836e-01 3.855022235411794673e-01 3.334806855128573111e-01 4.068456567571857585e-01 3.933579875904233414e-02 5.504285842311802401e-01 8.643776717881333782e-02 7.357337337879843453e-02 3.031690098506242825e-01 4.154511583869154728e-02 3.763634531090583740e-02 1.809510397189345587e-01 3.480344810802149524e-02 3.508539202746292079e-02 3.776531566935466266e-02 2.456813049469123295e-02 1.439341318943041306e-02 2.206287800924920661e-02 8.761673186724833196e-02 1.724099477964025073e-01 4.798852924268137699e-01 2.286845994622507816e-01
8.605440066829213031e-01 5.443616509707367435e-01 1.625992045992916413e-01 1.007554454378837283e-01 5.890982961238929727e-01 1.205213116370510706e-01 6.090690172094096466e-01 2.752931354010685894e-01 1.303324318546350280e-01 4.575787551087821120e-02 6.070107329969122167e-01 5.047376193765500396e-01 3.068710931200440556e-02 2.597377907076826170e-02 5.401005575742018339e-01 5.381912474452027473e-01 4.702893799277588910e-02 4.240968914358094616e-02 1.950493491059410861e-02 1.277906925457793913e-02 4.359477173536630695e-02 2.727585005143415980e-02 3.099265449690640287e-02 3.392295430703707454e-02 1.893774926089201657e-02 2.428508226875147891e-02 2.343703515199941356e-01 3.895974375979787685e-01 4.675736127944902232e-01 1.183273023553115533e-01
7.294106582694909191e-01 3.670823063156696264e-01 7.738789163951711458e-01 6.330890846857262222e-01 1.304537671874414495e-01 7.642510839904148590e-02 7.014121256664729298e-02 6.449978268736493436e-02 4.279920821969101369e-02 3.283640420879752053e-01 7.883213451849610531e-02 9.772188931966858949e-02 1.392955846403519937e-01 7.832581323698702136e-02 1.826745812063128999e-02 3.461103826112686688e-02 5.157925731627878430e-02 1.971351112890118093e-02 3.022466196770888791e-01 7.363754300220287652e-02 3.008493769450606287e-02 2.661781351951182997e-02 3.405845135801809087e-02 4.745593274595137634e-02 5.064228162304316994e-02 2.755438116511188529e-02 4.431020522624667252e-02 3.421835402440344398e-02 2.976640391804992111e-02 2.070546820703375590e-02
1.415279976469796808e-01 8.111063015630172457e-02 6.908331230718118832e-01 6.566816740218464066e-01 5.127635996524395612e-01 1.197540800374891079e-01 5.177336183542485815e-02 3.530892823883246406e-02 4.273398240072920351e-02 1.566211997598399366e-02 2.517509382346645730e-02 7.303466430247461394e-02 1.237529489572392755e-01 6.388395619665691860e-02 2.296289684780554452e-02 2.875499459545955219e-02 3.172940948179150261e-02 3.340163259332450812e-02 5.068839153484693272e-01 1.680516136266121674e-01 2.886793289412795463e-02 2.905952194089654259e-02 3.413513451104536328e-02 6.077882734677934884e-02 5.756052419333443360e-02 4.091092304586708972e-02 3.133429695010728211e-02 2.790168496766628342e-02 2.970715278891446903e-02 3.135607338332149080e-02
2.919395194423795442e-02 7.336281000345133696e-02 1.722973034240312395e-01 4.772504647866385175e-01 3.119677225997956604e-01 1.015696795236320366e-01 5.431691364145382894e-02 4.743399060632236958e-02 5.920559414303863677e-02 3.807721356918996047e-01 1.052055900205815103e-01 2.737128620726061654e-02 1.010794003059659885e-01 3.921659448510118884e-02 1.233025782869460497e-02 1.584863263880853870e-02 4.997308563691268413e-01 1.316004049679941022e-02 1.994707179806949268e-02 3.545930890040950301e-01 2.776280988923954252e-02 3.019118447480566292e-02 3.785563476484268136e-02 6.248092079908564717e-02 7.903174039082908053e-02 6.882665176395194595e-02 5.090611708692582837e-02 4.663671829716570238e-02 3.984389093558055039e-02 3.209072985586360061e-02
2.435487858144477769e-02 6.956316228760414666e-02 1.229872498627862798e-01 8.817840030522813843e-02 5.201501496386985030e-02 2.056546584522579990e-01 6.994139208560049559e-01 6.137373144718698548e-01 8.173191923200291698e-02 2.518169350210586882e-02 8.880036218840219042e-02 4.703566797001019206e-01 4.616790805673995357e-02 5.636766995074012770e-02 6.026674336271792970e-02 9.065914965561544525e-02 8.154907433551793206e-02 5.285883852994311544e-02 1.482012925458741637e-01 9.157523380868309859e-02 5.011262342408774328e-01 1.819274694384111768e-01 1.352549444983828786e-01 3.177570993014287026e-01 1.645848023709042818e-02 5.374816397605586271e-01 2.915657462014415238e-02 5.254104969939509262e-01 5.355978503554091608e-02 5.994118432355000081e-02
2.248486739868004597e-02 2.258042305748868966e-02 6.105958507078608488e-02 4.539731389531053152e-01 1.649321822962430684e-01 3.790478830818460459e-02 4.665358273921841881e-01 7.587724498349913971e-02 2.354089186354185390e-02 9.531136527320584195e-02 1.960301555904637449e-01 3.862790633576798638e-02 4.715589915021423106e-02 4.697590331441279382e-02 4.263980796893566960e-02 5.179906335960138275e-02 8.904758230417818277e-02 1.550928918608515117e-01 1.593193611081377414e-01 1.661992523096187946e-01 4.837949048573120803e-01 5.388987158030945634e-01 4.445484001605670143e-01 2.892744130370712707e-02 3.420658221235583357e-02 1.258452127031820800e-01 1.515351826254991985e-01 3.304510661076330569e-02 5.456760629186274691e-02 4.057964767249514632e-02
2.043115795841718083e-02 2.222377491846409467e-02 4.979243720090036074e-02 5.498982523473355810e-02 3.677402279106077587e-02 3.883811908571995625e-02 2.161565898075797354e-01 5.779312424625644429e-01 1.486178139784962403e-02 4.860125442811306651e-01 5.250065476487481009e-01 4.132947540336411874e-01 2.417247628674319693e-02 4.206376904872346362e-02 3.946254690946902899e-02 6.083886476454517661e-02 1.064452992577628737e-01 1.308734505643462664e-01 7.660829888931276754e-02 1.901890300332763004e-02 1.371683192855059109e-02 1.004100735448162640e-01 1.305514478379767029e-01 1.807137294474806255e-01 1.519998673562589775e-01 1.950283875204676942e-01 1.531096884704768735e-01 5.018208158404250524e-02 7.850430558793240754e-02 4.531243211265924969e-02
2.586976385976719889e-02 2.979513865609471901e-02 2.901085996615660606e-02 2.719328146346299685e-02 3.898542176440674550e-02 6.508945671794139076e-02 3.567354888120483764e-02 1.052180276700231260e-01 5.908107847545621821e-02 1.218165719104247029e-02 1.238712946120217907e-02 1.905059655209718344e-02 2.812580451478389684e-02 2.859673744115166436e-02 2.879483471683873599e-02 5.199288761463224939e-02 1.138278828702417311e-01 1.165248813515886717e-01 5.605269610082543041e-02 1.940008338613063640e-02 8.300321386693575165e-02 1.491539266621903503e-01 1.894330052866032010e-01 1.915372343823081303e-01 1.654503670827253137e-01 1.398708526501038496e-01 2.015610872933029929e-01 4.616777519566264698e-02 1.077180381863804132e-01 5.778503261219447573e-02
6.395060237951141757e-02 5.003867221441370139e-02 2.438420039081584667e-02 3.410624527866312761e-02 4.022842532992189080e-01 1.872767290676564250e-02 6.852878178657551000e-02 5.445058579067323101e-02 5.351839142387539161e-02 2.635952038953216434e-02 1.509126554361148349e-02 4.856748508756776328e-01 4.669080492734158372e-01 1.491819140015430978e-02 2.091765445884943495e-02 6.468781092503639307e-02 7.890875176895700838e-02 9.806841123450475706e-02 1.733131790199015851e-02 2.744779660417056774e-02 9.153763284622860874e-02 1.958163515518304143e-01 2.388092729251952151e-01 2.427824683061078903e-01 1.953733846422726350e-01 1.824681301964505842e-01 1.645678993600042939e-01 1.660444817468748890e-01 5.445912484506169049e-01 4.489776330944525440e-01
2.572415748950596451e-02 7.103411215135281565e-02 1.220665276497002322e-01 1.258979317792787052e-02 1.458548020295997658e-02 1.855342454410252584e-02 4.166394909777817318e-02 5.232050625818693290e-02 3.596984390861975023e-02 3.475545129397608624e-02 1.265246522874026100e-02 1.318686747188583808e-01 2.021372446375329091e-01 4.694853499787773887e-01 1.174141675035501702e-02 2.972779650878475122e-02 1.666910514847116942e-02 4.412691109642402076e-01 1.392981268304789022e-01 1.248130208413230670e-02 3.538305974553173500e-02 1.876870969672335687e-01 2.365637744400514164e-01 2.428418914863539058e-01 1.724460106875161658e-01 7.726303922025663795e-02 1.216272865868335690e-01 1.271338594702332292e-01 4.782307673403206338e-02 3.276810562256742276e-01
5.399822587362007598e-01 1.495030062622693286e-02 4.835695132917192662e-01 6.780455456078314340e-03 9.258242682516588246e-03 5.217508012944746011e-03 2.669880925526425461e-02 2.772011168767919004e-02 3.249678284887283497e-02 1.173098303790179493e-02 3.554081844185711936e-01 9.082724987529842975e-02 1.576076285336380778e-01 3.756231549252971869e-01 1.781071591359544362e-02 4.917512837943202424e-03 1.264851037669904171e-02 3.382722623371898218e-01 5.487507174717495273e-01 2.833520564140414380e-02 1.141465729820702185e-01 2.169185979384699314e-01 2.337616114629520736e-01 2.176709711930373270e-01 1.620940653612670257e-01 1.149240365986537865e-01 1.083148168076584206e-01 1.047440019376574827e-01 5.759577235708497334e-01 2.514033459105001755e-01
1.791827710831965167e-02 2.368151361048665207e-02 9.547638671051041775e-03 8.296101514774783733e-03 9.287722376993580442e-03 4.661047883028225369e-01 2.285134695232127200e-02 1.560804609842900842e-02 4.476815123439706681e-03 3.930851007943783060e-01 1.583767521125104549e-01 1.393666108336834852e-01 7.722069349560405083e-02 3.502694572659678651e-02 7.283179998879035777e-02 2.041043484469044489e-01 6.005522157912648352e-03 1.631721424548993396e-02 1.530371630079738546e-02 5.473202708994468618e-02 1.167525459560363049e-01 1.818664195427679431e-01 7.476187536314543580e-02 1.099849321222270415e-01 1.303373779360476048e-01 9.203991676969670854e-02 7.768491696922255607e-02 8.751232089457822161e-02 1.407795311659936766e-01 1.531622368597654604e-01
7.038924246759071732e-03 1.304623672644516542e-02 2.442240485145685536e-01 2.081499207257853090e-01 1.942131361160698566e-01 2.862604604577103640e-01 4.061870448471590067e-01 1.025309654222797962e-01 1.440771010525447593e-01 2.496248038550144890e-02 3.692304896454311897e-02 5.805758550890654374e-02 5.474449786318448530e-02 1.691371109028937947e-01 3.664909558664312117e-01 3.899304021855275193e-02 4.395710235950985728e-02 5.891231794287789952e-02 4.051099944877641079e-02 3.083509761827069040e-02 2.929777417300918202e-02 2.021592174169574430e-02 2.977039916910276252e-01 1.397221350616431601e-02 2.422611622166313122e-02 1.399063323406388171e-02 5.606108699761569447e-01 2.045698552417525296e-01 2.629764896048858436e-02 2.451525009205455380e-02
1.893552421092199387e-02 2.456172225900274397e-02 2.804517256959792038e-01 1.623468990062248152e-01 2.704169404287394829e-01 2.141443774050337256e-01 3.392807469898600492e-01 3.777287750477675149e-02 3.376114281360793890e-02 1.458873609964939783e-02 3.606988908529935867e-02 6.656325130688227343e-02 7.192989838568690508e-02 3.291248810435592476e-01 4.194705153709422096e-01 2.068743313087975308e-02 4.613767457679386619e-02 8.605544138241602581e-02 9.767278495042101827e-02 8.559089376767910207e-02 2.934605798327198992e-02 4.902606583339481072e-01 5.820793765693282884e-01 4.151769169362588136e-02 4.354536397531252184e-02 1.453994275048438485e-02 2.453224545926329103e-01 9.989492218217631281e-02 3.695556489553395579e-02 3.532210695521587063e-02
2.391343603048875013e-02 4.560871131542638124e-01 1.599479515824184517e-01 6.956463610191240821e-02 8.917207014718095404e-02 2.038269219782619934e-01 2.688397869979706756e-01 3.065563354962308820e-02 1.655352117828240432e-02 1.881532325599254846e-02 3.409301078526579681e-02 5.817491021906293774e-02 5.389402500649628086e-02 2.560555083332882176e-01 1.675174042939115565e-02 3.283016664409192653e-02 3.543182470915078042e-02 8.112583509797709203e-02 1.016514258692676059e-01 8.693596748080213710e-02 8.757761797343856236e-02 3.071328323692654183e-01 2.120747084528817050e-01 3.774178863861654687e-01 7.659635763854404089e-02 3.667863905345493392e-02 2.676288679548110422e-02 1.753504326343123254e-01 3.045060040205875909e-02 2.733539254416881073e-02
1.703464244684093840e-02 9.965809558757849837e-03 3.584321844663893586e-01 3.908082625977383207e-01 9.358947390808458611e-01 6.560887791737464170e-01 2.750888889747604149e-01 1.139918670585806093e-01 1.739991310162778970e-01 2.216209026769855595e-01 2.065173108458196252e-02 2.406031389794355269e-02 3.184273006828414881e-02 6.242701382086792566e-02 3.224866238270134855e-01 3.652652927627961232e-02 2.119987717953556589e-02 4.223925406696597828e-02 4.541172384334406925e-02 5.352650174958643869e-02 6.811855348775963659e-02 3.833429076582401396e-01 6.206450710014938671e-02 1.077600436971610509e-01 4.378608306506253101e-01 9.746229920076238118e-02 6.070419961835177985e-02 5.506110523201756396e-02 3.632581335545867485e-02 3.145273763396252975e-02
5.027044583280627400e-03 3.513932812440018760e-01 4.621922583125553374e-01 9.050226192719047491e-01 5.255007794872150750e-01 2.399064243420135634e-01 1.110053837583723085e-01 7.910189585389812428e-02 2.590226342150855343e-01 9.803309166967177912e-01 6.808332279894324657e-02 2.521684428200158395e-02 3.845746726928709475e-02 7.345019349182277391e-02 3.122672132769097608e-01 5.167451481295869398e-01 3.022708778888638093e-01 1.298496208995696954e-01 1.819204092190287447e-01 3.077955218247510061e-01 5.406096597552324523e-01 1.278728593265163471e-01 6.689007007160198415e-02 3.240077803140725132e-01 7.410664750814535129e-01 2.293758862514180541e-01 5.493089330730013820e-02 7.955693110598864581e-02 2.994963316069805259e-01 5.053428419818387085e-02
7.337256628767767352e-03 1.089207388186161536e-02 4.537110005564837234e-01 3.660862407545595887e-01 3.588705774263413750e-01 1.340436414999140458e-01 8.962157306756063369e-02 9.428231020277623442e-02 1.097874723082552378e-01 4.290937299642057501e-01 1.265811617170059800e-01 1.313059850417926111e-01 1.095873878276975161e-01 1.220638068425581313e-01 3.263387849656530504e-01 2.144048692587948446e-01 1.340977287408908203e-01 7.409585901813030284e-02 6.186668749665206329e-02 4.601497592890223254e-02 3.695488982919599430e-02 5.429407842014038338e-02 8.396241288624478605e-02 2.011789040661114136e-01 3.443702309024350150e-01 1.549316313885862606e-01 2.263322795684055977e-01 1.533991819027412384e-01 1.566565613746017660e-01 1.023920376159465351e-01
7.835060979054777816e-03 6.971199197966649885e-01 4.418882534847992649e-01 6.614180816880895764e-01 5.854234959428564755e-01 3.207741459646559212e-01 5.927576220208174984e-03 9.161158303196926811e-01 1.458044970684594099e-01 1.041042574026535966e-01 3.972350659630530245e-02 9.833515893599660551e-02 2.581308740098348653e-01 2.582143712114019496e-01 7.454213569270636830e-01 5.245490354080093454e-01 1.505849448024063897e-01 1.602920788908697436e-01 6.988096183014226581e-02 3.048068359858190080e-02 2.969649632343471929e-02 4.662053663185132535e-02 7.138279154884534516e-02 2.184612265721880275e-01 2.208881714393534645e-01 5.201946964276139146e-02 5.704094874202550458e-02 7.218780603854936528e-02 2.324837315946180760e-01 4.715411648066274858e-02
1.046844676182022600e-02 1.548331322579175190e-02 5.058121470491991900e-01 1.788788474087120786e-02 1.162912104738149030e-02 1.590853057008038279e-02 1.380296501401193261e-02 3.621997640460071222e-01 1.442925691714990188e-01 8.249137895877384219e-02 2.533451495071392320e-02 3.472594060504840402e-02 3.887804130570022415e-02 1.416394671102305103e-01 1.668621914802693174e-01 6.853426819597711883e-02 5.218280299279209888e-02 5.091957897091015095e-02 6.636083534591825928e-02 3.789017485317131700e-02 2.693482077781362075e-02 4.022261999857978249e-02 4.595040979002606996e-02 7.689611851179151136e-02 2.400822565526792574e-01 3.776239124768283884e-02 5.451882561378756931e-02 8.802201865561025407e-02 1.049844678286635802e-01 2.067194887831583783e-01
3.645539745877196102e-03 1.639534853377146509e-02 7.745085446775838989e-01 5.542989043895962288e-03 1.250159863307269068e-02 1.301197464631752461e-02 1.066698350647416957e-02 2.446005476823355784e-01 1.891912574549615145e-01 1.777802806346608921e-01 7.373593117207805081e-02 3.838780498691568566e-02 2.464283215437064814e-02 3.889429605145264951e-02 1.756818799864533209e-01 4.481629544629332079e-02 1.141721841585953828e-01 1.694996018574544683e-02 2.864135903908087907e-02 1.456890920225773212e-01 3.770587582954910283e-02 5.285378717291342593e-02 4.610477031435033374e-02 5.078297861997660423e-02 6.737189655770065011e-02 5.151804053590405136e-02 6.032051035448340870e-02 7.336016916290966083e-02 9.762587871384441340e-02 2.377423828148195195e-01
