2.037049325389911658e+01 3.066776295531143504e+01 2.644604615941559445e+01 3.317629851537142827e+01 2.494189090191907709e+01 5.487360377020735314e+01 5.479706413750010086e+01 1.496634911549804769e+02 2.759550608633526849e+02 1.251495074861052927e+02 5.933005906267394636e+01 1.382182697548210015e+01 8.352631109277560029e+00 3.270970304345797786e+01 4.035396325634978609e+01 9.479323648124296398e+00 3.631503528908520195e+01 6.967815590096424216e+01 6.988764244352225319e+01 2.696741159297992851e+01 2.188503640624594837e+01 3.215202870694496617e+00 2.532241303609075622e+00 1.027478481150062350e+01 2.039519179553227346e+01 1.649663881618566919e+01 7.915030390725730669e+00 7.074291477330428846e-01 6.834505216214228351e-01 8.762165114691460310e-01
1.511649708570467965e+01 3.422282648966105967e+01 6.138326604320729984e+01 4.958940575196619704e+01 3.434706610211311784e+01 1.548765985003652190e+02 7.506619149584254558e+01 9.541105633046447565e+01 6.391040235334267550e+01 5.556082262234009050e+01 4.100386167516654723e+01 8.349764880468347528e+00 1.156889401827219821e+01 2.761261984514446866e+01 4.037909588923908899e+01 2.750384844386170613e+01 3.712164650176404734e+01 1.342484410305210645e+02 1.134136336739965571e+02 3.790416695460159957e+01 1.380650658186278790e+01 3.171640659422700903e+00 6.831214066187406786e+00 6.237835980373866107e+00 5.710176676712114485e+00 8.012596719711808646e+00 3.004003968369906907e+00 7.610892744136528165e-01 1.066879778488386554e+00 1.057812156275412141e+00
1.763817419569193987e+02 1.834545676209405656e+02 3.884060690030689784e+02 3.133173581359187665e+02 6.699837480372043501e+02 6.905167123632821813e+01 1.325913082159666523e+01 1.455515048367962017e+01 2.445325236568285447e+02 7.665005695890687321e+01 2.155530267215021922e+02 1.515590105881660179e+02 5.866751817110538525e+01 8.908232604676950928e+01 1.767655942736225683e+01 7.816239309605315100e+01 5.725028942598337522e+01 1.309230195438658200e+02 4.933115165788865966e+02 9.220225655304420798e+01 9.097428367879231814e+00 2.731049870993686568e+00 4.327985534432794879e+00 1.585549748679769833e+00 1.002857043534822079e+00 7.134654807077511762e-01 6.875312487745850465e-01 5.118323670294973038e-01 8.240138642138754577e-01 8.892726950786016271e-01
8.422461233220184340e+01 2.467087110364927298e+02 5.420059495555312878e+02 4.342425606624681222e+02 1.799830987592072802e+02 2.798765440993858888e+01 2.260647876266776990e+01 1.529316583692704157e+01 9.559181669884161181e+00 9.059403587867245733e+01 5.962872362711146934e+01 1.232912683685629531e+02 5.837122984692504701e+01 4.108230415066946506e+01 1.270124207095859248e+01 1.022968773725423475e+01 2.302869575611688902e+01 4.695571870636196365e+01 3.690109779002553836e+01 3.471152843681673517e+01 1.660255777315865089e+01 5.960471782564699339e+00 1.954749868196336671e+00 3.988206511176343838e+00 7.956868197789118691e-01 6.325832670089248655e-01 5.879203839174087509e-01 5.192269590634623899e-01 9.727012410305895251e-01 1.011051326136280126e+00
5.054320325772518174e+01 1.617091439568746409e+02 4.499989262761099553e+02 1.741963877424099678e+02 1.006109674415747008e+02 1.462251000621590258e+01 2.233081614343100796e+01 1.241592202934891453e+01 5.730781895562598649e+00 1.990948681804310354e+02 2.490700440606717621e+02 2.158462275289211618e+02 3.297812368993085386e+01 2.911501165393474366e+01 1.448321294141362969e+01 5.698169019101083421e+00 6.491586572662936305e+01 3.966507532092375499e+01 6.865744732610264123e+01 4.217421912222437186e+01 3.103835710591949493e+01 9.234726839921371777e+00 2.166020181548219625e+01 6.304023047238092481e+00 1.352280936153706037e+00 7.955478142593488400e-01 5.973759049745358540e-01 6.479430427312269369e-01 9.375028688098282492e-01 3.308564859446959439e+00
5.278566498706737775e+01 5.783696649512297938e+01 2.586363345723964358e+02 2.066015287828334692e+02 8.209291096678020949e+01 8.668730339461715673e+00 1.034111671504224717e+01 1.089528349625818748e+01 1.002540580313517182e+01 2.960368444235479046e+02 2.272047695811955350e+02 1.189532191537372796e+02 1.386849104177382053e+01 4.465745921313584610e+00 3.606224803806143520e+00 6.273538107370269401e+00 3.427689975466719829e+01 9.290005843259432794e+00 3.159720048506159884e+01 1.146732049231110864e+02 1.507319009040691071e+02 9.691319366501998900e+01 2.617385691596732755e+01 3.603242331748276683e+00 1.922963107076927081e+00 1.979958823691305714e+00 1.330819142367274832e+00 8.622935222321991278e-01 1.052317744615901551e+00 1.825261248435821049e+00
7.422600288014731262e+00 1.241765595061405136e+01 1.315663855663906467e+01 6.685103728968647374e+01 3.212226293985767001e+01 5.238019768564572587e+01 7.716177373459716193e+01 4.291636855450679633e+01 4.983321435555706103e+01 5.579042796268306148e+01 4.153213671598292223e+01 1.669512261258380903e+01 6.947292474458046208e+00 2.865358116570329017e+00 1.601278131264532778e+00 3.044540748465045965e+00 1.849450646044527247e+01 8.963346833863669261e+00 4.711071355225831780e+01 6.700028440279834285e+01 3.346003140712099366e+01 8.720568303080939998e+00 3.728312211478279181e+00 3.122719651855838219e+00 1.252228982887412911e+00 1.405682525717371512e+00 1.329557260893538206e+00 1.086567879117500190e+00 1.172018956705319415e+00 2.694287147178237696e+00
1.513424326059134017e+01 2.882875148775485741e+01 1.700055398873481494e+01 3.703035029679633539e+01 5.737733365967909549e+01 6.424924791219926590e+01 5.635403172340771505e+01 5.283802933378407829e+01 4.235977850342705864e+01 2.297800320692653742e+01 8.991697988455575441e+00 2.714232974223593686e+01 5.797075181471733174e+00 1.995636813980072866e+00 2.124351095332032813e+00 4.094169065368866711e+00 3.509651497237887696e+01 5.815008326194055144e+01 5.317217977608474655e+01 3.975116505108127285e+01 1.175566202248916525e+01 5.978783394853217636e+00 2.178131429833692678e+00 1.805153141801395744e+00 9.067700794805541031e-01 1.023206803977689372e+00 1.688553855276571980e+00 2.022467913369422998e+00 1.933039136897601651e+00 5.501217995033725217e+00
3.822135918270249277e+01 2.562376843249345981e+01 1.522777670107920756e+01 8.987771992639187602e+01 5.966895024531651615e+01 2.547070428075932114e+01 8.251535081632715674e+01 3.741576109384627102e+01 3.198119920255108184e+01 3.066905896674622767e+01 2.670665902864482888e+01 3.454547621164250870e+01 7.510088575300220270e+01 4.992148832265598912e+01 7.583110502991931234e+00 7.080870406084203594e+00 3.186997932184873505e+01 1.010567741509423314e+02 1.047145596204424862e+02 1.855067090057981360e+01 3.148741796121117709e+00 2.608673796537339662e+00 2.641748901676302275e+00 1.709325768573206616e+00 1.041744182162147148e+00 1.701733608537812525e+00 6.773386466612808299e+00 1.308073227397563798e+01 3.645994845444731425e+01 1.748219762981587166e+01
6.193829064130409279e+01 4.052293776991174923e+01 6.556535532353890972e+01 6.265116569525936541e+01 5.693202456033718306e+01 1.146554352868806959e+01 5.414554458994203401e+01 2.364857692505720976e+01 1.030459570789923518e+01 3.766482825913939791e+00 5.407480998963655594e+01 5.186878732785500290e+01 1.084731604389704671e+02 1.161468023389769826e+02 5.503852458890849420e+01 5.990790751809655035e+01 3.319587409622300811e+02 3.609907268235641595e+02 1.539117014407698889e+02 7.351170270559649111e+01 3.866777334166720426e+00 1.954886010775975347e+00 2.131477561487507000e+00 2.333668650570160708e+00 1.326170786803476886e+00 1.797481422461069789e+00 1.778738387310111335e+01 2.935561154252021154e+01 3.539319293158791879e+01 9.044435577063101306e+00
5.214375714871071921e+01 2.718694241184650906e+01 6.124046409165080007e+01 5.313904537714977039e+01 6.997027944419963319e+01 6.611813397069568055e+00 5.717335554731085345e+00 5.161051370858450227e+00 3.386111957536483086e+00 2.970708554063034157e+01 4.562464106793754581e+02 7.481537765971052067e+02 1.512288482801349801e+03 7.228827485559739898e+02 1.297569640512159026e+02 2.464515205572560603e+02 4.676026200406732869e+02 1.346123253258883210e+02 3.388649726470350032e+01 7.195956742060745093e+00 2.575416168446929888e+00 1.881598637220561088e+00 2.349660258150556125e+00 3.296131653476977341e+00 3.569672338975070414e+00 2.004217435493020005e+00 3.303100798148382644e+00 2.563153967544205436e+00 2.237652592365942272e+00 1.570869652338521272e+00
9.909249560325363859e+00 5.820941384889770198e+00 5.131443629957726671e+01 5.091068696589961462e+01 4.070949899187581877e+01 9.656076067748243119e+00 3.899817311914230533e+00 2.616870843892759702e+00 3.402163570735539544e+00 6.213407534321995485e+01 1.468456871030254547e+02 9.372370519237625786e+02 1.627048708866906964e+03 8.076239708134371540e+02 2.807144515980487540e+02 3.034255113815547702e+02 3.346005052868866301e+02 2.002783326759681586e+02 5.044583839652299417e+01 1.469317111598390468e+01 2.238120831807939304e+00 2.046664520070809345e+00 2.389438613105007825e+00 4.304664924247882496e+00 4.154727497007000281e+00 3.019743859805756880e+00 2.365927107887253023e+00 2.110755772400569885e+00 2.230003137683551628e+00 2.365893019276339437e+00
1.950805345919549127e+00 5.034743185990544490e+00 1.221305648454335291e+01 3.476139929166542686e+01 2.310702564451005259e+01 7.578630670868895081e+00 4.058683579703001421e+00 3.576192547860393312e+00 4.776450294341026748e+00 3.345902515502598362e+01 1.080715854191768344e+01 3.187426061776212691e+02 1.281452313209136264e+03 5.148866225332627664e+02 1.530700483571070549e+02 1.674575366242777932e+02 6.035969892998788566e+01 8.730551994968590179e+01 9.864956125879123761e+01 3.713929176329938286e+01 2.536620627364096325e+00 2.314482004832614237e+00 2.839992276778397606e+00 4.892674764609996174e+00 6.432547453994937214e+00 6.112497124291706996e+00 4.592749278526103929e+00 4.158870318040371217e+00 3.175213465780506894e+00 2.479811485706834517e+00
1.585262156459239069e+00 4.565767515236162311e+00 8.259379036846738131e+00 6.022739902495827913e+00 3.603322751244237399e+00 1.477878866021430326e+01 5.437634569272034923e+01 5.085444389442216107e+01 7.229009305662380314e+00 2.170969898046924307e+00 8.506156174533305858e+00 5.540261464066655606e+01 6.182934012058909730e+02 7.697344572569934371e+02 7.636325132748252145e+02 9.630125213458320559e+02 8.249574640252388917e+02 5.121156003238669427e+02 1.346611309108593559e+03 6.153759121863778319e+02 5.143342844391894175e+01 1.509507328100637125e+01 1.146974196447238015e+01 2.869487232599090021e+01 6.579832620435520596e+01 6.158637398814079944e+01 1.712125276117538419e+02 5.762052823021372205e+01 4.732424900672485002e+00 4.743432546157393404e+00
1.452707082930123628e+00 1.468844126954731655e+00 4.051255149603306016e+00 3.052037398449859396e+01 1.125435865327815499e+01 2.726212412883141312e+00 3.742221500486432717e+01 1.159327386360031085e+02 8.425055369481435719e+01 8.656633114454693967e+00 1.844456218775842160e+01 2.918891258096906540e+02 5.932955950343026643e+02 6.895603298637813623e+02 5.753806697189136230e+02 6.456388839006118587e+02 1.024594939184570649e+03 1.655952831988962316e+03 1.593591259628551597e+03 1.216733261095630269e+03 5.214156579016962212e+01 5.476260871412057440e+01 4.871875957274070856e+01 1.500332407926770770e+02 2.107363176734845638e+02 1.071715456139292883e+03 1.085808407931153852e+03 2.267693719027292047e+02 5.221412987295803276e+00 3.245615336690076624e+00
1.302176209098194537e+00 1.436009994239267673e+00 3.320760257794784120e+00 3.731304645005755649e+00 2.532399310543879789e+00 2.948344623127318265e+00 2.136071642516727564e+01 6.239969467327932051e+01 1.352275233913059651e+02 4.989946518710089407e+01 5.322975909793990468e+01 4.806372156625848646e+01 3.644509364659480752e+02 6.775938591992003239e+02 5.844848456201345925e+02 8.302474160353996240e+02 1.301868583503078071e+03 1.447253488524948352e+03 7.774756659318979928e+02 1.621905788219213207e+02 9.659957590694976659e+01 6.591442089499477106e+02 9.533912496573707358e+02 1.560518649903545793e+03 1.430450096883292872e+03 1.858793130420217949e+03 1.514543348406449240e+03 4.483304967244307022e+02 7.915097178193972738e+00 3.656577678571593104e+00
1.630459377703242119e+00 1.918434553181846969e+00 1.923043654888971332e+00 1.882237158806435051e+00 2.974370012108559003e+00 6.293486707584939666e+00 3.681469955394416047e+02 1.249129250377969583e+03 6.272502011661065353e+02 1.118313580166296646e+02 8.803572978571332897e+01 1.470708850061012072e+02 2.881987937730976341e+02 3.880960088125424363e+02 4.707547155723763126e+02 7.814516619810218572e+02 1.485335368850604937e+03 1.342610353756614359e+03 5.811288534889049515e+02 1.874649125383465389e+02 7.889889994592033418e+02 1.398399593111572358e+03 1.763208058919058658e+03 1.756323344226692370e+03 1.519272227536625905e+03 1.320659971914248217e+03 2.001055371808480913e+03 3.566143489637390189e+02 1.155911544045737926e+01 4.917230704349186965e+00
4.036743975518900740e+00 3.241005623476250541e+00 1.728168295193276638e+00 2.820627314963521481e+00 3.879634516470932226e+01 1.974565936679236415e+02 1.087866407241121578e+03 8.916782501143620721e+02 9.009809936657101161e+02 4.684430350651560957e+02 1.825686986179815108e+02 5.394873457438336573e+01 5.284862022994099107e+01 1.235402549867810222e+02 2.544736122039375914e+02 1.086209803812501150e+03 9.818326693138935752e+02 1.004490819980893207e+03 1.561570842092216935e+02 2.541982020859488500e+02 8.663928240881314196e+02 1.809982487703098059e+03 2.176766547300779621e+03 2.181632953079559229e+03 1.779988546002556177e+03 1.745630953359713658e+03 1.679947904588829260e+03 1.332863056082967432e+03 5.921667840063872745e+01 3.912061928246082942e+01
1.836843359383774743e+00 5.248008382492451496e+00 1.012730382074391322e+01 7.461634895715889115e+01 1.797760290609140270e+02 2.588695524165461848e+02 8.130332887785315279e+02 1.021595866841244856e+03 7.196605936626795028e+02 5.713678119126625461e+02 1.248540018778866170e+02 1.288795858315624798e+01 1.911100703066236761e+01 4.896966929455941653e+01 9.708148485584209197e+01 5.287035424390880962e+02 1.761936718865601392e+02 4.987338223912836810e+01 1.491648006693195860e+01 9.912902297592704315e+01 3.560586650473869099e+02 1.799457430416589432e+03 2.181715788190011153e+03 2.183063176600025145e+03 1.551115208326956235e+03 7.144904536993566353e+02 1.169933662076820383e+03 8.034461658976204035e+02 7.248554397368820901e+01 2.864036956922081956e+01
4.772482335265214459e+01 6.524752434630488551e+01 4.694770659230715637e+01 6.352560659181781944e+01 1.657588306856725922e+02 9.855959807328936506e+01 5.139004726068262698e+02 6.738749923302685829e+02 6.368170387035431759e+02 1.495579688633417845e+02 3.767177996681820673e+01 8.008768688651343837e+00 1.338436681562142283e+01 3.594541326013474958e+01 1.305218877415382792e+02 8.100525860279864787e+01 1.308806799919998411e+02 3.444262053402594859e+01 5.770456212026034848e+01 2.473314618396336755e+02 1.234514828289998150e+03 2.189647067553616580e+03 2.220134462450373576e+03 1.987529514948736505e+03 1.456163899048429357e+03 1.035500508917802790e+03 9.931054048353996677e+02 6.694238984251562670e+02 6.030163508760879409e+01 2.148056307688956323e+01
1.425174171636752476e+02 1.423732816286112097e+02 8.117508300056262271e+01 6.569483375751116228e+01 9.751613873642797614e+01 5.523992418104175783e+01 3.238136897461487251e+02 2.986868215716414738e+02 8.462829446060837313e+01 4.389074994324980139e+01 1.451028037464189069e+01 1.112061284803260008e+01 6.283137513501237947e+00 3.232694324226552673e+00 7.835324585543302689e+00 2.476035303233113893e+01 7.865642142728324870e+01 1.604973854678391945e+02 1.389048604256793453e+02 5.617556608711194031e+02 1.400727607649721904e+03 1.874189744565579986e+03 7.108964590816044620e+02 9.825293510936637631e+02 1.180482888090077267e+03 6.331803034974702769e+02 4.598428561070461456e+02 3.778515149957174799e+02 1.385709023345948410e+01 1.253137319119655047e+01
1.207146688607960101e+02 1.520660686656329403e+02 2.516338181227455095e+01 1.980442891191804122e+01 1.874505751078208604e+01 2.992469568840100891e+01 4.455120666990248424e+01 1.165391973006389392e+01 1.564740182704347760e+01 2.325333415668938031e+00 2.903313556017481645e+00 4.228866292253833592e+00 4.423365277211992463e+00 1.474976997440121806e+01 3.898011191261205965e+01 4.737170150032430911e+02 8.091968079878629396e+02 1.055333532896910810e+03 6.537442637068315889e+02 4.478070974562673996e+02 2.863306939959427382e+02 9.334939405822075287e+01 3.315046929919301988e+01 6.499810215502887445e+01 2.161909502271203678e+02 6.823759167260512015e+01 6.028614760530928152e+01 2.032593718053796294e+01 2.306320292566272467e+00 1.884786885796141842e+00
2.654174848528382995e+02 2.203672815683699184e+02 2.635526810329904990e+01 1.271818602026402623e+01 2.110311948397738036e+01 1.756116642933235283e+01 2.836565237615171498e+01 3.179231830756480193e+00 2.771776767188100621e+00 1.147109412434310638e+00 2.608053981311154068e+00 4.741397535727172041e+00 5.968032569214342331e+00 2.999500509005608251e+01 4.595258236507644511e+01 2.688100651562035637e+02 8.844848821088670547e+02 1.499200329830624469e+03 1.553397009844984723e+03 1.228700949630896730e+03 2.348384195937163099e+02 4.736221298139784608e+01 5.322069203749580879e+01 1.202493281429016179e+02 2.504282601798929022e+02 6.962966440193793005e+01 2.561627013269725239e+01 9.524819813771436827e+00 2.950970494543958544e+00 2.632786594200669406e+00
3.517035258919264606e+02 4.763740713848211783e+01 1.424703544061278926e+01 5.109987182276880091e+00 6.452466714824791616e+00 1.498803839090519752e+01 2.022050619620472034e+01 2.373055043586182578e+00 1.354499990393584596e+00 1.503126310562855839e+00 2.564140795123908134e+00 4.226252220458986741e+00 4.525135278574365039e+00 2.331907901273859807e+01 8.460322199369903728e+01 3.807275177621517059e+02 6.690043610139979364e+02 1.409620671527862442e+03 1.633396497759987142e+03 1.260105657788654298e+03 5.606657874415839160e+02 2.903438109199291262e+01 1.862636088371626641e+01 3.805031674293108779e+01 2.100739565353767375e+02 1.209632109292241182e+02 1.054917819846940716e+02 1.938291298869303603e+01 2.741166237613450019e+00 2.041616837689346209e+00
2.120755909255006486e+02 6.871713891390540141e+01 2.799236281287973327e+01 2.788427698069563121e+01 6.798650378597082522e+01 4.920652129486518334e+01 2.132366410475329843e+01 9.184598745263622632e+00 1.428659335086119597e+01 1.790044950207187924e+01 1.611004464960211990e+00 1.761180936544497921e+00 2.596487775254493258e+00 5.462780035789007727e+00 3.078426136703536287e+01 1.173973110474318844e+02 1.086684630241991840e+02 4.300587924988932400e+02 5.136680872817885302e+02 4.029215377943786507e+02 2.994316354640134250e+02 3.468317126336548029e+01 4.850469658922786920e+00 9.188917879973512726e+00 4.012125837902362946e+01 9.891381335250392226e+01 2.610982047372778538e+02 1.417962309661589870e+02 3.421619532158644450e+00 2.480134244475309835e+00
7.707418783260820305e+01 3.192863215548769418e+01 3.555915784974065730e+01 6.386847063787057266e+01 3.820685628854671023e+01 1.810611457812663616e+01 8.716615013831804148e+00 6.448631977642727442e+00 2.121437890666586057e+01 7.904059994077258011e+01 5.199363905059955826e+00 1.741305483688562417e+00 2.784671693503240508e+00 5.671782005954590034e+00 2.509851748481524680e+01 4.214943843193982786e+01 2.690740799377504544e+01 1.246829700251013762e+01 1.849431855180211670e+01 3.122523863297360691e+01 5.031059594501307686e+01 1.051946826257738365e+01 5.026902453697106310e+00 2.504905376138215800e+01 6.023824403518524662e+01 2.109970230824778170e+01 7.141390131813577113e+01 7.688421516775485998e+01 2.644390095936057605e+01 3.902597499137516301e+00
7.818453033784433615e+01 6.552307502765602010e+01 3.329430693847771749e+01 2.603078535879890154e+01 2.654544560784056273e+01 1.053149292874464571e+01 7.283408734798561213e+00 7.857528616788992615e+00 9.007832816883464488e+00 3.459413510600775510e+01 9.431810769666151728e+00 8.692799144217772778e+00 7.756171394146148756e+00 8.977913262054824983e+00 2.430985333737949361e+01 1.604532365138647521e+01 1.046806571637305083e+01 6.076079759109273226e+00 5.204861923840217841e+00 3.855107944728501934e+00 2.924405061506499148e+00 4.087422465319297871e+00 6.243925410192867176e+00 1.520937062735907119e+01 2.616076887766222825e+01 1.231676002908226408e+01 1.924387368199004555e+01 1.231489192082358031e+01 1.203710070160766321e+01 7.535497818693171368e+00
1.059799503603590836e+02 5.770560580416393748e+01 3.423944175295747527e+01 4.996229562596263207e+01 4.810083147492409239e+01 2.758358469067409402e+01 9.864285855896221733e+01 7.879515197946463445e+01 1.211949995829515458e+01 8.457412483984612095e+00 2.912104233066865611e+00 6.481560580825903806e+00 1.818682532998937873e+01 1.879652124076429232e+01 5.474266060713413395e+01 3.902590188358889378e+01 1.194591056605667845e+01 1.379246230362742764e+01 6.219136554975308151e+00 2.641207556169786308e+00 2.339224898832886979e+00 3.483730661012296004e+00 5.289617321005222195e+00 1.606172505027171127e+01 1.609518856991775237e+01 3.773325617220450567e+00 4.117788737746482575e+00 5.159980992580081249e+00 1.642268755343444653e+01 3.327115804495080376e+00
1.422804658878276314e+02 1.285910643120900261e+02 4.072590357455214871e+01 1.488794567919450742e+02 1.890490647696871633e+02 3.758329145423850832e+02 2.649866894596558495e+02 3.178504771607145685e+01 1.192622100854246980e+01 6.632037928660642123e+00 1.891908280909367690e+00 2.292293986118905114e+00 2.718441273446025264e+00 1.027099056005884670e+01 1.224887688741354808e+01 5.293536131870030914e+00 5.021700417521957505e+00 5.935334213963783689e+00 7.921959294309248278e+00 4.189942205863676605e+00 2.264404321389065000e+00 3.062151685498028630e+00 3.424730674973191391e+00 5.613879129911019561e+00 1.716188396035250463e+01 2.637778525584569600e+00 3.739917085664914431e+00 6.083584906408022519e+00 7.265892954662504621e+00 1.435506104005402506e+01
7.801617949742254154e+01 2.033484851071171420e+02 6.383221354881043652e+01 7.321245677889766057e+01 3.850743029783833435e+02 4.267943301380555567e+02 2.975717073227286846e+02 2.149900034145025884e+01 1.565862248209763408e+01 1.420894936262800812e+01 5.624238300242112132e+00 2.696036008666019335e+00 1.652686470248074802e+00 2.763090942594693011e+00 1.272603217431089107e+01 3.585737262862621400e+00 1.222779819441250737e+01 7.083572638964736257e+01 1.203951087129393613e+02 1.608877219373022882e+01 3.118447494309881218e+00 3.938167418678145459e+00 3.343137031355493782e+00 3.614806296860397783e+00 4.715023588096856955e+00 3.548256982464171205e+00 4.104306940573234641e+00 5.026278056666413363e+00 6.734276207858290952e+00 1.645228566207250864e+01
