2.012681375122185867e-01 9.067812469701645381e-03 2.313048683601930944e-01 5.825216715288752956e-03 2.079129908490940370e-01 5.771829041555633089e-03 3.639028622759079429e-03 9.743506958881252913e-03 1.752885128970734646e-02 7.855627286462689082e-03 7.163619939994946006e-03 1.229109792150875069e-01 7.678113051875208594e-02 3.628037148054381877e-03 2.629152742237449505e-03 8.180198495702883932e-02 2.124787581921290178e-03 2.537839554515131362e-03 2.259634215898822639e-03 1.754178223099867691e-03 2.529967769659843269e-01 3.892222765759585645e-02 2.965682763462720861e-02 1.178629459715942185e-01 2.283516615350245083e-01 1.786966807182883699e-01 8.196401402662983893e-02 7.144724951583635540e-03 6.749187001523010258e-03 8.394304011424876671e-03
1.317554433504498634e-01 9.122063971751380451e-03 7.859124385553821826e-03 7.875293977052031519e-03 3.632077698577679259e-03 1.891058747010840660e-02 7.714788608753912064e-03 9.374444310968333555e-03 5.021990466149281115e-03 3.516455189449444341e-03 4.638532348774395547e-03 6.312702863310154511e-02 9.050084380446928034e-02 3.341751688367473709e-03 3.224530797832890656e-03 2.137144452484235953e-03 2.047259839551210294e-03 4.664585329143800495e-03 3.440160265059316342e-03 2.296455974225319538e-03 1.456396028674924181e-01 3.718594043004178062e-02 7.678661453651230984e-02 6.834635484045151199e-02 6.046000140992816019e-02 8.095433288575723529e-02 2.841017804733238228e-02 7.172767404979365179e-03 1.013218215920794023e-02 1.005111380914206279e-02
1.750528855894122743e-02 1.685733217432622971e-02 2.842095633172007918e-02 2.306313986428789806e-02 4.913042348353532929e-02 1.311209000923948403e-02 1.114345965692009471e-01 1.165931642660331669e-01 2.897455706182305163e-02 5.221565441642254078e-03 1.383697910850789116e-02 1.108372094140705130e-02 4.113183893625835946e-03 8.556678367380726388e-03 1.368291890429704505e-01 8.617649728528180286e-03 3.880338792383390776e-03 6.204623823049234925e-03 1.365347689168336376e-02 4.418959018306084160e-03 9.158989418983852493e-02 3.057057235387108246e-02 4.632540000299292804e-02 1.607270215692245541e-02 9.537431657362958198e-03 6.277187916983071117e-03 5.602001805729278118e-03 4.382498206959406506e-03 7.443015796075441552e-03 8.307538248704816886e-03
6.315899894581212745e-03 1.751374504175394128e-02 3.841678665795395659e-02 3.099755892782650457e-02 1.688487729352537020e-02 1.017283231640260001e-02 2.248807889675904781e-01 1.388877488463152454e-01 7.492925296867693208e-02 6.902589231116583977e-03 3.715293669606195299e-03 7.408640932001841345e-03 3.333908360410242893e-03 6.090329262159245062e-03 1.044424612016853493e-01 9.279607713712695327e-02 2.013180678952434521e-01 2.342930179054063256e-03 1.130148446259513807e-03 1.480675481764934459e-03 1.594372715179425137e-01 6.307824291089729474e-02 2.157960321258781122e-02 4.247929067407515275e-02 7.752532724367251424e-03 5.524296615356802560e-03 4.736506920756863685e-03 4.478279253917258687e-03 9.059375457398051446e-03 9.806991992694516144e-03
3.633409493617982197e-03 1.091202942738996734e-02 3.042489322938941171e-02 1.180113131208714548e-02 1.055550689173747302e-02 1.332533391764165742e-01 2.301041077068700647e-01 1.287131085837424915e-01 4.706852635897261494e-02 1.744644739054317453e-02 1.665493439587489508e-02 1.813105511719113536e-02 3.597783927824509294e-03 6.580114493388806995e-03 1.356566047164720623e-01 5.567838881112600197e-02 8.127306121680893600e-03 2.562156779351240990e-03 3.076785482049433640e-03 1.785846986757568672e-03 1.600126538206684840e-03 8.201288720647650909e-02 2.104919450823019567e-01 6.930800469700051925e-02 1.392039106703272903e-02 7.360021953514370337e-03 5.107010585227100656e-03 5.885678570535468786e-03 9.173837693225906156e-03 3.361978640714118061e-02
6.096906742969748251e-03 6.397443033093775169e-03 2.248060880088548208e-02 1.493978599830754830e-02 8.404976147410300746e-03 7.538613039761891954e-02 9.508435944073750923e-02 1.002635510537706748e-01 8.070637128532742732e-02 2.441243653747361686e-02 2.074957112602173609e-02 1.623386385198252735e-02 1.187833833002873291e-01 4.417922643422085571e-02 3.679543458117290333e-02 6.313580650809805239e-02 5.940393453827060542e-03 8.395265435855596425e-02 1.907333294706229894e-03 4.153525711035256640e-03 6.859439437051163650e-03 1.000927172001537732e-02 2.565677109207827322e-01 4.008579373140384178e-02 2.064773992299111585e-02 1.919308068385836355e-02 1.197313965414128177e-02 8.229274176102875302e-03 1.082720137134066986e-02 1.940964163163181808e-02
7.018134535461273416e-02 1.056364282700364421e-01 1.034951553733952923e-01 6.884463467330683220e-03 2.426735229618938623e-03 5.679850167820409655e-03 1.121967554393627289e-02 6.129298233921129033e-03 7.293633868535771836e-03 7.455762961663957127e-03 6.292688615373799067e-03 1.445584284340367398e-01 6.710962850303371641e-02 3.150420888964149124e-02 1.824360218878706349e-02 3.130616054033900225e-02 1.765237768444543609e-01 7.864885584993572265e-02 2.993168762790820569e-03 4.224232071852362241e-03 3.110821648478358410e-03 7.985808325993735968e-02 3.743015942077750069e-02 3.591624658908006140e-02 1.391074783704963902e-02 1.425518931833716883e-02 1.255956775338588384e-02 1.080917488230272692e-02 1.234500065047277641e-02 2.926551597136999375e-02
1.458857468682550618e-01 9.844138912956173007e-03 1.486606626662468622e-01 5.086790731950274584e-03 5.354446695174847060e-03 5.930540119327039339e-03 5.207559223478568609e-03 3.504321320605437075e-03 4.389774723987772444e-03 1.967444512953847036e-01 8.173882899007237079e-02 4.573518623753109434e-03 5.683415784218038419e-02 2.060690742749982790e-02 2.319094105966084882e-02 4.259566986708706454e-02 5.498345723789928134e-03 6.184890926456777793e-03 3.921486015443847659e-03 3.653590435988497871e-03 1.136045506289537904e-01 6.653971758625094879e-02 2.676065899564807754e-02 2.241026387626133751e-02 1.068850975442558332e-02 1.115439082965616509e-02 1.729420968359837024e-02 1.934695284486476902e-02 1.904645135229424829e-02 5.489274245499937283e-02
9.027211490117918735e-03 2.214429948399624093e-01 1.276637445500709567e-01 1.188817710362514990e-02 6.827659848581281443e-03 1.970939247203731814e-01 1.359936172615283830e-02 5.639145080496670015e-03 6.293995975329076328e-03 5.163346968565404177e-03 3.701498664360447412e-03 3.754586875808907029e-03 7.095521718100582936e-03 6.204291855520993257e-03 7.448389183339206021e-02 6.213318944070150840e-02 2.607142736388216690e-03 5.460053094099759537e-03 6.871583242944128908e-03 1.538956939226382714e-01 3.044855023286202264e-02 3.151850652297360361e-02 3.403378264501261824e-02 2.221983093579402158e-02 1.302857252477824905e-02 1.956028125568735204e-02 7.265343475694391318e-02 1.271654545589764040e-01 6.597597679393292676e-03 1.675981911260332469e-01
9.106099363494633142e-03 6.844838204375752223e-03 1.085322615224644689e-02 6.411518142490954530e-03 7.645937868990912434e-03 9.332830027979331644e-02 1.409281413391791707e-02 2.074753707803687064e-01 9.701760548792254246e-02 3.409282347457012058e-02 3.617428743337490309e-03 3.367019126673473535e-03 7.066474797949620981e-03 9.050221598461994157e-03 4.676853250680552618e-03 4.979546769694010409e-03 2.237340855930038466e-02 2.090589753894744884e-02 1.205792805362077003e-02 8.357639802372186094e-03 3.930273382844581831e-02 2.463836017451600385e-02 2.799788466966558406e-02 3.068282269728566172e-02 1.714450520970399808e-02 2.163879307277621900e-02 1.966442249991414148e-01 2.931347601720248330e-01 6.825535913937111517e-03 8.782659188700854547e-02
9.508966750855298716e-03 4.781567419126222900e-03 6.181196755426878083e-03 4.231672190256326876e-03 1.067987927483146637e-02 5.821629501906010890e-02 5.718923567699889937e-02 5.216146812730695220e-02 3.573328908258904119e-02 3.752606058929610668e-03 2.863606401267779211e-02 4.546914814480250422e-02 9.340215133268610359e-02 4.596070182239069685e-02 8.455848724396584568e-03 1.654394690074230748e-02 3.059738990419210922e-02 8.388024042000926175e-03 3.303211956499360093e-03 6.497551301736871621e-02 2.716770551617751078e-02 2.408306270062863727e-02 3.080384513079695644e-02 4.296501795192243095e-02 4.590894481578310093e-02 2.478501626287634221e-02 3.844727037396612063e-02 2.805121395822136876e-02 2.442821459183775606e-02 1.711082033175702344e-02
1.004112955641993515e-01 5.471535329738998893e-02 1.111672517220291603e-02 1.185926398765229511e-02 1.105517452991807911e-02 9.395061300426116313e-02 4.418123278675144955e-02 3.061361334520654523e-02 3.632925898063396608e-02 6.093307153336892726e-03 8.712239338319608534e-03 5.618222401481805933e-02 9.606346226336677507e-02 4.993942348310511509e-02 1.806231653771310161e-02 2.044566834973839467e-02 2.252785466027245817e-02 1.322768737524494462e-02 5.508322846727402994e-03 1.484870164242647617e-01 2.607868370579195794e-02 2.636475847375324005e-02 3.094755142464626282e-02 5.513787722318701234e-02 5.231100596837801042e-02 3.719470144458070920e-02 2.845851606827855609e-02 2.530254617842003090e-02 2.704996129880909636e-02 2.869666547323450334e-02
2.364519934861552403e-02 5.562724696241225925e-02 1.217853334757420802e-01 1.327882336044093961e-02 2.225221989142719126e-01 7.770314773658876240e-02 4.374523928069107281e-02 3.848627849823197528e-02 4.926906827967258290e-02 3.378896763802845347e-03 9.265849185147355394e-02 1.909766878790607539e-02 7.117824391482011070e-02 3.072543500786984252e-02 9.736828516305888123e-03 1.135640731691909405e-02 4.201106248366518782e-03 6.165597111862567911e-03 1.012421585550259302e-02 4.664007984913233831e-03 2.504109295517296940e-02 2.728082634150435018e-02 3.401977131309027319e-02 5.626408172213383935e-02 7.107137309529075464e-02 6.263467245364048863e-02 4.601698147687514895e-02 4.250394630134255586e-02 3.661828403421001771e-02 2.978153629182460349e-02
2.022978269600004056e-02 5.558575945410671598e-02 8.600568646616635338e-02 6.029023655382140245e-02 3.564273200385262991e-02 1.569002891116117737e-01 1.260629506318696261e-02 5.533552811253216255e-03 6.805513862378118062e-02 2.210197180409940315e-02 7.821422014371991194e-02 3.769814144213996885e-03 3.225858420006957883e-02 4.421080108720817220e-02 4.772721703273607313e-02 6.523549885732160547e-02 5.906415751571499062e-02 3.851070934677199020e-02 1.056190978988885698e-01 5.049192182171491350e-02 7.395892390189396683e-03 1.630383607133919777e-01 1.206671057221614662e-01 5.680521518749022912e-03 9.331207126488473558e-03 7.238184809404266638e-03 1.725233753661219172e-02 7.728269213528180664e-03 4.958451139056395396e-02 5.611181824489624298e-02
1.903979033139053048e-02 1.840385255702304060e-02 4.409846369493010398e-02 1.678512551278247764e-02 1.142581866276951019e-01 2.887052874150959972e-02 6.008152448780559700e-03 7.767032922079496193e-03 5.948322851763703650e-03 8.458647124398800676e-02 1.729856616516458612e-01 1.832826681487703321e-02 2.868890344346278209e-02 3.684318437096556487e-02 3.367810279508899607e-02 4.118528106421921742e-02 7.102542451617370467e-02 1.240134534253652665e-01 1.275620724470021838e-01 1.008584917040086099e-01 6.520526718527898218e-03 8.350052578525135952e-03 7.092678110917816428e-03 1.567743919397803637e-02 1.727722724366776222e-02 8.747651121019259235e-02 8.600657346627031685e-02 2.191938955373797307e-02 5.067574550015152557e-02 3.807222129575715819e-02
1.768022073976126610e-02 1.867499999342201247e-02 3.646526479668004556e-02 3.852835258401905716e-02 2.505819032736296761e-02 3.039052028124521881e-02 1.861403561582999355e-01 3.606121150734832494e-03 7.887338017366995677e-03 3.479977049168115743e-03 3.605579406310445607e-03 2.635187267824471141e-03 1.609002410275297418e-02 3.292500472717860976e-02 3.103508923182226459e-02 4.801579616479755702e-02 8.439454621689258806e-02 1.042322515835519131e-01 6.124107112019866461e-02 1.348205052319123923e-02 8.038533923078353821e-03 5.473034160342300780e-02 7.892219691507218471e-02 1.310208990332145385e-01 1.217389129093845029e-01 1.564490542700029962e-01 1.230510373104813232e-01 4.037479465552216290e-02 7.311234463268682926e-02 4.230471574941815915e-02
2.279414167028969915e-02 2.579261757814799855e-02 2.422546937720758062e-02 2.188562800024288976e-02 3.191758848547939648e-02 5.643513360291730480e-02 2.269308046470104590e-02 6.963769418818437085e-02 3.123213987127960653e-02 5.261216251452603514e-03 3.829186770236102377e-03 5.804999765603215296e-03 1.136157228172776819e-02 1.690329998371612255e-02 2.252288321971626997e-02 4.069039794510970198e-02 8.963073755995457081e-02 9.236649314460261551e-02 4.472446290480677072e-02 1.554438549466723857e-02 6.643498568215208677e-02 1.192736469453512943e-01 1.513843462969282350e-01 1.534203425115987784e-01 1.329329110009811188e-01 1.126823540453927575e-01 1.626629957287797912e-01 3.080988419164815834e-02 9.509889584630015769e-02 5.092820597725974952e-02
5.703149450491462602e-02 4.448945422221741580e-02 2.153328167728564904e-02 3.006533519651945902e-02 3.086477147275102501e-03 1.053656353857520059e-02 5.331131589745048693e-02 4.249278667348709709e-02 4.171359244418405138e-02 2.056537818896908218e-02 8.665957353855488488e-03 3.095497202540637479e-03 2.971297568947425111e-03 6.560183327437938555e-03 1.088800583301940267e-02 5.019380044610036867e-02 5.427550715918008639e-02 6.877398746174413768e-02 1.228386933938507841e-02 2.193676783246014186e-02 7.328795447949626451e-02 1.568066487023573041e-01 1.912795741348989609e-01 1.949797872675346211e-01 1.574467207106055588e-01 1.474940830133258107e-01 1.329430808219145277e-01 1.091095987405775042e-01 6.454546236175512548e-03 4.532818895607746909e-03
2.280300175440018104e-02 6.279808934630244643e-02 1.093099777436205566e-01 5.797247254882893601e-03 7.916802613116419307e-03 1.019839461256185145e-02 3.235327344007422196e-02 4.056446287974171949e-02 2.781734880786172759e-02 2.141270786539118190e-02 6.370788905147198138e-03 1.156865489334281266e-01 1.723089579299869611e-01 3.704634822311281186e-03 3.901752976880885730e-03 2.289931466791274295e-02 8.947930270382728132e-03 3.121089510063608605e-03 1.249821510859510376e-01 7.807551123529200138e-03 2.805589378476767287e-02 1.484576436343041095e-01 1.866313202429584484e-01 1.924642375780999948e-01 1.376148099929699609e-01 6.202801412028719624e-02 9.782037780757472933e-02 6.668463966801965737e-02 1.255651900776869924e-02 5.558920869041315653e-03
3.771539741165461871e-03 5.970958442502003957e-03 3.622154900534147945e-03 3.437293890175389249e-03 5.584539718832196367e-03 3.188563695016470752e-03 1.644886896823821026e-02 2.129205023754961526e-02 1.962904758175612954e-02 6.117991430456813998e-03 3.097629405584412157e-03 8.037622794237700430e-02 1.353630702521662343e-01 3.569516150194071164e-03 6.171831565975576320e-03 3.750911396847333643e-03 6.527157342648703259e-03 1.939284012643374298e-03 3.686254064178363498e-03 1.751369798041955625e-02 8.954369562422953566e-02 1.693645744605802306e-01 1.815855041454208785e-01 1.702399272790505458e-01 1.280319622057793372e-01 9.152765625732936505e-02 8.663805116448618227e-02 6.544635299738359169e-02 1.881509185731024270e-02 2.237409608044949316e-01
6.613769153246077531e-03 7.627815211060090875e-03 5.210493379186632683e-03 4.686309059031026208e-03 5.293140362485427089e-03 2.022911643185756458e-03 8.706521526721409596e-03 9.099480122369687368e-03 2.672337073430838122e-03 2.058974954995833155e-03 1.387953577428641949e-01 1.220834814365206744e-01 6.650871185320801626e-02 3.003951865361067716e-02 6.299825255362780096e-02 1.819960112742231018e-01 3.486151930952106470e-03 7.413477457535984708e-03 7.265910988196670750e-03 3.292013535628041804e-02 9.054838480497669206e-02 1.319033360032435265e-01 5.392856158442865810e-02 8.014747542870948038e-02 1.018081654437479056e-01 5.654923341195394748e-02 4.996673866286036048e-02 4.838042588111858555e-02 1.280810669244099309e-01 1.392880051464348290e-01
5.333211491516298176e-03 1.018677315088066353e-02 2.231847435573765526e-01 1.899400994354207839e-01 1.735654545698424867e-01 2.129470304388159270e-03 1.679183261673745280e-03 8.951600724032066081e-02 1.275881949047623642e-01 2.201848156515432212e-02 3.234419908347157396e-02 5.124092804903494086e-02 4.675682597981540428e-02 1.423820028226328860e-01 2.524425638077871202e-03 1.867864433660104337e-02 3.362932219324126643e-02 4.539071625587103032e-02 3.146763355877291168e-02 2.398384652512072779e-02 1.716159123013280205e-02 6.195793750021583689e-03 2.424069307227521685e-03 5.218363022214489964e-03 1.867184449801481336e-02 9.196910756674361170e-03 1.222930432525593490e-02 1.866827987415473344e-01 2.411394286744827226e-02 2.249568959219737027e-02
1.129103027454020879e-02 1.656094651705953755e-02 2.531544762958254924e-01 1.474559786113829318e-01 2.416131987623766630e-01 1.831164035742992580e-01 1.825676456711893382e-03 3.210273193944174902e-02 3.040750386587690729e-02 1.316100666642026039e-02 3.248985072660446477e-02 5.916675832659288453e-02 6.166519476858104559e-02 3.825415803952817925e-03 3.703913363877593939e-03 9.516047295033315187e-03 3.521538156366921940e-02 6.647786498162214230e-02 7.621223249595801552e-02 6.682516250804318436e-02 1.435050399031167524e-02 4.922357961644880514e-03 6.065487763576740514e-03 1.398950372802183241e-02 2.202440690325678865e-02 9.462502316740034614e-03 2.218633114001249129e-01 9.066832886437857508e-02 3.384955446626910364e-02 3.243865835816734516e-02
1.398807915705560165e-02 2.955539177487196464e-03 1.409613708030369450e-01 6.015881187240582073e-02 7.661577629074300955e-02 1.695541119086070858e-01 2.268328767143776570e-01 2.632790745880277117e-02 1.498418294832540645e-02 1.706697241719755398e-02 3.089713104426507553e-02 5.210614401223141734e-02 4.640965331040741021e-02 2.173175861480248217e-01 5.865847904795933043e-03 1.383306442914254177e-02 2.702515332671477644e-02 6.276338362958852612e-02 7.954187731579975829e-02 6.800411603958696205e-02 3.438863721435223703e-02 3.892792871468855366e-03 1.763776810635456771e-01 6.263651382538180240e-03 2.234588959319035520e-02 1.573833429652483212e-02 2.092580136767320867e-02 1.590566622226795290e-01 2.777293286507151113e-02 2.504331081824386421e-02
7.634832463979007375e-03 2.968411568049340865e-03 1.800903257434214536e-03 3.126177571847747472e-01 4.800602519774748583e-03 3.696695698973228097e-03 2.421884674537007898e-01 1.035357701983035533e-01 1.518231383564973280e-01 1.938092184708637422e-01 1.811982439372035111e-02 2.161821088221076506e-02 2.813233327244988452e-02 5.360894503830690438e-02 3.967559398672286866e-03 1.055507476174056582e-02 6.642535482268002202e-03 3.014039599686732865e-02 2.997514150428759808e-02 2.361693807275921930e-02 2.438306734239126597e-02 7.972772742612670507e-03 5.188449120372020523e-02 8.382620566033956166e-02 1.476797532196206554e-02 1.246870518006461606e-02 3.963121229220863129e-02 4.476656890600372307e-02 3.298218161571754570e-02 2.873679882476961114e-02
2.725369851300950361e-03 1.068088992239169107e-03 2.045440186567408156e-03 4.284890147899071862e-03 2.855450741642430890e-03 2.002010974954375189e-01 9.805366784853997153e-02 7.211405549516552993e-02 2.266371030114922580e-01 5.953890038230161968e-03 5.947998314191019903e-02 2.197806448605443830e-02 3.229526440068574561e-02 5.842270373436152242e-02 2.397367985463321471e-01 9.221176773818491254e-03 2.476421927811334744e-01 1.145402859537005963e-01 1.641673905833738456e-01 4.810236467162132615e-03 1.004059002717616438e-02 1.112250523251327727e-01 5.690078024908618720e-02 2.629820186824319284e-01 6.814293306347964096e-02 1.845952752868181557e-01 3.733200287520162947e-02 6.430348786061887423e-02 2.712852802712814038e-01 4.610501190935580029e-02
2.761479854926935078e-03 2.188731345212950423e-03 1.416562292702505362e-03 2.919857093628648870e-01 2.985058214411442368e-01 1.181636181888163772e-01 8.071326618652993612e-02 8.480407197756291426e-02 9.491066300695956415e-02 3.761197638634313778e-01 1.101345525129969749e-01 1.100384227510796536e-01 8.790479263785294650e-02 8.824119266198099387e-02 2.198541601836182524e-01 1.474910583881090254e-01 1.034277598643262852e-01 6.425279919949584972e-02 5.543609919179536688e-02 4.131660143934411805e-02 3.300555511499934230e-02 4.809419249614284297e-02 7.305416725619494345e-02 1.697674067227198935e-01 2.891799556450064257e-01 1.299603986756603102e-01 1.991061124738776611e-01 1.377386829280783376e-01 1.418959005262784290e-01 9.339944571586905608e-02
3.749066005624036076e-03 1.929869129141792601e-03 1.455424980192899804e-03 2.553917274881200433e-03 2.546691575409370991e-03 2.914036323800020534e-01 3.607958887193680152e-03 3.121720726947109417e-03 1.308263107839526262e-01 9.481059470704475411e-02 3.547338366598190573e-02 8.208891576834846660e-02 2.048971556849047693e-01 1.857739300257689463e-01 1.700147306123062779e-02 1.244520939054845170e-02 1.172395822783149633e-01 1.388692296016000582e-01 6.279341165216235920e-02 2.773788369139198323e-02 2.691522802688583668e-02 4.191439935154201574e-02 6.339437260309409294e-02 1.922542124461369961e-01 1.933207512577641563e-01 4.558447061154197871e-02 5.053462502268481898e-02 6.484014482984176708e-02 2.106594827862112995e-01 4.302236313662424066e-02
5.039795266769355429e-03 4.308384581289635522e-03 1.294249126017736531e-03 4.334156022693447415e-03 5.369829229496012914e-03 1.005122864961352502e-02 8.342387354576425232e-03 3.273933857223641497e-01 1.297820693715927842e-01 7.535229858672222447e-02 2.284393508264349892e-02 2.916620723669019130e-02 3.105571467961989324e-02 1.051815759484221457e-01 1.192898406165403269e-01 4.987752303295296674e-02 4.119944245171472397e-02 4.444907961369908012e-02 5.986743605167941379e-02 3.462114583631949183e-02 2.457256677757723926e-02 3.656641351925772609e-02 4.153291826917394902e-02 6.880885908337251722e-02 2.133282094000091833e-01 3.348963600253969386e-02 4.849122551955321186e-02 7.913661736860601315e-02 9.521444634496202541e-02 1.887233514430485537e-01
2.744672594347877855e-03 6.753603485164599851e-03 1.988317359432863543e-03 2.073659929867648424e-03 9.679608718730928207e-03 1.007957108744639112e-02 8.394513105464533956e-03 2.240173323566303776e-01 1.730213400649198430e-01 1.623618865041383252e-01 6.696696310097857707e-02 3.387541932334631190e-02 2.025547086262643320e-02 3.152723697702726480e-02 1.426437891216915943e-01 3.705719415632751507e-02 9.937044429521632583e-02 1.177443368627132704e-02 2.315826117591091374e-02 1.336699293648000442e-01 3.450565254513029978e-02 4.826609769478625717e-02 4.199139582418084243e-02 4.587647108823827286e-02 6.057224894894924772e-02 4.625380763679941970e-02 5.434594568872846976e-02 6.661647494573137707e-02 8.924023528186300624e-02 2.184460838559727225e-01
