24.1246567667775 24.1246567667775 24.1246567667775 24.1246567667775 24.1246567667775 24.1246567667775 24.1246567667775 24.1246567667775 24.1246567667775 24.1246567667775 24.1246567667775 24.1246567667775 24.160309889545 24.2645726272735 24.3697678243739 24.4758939779738 24.4237545072706 24.3191072615805 24.2135299666266 24.1246567667775 24.1246567667775 24.1246567667775 24.1246567667775 24.1246567667775 24.1246567667775 24.1246567667775 24.1246567667775 24.0570778017269 23.9894491215347 23.9227372710383
24.1246567667775 24.1246567667775 24.1246567667775 24.1246567667775 24.1246567667775 24.1246567667775 24.1246567667775 24.1246567667775 24.1246567667775 24.1246567667775 24.1246567667775 24.1246567667775 24.1441369618727 24.1998525786392 24.2565004124038 24.3140789606339 24.2855631627241 24.2294634735663 24.1724339767326 24.1246567667775 24.1246567667775 24.1246567667775 24.1246567667775 24.1246567667775 24.1246567667775 24.1246567667775 24.1246567667775 24.0080978500819 23.8919213508328 23.7766614428745
24.1246567667775 24.1246567667775 24.1246567667775 24.1246567667775 24.1246567667775 24.1246567667775 24.1246567667775 24.1246567667775 24.1246567667775 24.1246567667775 24.1246567667775 24.1246567667775 24.1270301337061 24.1341996202531 24.1423010814417 24.1513330150794 24.1483016824061 24.1407485589785 24.1322658694445 24.1246567667775 24.1246567667775 24.1246567667775 24.1246567667775 24.1246567667775 24.1246567667775 24.1246567667775 24.123840477863 23.9581992951797 23.7934759675454 23.6296689928133
24.1246567667775 24.1246567667775 24.1246567667775 24.1246567667775 24.1246567667775 24.1246567667775 24.1246567667775 24.1246567667775 24.1246567667775 24.1246567667775 24.1246567667775 24.1246567667775 24.1246567667775 24.1246567667775 24.1246567667775 24.1246567667775 24.1246567667775 24.1246567667775 24.1246567667775 24.1246567667775 24.1246567667775 24.1246567667775 24.1246567667775 24.1246567667775 24.1246567667775 24.1246567667775 24.1220802473247 23.9429589780402 23.7638374206848 23.5847155755722
24.1246567667775 24.1246567667775 24.1246567667775 24.1246567667775 24.1246567667775 24.1246567667775 24.1246567667775 24.1246567667775 24.1246567667775 24.1246567667775 24.1246567667775 24.1246567667775 24.1246567667775 24.1246567667775 24.1246567667775 24.1246567667775 24.1246567667775 24.1246567667775 24.1246567667775 24.1246567667775 24.1246567667775 24.1246567667775 24.1246567667775 24.1246567667775 24.1246567667775 24.1246567667775 24.1203842906226 23.9412648710401 23.7621451634006 23.5830251680183
24.1246567667775 24.1246567667775 24.1246567667775 24.1246567667775 24.1246567667775 24.1246567667775 24.1246567667775 24.1246567667775 24.1246567667775 24.1246567667775 24.1246567667775 24.1246567667775 24.1246567667775 24.1246567667775 24.1246567667775 24.1246567667775 24.1246567667775 24.1246567667775 24.1246567667775 24.1246567667775 24.1246567667775 24.1246567667775 24.1246567667775 24.1246567667775 24.1246567667775 24.1246567667775 24.1186886222922 23.9395710520973 23.7604531938593 23.5813350478926
24.0737494289668 24.077791162124 24.0926408945223 24.1065464156883 24.11950922654 24.1246567667775 24.1246567667775 24.1246567667775 24.1246567667775 24.1246567667775 24.1246567667775 24.1246567667775 24.1246567667775 24.1246567667775 24.1246567667775 24.1246567667775 24.1246567667775 24.1246567667775 24.1246567667775 24.1246567667775 24.1246567667775 24.1246567667775 24.1246567667775 24.1246567667775 24.1246567667775 24.1246567667775 24.1169932423194 23.9378775211977 23.7587615120466 23.5796452151813
23.8994763985995 23.9124323252482 23.9758229394057 24.0382695877789 24.0997737709458 24.1246567667775 24.1246567667775 24.1246567667775 24.1246567667775 24.1246567667775 24.1246567667775 24.1246567667775 24.1246567667775 24.1246567667775 24.1246567667775 24.1246567667775 24.1246567667775 24.1246567667775 24.1246567667775 24.1246567667775 24.1246567667775 24.1246567667775 24.1246567667775 24.1246567667775 24.1246567667775 24.1246567667775 24.1152981506901 23.9361842783271 23.7570701179491 23.5779556698704
23.7252033315828 23.7480172120043 23.8599477185705 23.9709345047828 24.0809790708792 24.1246567667775 24.1246567667775 24.1246567667775 24.1246567667775 24.1246567667775 24.1246567667775 24.1246567667775 24.1246567667775 24.1246567667775 24.1246567667775 24.1246567667775 24.1246567667775 24.1246567667775 24.1246567667775 24.1246567667775 24.1246567667775 24.1246567667775 24.1246567667775 24.1246567667775 24.1246567667775 24.1246567667775 24.1136033473899 23.9344913234713 23.7553790115518 23.5762664119455
23.5509302279214 23.5845455818672 23.7450149917458 23.9045409266825 24.0631248865755 24.1246567667775 24.1246567667775 24.1246567667775 24.1246567667775 24.1246567667775 24.1246567667775 24.1246567667775 24.1246567667775 24.1246567667775 24.1246567667775 24.1246567667775 24.1246567667775 24.1246567667775 24.1246567667775 24.1246567667775 24.1246567667775 24.1246567667775 24.1246567667775 24.1246567667775 24.1246567667775 24.1246567667775 24.1119088324052 23.9327986566162 23.7536881928407 23.5745774413931
23.4816865816592 23.5193063496641 23.698407376174 23.8775086985142 24.0566103163698 24.1246567667775 24.1246567667775 24.1246567667775 24.1246567667775 24.1246567667775 24.1246567667775 24.1246567667775 24.1246567667775 24.1246567667775 24.1246567667775 24.1246567667775 24.1246567667775 24.1246567667775 24.1246567667775 24.1246567667775 24.1246567667775 24.1246567667775 24.1246567667775 24.1246567667775 24.1246567667775 24.1246567667775 24.1115974108269 23.9491423657626 23.7857702229553 23.6214824830872
23.4816865816592 23.5210464709734 23.7001456503391 23.8792451255206 24.0583448962029 24.1246567667775 24.1246567667775 24.1246567667775 24.1246567667775 24.1246567667775 24.1246567667775 24.1246567667775 24.1246567667775 24.1246567667775 24.1246567667775 24.1246567667775 24.1246567667775 24.1246567667775 24.1246567667775 24.1246567667775 24.1246567667775 24.1246567667775 24.1246567667775 24.1246567667775 24.1246567667775 24.1246567667775 24.1144394295375 24.0005294596588 23.8857026306643 23.7699604428961
23.4816865816592 23.5227862961532 23.701883628689 23.8809812570259 24.060079180849 24.1246567667775 24.1246567667775 24.1246567667775 24.1246567667775 24.1246567667775 24.1246567667775 24.1246567667775 24.1246567667775 24.1246567667775 24.1246567667775 24.1246567667775 24.1246567667775 24.1246567667775 24.1246567667775 24.1246567667775 24.1246567667775 24.1246567667775 24.1246567667775 24.1246567667775 24.1246567667775 24.1246567667775 24.1181998537181 24.0528339696483 23.9865514650725 23.9193538399927
23.4816865816592 23.5245258252183 23.7036213112382 23.8827170930446 24.061813170323 24.1246567667775 24.1246567667775 24.1246567667775 24.1246567667775 24.1246567667775 24.1246567667775 24.1246567667775 24.1246567667775 24.1246567667775 24.1246567667775 24.1246567667775 24.1246567667775 24.1246567667775 24.1246567667775 24.1246567667775 24.1246567667775 24.1246567667775 24.1246567667775 24.1246567667775 24.1246567667775 24.1246567667775 24.1228784492427 24.1060556618588 24.0883164925613 24.0696624410119
23.6408388180677 23.6728071472378 23.8069389678383 23.9420139239049 24.0780305162964 24.1246567667775 24.1246567667775 24.1246567667775 24.1246567667775 24.1246567667775 24.1246567667775 24.1246567667775 24.1246567667775 24.1246567667775 24.1246567667775 24.1246567667775 24.1246567667775 24.1246567667775 24.1246567667775 24.1246567667775 24.1246567667775 24.1246567667775 24.1246567667775 24.1246567667775 24.1246567667775 24.1246567667775 24.1246567667775 24.1246567667775 24.1246567667775 24.1246567667775
23.8151121414859 23.8358397395037 23.9214330483911 24.0079692473965 24.0954468377185 24.1246567667775 24.1246567667775 24.1246567667775 24.1246567667775 24.1246567667775 24.1246567667775 24.1246567667775 24.1246567667775 24.1246567667775 24.1246567667775 24.1246567667775 24.1246567667775 24.1246567667775 24.1246567667775 24.1246567667775 24.1246567667775 24.1246567667775 24.1246567667775 24.1246567667775 24.1246567667775 24.1246567667775 24.1246567667775 24.1246567667775 24.1246567667775 24.1246567667775
23.9893855015119 23.9979296436818 24.0349854291222 24.0729838593509 24.1119234359062 24.1246567667775 24.1246567667775 24.1246567667775 24.1246567667775 24.1246567667775 24.1246567667775 24.1246567667775 24.1246567667775 24.1246567667775 24.1246567667775 24.1246567667775 24.1246567667775 24.1246567667775 24.1246567667775 24.1246567667775 24.1246567667775 24.1246567667775 24.1246567667775 24.1246567667775 24.1246567667775 24.1246567667775 24.1246567667775 24.1246567667775 24.1246567667775 24.1246567667775
24.1246567667775 24.1246567667775 24.1246567667775 24.1246567667775 24.1246567667775 24.1246567667775 24.1246567667775 24.1246567667775 24.1246567667775 24.1246567667775 24.1246567667775 24.1246567667775 24.1246567667775 24.1246567667775 24.1246567667775 24.1246567667775 24.1215553069499 24.1190623283602 24.1174946626322 24.117502556912 24.1191608050223 24.1208172572107 24.1224719134642 24.1241247737694 24.1246567667775 24.1246567667775 24.1246567667775 24.1246567667775 24.1246567667775 24.1246567667775
24.1246567667775 24.1246567667775 24.1246567667775 24.1246567667775 24.1246567667775 24.1246567667775 24.1246567667775 24.1246567667775 24.1246567667775 24.1246567667775 24.1246567667775 24.1246567667775 24.1246567667775 24.1246567667775 24.1246567667775 24.1246567667775 24.0765349175736 24.0255035451395 23.9753972445096 23.9432240343248 23.9448820174431 23.9465382049266 23.9481925967621 23.9498451929365 23.9514959934364 23.9531449982485 23.9547922073598 23.9564376207574 23.9580812384274 23.9597230603574
24.1246567667775 24.1246567667775 24.1246567667775 24.1246567667775 24.1246567667775 24.1246567667775 24.1246567667775 24.1246567667775 24.1246567667775 24.1246567667775 24.1246567667775 24.1246567667775 24.1246567667775 24.1246567667775 24.1246567667775 24.1246567667775 24.0305874853882 23.9310187068671 23.8323747591104 23.7689454752456 23.7706031933776 23.7722591161611 23.773913243584 23.7755655756325 23.7772161122934 23.7788648535538 23.7805117994002 23.7821569498195 23.7838003047988 23.7854418643247
24.1246567667775 24.1246567667775 24.1246567667775 24.1246567667775 24.1246567667775 24.1246567667775 24.1246567667775 24.1246567667775 24.1246567667775 24.1246567667775 24.1246567667775 24.1246567667775 24.1246567667775 24.1246567667775 24.1246567667775 24.1246567667775 23.9837132469767 23.8356080498726 23.6884274425117 23.5946668796803 23.5963243328305 23.5979799909201 23.5996338539352 23.6012859218633 23.6029361946907 23.6045846724044 23.6062313549909 23.6078762424376 23.6095193347311 23.611160631858
24.1246567667775 24.1246567667775 24.1246567667775 24.1246567667775 24.1246567667775 24.1246567667775 24.1246567667775 24.1246567667775 24.1246567667775 24.1246567667775 24.1246567667775 24.1246567667775 24.1135677413082 24.0939684592144 24.0752980114403 24.0575549006816 23.9225471821702 23.7802356296028 23.6360727119458 23.5367506978617 23.5186502472845 23.5014735337353 23.485219059789 23.4816865816592 23.4816865816592 23.4816865816592 23.4816865816592 23.4816865816592 23.4816865816592 23.4816865816592
24.1246567667775 24.1246567667775 24.1246567667775 24.1246567667775 24.1246567667775 24.1246567667775 24.1246567667775 24.1246567667775 24.1246567667775 24.1246567667775 24.1246567667775 24.1246567667775 24.0864157384251 24.0182808685167 23.9510745908548 23.8847954084745 23.8405959691087 23.7953585710874 23.7482702902796 23.692680514197 23.6260435833408 23.5603301489577 23.495538713962 23.4816865816592 23.4816865816592 23.4816865816592 23.4816865816592 23.4816865816592 23.4816865816592 23.4816865816592
24.1246567667775 24.1246567667775 24.1246567667775 24.1246567667775 24.1246567667775 24.1246567667775 24.1246567667775 24.1246567667775 24.1246567667775 24.1246567667775 24.1246567667775 24.1246567667775 24.0583333631475 23.9416638924176 23.8259227718784 23.7111085049058 23.7604977864762 23.812332568575 23.8623169501551 23.8476869768747 23.732514552841 23.6182653847424 23.5049379758333 23.4816865816592 23.4816865816592 23.4816865816592 23.4816865816592 23.4816865816592 23.4816865816592 23.4816865816592
24.1246567667775 24.1246567667775 24.1246567667775 24.1246567667775 24.1246567667775 24.1246567667775 24.1246567667775 24.1246567667775 24.1246567667775 24.1246567667775 24.1246567667775 24.1246567667775 24.0293208530295 23.8641177682183 23.6998427915603 23.5364944267704 23.682252161192 23.8311571494909 23.9782122195035 24.001770321661 23.8380633912976 23.6752794763486 23.513417080409 23.4816865816592 23.4816865816592 23.4816865816592 23.4816865816592 23.4816865816592 23.4816865816592 23.4816865816592
24.1246567667775 24.1246567667775 24.1246567667775 24.1246567667775 24.1246567667775 24.1246567667775 24.1246567667775 24.1246567667775 24.1246567667775 24.1246567667775 24.1246567667775 24.1246567667775 24.0200537389433 23.8409771521382 23.6619002731743 23.4828231023663 23.6596275232913 23.8387052768471 24.0177833213052 24.0654160118989 23.9178430830335 23.7693485929615 23.6199340383903 23.5658798836644 23.5347523862677 23.504543761766 23.4816865816592 23.4816865816592 23.4816865816592 23.4816865816592
24.1246567667775 24.1246567667775 24.1246567667775 24.1246567667775 24.1246567667775 24.1246567667775 24.1246567667775 24.1246567667775 24.1246567667775 24.1246567667775 24.1246567667775 24.1246567667775 24.0183383256064 23.8392635813917 23.6601885450324 23.4822599464758 23.6613355661818 23.84041147709 24.0194876788867 24.0840519802202 23.9850155350779 23.8850577689553 23.78418017822 23.6999611412925 23.6202985716563 23.5415546354881 23.4816865816592 23.4816865816592 23.4816865816592 23.4816865816592
24.1246567667775 24.1246567667775 24.1246567667775 24.1246567667775 24.1246567667775 24.1246567667775 24.1246567667775 24.1246567667775 24.1246567667775 24.1246567667775 24.1246567667775 24.1246567667775 24.0166232047279 23.8375503027897 23.6584771087209 23.4839695404826 23.6630433178696 23.8421173864451 24.0211917458943 24.1036109761967 24.0531100280558 24.0016879991435 23.9493463854877 23.8331236801195 23.7049270247112 23.5776487633612 23.4816865816592 23.4816865816592 23.4816865816592 23.4816865816592
24.1246567667775 24.1246567667775 24.1246567667775 24.1246567667775 24.1246567667775 24.1246567667775 24.1246567667775 24.1246567667775 24.1238839891739 24.1206476306357 24.1183431858767 24.1169691594213 24.0091472075132 23.8329295888587 23.6557821610047 23.485666743512 23.6646693021767 23.8438230049255 24.0228955223417 24.1240927640896 24.1221263264817 24.1192390482937 24.115432425214 23.9653677348471 23.7886379798804 23.6128263795802 23.4816865816592 23.4816865816592 23.4816865816592 23.4816865816592
24.1246567667775 24.1246567667775 24.1246567667775 24.1246567667775 24.1246567667775 24.1246567667775 24.1246567667775 24.1246567667775 24.1135044924589 24.0617364696656 24.0109001176017 23.9609939411312 23.8633861599093 23.735702483435 23.6070892400404 23.4858252380782 23.6162931287448 23.7476860997169 23.88000265541 23.9550684339212 23.9567235024757 23.9583767785515 23.9600282621354 23.8479604203388 23.7150774605482 23.5812760081705 23.4816865816592 23.4816865816592 23.4816865816592 23.4816865816592
