7.962838737158374203e-01 3.206447123717470066e-02 9.408009013001518428e-03 1.184465305191330191e-02 8.999799298211288295e-03 1.971864681094339863e-02 1.951519951120758711e-02 5.265687982130583950e-02 9.528238960743129482e-02 4.165652819776700239e-02 3.373595670102764316e-02 4.718504368813821737e-01 2.894802894494228895e-01 1.636635104339349486e-02 1.258134621988983744e-02 3.097932388280946192e-01 1.013581036074014639e-02 1.282767082155158653e-02 1.145122366389617063e-02 8.086673526959778716e-03 9.645114730804555947e-01 1.492464247365215824e-01 1.142339434800821452e-01 4.835490152135457076e-01 1.036177678826629922e+00 8.920586572209228127e-01 4.475817585500918572e-01 4.086999988993651745e-02 3.863837007067354168e-02 4.687569783751819458e-02
5.501067174997272824e-01 3.558040349762752602e-02 2.465845456150588672e-02 2.006200848241048926e-02 1.398622049368080690e-02 7.510563371057354942e-02 4.162915092415234858e-02 5.131761211075558382e-02 2.850715455226055309e-02 1.969332676888642039e-02 2.263414140896775895e-02 2.444423961823986857e-01 3.396421482773098743e-01 1.482971695865421130e-02 1.495480532761562543e-02 9.936633579285161777e-03 9.855699002513563026e-03 2.377229567309165070e-02 1.762999852064965969e-02 1.069020386982539803e-02 5.579752691565695866e-01 1.435218045942263654e-01 2.981333090966091781e-01 2.862797936840376645e-01 2.853585511742953718e-01 4.273365103477475557e-01 1.636284947269555368e-01 4.079526352020923508e-02 5.691516852026271694e-02 5.571670676635460256e-02
9.474486170336121615e-02 9.816357146597945449e-02 1.713806471226582695e-01 1.391293361927166405e-01 2.960223241701710473e-01 7.020315318110666170e-02 5.277861123652828335e-01 5.566237239316079721e-01 1.669369341697156672e-01 3.011085307078022189e-02 7.417349904025236085e-02 5.361211767101128206e-02 1.901224318608804587e-02 3.828554123658740177e-02 5.174212680817861232e-01 3.855266820629745655e-02 1.810230165876243816e-02 2.995770053980284855e-02 7.071271173139732913e-02 2.095198770881280884e-02 3.526034892022652523e-01 1.187275730375455807e-01 1.813116190331834077e-01 6.878631175249930174e-02 4.679307618275223984e-02 3.498279949149769863e-02 3.086052593079434761e-02 2.413884771423562003e-02 4.098906925624081626e-02 4.570899836081530193e-02
3.571915591344856228e-02 1.064838030862456653e-01 2.335483162682253921e-01 1.885725710515947784e-01 9.780718115178345384e-02 5.250637710191271429e-02 1.073097006038360890e+00 6.681915478909594697e-01 3.629674366548176212e-01 3.963262903413114491e-02 2.037127825964068356e-02 3.757051710188673982e-02 1.630135725005832023e-02 2.703166665840460794e-02 4.127244554730998827e-01 3.756998075573051432e-01 8.183191719620426241e-01 1.213664680076866932e-02 6.248402751969410474e-03 7.687789976955505637e-03 6.534477182855866761e-01 2.592083938514024855e-01 8.888220858427574311e-02 1.880473327302581987e-01 3.858649473724168333e-02 3.075349398853908719e-02 2.696292755480489411e-02 2.555506746845447388e-02 5.184587562428313173e-02 5.623471953431481013e-02
2.059270842339558719e-02 6.654046220114831489e-02 1.855767891872854014e-01 7.198762565385581624e-02 5.994064333971268338e-02 6.315953183095918133e-01 1.099802921780785647e+00 6.197623388094403163e-01 2.279975590459185630e-01 9.859433567015750410e-02 9.149371564841843329e-02 8.849381395068192657e-02 1.638301067900064037e-02 2.943751760102600312e-02 5.639632668632408308e-01 2.416319223571166408e-01 4.174929607499072021e-02 1.402996813748060186e-02 1.758904248708795595e-02 1.023303035795660940e-02 8.832793347713762538e-03 3.544596836809241203e-01 9.055833127411284655e-01 3.053560927344708409e-01 7.002763885392628007e-02 4.009992359449456728e-02 2.980422917934082150e-02 3.445523289621053170e-02 5.389909679229692996e-02 1.980505010554670375e-01
3.182224918050689799e-02 3.580741200621928577e-02 1.301016843021390035e-01 8.928756138123261632e-02 4.772067952650090039e-02 3.577437216599051450e-01 4.547644090901706848e-01 4.827014390916429254e-01 3.906532971435630053e-01 1.401243527558540258e-01 1.096288269259061143e-01 7.558403138640108765e-02 4.573016162799460327e-01 1.814217024582998328e-01 1.608184582488721703e-01 2.932949753988740027e-01 3.237994210755788110e-02 3.970216540436509733e-01 1.148716042261795252e-02 2.703860018553952763e-02 4.172521579432515032e-02 3.797396864138961881e-02 1.365736916394030658e-02 1.869585274725302226e-01 1.048719161509411579e-01 1.021513279414146269e-01 6.605893733806149359e-02 4.553549715628742167e-02 6.011371101472816336e-02 1.079915323184462289e-01
2.982954528897628355e-01 4.783827172100419411e-01 4.731559436577816302e-01 3.702426635228849017e-02 1.406993780257459990e-02 3.169173955344988663e-02 6.153144552071666828e-02 3.406516222895673157e-02 4.100541823487454524e-02 3.989138949008842056e-02 3.120128353864759507e-02 5.668902938164560590e-01 2.606302646240944432e-01 1.321636933171373429e-01 8.251177233666356914e-02 1.524363894088182347e-01 8.761075069691726114e-01 3.928014963752515243e-01 1.922835520859285038e-02 2.717485679512587904e-02 1.904025933944063567e-02 3.980645201158902746e-01 1.859936080189869001e-01 1.753312260619468155e-01 7.138914972441456896e-02 7.377376130352697459e-02 6.518660661212014040e-02 5.630482226003075824e-02 6.453016207478812216e-02 1.532000723599479253e-01
5.358659365647507888e-01 3.321394655237238508e-02 5.923478912496443760e-01 2.382841582014714327e-02 2.114970987071457253e-02 2.398120163752053349e-02 2.124044233146347646e-02 2.003309628149769692e-02 2.368001849353893254e-02 8.324039030949220708e-01 3.307505424991472598e-01 2.059335909529868419e-02 2.187706693674350278e-01 8.403932343979307606e-02 1.000964961969297295e-01 1.944578329893524027e-01 2.978538854855266801e-02 3.475937870725154255e-02 2.303182029370519357e-02 2.090069356503521797e-02 5.348263670236833578e-01 3.148990401679575557e-01 1.272268835933169362e-01 1.069826551405555909e-01 5.117480947717307355e-02 5.325591650504536007e-02 8.238349578177989185e-02 9.488648590647325021e-02 9.640458762231292333e-02 2.852822613022172882e-01
2.324275659703034513e-02 2.058232654362590272e-02 4.495237460978277477e-01 5.068712169542689133e-02 2.537874633819685657e-02 1.088028222491012678e-02 3.501027943231831835e-02 1.755254527160136913e-02 2.092586200207330674e-02 2.338249080401679642e-02 1.708468066089752560e-02 1.738627499246064856e-02 3.352856682114888076e-02 2.941456132518432964e-02 3.063642749365056983e-01 2.652202305804222116e-01 1.409372235423223332e-02 3.151148441759383384e-02 3.821644667049076821e-02 6.665965694370912242e-01 1.328250695819282179e-01 1.384990169329658460e-01 1.506798080665272821e-01 9.881115953797042772e-02 5.804436433089170400e-02 8.572334635501728528e-02 3.032800447772407426e-01 5.642817282799407197e-01 2.619033141095183925e-02 8.649055906708937869e-01
1.974779830251807700e-02 1.605547058605642785e-02 2.644380738420836971e-02 2.602363307592553410e-02 2.661829164393670483e-02 3.511814665590826112e-01 3.881368795701770763e-02 1.739354523096867458e-02 3.580614266033538828e-01 1.285433518893304428e-01 1.763875511128969523e-02 1.654652040201964186e-02 3.500422087821068035e-02 4.435057137002994254e-02 2.303643240528847197e-02 2.508877565578917015e-02 1.165447535815308105e-01 1.111652898469551454e-01 6.059157500505439609e-02 4.001636666005569526e-02 1.584736782615948358e-01 1.001963430178053477e-01 1.149014935709318785e-01 1.264983107550871066e-01 7.077959080560339289e-02 8.817085680107199230e-02 7.680888386244256738e-01 2.051822090699573567e-02 2.609356687458680435e-02 4.497665472380517060e-01
3.202918295005227622e-02 1.627724226045607070e-02 2.324799758912499473e-02 1.721449757372417802e-02 4.171671165826331545e-02 2.049326129787080730e-01 1.979564342824413348e-01 1.795353580056629761e-01 1.221748284906599424e-01 1.500865298817040394e-02 1.353664656321519055e-01 2.218521235627025634e-01 4.627855997799478760e-01 2.290542127058997901e-01 4.233978417877033718e-02 8.331969227286910307e-02 1.545508803109767182e-01 4.243801302782403834e-02 1.546845047214960057e-02 2.480847434661490603e-01 1.045454498883478384e-01 9.337305998050793310e-02 1.204550504090510371e-01 1.686683827296341642e-01 1.804423077758601779e-01 9.678341731827413974e-02 1.460463171474890853e-01 1.166439376467467565e-01 1.118420537259755959e-01 8.750891807216555629e-02
3.006130241737737241e-01 1.644483978326772011e-01 3.796769919570629204e-02 4.131319636656671096e-02 3.913744148653531402e-02 3.069375673043466812e-01 1.439230947160193841e-01 9.945026227982799172e-02 1.180667742724973435e-01 2.427005360740933787e-02 3.999166351299401206e-02 2.702567869306737869e-01 4.780609728461006069e-01 2.491745644134471527e-01 9.027071031176582550e-02 1.023864646913778681e-01 1.129742850674383681e-01 6.638741780898939349e-02 2.556325626224083963e-02 5.681121870198916346e-01 1.004510987696305979e-01 1.021958893953256453e-01 1.207585779319267361e-01 2.159794219315417374e-01 2.053529353522399459e-01 1.460871437751635193e-01 1.127109599039451127e-01 1.095364914373031934e-01 1.280995997091393945e-01 1.479185215877402704e-01
7.111300140684798099e-02 1.676255344617682552e-01 3.705998977633399027e-01 4.397611364159287328e-02 6.940700514666651166e-01 2.435285569349215085e-01 1.369651634777381555e-01 1.203809809770528538e-01 1.543977364725004908e-01 1.302627370157887626e-02 3.172628481400904255e-01 8.992457172446358116e-02 3.549663059538131216e-01 1.533167795065834005e-01 4.856569867186021072e-02 5.661336447328927518e-02 2.095808805174179806e-02 3.078414074893674746e-02 4.775283547845066145e-02 2.147248871753444296e-02 9.660308299008361910e-02 1.058171006235417988e-01 1.326707090570811709e-01 2.202222421005941289e-01 2.789545093194871206e-01 2.465028698224214776e-01 1.832108078766431225e-01 1.852439419534646914e-01 1.746837875271944618e-01 1.548983832332869182e-01
6.110567735114161292e-02 1.678304264299480264e-01 2.597014235950307337e-01 1.822498625106206971e-01 1.079204307812688668e-01 4.755190247327819031e-01 4.212570515432833423e-02 1.965501867750941642e-02 2.069445422091642506e-01 7.005879033180698046e-02 2.603647069769683409e-01 1.706628327787524865e-02 1.612700629707665423e-01 2.204726971653990231e-01 2.373546435613066996e-01 3.233571376842437339e-01 2.929698444579559857e-01 1.913137272492690666e-01 5.254968124233395654e-01 2.505462799767943505e-01 3.399255406553197689e-02 6.323236565746112037e-01 4.700158345880120492e-01 2.571761600495719308e-02 4.385769374120278979e-02 3.498389714195601630e-02 8.627796547399300964e-02 4.096928581348865950e-02 2.379021798385958786e-01 2.941978243503262092e-01
5.920468366771008961e-02 5.708607492867873168e-02 1.354877209672729621e-01 5.418808933195828903e-02 3.456427386617296205e-01 8.711159241308553958e-02 2.050086717788003957e-02 2.930962332394597761e-02 2.213240009895990623e-02 2.664825501743541825e-01 5.725106988078220160e-01 8.283447150691659877e-02 1.431549109591134239e-01 1.836487739232345318e-01 1.675824368183000679e-01 2.044463339954306902e-01 3.527826189590643202e-01 6.166193461591775726e-01 6.347854985364356217e-01 5.030058260034420137e-01 3.070192224597819222e-02 3.866293834895749570e-02 3.328370360719519472e-02 7.835668403629317269e-02 9.221699260287732902e-02 4.773430230794231122e-01 4.833706547549893595e-01 1.279764425090942348e-01 2.488622345895586119e-01 2.012336043847613443e-01
5.718788625316214430e-02 6.005686434787482764e-02 1.146545041927547470e-01 1.188598106161333490e-01 7.597388487369080567e-02 9.163142381555812455e-02 5.607415269881652620e-01 1.391021945072993919e-02 3.029424790631725720e-02 1.349101854676758652e-02 1.468627120450878391e-02 1.200806568034963433e-02 8.018480973472104367e-02 1.640821132589053710e-01 1.545776483812451030e-01 2.390153270530047114e-01 4.203280232208916889e-01 5.193033900259509394e-01 3.050948576802032797e-01 6.733574891820298669e-02 4.056801060230279948e-02 2.793231504106105101e-01 4.078326605229481983e-01 7.016531246686972256e-01 6.821000347068822967e-01 9.175509076189973801e-01 7.558457014628600090e-01 2.546309850534655972e-01 3.704131019096323918e-01 2.251236245287464299e-01
7.893547679463470967e-02 8.778649276689794168e-02 7.825732466203776105e-02 6.835854590927110952e-02 9.691751791178887521e-02 1.699356091377771660e-01 8.609883943707015430e-02 2.687550466451406606e-01 1.228733674508445950e-01 2.158343491974954939e-02 1.656217824322958262e-02 2.750401713128518624e-02 5.654053268854655062e-02 8.424676570432827749e-02 1.123899396488283325e-01 2.033495979303091006e-01 4.477721533560265477e-01 4.609586717097277631e-01 2.229770084110851702e-01 7.774723837654320957e-02 3.366742666573071530e-01 6.127423075833671184e-01 7.884799966211676336e-01 8.429410225161627634e-01 7.818560692083281749e-01 7.093453370193213425e-01 1.091046209671365119e+00 2.086097403176915832e-01 4.964936679214701498e-01 2.725866507230065849e-01
2.107410788750628261e-01 1.605670138439635741e-01 7.175804039848837634e-02 9.537454234984638068e-02 1.128668114680797356e-02 4.058942859364998018e-02 2.092062371287018996e-01 1.675975056627365400e-01 1.651402980508280549e-01 8.468173712966839406e-02 3.645616430684179426e-02 1.357867880320875673e-02 1.367816537844872109e-02 3.105921961026479952e-02 5.474829848096597618e-02 2.537163236183401782e-01 2.736451698976588021e-01 3.423154911090200980e-01 6.103538029487436123e-02 1.093928402787508192e-01 3.738639784798720722e-01 8.112763201250603462e-01 1.003343197482732485e+00 1.097991271907578392e+00 9.707720793685430394e-01 9.972171286089178688e-01 9.733687786551656895e-01 7.923517759505178670e-01 4.476641484052400893e-02 3.116182360467623438e-02
8.518383640204442442e-02 2.266636627299797591e-01 3.737453299569993281e-01 2.261787050446330272e-02 3.248476360250544814e-02 4.224988193877903669e-02 1.334393222206778085e-01 1.667225541209279571e-01 1.143969261602839210e-01 9.108831358424239466e-02 2.679374647947528609e-02 4.161291334233065409e-01 6.486287800992168728e-01 1.722073215831526616e-02 2.089984897956448720e-02 1.264887456153234169e-01 4.941382044563922410e-02 1.699507064377981866e-02 5.231730277784943928e-01 4.258074658873083757e-02 1.557395371679978213e-01 8.313296333539796912e-01 1.054271894077037697e+00 1.149425059704019203e+00 8.834602003272632453e-01 4.294854059479217279e-01 7.230583266719836644e-01 4.924870018828899632e-01 8.395151326485532361e-02 3.674513630563082389e-02
1.730859887798886707e-02 2.555688253780924110e-02 1.526739018668479136e-02 1.464875246402224176e-02 2.470115671143337591e-02 1.399472670932111126e-02 7.167484909711625829e-02 9.215683376374840530e-02 8.467605317117229968e-02 2.596114904435777720e-02 1.255705668316214711e-02 2.913030824523646367e-01 5.143424004964123331e-01 1.667463764889262623e-02 3.124127072265068736e-02 2.037500197471900018e-02 3.600874781768453187e-02 1.153957816867508777e-02 2.192983771434298124e-02 1.044072274987768306e-01 5.401460421684156632e-01 1.024053862266782744e+00 1.100811561948374262e+00 1.075969406069634093e+00 8.558593538098424602e-01 6.481974295262399322e-01 6.446667891606217005e-01 4.767366910711027250e-01 1.214480603925934682e-01 1.216201130711543676e+00
3.357782985862055314e-02 2.901063079336258302e-02 1.908837633478052687e-02 1.700486871832983249e-02 2.249427155715402055e-02 9.125871850362100857e-03 4.091280887032276020e-02 4.119239342652141617e-02 1.189157469589808939e-02 8.854508026021348788e-03 4.991340782109567886e-01 4.454590859747071807e-01 2.553845772683538962e-01 1.248577331842503774e-01 2.817661312290425935e-01 6.127970887885470820e-03 2.117451726081319430e-02 4.911412394185728225e-02 4.806308443797032565e-02 2.171839824945710484e-01 5.944358435440673105e-01 8.615017048641266939e-01 3.505508345984824636e-01 5.359397504330749573e-01 7.078872421614115229e-01 4.092428418748613739e-01 3.597464062233121651e-01 3.398685234977703029e-01 6.994849229722378547e-01 7.607162681934898085e-01
2.620187336079105381e-02 2.853592175964169558e-02 7.494672960762221482e-03 6.929940549714799225e-01 6.643824687188373268e-01 9.507767152445794137e-03 7.864030568036209368e-03 3.312449879175117795e-01 4.658831674121233779e-01 8.048781573229586705e-02 1.184087289279321664e-01 1.879652669348035876e-01 1.799111437521813406e-01 5.957975141716603806e-01 1.328450666426393353e-02 1.139008571501195083e-01 2.108162765823121676e-01 3.100577923270312342e-01 2.151505181002883460e-01 1.635858792233468861e-01 1.161221367273388289e-01 4.157999685291162428e-02 1.615084076707716185e-02 3.545745207232488955e-02 1.302208134713310761e-01 4.454452274032279224e-02 6.226851337521611268e-02 9.871650929831111698e-01 1.291668627951298998e-01 1.206379008767492766e-01
5.110935388231477999e-02 4.387232462401934735e-02 9.188775751417500859e-03 5.463336274607691889e-01 9.850524432244019968e-01 7.437230521625541879e-01 8.501644238317876759e-03 1.212937867110113893e-01 1.114407916740017129e-01 4.829585116078259632e-02 1.194505045833693102e-01 2.177243997821771138e-01 2.348662235218092476e-01 1.765687525771008140e-02 1.904155479972312326e-02 5.961312193462158654e-02 2.218505792229021611e-01 4.199400021229487967e-01 4.826789375802576498e-01 4.227736328959348366e-01 9.021968300648201822e-02 2.877091788131163827e-02 3.537517084561117575e-02 8.348181197428772293e-02 1.417307853770404247e-01 4.227592377497706860e-02 2.878789816055220968e-02 4.393045284071162015e-01 1.661167280936133583e-01 1.594819460866316596e-01
5.956858795847558286e-02 8.733133615431105945e-03 4.794936219052966520e-01 2.273820678616821356e-01 3.285603678513074333e-01 7.304417644825740297e-01 9.253955755065951250e-01 1.015693563273807332e-01 5.510198778919871143e-02 6.285001319660624142e-02 1.139919994433609279e-01 1.923904773652898581e-01 1.747394337119535235e-01 8.480101488415671129e-01 2.843365486698026107e-02 7.958182514820863473e-02 1.566027748019733767e-01 3.658322921079174006e-01 4.666807748436904157e-01 3.999368340093545360e-01 2.015104599996579982e-01 1.958385403029438976e-02 7.597058140361871992e-01 3.108673741581852515e-02 1.230916780182726017e-01 6.556231037260111527e-02 9.111725293266709214e-02 7.046897708587670506e-01 1.244353813482086540e-01 1.124646174557459577e-01
3.143184770630370883e-02 1.158577646220649085e-02 5.695018258004978101e-03 7.042208134819146620e-03 2.025928830079964590e-02 2.011031870768043711e-02 1.027545045183577699e+00 4.074546387923420609e-01 5.601974910016620512e-01 7.156728778563257176e-01 6.704007268358390392e-02 8.005271108879043196e-02 1.045256379496747046e-01 1.965301584841934179e-01 1.212629074086446143e-02 2.283129419242204902e-02 2.575559835732421990e-02 1.215706200600284170e-01 1.558808425858695113e-01 1.260833128878003362e-01 1.244725422699938799e-01 3.342341690078875355e-02 1.957802588246526088e-01 3.170428877837957460e-01 2.851045894366023917e-02 6.282857561513514877e-02 1.970197429269255063e-01 1.086047381188935540e-01 1.304267867217730748e-01 1.139309231986499749e-01
1.116775688689622750e-02 4.418432511601015807e-03 6.529187858920062343e-03 1.605464299796660263e-02 1.267573121842591709e-02 9.238355724448066297e-01 4.191284946738454975e-01 2.848083585546947183e-01 8.231898627118613421e-01 2.070339888852547675e-02 2.172386824010587580e-01 8.139056782800349610e-02 1.193486857539770019e-01 2.121767496568794931e-01 1.697326949659949333e-02 2.726141984406896257e-02 1.893302738330913601e-02 4.365900814193867108e-01 6.377216809784171936e-01 2.189867438359081181e-02 4.438613370335806052e-02 4.298528306988201875e-01 2.124172126261249238e-01 9.672986385916781948e-02 2.108008239064535772e-01 7.162821756618088509e-01 1.577637480615324272e-01 2.138431379151552458e-01 1.252867451478960614e-01 1.765178993801501395e-01
1.131315533572291483e-02 9.061012562659873787e-03 6.207433835255722274e-03 1.178488774655355620e+00 1.409111567364428330e+00 5.448159821950110393e-01 3.446492558168106624e-01 3.344607066753101932e-01 3.444673415997982491e-01 8.577597661441461671e-03 4.025059956487419544e-01 4.075039651111984074e-01 3.258724233257083713e-01 3.235066906611719917e-01 8.055804945985585164e-01 5.412315531173897964e-01 3.909108190115492265e-01 2.461793441026876861e-01 2.156498771500174050e-01 1.617797412339767316e-01 1.289911025180362492e-01 1.868350215798017799e-01 2.786010416005438861e-01 6.499364308299916404e-01 1.108228278303423409e+00 5.057981844053159870e-01 7.783846174837231180e-01 5.363430185032213027e-01 5.536725450978940977e-01 3.646148368944482909e-01
1.535861521747065687e-02 7.997085138787409647e-03 6.390214051090990777e-03 1.280556747488889591e-02 1.485632656136919375e-02 1.342053845822090530e+00 1.786992092301984900e-02 1.391015530522213793e-02 4.713808800588195624e-01 3.437052742374288594e-01 1.295336735224389968e-01 3.040973515317891285e-01 7.609144037507182823e-01 6.918310160551458532e-01 6.739833020701689603e-02 5.014414791574008795e-02 4.453282562497210550e-01 5.342140011539847633e-01 2.443728614582645620e-01 1.086247210843358235e-01 1.052564740071881971e-01 1.634292200362083836e-01 2.469640371796243961e-01 7.503057387309787218e-01 7.542407061644782473e-01 1.781187848683400132e-01 1.981046676636928072e-01 2.556148991469872067e-01 8.335708939562599396e-01 1.703550197779698516e-01
2.079128420810221964e-02 1.796029326620759287e-02 6.019905915840367827e-03 2.370445788433018716e-02 3.397846304331867545e-02 6.203581650975557166e-02 4.229278365102155657e-02 6.250476548182051437e-03 4.830483671685287250e-01 2.812666517750407880e-01 8.521109964203360532e-02 1.086095702151455428e-01 1.158115585480380683e-01 3.937592355573413805e-01 4.479580279966212664e-01 1.880632255278984755e-01 1.568914853964100686e-01 1.711638680599942564e-01 2.331573493094293015e-01 1.356491331922263510e-01 9.628989695958084516e-02 1.432606423913725946e-01 1.627619018328295142e-01 2.699881826983921429e-01 8.359249299907386410e-01 1.312999189084763374e-01 1.905131190790418927e-01 3.127321924270383136e-01 3.782065373261372376e-01 7.501637359189906595e-01
1.192382895729798831e-02 2.930449054200836081e-02 9.780315542666123338e-03 1.175296143910767137e-02 6.321335946616324364e-02 6.620952801171485491e-02 4.670468128468401037e-02 1.006406925814229636e+00 7.535194350196500190e-01 6.932317318983682863e-01 2.789148201812112204e-01 1.376712653499431727e-01 8.060299580029237076e-02 1.232677263056729255e-01 5.479493857891356567e-01 1.400451922175491581e-01 3.784916609518351738e-01 5.264915714013657100e-02 1.039558729180546093e-01 5.208564538946787170e-01 1.344474593009909458e-01 1.880462704734921775e-01 1.636041720426099355e-01 1.788980660955808433e-01 2.360761953305088034e-01 1.804560512657524818e-01 2.124432057519945738e-01 2.621611908220199405e-01 3.539541269552226033e-01 8.683329628088755081e-01
