2.032244245222907409e-03 2.995904745959443276e-03 2.636724668353131965e-03 3.361947768745592903e-03 2.578004097942955455e-03 5.698632778980321570e-03 5.696022499702554746e-03 1.553716230169179327e-02 2.840358141037280237e-02 1.269983073754927042e-02 5.832615953792652692e-03 1.318203813585116374e-03 7.701468342958516780e-04 2.888602279025689803e-03 3.371188681215055074e-03 7.407452147453420701e-04 2.652627371083890895e-03 4.756810183815888930e-03 4.409651677963899973e-03 1.578027073318277957e-03 1.402245929209765003e-03 1.938174953171314246e-02 1.504946900999009664e-02 5.667851758663551044e-04 9.726549248417242421e-04 7.690741910062290788e-04 3.656294734839569223e-04 3.898607158047627617e-03 3.815211570881430880e-03 4.829962068955399694e-03
1.637306862748892341e-03 3.631986291407831267e-03 6.551093033144991980e-03 5.380912832209156470e-03 3.764033995182518820e-03 1.695601701620265064e-02 8.127957605039017042e-03 1.037620151729459587e-02 6.843569034232778805e-03 5.806763527690450739e-03 4.053651337078557904e-03 7.824852917075779879e-04 1.031034107732603554e-03 2.353256687883330343e-03 3.278003540558065577e-03 2.089298551837005195e-03 2.638157058441227033e-03 8.902652140622377072e-03 6.920720720571759375e-03 2.125265506558173759e-03 8.505549342967509696e-04 1.861291198954733925e-02 4.889698236463948080e-04 3.565205093743148987e-04 2.539225790564728687e-04 3.356699130212522177e-04 1.479851044549647388e-02 3.952977369362299306e-03 5.773970253780572742e-03 5.803018072951036770e-03
2.019907885856993962e-02 2.055031740855729760e-02 4.345044861738397990e-02 3.536841346247436568e-02 7.501155306798483469e-02 7.682040319688706285e-03 1.443369781698263096e-03 1.570718679905216573e-03 2.562408535953748095e-02 7.771944651322097199e-03 2.061793543149319230e-02 1.351918672277185353e-02 4.909513748523598037e-03 7.122311637479874537e-03 1.351729754769593478e-03 5.603854831556539032e-03 3.859419835428146150e-03 8.199384987005141345e-03 2.828285541952000118e-02 4.823319949001933851e-03 4.897315928531302803e-04 1.538308725274995480e-02 2.432161152085022399e-02 8.541817004773794367e-03 5.098410445496752604e-03 3.413158246014678151e-03 3.099446382493217279e-03 2.495177211445601378e-03 4.276285346307348578e-03 4.811863813733510686e-03
9.566458581921897728e-03 2.758108286972722409e-02 6.053293440026381866e-02 4.890514787318812895e-02 1.992367235920872864e-02 3.081204640415855910e-03 2.444168178578509220e-03 1.656355990961785049e-03 1.023414256374042056e-03 9.589277100457259048e-03 6.133967230157317402e-03 1.205418199143582642e-02 5.397069099484354780e-03 3.540362606402695875e-03 1.026169935294981607e-03 7.657992836023768844e-04 1.629531664827031786e-03 3.139053770293299787e-03 2.287721263027785688e-03 1.993434884772264225e-03 9.156233191126278816e-04 3.454413838626203890e-04 1.085371918740476484e-02 2.174129718143749668e-02 4.193528999877987884e-03 3.111769116866141237e-03 2.686388303399794061e-03 2.556066158083564969e-03 5.203552748695988196e-03 5.666197204629539429e-03
5.610858934213518862e-03 1.763617188227394397e-02 4.924190501640412360e-02 1.908064312791215439e-02 1.081304090633480354e-02 1.570049361134921891e-03 2.394944464727118746e-03 1.328884448288082231e-03 6.175032145034049878e-04 2.166989554203804444e-02 2.729764745815260046e-02 2.299201730783103845e-02 3.354073165014040143e-03 3.225317544220443564e-03 1.499989495435287163e-03 5.542347546706103117e-04 4.843980868704337098e-03 2.844643332245910036e-03 4.669009853377537912e-03 2.730276641205834319e-03 1.882893586068928263e-03 5.346912089581549316e-04 1.335356324070516298e-03 4.127503560429130651e-04 7.556643889162867507e-03 4.143317654990685481e-03 2.889592011432825461e-03 3.347071856233485229e-03 5.243817840752874014e-03 1.930995724827778634e-02
5.685622396233732875e-03 6.069839152229580988e-03 2.721477170261132547e-02 2.180014364139368568e-02 8.590862068145167785e-03 9.150554847129397209e-04 1.102652483641404458e-03 1.167204148566958460e-03 1.087652683138615704e-03 3.319298999185908705e-02 2.621206244063014126e-02 1.368157117898495707e-02 1.916542140442159450e-03 7.629578557039597099e-04 1.724122817309823447e-02 8.203477986155901331e-04 3.004304474819901455e-03 7.132653118628271569e-04 2.344472783419674841e-03 8.222616271494712428e-03 1.011542145186676393e-02 6.427205756122101633e-03 1.934814365767463604e-03 2.033576299767730911e-02 1.126105752943679615e-02 1.079133887356608854e-02 6.745381361338376701e-03 4.651909381282419778e-03 6.134339714892609458e-03 1.104105375978565139e-02
7.971324296557554022e-04 1.291947897605131819e-03 1.367286679373707573e-03 6.937617525657133362e-03 3.324315333503424091e-03 5.467410256660681228e-03 8.151641097996724719e-03 4.565830267800815266e-03 5.345543261290567651e-03 6.281927628647192112e-03 4.872548751578895457e-03 2.000177318678686422e-03 1.065327894461651041e-03 1.507726585177860193e-02 8.736353349530604634e-03 1.486982609590587444e-02 1.688433300843371516e-03 7.303607629436350201e-04 3.764559158857294294e-03 5.218659811929768702e-03 2.454389819562467333e-03 7.327643309073167454e-04 1.973598826912545401e-02 1.914133447338044886e-02 7.760253259369768661e-03 7.976167916104144953e-03 7.001359929894225391e-03 6.039578163866777226e-03 6.737364027599426243e-03 1.604778494195542235e-02
1.698560083247834408e-03 3.161079374468729261e-03 1.853889182669400714e-03 4.006760417081562699e-03 6.176205832596846218e-03 6.915986258522892165e-03 6.056574750010003221e-03 5.641849209200450362e-03 4.440007160205526951e-03 2.503883727321199945e-03 1.012443056032700855e-03 3.139886963169559019e-03 8.851609183747556533e-04 1.005776333325129543e-02 1.139935856481332291e-02 5.728419660260078167e-04 3.545627037953966339e-03 5.222067057180605244e-03 4.616604430149052508e-03 3.533144504391793738e-03 1.235898572645033203e-03 9.387878162509576217e-04 1.427395038521054628e-02 1.240632467815871824e-02 5.935664247648485270e-03 5.976172782238886594e-03 8.884593276622889182e-03 1.030100624655834810e-02 9.989489953861504373e-03 4.339694240729761489e-04
4.463038273110333728e-03 2.970190248542172243e-03 1.740780097128737276e-03 1.012832614588297410e-02 6.577549840710729574e-03 2.777373501492332985e-03 8.853098728957975797e-03 3.938427497406112379e-03 3.296879967225211771e-03 3.273429457493160118e-03 2.934032892675957505e-03 3.811541016349424740e-03 8.770130793361193694e-03 6.311702325572861837e-03 9.444249344142433781e-04 8.189375500295593838e-04 3.269669405782731856e-03 1.001642291270324336e-02 9.890159518630226368e-03 1.962423800898452191e-03 1.567276266049186240e-02 1.650997544086989927e-02 1.830650173434822045e-02 1.219765766792907900e-02 7.144190157707631592e-03 9.833877764992901907e-03 4.668020581097550117e-04 8.027899521226405368e-04 2.354498457541159048e-03 1.184970487220851154e-03
7.335344985634705516e-03 4.839507148661460582e-03 7.723081797417643765e-03 7.273074568627532245e-03 6.356042379573183763e-03 1.252750556695558532e-03 5.742490124619944840e-03 2.597325209163195165e-03 1.098065546619884838e-03 1.632805558329322032e-02 5.657196337562353690e-03 5.452087042058465644e-03 1.165010187975836463e-02 1.284276128185087712e-02 6.202925756024070363e-03 6.916808470150253782e-03 3.728158281682481673e-02 3.863607213047173805e-02 1.539918245767737948e-02 8.809756128303427095e-03 2.063905146079575426e-02 1.316217242233085755e-02 1.504985939827971006e-02 1.637385329066953776e-02 9.072912308789107816e-03 1.087161264939608823e-02 1.694054834274177045e-03 2.413461930630138048e-03 3.061786273392585415e-03 7.907786895368712965e-04
6.023807325077541221e-03 3.191894151066191915e-03 7.152708092178355903e-03 6.179647026585810728e-03 7.824125575851626282e-03 9.070579341245433008e-04 9.233881851043356436e-04 8.885217752260579074e-04 1.628830080544659692e-02 3.340756831754847569e-03 4.547807319177031571e-02 7.512887714108372472e-02 1.572766307742588798e-01 7.949301288725595105e-02 1.497961874666517076e-02 3.009516219161473966e-02 5.625543173725134488e-02 1.549412657876586726e-02 3.660136027269488782e-03 9.857212711005514626e-04 1.428764756342614656e-02 1.287123839512442809e-02 1.612616010131218136e-02 2.179382259404974084e-02 2.287275407835737129e-02 1.238926893665692058e-02 1.946384951995846005e-02 1.479079065175645594e-02 1.351158091892439711e-02 9.926345858447267745e-03
1.378812248225369172e-03 8.029222657757908825e-04 5.816827516209236923e-03 5.829259902875509429e-03 4.562093174095496403e-03 1.332871976853976410e-03 1.995768294473970056e-02 1.409676353711387768e-02 1.713050785725110658e-02 6.584338800803774330e-03 1.380766242988206403e-02 9.120868226413018920e-02 1.656466045983591151e-01 8.752328498433604997e-02 3.208713475226416395e-02 3.686563904529911728e-02 4.092563358262981538e-02 2.412724286366014353e-02 5.913252270872900417e-03 2.101177215919397025e-03 1.384796408649332546e-02 1.419602641731917622e-02 1.617046384620195523e-02 1.425645571975322915e-03 1.030545165337621964e-03 1.922209489913295419e-02 1.551856448575018171e-02 1.424798385712119919e-02 1.550851543937706647e-02 1.677332502664918498e-02
9.997225065938549968e-03 9.195037403905037977e-04 1.340464565132696911e-03 4.220128396747474357e-03 2.799153648953662046e-03 1.127323065808836199e-03 6.918845547614140305e-04 1.822269666066663601e-02 6.318615447889972805e-04 3.226212082295535841e-03 9.891645690427179529e-04 2.936983111452892356e-02 1.250175971700618061e-01 5.441490354819792513e-02 1.734015412479215576e-02 2.033881726664886133e-02 7.572562350673278306e-03 1.117582885153278402e-02 1.277939574873651618e-02 5.384165914829314517e-03 1.335481878439080498e-02 1.461783700212312444e-02 1.771508265803064044e-02 9.398012364857817862e-04 9.749065156150869696e-04 1.064831764887353349e-03 9.692959005639253077e-04 2.424836415132815975e-02 2.029840475485655479e-02 1.670860610585396880e-02
8.714862828401327005e-03 1.333835095875163506e-03 1.150936308402860514e-03 7.276177902653172252e-04 1.556020919606596400e-02 1.810106850371892171e-03 6.094192204471628876e-03 4.872038170567530996e-03 6.464230524055340418e-04 1.070615023414229865e-02 7.383393801384506312e-04 4.841414121889553619e-03 5.776110130271143450e-02 7.901255801735032613e-02 8.501867895171034972e-02 1.157313748032778866e-01 1.055433012043014429e-01 6.943651304146147840e-02 1.920320354701758325e-01 9.104812312569302013e-02 8.235122064112544368e-03 2.770465969397200266e-03 2.059147413009429928e-03 4.725667945795720623e-03 9.698287378838472625e-03 9.124868710847687525e-03 2.640296742437218264e-02 9.786381973749258556e-03 1.377042669239335153e-03 1.378417262711608164e-03
8.562942457640120714e-03 8.167490585124647859e-03 1.051815667082623730e-03 5.924848550660835426e-03 1.861279839785596069e-03 1.313874956471435852e-02 3.848456029413938398e-03 1.021676846421856917e-02 7.129743764442423443e-03 7.355779792238820560e-04 1.570866854590071858e-03 2.417434018812079227e-02 5.182616479329612419e-02 6.655697857724075794e-02 6.072455396015972312e-02 7.402077911131718646e-02 1.282837407245108197e-01 2.252808145235343507e-01 2.327748508611430511e-01 1.852246972263909830e-01 7.995110882831554105e-03 8.435944823731793621e-03 7.616107871810101106e-03 2.397132287316525515e-02 3.449584878650457237e-02 1.764674741728436969e-01 1.758443586104046497e-01 3.487151724533587432e-02 1.384612484915124023e-03 2.137057371291184796e-02
8.397651985241493325e-03 8.852170734009673705e-03 1.728408845692066056e-02 1.783456863508282864e-02 1.168671348505066591e-02 1.415404133926315144e-02 2.121252948376447373e-03 5.582485324127683772e-03 1.168755338328981812e-02 4.158909321452951627e-03 4.285977188302808952e-03 3.744681328989691530e-03 2.935577215553504538e-02 6.019070621840163365e-02 5.676394289911564084e-02 8.786034878387283253e-02 1.546889626742968815e-01 1.911638521033405813e-01 1.122076108211457202e-01 2.482043617355730175e-02 1.515556916938832696e-02 1.058768712973972986e-01 1.571046265159165012e-01 2.627657289074896707e-01 2.449629518706800402e-01 3.172432847196731687e-01 2.519290941885625745e-01 7.104604443463169439e-02 2.147121378518151817e-03 2.453207290660194134e-02
1.117261731997213660e-02 1.273553230949302055e-02 1.186749172999670282e-02 1.069226585052419735e-02 1.550400634592661621e-02 6.666162882769115401e-04 3.291072625778355965e-02 1.102836363249657670e-01 5.467007132098789662e-02 9.270766769819355560e-03 6.817773172944102678e-03 1.054112459849844766e-02 2.092671939939430223e-02 3.129029259363667881e-02 4.188785653702091494e-02 7.603187297833205460e-02 1.668765141717979683e-01 1.708431504747603136e-01 8.217257227433380495e-02 2.868325495249952894e-02 1.263020374975991345e-01 2.338578687859460270e-01 3.060388325050630298e-01 3.113428182724928273e-01 2.695591392101248651e-01 2.295953466994879177e-01 3.348963189948757080e-01 5.771415082905920202e-02 2.479855575193716435e-03 1.107495741026319090e-03
2.847902293092226256e-02 2.234964065919673587e-02 1.066870868648478812e-02 1.486211516830949694e-02 3.838991319523860860e-03 1.629516237785519350e-02 8.937970910096801336e-02 7.473182627047116056e-02 7.474166736228871066e-02 3.687336970257715923e-02 1.330843657309941676e-02 3.534045172594394921e-03 3.458560052847661857e-03 9.004622007037344986e-03 2.059452515207470594e-02 9.582191436018047681e-02 1.025937516291960672e-01 1.215540654223700445e-01 2.151509951570065513e-02 3.867887216788816473e-02 1.403770278479787303e-01 3.103736446496555557e-01 3.906750987331797376e-01 3.986859246097968490e-01 3.206921641750896113e-01 3.026592560157756462e-01 2.764917230885498567e-01 2.170567887017909869e-01 9.564726192654499082e-03 6.240583803204831706e-03
1.142030682326885226e-02 1.658306550921977976e-03 1.643826002471300649e-03 6.634314549692358134e-03 1.337214454449242064e-02 1.832875569949794781e-02 5.827050879993302124e-02 7.344057169548377784e-02 5.064145429830558404e-02 3.904799287300565747e-02 8.107465158745845793e-03 7.882319589283568817e-04 1.199906454288129616e-03 3.416244962368175739e-03 7.495481847127194799e-03 4.449702845902191173e-02 1.723138079532923403e-02 5.580253518167209957e-03 1.897622153912235455e-03 1.396928970271844525e-02 5.389280756499748720e-02 2.906522440354917802e-01 3.721622173356125551e-01 3.870198497068097487e-01 2.794673443687286651e-01 1.283764780127926997e-01 2.068336181015742736e-01 1.404996311155322364e-01 1.260149479331137273e-02 4.902952056410752289e-03
4.596326713712500095e-03 5.925838728010452382e-03 3.679577798802156213e-03 4.555844041207864244e-03 1.066000408526339947e-02 6.080344798357652236e-03 3.103482695323804899e-02 3.981752601879231385e-02 3.642655514525666022e-02 8.561881558329147157e-03 2.146184446913709798e-03 4.542335341543228913e-04 8.355243907143328815e-04 2.459040402394793712e-03 9.726509220123668795e-03 6.341971237999391095e-03 1.171744614493978875e-02 3.504575773832371670e-03 6.666766425572822827e-03 3.195874599922502585e-02 1.730375141280932616e-01 3.285397666092844671e-01 3.536435917033006748e-01 3.369838782752882511e-01 2.597122334326169568e-01 1.910205333856671572e-01 1.857050839659552255e-01 1.240085966134333584e-01 1.110986733637961583e-02 3.907623515859510316e-03
1.228263945117635814e-02 1.124551551080521343e-02 5.793871529588696598e-03 4.179497887823264458e-03 5.433229821524928303e-03 2.868007947232905069e-03 1.592842003211008065e-02 1.391066554617507132e-02 3.831692023351227459e-03 2.209777280063516224e-03 7.794658912158518955e-04 6.132726005054232659e-04 3.687415220514457591e-04 1.468664518109191047e-02 5.417261570149547187e-04 1.790018624959044142e-03 6.479400988766227491e-03 1.493905672647418553e-02 1.453021359230948287e-02 6.522272382687924197e-02 1.770842046738472508e-01 2.546601830743981942e-01 1.028808916957101305e-01 1.566019044424997730e-01 2.062646561158650582e-01 1.189392287924196934e-01 8.989851167097118179e-02 7.525541019983081337e-02 3.526443803054638178e-03 3.334597476071782165e-03
1.000232937726478616e-02 1.148060968562284595e-02 1.701685114034730750e-03 1.185578414303611015e-03 9.802127984401007646e-04 1.434204154514067027e-03 2.042286203590214060e-03 5.174604467124169173e-04 6.959404717888457645e-04 1.077757234196840587e-02 1.493699658346058813e-02 2.434549726622150568e-04 2.495496844070801685e-04 9.039320086026608790e-04 2.579608121703886280e-03 3.282055405642388818e-02 6.379148815553753460e-02 9.336108656225951263e-02 6.444170832944576266e-02 4.849314183825852165e-02 3.383469265872928594e-02 1.191246798328862190e-02 4.561339914375651776e-03 1.010010116716526796e-02 3.759944563080225288e-02 1.302165565493903013e-02 1.215655566931386419e-02 5.506767557535926366e-03 1.413841571811285530e-02 1.330004344607360958e-02
2.096117784763815856e-02 1.606305018840810742e-02 1.739463718569958647e-03 7.579529527309937032e-04 1.125276888077395400e-03 8.635357362552744309e-04 1.377623876798737259e-03 1.595341461259019641e-02 1.485511860297822340e-02 6.507714213048107314e-03 1.522226861880135451e-02 2.922540723554040956e-04 3.192133800812144346e-04 1.773117965000833851e-03 3.007037698265458206e-03 1.934291215200061378e-02 7.195228008773793538e-02 1.360826863033465783e-01 1.561250629653953281e-01 1.353260616795921856e-01 2.826469303764517563e-02 6.205240228198915381e-03 7.622938870877457064e-03 1.914409751721150160e-02 4.347474054594713255e-02 1.306694854636587279e-02 5.019248858016423995e-03 2.729456959691642023e-03 1.953686996914953677e-02 1.894682178740910924e-02
2.598764913996190473e-02 3.295580519852380538e-03 9.135259394005991853e-04 3.039768208265234144e-04 3.506635138265979963e-04 7.579216368533211057e-04 1.023793222745707785e-03 1.301043984435163413e-02 7.410931031923334578e-03 8.546191891355532644e-03 1.488390126575144315e-02 3.064919794642471116e-04 2.848018226723556391e-04 1.515813772148322681e-03 5.531617380011965429e-03 2.755505017710888419e-02 5.447990881200139718e-02 1.277034007802862470e-01 1.634144767871910930e-01 1.388633348978325077e-01 6.830654353562935766e-02 3.884995343090356934e-03 2.738591894649213942e-03 6.037104206454121762e-03 3.524889665255149379e-02 2.157159440288272667e-02 1.949830518239347929e-02 5.152752528940637844e-03 1.554416196166056446e-02 1.415156512469468476e-02
1.426039476262123094e-02 4.402001810675414822e-03 1.723900150970821997e-03 1.637602450387943241e-03 3.700081413418491311e-03 2.501312717900794694e-03 1.036314275091296082e-03 4.231856596839065352e-04 6.389334553401800065e-04 8.947090883215891256e-04 9.080155888185840324e-03 1.054302668583372883e-02 1.338606952206378327e-02 3.910676327585865092e-04 1.996640343986729772e-03 8.442556867186709960e-03 8.729623131332986744e-03 3.810914795959957635e-02 4.991470388868959190e-02 4.343424616837487234e-02 3.621366531888649959e-02 4.640706675378534866e-03 7.119115010249457828e-04 1.409313263889424997e-03 6.278905600438922964e-03 1.593341888873647805e-02 4.286479999509081040e-02 2.748689082757528948e-02 1.719207173899009455e-02 1.506537016254592271e-02
5.095237096317818161e-03 2.017517610128769477e-03 2.180399032710978423e-03 3.745303420291697018e-03 2.079328464397235589e-03 9.202338644468404001e-04 4.124571285125636804e-04 2.817640274861748974e-04 8.764181953456042862e-04 3.494506631474485637e-03 2.859259166303970440e-04 1.011691451235737817e-02 1.478494451950810272e-02 4.054844292815987217e-04 1.618442349976249037e-03 3.006486625772218819e-03 2.130731686078209727e-03 1.085735299621525506e-03 2.022168027363347234e-03 4.214568546577230658e-03 8.861894616604221175e-03 1.840700576827006751e-03 8.481121522632530454e-04 3.628212306673222858e-03 8.865985017167054075e-03 3.178802453953471704e-03 1.098522482227101346e-02 1.303775676797133166e-02 7.285323251029578867e-03 2.129944052488459000e-02
5.163953315259420772e-03 4.135688277757132610e-03 2.040947740394253272e-03 1.520565482476462626e-03 1.436047208992046083e-03 5.318941557147058730e-04 3.435763346107660208e-04 3.429955745286760089e-04 3.723450218953836726e-04 1.576611158082430507e-03 4.832145804052850164e-04 5.349107657140187615e-04 4.791343333152822052e-04 5.839812633547321373e-04 1.590562952675269627e-03 1.160997690869644246e-03 8.385476032362837668e-04 5.341789664494643554e-04 7.881366972380724444e-04 2.127580882603415449e-02 1.721653099923304078e-02 2.315380467229447015e-02 1.535921444329165029e-03 2.088485188481746004e-03 4.284317075654010994e-03 2.080896430808562916e-03 3.344695988171155106e-03 1.963140762481282477e-03 2.953962683022318472e-03 1.928205433948381245e-03
7.014730895631256062e-03 3.649254252931802885e-03 2.098935955453036257e-03 2.911027577041995409e-03 2.599580910368188592e-03 1.395071356967244941e-03 4.658857794135282462e-03 3.437442049772318833e-03 4.987699241233735630e-04 4.062466024877604462e-04 1.635514524403358996e-02 4.165452275437027830e-04 1.139659702541192653e-03 1.212859412469041069e-03 3.583795522266943531e-03 2.823507724066828470e-03 9.568828444584635958e-04 1.214213595217718223e-03 9.210968395503396676e-04 1.416125706989057598e-02 1.391961559404725213e-02 2.047558763868927850e-02 2.218366308492414601e-03 3.187692801272547227e-03 3.122184182620092296e-03 1.822767478480429720e-02 1.265100268927106617e-03 1.282304771107224683e-03 3.255169342892352564e-03 1.571387540122176629e-02
9.449610408328515745e-03 8.162111139063553747e-03 2.505496044883365539e-03 8.687317572583876102e-03 1.026459298158205816e-02 1.917922371013811716e-02 1.261374329366680980e-02 1.397384342118057187e-03 4.949339829586315090e-04 3.216381639073590524e-04 1.095550647276419785e-02 1.291200340704309023e-02 1.363645885124512881e-02 8.926543842820639559e-04 1.186895487616968815e-03 4.824735001949968316e-04 4.904323072012451920e-04 5.367660384032915503e-04 1.006425854999048802e-03 1.250340081952672688e-03 1.259419921867385890e-02 1.827829694665374441e-02 1.915994290859879962e-02 2.223857807448677889e-03 5.806605809621397975e-03 1.370136131445481159e-02 1.989623288937989939e-02 2.428409271611439799e-03 1.449800657551622313e-03 2.895608183563176848e-03
5.209338474400399162e-03 1.292833914537070382e-02 3.902334345684490072e-03 4.222341108034302973e-03 2.072080143931508481e-02 2.182675395651354627e-02 1.439145497759495261e-02 9.783772116194681522e-04 6.853163496278698915e-04 6.885410883324891975e-04 4.103171833544627927e-04 1.699433758362325561e-02 9.659411723821809473e-03 1.390175909820665946e-02 1.356850281927171002e-03 1.663374678994597108e-02 1.310238338966833796e-03 7.250202916575999856e-03 1.384773056228121198e-02 4.022188011453097477e-03 1.794778585079634739e-02 2.490626954815804497e-02 2.071820132963083511e-02 1.993236430618214663e-02 1.707379292585160715e-03 1.981089098652457497e-02 2.304989398838016776e-02 2.232353887135487755e-03 1.247016123230388664e-03 3.049330311649583580e-03
