2.224869661201414779e-03 3.232138085470109140e-03 2.852221107218710309e-03 3.652365772880454813e-03 2.792836282365940455e-03 6.159113302142353585e-03 6.097991619377737121e-03 1.648428076940808978e-02 3.002216537610924441e-02 1.367260308431332214e-02 6.465778475456812960e-03 1.494944555355425062e-03 8.783959309429146840e-04 3.227850218063356858e-03 3.714614575337468402e-03 8.087150700092474208e-04 2.800235294016674165e-03 4.787903585355700146e-03 4.239980592968603003e-03 1.466570936411764909e-03 1.197293572855866357e-03 1.759940703854325178e-04 1.259151436711692350e-02 5.289027705926166662e-04 9.506901624278176356e-04 6.889081427471103677e-04 2.933706826723835124e-04 2.833421499546784177e-03 2.703796389530951829e-03 3.398294131052036031e-03
1.713909681035311050e-03 3.700712842364071824e-03 6.716986229234892664e-03 5.487991081924123091e-03 3.840695973606554625e-03 1.732091380732580371e-02 8.303211100810123715e-03 1.038012453673477914e-02 6.796509502121976867e-03 5.838009755707220666e-03 4.223194116054996769e-03 8.366805153749005443e-04 1.118646561014056224e-03 2.555762926597659329e-03 3.558380138799626616e-03 2.294998388312211729e-03 2.794228452294184907e-03 8.918568368759595758e-03 6.586480045306901919e-03 1.954720364700204133e-03 7.085422748167400503e-04 1.610101916936294267e-04 3.410971087037012635e-04 2.874952999693752647e-04 2.302457252500858596e-04 2.788090412583708855e-04 1.077154405246193852e-02 2.806330680580337422e-03 4.021550065977843452e-03 4.054217960799808354e-03
2.047940623726809961e-02 2.003026388601060123e-02 4.242964869813472401e-02 3.424707282507385292e-02 7.329319278392426584e-02 7.531799762638912571e-03 1.427905633529910536e-03 1.532630114872207986e-03 2.488267659949206650e-02 7.625327776711291958e-03 2.072961289248129169e-02 1.389682051674111241e-02 5.151862902983811963e-03 7.652393414827968372e-03 1.477676242731101311e-03 6.309011522105219955e-03 4.165402799238859463e-03 8.331395877696989860e-03 2.715070783707150548e-02 4.464280968978965800e-03 4.346565535072021563e-04 1.277437016161394408e-04 1.966853356014575040e-04 6.830435024592988388e-03 3.933387731379757966e-03 2.518724488682649865e-03 2.164026739388610551e-03 1.724802998967011215e-03 2.948191316120322807e-03 3.357822154596030312e-03
9.530440965727129607e-03 2.612412194415624639e-02 5.741462064741839622e-02 4.601089671375303836e-02 1.907792111349375028e-02 2.983406230169680269e-03 2.419061379597666796e-03 1.632464151536201259e-03 1.010353611966438754e-03 9.531835101758661180e-03 6.186190619218969768e-03 1.247352548045580628e-02 5.702740502021309485e-03 3.855342419775384909e-03 1.140300616897503908e-03 8.744954324775805303e-04 1.797003077023306278e-03 3.279070444900898489e-03 2.285557514017405156e-03 1.925627445735121190e-03 8.848510500982069166e-04 3.035396788142387284e-04 9.265175600419305046e-03 1.713961210086188257e-04 3.210253471143270816e-03 2.294349687084721798e-03 1.902802123103850560e-03 1.810424380370679112e-03 3.630280260850017419e-03 4.019524431513693714e-03
5.540073512435737466e-03 1.644569466399800964e-02 4.578864540280246087e-02 1.773261889593452656e-02 1.024513346344617382e-02 1.513744630772131602e-03 2.369794264288152714e-03 1.344344573788319296e-03 6.296674443982233941e-04 2.230744199663248217e-02 2.822969196489082122e-02 2.455952509886397822e-02 3.663159807960330184e-03 3.043635695104595675e-03 1.418889093576416799e-03 5.213123520959459445e-04 5.513231592482639720e-03 3.107660360065153411e-03 4.932517775786609410e-03 2.781359643754489561e-03 1.919235426920410520e-03 5.325969221585480709e-04 1.160245604175704328e-03 2.975562092215371579e-04 5.797827886494156917e-03 3.092103922142673111e-03 2.096257202056695402e-03 2.441125538125571166e-03 3.774264801912679754e-03 1.312595775765203004e-04
5.559066308046218402e-03 5.594976929052023450e-03 2.503342046534320561e-02 2.000708331982178206e-02 7.953198013010150114e-03 8.654259737268131178e-04 1.082601887817013792e-03 1.189450169034645104e-03 1.136203126084178163e-03 3.504191823310394416e-02 2.789334674638211178e-02 1.503093521126372054e-02 1.727096055738976382e-03 5.143371906758430808e-04 3.820357644846457510e-04 6.069057973641909815e-04 3.134229984808760677e-03 8.066066178185389178e-04 2.590734132457034409e-03 8.803540998394594752e-03 1.063727977663470048e-02 6.246617122915864434e-03 1.530677047649278873e-03 1.849656520745636044e-04 8.716119946137480465e-03 8.194232715324035327e-03 5.019783535015120632e-03 3.485987918140899533e-03 4.535676757159512809e-03 8.354777136138661839e-03
7.769872889527780794e-04 1.191948891242295425e-03 1.258122473369636864e-03 6.368941059486651207e-03 3.049382221040989119e-03 5.149039673177795845e-03 8.037772344673826258e-03 4.711386906633346222e-03 5.734895684061264501e-03 6.834826347376804848e-03 5.374176720044091665e-03 2.265867243406693207e-03 9.367703631314578099e-04 3.551582008867893033e-04 1.173400391449287705e-02 3.090309460680317095e-04 1.803928284341735485e-03 8.495267334504140889e-04 4.314529953622913382e-03 5.837682486421162317e-03 2.646000835109599443e-03 6.193888956218315941e-04 2.351963116178057130e-04 1.730689066398920315e-04 5.979335813195809854e-03 6.167010639227967980e-03 5.347998206698276191e-03 4.682818785073252985e-03 5.373183289675422664e-03 1.306753121301860651e-02
1.718565206814341067e-03 3.093513176954724737e-03 1.806747637572925268e-03 3.891383584123568086e-03 5.949098267373496493e-03 6.750752424406405473e-03 6.094994349392591527e-03 5.851108616280499553e-03 4.781898075328123651e-03 2.748391891504400018e-03 1.132228216856725166e-03 3.578440481463908245e-03 7.656700257596615270e-04 1.534505175909384525e-02 1.579874115985255290e-02 4.425544821210504443e-04 3.643979490171107144e-03 5.824307746530717374e-03 5.115578659744453478e-03 3.628150305061339162e-03 9.793322675786231800e-04 4.509832887151365034e-04 1.245235529106456310e-02 9.734808583765344400e-03 4.575934704430139471e-03 4.797920127428415699e-03 7.361848443371758408e-03 9.375568516794189830e-03 9.479015871046382949e-03 3.086452052097556249e-04
4.642375021313299883e-03 3.015589219536714272e-03 1.768939496155509878e-03 1.025322508192318301e-02 6.651790341955567468e-03 2.825502809289809781e-03 9.189364986189290166e-03 4.150501428685270458e-03 3.509874559815819202e-03 3.550785645993541524e-03 3.242025058578019980e-03 4.370754516183112011e-03 9.584255990262056241e-03 6.153792052639596617e-03 8.985861560215217033e-04 8.037446022767488806e-04 3.484843916329648933e-03 1.060606778394081531e-02 1.050489133210207038e-02 1.760831914849823529e-03 2.746878957149243451e-04 2.077706275794185251e-04 1.909898363745940095e-04 9.601402699364713911e-03 5.524323510913089000e-03 8.451635321201345780e-03 3.117952993462538044e-04 6.701011905471587673e-04 2.059412799860734118e-03 1.081892015782459420e-03
7.881045210368534809e-03 5.116974320685097229e-03 8.216247247462685199e-03 7.678409230655956763e-03 6.749440436328553797e-03 1.330056163755454109e-03 6.163642486598128536e-03 2.610631491444929866e-03 1.089901104202017131e-03 4.180303022654620164e-04 6.252399130097277200e-03 6.206616514739339563e-03 1.318340546050532358e-02 1.402891909680769114e-02 6.577970080807139450e-03 7.042062124169469819e-03 3.770807822949098775e-02 3.933672880606323141e-02 1.595697291672610457e-02 7.189176596968023872e-03 3.509075138199908069e-04 1.240094749935960125e-02 1.296173862172531055e-02 1.638302750029856970e-04 7.340719815681823190e-03 9.372857633769233338e-03 9.160947296015158146e-04 1.672011931762890525e-03 2.205289496958122257e-03 6.110475280437905297e-04
6.685863772370927854e-03 3.480593018674725970e-03 7.819032869568184885e-03 6.675616203633486477e-03 8.513151915843966688e-03 7.789934759873518152e-04 6.486222740473908573e-04 5.562532907334419210e-04 3.421305543849942430e-04 3.132909315318266850e-03 4.991900371658229002e-02 8.433015433804560979e-02 1.742303421367430438e-01 8.441789664626600520e-02 1.529142388066034516e-02 2.913747071980690717e-02 5.415416043023368875e-02 1.512987066948958022e-02 3.662501128175661355e-03 7.415889305284089402e-04 2.501498533309416813e-04 1.244592065261933972e-02 1.985188817955765655e-04 2.608117520983698639e-04 2.621370953004940191e-04 1.133297031383663153e-02 2.020655824840839401e-04 1.700258637436548597e-04 1.312447839368991766e-02 9.533465807753365578e-03
1.250515488378771021e-03 7.309422005956395414e-04 6.474123739547520476e-03 6.364470978305156179e-03 4.973478206297394025e-03 1.133830693831089538e-03 4.331600089918003936e-04 2.714881053043188266e-04 3.266514406774632300e-04 6.196796395955274719e-03 1.515497991528935197e-02 9.954160959338712034e-02 1.773952420659068163e-01 9.017391110237811536e-02 3.197556014623972181e-02 3.513080915786805092e-02 3.883471057281651789e-02 2.315548802933883529e-02 5.773906522979878678e-03 1.648347023921829888e-03 1.609446495068610206e-02 1.448051627576616915e-02 2.378188267806646751e-04 4.126043497380353078e-04 3.817799105276957266e-04 2.620321746509381221e-04 1.937345116744343073e-04 1.359338944178142133e-02 1.465623841570814351e-02 2.116419746175404965e-04
1.457793546892202294e-02 6.151032240152874220e-04 1.515377519769986860e-03 4.311854802857527369e-03 2.819359888434955826e-03 8.807139508452464880e-04 4.385350845299923689e-04 3.544720031354282679e-04 4.308133615772596122e-04 3.135897433776024985e-03 1.047579801608694875e-03 3.174299560767616935e-02 1.315458725347219138e-01 5.476994743671055599e-02 1.680530308397425870e-02 1.890011195875859057e-02 6.991588594751589093e-03 1.033928849993139693e-02 1.188712196839064247e-02 4.501126702522922907e-03 3.030180452719459191e-04 2.715212175540355414e-04 3.260817430475452432e-04 5.555343304665691460e-04 7.198837820907366203e-04 6.661415224144423032e-04 4.848946794507536179e-04 4.425875894009237204e-04 3.362002407954060076e-04 2.571579321873632617e-04
1.165722012080353670e-02 5.389105339821036265e-04 1.003403836650135390e-03 7.389465198710294539e-04 4.374884977824279987e-04 1.694913694211170035e-03 5.700394060190977323e-03 4.796311832956342072e-03 6.089851702023897639e-04 1.358487311284434403e-02 7.709818332803793865e-04 5.136803196983047611e-03 5.938171624795125086e-02 7.775746677535658180e-02 8.061192689984716941e-02 1.056454531056724711e-01 9.514169006746520107e-02 6.193235714784790097e-02 1.698190956265199780e-01 7.998689886218210421e-02 6.718925271937558133e-03 1.972331006803991309e-03 1.491094881009063112e-03 3.769688885320130779e-03 8.745325539630709882e-03 8.160581777022259120e-03 2.236601500105635243e-02 7.470600212067939581e-03 5.911354039324567215e-04 5.577459663489617954e-04
1.045054355960194255e-02 1.048142284931779383e-02 4.635241059251677146e-04 3.502618403674739346e-03 1.272254662909283462e-03 2.938922753446545450e-04 3.768139600395666554e-03 1.079172033227276950e-02 7.231635192561688963e-03 7.505126391999179846e-04 1.611354459924732585e-03 2.550211396818588550e-02 5.308737810598151974e-02 6.503043482034728817e-02 5.689842826428494899e-02 6.666274053332998939e-02 1.137633505315612803e-01 1.974299769792784431e-01 2.026631955370299387e-01 1.623906911622848559e-01 7.083504694757278633e-03 7.539070264544546138e-03 6.754729513807566921e-03 2.134261213991394540e-02 3.071018629170985115e-02 1.573267459893455122e-01 1.585819952194223448e-01 3.273562999797692552e-02 7.255173903557789097e-04 4.260534381216536702e-04
9.110118218168695298e-03 9.934766007657538922e-03 3.539706466986312786e-04 3.952596252781385294e-04 2.616621842328592908e-04 2.938803044980152880e-04 2.040490105284360062e-03 5.667023253248154417e-03 1.165368406909504662e-02 4.241617955188882461e-03 4.444250185735571304e-03 3.906420957368595716e-03 2.998185443234497455e-02 5.886585587791071800e-02 5.336299547321432524e-02 7.932027327365884228e-02 1.370455518225159874e-01 1.675945638276268024e-01 9.815922334012672223e-02 2.186319591703123413e-02 1.339528828584983337e-02 9.361917008701235721e-02 1.380128777444771526e-01 2.340038088522702897e-01 2.210042702770361744e-01 2.896688984896284569e-01 2.351535609405397409e-01 6.856551267252458670e-02 1.179133453979721398e-03 5.262423510386883595e-04
1.100444593825268894e-02 1.277050495743678807e-02 1.292045917110418510e-02 1.256658731506137168e-02 2.778911749074295767e-04 5.730425004003059965e-04 3.283960343017389150e-02 1.078765840149486926e-01 5.208120550949858762e-02 9.107804224194045867e-03 6.908747857837923764e-03 1.095252784503157259e-02 2.149486476417660288e-02 3.072283776781023490e-02 3.930463271141519666e-02 6.836653262556574573e-02 1.472627382222129744e-01 1.504625707771726772e-01 7.261123654125775650e-02 2.543882151415571141e-02 1.113098057796680362e-01 2.042319802322727917e-01 2.654578741690108434e-01 2.765722889415465069e-01 2.466735974793064501e-01 2.158327183698264540e-01 3.236781299351616514e-01 5.709591644389716558e-02 1.827794293325404103e-03 7.659348331151508843e-04
3.827767590233146144e-04 2.949634273985051250e-04 1.115420311403928985e-02 2.495099524624472633e-04 3.253338106011629746e-03 1.622115218299185341e-02 8.832023811691014359e-02 7.029174064181270554e-02 6.812303883060397136e-02 3.501906597821132644e-02 1.317135646853207290e-02 3.635979359081231883e-03 3.551377185318602137e-03 8.885916127213453961e-03 1.939923423810416617e-02 8.671422606674786260e-02 9.135016707090046206e-02 1.084499851990611829e-01 1.920477538703005069e-02 3.449051694551938385e-02 1.238458670217788826e-01 2.710900195423108228e-01 3.396861772696349591e-01 3.588929722775819897e-01 3.019600363849741509e-01 2.954018163419396270e-01 2.779687463222914046e-01 2.204272473957075984e-01 9.785820312523096573e-03 6.455141011787866867e-03
1.197687524919335313e-02 4.644177656327824972e-04 8.627314549686860342e-04 5.999863764029386010e-03 1.336492449389943896e-02 1.857320446534144881e-02 5.710648370607590563e-02 6.921995164742515694e-02 4.657845251661161395e-02 3.692530275806184259e-02 7.913908654455573816e-03 7.904196583361126167e-04 1.205126571098150048e-03 3.362724664882550153e-03 7.199301185059073932e-03 4.193994990344600965e-02 1.610584479575020642e-02 5.232928834561920844e-03 1.775660569708658806e-03 1.298015307173658317e-02 4.928593050200598402e-02 2.624840230099901861e-01 3.336705651857782007e-01 3.550343715542028100e-01 2.643428691412367249e-01 1.245333241554792969e-01 2.041201848663486418e-01 1.401110305719614202e-01 1.263490129610978820e-02 4.987992134685159847e-03
4.358090390968266670e-03 5.529394969076950606e-03 3.699147456876175199e-03 4.579089408674366646e-03 1.076020649977794952e-02 6.044243097548961455e-03 3.026318201607446773e-02 3.777994861017409250e-02 3.397430618751322295e-02 8.111664597599587204e-03 2.063619022210309156e-03 4.409828432740885520e-04 7.818222103210795051e-04 2.329378829631424761e-03 9.301789012017797759e-03 6.290550182539328058e-03 1.158123570884741528e-02 3.458717874997453007e-03 6.528716084795280553e-03 3.079400872133539191e-02 1.633314011606098459e-01 3.063664108233118410e-01 3.271165834593867672e-01 3.157498155759322911e-01 2.474813915144838394e-01 1.847846845420764716e-01 1.816949244092935234e-01 1.224264595798738309e-01 1.102307731981474331e-02 3.924095114735296624e-03
1.256231556423470855e-02 1.138616436480779232e-02 5.845669537999783130e-03 4.182540764311476304e-03 5.394021337112236275e-03 2.818444436530698552e-03 1.553823353952299771e-02 1.335038936628786012e-02 3.551717769899612187e-03 1.944475269475343278e-03 6.755991827841405055e-04 5.407935464428452075e-04 3.340509152268129715e-04 1.946863347248785781e-04 5.284317413828656853e-04 1.849065361658748952e-03 6.639244793731926414e-03 1.522395528113605276e-02 1.470952158236609603e-02 6.519314264611646148e-02 1.737562098154831203e-01 2.471486564219032012e-01 9.901197731072591823e-02 1.508167831426245886e-01 1.991084907043316199e-01 1.151967769922284945e-01 8.751690332455169807e-02 7.188268505379691309e-02 2.634911735486170862e-03 2.381888256623778191e-03
1.028227955247409779e-02 1.172663177211413603e-02 1.720457109251095906e-03 1.179421818712994043e-03 9.552924939832249315e-04 1.388433463619839249e-03 1.920185519519731305e-03 4.621400417480782917e-04 5.792197650426880121e-04 9.270956890324510632e-05 1.241187331208574171e-04 1.924522500760084782e-04 2.240122834007479062e-04 8.573054796545302248e-04 2.569849768889111152e-03 3.501643788076152369e-02 6.686878026925544005e-02 9.686856904135110469e-02 6.621761077103011095e-02 4.955259775329583227e-02 3.428775220268665685e-02 1.201191647730667431e-02 4.546802679940706998e-03 9.924237364526494742e-03 3.676383285458681427e-02 1.272256852998370803e-02 1.196634181530990132e-02 4.044433504038711866e-03 4.599653233248979472e-04 1.895734976026429777e-02
2.172463334536359203e-02 1.657575677458750577e-02 1.771736114969761026e-03 7.515839495194920079e-04 1.080190654440288606e-03 8.234510135237368186e-04 1.240950921243081815e-03 1.288796333023363916e-04 1.057937913420190889e-04 4.887097787641896118e-03 1.135959733765497714e-04 2.192330658537478222e-04 3.073027006106012382e-04 1.779262665487483901e-03 3.110553901352700219e-03 2.056971673813113091e-02 7.473627691797152250e-02 1.391642199872449026e-01 1.575781095846104096e-01 1.369574967245635322e-01 2.906025710760536812e-02 6.448393974853573046e-03 7.910228563370138785e-03 1.948932710847814387e-02 4.402500758684248228e-02 1.318029184851990214e-02 5.133302559889269673e-03 1.938631048808600512e-03 6.095219510462131576e-04 5.509640957556447656e-04
2.704072576142601061e-02 3.410309870903846692e-03 9.289440121334561476e-04 2.974142721062364913e-04 3.290651055609431462e-04 7.052313281585947643e-04 8.919981125873855613e-04 1.012744227229647742e-02 5.609370991923497141e-03 6.465082212582587418e-03 1.142296530612247479e-02 1.960475200148518462e-04 2.339944856766178020e-04 1.394683428507729160e-03 5.800078106344331089e-03 2.965442554335521314e-02 5.706300220715918720e-02 1.308768684648492220e-01 1.640418295452792108e-01 1.396404259185197450e-01 7.066525940406719053e-02 4.112177722844841989e-03 2.932970840689236997e-03 6.367153826189015167e-03 3.692202340879405242e-02 2.228276112600797304e-02 2.025814684903046864e-02 3.828972684440828163e-03 5.543376526760838757e-04 2.125588973154217756e-02
1.499997438936380781e-02 4.597327751626732219e-03 1.748264271511154296e-03 1.585439622280655075e-03 3.417443078067820481e-03 2.301675500095789854e-03 9.415154022647230243e-04 3.792745528273503862e-04 5.602981308174746723e-04 7.452980174702395887e-04 7.182519529153383493e-03 8.087428676514591547e-03 1.332592743234509375e-04 3.255916864385774412e-04 2.108806281090386606e-03 9.137710776635910373e-03 9.217267996730966334e-03 3.941612760855347369e-02 5.049121877660066315e-02 4.395326775132697705e-02 3.803392663699691617e-02 5.034641531780650187e-03 7.910032425600251006e-04 1.547833489251189886e-03 6.853689475117493574e-03 1.714151298433530535e-02 4.622546585695549992e-02 2.614216744501276363e-02 6.519920020439209148e-04 4.856570334626649464e-04
5.369948279433729883e-03 2.107784161748561293e-03 2.200307295244060841e-03 3.609183977676946528e-03 1.911051808668465073e-03 8.449190949149567188e-04 3.845004239019046482e-04 2.661748980402052316e-04 8.326290607232838094e-04 3.291046447078717525e-03 2.278467265565062023e-04 7.981955714674717622e-03 1.425016687663228205e-04 3.373752270413379341e-04 1.716387641427926172e-03 3.268958104071771360e-03 2.271443783926322020e-03 1.134895644581108455e-03 1.800159549847519906e-03 3.339185557301838948e-03 6.156055898608275151e-03 1.452468029466418616e-03 7.727368051658703874e-04 3.989411703879052265e-03 9.782799485931569297e-03 3.490248198423886311e-03 1.210656965929053988e-02 1.363761740436436956e-02 4.862954518610845302e-03 7.384935352427204848e-04
5.444489514841244562e-03 4.323276795259179718e-03 2.058590900529302069e-03 1.469438812303500066e-03 1.325966607743055354e-03 4.911860549046900707e-04 3.210825063299759257e-04 3.241070463577464911e-04 3.537601169652334525e-04 1.441173818180009007e-03 4.135141596134865702e-04 3.985346810073211489e-04 3.975217370525606581e-04 5.348395126554720625e-04 1.664778426367793940e-03 1.245845900753103598e-03 8.843950989405623998e-04 5.534217539287481120e-04 5.069058575798657219e-04 4.048791810417386996e-04 3.372216179678935071e-04 5.144042430928806673e-04 8.526826453340771977e-04 2.211837175876705044e-03 4.021468168745791910e-03 1.991800314475206460e-03 3.263443912811136993e-03 2.184952042846066960e-03 2.214168527594746402e-03 1.426510027202504763e-03
7.376257453770317107e-03 3.805551523142193526e-03 2.115415517214928702e-03 2.817395492439853533e-03 2.399475722763157789e-03 1.285858936251969798e-03 4.346030115030997606e-03 3.247926535819083051e-03 4.762449419066022639e-04 3.525125084763292135e-04 1.277314727195447835e-04 2.972756116019533291e-04 9.335260806965258026e-04 1.121331028040692531e-03 3.753672971593837501e-03 3.032802769284940244e-03 1.010095148456322672e-03 1.257214118094211264e-03 6.060930524428376556e-04 2.720991041922971357e-04 2.531552544816510547e-04 3.957300357571485517e-04 6.299923730826391182e-04 2.110722416807791612e-03 2.332381680899116728e-03 5.964972026672277043e-04 6.985622842997871737e-04 9.158347748683116863e-04 3.022078226484474495e-03 6.300973031091282187e-04
9.907486180766400183e-03 8.485019944413505627e-03 2.516834084212839304e-03 8.402222974465420671e-03 9.454042371703852768e-03 1.759511591459311103e-02 1.173351463800770961e-02 1.317759190083276537e-03 4.721568157921879772e-04 2.782220939494691966e-04 8.463069594681828234e-03 1.056686939504210173e-04 1.402387744170174866e-04 6.149939793965660028e-04 8.421443733246268201e-04 4.120498245070967642e-04 4.251378530661448696e-04 5.414902757650816084e-04 7.726537609912998046e-04 4.229661043930850396e-04 1.605795635679046693e-02 3.106540363351182883e-04 3.488012677074819792e-04 6.592160733605398771e-04 2.335916095703936043e-03 4.075295319100300266e-04 6.348187203034606416e-04 1.080236496846990243e-03 1.337498821688366119e-03 2.719462022747358432e-03
5.447748548854909091e-03 1.345682294239471631e-02 3.955165224728769517e-03 4.164649995680351838e-03 1.971239458583118331e-02 2.070648693558573006e-02 1.381128672208149083e-02 9.485107164162137443e-04 6.696907445304374311e-04 6.454416679349212014e-04 2.699601788594095664e-04 1.359008819164257351e-04 8.460153242503230808e-03 1.779680796866219667e-04 9.329729608855935434e-04 2.961419274283674840e-04 1.125913311374598718e-03 7.194547774525906006e-03 1.336665756052736465e-02 1.869050951928763384e-03 3.617511215494713340e-04 4.562954244465292010e-04 3.868744150325462497e-04 4.724188577638553351e-04 7.013965659889236613e-04 5.925871211073653437e-04 7.490953403678983318e-04 9.573515749634667598e-04 1.329383645306450373e-03 3.347856358528757646e-03
