6.582662797113721792e-03 9.501084598318205662e-03 8.319796381631848481e-03 1.057217929290867400e-02 8.021947505423145802e-03 1.757837212777864713e-02 1.731750506365010295e-02 4.658401395979307885e-02 8.442841491176834856e-02 3.816471371642252142e-02 1.788041110615287699e-02 5.473021828789406129e-01 3.238790365179082809e-01 8.696844404593015790e-03 9.958519576735817835e-03 3.280273523611242914e-01 7.496936531415599944e-03 1.291701014439660192e-02 1.153537740507810591e-02 4.004394179970552012e-03 3.189510499934934164e-03 8.789472226163647095e-02 6.823487816172953135e-02 2.707933822527727186e-01 2.514933387789158870e-03 4.019960965075194403e-01 1.792827030130212385e-01 1.565957500824731452e-02 1.472602795790656574e-02 1.830692997790432999e-02
6.339808502322301642e-01 1.085019086113020274e-02 1.961552631244089379e-02 1.596222188303939721e-02 1.112536577427256090e-02 4.985141811163235764e-02 2.370012791490338361e-02 2.938564451491258028e-02 1.908204664418273327e-02 1.645032165296035978e-02 1.195625316661944049e-02 3.268711512067319358e-01 4.422990638783131923e-01 7.019395486883217225e-03 9.587665765910618337e-03 6.062535880319186443e-03 7.377538765833762183e-03 2.368137704327408569e-02 1.758989475935075070e-02 5.218282873542124355e-03 3.657585819330788635e-01 8.229996040398715462e-02 1.731051800934960139e-01 1.528248167058373075e-01 1.337995729414238333e-01 1.751871231614333113e-01 5.917167326766585578e-02 1.529234015123009938e-02 2.175613719831305179e-02 2.179560874448360774e-02
6.074412650624232135e-02 5.899597428571902447e-02 1.249427476208349319e-01 1.008167094087929205e-01 2.156792253569044804e-01 2.201227395656547500e-02 5.243062980854202859e-01 5.588375718265586878e-01 7.018786544746857814e-02 2.172742027480418017e-02 6.007304261623357122e-02 4.078540334269831896e-02 1.490816757601609414e-02 2.143394983418718189e-02 3.998625167636174482e-03 1.647746243458880766e-02 1.083080544430599368e-02 2.175063997093585472e-02 7.108810636905288360e-02 1.163210194536200455e-02 2.294861808467921760e-01 6.690255725853384849e-02 1.025107750833114950e-01 3.587234423615374285e-02 2.138641846814090877e-02 1.385109208413858213e-02 1.172661387794552562e-02 9.317201972805192953e-03 1.587513584194916172e-02 1.802055590140609273e-02
2.837811545212528402e-02 7.766364963885934170e-02 1.706704935990530081e-01 1.367569884751879128e-01 5.670055599134538049e-02 8.786671221806098900e-03 7.012020753256640107e-03 6.035523752260550934e-01 3.659974891794301466e-01 2.694980346181742592e-02 1.764515671144912048e-02 3.583020337790470550e-02 1.618965074380804975e-02 1.065338726134306899e-02 4.591811215582495276e-01 3.530335846816545775e-01 4.636059388204025015e-03 8.490085963823753093e-03 5.937091589429328506e-03 4.986649975815080765e-03 2.225843132524602756e-03 1.538270888304420769e-01 4.835937190676366931e-02 9.342462456938918636e-02 1.735117061753117113e-02 1.247045232696437390e-02 1.018472769353992967e-02 9.678432592417619135e-03 1.938147848964190401e-02 2.142731162459977218e-02
1.656077358834191771e-02 4.932931170860666015e-02 1.373326432105916040e-01 5.318053957341930399e-02 3.072231373369926216e-02 5.814487034938015109e-01 6.884913971804456669e-03 4.954953647997845656e-01 2.270450896911534455e-01 6.240555167110583418e-02 7.892121682202062061e-02 6.849435630395296626e-02 1.010466459454851564e-02 8.232765442641896622e-03 5.432205954929223424e-01 2.034577407149052442e-01 1.417244681236822824e-02 8.017678877641253379e-03 1.277709202263590041e-02 7.203165317683733575e-03 4.874725569530649963e-03 2.582051988222102135e-01 2.821505550647646597e-03 1.575689310782127928e-01 3.119464036626701936e-02 1.664555162730760318e-02 1.115960672688913816e-02 1.300536240977440139e-02 2.012048133127579755e-02 7.557139913214787341e-02
1.667572176846961532e-02 1.692274123921566967e-02 7.571183461312831764e-02 6.050514868906971266e-02 2.404921469052991381e-02 3.405613690626967394e-01 4.113614791881363142e-01 4.377449463075875347e-01 4.019908299058879142e-01 9.693547311220175600e-02 7.645358159142676135e-02 4.076677537137880780e-02 5.871322720128731021e-01 1.811798024690039477e-01 1.394990234624717551e-01 2.299587344983078929e-01 8.028539438896163671e-03 3.244436698514905904e-01 6.688266061749583748e-03 2.277097063010733585e-02 2.723464409713209633e-02 1.578822645378246542e-02 3.809121482117368545e-03 9.494978940704297543e-02 4.660101935661273287e-02 4.372312348292171913e-02 2.667434332949875087e-02 1.858029231778829393e-02 2.424663651471859610e-02 4.479178763385260192e-02
3.022925716585741496e-01 4.866602797716160778e-01 5.135830322783585533e-01 1.936813868684709311e-02 9.264767323391369380e-03 1.538723487750135940e-02 2.338659116646911451e-02 1.336316481759592702e-02 1.587270475047959997e-02 1.872210188861633470e-02 1.450200956108374344e-02 6.014307317044608435e-03 3.009375662306371102e-01 1.192161001674448273e-01 6.352163330263917163e-02 1.137996871732074311e-01 4.598654050036871978e-03 3.254606603879378057e-01 1.106024139511391745e-02 1.499507676154164006e-02 6.764143328931364156e-03 2.742254082878735622e-01 1.096623763621710074e-01 8.562291269004652927e-02 3.176101923876937377e-02 3.268470055323977747e-02 2.829055657483666233e-02 2.489582209654131462e-02 2.871439238814227010e-02 7.021081277510737850e-02
5.101512386861923459e-03 9.326760982994600560e-03 5.450751201497982569e-03 1.173128336399293509e-02 1.790462597335076497e-02 1.999417135981014504e-02 1.760446864004144157e-02 1.649211729787182848e-02 1.316116742868732661e-02 7.493713720831454358e-03 3.821531477777808106e-01 9.551102297345692022e-03 2.511083636520967666e-01 8.398942393425898323e-02 8.634978761850559126e-02 1.599988205269845809e-01 9.531729861440581264e-03 1.520458860265034087e-02 1.332977734382320700e-02 9.421253815062322415e-03 4.036298267510953219e-01 1.943472072969172626e-01 6.664825903848235755e-02 5.199431160207948488e-02 2.445718922598138015e-02 2.565028415875958076e-02 3.936347109760943153e-02 5.024424562041270720e-02 5.086507399275343871e-02 1.525071893807097012e-01
1.305127453283442054e-02 8.666014427561506694e-03 5.178454797941370834e-03 3.031446536403812481e-02 1.973067110618711636e-02 8.260198051889475201e-03 2.622791235487478834e-02 1.156716821633690072e-02 9.550037162353790937e-03 9.628773053430877971e-03 8.749099542502041318e-03 1.171900058817844717e-02 2.562986624245743722e-02 1.651049259208372394e-02 3.133790167732192211e-01 2.853898123657752084e-01 9.297292247389133887e-03 2.809299277181755497e-02 2.761454282760555934e-02 4.581679118553871541e-03 1.098838447500007087e-01 8.643959263757883260e-02 8.275455063102096775e-02 5.087874618917510167e-02 2.939386902607666469e-02 4.511137778426431433e-02 1.688198343572184512e-01 3.464215465361437096e-01 5.216586624251135645e-03 2.761161939680112191e-03
2.078392161221426920e-02 1.355137703736271002e-02 2.228650623619449905e-02 2.157063098375753760e-02 1.944214596123605698e-02 4.809273980683272942e-01 1.729846347183325653e-02 7.174897868820152499e-03 3.927608022484525008e-01 1.486115759390884139e-01 1.682545326577429556e-02 1.667201142684663143e-02 3.549186469479556627e-02 3.808479346109888003e-02 1.797399627826072599e-02 1.934497886959113053e-02 1.026314197413337737e-01 1.056951896345027231e-01 4.226519119217601178e-02 1.870835826878695235e-02 1.362893225504375472e-01 6.557459658498300537e-02 6.776147239388324861e-02 7.113643600738531192e-02 3.873921898517584950e-02 4.978185316061817939e-02 2.260048348981440712e-03 4.191900713003893914e-03 5.603276673094110746e-03 2.764049699631023760e-01
1.729780484123338152e-02 9.016919613781270576e-03 2.045420717343748862e-02 1.784606176654967430e-02 2.357950652261189134e-02 2.755067093503456022e-01 2.313461189883324332e-01 2.009565896423514131e-01 1.258170332327461227e-01 8.366627377263912563e-03 1.334149569841626692e-01 2.256389329568939672e-01 4.698519802137867130e-01 2.312850735984637307e-01 4.254364578189117480e-02 8.236918091931033636e-02 1.517906723392976609e-01 4.180442949596699376e-02 9.954573766973704579e-03 2.749802273321353407e-01 9.477620329851857428e-02 6.638021006220089226e-02 7.912263834531421680e-02 1.075873865007375557e-01 1.128464556186855039e-01 6.070290248710845382e-02 9.568349388776774267e-02 7.790550425621474429e-02 7.066882760842603528e-02 5.093140456419822937e-02
3.863636311716970306e-01 2.271409402085305673e-01 1.664297391847088803e-02 1.660059217358865469e-02 1.333362359661677092e-02 3.917271143395627542e-01 1.531451246371333119e-01 9.867583886391806391e-02 1.224247712652821451e-01 1.637454188549414963e-02 4.017021191957222126e-02 2.645648678779783936e-01 4.778567391410383225e-01 2.495372202348720148e-01 9.089567173892666718e-02 1.025910834447461839e-01 1.130244472272428913e-01 6.675635022007544994e-02 1.646447170352465655e-02 6.044216093150108771e-01 8.988775682806865452e-02 8.004236557910955618e-02 9.069139968938133567e-02 1.605356488207802523e-01 1.523539823982432706e-01 1.078388962130006068e-01 8.216443181244448279e-02 7.466799884351482675e-02 7.951706331561261831e-02 8.426195454454105116e-02
7.450387454775045382e-02 1.923586086705750264e-01 4.749920167301445728e-01 1.101279429370213142e-02 7.370001496229570612e-03 2.990978149974735656e-01 1.540236286407948851e-01 1.294231586489095753e-01 1.639950544293652668e-01 8.166836682749790965e-03 3.925729470640342833e-01 8.384694358399341629e-02 3.539474837069580548e-01 1.531559074146650601e-01 4.882300589381581568e-02 5.703179415948286812e-02 2.112799918970101332e-02 3.109435179389645476e-02 3.553874366232154247e-02 1.332910660656618645e-02 1.104000301688403407e-01 9.927341559587966879e-02 1.197980048034205935e-01 2.053447435066661775e-01 2.687342237749288931e-01 2.522730211101815168e-01 1.866172956166061714e-01 1.686559696912817985e-01 1.264942554971300870e-01 9.574071326999031295e-02
5.907295620763653582e-02 1.701292256140369830e-01 3.152051747465805520e-01 2.333016051288896997e-01 1.417941402300209042e-01 5.685971757897307910e-01 1.454219412454437962e-02 1.212988690729224078e-02 2.346052160807418907e-01 7.325565381134671594e-02 2.961271981776182338e-01 1.350089232048775831e-02 1.597023621678419769e-01 2.198302742092564932e-01 2.394097823006693937e-01 3.291763286353044937e-01 2.982412939032119681e-01 1.940593883823110710e-01 5.314193252621084440e-01 2.490956016136262052e-01 2.067108613817408153e-02 7.037459344452123844e-01 5.305397447931113897e-01 1.124390005724458172e-02 2.606138267036902517e-02 2.426169842561951701e-02 6.610565662198984727e-02 2.126010101540361241e-02 2.074360056139698538e-01 1.958772205360887197e-01
5.436265397852563241e-02 5.475374573723219840e-02 1.529797733874921073e-01 8.899160870550685068e-03 4.292848921120993588e-01 1.019022386130379598e-01 9.685435702863176566e-03 2.770958530801908778e-02 1.855814158796986052e-02 2.936437441500379109e-01 4.233901870901892253e-03 6.740074765888878772e-02 1.431961706654098498e-01 1.837256101074730419e-01 1.682038049828461501e-01 2.059660609542189047e-01 3.550737580330463605e-01 6.194586052432055068e-01 6.385928962095678285e-01 5.113405348091806246e-01 2.205197182487120960e-02 2.319094126091358898e-02 2.051377307668967795e-02 6.451099196246803946e-02 9.255713447617319733e-02 4.717115662291571088e-01 4.704306199749472284e-01 9.316041602332883476e-02 2.413024488865942174e-01 1.419874267845221416e-01
4.915251299172186672e-02 5.374466859876149416e-02 1.242475832000587144e-01 1.388670511565676113e-01 9.291302446175216112e-02 1.064073846769689469e-01 5.311433023840891887e-03 1.487654716619491932e-02 3.082287472383236221e-02 1.125284240321638290e-02 1.182182878543093854e-02 1.041321675190309826e-02 8.119220401484622540e-02 1.656042135540913840e-01 1.557494877920151677e-01 2.398808574301733443e-01 4.203622621232349643e-01 5.197397146018150060e-01 3.073937897929085450e-01 6.864375243682550864e-02 4.152735274535732102e-02 2.864293618691329257e-01 4.164520349896849716e-01 7.020575883387328853e-01 6.577300619090710176e-01 8.503969469662965297e-01 6.777610608821539318e-01 1.915655387349345651e-01 3.757043603944217880e-01 1.676357978546798577e-01
6.115439146337269677e-02 7.122613022132757987e-02 7.112459844665118547e-02 6.820980999938791589e-02 1.043014139172028787e-01 2.177747424945405685e-01 8.655239041391254995e-02 2.891784635721635910e-01 1.415715433493283659e-01 2.462145723211962844e-02 1.859820418909899353e-02 2.943715041119755738e-02 5.841233424756904491e-02 8.601292563647101874e-02 1.131759722825425168e-01 2.021999313293442735e-01 4.436684540559679424e-01 4.611339072902459479e-01 2.259970811889178144e-01 7.963631898871069426e-02 3.435955803852459578e-01 6.214670640762747222e-01 7.960385713932229823e-01 8.228707501670348146e-01 7.218739914931383561e-01 6.165305903946400878e-01 9.028561024857300055e-01 1.568479233690118213e-01 5.539654423993340959e-01 2.344452382815215563e-01
1.471540849991389566e-01 1.169309244736367465e-01 6.231699427077473652e-02 9.890966860834282670e-02 8.384877559011537362e-03 4.214107618467817507e-02 2.351047778212733697e-01 1.914526862464651646e-01 1.889846773679218217e-01 9.619283865806038669e-02 3.588747806981884558e-02 9.855360905359060800e-03 9.683940300349868496e-03 2.475663791445356296e-02 5.509144334946000643e-02 2.506169025857180599e-01 2.700923111358061734e-01 3.280580545690188199e-01 5.933769104041240749e-02 1.075370813861649538e-01 3.804981885283097442e-01 8.205493899758025123e-01 1.012623297352594154e+00 1.057920131363289329e+00 8.668010170244470070e-01 8.210672334814077544e-01 7.507718790093843575e-01 5.952121227461546482e-01 2.640961367087530168e-02 1.740607572335486214e-02
6.611868365545223170e-02 1.849424065131032580e-01 3.510047907531939071e-01 1.571778349350387224e-02 3.443149803007736209e-02 4.835224852439390375e-02 1.521825275136458600e-01 1.888199758666261885e-01 1.296978567571632768e-01 1.024971856853344465e-01 2.187275851010678576e-02 3.930412516502101439e-01 3.302554035893252860e-03 9.315624964858243429e-03 2.010302972533467916e-02 1.177365321479278970e-01 4.609539225405936275e-02 1.527789999487004155e-02 6.574740108930363647e-01 3.908224503622709928e-02 1.477317331646900156e-01 7.827456703748837397e-01 9.892187376219596651e-01 1.036824060354198496e+00 7.542282621636768880e-01 3.466485024890992861e-01 5.550777567291582670e-01 3.809818654902468182e-01 3.435302876557796287e-02 1.356055273980714439e-02
1.135265646626153202e-02 1.439251695074520582e-02 9.592527528224509270e-03 1.180218173428979750e-02 2.750151128109739468e-02 1.567886970207841082e-02 8.050817447392261128e-02 1.032021619184396027e-01 9.513726344722403527e-02 2.273617169425666898e-02 5.756688950782546700e-03 2.316978388166411607e-01 3.975192745753580725e-01 6.379483309272061115e-03 2.537373553841695828e-02 1.707779774236133433e-02 3.185763707534455813e-02 9.652070233958885692e-03 1.848800638075380823e-02 8.830010172303841276e-02 4.715967534038101316e-01 8.896771690553667566e-01 9.544068744729199416e-01 9.116352496429939167e-01 7.029253221418738651e-01 5.151094793071089306e-01 4.974908041804060876e-01 3.351873669066408046e-01 3.017747378928582053e-02 1.074210827412582295e-02
3.183626908837233066e-02 2.867916959474744315e-02 1.471974186927941033e-02 1.052756735780335101e-02 1.357413352560175000e-02 7.241116490895196586e-03 4.118806623732090832e-02 3.658243766966294552e-02 1.003411306500457192e-02 5.481301613764800323e-03 1.893382199707769730e-03 3.017108915521213852e-01 1.768333412799623638e-01 9.592905165506279697e-02 2.433614674400007005e-01 4.833569852017674529e-03 1.749973591243808926e-02 4.052072950481760971e-02 3.954441047743058324e-02 1.776598262967854780e-01 4.826867309884556034e-01 6.990445357344723387e-01 2.847779001581521308e-01 4.319150578111560224e-01 5.634150008060037074e-01 3.214537622867862932e-01 2.409698312324858871e-01 1.979107028096866450e-01 7.285834871330897355e-01 6.646575000942857026e-01
2.575952174284405760e-02 2.915326053696280090e-02 4.291685637003589578e-03 2.950477228399236117e-03 2.396624240821291704e-03 3.560630729042300012e-03 5.073685191320429638e-03 2.845928105722765888e-01 1.622949871880847734e-03 5.751787966001546681e-02 7.391281325531803836e-02 1.102966024989622124e-01 1.205788802728933740e-01 4.261665928822367388e-01 6.671378403416616462e-03 8.885896875427949648e-02 1.711601716421574659e-01 2.503826636606818479e-01 1.727699048681565208e-01 1.311516472003838307e-01 9.290201215628481057e-02 3.330541349249549476e-02 1.289534763263559987e-02 2.812121710052110229e-02 1.033281297385356262e-01 3.543499120650159956e-02 3.305853626913594218e-02 1.117032204554696193e-02 1.261589116828367163e-01 1.031753830952102102e-01
5.414560707181162447e-02 4.106284187829797178e-02 4.462126895780620973e-03 3.630065721590436389e-01 2.768591460019571848e-03 2.143770169101875435e-03 3.291681201688887240e-03 7.787595371769114039e-02 6.633716998320528246e-02 2.830887031254159664e-02 6.618173966778448380e-02 1.234143060351586829e-01 1.629377506241409534e-01 4.636248997798388116e-03 7.974075227421485029e-03 5.189736495592306431e-02 1.912272515448845966e-01 3.613601528091694437e-01 4.150843855549968819e-01 3.656210469331516721e-01 7.853264502490922561e-02 1.764705809354987984e-02 2.193231469759459110e-02 5.404831480542750255e-02 1.216311130159318521e-01 3.625844099779319818e-02 1.406776611811504617e-02 5.285682247231708875e-01 1.667010362291570791e-01 1.495981053042277631e-01
6.691781465651847061e-02 8.477099715286998127e-03 4.249040944608117876e-01 1.462089073081838664e-01 1.733667674411521753e-01 3.883561038888740380e-01 2.370214982599243986e-03 5.789311320894027779e-02 3.217750342433525063e-02 3.678272200481200183e-02 6.448565154909013941e-02 1.090300795613417806e-01 1.228628271990279963e-01 3.570289836784977609e-03 1.468641683902502035e-02 7.429020888094019226e-02 1.458028343898431778e-01 3.411233723462281930e-01 4.364116619164842836e-01 3.762535940855473715e-01 1.906641105688201554e-01 1.112003932659313098e-02 7.957893590812274709e-03 1.727432622563508657e-02 1.000454705476499506e-01 6.029292426138602168e-02 5.473357864748449458e-02 1.033012849814090618e-02 1.509291573217277638e-01 1.159069958546944112e-01
3.801107073408697273e-02 1.176260818219457271e-02 4.459207249720204339e-03 4.183878176568585523e-03 9.192656835876153454e-03 6.180739790142848918e-03 2.506230522064196477e-03 2.217195492913952848e-01 3.343749175635050697e-01 4.318323298698495960e-01 3.992936531204461376e-02 4.472361700278801311e-02 6.961429952352640727e-02 1.575365845456734581e-01 5.275951225649960601e-03 2.273192822648020112e-02 2.346670246202425467e-02 1.027129643171310058e-01 1.346115812987465910e-01 1.182768669409866025e-01 1.014282142944992748e-01 1.331973405627712680e-02 2.427369423907236312e-01 4.607431534126331663e-01 1.799341864483804815e-02 4.501953933686610176e-02 1.213894509901743690e-01 6.852976393926360488e-02 1.799594025755641979e-01 1.358241018095929786e-01
1.370628730977775482e-02 5.427386285299535054e-03 5.618074742378440650e-03 9.558501022537017888e-03 5.168230117039244835e-03 4.701129990591565999e-01 2.184109316227401676e-01 1.551471184916737300e-01 2.173745109074110352e-03 8.499977372001712994e-03 1.283033920960804652e-01 4.399262597799103586e-02 7.435188986837140690e-02 1.630773020376137805e-01 4.279295180718297766e-03 8.115400602936855001e-03 5.772183195021130496e-03 4.601821678175800345e-01 4.787060681569280281e-03 8.951162505351006188e-03 1.632928832346175821e-02 4.859008111417201792e-01 2.433821242752338132e-01 1.033991915726042987e-02 2.530611881643538702e-02 9.011772666799226436e-03 3.119812911653285087e-02 3.506500919669074817e-02 1.247806496057449373e-02 2.074297870598094395e-01
1.390228739312123971e-02 1.112605591118556031e-02 5.259324086447830782e-03 3.892412608041677380e-03 3.586800274627683673e-03 2.733515690025473677e-01 1.824310256933181495e-01 1.889650192764611991e-01 2.100099427203301616e-01 3.721827616010927632e-03 2.328031040438243437e-01 2.196646757895530655e-01 2.072475369368009801e-01 2.583153689392349017e-01 4.150557078125840897e-03 3.093130105865273503e-03 3.650134765965572514e-01 2.243403792510405559e-01 2.022150246248922700e-01 1.568218067932789506e-01 1.243445754008151577e-01 1.809995211952066529e-01 2.869633997948554116e-01 7.167170190226955784e-01 1.045920250418799942e-02 6.030151537822532326e-01 8.409308830253028541e-03 6.187404851290072560e-01 6.216251738171896246e-01 4.005970742949254149e-01
1.884279794774881833e-02 9.788375720873791416e-03 5.407659870915997730e-03 7.464520129876155499e-03 6.492290694314317365e-03 3.464094741211882697e-03 1.157019404835465427e-02 8.560979539345949657e-03 2.826442596057723855e-01 2.033036509208447640e-01 7.189618820646445640e-02 1.638217848680618427e-01 2.352422027877279324e-03 2.809389611069152554e-03 9.358125175891865433e-03 7.531463231906364297e-03 4.168027854015354250e-01 5.095334273572423855e-01 2.417405047513015715e-01 1.064578266698694570e-01 9.652519513198376533e-02 1.470826722400873365e-01 2.283269408765042918e-01 5.566925094344383346e-03 6.099581120942797197e-03 1.848030832054617656e-01 2.079252998768496841e-01 2.636921107732935754e-01 7.754339133224612615e-03 1.751979551665929780e-01
2.512766810369562731e-02 2.166367226608523905e-02 6.436916329673141209e-03 2.220476405608761902e-02 2.549951411777557492e-02 4.723193418055997295e-02 3.112434382449852724e-02 3.460884162899548026e-03 2.788548739209823490e-01 1.598311165363985598e-01 4.682702673728689896e-02 5.807906447107821085e-02 7.287625817533917305e-02 2.962888506384570020e-01 3.780011776393481515e-01 1.735040197845096333e-01 1.753467577058819560e-01 2.165349533201253451e-01 3.018954246156380639e-01 1.667562242182646093e-01 9.046504064846190574e-02 1.225111277932466880e-01 1.372700642720227626e-01 2.407150648414885796e-01 6.142566220394168539e-03 1.279830024659805443e-01 1.888930247799394391e-01 3.081999324969492693e-01 3.615390668171923894e-01 7.368413532821028733e-01
1.346669864227127353e-02 3.331094046355992377e-02 1.005551895527334594e-02 1.076313277000139762e-02 5.166318503301089993e-02 5.387075570408349917e-02 3.545564876282556593e-02 2.402683273517168192e-03 3.751886275184385666e-01 3.527150568076590220e-01 1.442623830338567448e-01 7.125787423420802680e-02 4.622792213394784355e-02 8.292279439432218013e-02 4.079584929670209137e-01 1.221588491044145186e-01 4.505298494200903336e-01 1.915643650675699292e-02 3.656974438042166764e-02 5.187636063723480295e-03 1.358114323084285702e-01 1.713778038691926298e-01 1.453685819258678791e-01 1.664900741862082312e-01 2.305717122316944812e-01 1.827489053147100806e-01 2.197199217613090838e-01 2.717752719425775010e-01 3.552586869302643557e-01 8.925766439356807788e-03
