2.140950530851447198e+01 3.219779894160529210e+01 2.778816835420651188e+01 3.488425884048248804e+01 2.624465854646987140e+01 5.774534951163074226e+01 5.759750188223709699e+01 1.572146922492744920e+02 2.896202443895909937e+02 1.314745089856500329e+02 6.237124643295150861e+01 1.453543303249184504e+01 8.807299298149096956e+00 3.475608772016846615e+01 4.319158049759215601e+01 1.021638451810963666e+01 3.933526001861075372e+01 7.581007409291619581e+01 7.636420937899467276e+01 2.955180223216094504e+01 2.389660248218774541e+01 3.498176238535846583e+00 2.745097468197292834e+00 1.106708344183430803e+01 2.176551559362673771e+01 1.742132172024069803e+01 8.265543314702402000e+00 7.371667199772835577e-01 7.106420202520984386e-01 9.089409070422826975e-01
1.596346540694998950e+01 3.612044986866256835e+01 6.482600226762369289e+01 5.238247203091895443e+01 3.629767650557803194e+01 1.635838344772995185e+02 7.919439503914642842e+01 1.004949151625104378e+02 6.725181618737779843e+01 5.847675887295986286e+01 4.321694177926663372e+01 8.800344330404598736e+00 1.223716180756462180e+01 2.943379557523662982e+01 4.336297730657802418e+01 2.974148627904458664e+01 4.032728404710333336e+01 1.464068842719434826e+02 1.241524609533881573e+02 4.158262529760382620e+01 1.507786051408117345e+01 3.448871204181968686e+00 7.395352047475181934e+00 6.710313080864223068e+00 6.086255548872276044e+00 8.451255436330544768e+00 3.132824639732751493e+00 7.923047185606597598e-01 1.108607975168227622e+00 1.097015086425991548e+00
1.871378804697938563e+02 1.948446353083567146e+02 4.126376705220163785e+02 3.327757012074006866e+02 7.115073767108054881e+02 7.324092540976309351e+01 1.403540291644067395e+01 1.537985685784284939e+01 2.578905103652830348e+02 8.092011915894035212e+01 2.277307095041154241e+02 1.602408932982092722e+02 6.219554417703635352e+01 9.522607212404182064e+01 1.903908406039877121e+01 8.475915533496562659e+01 6.234780975614376075e+01 1.430470957756216137e+02 5.407043624269697375e+02 1.012035385292542458e+02 9.934096014093041660e+00 2.967548741313467353e+00 4.678367813565423639e+00 1.702665206857898905e+00 1.067268096094152519e+00 7.513349355490237524e-01 7.158458130553793097e-01 5.322099165645615138e-01 8.556261757709795468e-01 9.219468640566704787e-01
8.937598432501705759e+01 2.619703187962804805e+02 5.756078141948396478e+02 4.610652478399570100e+02 1.911320804161483693e+02 2.968546547056973850e+01 2.393542136405226017e+01 1.617094053535038256e+01 1.009570116906709814e+01 9.566788354174477149e+01 6.299580872271066312e+01 1.301417888828215439e+02 6.178700962197419244e+01 4.383723704013712563e+01 1.364427459306721069e+01 1.105685791534085283e+01 2.500481544508917153e+01 5.117959635632813331e+01 4.036188929846865392e+01 3.802794979634587946e+01 1.807541123877950184e+01 6.450852521381771787e+00 2.102730966158895320e+00 4.263457350289944436e+00 8.440254509170914687e-01 6.653906469702446369e-01 6.130016993627779298e-01 5.404947353823501555e-01 1.010882163860384875e+00 1.048834914375728733e+00
5.364703859466712288e+01 1.716162932765634537e+02 4.777476441426146039e+02 1.849314548106163443e+02 1.067686159947110838e+02 1.550462110459940490e+01 2.364415537440766713e+01 1.313596445544003721e+01 6.062303580659820668e+00 2.105174519631812871e+02 2.631053444641000283e+02 2.277973806607315623e+02 3.487327172780202034e+01 3.097346621658330079e+01 1.549214740008621050e+01 6.129503026260358034e+00 7.016936362724595710e+01 4.307170783326338181e+01 7.487043719414404563e+01 4.608479915701658314e+01 3.367847318723411121e+01 9.945103574291810133e+00 2.314458978183848004e+01 6.696258284016439077e+00 1.428840413433944967e+00 8.360384560299685131e-01 6.243552053485665887e-01 6.757197783000751246e-01 9.755755696095906870e-01 3.434961018861551363e+00
5.600428979674934737e+01 6.133759084734849409e+01 2.742788220979572884e+02 2.190777742369023429e+02 8.704491713248434337e+01 9.183849519615463919e+00 1.094989841906278727e+01 1.153444514095275508e+01 1.062075371751469888e+01 3.131828210451424752e+02 2.399309154599773137e+02 1.253956971645403939e+02 1.463791784194653722e+01 4.733738377260351626e+00 3.840848114317097384e+00 6.713407436316787269e+00 3.687131576255764998e+01 1.004675572889127366e+01 3.434053553756434241e+01 1.248859695324588017e+02 1.627798434996662422e+02 1.037170590285320486e+02 2.774691654567025978e+01 3.800963214663495737e+00 2.023722186155731073e+00 2.078728533107152554e+00 1.393861527161517122e+00 9.007214735792825611e-01 1.096316358435376337e+00 1.896219349104906415e+00
7.891522222391278873e+00 1.319086811462884512e+01 1.397561950510281292e+01 7.100152870460884458e+01 3.411639182729251019e+01 5.561873207912923078e+01 8.191183450072350070e+01 4.555293160216021420e+01 5.288399306572573266e+01 5.908777075566369774e+01 4.387752922405614697e+01 1.760642752378015530e+01 7.325907257351934376e+00 3.030328394439262052e+00 1.699572966737973978e+00 3.242554103546888999e+00 1.980481758226867228e+01 9.653384813072626969e+00 5.100537031014981437e+01 7.267251263663547434e+01 3.595346779912794943e+01 9.273914532025740343e+00 3.921185933225284082e+00 3.271952305007936879e+00 1.312825415689410802e+00 1.474422396216917619e+00 1.394990516944035530e+00 1.136502367131160263e+00 1.222066967226839385e+00 2.800093885842920294e+00
1.621990918411320237e+01 3.089116895252203676e+01 1.822740271322960126e+01 3.972263615426054884e+01 6.156760210862930904e+01 6.889546758697079554e+01 6.036518824490739377e+01 5.653469749477912387e+01 4.528851966120507200e+01 2.453392306624173358e+01 9.585745691987265005e+00 2.887889271924295187e+01 6.162630000778039019e+00 2.123451741051206376e+00 2.262589528728473631e+00 4.364671370452580135e+00 3.754556065445272850e+01 6.244372265252923881e+01 5.729144927035404322e+01 4.285458379644456528e+01 1.257170271781265392e+01 6.339960988235642247e+00 2.289561518385651695e+00 1.891810541012665325e+00 9.506460094806550298e-01 1.073028565336765272e+00 1.770913764968636173e+00 2.113248224554119314e+00 2.012189542980072687e+00 5.703630571447250830e+00
4.125535882522090247e+01 2.765966723658455351e+01 1.645806056632494574e+01 9.723597486487412311e+01 6.460842774779823117e+01 2.755482593687802506e+01 8.910506866250281632e+01 4.033147965904825583e+01 3.441560233323053097e+01 3.297913436857301406e+01 2.869089743751296595e+01 3.707610222108470310e+01 8.050816287833411877e+01 5.343048502631256724e+01 8.102753646407066412e+00 7.558117483896133137e+00 3.406205522170264288e+01 1.081675263692462181e+02 1.122270510682957365e+02 1.986626167378825158e+01 3.350749836959085570e+00 2.758047879203839425e+00 2.774556825486905964e+00 1.791123241094501495e+00 1.091745020316355674e+00 1.783591346116692122e+00 7.098278784528974761e+00 1.365338915586573165e+01 3.788824737545394328e+01 1.808192631797505001e+01
6.718081912107615494e+01 4.397717519666589681e+01 7.134825444706766007e+01 6.829002240881143848e+01 6.214000717355821735e+01 1.250008093519009833e+01 5.888759450986932364e+01 2.565833791350561555e+01 1.115329993103872397e+01 4.078213276251478447e+00 5.855857956798497099e+01 5.613982652212945368e+01 1.171574644299373205e+02 1.249557765265396085e+02 5.900264930607649205e+01 6.396461339343848351e+01 3.540483500626521618e+02 3.847755316883312844e+02 1.639021639297667434e+02 7.811576881535579275e+01 4.091389801561913231e+00 2.059762735514504506e+00 2.235805688242733513e+00 2.443972892612463088e+00 1.388755506901550252e+00 1.882080204284099167e+00 1.861644024697327282e+01 3.059276720618444401e+01 3.670948141074374860e+01 9.331384729122726540e+00
5.682394229136637875e+01 2.964436608849840837e+01 6.689290485297496502e+01 5.812245450849917461e+01 7.659994167522718556e+01 7.223982664041672663e+00 6.225140471121692443e+00 5.602527350234462133e+00 3.663977861083955290e+00 3.218214469812139811e+01 4.949673252480768610e+02 8.117580352538343504e+02 1.637592064339366971e+03 7.791035093924956527e+02 1.392566616700331679e+02 2.631727049136451342e+02 4.982775125492413508e+02 1.432168595968633156e+02 3.598393490657323923e+01 7.619352183967171399e+00 2.718498581687154747e+00 1.980475994772491699e+00 2.465259986375900603e+00 3.453706343225478648e+00 3.739031232970869034e+00 2.098471807034771430e+00 3.455758583075378532e+00 2.668723646999278554e+00 2.317888449482808255e+00 1.617663047930177012e+00
1.084752048502667066e+01 6.377261005994545151e+00 5.620443461919330730e+01 5.572884595874898395e+01 4.452633282677764726e+01 1.052689906332037673e+01 4.229335062564420156e+00 2.826732069800407476e+00 3.662108879164788000e+00 6.696292984951828942e+01 1.584940336669983481e+02 1.011308655948169871e+03 1.753621598416688585e+03 8.675812466758887922e+02 3.008573332009411843e+02 3.242408500916574212e+02 3.570495463606932844e+02 2.134924429038406402e+02 5.368497380169041833e+01 1.559800565673936923e+01 2.368389426836077671e+00 2.159337570134991946e+00 2.513011433404310324e+00 4.520413478323516365e+00 4.359927569114073975e+00 3.166558339027851332e+00 2.478087054319422222e+00 2.198711624252851049e+00 2.309744850321548526e+00 2.434678659964040648e+00
2.144006406549398669e+00 5.540169230607236095e+00 1.340914219963439535e+01 3.807094755017494947e+01 2.523203002890291202e+01 8.235502371632415830e+00 4.384892402464739547e+00 3.843571003088720239e+00 5.109399031717486217e+00 3.583692132527066576e+01 1.159899539345039088e+01 3.421819650637056611e+02 1.374462340053314847e+03 5.514811052072271877e+02 1.637680547420722235e+02 1.789799835957497294e+02 6.448021326644490614e+01 9.319175877737751534e+01 1.052432882033893975e+02 3.957390424588722766e+01 2.692608897861369144e+00 2.446804452839715260e+00 2.992420637378855552e+00 5.145824347015651057e+00 6.758654203856531595e+00 6.416990444668698501e+00 4.814593489449810804e+00 4.334628999562218254e+00 3.288235843305885808e+00 2.549791148646473715e+00
1.750019610939343107e+00 5.043932585975745120e+00 9.087143311929331446e+00 6.596943289907185815e+00 3.927720078605558385e+00 1.600864070297426878e+01 5.853429723831294496e+01 5.440067846732921453e+01 7.685566882092226493e+00 2.310554283588849511e+00 9.072375855181695314e+00 5.915097236100000089e+01 6.600513772950007478e+02 8.222725254741370691e+02 8.169764946096206586e+02 1.031254632817820948e+03 8.830747016210445963e+02 5.478418853584043973e+02 1.439593074380000871e+03 6.574115903317765515e+02 5.475635559079850623e+01 1.598776480062318761e+01 1.210514157376490729e+01 3.022695079091064940e+01 6.929324418698547561e+01 6.479711577568765790e+01 1.798234100353051872e+02 6.013832730173076868e+01 4.899765898800513497e+00 4.871863494837871400e+00
1.594778885981004590e+00 1.612303636367122817e+00 4.422349679686386814e+00 3.312331631910757324e+01 1.213976770000467909e+01 2.923794653740462657e+00 3.994202231806397663e+01 1.231110118703208087e+02 8.901948579546719031e+01 9.169578887111322629e+00 1.959535992181542241e+01 3.110956411493079372e+02 6.328861985839477029e+02 7.354482489584368068e+02 6.138986607144966001e+02 6.892553845606719278e+02 1.094918019480143357e+03 1.770279983805860411e+03 1.704116159609227907e+03 1.300753331902910077e+03 5.559826899400673028e+01 5.818681523545053835e+01 5.164309088338561082e+01 1.586883667089394123e+02 2.223926994668797761e+02 1.128506819911341609e+03 1.140826030623391716e+03 2.371911371841255232e+02 5.421790502021924141e+00 3.345241494023099449e+00
1.419534123108541657e+00 1.563753254011890359e+00 3.590805114237642481e+00 4.005983958096217101e+00 2.699020694945237331e+00 3.127189856097697174e+00 2.259110988420481192e+01 6.575915347288710677e+01 1.420351673779697990e+02 5.262760599310725240e+01 5.639163581449020057e+01 5.114415545751330683e+01 3.884831579310151710e+02 7.217494956274931610e+02 6.223751404839298402e+02 8.836923770357507237e+02 1.387986974439657388e+03 1.545182699977871152e+03 8.306787853634962175e+02 1.733078345355693841e+02 1.030568662250391014e+02 7.023225488557270637e+02 1.014400492217806686e+03 1.656079024889118955e+03 1.512854930074448930e+03 1.958879871433141716e+03 1.591229203170434175e+03 4.697674641488493421e+02 8.252493543400484910e+00 3.791439345069787414e+00
1.762410426603751246e+00 2.070128574252410480e+00 2.058631059372609151e+00 1.997868220787801130e+00 3.130609600861947506e+00 6.600728781281345547e+00 3.855083636543108696e+02 1.305397884769076882e+03 6.544880321130858647e+02 1.174139961670095147e+02 9.298244807747994400e+01 1.562175056198346397e+02 3.069244670189272597e+02 4.127878393479827537e+02 4.999669582206332734e+02 8.287271743625256022e+02 1.578940275630831820e+03 1.430750840778825022e+03 6.207130334505380915e+02 2.004818103390360307e+02 8.430500918907732739e+02 1.493321842814238153e+03 1.882599128332524970e+03 1.869603864987120915e+03 1.610166412192987991e+03 1.393244163284477054e+03 2.102296342412872946e+03 3.741065624372054685e+02 1.210508086839467978e+01 5.129528938760330448e+00
4.321978565751328105e+00 3.461182051802091042e+00 1.831141020982246292e+00 2.962150012889067430e+00 4.036189972972957918e+01 2.048260731689181284e+02 1.128218617228935955e+03 9.241601497119517035e+02 9.339723711438859937e+02 4.895555752059747761e+02 1.922586341968133468e+02 5.719972274034191173e+01 5.618247402425763681e+01 1.311301744634179158e+02 2.697085139762654649e+02 1.148182901444372192e+03 1.041002443392340183e+03 1.068962921040128549e+03 1.667298120777887789e+02 2.718848328267507668e+02 9.269535710066031697e+02 1.937934312891100490e+03 2.332731526718024725e+03 2.329511984147513431e+03 1.890273115464198327e+03 1.842425864618407331e+03 1.764307581348993153e+03 1.400085917188229132e+03 6.223153794695821261e+01 4.104285122442610856e+01
1.948434570346066597e+00 5.545042457468573716e+00 1.062334137757560093e+01 7.769011003545000449e+01 1.856195644045094753e+02 2.667749689793060384e+02 8.383350750486097240e+02 1.053697469589566253e+03 7.431086728676868915e+02 5.949084786695240155e+02 1.309613709456351671e+02 1.361279581560093632e+01 2.024880884612742804e+01 5.186297229609168369e+01 1.028231751947484156e+02 5.591621091813769908e+02 1.868258436959545463e+02 5.304894676336202508e+01 1.590515225706114499e+01 1.059649759228233705e+02 3.812657781621999789e+02 1.931742933102626012e+03 2.346245786401476835e+03 2.339169021401553437e+03 1.652168578120878465e+03 7.559993764131659191e+02 1.231307312473250931e+03 8.456403722822431064e+02 7.632217948068500846e+01 3.012371403069813880e+01
5.013371223997221904e+01 6.817405309033175342e+01 4.873314464600612439e+01 6.550326675236144069e+01 1.697106227279570305e+02 1.008131859937561501e+02 5.264610964947272578e+02 6.912770689370117907e+02 6.546166595024458275e+02 1.550037911392782064e+02 3.934619267349602723e+01 8.428939350799408814e+00 1.413916167711362704e+01 3.798298883166741291e+01 1.380150758869608865e+02 8.565259564335062237e+01 1.386998187616128462e+02 3.657195029443467149e+01 6.143667935571387773e+01 2.643536265850445943e+02 1.323458988633310582e+03 2.355795706751448961e+03 2.396418225269520008e+03 2.136772784345239870e+03 1.554996981003180508e+03 1.098105168655380794e+03 1.047293269078652884e+03 7.060836526774764934e+02 6.360878031372862296e+01 2.264249630311978123e+01
1.482291618437106422e+02 1.470464862388977849e+02 8.332996319584515277e+01 6.701870610939754158e+01 9.882752090411338486e+01 5.599070494545766508e+01 3.290555883182594243e+02 3.042807705544793180e+02 8.648193830630216894e+01 4.524918730100978337e+01 1.508845898025910515e+01 1.166008325428207826e+01 6.614470500793847130e+00 3.407195262585489104e+00 8.267864559378219624e+00 2.615310259172967022e+01 8.324257846969538832e+01 1.702073274858124705e+02 1.476682184260094743e+02 5.995786327823979036e+02 1.502734257609275119e+03 2.020366086769769254e+03 7.698782124817827253e+02 1.059564478936573323e+03 1.264178167030994246e+03 6.732641094963570367e+02 4.860842767692748225e+02 3.993870719764692012e+02 1.464165948011722840e+01 1.323703182936988654e+01
1.258152180333206616e+02 1.572045328535915871e+02 2.587975027381123283e+01 2.026032799144781293e+01 1.907283192015328410e+01 3.042134892673604085e+01 4.533046976066749068e+01 1.186807525962921162e+01 1.596289780103495382e+01 2.390041272901456182e+00 3.006270203720026402e+00 4.408023616153124991e+00 4.627376729339051309e+00 1.545776927490494757e+01 4.095044938044920713e+01 4.988982973596495185e+02 8.537703096463991415e+02 1.115048873434118605e+03 6.917039776564206477e+02 4.755005959908748423e+02 3.060451110737382692e+02 1.004339935880099972e+02 3.588307202755670744e+01 7.008378540728293160e+01 2.315725713598025948e+02 7.260795002698999667e+01 6.378164148495866215e+01 2.149970303936009230e+01 2.439604442889051317e+00 1.994562240457525615e+00
2.800289464934544412e+02 2.305253274404925889e+02 2.748722803711891061e+01 1.322265665996293471e+01 2.186933144126917483e+01 1.814252306191472641e+01 2.921620184417641752e+01 3.264486372547680038e+00 2.839656420344945253e+00 1.178665692400305609e+00 2.687526149957656152e+00 4.899312061775892957e+00 6.180819673569464712e+00 3.114548951922015618e+01 4.787699155975283816e+01 2.809786534714713753e+02 9.254212925965669001e+02 1.570530515444557295e+03 1.628994124119406933e+03 1.292477059417804639e+03 2.487698399008648948e+02 5.048916940342347459e+01 5.711744425853675722e+01 1.287842662740991670e+02 2.669350371964104625e+02 7.385779772357774675e+01 2.706681012081218185e+01 1.006729670329032622e+01 3.121022086494230408e+00 2.786506912285123594e+00
3.750736126441063334e+02 5.036032786630923397e+01 1.505871186328274192e+01 5.396638586169034468e+00 6.803762512667918649e+00 1.572091037741906305e+01 2.106630083496606076e+01 2.455167625789379748e+00 1.392484573730594644e+00 1.543162978157823773e+00 2.629015436386308302e+00 4.327548688199675198e+00 4.638217616108238239e+00 2.398175469923150160e+01 8.733659070124321033e+01 3.946304002172460059e+02 6.941400436614532055e+02 1.463324568752550022e+03 1.695981652743832001e+03 1.312167226513359765e+03 5.881258751143523114e+02 3.065246602439817281e+01 1.980466655992048075e+01 4.044950464308043792e+01 2.226954407836413452e+02 1.278231670404274496e+02 1.112528939445340086e+02 2.046453085516380099e+01 2.896067206374346004e+00 2.158940120730345580e+00
2.283405772198598243e+02 7.336157917695365427e+01 2.996392457122869857e+01 2.989170347105897463e+01 7.282411093684265779e+01 5.231827469635281602e+01 2.244985887212159525e+01 9.567222806771717103e+00 1.473197271077092552e+01 1.836022078432886318e+01 1.643386303909637469e+00 1.786872624248181607e+00 2.633561623585161104e+00 5.562291089243863951e+00 3.147834976705045307e+01 1.205487481987882745e+02 1.116787256528361354e+02 4.419622896344213814e+02 5.276041747146175567e+02 4.150211617077870869e+02 3.107823390124007119e+02 3.624179731284414885e+01 5.104603842570292649e+00 9.687675053347566845e+00 4.227862364980724408e+01 1.041242377145963189e+02 2.747615198502061276e+02 1.494765675285170801e+02 3.611262204394460440e+00 2.619193389741531597e+00
8.310108450913349998e+01 3.414463074470435089e+01 3.815090137694126327e+01 6.865240839493802127e+01 4.104613644661112914e+01 1.930105663491320911e+01 9.196074199682396255e+00 6.726576271279059327e+00 2.188998563742338632e+01 8.104819234608686429e+01 5.296976148105187576e+00 1.762392140318276734e+00 2.816752678472520088e+00 5.759289370998860846e+00 2.558639713074148858e+01 4.313263592615805919e+01 2.755218514592525025e+01 1.276807591675039610e+01 1.892755062071793049e+01 3.201941045558230314e+01 5.189992450721420880e+01 1.091662961798657605e+01 5.250120949842505880e+00 2.623001328155536527e+01 6.317580908083755276e+01 2.215960652840374934e+01 7.509350285954806736e+01 8.099313111793524911e+01 2.789589615916661103e+01 4.120165693216872427e+00
8.429219170354944879e+01 7.007421588690991143e+01 3.572198202935661726e+01 2.797886880976505353e+01 2.851533273796847112e+01 1.122437231638668109e+01 7.682863529714310857e+00 8.195278221165727572e+00 9.294172116044382648e+00 3.547044249229941215e+01 9.608537749261678584e+00 8.798097135138249314e+00 7.846708816588018109e+00 9.120094511081514810e+00 2.479118111624082843e+01 1.642381941278863167e+01 1.071760733223006845e+01 6.220173010745696729e+00 5.325257288350362828e+00 3.949338345074576484e+00 3.008586568481819157e+00 4.223519566599908792e+00 6.481466798987781885e+00 1.584324432650475245e+01 2.733817591973598837e+01 1.291181178717894795e+01 2.023035346103479171e+01 1.296874972223744038e+01 1.269574447270480633e+01 7.958923401040548740e+00
1.142499244428272789e+02 6.171856606237854237e+01 3.673688569961277040e+01 5.369826054060666820e+01 5.166767357207690026e+01 2.939596285176943269e+01 1.040453466753160683e+02 8.217390739009309186e+01 1.250322745010622683e+01 8.670670575056455220e+00 2.966418656463633674e+00 6.559640858794125506e+00 1.840037254724539650e+01 1.909579644977996082e+01 5.583006858103310321e+01 3.995015442784170290e+01 1.223391994975454544e+01 1.412450410258638200e+01 6.364666995165161545e+00 2.704167657035252414e+00 2.400553750861967650e+00 3.583814490538932862e+00 5.455316714365119779e+00 1.664528907862075258e+01 1.676558943951986436e+01 3.949609170673762382e+00 4.327389824999887225e+00 5.433682919137002187e+00 1.732460154868815039e+01 3.515727278105307718e+00
1.533325662938820813e+02 1.375305235573662799e+02 4.368849410218594187e+01 1.599453014711353944e+02 2.029830201475800777e+02 4.003977214835751965e+02 2.794491162394795651e+02 3.314654271793913409e+01 1.230517349588508935e+01 6.800057978309105522e+00 1.927331050740751284e+00 2.319993723446801326e+00 2.750660412598853188e+00 1.043620973537488617e+01 1.249390516758658620e+01 5.421196184530463924e+00 5.148994512389013067e+00 6.081378311906694201e+00 8.111816997413608732e+00 4.288279688547456558e+00 2.317508381179168353e+00 3.135481701031661128e+00 3.508172551560708285e+00 5.786963019374136152e+00 1.781850125496652737e+01 2.757581618129009815e+00 3.931378140860174675e+00 6.407450830638435235e+00 7.664962962845151218e+00 1.517244047183333322e+01
8.390774191205895249e+01 2.172068186284367357e+02 6.828992218135897474e+01 7.832752884471838684e+01 4.115121457467441815e+02 4.529198754132715976e+02 3.130394589755530887e+02 2.241064382060815774e+01 1.618055404697960853e+01 1.459282579005814995e+01 5.740204737867694362e+00 2.733677817891456918e+00 1.675214766505731534e+00 2.810829242093676239e+00 1.298874224217950868e+01 3.673473618939069318e+00 1.256333279943316938e+01 7.283570576627170112e+01 1.238763522094662335e+02 1.655415809274164829e+01 3.207241108970539489e+00 4.051498372664697811e+00 3.439872852924840796e+00 3.739628184745692696e+00 4.907332932823603500e+00 3.714840432320624775e+00 4.318107741808997702e+00 5.300917223086823782e+00 7.116752721577134899e+00 1.742323926099243536e+01
