25.3000422436698 25.2889365515397 25.1899445521832 25.0900089650618 24.9891312928335 24.9398155276893 24.9381275641066 24.9364414011373 24.9347570387944 24.8612906519043 24.7836251202772 24.7068962630429 24.6570720585516 24.6570720585516 24.6570720585516 24.6570720585516 24.6570720585516 24.6570720585516 24.6570720585516 24.6570720585516 24.6570720585516 24.6570720585516 24.6570720585516 24.7601504336425 24.9392763876916 25.1184026307972 25.2975291626458 25.3000422436698 25.3000422436698 25.3000422436698
25.3000422436698 25.2939264852925 25.2434797290765 25.1920896303503 25.1397576914314 25.1140896878537 25.1124019933709 25.110716099214 25.109032005397 24.989029348774 24.8628192757515 24.7375456337415 24.6570720585516 24.6570720585516 24.6570720585516 24.6570720585516 24.6570720585516 24.6570720585516 24.6570720585516 24.6570720585516 24.6570720585516 24.6570720585516 24.6570720585516 24.7618528073952 24.9409769108411 25.1201013033299 25.2992259845472 25.3000422436698 25.3000422436698 25.3000422436698
25.3000422436698 25.2998613265497 25.2979588229129 25.2951132220023 25.2913260257955 25.2883638846719 25.2866764592833 25.2849908339339 25.283307008637 25.1158314667893 24.9410778427456 24.7672604063522 24.6570720585516 24.6570720585516 24.6570720585516 24.6570720585516 24.6570720585516 24.6570720585516 24.6570720585516 24.6570720585516 24.6570720585516 24.6570720585516 24.6570720585516 24.76355489179 24.9426771449478 25.1217996871343 25.3000422436698 25.3000422436698 25.3000422436698 25.3000422436698
25.3000422436698 25.3000422436698 25.3000422436698 25.3000422436698 25.3000422436698 25.2750275983261 25.230462081695 25.1868352101817 25.1441454820689 25.0135667492594 24.8786302862687 24.7427572921406 24.6570720585516 24.6570720585516 24.6570720585516 24.6570720585516 24.6570720585516 24.6570720585516 24.6570720585516 24.6645760048258 24.7027849886933 24.7400691538294 24.7764300022206 24.875464577727 25.0167567425354 25.1589716069908 25.3000422436698 25.3000422436698 25.3000422436698 25.3000422436698
25.3000422436698 25.3000422436698 25.3000422436698 25.3000422436698 25.3000422436698 25.2473073752701 25.1541988767442 25.0620287792086 24.9707955812859 24.8851822743915 24.7987910813534 24.7114636005332 24.6570720585516 24.6570720585516 24.6570720585516 24.6570720585516 24.6570720585516 24.6570720585516 24.6570720585516 24.6748080215577 24.761562313894 24.8473920280128 24.9322986655609 25.0213095305269 25.1140541050262 25.2077211394304 25.3000422436698 25.3000422436698 25.3000422436698 25.3000422436698
25.3000422436698 25.3000422436698 25.3000422436698 25.3000422436698 25.3000422436698 25.2186469624386 25.0769964718851 24.9362841382125 24.7965084603838 24.7577342502037 24.7198873368756 24.6811043791026 24.6570720585516 24.6570720585516 24.6570720585516 24.6570720585516 24.6570720585516 24.6570720585516 24.6570720585516 24.6859662220429 24.8212648327527 24.9556391057418 25.0890905423162 25.1662320438312 25.2104300184905 25.2555502133306 25.3000422436698 25.3000422436698 25.3000422436698 25.3000422436698
25.3000422436698 25.3000422436698 25.3000422436698 25.3000422436698 25.3000422436698 25.1959206606162 25.016811060721 24.8377011661956 24.658590977354 24.6570720585516 24.6570720585516 24.6570720585516 24.6570720585516 24.6570720585516 24.6570720585516 24.6570720585516 24.6570720585516 24.6570720585516 24.6570720585516 24.69569762292 24.8700830759109 25.0453932066026 25.2216265134003 25.2898521347361 25.2941997697007 25.2976254241912 25.2999538877862 25.2983676901838 25.2976989689498 25.2979462226706
25.3000422436698 25.3000422436698 25.3000422436698 25.3000422436698 25.3000422436698 25.1941867483365 25.0150789969005 24.8359709508487 24.6570720585516 24.6570720585516 24.6570720585516 24.6570720585516 24.6570720585516 24.6570720585516 24.6570720585516 24.6570720585516 24.6570720585516 24.6570720585516 24.6570720585516 24.6861038279259 24.8119432446538 24.9387070985931 25.0663938884885 25.1467737955457 25.1996660501719 25.2516365640132 25.2973976492644 25.2472661139532 25.1980518163415 25.1497532553555
25.3000422436698 25.3000422436698 25.3000422436698 25.3000422436698 25.3000422436698 25.1924531309867 25.0133472276956 24.8342410298031 24.6570720585516 24.6570720585516 24.6570720585516 24.6570720585516 24.6570720585516 24.6570720585516 24.6570720585516 24.6570720585516 24.6570720585516 24.6570720585516 24.6570720585516 24.6755839759971 24.7528783464256 24.8310969135933 24.9102381765854 25.0046171910037 25.1060530755823 25.2065674590476 25.2939226452742 25.1952467620158 25.0974878778055 25.0006444919095
25.3000422436698 25.3000422436698 25.3000422436698 25.3000422436698 25.3000422436698 25.190719808553 25.0116157530925 24.8325114030452 24.6570720585516 24.6570720585516 24.6570720585516 24.6570720585516 24.6570720585516 24.6570720585516 24.6570720585516 24.6570720585516 24.6570720585516 24.6570720585516 24.6570720585516 24.6641383030905 24.6928886169296 24.7225628870535 24.7531596128873 24.8633820861906 25.013360611266 25.1624178748825 25.2895291099744 25.1423098682766 24.9960073869932 24.8506201657304
25.3000422436698 25.3000422436698 25.3000422436698 25.3000422436698 25.3000422436698 25.205667664283 25.0527066519954 24.8988078193873 24.7478301435793 24.7211372661322 24.695381010033 24.6705598752732 24.6674717552818 24.6904271474805 24.7124519185037 24.7335475684521 24.7352090997858 24.7335436028738 24.7318799038522 24.7302180027346 24.7285578995342 24.7268995942644 24.7252430869381 24.8188306439331 24.9607655891 25.104541646675 25.2254199089361 25.0646123812808 24.9028859578599 24.740242139342
25.3000422436698 25.3000422436698 25.3000422436698 25.3000422436698 25.3000422436698 25.2347659879723 25.1303465754329 25.0249895866193 24.9199297633469 24.8446969386506 24.7704004917173 24.6970389228782 24.6895333846613 24.7610296964095 24.8315956292075 24.9012326828161 24.9094865699808 24.9078213389585 24.9061579055396 24.9044962697375 24.9028364315658 24.9011783910377 24.899522148166 24.9284353810874 24.9732831953048 25.019971642937 25.0539818114693 24.9417190959804 24.8285377236394 24.7144391947757
25.3000422436698 25.3000422436698 25.3000422436698 25.3000422436698 25.3000422436698 25.2648037095795 25.2089249077518 25.1521087736768 25.0910933194618 24.9673215362826 24.8444858872987 24.7225848731819 24.7125271225229 24.8325633649838 24.9516694707022 25.0698469390983 25.0837640767187 25.0820991115807 25.0804359437592 25.0787745732677 25.0771150001194 25.0754572243276 25.0738012459057 25.0361976239605 24.9839602855678 24.9335631016316 24.8834620829828 24.8197431902879 24.7551058796382 24.6895516510223
25.3000422436698 25.3000422436698 25.3000422436698 25.3000422436698 25.3000422436698 25.295780589627 25.2884414097271 25.2801651415899 25.261321050619 25.0890112974684 24.9176374349641 24.7471979641174 24.7364527311871 24.9050279157773 25.072673205815 25.2393901003803 25.2580416199956 25.2563769207364 25.254714018507 25.2530529133207 25.2513936051906 25.2497360941301 25.248080380152 25.1421178423172 24.9927973291464 24.8453164915087 24.7138604893536 24.6986844303356 24.6825901922415 24.6655792747208
25.3000422436698 25.3000422436698 25.3000422436698 25.3000422436698 25.3000422436698 25.3000422436698 25.3000422436698 25.3000422436698 25.2905288257447 25.1515053465127 25.0115474296573 24.8706565744686 24.8446914108633 24.946084141947 25.0493388514294 25.1544525408986 25.2005034485614 25.2381377933302 25.2748445962757 25.2894591308208 25.2546029141367 25.2206697418451 25.1876581147568 25.076305363419 24.9316820353561 24.7861377772644 24.6570720585516 24.6570720585516 24.6570720585516 24.6570720585516
25.3000422436698 25.3000422436698 25.3000422436698 25.3000422436698 25.3000422436698 25.3000422436698 25.3000422436698 25.3000422436698 25.2929954768218 25.2025119514369 25.1110942316839 25.0187438165134 24.9725465802448 24.9768601087633 24.9830351310418 24.9910686493485 25.0701749205779 25.1563485120126 25.2415948030069 25.2741691949977 25.1907730085188 25.1082996260693 25.0267475488 24.9354993524201 24.8394182720468 24.7424165012364 24.6570720585516 24.6570720585516 24.6570720585516 24.6570720585516
25.3000422436698 25.3000422436698 25.3000422436698 25.3000422436698 25.3000422436698 25.3000422436698 25.3000422436698 25.3000422436698 25.2963978611808 25.2544533012565 25.2115747902021 25.1677638266282 25.0985385926135 25.0057748951511 24.9148722068458 24.8258275306457 24.9407738173622 25.0754856672648 25.2092704580924 25.2579547990539 25.126019631031 24.9950070266922 24.8649154875278 24.7956140646205 24.7480742433124 24.6996139711404 24.6570720585516 24.6570720585516 24.6570720585516 24.6570720585516
25.3000422436698 25.3000422436698 25.3000422436698 25.3000422436698 25.3000422436698 25.3000422436698 25.3000422436698 25.3000422436698 25.3000422436698 25.3000422436698 25.3000422436698 25.3000422436698 25.2091730527502 25.0300817139161 24.850990082809 24.671898159743 24.8213381720704 25.0004306781111 25.1795234751681 25.2421196699875 25.0644060752635 24.8857695770364 24.7062116741038 24.6574948519231 24.6576497145652 24.6577299526432 24.6570720585516 24.6570720585516 24.6570720585516 24.6570720585516
25.3000422436698 25.3000422436698 25.3000422436698 25.3000422436698 25.3000422436698 25.3000422436698 25.3000422436698 25.3000422436698 25.3000422436698 25.3000422436698 25.3000422436698 25.3000422436698 25.2074552992314 25.0283658055002 24.8492760195104 24.6701859415765 24.8230485450916 25.0021392059718 25.1812301578546 25.2567726036438 25.1275997051274 24.9975041434462 24.8664874170583 24.7955393978286 24.7459996658683 24.6973799056766 24.6570720585516 24.6570720585516 24.6570720585516 24.6570720585516
25.3000422436698 25.3000422436698 25.3000422436698 25.3000422436698 25.3000422436698 25.3000422436698 25.3000422436698 25.3000422436698 25.3000422436698 25.3000422436698 25.3000422436698 25.3000422436698 25.205737838285 25.0266501893428 24.8475622481564 24.6684740150397 24.8247586267963 25.0038474428308 25.1829365498533 25.2723498706658 25.1917166802373 25.1101610669656 25.0276845289681 24.9326639250095 24.834585898339 24.7374276039156 24.6570720585516 24.6570720585516 24.6570720585516 24.6570720585516
25.3000422436698 25.3000422436698 25.3000422436698 25.3000422436698 25.3000422436698 25.3000422436698 25.3000422436698 25.3000422436698 25.3000422436698 25.3000422436698 25.3000422436698 25.3000422436698 25.2040206698973 25.0249348654298 24.8458487687325 24.6667623801189 24.8264684171994 25.0055553887022 25.1846426511783 25.2888512352211 25.2567567650148 25.2237401122685 25.1898027747604 25.0688686682602 24.9222533344907 24.7765574934648 24.6570720585516 24.6570720585516 24.6570720585516 24.6570720585516
25.3000422436698 25.3000422436698 25.3000422436698 25.3000422436698 25.3000422436698 25.3000422436698 25.3000422436698 25.3000422436698 25.3000422436698 25.3000422436698 25.3000422436698 25.3000422436698 25.2133928195229 25.0539081413103 24.8934943365615 24.7321529028962 24.8768201132665 25.0366871669844 25.197480946094 25.3000422436698 25.3000422436698 25.3000422436698 25.3000422436698 25.1730760196572 25.0084033493606 24.842812643113 24.7042505026683 24.6892955156037 24.6752573728452 24.6621345768351
25.3000422436698 25.3000422436698 25.3000422436698 25.3000422436698 25.3000422436698 25.3000422436698 25.3000422436698 25.3000422436698 25.3000422436698 25.3000422436698 25.3000422436698 25.3000422436698 25.2388282390923 25.1278809925409 25.0160048615411 24.903201343372 25.005789259662 25.1171184470712 25.2293741185695 25.3000422436698 25.3000422436698 25.3000422436698 25.3000422436698 25.20959726619 25.0934638803567 24.9764126977826 24.86898095187 24.8054883337007 24.7429123210876 24.6812514168122
25.3000422436698 25.3000422436698 25.3000422436698 25.3000422436698 25.3000422436698 25.3000422436698 25.3000422436698 25.3000422436698 25.3000422436698 25.3000422436698 25.3000422436698 25.3000422436698 25.2651943235719 25.2027835213742 25.1394440767982 25.0751774867829 25.133831763457 25.1966240719244 25.2603426231968 25.3000422436698 25.3000422436698 25.3000422436698 25.3000422436698 25.2470382069312 25.1794431180764 25.1109304716732 25.0327950303582 24.9207657682974 24.8096528730601 24.6994548477673
25.3000422436698 25.3000422436698 25.3000422436698 25.3000422436698 25.3000422436698 25.3000422436698 25.3000422436698 25.3000422436698 25.3000422436698 25.3000422436698 25.3000422436698 25.3000422436698 25.2924908353932 25.2786154904951 25.2638117452707 25.2480810963193 25.2609478611962 25.2752042778363 25.2903866960147 25.3000422436698 25.3000422436698 25.3000422436698 25.3000422436698 25.2853986071137 25.2663408280051 25.2463657305232 25.1956929721153 25.0351280531235 24.875479262239 24.7167451029239
25.3000422436698 25.3000422436698 25.3000422436698 25.3000422436698 25.3000422436698 25.3000422436698 25.3000422436698 25.3000422436698 25.3000422436698 25.3000422436698 25.3000422436698 25.3000422436698 25.3000422436698 25.3000422436698 25.3000422436698 25.3000422436698 25.3000422436698 25.3000422436698 25.3000422436698 25.3000422436698 25.3000422436698 25.3000422436698 25.3000422436698 25.3000422436698 25.3000422436698 25.3000422436698 25.2602212689111 25.0811406204631 24.902059684254 24.722978460597
25.3000422436698 25.3000422436698 25.3000422436698 25.3000422436698 25.3000422436698 25.3000422436698 25.3000422436698 25.3000422436698 25.3000422436698 25.3000422436698 25.3000422436698 25.3000422436698 25.3000422436698 25.3000422436698 25.3000422436698 25.3000422436698 25.3000422436698 25.3000422436698 25.3000422436698 25.3000422436698 25.3000422436698 25.3000422436698 25.3000422436698 25.3000422436698 25.3000422436698 25.3000422436698 25.2585316531295 25.0794528474701 24.9003737540634 24.7212943732229
25.3000422436698 25.3000422436698 25.3000422436698 25.3000422436698 25.3000422436698 25.3000422436698 25.3000422436698 25.3000422436698 25.3000422436698 25.3000422436698 25.3000422436698 25.3000422436698 25.3000422436698 25.3000422436698 25.3000422436698 25.3000422436698 25.3000422436698 25.3000422436698 25.3000422436698 25.3000422436698 25.3000422436698 25.3000422436698 25.3000422436698 25.3000422436698 25.3000422436698 25.3000422436698 25.2568423254098 25.0777653622248 24.8986881113065 24.7196105729684
25.3000422436698 25.3000422436698 25.3000422436698 25.3000422436698 25.3000422436698 25.3000422436698 25.3000422436698 25.3000422436698 25.3000422436698 25.3000422436698 25.3000422436698 25.3000422436698 25.3000422436698 25.3000422436698 25.3000422436698 25.3000301441946 25.299960767477 25.3000422436698 25.3000422436698 25.3000422436698 25.3000422436698 25.3000422436698 25.3000422436698 25.3000422436698 25.3000422436698 25.3000422436698 25.2551532857377 25.0760781647133 24.8970027559693 24.7179270598194
25.3000422436698 25.3000422436698 25.3000422436698 25.3000422436698 25.3000422436698 25.3000422436698 25.3000422436698 25.3000422436698 25.3000422436698 25.3000422436698 25.3000422436698 25.3000422436698 25.3000422436698 25.3000422436698 25.3000422436698 25.2984796277442 25.2498774247196 25.2022000108407 25.1554458908369 25.1304539108136 25.1321089793681 25.1337622554438 25.1354137390278 25.1370634301064 25.1387113286669 25.1403574346954 25.1068727254532 24.9728812960313 24.8379740687006 24.7021525392425
