2.949032791345409521e-01 1.340595866989271589e-03 1.165151626819042104e-03 1.469386521484030480e-03 3.579800118148765975e-01 2.406795621348854948e-03 2.356479499041348041e-03 6.300513249150205448e-03 1.135165726272268846e-02 5.085590070256933160e-03 2.361368185218739625e-03 1.838247414090644627e-01 1.085668934796214236e-01 1.123701038035783244e-03 1.277336079781254312e-03 1.098740159665857197e-01 9.564674943625549233e-04 1.659081936685503867e-03 1.493171085351837095e-03 5.203904138949957741e-04 2.061098397388439751e-01 2.967534655992580192e-02 2.286266958145702355e-02 9.023039106016356170e-02 1.731606624577165521e-01 1.347293023758063257e-01 6.191898371029311288e-02 5.429225371530786368e-03 5.113333468081715169e-03 6.341170630502686659e-03
2.254932274635651768e-01 1.563829832610847109e-03 2.816768261107611103e-03 2.283549752295244498e-03 1.585376930437240595e-03 7.054541938053337374e-03 3.322727409840316344e-03 4.083126556875646580e-03 2.627655989405128581e-03 2.242416880650664052e-03 1.607118611232917840e-03 1.100539282642760963e-01 1.484644063042299678e-01 9.161671185798131358e-04 1.238415678858275238e-03 7.738364427482054709e-04 9.393925726223557220e-04 3.017634996903913527e-03 2.243491309043109047e-03 6.631724855431608660e-04 1.235868371714896885e-01 2.751378981758519082e-02 5.731916317454548160e-02 5.036209229573176266e-02 4.395255375078643834e-02 5.843787189142603256e-02 2.065938789433875711e-02 5.330753829965919482e-03 7.562854453920016956e-03 7.546082093083771557e-03
8.865198626274817945e-03 8.585274880073684445e-03 1.817919508265575940e-02 1.466527465195005195e-02 3.136403261552220267e-02 3.178700063379284475e-03 1.890862026576707877e-01 2.001394003496136387e-01 9.783324398028061392e-03 3.017412258992173760e-03 8.222514418696844768e-03 5.484773995806245701e-03 1.989145421066212602e-03 2.824880130289270357e-03 2.079051503566549663e-01 2.107509118435982407e-03 1.375222523251732037e-03 2.746966519374778419e-03 8.919856130330226091e-03 1.442564765846738369e-03 7.693199044483528537e-02 2.214538440602836777e-02 3.354535841228945686e-02 1.167671713312026099e-02 6.944445056139450338e-03 4.602544736986313202e-03 4.103955860118807183e-03 3.248283519004998079e-03 5.513412567928999489e-03 6.234116474901652341e-03
4.098754869831411352e-03 1.117550907567061748e-02 2.456154115110004837e-02 1.968268692956023913e-02 8.161703373628171124e-03 1.254967012367633455e-03 3.208431294911581189e-01 2.133955212916116007e-01 1.285012381285085270e-01 3.707057643522988083e-03 2.420080544140776509e-03 4.879272254349070921e-03 2.188331144082951256e-03 1.413156717936499577e-03 1.542614067565470093e-01 1.182649938806912271e-01 2.535802719438696728e-01 1.063891100718419034e-03 7.374569365281269081e-04 6.116656177090490105e-04 1.475646397118035025e-01 5.040659387545663728e-02 1.568909408400824546e-02 3.018842108784551212e-02 5.620868642018756953e-03 4.141706662454597461e-03 3.548925275239994508e-03 3.358318018966593814e-03 6.697095645364714925e-03 7.373054799863927242e-03
2.367050799975351904e-03 7.020972816352426954e-03 1.954839014335799791e-02 7.570698960462448994e-03 4.373937625681589489e-03 2.061625608934264109e-01 3.128669685394807054e-01 1.725691232974433664e-01 7.844540198400487552e-02 8.478429291742072341e-03 1.080604714202577747e-02 9.443677123548623736e-03 1.385777689996746951e-03 1.101003887991556509e-03 1.825944406318815438e-01 6.791599879457756173e-02 1.776303310187678621e-03 9.943886944478251121e-04 1.568757782663529523e-03 8.736838772608007762e-04 5.784235131302010915e-04 8.355619526139781983e-02 1.849984244659723664e-01 5.057930742042753003e-02 1.012752598007119961e-02 5.531351061182630466e-03 3.844365302209694531e-03 4.456090793001693182e-03 6.857298706406800629e-03 2.561996085320844552e-02
2.358739739140880767e-03 2.383023145916683856e-03 1.066283813575575126e-02 8.522047817068903464e-03 3.387461967624947647e-03 1.193049783113560858e-01 1.425654824655515074e-01 1.502088771750556828e-01 1.367357949854924593e-01 1.300738801337087899e-02 1.044437255880354895e-02 5.666240803214177800e-03 2.024481250114199549e-01 6.168433298355308070e-02 4.693140899363384272e-02 7.651309316782552161e-02 9.963880109094935388e-04 1.065115884025536475e-01 8.098667992340800826e-04 2.722176476322528925e-03 3.195239637226920427e-03 1.816235613570916108e-03 4.292240460074848996e-04 3.043432017034412157e-02 1.518710589350734733e-02 1.453624742966646080e-02 9.068890356506527015e-03 6.272732785245713552e-03 8.130142880589616775e-03 1.492048912494457584e-02
1.055820517391717339e-01 1.695407444132380204e-01 1.789185322344017948e-01 2.710093785421482417e-03 1.294839909204578915e-03 2.123299232391933754e-03 3.163025701085009356e-03 1.773631263050134965e-03 2.069777929969475634e-03 2.491148622442393955e-03 1.975957257223162448e-03 2.519504033163514345e-01 1.042887852896589584e-01 4.070734826991803668e-02 2.138366298775273150e-02 3.792360567217756273e-02 2.242970205851118060e-01 1.066969424350580342e-01 1.332422289170656377e-03 1.782244876719226833e-03 7.925494981785483582e-04 8.794337491589118705e-02 3.506805400225913860e-02 2.760313035578840918e-02 1.039190780895142205e-02 1.085953736548445417e-02 9.538467646339539308e-03 8.321914119888335071e-03 9.519732625746710891e-03 2.308680810790181628e-02
2.250474299234808129e-01 1.344079171226302428e-03 2.438361729168455061e-01 1.659400488023350141e-03 2.511698498356163337e-03 2.766374108418285897e-03 2.396042707136791100e-03 2.210460549191650952e-03 1.739117347887157109e-03 3.230705337447012937e-01 1.300501552587063625e-01 1.317040475032574699e-03 8.586099448178177718e-02 2.845933580357146164e-02 2.902223771937163105e-02 5.336682273680799782e-02 1.207619330064430485e-03 1.902121040339630831e-03 1.646587580998541082e-03 1.147555659300073926e-03 1.302046718877687970e-01 6.224716186407793644e-02 2.120151461034230217e-02 1.662961385709881001e-02 7.920363168738689397e-03 8.414156208826625155e-03 1.306805382126213950e-02 1.654909042252949644e-02 1.664608893159874245e-02 4.964083116821602082e-02
2.036640635864438512e-03 1.323868726162575997e-03 2.254108663382627942e-01 4.352872130280014892e-03 2.772415765300159478e-03 3.547991431311240396e-01 3.596539593400651259e-03 1.568636428143726407e-03 1.281899448796323861e-03 1.296938605076940025e-03 1.183245511750942707e-03 1.591042270290418496e-03 3.472741544016161655e-03 2.213157013778690747e-03 1.051627407255296826e-01 9.567884322421753296e-02 1.208216404507732019e-03 3.612721846176615050e-03 3.512966451783441132e-03 2.237449978775003512e-01 3.587554059128145179e-02 2.794169643375719880e-02 2.649250294989429627e-02 1.633525820722638022e-02 9.530086358164709809e-03 1.477273647775323093e-02 5.577032205200353754e-02 1.131933018320539774e-01 5.939815694517300640e-04 1.646212701742970075e-01
3.467787529288148419e-03 2.247805782199065790e-03 3.547013026164298061e-03 3.238150529909579727e-03 2.768528074926932848e-03 1.631259967374560360e-01 2.394262155495931535e-03 3.227273524511409253e-01 1.357663219717120395e-01 5.078051718479896504e-02 2.261279980526238048e-03 2.226434366850650777e-03 4.724681110647995647e-03 5.075119040420492805e-03 2.399826092765298350e-03 2.586773085427191039e-03 1.364680666849395554e-02 1.394671026790197249e-02 5.528586556093487495e-03 2.414713804992366791e-03 4.510926927367639450e-02 2.146119552865796004e-02 2.192100049782563093e-02 2.302697675785731618e-02 1.262741944798126750e-02 1.634142255826907461e-02 1.543169740134242018e-01 4.828022893368911464e-04 6.369730455703492399e-04 8.842674147954850128e-02
2.875702694296433659e-03 1.496159867664851153e-03 3.310316865566970308e-03 2.775099840941043852e-03 3.450308826081386476e-03 9.496952403363599637e-02 7.993480056145357837e-02 6.965903788162525201e-02 4.372113853212299811e-02 1.137961058508616622e-03 1.793656344987697854e-02 2.994000520917292421e-02 6.208047769989366582e-02 3.082224680766076225e-02 5.720876494090951919e-03 1.115756030551707731e-02 2.051701090733661081e-02 5.625129503417928417e-03 1.331872057127725297e-03 9.254154392083782654e-02 3.154983820298926794e-02 2.186242521747523010e-02 2.575489815828395368e-02 3.498379384439954248e-02 3.685274650886544157e-02 1.990815777081576116e-02 3.144171824600867915e-02 2.522915521485769030e-02 2.261811122810699487e-02 1.621693008242909226e-02
1.504426434599484830e-01 8.836651199290254666e-02 2.671217038919138781e-03 2.598245325406815971e-03 2.000588869806407648e-03 1.387916690056127944e-01 5.412075683523160513e-02 3.479648080193015192e-02 4.307662764511967918e-02 2.247829346675039169e-03 5.429640522035815951e-03 3.519027525148706731e-02 6.328471874033166078e-02 3.339029851711720898e-02 1.228735866043709560e-02 1.401017293858049240e-02 1.544464511932411299e-02 9.108764361180431146e-03 2.241383094011916745e-03 2.026116539914842862e-01 2.984828536716451625e-02 2.632466753524703024e-02 2.954451193734556474e-02 5.218616622418872919e-02 4.959634777680269058e-02 3.513740779099850525e-02 2.674571106549279015e-02 2.400406076069941386e-02 2.537679453998567536e-02 2.682506612594619949e-02
2.870368119432282344e-02 7.416126723637032903e-02 1.817009825489500630e-01 1.729171942302355335e-03 3.403364836367388513e-01 1.084485458920890488e-01 5.563812267152818541e-02 4.658701481843121467e-02 5.878150540694403181e-02 1.133454526224182170e-03 1.351039888583545900e-01 1.117612973011003485e-02 4.701885884523261672e-02 2.058146369221352384e-02 6.634514578014859276e-03 7.834178625219782865e-03 2.910226644193200651e-03 4.288022753858713142e-03 4.903598856153963161e-03 1.830533516705430252e-03 3.652616851021192601e-02 3.258842349765916219e-02 3.900922786164250089e-02 6.663222771725474392e-02 8.706097579932579877e-02 8.158002916703666063e-02 6.014334864773294986e-02 5.382658982470432674e-02 4.024677709907203971e-02 3.046280130263515767e-02
2.252083451634923419e-02 6.500960115372435288e-02 1.201934357002600040e-01 8.856077048959548614e-02 5.287246198277360809e-02 2.103220153739240872e-01 2.172543052805392741e-03 1.783824244250179153e-03 8.618064323147943406e-02 2.607009319064661906e-02 1.026756128551512409e-01 1.799089389950016748e-03 2.125322541870527937e-02 2.967669040234340028e-02 3.270389530940469303e-02 4.548349121540631868e-02 4.140087157221471192e-02 2.702906318179762457e-02 7.422260640801919829e-02 3.473383389424061773e-02 2.847074150810268139e-03 2.307341526123298792e-01 1.729032154272436284e-01 1.493138428642126325e-03 3.437606210966530004e-03 3.174470396680467536e-03 8.536946997655290095e-03 2.657764172775652252e-03 6.576032910319287716e-02 6.226995594726462968e-02
2.038069936048973393e-02 2.060441166455576414e-02 5.767773273112370563e-02 1.378420860879046861e-03 1.599673967579641753e-01 3.781191804309694954e-02 1.449093274344694137e-03 4.100856783081062613e-03 2.711646382870726291e-03 1.051346160523164430e-01 2.218120810812450605e-01 8.979262327610655625e-03 1.899290113124797383e-02 2.472709033399903000e-02 2.294301211123656037e-02 2.845721788517212997e-02 4.932665710531106140e-02 8.641257516139419503e-02 8.938968616940963507e-02 7.148437702927400161e-02 3.045744585176210842e-03 3.162116238773825770e-03 2.758344457788932010e-03 8.573257058678380657e-03 1.217314333938921550e-02 6.135449438297609082e-02 6.037397658709792170e-02 1.171038538229601973e-02 7.655447878922652660e-02 4.520245384295201729e-02
1.798798088689353147e-02 1.977330836950136339e-02 4.607642907328572679e-02 5.161009755085115697e-02 3.455152196357998834e-02 3.952933434681152325e-02 2.806435359209581426e-01 2.207395296145053809e-03 4.534102761437213552e-03 1.603061993752370566e-03 1.629869749843175768e-03 1.382894332840970027e-03 1.069748347420863832e-02 2.215851686407835364e-02 2.115276557663511164e-02 3.305173923931727098e-02 5.827997439614240882e-02 7.239417086150957970e-02 4.297342677984126308e-02 9.578142087737769733e-03 5.714969341699602072e-03 3.885204622393711310e-02 5.563251842698098415e-02 9.236307854988451416e-02 8.551900370090317893e-02 1.094221489718995854e-01 8.637616866537631277e-02 2.413446486260594631e-02 1.196444629930296655e-01 5.353687058807539423e-02
2.197120273665723045e-02 2.572157598192537781e-02 2.588698828741380076e-02 2.505904008965579438e-02 3.871758503396739021e-02 8.100362640984024032e-02 1.288931475312171324e-02 4.291759665537384083e-02 2.088288241943440926e-02 3.527145130329397207e-03 2.573260519982883097e-03 3.896243945732563198e-03 7.640429358156369810e-03 1.143493163597517244e-02 1.528933607975489078e-02 2.772669516391291708e-02 6.134362959467998255e-02 6.411333809270988726e-02 3.154502762712869945e-02 1.108802824728463005e-02 4.710619377154148801e-02 8.387111285419013296e-02 1.057045939683063374e-01 1.073122962927665069e-01 9.313436798827602614e-02 7.895851541019731357e-02 1.144916174996964409e-01 1.975035263738410263e-02 1.773134936547318963e-01 7.514106960577537908e-02
5.279542998473592957e-02 4.204360889058680884e-02 2.243156739937141736e-02 3.592931826805135370e-02 1.233045424296994128e-03 6.211557298300239907e-03 3.468097646913308185e-02 2.820968481220472238e-02 2.772002837048578860e-02 1.376168549703810605e-02 4.966333508730030183e-03 1.300682973378182146e-03 1.259068458767534718e-03 3.266883460527882262e-03 7.380679955122834354e-03 3.401766014594546916e-02 3.708621459400401194e-02 4.540280003964906191e-02 8.251032502946384350e-03 1.491283487010797854e-02 5.191452144963642351e-02 1.101461518313745780e-01 1.337118828055127440e-01 1.369057789434607597e-01 1.112491054067759610e-01 1.044563715077325705e-01 9.453368419126728650e-02 7.493265691079298296e-02 3.323677338900008892e-03 2.189593078972708242e-03
2.344067256640954694e-02 6.579773813855854803e-02 1.247389992484237153e-01 2.225180989329002181e-03 4.854711800163695121e-03 6.838519387368307070e-03 2.161788935100746045e-02 2.691357113407585877e-02 1.848298607743709132e-02 1.430283984635266799e-02 2.975667357555421451e-03 1.360202047702990247e-01 2.029169171526825632e-01 1.218807276868689787e-03 2.631037762479778233e-03 1.543737562500311668e-02 6.111125425122064525e-03 2.046703627299533042e-03 2.170072696534240675e-01 5.277867237541429557e-03 1.970222892328673397e-02 1.030953785893600483e-01 1.286417455943441868e-01 1.335674258317082475e-01 9.649883790800768690e-02 4.382763968254115017e-02 6.943261416540928710e-02 4.765766350834634013e-02 4.297422698199730197e-03 1.696410255264654658e-03
1.562074804546726868e-03 1.990027250574858721e-03 1.314785083960805061e-03 1.607336019280242992e-03 3.731668881718570169e-03 2.130191958991509062e-03 1.098322924388402469e-02 1.414690526331153879e-02 1.307797501713275218e-02 3.084548719043652635e-03 7.739185596774141810e-04 8.124025349060473578e-02 1.381054035872956998e-01 8.287381704943368350e-04 3.247086454002829411e-03 2.156217773550636509e-03 4.081791532013705204e-03 1.256212322452453668e-03 2.441548598830924066e-03 1.172668556896677358e-02 6.213948955127621132e-02 1.162988667789585651e-01 1.237732759835954016e-01 1.172558490130641146e-01 8.940007000408888016e-02 6.470564826516249368e-02 6.182358326067174947e-02 4.165606233101021988e-02 3.750519694817940931e-03 3.524057443137018630e-01
4.224991099222989190e-03 3.823494042841130147e-03 1.947772251497764196e-03 1.382218336685551562e-03 1.768300531487544507e-03 9.427929076621224596e-04 5.367288998276004836e-03 4.775725768094938109e-03 1.314372532188212402e-03 7.240041368844097203e-04 1.367880933241050478e-01 1.074353970140342479e-01 6.227100549513257810e-02 3.290692541604869903e-02 8.155253898683684222e-02 2.622946972604633942e-01 2.157049862214652398e-03 5.099592411117866327e-03 5.075696080781571737e-03 2.305562546037068228e-02 6.248261417441161591e-02 9.029879113273668600e-02 3.671547730989968561e-02 5.520199496000520456e-02 7.117602649165899464e-02 4.011048339797877033e-02 2.974085638812452165e-02 2.442760907709825083e-02 2.285732768507582890e-01 2.083326292863364182e-01
3.380490800556528938e-03 3.842679748477451779e-03 2.648562646565696954e-01 1.956962813657799616e-01 1.722854171885584429e-01 4.549767732555242837e-04 6.481993424523119695e-04 9.842204538209090026e-02 1.295786016022067721e-01 2.013722365988823704e-02 2.621728258584945029e-02 3.959253648384517682e-02 4.277190642134776760e-02 1.465984937707496827e-01 8.192534865527054989e-04 1.051781473036973377e-02 2.065206334414898537e-02 3.084184856668459665e-02 2.170658938338269200e-02 1.667178651984114676e-02 1.181228935129410330e-02 4.240187033459947782e-03 1.645329298746020606e-03 3.562987911195158054e-03 1.295815065915501690e-02 4.394870077233399737e-03 4.060751523348378987e-03 3.422296670333822566e-01 3.921301256145205694e-02 3.206900369027469722e-02
7.243412243625999870e-03 5.519655205991337750e-03 5.884021261654682859e-04 1.264002810549821332e-01 1.959507459813423225e-01 1.574301662560421700e-01 4.223945550857406998e-04 2.708069800507852815e-02 2.314423075013916781e-02 9.961507619391860371e-03 2.348589376022068922e-02 4.416809943092424307e-02 5.764832960850309329e-02 5.939353788785466711e-04 9.877147391041144961e-04 6.219787573118926507e-03 2.323614838881414568e-02 4.456519445718762351e-02 5.192593676727147445e-02 4.606872023690725820e-02 9.872707855823285167e-03 2.216417070106642320e-03 2.755812928264286896e-03 6.754991256227935691e-03 1.508812759855281821e-02 4.462202505298999006e-03 4.225304449110842686e-01 1.634315231419061487e-01 5.145756632834763006e-02 4.615658351565404133e-02
9.078210895224257324e-03 1.144504297031085673e-03 1.493307545010724713e-01 5.084014957908827848e-02 6.023685017146239440e-02 1.351599355278974013e-01 1.778306227810612095e-01 2.028918028814492500e-02 1.134183638848616782e-02 1.301817312048893227e-02 2.291074214682686447e-02 3.888739599392274093e-02 4.335115656378382698e-02 2.340383095430727256e-01 1.835598258954800228e-03 9.037743113412884111e-03 1.785323279828517073e-02 4.207077605441311013e-02 5.403724152675742909e-02 4.659268583047289358e-02 2.350002573134281000e-02 1.365953099402534643e-03 2.903957524380124111e-01 2.109232020852828526e-03 1.215990535850964074e-02 7.293429598243496119e-03 6.593711323863899604e-03 3.031944200788460608e-01 4.629903488703596137e-02 3.546053186807845287e-02
5.047937508982809629e-03 1.553467639711579064e-03 5.987169634141462082e-04 5.464874930683541725e-04 1.173817074162316655e-03 7.908711819932430238e-04 1.875043011083940281e-01 7.834013662231675834e-02 1.190085408176383419e-01 1.537730738149436782e-01 1.421012060017135675e-02 1.590498513964848024e-02 2.450358168703188969e-02 5.452681593407576743e-02 6.655746582362751049e-04 2.809647327484620771e-03 2.899958303546129428e-03 1.267072270203243971e-02 1.655627066440112580e-02 1.448672880553615247e-02 1.233496908605006062e-02 1.609443271128315010e-03 7.543378206481907156e-02 1.429258345551199516e-01 2.152553086409570229e-03 5.377339027359491486e-03 1.447308665310251610e-02 8.150971662675693744e-03 5.523770376662023862e-02 4.153091904105611631e-02
1.807699698923914688e-03 7.131054893466916506e-04 7.554423031146488814e-04 1.248659044223293917e-03 6.589710759890171111e-04 1.631367193658453119e-01 7.659862152234339638e-02 5.493339337824130336e-02 1.764209814028686596e-01 1.124800411847971327e-03 4.568337977368247538e-02 1.563406495313750255e-02 2.615453594578182744e-02 5.648053727504490085e-02 2.635054402496053716e-01 1.007814547218214857e-03 7.158724942592546107e-04 1.504109933539415078e-01 2.317958405722183590e-01 1.096547898608543278e-03 1.987287448159480788e-03 1.527586586494724119e-01 7.599336613519433459e-02 3.832833990394457491e-01 3.028764998540039478e-03 3.092019142929391951e-01 3.721917491428732711e-03 4.170070620890226065e-03 1.479647592250343986e-03 6.379916475491327621e-02
1.832773315752800423e-03 1.462885521748394195e-03 7.068496581726069726e-04 2.573643761747595460e-01 2.468663565683537064e-01 9.486733813706951790e-02 6.398613670937855491e-02 6.691347545657647111e-02 7.493353067249768074e-02 4.925171837628511146e-04 8.288972200093097653e-02 7.806287136134251736e-02 7.289167246516801979e-02 8.945257224211122793e-02 2.553455561963422493e-01 1.763197669153007408e-01 1.209464389786618355e-01 7.331625508602081231e-02 6.524776156666858840e-02 5.014442513791812078e-02 3.953008357973653020e-02 5.723105026815238083e-02 9.028044265205059649e-02 2.246473569707468920e-01 3.931856265581674670e-01 1.878074833607873417e-01 2.991264006055377456e-01 1.915806508252445028e-01 1.918902830406233884e-01 1.232093469379814954e-01
2.483045788887602943e-03 1.287918927758394290e-03 7.264278172083438309e-04 9.747541052253783089e-04 8.272647886933201522e-04 2.484189326104293549e-01 1.499186490862189445e-03 1.120970224033516777e-03 1.008497049131703849e-01 7.250761317825027419e-02 2.559821122666484233e-02 5.821680958927340221e-02 1.710191318255083193e-01 1.873830395311587849e-01 1.183337879054822874e-03 9.351972567744442884e-04 1.380900562199228743e-01 1.664978369742707298e-01 7.799255478399963470e-02 3.408113338152610888e-02 3.080705133878687205e-02 4.680278768183938204e-02 7.244365143410375074e-02 2.287733531342117932e-01 2.380202189100993349e-01 5.759950977973685160e-02 6.448613191542605649e-02 8.158123380448192852e-02 2.596031235004765403e-01 5.394176216749294039e-02
3.333239700620795748e-03 2.869052714770572998e-03 8.621432841208526068e-04 2.896010162347640617e-03 3.244595318236637854e-03 6.031517328481578871e-03 4.023836533757905315e-03 2.708099660440138057e-01 9.940880405037277878e-02 5.695607076694016169e-02 1.666137935693702901e-02 2.062745899981484332e-02 2.561687686470877010e-02 1.025755343851144641e-01 1.289098396579424488e-01 5.826786488664786878e-02 5.808787485772055892e-02 7.076137133244737865e-02 9.741244436323817646e-02 5.345960443795382683e-02 2.899477466795268715e-02 3.925865798328476153e-02 4.397762966330969608e-02 7.644143635405638293e-02 2.478226275545015178e-01 3.994880923717885474e-02 5.858142933724413970e-02 9.539680513428272501e-02 1.117639653364599361e-01 2.271700672641881469e-01
1.824740900091194329e-03 4.512965088686124275e-03 1.328177505161464139e-03 1.390900617022279226e-03 6.505465255140442833e-03 6.761539944369242966e-03 4.465279815175936251e-03 1.846139288315182814e-01 1.322458114797499806e-01 1.243023229401784419e-01 5.080842673585291014e-02 2.504350095749017374e-02 1.614736095006534186e-02 2.873675732133315619e-02 1.402080526977693697e-01 4.164182004127786607e-02 1.509666706448196671e-01 2.426021848538036270e-03 4.604170602417165074e-03 2.236355753166845151e-01 4.367128203217504612e-02 5.510601107545297361e-02 4.674119185104358420e-02 5.320343334261597168e-02 7.319318997237339586e-02 5.765258666123020126e-02 6.895685624930825153e-02 8.512315088662630869e-02 1.112190809462514085e-01 2.791292154343005261e-01
