2.322878552114027162e-02 3.443153915841899032e-02 3.017620123169151292e-02 3.831052832332768054e-02 2.931826070988513555e-02 6.464095902253801096e-02 6.448227232597644742e-02 1.755112232992714905e-01 3.195907620127032001e-01 1.433896522449100430e-01 6.612295015733102299e-02 1.506723722831600047e-02 8.849828630168631374e-03 3.298464859907228319e-02 3.823189096396250458e-02 8.339382405642808624e-03 2.919514201224106265e-02 5.092136905080214826e-02 4.584000451401861603e-02 1.603461350915745889e-02 1.359930556709013603e-02 5.964345736962317623e-02 4.689084764143874873e-02 6.664308899982961283e-03 1.164954151645006784e-02 9.249072986568960750e-03 1.285637673214844456e-01 1.164449823277844027e-02 1.113659328673492592e-02 1.401459048741604541e-02
1.842591940740269732e-02 4.135414289921385267e-02 7.445893260318969809e-02 6.118006712008752096e-02 4.274510830062969169e-02 1.915528797257613769e-01 9.105149814336462033e-02 1.157478864905073374e-01 7.577462593455820683e-02 6.453651014398070762e-02 4.524535884782652367e-02 8.822262063920633529e-03 1.173862906708806469e-02 2.680769629755676287e-02 3.743651975939853160e-02 2.389608667123637245e-02 2.939062180501988975e-02 9.577081598269554519e-02 7.180657259553702154e-02 2.142524412295483682e-02 8.047814299135999314e-03 5.669671693404908230e-02 1.219878899584518617e-01 1.049501133832832500e-01 9.020404949300167563e-02 1.229930262029384769e-01 4.486807963408354777e-02 1.180390756199723064e-02 1.682567567643329307e-02 1.682384296178912955e-02
2.250835262553092520e-01 2.336426644579354672e-01 4.944495159197014322e-01 4.030766398842022258e-01 8.531963375549508344e-01 8.668464469346784385e-02 1.605511856617491961e-02 1.731189950229637675e-02 2.791791874761507253e-01 8.475991839096130853e-02 2.257339557988006229e-01 1.498844042977976188e-01 5.525216941610250343e-02 8.077366568173070804e-02 1.549602874940789882e-02 6.501385853749644395e-02 4.346696317244641561e-02 8.848719257729191490e-02 2.923841954508621388e-01 4.819239514306672412e-02 4.990496220681120594e-03 4.698335574044214258e-02 7.529769761159010866e-02 2.604169625124728993e-02 1.538669444078311771e-02 1.022579657891855252e-02 9.266176465574519142e-03 7.294447265936136737e-03 1.244123670735323636e-02 1.394118344287830630e-02
1.051804948377619148e-01 3.068280001958910708e-01 6.742451851675552721e-01 5.454806075979555802e-01 2.215149614134364064e-01 3.415519882698447862e-02 2.696380596524413503e-02 1.865106947444702609e-02 1.151213869046163914e-02 1.072749432629988287e-01 6.735176483721234952e-02 1.326388997577480355e-01 6.004903711610946881e-02 3.990164540157493250e-02 1.239029104023686711e-02 9.501626444654845058e-03 1.983151362116109678e-02 3.452475916818575907e-02 2.422285674136377340e-02 2.047814613110209708e-02 9.681136135224178985e-03 9.637270887984021595e-02 3.307358778260513499e-02 6.501235108952040098e-02 1.255521569875213059e-02 9.082094068917221513e-03 7.856894305413647181e-03 7.457339971647603850e-03 1.514121288236047400e-02 1.645184517026431967e-02
6.072343792769490517e-02 1.912938345308378418e-01 5.348041905666649498e-01 2.072003340290434759e-01 1.169247984794337669e-01 1.704752252905427506e-02 2.626811627936566709e-02 1.506510854067552412e-02 7.264911243368595006e-02 2.455022752099202121e-01 3.013329082775380585e-01 2.511962126667663386e-01 4.010733011487307986e-02 3.724442025136950885e-02 1.968538073038016492e-02 8.702119996526826162e-02 6.529958524063775305e-02 3.193108501303897756e-02 5.089987992916020915e-02 2.907834530806719525e-02 2.052662859106702681e-02 5.692033140910550577e-03 1.379331104484321675e-02 1.030403091924184111e-01 2.265883158820099566e-02 1.213895696605464536e-02 8.442170096358038445e-03 9.775972742456298659e-03 1.530690594720296276e-02 5.635467588550211598e-02
6.602057091213785200e-02 6.894061847325845538e-02 2.872851289402413855e-01 2.301718772367991606e-01 9.051501824858397549e-02 9.769998785882475639e-03 1.206299265863421295e-02 1.335121680729442310e-02 1.278922376560407900e-02 3.816644442914183255e-01 2.908320867648824803e-01 1.600927782024821611e-01 2.242077141140397245e-02 6.930463011188076061e-02 5.862436098681491486e-02 1.001674982751461912e-01 3.883273168621978466e-02 8.206179960355525216e-03 2.642728434706880652e-02 9.100850071224332594e-02 1.091738077674081209e-01 6.573716659728734424e-02 1.844766873831411164e-02 6.113353127985769742e-02 3.386015274685013482e-02 3.176876927037617510e-02 1.976558919653633936e-02 1.365859752967466326e-02 1.805991237851096998e-02 3.254753337469065699e-02
1.028413252450116333e-01 1.450728051981897866e-02 1.414585699324139197e-02 7.173721001310169598e-02 3.437296768813316583e-02 5.765447530763284645e-02 8.899317019928998374e-02 5.165250794184602506e-02 6.289021166974394228e-02 7.173379646122603204e-02 5.418028480819035014e-02 2.462379292089855037e-02 1.061658620911203055e-01 5.066411003903494720e-02 2.987998282056473706e-02 5.139654382273138589e-02 2.244180532620792395e-02 8.530161188580378390e-03 4.348522440919554144e-02 5.949114227944006517e-02 3.077634269930918862e-02 8.148888223439433587e-03 6.114558069608062169e-02 5.741776615146759050e-02 2.310103121161049752e-02 2.363288866345674213e-02 2.067856419958934849e-02 1.788362644437105353e-02 2.052170156499173725e-02 4.896869831252211730e-02
1.952853102796262702e-02 3.570485973334705521e-02 1.922735048334973940e-02 4.149072146457959132e-02 6.400125339127471502e-02 7.304712511858522939e-02 6.605504770671596915e-02 6.362491933287915680e-02 5.176649535942125235e-02 2.836840271302316571e-02 1.119997616923778215e-02 3.929288255738076080e-02 9.030634889308232494e-02 3.330567507342361427e-02 3.787156929977838343e-02 6.919582923739882319e-02 4.220101106940473551e-02 5.758365132845916223e-02 5.063799927224649916e-02 3.734501156446275866e-02 1.307434372435943917e-02 1.085104228705254803e-01 4.404761734025070680e-02 3.712270031362002037e-02 1.760776608547340652e-02 1.806498931789364548e-02 2.676810682333853608e-02 3.090434133849056381e-02 3.006406442359111503e-02 8.957037299370647354e-02
4.776275081894741648e-02 3.148149960668293612e-02 1.836914178136441270e-02 1.065600929743315550e-01 6.901820144145950908e-02 2.964080276350748028e-02 9.701124064313393358e-02 4.448461376145709800e-02 3.795400084321170348e-02 3.668209596794783089e-02 3.218601792830722008e-02 4.405708877921008654e-02 9.831408047736737987e-02 7.089465203936719251e-02 1.215344615480668661e-01 1.024200536670299422e-01 3.769282250634510556e-02 1.053148023730075822e-01 1.039680356999153898e-01 1.910193643966666410e-02 4.903456447343783331e-02 5.108536073442549591e-02 5.595264780700121010e-02 3.659187439498647748e-02 2.132628915380535214e-02 2.956094841738734352e-02 1.021055545961106481e-01 8.057033468317990194e-03 2.430257577276130967e-02 1.238442157414993555e-02
8.095184191691900955e-02 5.320350235105269360e-02 8.368106115094234299e-02 7.830366148514095181e-02 7.158650473285740889e-02 1.568617198489053247e-02 8.077028277603809370e-02 3.467549891354246294e-02 1.365731656081434382e-02 5.420364973913827794e-02 6.232435193299447340e-02 5.996685118599923148e-02 1.259337190855825683e-01 1.413575679307480237e-01 6.846798853932710427e-02 7.437624209333432157e-02 3.827166742125006627e-01 3.888818884673394538e-01 1.618110666278254062e-01 8.372252092364448894e-02 6.319798336627011071e-02 4.005266263787120307e-02 4.581986334185623316e-02 5.030913693653411844e-02 2.796147751892839525e-02 3.333262362008283103e-02 1.443228432439319989e-02 2.182843674525444116e-02 2.594574045030557247e-02 6.853862243044983940e-03
7.208230266510981532e-02 3.806576326492071977e-02 8.367873671545586478e-02 6.776806086284037356e-02 8.926004794039385515e-02 8.809434651015778106e-02 8.594147325445694596e-02 7.963838143881482590e-02 5.497904893220632860e-02 3.497845559883028949e-02 4.979994574770620908e-01 8.245673175723891024e-01 1.691457016033139027e+00 8.228795309973913064e-01 1.495618816553516972e-01 2.917600829766153758e-01 5.450023158595925787e-01 1.507207715489578270e-01 3.712230391402346341e-02 1.024996566335454329e-01 4.313335086446406369e-02 3.884822679901489551e-02 5.007671749465733568e-02 7.006833425191553999e-02 7.479804665664729901e-02 3.917362812731581961e-02 5.815625641392864476e-02 4.364609642213523877e-02 3.990851606768142795e-02 2.942996824051372431e-02
1.791206412750923072e-02 8.155541797143911475e-02 7.790322724940038079e-02 6.458168079907322667e-02 5.677908154516489447e-02 1.743787820758056772e-02 6.695825686211760719e-02 4.730884613628753843e-02 5.688559786589507394e-02 7.145131005076023334e-02 1.502285402619810972e-01 9.868135598853936541e-01 1.756300226266914510e+00 8.939839434020990794e-01 3.159733318857673723e-01 3.514698683045138217e-01 3.873634690968933425e-01 2.275595981662675293e-01 5.794432205042716194e-02 1.874357989451550660e-02 4.104509742322227234e-02 4.213876875160139923e-02 4.974894797632670174e-02 8.909745454053590030e-02 8.484976494093864063e-02 6.041570640726172392e-02 4.632245121589354669e-02 4.203025235362361361e-02 4.603267799787538056e-02 5.007362899457705463e-02
3.592983242149375145e-02 8.247407507610027277e-02 2.586969430012656113e-02 4.992198416237449143e-02 3.507024323583345787e-02 1.124256071258629974e-01 6.502708837454501678e-02 5.960310785249023358e-02 7.696914734948021031e-02 3.663920624897927525e-02 1.045176452714343014e-02 3.125886621986239677e-01 1.304703047320419529e+00 5.484384165001922051e-01 1.688984785996400229e-01 1.919636488429329324e-01 7.049205829593011008e-02 1.029759676955873948e-01 1.166416086774004768e-01 4.644495910613119505e-02 3.871771527166421173e-02 4.246744942815559865e-02 5.340083463221854954e-02 8.993779946587690532e-02 1.152168730542418029e-01 1.022488013630868109e-01 7.567103989138489195e-02 7.114032110543112852e-02 6.256558112372598290e-02 5.215661263012192489e-02
3.140644119971290615e-02 8.439204643582640109e-02 2.124076727080810231e-02 8.587743476909218132e-02 5.090474563839993138e-02 2.147643828034760324e-02 7.333940473986423625e-02 5.952934643383515911e-02 1.058234342463441890e-01 3.407644195070928805e-02 7.684776775139307708e-03 5.085121802592518225e-02 5.948881494755058341e-01 7.860833053312268337e-01 8.194376794120554752e-01 1.084163689196782299e+00 9.688157076785368638e-01 6.265914882167663569e-01 1.705651207126181346e+00 7.924167290928102458e-01 6.824980295194027491e-02 2.185494548372315937e-02 1.776814588924430574e-02 4.572712454177808861e-02 1.004003900982512604e-01 8.895612909025113479e-02 2.344806909987678378e-01 8.607640197603705356e-02 8.502379734510411013e-02 9.865715399314449463e-02
2.917246472011022357e-02 2.787358335531545800e-02 6.636254925591331122e-02 6.548954436747447816e-02 1.883038606420790739e-02 4.169740444852736844e-02 3.986107862284854475e-02 1.141409647347803313e-01 7.838591540527295454e-02 7.991878230036726649e-03 1.616848892177500524e-02 2.527457774361059895e-01 5.340502553355385151e-01 6.642821663710352098e-01 5.883460263845696758e-01 6.982356933728555148e-01 1.182168883172033613e+00 2.031619835009065067e+00 2.055407716943151719e+00 1.603099547860253660e+00 6.817822220663616317e-02 7.098887486240569589e-02 6.358676209361412146e-02 2.002450703771420371e-01 2.900928049075000015e-01 1.495686135222924040e+00 1.501824597915629722e+00 3.229552048791635155e-01 8.758276166523505657e-02 6.718608511031787245e-02
2.673912300564550149e-02 2.815753244361342278e-02 5.530941801713398775e-02 5.729266375296601654e-02 3.712670485968788681e-02 4.472365207247046281e-02 2.188538234023914425e-02 5.876599642173264970e-02 1.216769575320152674e-01 4.316640003965553640e-02 4.447874749907282377e-02 3.919952936544581629e-02 3.041792322332831366e-01 6.047454051086011972e-01 5.540765543508928692e-01 8.360888910708000887e-01 1.435495267554387055e+00 1.730319451980765866e+00 9.907185372135558499e-01 2.142485755166668171e-01 1.289538725549468912e-01 8.899656071960695414e-01 1.307362928177363326e+00 2.199602440893137612e+00 2.080886914240139607e+00 2.739460429239981565e+00 2.206902158338654107e+00 6.455414886676438257e-01 1.276416701573074852e-01 7.486280831825099791e-02
3.413159070859153599e-02 3.848010824975579836e-02 3.636877703310929105e-02 3.319881177619456170e-02 4.890992346622606568e-02 8.688283436170091134e-02 3.457399460159219506e-01 1.140581973174261465e+00 5.553037260163562472e-01 9.476396912046035348e-02 7.029744684664653021e-02 1.104824563371480384e-01 2.179546878739930804e-01 3.164295525009357957e-01 4.125030795355883462e-01 7.318192534719687448e-01 1.560155969707865964e+00 1.550190030373052918e+00 7.245295753189548993e-01 2.468800218018800396e-01 1.072797101529101793e+00 1.963903154614982993e+00 2.541394723757155916e+00 2.615621815776306924e+00 2.315677543327857801e+00 2.019835805259186046e+00 3.013983395270672716e+00 5.280505830011730239e-01 2.197857343326019633e-02 9.048442555900315654e-02
8.508355313021317978e-02 6.585055513369253433e-02 3.197650535804780203e-02 4.518384868552885458e-02 3.767607873017713577e-02 1.723455812052814284e-01 9.416827567418433187e-01 7.644188686904264118e-01 7.490838500413596890e-01 3.734997212018852930e-01 1.366217980377020524e-01 3.708305732152929884e-02 3.616337300447291375e-02 9.155136335404127912e-02 2.046310419067782216e-01 9.340005484314202189e-01 9.665616714191245240e-01 1.106061367174321575e+00 1.897837103508265011e-01 3.326494320210713895e-01 1.190842046917187425e+00 2.600678476167137987e+00 3.233480759061731824e+00 3.357066287782565883e+00 2.781833970862692684e+00 2.717362713591413570e+00 2.560900093856539161e+00 2.004033449365866026e+00 9.530062081548243413e-02 6.339603849187437634e-02
3.412119116251993017e-02 9.291167689638124561e-02 1.366139639137977854e-02 6.364831250728539280e-02 1.365309849280842147e-01 1.910430602126538813e-01 6.019068385124919374e-01 7.521423068406875023e-01 5.142409114639792111e-01 3.984426127698432185e-01 8.333950625503394605e-02 8.193162916008741442e-03 1.241772327856887313e-02 3.470724706946477778e-02 7.507602027468665562e-02 4.399754433565160605e-01 1.648692716124195434e-01 5.161060563627959535e-02 1.703580081583910485e-02 1.228944380631320776e-01 4.710298691418597916e-01 2.523283065511210843e+00 3.206437592862723562e+00 3.349162135808944729e+00 2.444745226297769136e+00 1.140681601574629944e+00 1.866285607427855986e+00 1.264660287108154924e+00 1.132545846769913572e-01 4.392200641562082203e-02
4.725404192858786989e-02 6.071943331979151592e-02 3.933394023944784129e-02 4.545497161990211255e-02 1.074707267621567985e-01 6.188292128783902390e-02 3.179819730658414167e-01 4.105478156939335599e-01 3.767648145000765947e-01 8.835361096166147177e-02 2.212061294252490318e-02 5.135159591174755234e-03 9.209621862863380873e-03 2.664429252242562704e-02 9.723834939527623011e-02 6.393356066731177567e-02 1.144008160605142488e-01 3.312564514535155241e-02 6.125317582882913725e-02 2.888640083455469298e-01 1.560843815486397279e+00 2.954316909307770800e+00 3.167567836933782743e+00 2.993124951537546430e+00 2.292213756363359778e+00 1.679794177387675225e+00 1.631207773822435758e+00 1.087031668674235174e+00 9.721221891289311134e-02 3.410265833393724688e-02
1.211290199544740043e-01 1.113450761395314847e-01 5.712806280202384346e-02 4.115355696329278667e-02 5.350900928663113176e-02 2.870735672801691396e-02 1.629751309877744414e-01 1.455526698200626523e-01 4.021317283717042168e-02 2.233839751930373832e-02 8.339717695371154718e-03 7.862675607696231403e-03 9.299073302498174487e-02 4.472221551177463922e-02 5.505122161574046123e-03 1.860344211353884974e-02 6.536610143931800843e-02 1.461227832706342433e-01 1.381299678866719505e-01 6.098640944436930500e-01 1.656401110640945307e+00 2.378389566394984556e+00 9.587484551521714415e-01 1.427489979183986790e+00 1.834364898430216773e+00 1.035133397681115008e+00 7.701377936367536092e-01 6.355463397626972544e-01 2.682051545798724151e-02 2.489260962325068327e-02
9.890706015352349056e-02 1.141865615334222012e-01 1.677405474942530658e-02 1.160595700624297670e-02 9.542393362015982872e-03 1.422047729858223752e-02 2.047728889568070643e-02 5.200764010855701835e-03 6.898221859012437090e-03 3.172448448205450466e-02 4.511650357841630321e-02 7.132734078945911216e-02 6.681178513953300868e-02 1.155923613402867235e-02 2.641730197749143222e-02 3.463870129602235615e-01 6.547946343118110635e-01 9.301872287414415519e-01 6.242427685922398162e-01 4.618638361661112635e-01 3.223886389605399305e-01 1.133841411019850670e-01 4.340124278948772479e-02 9.355438162466797603e-02 3.366046669376892564e-01 1.128645696344166144e-01 1.026023160206503831e-01 4.116963043342481560e-02 4.162359567961354534e-02 3.916859683954631438e-02
2.078759386513974183e-01 1.603098869996136544e-01 1.747565025423101701e-02 7.758793269960328337e-03 1.151685723668318534e-02 8.722308062198955853e-03 1.348570524598329684e-02 4.641592267205650602e-02 4.359602202349281697e-02 1.905381886074569014e-02 4.774277215135053209e-02 8.649627814016577765e-02 8.824253059583583858e-02 2.263600960721273009e-02 3.103773431361876028e-02 2.017370918211653097e-01 7.287105439742005419e-01 1.337527319195693787e+00 1.491373621800908378e+00 1.270673838092650776e+00 2.653061055111695099e-01 5.818496530701053326e-02 7.157307717130081959e-02 1.767900096522732611e-01 3.918286747258321601e-01 1.150293591736171739e-01 4.323394340268772729e-02 2.030217438059276833e-02 5.827219373997294394e-02 5.668604486559238737e-02
2.607068739161180204e-01 3.331334322779169049e-02 9.235855802627153388e-03 8.207610245096315371e-02 1.043819983673021923e-01 7.663803774618273452e-03 1.022544386184455825e-02 3.784201763845967958e-02 2.171149299140161595e-02 2.482807044532371263e-02 4.541604625005170315e-02 7.674300273081541279e-02 6.764908302991726186e-02 1.816442419167277680e-02 5.937086966173636682e-02 2.837938993252452358e-01 5.440124997129879292e-01 1.237603727760957728e+00 1.542730399719158374e+00 1.292341882420484422e+00 6.369043728779926195e-01 3.856266399891886132e-02 2.724368454552627411e-02 5.888321715532133377e-02 3.229783835798711866e-01 1.952114146037971787e-01 1.743853042272289211e-01 3.989196484379833874e-02 4.714710412737188605e-02 4.315217280746515977e-02
1.453248354172813617e-01 4.514040908447020106e-02 1.762435518198439410e-02 1.689961277906949083e-02 3.814728075967427356e-02 2.600462603298364303e-02 1.117162308566824712e-02 1.475084180948333934e-01 6.736623045421032130e-03 8.716050927292563408e-03 2.677016929485279834e-02 3.185110712807270178e-02 4.054134441430297386e-02 7.696672154662254073e-02 2.307741019713311845e-02 8.609580886102438657e-02 8.604667497881451910e-02 3.646903114436284010e-01 4.657807852696292938e-01 4.006467172822300582e-01 3.357340379799958474e-01 5.115980870825784926e-02 7.826830325211991957e-02 1.520038656650834694e-02 5.888546935251921105e-02 1.487941345531871018e-01 3.991436424966499641e-01 2.421162486559238491e-01 5.330147290244130476e-02 4.704052986328018104e-02
5.206604360529168418e-02 2.073738000483625610e-02 2.180550275213731862e-02 3.678756595763135046e-02 2.026692239684182995e-02 9.425446998611072824e-03 1.436618807883989490e-01 1.043607315831878990e-01 9.969741426732365436e-03 3.688540084465988245e-02 8.260316077143833868e-02 3.032392824189526076e-02 4.482832174539971848e-02 8.083220474629207453e-02 1.882364764453090325e-02 3.056368436003274042e-02 2.391409695698370336e-02 1.339418026001282583e-02 2.256566563194982444e-02 3.991878570280711636e-02 7.371658740564224210e-02 2.144991587988137952e-02 8.177219292938939232e-02 4.657763413304866207e-02 8.408282724685847698e-02 3.016449028331354837e-02 1.046377745683931548e-01 1.221850339061095192e-01 6.909569257269532194e-02 6.891367777674717310e-02
5.278880489209610699e-02 4.249749918515277614e-02 2.040698162373332653e-02 1.492572873433401469e-02 1.398630961484517189e-02 5.464850820282874874e-03 1.193657386828145817e-01 1.252515359916863691e-01 1.377129163893326957e-01 1.696474091189537764e-02 5.607139559352984637e-03 6.456199181345837791e-03 1.123259353108917447e-01 6.915824865939484284e-03 1.756967815369395863e-02 1.186882370748527232e-02 9.481122206042349662e-03 8.967913847106967484e-02 8.187215020158042367e-02 6.498864406104803981e-02 5.176980125836273122e-02 7.293073225129409476e-02 9.972072869223669311e-02 3.235881968915982343e-02 3.969192701575458004e-02 2.329936789431609132e-02 4.449273758731287637e-02 2.850754642621700780e-02 3.602682038140050946e-02 1.243961505948959767e-01
7.175373773188782611e-02 3.749966963184638014e-02 2.098346599043150046e-02 2.856147279003692918e-02 2.531311843387960142e-02 1.387595388331767585e-02 4.771100017000873272e-02 3.666409618368109136e-02 5.778204724117276883e-03 1.362672570321152299e-01 4.854651479714003348e-02 1.037130682605706122e-01 1.314647583158973926e-02 1.329608503838822231e-02 3.934051854407508847e-02 3.316931222192467943e-02 1.283144091170721271e-02 2.236931906247678972e-02 9.317729203385430314e-02 4.341100630929049797e-02 4.181717757592898904e-02 6.308207556521425174e-02 8.770959825521690290e-02 4.461955748056979643e-02 3.543704955702087905e-02 5.875900275655625976e-02 7.125543737955837564e-02 8.550874650119497100e-02 6.952064970704451008e-02 5.317221401471693143e-02
9.645023322688642264e-02 8.369453040459634563e-02 2.503751796276599412e-02 8.527640192704821764e-02 1.000984712727444187e-01 1.888607804297170456e-01 1.260138189698682409e-01 1.421225344405607771e-02 5.529883105006480268e-03 1.086183685365519902e-01 3.291820685686903947e-02 3.788151212037178112e-02 3.969351375498254841e-02 7.671902783220644131e-03 1.103131497859980922e-02 6.601788383511965341e-02 5.640804208200872472e-02 6.254836651488235311e-02 8.766209026048987774e-02 5.319656769392764467e-02 3.743519868394914324e-02 5.486509126212164855e-02 5.837246858555791840e-02 8.779169780777774934e-02 6.458323679822183805e-02 4.545970571136850880e-02 6.967686722785418341e-02 1.076192335185223448e-01 1.166137206225865419e-01 5.039717954584767290e-02
5.224642642184179619e-02 1.304380283251713180e-01 3.875033721541751297e-02 4.155664112646867414e-02 2.035262509175426726e-01 2.162284702331754294e-01 1.440894584124718658e-01 9.909916390363482375e-03 7.302109978763048244e-03 7.787658462264550677e-03 9.943567486338845962e-02 4.977394132559254808e-02 2.811632114523514650e-02 4.068316075792755698e-02 1.240061145293737226e-02 4.997501282940502998e-02 1.371294311421529175e-02 8.032738765972780026e-02 1.516026984946155787e-01 3.191845811486735546e-02 5.276757226331845602e-02 7.333430093879360345e-02 6.184098197249943141e-02 6.216607205901646810e-02 8.159145698501127364e-02 6.453775039443092332e-02 7.892293741827186015e-02 9.410571690601009232e-02 1.119556935934004349e-01 5.746503253650755982e-02
