19.7570482143857 19.7570482143857 19.7570482143857 19.7570482143857 19.7570482143857 19.7570482143857 19.7570482143857 19.7570482143857 19.7570482143857 19.7570482143857 19.7570482143857 19.7570482143857 19.7570482143857 19.7570482143857 19.7570482143857 19.7570482143857 19.7570482143857 19.7570482143857 19.7570482143857 19.7570482143857 19.7570482143857 19.7570482143857 19.7570482143857 19.7570482143857 19.7570482143857 19.7570482143857 19.7570482143857 19.7570482143857 19.7570482143857 19.7570482143857
19.7570482143857 19.7570482143857 19.7570482143857 19.7570482143857 19.7570482143857 19.7570482143857 19.7570482143857 19.7570482143857 19.7570482143857 19.7570482143857 19.7570482143857 19.7570482143857 19.7570482143857 19.7570482143857 19.7570482143857 19.7570482143857 19.7570482143857 19.7570482143857 19.7570482143857 19.7570482143857 19.7570482143857 19.7570482143857 19.7570482143857 19.7570482143857 19.7570482143857 19.7570482143857 19.7570482143857 19.7570482143857 19.7570482143857 19.7570482143857
19.7570482143857 19.7570482143857 19.7570482143857 19.7570482143857 19.7570482143857 19.7570482143857 19.7570482143857 19.7570482143857 19.7570482143857 19.7570482143857 19.7570482143857 19.7570482143857 19.7570482143857 19.7570482143857 19.7570482143857 19.7570482143857 19.7570482143857 19.7570482143857 19.7570482143857 19.7570482143857 19.7570482143857 19.7570482143857 19.7570482143857 19.7570482143857 19.7570482143857 19.7570482143857 19.7570482143857 19.7570482143857 19.7570482143857 19.7570482143857
19.7570482143857 19.7570482143857 19.7570482143857 19.7570482143857 19.7570482143857 19.7570482143857 19.7570482143857 19.7570482143857 19.7570482143857 19.7570482143857 19.7570482143857 19.7570482143857 19.7570482143857 19.7570482143857 19.7570482143857 19.7570482143857 19.7570482143857 19.7570482143857 19.7570482143857 19.7570482143857 19.7570482143857 19.7570482143857 19.7570482143857 19.7793427576056 19.8155162372699 19.8507691062943 19.8840806779525 19.8473658066023 19.8115706396934 19.7766936751187
19.7570482143857 19.7570482143857 19.7570482143857 19.7570482143857 19.7570482143857 19.7570482143857 19.7570482143857 19.7570482143857 19.7570482143857 19.7570482143857 19.7570482143857 19.7570482143857 19.7570482143857 19.7570482143857 19.7570482143857 19.7570482143857 19.7570482143857 19.7570482143857 19.7570482143857 19.7570482143857 19.7570482143857 19.7570482143857 19.7570482143857 19.8094783802325 19.894197864464 19.9779969774961 20.0568660448328 19.9716049777266 19.8872633760673 19.803839738088
19.7570482143857 19.7570482143857 19.7570482143857 19.7570482143857 19.7570482143857 19.7570482143857 19.7570482143857 19.7570482143857 19.7570482143857 19.7570482143857 19.7570482143857 19.7570482143857 19.7570482143857 19.7570482143857 19.7570482143857 19.7570482143857 19.7570482143857 19.7570482143857 19.7570482143857 19.7570482143857 19.7570482143857 19.7570482143857 19.7570482143857 19.8405361895836 19.9738006882221 20.1061450550845 20.228732268577 20.094925995917 19.9620389497269 19.8300696285802
19.7570482143857 19.7570482143857 19.7570482143857 19.7570482143857 19.7570482143857 19.7570482143857 19.7570482143857 19.7570482143857 19.7570482143857 19.7570482143857 19.7570482143857 19.7570482143857 19.7570482143857 19.7570482143857 19.7570482143857 19.7570482143857 19.7570482143857 19.7570482143857 19.7570482143857 19.7570482143857 19.7570482143857 19.7570482143857 19.7570482143857 19.8703364919144 20.0494513470627 20.2285664911836 20.3924432309295 20.2149137074102 20.0364664194931 19.8571028689069
19.7570482143857 19.7570482143857 19.7570482143857 19.7570482143857 19.7570482143857 19.7570482143857 19.7570482143857 19.7570482143857 19.7570482143857 19.7570482143857 19.7570482143857 19.7570482143857 19.7570482143857 19.7570482143857 19.7570482143857 19.7570482143857 19.7570482143857 19.7570482143857 19.7570482143857 19.7570482143857 19.7570482143857 19.7570482143857 19.7570482143857 19.872037129735 20.0511501361673 20.2302634315574 20.393304377822 20.2643220407702 20.1344221780038 20.0036062909112
19.7570482143857 19.7570482143857 19.7570482143857 19.7570482143857 19.7570482143857 19.7570482143857 19.7570482143857 19.7570482143857 19.7570482143857 19.7570482143857 19.7570482143857 19.7570482143857 19.7570482143857 19.7570482143857 19.7570482143857 19.7570482143857 19.7570482143857 19.7570482143857 19.7570482143857 19.7570482143857 19.7570482143857 19.7570482143857 19.7570482143857 19.8737374782835 20.0528486363137 20.2319600832877 20.395084578512 20.3146484378518 20.2332950101427 20.1510257964323
19.7570482143857 19.7570482143857 19.7570482143857 19.7570482143857 19.7570482143857 19.7570482143857 19.7570482143857 19.7570482143857 19.7570482143857 19.7570482143857 19.7570482143857 19.7570482143857 19.7570482143857 19.7570482143857 19.7570482143857 19.7570482143857 19.7570482143857 19.7570482143857 19.7570482143857 19.7570482143857 19.7570482143857 19.7570482143857 19.7570482143857 19.8754375375736 20.0545468475161 20.2336564463886 20.3977835988271 20.3658926647359 20.3330846822438 20.299361152059
19.7570482143857 19.7570482143857 19.7570482143857 19.7570482143857 19.7570482143857 19.7570482143857 19.7570482143857 19.7570482143857 19.7570482143857 19.7570482143857 19.7570482143857 19.7570482143857 19.7570482143857 19.7570482143857 19.7570482143857 19.7570482143857 19.7570482143857 19.7570482143857 19.7570482143857 19.7570482143857 19.7570482143857 19.7570482143857 19.7570482143857 19.8647138941849 20.0260615535525 20.1883290145901 20.3398382258262 20.3581390261441 20.3755212186689 20.3919863037552
19.7570482143857 19.7570482143857 19.7570482143857 19.7570482143857 19.7570482143857 19.7570482143857 19.7570482143857 19.7570482143857 19.7570482143857 19.7570482143857 19.7570482143857 19.7570482143857 19.7570482143857 19.7570482143857 19.7570482143857 19.7570482143857 19.7570482143857 19.7570482143857 19.7570482143857 19.7570482143857 19.7570482143857 19.7570482143857 19.7570482143857 19.8332263404722 19.9460293786952 20.059751979228 20.170094066756 20.2369378317389 20.3028632278282 20.3678717550393
19.7570482143857 19.7570482143857 19.7570482143857 19.7570482143857 19.7570482143857 19.7570482143857 19.7570482143857 19.7570482143857 19.7570482143857 19.7570482143857 19.7570482143857 19.7570482143857 19.7570482143857 19.7570482143857 19.7570482143857 19.7570482143857 19.7570482143857 19.7570482143857 19.7570482143857 19.7570482143857 19.7570482143857 19.7570482143857 19.7570482143857 19.8008173767579 19.8650767831658 19.9302555125408 20.0012679883934 20.1166537289833 20.2311213395626 20.3446723198065
19.7570482143857 19.7570482143857 19.7570482143857 19.7570482143857 19.7570482143857 19.7570482143857 19.7570482143857 19.7570482143857 19.7570482143857 19.7570482143857 19.7570482143857 19.7570482143857 19.7570482143857 19.7570482143857 19.7570482143857 19.7570482143857 19.7570482143857 19.7570482143857 19.7570482143857 19.7570482143857 19.7570482143857 19.7570482143857 19.7570482143857 19.7674872379336 19.7832040016022 19.7998398489124 19.8333597566293 19.9972864840231 20.1602953202716 20.3223877647094
19.7570482143857 19.7570482143857 19.7570482143857 19.7570482143857 19.7570482143857 19.7570482143857 19.7570482143857 19.7570482143857 19.7570482143857 19.7570482143857 19.7570482143857 19.7570482143857 19.7570482143857 19.7570482143857 19.7570482143857 19.7570482143857 19.7570482143857 19.7570482143857 19.7570482143857 19.7570482143857 19.7570482143857 19.7570482143857 19.7570482143857 19.7808602698955 19.8136851601438 19.8455912060581 19.8901596615222 20.0358948155816 20.1825481977718 20.3301183084691
19.7570482143857 19.7570482143857 19.7570482143857 19.7570482143857 19.7570482143857 19.7570482143857 19.7570482143857 19.7570482143857 19.7570482143857 19.7570482143857 19.7570482143857 19.7570482143857 19.7570482143857 19.7570482143857 19.7570482143857 19.7570482143857 19.7570482143857 19.7570482143857 19.7570482143857 19.7570482143857 19.7570482143857 19.7570482143857 19.7570482143857 19.8160320543253 19.8973976099214 19.9778445604733 20.0596184731271 20.156810924742 20.2549213656286 20.3539482965042
19.7570482143857 19.7570482143857 19.7570482143857 19.7570482143857 19.7570482143857 19.7570482143857 19.7570482143857 19.7570482143857 19.7570482143857 19.7570482143857 19.7570482143857 19.7570482143857 19.7570482143857 19.7570482143857 19.7570482143857 19.7570482143857 19.7570482143857 19.7570482143857 19.7570482143857 19.7570482143857 19.7570482143857 19.7570482143857 19.7570482143857 19.852124309281 19.9820295419086 20.1110164087654 20.2281595639303 20.2768103017721 20.3263787900452 20.376863529806
19.7570482143857 19.7570482143857 19.7570482143857 19.7570482143857 19.7570482143857 19.7570482143857 19.7570482143857 19.7570482143857 19.7570482143857 19.7570482143857 19.7570482143857 19.7570482143857 19.7570482143857 19.7570482143857 19.7570482143857 19.7570482143857 19.7570482143857 19.7570482143857 19.7570482143857 19.7570482143857 19.7570482143857 19.7570482143857 19.7570482143857 19.8889184006589 20.067580721529 20.2451065166098 20.3957831680064 20.3958931804941 20.3969207045895 20.3988642416893
19.7570482143857 19.7570482143857 19.7570482143857 19.7570482143857 19.7570482143857 19.7570482143857 19.7570482143857 19.7570482143857 19.7570482143857 19.7570482143857 19.7570482143857 19.7570482143857 19.7570482143857 19.7570482143857 19.7570482143857 19.7570482143857 19.7570482143857 19.7570482143857 19.7570482143857 19.7570482143857 19.7570482143857 19.7570482143857 19.7570482143857 19.8543808223336 19.9855845821697 20.117706806889 20.2301538400863 20.2317992534838 20.2334428711539 20.2350846930839
19.7570482143857 19.7570482143857 19.7570482143857 19.7570482143857 19.7570482143857 19.7570482143857 19.7570482143857 19.7570482143857 19.7570482143857 19.7570482143857 19.7570482143857 19.7570482143857 19.7570482143857 19.7570482143857 19.7570482143857 19.7570482143857 19.7570482143857 19.7570482143857 19.7570482143857 19.7570482143857 19.7570482143857 19.7570482143857 19.7570482143857 19.8189228996962 19.9015862560379 19.9851678380146 20.0558734321267 20.057518582546 20.0591619375253 20.0608034970512
19.7570482143857 19.7570482143857 19.7570482143857 19.7570482143857 19.7570482143857 19.7570482143857 19.7570482143857 19.7570482143857 19.7570482143857 19.7570482143857 19.7570482143857 19.7570482143857 19.7570482143857 19.7570482143857 19.7570482143857 19.7570482143857 19.7570482143857 19.7570482143857 19.7570482143857 19.7570482143857 19.7570482143857 19.7570482143857 19.7570482143857 19.7825448675601 19.8166688083386 19.8517107355212 19.8815929877174 19.8832378751641 19.8848809674576 19.8865222645845
19.7570482143857 19.7570482143857 19.7570482143857 19.7570482143857 19.7570482143857 19.7570482143857 19.7570482143857 19.7570482143857 19.7570482143857 19.7570482143857 19.7570482143857 19.7570482143857 19.7570482143857 19.7570482143857 19.7570482143857 19.7570482143857 19.7570482143857 19.7570482143857 19.7570482143857 19.7570482143857 19.7570482143857 19.7570482143857 19.7570482143857 19.7570482143857 19.7570482143857 19.7570482143857 19.7596054777908 19.7729158403765 19.785311153522 19.796792914799
19.7570482143857 19.7570482143857 19.7570482143857 19.7570482143857 19.7570482143857 19.7570482143857 19.7570482143857 19.7570482143857 19.7570482143857 19.7570482143857 19.7570482143857 19.7570482143857 19.7570482143857 19.7570482143857 19.7570482143857 19.7570482143857 19.7570482143857 19.7570482143857 19.7570482143857 19.7570482143857 19.7570482143857 19.7570482143857 19.7570482143857 19.7570482143857 19.7570482143857 19.7570482143857 19.7691555458813 19.831003802534 19.8919372482098 19.9519573801402
19.7570482143857 19.7570482143857 19.7570482143857 19.7570482143857 19.7570482143857 19.7570482143857 19.7570482143857 19.7570482143857 19.7570482143857 19.7570482143857 19.7570482143857 19.7570482143857 19.7570482143857 19.7570482143857 19.7570482143857 19.7570482143857 19.7570482143857 19.7570482143857 19.7570482143857 19.7570482143857 19.7570482143857 19.7570482143857 19.7570482143857 19.7570482143857 19.7570482143857 19.7570482143857 19.77962202112 19.8900071846212 19.9994777755914 20.1080352909224
19.7570482143857 19.7570482143857 19.7570482143857 19.7570482143857 19.7570482143857 19.7570482143857 19.7570482143857 19.7570482143857 19.7570482143857 19.7570482143857 19.7570482143857 19.7570482143857 19.7570482143857 19.7570482143857 19.7570482143857 19.7570482143857 19.7570482143857 19.7570482143857 19.7570482143857 19.7570482143857 19.7570482143857 19.7570482143857 19.7570482143857 19.7570482143857 19.7570482143857 19.7570482143857 19.7910046695182 19.9499257529025 20.1079325021848 20.2650264139164
19.7570482143857 19.7570482143857 19.7570482143857 19.7570482143857 19.7570482143857 19.7570482143857 19.7570482143857 19.7570482143857 19.7570482143857 19.7570482143857 19.7570482143857 19.7570482143857 19.7570482143857 19.7570482143857 19.7570482143857 19.7570482143857 19.7570482143857 19.7570482143857 19.7570482143857 19.7570482143857 19.7570482143857 19.7570482143857 19.7570482143857 19.7570482143857 19.7570482143857 19.7570482143857 19.7968691891444 19.9759498375924 20.1550307738015 20.3341119974586
19.7570482143857 19.7570482143857 19.7570482143857 19.7570482143857 19.7570482143857 19.7570482143857 19.7570482143857 19.7570482143857 19.7570482143857 19.7570482143857 19.7570482143857 19.7570482143857 19.7570482143857 19.7570482143857 19.7570482143857 19.7570482143857 19.7570482143857 19.7570482143857 19.7570482143857 19.7570482143857 19.7570482143857 19.7570482143857 19.7570482143857 19.7570482143857 19.7570482143857 19.7570482143857 19.7985588049261 19.9776376105855 20.1567167039921 20.3357960848326
19.7570482143857 19.7570482143857 19.7570482143857 19.7570482143857 19.7570482143857 19.7570482143857 19.7570482143857 19.7570482143857 19.7570482143857 19.7570482143857 19.7570482143857 19.7570482143857 19.7570482143857 19.7570482143857 19.7570482143857 19.7570482143857 19.7570482143857 19.7570482143857 19.7570482143857 19.7570482143857 19.7570482143857 19.7570482143857 19.7570482143857 19.7570482143857 19.7570482143857 19.7570482143857 19.8002481326458 19.9793250958308 20.158402346749 20.3374798850872
19.7570482143857 19.7570482143857 19.7570482143857 19.7570482143857 19.7570482143857 19.7570482143857 19.7570482143857 19.7570482143857 19.7570482143857 19.7570482143857 19.7570482143857 19.7570482143857 19.7570482143857 19.7570482143857 19.7570482143857 19.7570482143857 19.7570482143857 19.7570482143857 19.7570482143857 19.7570482143857 19.7570482143857 19.7570482143857 19.7570482143857 19.7570482143857 19.7570482143857 19.7570482143857 19.8019371723178 19.9810122933423 20.1600877020863 20.3391633982362
19.7570482143857 19.7570482143857 19.7570482143857 19.7570482143857 19.7570482143857 19.7570482143857 19.7570482143857 19.7570482143857 19.7570482143857 19.7570482143857 19.7570482143857 19.7570482143857 19.7570482143857 19.7570482143857 19.7570482143857 19.7570482143857 19.7570482143857 19.7570482143857 19.7570482143857 19.7570482143857 19.7570482143857 19.7570482143857 19.7570482143857 19.7570482143857 19.7570482143857 19.7570482143857 19.792177237112 19.92781118746 20.0643591431462 20.2018196083753
