7.290239993154747078e-02 1.030129539095180347e-01 8.754870676382563166e-02 1.092484140490823791e-01 7.653397429505751082e-02 5.984074251611168349e-03 3.986225909566927343e-03 1.082911777484272565e-02 1.981975853010896696e-02 1.087661913829909843e-02 7.621262285434305707e-03 4.788262709378846016e-02 3.308094570864587858e-02 1.314340644387425872e-01 1.626758180539323861e-01 3.858613218041222204e-02 1.480689507999719823e-01 6.945224850540025405e-03 4.412244586728271065e-03 1.173380841400252644e-01 1.076461448548031857e-01 1.578059225140043820e-02 1.184667079922088403e-02 4.626191584644594873e-02 8.730092667083126645e-02 6.651346880458501587e-02 2.966112478842093322e-02 2.614043158152482785e-03 2.500313143836430715e-03 3.150615619913356164e-03
4.706637177612878198e-02 9.723688792909553069e-02 1.688564684380342365e-02 1.293725741440328314e-01 8.870072091145519977e-02 1.767750981695545912e-02 6.804402690935408039e-03 8.545199831149255174e-03 5.087556660369438842e-03 4.708571684283521276e-03 1.084463522870291602e-01 2.407538874904624135e-02 3.825228772828243723e-02 9.962618153313800018e-02 1.471882746116764118e-01 1.047075803760959406e-01 1.350083718746176720e-01 1.241344398402534008e-02 6.758051934773800194e-03 1.426264440115925514e-01 6.299127332845834426e-02 1.552426303900010345e-02 3.167231275736579615e-02 2.760639730315172027e-02 2.361433305534260327e-02 3.053891619213151137e-02 1.033023483566033671e-02 2.635661242610948338e-03 3.765728633160599775e-03 3.779047514576669691e-03
1.918742561796430920e-02 1.835943627571925973e-02 3.768700756986823747e-02 2.815328645905462029e-02 6.602540630767998742e-02 1.019944882890098069e-02 3.764043672704187049e-02 3.994676619829104491e-02 2.400158326038756562e-02 6.439007798351034650e-03 1.762915408542143833e-02 1.380323194650350839e-02 9.770953923259500726e-03 2.316062473431814220e-02 5.962503227626432534e-02 1.848284372764035996e-02 7.795583896790169928e-03 1.161767874708482910e-02 3.452563042902940388e-02 7.078349401564654197e-03 4.053843397726038245e-02 1.318763855387095757e-02 1.980906919294312188e-02 6.696756204909370611e-03 3.811052418070648515e-03 2.401723344074003369e-03 2.047047427512165615e-03 1.617465623042299615e-03 2.775047743950201026e-03 3.128558033067943382e-03
8.078925248490268982e-03 2.180208931397390956e-02 3.806962342954534062e-02 3.086076018952282896e-02 1.624464012903629670e-02 7.621230244415712340e-02 7.655135347536538848e-02 4.801794125864141533e-02 2.628861402942658104e-02 7.032884238692783084e-03 4.187044374282100981e-03 1.072614485307351977e-02 1.124755137323500860e-02 1.348732273765339551e-01 4.326849702310443108e-02 3.653193185859466424e-02 8.176178746149732890e-02 1.650555685699406361e-01 1.366145217352571772e-01 1.301573779404922582e-01 7.136235216104717949e-02 2.745807795817947067e-02 9.151350015086734749e-03 1.766812799201447973e-02 3.121374306733448213e-03 2.149259229664501978e-03 1.777517281032949892e-03 1.694409403861742462e-03 3.457435459899436698e-03 3.774004140297310735e-03
1.405787329542488306e-01 1.388046269788897891e-02 3.047015171513310292e-02 1.181015754557936115e-02 9.585400147072634450e-03 4.495120126191892024e-02 7.916481389706958582e-02 4.493713822167388211e-02 1.666619542065357271e-02 1.744930619652440215e-02 1.909979638944531502e-02 2.349073846654795711e-02 1.025539209036324118e-01 1.057003042016924077e-01 5.532501549425611342e-02 2.238765765040809722e-02 1.525902947714737404e-02 1.565253632621032009e-01 1.069478120407012407e-02 1.542337267127573686e-01 1.099544478239549011e-01 3.428404862622816407e-02 8.745378822642034533e-02 2.852097378015384238e-02 5.615172120727107002e-03 2.909635304669251459e-03 1.977606843330988618e-03 2.294827363093810378e-03 3.603546211665261713e-03 1.330019360808433471e-02
6.848232912050887175e-03 6.955747142078985701e-03 2.133523388426230086e-02 1.740750527408076870e-02 8.075376598566897865e-03 2.572412199742002761e-02 3.355596685442636257e-02 3.651232306005999795e-02 3.013592659342628766e-02 4.385486323227527627e-02 2.655672372253984129e-02 2.040862859045805208e-02 4.687264141435569520e-02 1.748471091672066519e-02 1.451834428133103386e-02 2.507220487898311964e-02 1.382254048825398984e-01 3.613521393714269614e-02 1.170402221369190449e-01 1.607822103407337624e-02 1.438651218877546115e-02 1.125634094035749336e-02 1.045806849888183121e-01 1.633032599308747654e-02 8.343465406430499928e-03 7.698329763566430853e-03 4.767847480432857096e-03 3.299280217097325715e-03 4.374119177392056003e-03 7.887258311342081746e-03
2.623295281218623529e-02 3.939934887891888282e-02 3.885085603370282831e-02 9.430940314620567949e-03 8.633630147424617429e-02 5.617398369787435057e-03 1.362230170835521462e-02 1.346696673449208903e-01 1.558067749925198531e-01 1.657180154132143618e-02 1.278703600496578774e-01 5.676188087928418780e-02 2.617891415013770887e-02 1.195582472871987122e-02 6.912700067052034852e-03 1.253817664846615387e-02 7.207701157442095163e-02 3.341267922195070850e-02 1.619293893055503697e-01 1.111029543749856609e-02 1.145563741099366872e-01 3.217903841234499157e-02 1.507639721490336947e-02 1.452111043363268038e-02 5.635648400357034030e-03 5.799119196481242883e-03 5.172878389877918689e-03 4.511682787813827561e-03 5.258699967488380568e-03 1.245534190265981146e-02
5.807598431973276520e-02 1.069085743155121504e-01 5.725881087228913702e-02 1.117999039058845401e-01 7.527488480280131351e-03 6.476178156249534981e-03 1.054879354433096994e-02 1.893520224963722923e-02 1.474507059273939547e-01 8.492817110613108678e-02 3.445669787315955995e-02 1.056839032442840332e-01 2.297345401914503704e-02 7.993284272430036669e-03 9.044056731855980302e-03 1.696626657885974207e-02 1.306624933241408437e-01 1.209479498108522420e-02 7.803901544452392265e-03 1.407102328021234972e-01 4.676945387648669128e-02 2.723274487543515809e-02 1.095057979644892265e-02 9.197723313077299859e-03 4.393831070427068643e-03 4.639863640191019267e-03 7.560642988221339192e-03 9.740883429629731624e-03 9.558787836708776062e-03 2.737536944197141095e-02
1.424283850446932953e-01 9.144630751423189763e-02 5.140539130792634581e-02 1.501715898189448332e-02 7.980365460786065235e-03 7.047065188456541618e-02 1.586154705372926424e-02 1.216524014393092906e-01 1.172491046134631620e-01 1.202347602756238670e-01 1.073677606024013576e-01 1.343322377044605664e-01 1.957622446807579658e-02 1.879928228308521132e-01 2.949296931302844080e-02 2.510383763575087246e-02 1.010186690581339891e-01 1.273295734376112161e-02 1.130519965003707987e-02 6.216096416563028637e-02 1.248453242581592376e-02 1.286289265606219319e-02 1.410746463170208312e-02 9.252347806636269240e-03 5.433244149840617612e-03 8.352359123387520859e-03 3.331165585523229028e-02 6.630150208070045847e-02 1.862258933016220086e-01 8.938489543605410148e-02
2.623423570697027210e-02 1.394000848800085735e-01 1.911938973570573644e-02 7.602866086195480232e-03 7.147232486703301683e-03 3.443282550632754263e-02 1.393480909087432135e-02 8.207522768232689003e-02 4.006675934261146044e-02 1.444343942195402096e-02 1.580864641348980401e-02 9.141733642574761606e-03 1.698254691413421044e-02 1.505677478798573415e-02 7.620337161725751311e-03 6.387612769872743658e-03 3.141469214811567351e-02 3.453367186910291653e-02 1.525537880178966937e-02 8.850773041332445426e-03 1.588174086287250791e-02 1.012947874061164051e-02 1.174440118557119883e-02 1.296607678110818854e-02 7.256157023831769949e-03 9.336681767854432268e-03 9.051037181103094298e-02 1.521134737589078245e-01 1.842005554670174128e-01 4.698211248640474930e-02
1.505273777557259232e-02 9.646132439162016792e-02 3.213813933386949068e-02 2.709716102722085213e-02 2.934241497695204079e-02 2.347524402051019699e-02 2.171026271196336774e-02 1.972526983715940443e-02 1.358418356147142285e-02 1.066479702451107320e-01 3.940817788710122144e-02 5.525222254475002648e-02 1.147686744172832229e-01 5.724257165829552824e-02 1.064261773225144182e-02 2.110883760415912039e-02 3.958020416949807607e-02 1.552745058658890065e-02 1.090295494238741336e-01 2.660914480018111011e-02 1.105061184236543100e-02 9.952192135349445523e-03 1.299372918201918518e-02 1.828192060069518815e-02 1.959754130461817748e-02 1.071664246756378995e-02 1.733557016776519216e-02 1.354515161361320198e-02 1.190752610585692380e-02 8.363815486818079042e-03
3.922674788071443819e-02 2.286515012614477593e-02 2.081574177940167525e-01 2.024451713590492141e-01 1.635490254197059234e-01 3.921840046241984595e-02 1.702810305461788243e-02 1.158567490902862908e-02 1.407611137254774838e-02 8.753506357509857963e-03 1.649988399202080222e-02 6.822599798076191269e-02 1.198912195444517270e-01 6.219355119237130608e-02 2.238950961195095013e-02 2.526158678681066430e-02 2.809030635906838505e-02 2.404853957631703301e-02 1.827837052318015965e-01 6.084871649617549366e-02 1.060296225802660579e-02 1.084739953936450854e-02 1.297074529956740267e-02 2.335963876151505095e-02 2.230183826690802437e-02 1.597576316014696560e-02 1.234781764177509712e-02 1.114303330406619420e-02 1.205347014329137198e-02 1.290105510329331122e-02
9.203166155177801636e-03 2.304192004585677023e-02 5.509987807336196725e-02 1.544621909901642554e-01 1.029380583899117546e-01 3.328260051376840528e-02 1.737050292236566942e-02 1.477822100050709027e-02 1.932685826760940917e-02 1.316662417044282274e-01 3.666455630181888331e-02 2.280714759254114099e-02 8.988809131729079416e-02 3.822094317010125281e-02 1.190093634098987954e-02 1.363894542810010352e-02 5.078579614431079532e-03 9.786057098114388925e-03 1.413000603587320596e-02 1.280761964012442911e-01 1.013904249369866270e-02 1.118687091706053321e-02 1.432554672521222858e-02 2.399329730562509491e-02 3.060157724788880110e-02 2.692133749628256023e-02 1.997825986449351665e-02 1.870138697560689428e-02 1.634720301421442937e-02 1.346727262426161871e-02
7.876231886139836019e-03 2.246643382797087682e-02 4.067420973330270612e-02 2.969787254180648872e-02 1.781213570375978286e-02 6.919613423808171349e-02 1.515913474647946103e-02 7.070622243282049385e-03 2.722316500510922957e-02 8.883889357023994418e-03 3.142075005211960453e-02 4.195779833470953887e-03 4.128417808478281742e-02 5.487813273959956523e-02 5.739836219533737266e-02 7.597970499759763852e-02 6.915751512310358562e-02 4.560234655920588492e-02 1.342248274755505622e-01 6.410627436254702494e-02 7.355582516049148992e-03 6.666730915539420543e-02 5.075927227980552014e-02 1.220092526353833556e-01 1.146743567174036450e-02 8.132829750162636276e-03 2.074940836637433061e-02 8.336137199295818104e-03 2.229434999345151699e-02 2.561730551838880057e-02
7.350102838032284043e-03 7.402713223609780867e-03 2.044421122495918008e-02 1.548359612133179963e-01 5.716301211318750713e-02 1.284551629476391593e-02 1.492602175047780533e-01 1.298749495896302578e-02 7.212137521076040364e-03 3.339348281005437291e-02 6.860482961210699615e-02 2.216409065039116194e-02 3.980672108742860232e-02 4.608339841160073724e-02 4.083902865022404766e-02 4.837644853714415799e-02 8.366658159709376708e-02 1.471618995035648136e-01 1.523165828908620567e-01 1.215782344936586629e-01 6.655207350465255564e-03 8.514371181503116101e-03 1.686300393933614361e-01 2.337808155928243828e-02 2.851005199841998364e-02 1.209863835635457407e-01 1.214562176586705955e-01 2.795233390133325738e-02 2.256672770000051412e-02 1.718371753878765104e-02
6.721796388580631582e-03 7.363820061097912407e-03 1.678767138949676524e-02 1.885055389063601539e-02 1.279730893298082831e-02 1.352941632337076143e-02 7.493326191210451792e-02 6.350088771528049174e-03 1.046719940529496420e-02 1.712899801229117447e-01 4.683730756774924509e-03 1.454589028690508601e-01 2.257457395617719700e-02 4.162758640373342284e-02 3.815375943084198945e-02 5.743030413943482626e-02 1.009536761542038225e-01 1.249328480332587005e-01 7.345297888410073917e-02 1.630869117125912857e-02 1.004698493047991546e-02 7.479105403191578516e-02 1.116926354638803354e-01 1.875048044546561155e-01 1.669189456422439377e-01 2.167557166855990647e-01 1.726948035747218335e-01 5.348491950963599889e-02 3.195599144129244312e-02 1.867044989668633151e-02
8.563471680177611733e-03 9.975408219685621969e-03 9.839444627496439499e-03 9.360250493139179312e-03 1.363628134400512483e-02 2.303163233338152011e-02 2.649344487405841733e-02 8.374836819788458731e-02 4.471002665709991608e-02 7.679341567351146217e-03 6.219151472400611703e-03 8.325880347210426122e-03 1.620655206779585480e-02 2.162515517650346122e-02 2.815379986880572893e-02 4.972917501504342530e-02 1.090372024971832249e-01 1.118003870630848162e-01 5.385938904894744389e-02 1.887784027421877953e-02 8.402593907947406016e-02 1.573180750304843667e-01 2.082207322724405896e-01 2.124687985128023704e-01 1.837863359331480262e-01 1.562372879796559699e-01 2.275310637534963265e-01 4.155337287818292730e-02 4.261370589468550102e-02 2.299224670191674091e-02
2.131328235262685417e-02 1.693672766402243290e-02 8.346246577477078182e-03 1.184540750492717349e-02 1.418750482589937467e-01 1.474272275473086091e-02 6.598277383049649947e-02 5.355714130047930371e-02 5.293212458482590699e-02 2.619191314455431019e-02 1.029352804177018250e-02 3.337495329128045782e-03 3.912934937208456532e-03 9.110245041040687664e-03 1.702858648054458510e-02 6.278576272708451256e-02 7.165342900641014090e-02 8.710192374547712224e-02 1.543237849334857560e-02 2.618216331504011340e-02 9.371525952267326098e-02 2.098377267264901203e-01 2.675525030814918104e-01 2.733050987346020699e-01 2.187155461869118578e-01 2.049361050750378443e-01 1.858301486402652580e-01 1.498346586300651762e-01 1.860224131352017363e-02 1.734406974016378944e-01
8.675221617256249906e-03 2.432200623784339100e-02 4.226889987977235780e-02 8.009351498345630010e-03 1.179904472188973014e-02 1.572438668719116153e-02 4.123044221203031601e-02 5.127268369849106305e-02 3.493821170456996167e-02 3.042004262782357221e-02 7.659339638206645769e-03 4.472223890848627675e-02 6.881963936981298768e-02 1.620160475675068712e-01 8.212005110182538092e-03 2.957682953414229182e-02 1.388447365769871975e-02 1.563629767842165952e-01 4.994376106505387519e-02 9.535232219476070387e-03 3.595236142297262433e-02 1.948139956461623634e-01 2.506858993716010175e-01 2.609201512115381094e-01 1.881090258903336254e-01 8.615706463133558646e-02 1.383559718866275989e-01 9.429488729055100771e-02 2.635929507723302340e-02 1.265078247649641108e-01
1.844062145867600144e-01 8.894085405804141517e-03 1.692601854959400465e-01 4.925136941301520334e-03 7.513284513575875685e-03 4.248183868584340731e-03 2.141216160831710055e-02 2.710605489038997104e-02 2.766399376902079280e-02 8.408092789873136338e-03 1.208969620933943168e-01 3.085625758531750085e-02 5.386220896134835678e-02 1.297731675718377942e-01 1.191146230125310172e-02 4.653201262340334390e-03 1.030968963370752431e-02 1.199751442728231310e-01 5.642728740454973010e-03 2.197985755721483525e-02 1.153107978018393653e-01 2.180734052676475132e-01 2.338956475786779232e-01 2.232077474169240627e-01 1.724581172380302840e-01 1.270919599628123342e-01 1.237444859011867376e-01 8.782448725390505639e-02 2.130694379547845574e-02 9.791348322642140500e-02
1.291918297912714349e-02 1.551368733088964377e-02 6.825349692552567030e-03 5.616942102292394809e-03 5.991049329792188377e-03 3.003656884543895976e-03 1.480898846067748957e-02 1.200242323396154796e-02 3.284058972692434700e-03 1.299971822425773915e-01 5.261495543269945757e-02 4.652418251906092345e-02 2.612318971530594447e-02 1.205567170337651199e-02 2.545384069152009654e-02 7.233379357359318029e-02 5.345931505502060296e-03 1.171369522416710815e-02 1.124178380841187042e-02 4.395482298031195417e-02 1.178595836287685827e-01 1.719787536242317061e-01 6.851197069593945033e-02 1.045279473766043549e-01 1.350889996444884222e-01 7.848435906532830186e-02 6.545745796760740753e-02 5.850709629667658063e-02 5.527350963857559363e-02 6.009986365377453787e-02
7.092252551734831711e-03 1.067132038896459988e-02 8.653233743713595327e-02 7.419032044317978858e-02 6.891979457322433555e-02 9.979416475499144901e-02 1.377681095582820869e-01 3.416241150612476379e-02 4.686286664674670782e-02 8.169840936663041661e-03 1.215572602576440141e-02 1.925273653028806292e-02 1.845275011096659395e-02 5.815189612984474066e-02 1.282778988784602781e-01 3.220692126571716996e-02 4.595705876952602131e-02 6.420825884417909191e-02 4.418034964687702487e-02 3.301536142620167813e-02 2.577144562222999716e-02 9.193431771591735122e-03 9.718026696972389966e-02 6.778205099621529596e-03 2.473400288115805770e-02 1.061568443138710335e-02 1.263306200721789514e-02 8.057125729549584336e-02 1.042793868690859022e-02 9.732953623409991081e-03
1.687556755870497915e-02 1.783193967010465383e-02 9.847240790896021057e-02 5.714184335835102019e-02 9.530206613309706587e-02 7.448970013115208122e-02 1.158238282024534882e-01 1.265475800650489070e-02 1.112919491956147755e-02 4.836181684846018597e-03 1.202358045609348662e-02 2.231427611605659930e-02 2.444304648526828341e-02 1.136405871754176400e-01 1.469069477119708811e-01 1.769647132762859620e-02 5.016825555090123623e-02 9.458739024562505537e-02 1.083748419158231668e-01 9.374740124565016097e-02 2.428236906581655863e-02 1.676995215860122568e-01 9.784895974617537767e-03 1.983980503817111413e-02 3.688782921329111092e-02 1.105096561156135478e-02 9.443031924678593758e-02 3.872840483413286100e-02 1.452202524585134193e-02 1.395802391043889090e-02
2.118338462562167554e-02 1.591504852468098863e-01 5.552281126209907686e-02 2.355778430410129104e-02 2.996359943592994193e-02 6.810751174841665756e-02 9.157955600979619804e-02 1.035044024567139016e-02 5.527754126361049403e-03 6.313508169999524668e-03 1.150440361329830088e-02 1.973270965794686818e-02 1.845778382547383009e-02 8.868330725563380867e-02 1.015581377567102532e-02 2.664052982107512416e-02 3.835852338200354539e-02 8.976810605195383042e-02 1.149828523469458019e-01 9.799816183287418658e-02 6.908095099945807394e-02 1.079628816012668524e-01 7.334644501472929734e-02 1.326228383464661542e-01 5.255824993966354969e-02 2.765310979861612672e-02 2.178773589197856991e-02 6.740146281803856276e-02 1.185083585338909257e-02 1.074591916634730880e-02
1.346109840444218060e-02 6.105997941982451403e-03 1.201808625558108967e-01 1.256969445555510823e-01 5.824278145246354448e-03 2.145981331235812251e-01 9.360313910178640062e-02 3.881212834784562166e-02 5.662000415087191374e-02 7.247699115910850864e-02 6.809203613692312029e-03 8.258390412335107900e-03 1.099301518633273057e-02 2.168594030927073479e-02 1.126601618420201567e-01 2.056228844714101667e-02 1.380440834300337115e-02 3.641154071140179083e-02 4.356222535808872837e-02 4.590502584624631122e-02 4.990175862538618473e-02 1.417903844500225941e-01 2.257752343834784278e-02 3.930951091990190355e-02 1.606891894775397678e-01 5.597441057592414393e-02 5.025934880632654256e-02 3.983216422575039384e-02 1.401010647935961757e-02 1.230673013724153074e-02
4.300936832050898662e-03 1.217358413658510413e-01 1.540932837729213079e-01 7.339864513879659075e-03 1.658120247893927757e-01 7.819133040863478212e-02 3.780062725078637414e-02 2.697316282300220996e-02 8.474038135975354991e-02 4.495254742097272264e-03 2.260679860892462339e-02 8.678998494513281287e-03 1.330222086105806514e-02 2.553140163661728190e-02 1.089735595452841072e-01 1.808136250831246794e-01 1.089554793152229667e-01 4.819859503391227262e-02 6.949942434646762257e-02 1.189454658833914436e-01 2.061621278049090289e-01 4.813401007269323129e-02 2.486459036706917952e-02 1.200090178774888133e-01 2.736678437256656604e-01 8.445159616622859022e-02 3.303770913526931502e-02 4.686024396307172935e-02 1.150496076028375697e-01 1.973404099714688373e-02
4.447115013470618466e-03 5.553661849220175618e-03 1.491345211222840916e-01 1.201733068337568072e-01 1.166971271958053696e-01 4.557484443879663422e-02 3.019192164478799387e-02 3.169356472342758219e-02 3.549221899694757210e-02 1.410635370598211646e-01 4.216511631821660833e-02 4.521737431710081551e-02 3.793584845088869562e-02 4.250085415970646097e-02 1.140988814940644830e-01 7.512553896647336527e-02 4.841669857074053229e-02 2.753826076182564267e-02 2.366151376918673721e-02 1.782058094775317361e-02 1.418456823440400472e-02 2.066051956865753297e-02 3.170974529058773195e-02 7.554741302974281314e-02 1.283002703547167778e-01 5.724902170345541608e-02 8.354702221178465782e-02 5.788907274953575266e-02 6.021619704385511307e-02 3.998462596631332383e-02
5.046012776965725158e-03 3.927732286774895248e-03 1.494926587988418820e-01 2.255729362144289485e-01 2.002398229205594182e-01 1.098465298299376308e-01 3.724638907052253353e-03 2.980724205709107434e-03 4.889393054597122867e-02 3.553919460263479241e-02 1.362127224519226257e-02 3.386815495388890290e-02 8.937805582101374102e-02 8.992256144370698590e-02 2.605900192933713888e-01 1.838041056020353892e-01 5.437486681641514469e-02 5.959586335053824319e-02 2.673693084594791491e-02 1.182538516906855332e-02 1.146972474511255904e-02 1.793078197950434549e-02 2.736906594225340522e-02 8.305541209990649487e-02 8.289432937096849474e-02 1.928538069737323682e-02 2.107724188748117539e-02 2.726176968770207404e-02 8.945276591324408111e-02 1.842266420912338359e-02
6.776301240279422426e-03 7.376010248231586013e-03 1.696374793874469156e-01 9.505599595765220136e-03 8.930212455079593672e-03 1.407512094534646950e-02 9.304221430309157770e-03 1.225076055490702670e-01 4.855983834583255110e-02 2.826418321400065228e-02 8.706568127284130751e-03 1.196091096721596352e-02 1.345809139443842478e-02 4.935373506100774327e-02 5.836425535435781770e-02 2.403708838665746111e-02 1.884952239975944133e-02 1.894223387568707076e-02 2.540669501476050529e-02 1.473305315987046352e-02 1.047581184038964656e-02 1.564793387482554810e-02 1.790273156207478761e-02 2.960155650771033667e-02 9.078130966175798622e-02 1.404506485840978369e-02 2.013489781038884860e-02 3.320818168035833545e-02 4.034581460935415809e-02 8.065770290995290248e-02
3.671186829363140558e-03 1.026453618480068636e-02 3.037144740735022233e-03 3.232792735636175630e-03 1.317372652257753698e-02 1.383750078923848964e-02 1.012724290506781741e-02 8.450950277593859139e-02 6.533444068966087759e-02 6.118887731931357127e-02 2.529493923969963406e-02 1.312788670289248560e-02 8.450979675001567618e-03 1.343281938427101814e-02 6.101925605696180421e-02 1.565173174096996453e-02 4.111784489382291213e-02 1.169105386248741121e-02 2.101983264622123149e-02 5.646911120323053201e-02 1.462183077734129956e-02 2.050481868191705165e-02 1.789785347569950932e-02 1.952697468834963673e-02 2.555556130477778382e-02 1.930532249978848119e-02 2.249522237080860479e-02 2.781571768125440033e-02 3.765523548563272371e-02 9.270779360527234281e-02
