2.225385547553500487e+01 3.369006638249047114e+01 2.911115980940640924e+01 3.652279686415627680e+01 2.761818102442919809e+01 6.112098081375114589e+01 6.158901220438870894e+01 1.698916871159026414e+02 3.142185972012476896e+02 1.425543356726083175e+02 6.715909451963395327e+01 1.551439574856483716e+01 9.377471661732659669e+00 3.710923590583522724e+01 4.606633342333662995e+01 1.084263466434611622e+01 4.159301044100530476e+01 8.027591295736402799e+01 8.080058921562313401e+01 3.123249661273952071e+01 2.534683721407701995e+01 3.726373066597125749e+00 2.930219777862976827e+00 1.192196699345595690e+01 2.372876645075850632e+01 1.921793469575785096e+01 9.217500548703585039e+00 8.269297037469376388e-01 8.032468317950911540e-01 1.035162426414734771e+00
1.673583434510589285e+01 3.831976952417237925e+01 6.900091257492924512e+01 5.594314196777943238e+01 3.876210927382177829e+01 1.748411427220768815e+02 8.515813110547318843e+01 1.094621333013484161e+02 7.353342159995906968e+01 6.396700112924716564e+01 4.735944162179916361e+01 9.625750969138440638e+00 1.334377084456136053e+01 3.188709869849384759e+01 4.681973172413272266e+01 3.187623777970423689e+01 4.311170289123992916e+01 1.566470989126428890e+02 1.328457039226275072e+02 4.439526516845799620e+01 1.603608486000365119e+01 3.690208373869797942e+00 7.929631407014236189e+00 7.263666156350090830e+00 6.669134346465440899e+00 9.374756135925231604e+00 3.513793952165576329e+00 8.927680465055851666e-01 1.257941917061233816e+00 1.252742302175736899e+00
1.980180525806006244e+02 2.097041803807696283e+02 4.457365208020463569e+02 3.595001331644184575e+02 7.675388630809250117e+02 7.881726948225761475e+01 1.508810697574744886e+01 1.680599348987594155e+01 2.844341959834349041e+02 8.946113241478809641e+01 2.521580693867826426e+02 1.778542797412518439e+02 6.874490934010140109e+01 1.040344600586319928e+02 2.063468173140004325e+01 9.086435923598531872e+01 6.679009291221237277e+01 1.531038071172160926e+02 5.786547753721677054e+02 1.081124456308210711e+02 1.057938790449760091e+01 3.183482196704272127e+00 5.034514736547895275e+00 1.846061012843803972e+00 1.169475733257258288e+00 8.327745151151376701e-01 8.039332017720115520e-01 6.009755942035450715e-01 9.731583699028312218e-01 1.054210803950718756e+00
9.533410917252437855e+01 2.835708238917883364e+02 6.244654872153544147e+02 4.994858436331041958e+02 2.070339722905445967e+02 3.199957524817756749e+01 2.546038886376616261e+01 1.756522583792451542e+01 1.114283569150684094e+01 1.059526257337404331e+02 6.992699307343772830e+01 1.445618947739301916e+02 6.852331449040080713e+01 4.802749404721195958e+01 1.481518355098937434e+01 1.190129271535068867e+01 2.694297698691434562e+01 5.521518449783188487e+01 4.338623946455177105e+01 4.085212878843225326e+01 1.936246843880239865e+01 6.964441339066091530e+00 2.286689942394316777e+00 4.676344285345606977e+00 9.326634697549619490e-01 7.412033919761619183e-01 6.906984495224396392e-01 6.117098498428681363e-01 1.152226532979869322e+00 1.199188421274364869e+00
5.734645056322214884e+01 1.869208453224552784e+02 5.211278029244161871e+02 2.017040754147916175e+02 1.160575085385319341e+02 1.664296065172229078e+01 2.513787114359646324e+01 1.400515929140303228e+01 6.693409843619370747e+00 2.340355232042054467e+02 2.923590987535537238e+02 2.537024387885326746e+02 3.873090408604839752e+01 3.375234573278210348e+01 1.671389349911579814e+01 6.611687072389660358e+00 7.568584066484237383e+01 4.653972262749957167e+01 8.057922517145183861e+01 4.986933954283583148e+01 3.679969264889568592e+01 1.093635849602820898e+01 2.551739211068322533e+01 7.438558896039751289e+00 1.595868131683465307e+00 9.397796022883779798e-01 7.081298347201604448e-01 7.672852000756351654e-01 1.112656290766197653e+00 3.918702536557440830e+00
5.952855141096520697e+01 6.704274532354004634e+01 3.006787638415756874e+02 2.399824287276669565e+02 9.470102453674570597e+01 9.890808585349788018e+00 1.174821821839747393e+01 1.239774146936155219e+01 1.170578966308128344e+01 3.478016783921434580e+02 2.667893913234274805e+02 1.396862846610365523e+02 1.621789756762770196e+01 5.131322567391034539e+00 4.148466916509489621e+00 7.296306298917551558e+00 4.002240911888704034e+01 1.092196955660747903e+01 3.719539062055130785e+01 1.358629603965803767e+02 1.789237683354896831e+02 1.148025271697423051e+02 3.087938843441939341e+01 4.268068585454551922e+00 2.283711193195551825e+00 2.356732905289241842e+00 1.590969142934974379e+00 1.026458739140955423e+00 1.252315574130708598e+00 2.160200742962695486e+00
8.335464252460415224e+00 1.425918503747660893e+01 1.520781037594502294e+01 7.731721480252073775e+01 3.703691330616734234e+01 6.011056289479353154e+01 8.832773577949893706e+01 4.911317373991664681e+01 5.768554701839705956e+01 6.498182911692065034e+01 4.842690239585243717e+01 1.941743030085280353e+01 7.989764081624434411e+00 3.264527671850533608e+00 1.837642560454421981e+00 3.535161822267564702e+00 2.159371872991243890e+01 1.053151502099547443e+01 5.550128132810853998e+01 7.923399001777158901e+01 3.969646426715785026e+01 1.032866617975680867e+01 4.408692669044234513e+00 3.714182724270450819e+00 1.496037508985450959e+00 1.685501739119716458e+00 1.602006937805687148e+00 1.298971639257411104e+00 1.394431860003454426e+00 3.178404526776609451e+00
1.701061816133312732e+01 3.266108419881181391e+01 1.940731012313646886e+01 4.247185115696483138e+01 6.614413083685735728e+01 7.409977166097661438e+01 6.484350925285924916e+01 6.065496460863576544e+01 4.852120644029449181e+01 2.631951671741678922e+01 1.028619234737105792e+01 3.094434443226490217e+01 6.602882298389225468e+00 2.273554225090863579e+00 2.426127361994428355e+00 4.709813804208273780e+00 4.075234776833724482e+01 6.813529570774306876e+01 6.245805701676943045e+01 4.665023962753492981e+01 1.378750116035095807e+01 7.033360212000773437e+00 2.583085735775889624e+00 2.151768740456348805e+00 1.085076612934348317e+00 1.228021672315334989e+00 2.035995961861225556e+00 2.426651607299290081e+00 2.309322778970468004e+00 6.505820806993959593e+00
4.328142720243587149e+01 2.920574754010192109e+01 1.746991086504223034e+01 1.036775066808801853e+02 6.909530490504545241e+01 2.946763385260880597e+01 9.498930282333819264e+01 4.292124241561306519e+01 3.641202457282243898e+01 3.482103840704819930e+01 3.026838953521161812e+01 3.922234997755242603e+01 8.545773764641350567e+01 5.670561105830395832e+01 8.616435911740261133e+00 8.164726806025646155e+00 3.720434529873867291e+01 1.186154237793059707e+02 1.231356937339051569e+02 2.173412913610027886e+01 3.685625114202882635e+00 3.071882841229315986e+00 3.142405200982294922e+00 2.042581769621922838e+00 1.248526071284387973e+00 2.046315826744462107e+00 8.202869402928794074e+00 1.582637673121430666e+01 4.378482729076024782e+01 2.073487289247069754e+01
7.050377083928681543e+01 4.641581620657074581e+01 7.551908853516482623e+01 7.260031176195798253e+01 6.616884774523106216e+01 1.328753046392898085e+01 6.214932222060471645e+01 2.702279684607500343e+01 1.164726954552707738e+01 4.265802531490706428e+00 6.164892910054119568e+01 5.977688540086279545e+01 1.252477262021916005e+02 1.336569876532077217e+02 6.301866288832259499e+01 6.916944375765785935e+01 3.860756022347421776e+02 4.213019764016258932e+02 1.797013579419612483e+02 8.542421222916630086e+01 4.497115340696850261e+00 2.299613122757067529e+00 2.538553240736431516e+00 2.794877542722434605e+00 1.592491518479242973e+00 2.165051635685683706e+00 2.151583151240208025e+01 3.544284013309033554e+01 4.241400587525362909e+01 1.071831557025926074e+01
5.941094832329581266e+01 3.125224300504256547e+01 7.072112483939318395e+01 6.166932746421668554e+01 8.131206170712749781e+01 7.639623569009586390e+00 6.515927473431558425e+00 5.851185823863073843e+00 3.800236793607195018e+00 3.346563790643814684e+01 5.248802991505933733e+02 8.731483714030767942e+02 1.766994831975375291e+03 8.401412080083395040e+02 1.496800001043239376e+02 2.847705913274446061e+02 5.421677441258093495e+02 1.562905593996378855e+02 3.930724800878012104e+01 8.296202541327208024e+00 2.981490394887671869e+00 2.204950182811849846e+00 2.788376676657798203e+00 3.932993641055070100e+00 4.271204317917238313e+00 2.405321585012231811e+00 3.976617932517016563e+00 3.074186117693748166e+00 2.669895266322100724e+00 1.857868548836983713e+00
1.124088818330958617e+01 6.681793475929378445e+00 5.922995531631841004e+01 5.905298910452118122e+01 4.716486434855075771e+01 1.107729299578343074e+01 4.401542921924800567e+00 2.948041244619616030e+00 3.828252823114276282e+00 7.023575158122783080e+01 1.696594103191976046e+02 1.094633489852861658e+03 1.901263514577007754e+03 9.395218505267878299e+02 3.242744665302782323e+02 3.496717154546684583e+02 3.860926855833972695e+02 2.309783776805116133e+02 5.771715236153532658e+01 1.668437636648836175e+01 2.560623059012979486e+00 2.372468096181673758e+00 2.796410543188309283e+00 5.060747937182966893e+00 4.894316614887438632e+00 3.561841057723047932e+00 2.793808971476265945e+00 2.485946853087622532e+00 2.628434710136882568e+00 2.775304076016728239e+00
2.200526158779126717e+00 5.752531604796051745e+00 1.404676662456390623e+01 4.011621643202402510e+01 2.660432569050438190e+01 8.665294819839221674e+00 4.615354041154572151e+00 4.057932520812029153e+00 5.409931354835241457e+00 3.773147746699368099e+01 1.242080984454335812e+01 3.728641481430064459e+02 1.497278729715883856e+03 5.996768998196143912e+02 1.772877575612683927e+02 1.934262468900955696e+02 6.973912764481762849e+01 1.008092433669169736e+02 1.136252258583190553e+02 4.262320748175137908e+01 2.884591608086112480e+00 2.643942689827413428e+00 3.276087950136278515e+00 5.655792869125097155e+00 7.448303993812393387e+00 7.098991505780047895e+00 5.344066769583051268e+00 4.827921499189950616e+00 3.701885074104198203e+00 2.886738191035342460e+00
1.794780885731009246e+00 5.209859542417037304e+00 9.510253243257437816e+00 6.943978130206135191e+00 4.148600432579861774e+00 1.687906542803348842e+01 6.225843121364627564e+01 5.835183969473698085e+01 8.275968650319903475e+00 2.463570763638524674e+00 9.691011998195664390e+00 6.465206270146424572e+01 7.222248201355109813e+02 8.975615605125867660e+02 8.897477701198878322e+02 1.122272918657661876e+03 9.618838960229882105e+02 5.964547423050400994e+02 1.563810124831287339e+03 7.121944383467025546e+02 5.879583204640668725e+01 1.700713079061117128e+01 1.300699159839584063e+01 3.271053924396026957e+01 7.663785968698493889e+01 7.260267876802444675e+01 2.018680243045782845e+02 6.719321325674478373e+01 5.437774644024718107e+00 5.456806450749693838e+00
1.647404605698923330e+00 1.678607175431769072e+00 4.648337934770622404e+00 3.497135102876723778e+01 1.285295651120262761e+01 3.098060324367586382e+00 4.276974932299353327e+01 1.330575035292741291e+02 9.647432452545911019e+01 9.850704700209638176e+00 2.097536671821996634e+01 3.391277054278464220e+02 6.945326793002036538e+02 8.056251150559078269e+02 6.712802685837268655e+02 7.537852822575413256e+02 1.199018354561928618e+03 1.934869883107620353e+03 1.857899272832168663e+03 1.412402428871381744e+03 6.000273987115915020e+01 6.285135342267632552e+01 5.687290767035125327e+01 1.766812387661881019e+02 2.497331040390410521e+02 1.270481588919699561e+03 1.284386474994166292e+03 2.668760062431240385e+02 6.005939142362146654e+00 3.715120461973617783e+00
1.478588519309053551e+00 1.642120352268112260e+00 3.801748655923885778e+00 4.259974636437713791e+00 2.875473209019369314e+00 3.333085247752293423e+00 2.446139031227992078e+01 7.200616151196649639e+01 1.559653100563737098e+02 5.720030244740986802e+01 6.105348204424846159e+01 5.596634296765628847e+01 4.273320509829084131e+02 7.930971365250069312e+02 6.839663188144586456e+02 9.719989721657150312e+02 1.526340100876032011e+03 1.695381700864347295e+03 9.081138234227917110e+02 1.882428963160771218e+02 1.121305797638292461e+02 7.732734067439751016e+02 1.128710082766464666e+03 1.853149991176557023e+03 1.696769389303321987e+03 2.196023839055322696e+03 1.783173679129673474e+03 5.279240752602125895e+02 9.127877903757189770e+00 4.169276775402664725e+00
1.858806901235859232e+00 2.200853115959428230e+00 2.184723870449034600e+00 2.125988361466032206e+00 3.344189006387773055e+00 7.140355975575887193e+00 4.233734750235489628e+02 1.446854050037205297e+03 7.265505833111969878e+02 1.292771035716074834e+02 1.015801761056270038e+02 1.712020086547158826e+02 3.377121783681083684e+02 4.543068516311820986e+02 5.516956022415581629e+02 9.148157331018571767e+02 1.741244622530444303e+03 1.575320505283586954e+03 6.798120310560300368e+02 2.177836905514560044e+02 9.254468829439038018e+02 1.654559850400716869e+03 2.097647103015148332e+03 2.088195333012083211e+03 1.798558868230855524e+03 1.554429370805230064e+03 2.345454830658924948e+03 4.187394165470557255e+02 1.350031937657736236e+01 5.609514337599717848e+00
4.591613036540885595e+00 3.712908197956962475e+00 1.965688605320370375e+00 3.195249930275807060e+00 4.381271338501105106e+01 2.252468091853749002e+02 1.254980216290465250e+03 1.034381684690368274e+03 1.047666539516013927e+03 5.450450674729572711e+02 2.121087357589987050e+02 6.295571458590857361e+01 6.178679080266728363e+01 1.440803609186774281e+02 2.983935124281660478e+02 1.270155705359419699e+03 1.150242783430643385e+03 1.177271832604743167e+03 1.819895884469310374e+02 2.953113355761903449e+02 1.022256097702997295e+03 2.151306880162952439e+03 2.596934136286186913e+03 2.594621429004434503e+03 2.104360201656708796e+03 2.048909910646355456e+03 1.961561521450432565e+03 1.559314717761998281e+03 6.910196628315945588e+01 4.458930103459641003e+01
2.079625450970953526e+00 5.980340721808373061e+00 1.148953424647494259e+01 8.466191255157242779e+01 2.035778142696042039e+02 2.958370168416157640e+02 9.369942131329752328e+02 1.185105401518851522e+03 8.372822703197120973e+02 6.660693608698464914e+02 1.451708765946123094e+02 1.502196319738675356e+01 2.231267388823297537e+01 5.707337980527371712e+01 1.138904326402226843e+02 6.178636544890754294e+02 2.059214114224221817e+02 5.794551756163559730e+01 1.720148566792098777e+01 1.155537522038259794e+02 4.212647938353065911e+02 2.141648815735321023e+03 2.602942160264697122e+03 2.594893896398843935e+03 1.831372253532211971e+03 8.374780359498188318e+02 1.363369286390864545e+03 9.370021744519142430e+02 8.434837495974009869e+01 3.262187195574091447e+01
5.397847037163919026e+01 7.431353131853092009e+01 5.335857098130622944e+01 7.223468540930072379e+01 1.877155532173129870e+02 1.122883138549005366e+02 5.899488736608456065e+02 7.792795584011748815e+02 7.387282014570323554e+02 1.737856340722000823e+02 4.376730528843845036e+01 9.358720160198773286e+00 1.567740839517225382e+01 4.193744727584558518e+01 1.522133237010733922e+02 9.394460773792471286e+01 1.511263061190017254e+02 3.940047271488476355e+01 6.636458837634246777e+01 2.908457170134263947e+02 1.463398562049319708e+03 2.606579418480333970e+03 2.651749044626505111e+03 2.362603428053192602e+03 1.716130323685374151e+03 1.209708221027138052e+03 1.152047201467096556e+03 7.766061042659528084e+02 6.954438706678563165e+01 2.438032515557061686e+01
1.614896235702955209e+02 1.619400836004110715e+02 9.194566352115177210e+01 7.420748349141362610e+01 1.097092157154129239e+02 6.245400462307470946e+01 3.683562626649539880e+02 3.428813905131129331e+02 9.741841573368078855e+01 5.064778705676121007e+01 1.682831972961925970e+01 1.305213096256830596e+01 7.385479023309937219e+00 3.782371869414044685e+00 9.114742513624307207e+00 2.884831729585550519e+01 9.201792836221181915e+01 1.878864435644222226e+02 1.628906201158889928e+02 6.638044936271674032e+02 1.663514880277809425e+03 2.233914772878531949e+03 8.504963204113632855e+02 1.168279735060219764e+03 1.390793250063288269e+03 7.390391879072176380e+02 5.322549208158299052e+02 4.357425946506741639e+02 1.583820798927853168e+01 1.418821646780821233e+01
1.373543022797065305e+02 1.731483617243175104e+02 2.852761654163231952e+01 2.237187334524671201e+01 2.114926720797410553e+01 3.382188070137060265e+01 5.046236390234611946e+01 1.326773195848999976e+01 1.782538122607468978e+01 2.669941210428630640e+00 3.385214093545646730e+00 4.986012773075046312e+00 5.191860071085566908e+00 1.715850301112054410e+01 4.527552301876159646e+01 5.568833263962549154e+02 9.615453477738174115e+02 1.255641680701780842e+03 7.750528875252625767e+02 5.289928853353883369e+02 3.380924468587762135e+02 1.102746246241519117e+02 3.929564708251987781e+01 7.689963982443524060e+01 2.539467341701940200e+02 7.943162555008072445e+01 6.924205606009516600e+01 2.316695488607473408e+01 2.622806714630170788e+00 2.149177708129684561e+00
3.026646676168846852e+02 2.510688402970932316e+02 2.985944603511035211e+01 1.443067465627005319e+01 2.406099116497405532e+01 2.004369093000461532e+01 3.238643349687102813e+01 3.639276345076638552e+00 3.185586598934365021e+00 1.326344156161496812e+00 3.042802742335801724e+00 5.562086790887789789e+00 6.955995396687002952e+00 3.480173168144115436e+01 5.352484482811283328e+01 3.170085191082644087e+02 1.048795134158285919e+03 1.777478403309018177e+03 1.834551960128606879e+03 1.445072905647772586e+03 2.747699407162748457e+02 5.471983903645684677e+01 6.210005514609475341e+01 1.419906748012102184e+02 2.950513171550163634e+02 8.174021740568238670e+01 2.982292999941421385e+01 1.100549591399339633e+01 3.393492549475735309e+00 3.032715153400111330e+00
4.024928635329846998e+02 5.447929103815413043e+01 1.620760023196162081e+01 5.846300672732100523e+00 7.430338156083398538e+00 1.732090796858303250e+01 2.333697771003847521e+01 2.737929907681644348e+00 1.558179372853645717e+00 1.733678564560382718e+00 2.975027800930136301e+00 4.925180369974555106e+00 5.229459549371062721e+00 2.689123539469193958e+01 9.789402780246783209e+01 4.457817045614912104e+02 7.900543530272022963e+02 1.661288227565227317e+03 1.913937009906340336e+03 1.470792275947046164e+03 6.527388209529972301e+02 3.346306362764322984e+01 2.172953151661736726e+01 4.494268416878281869e+01 2.484544116807107912e+02 1.431974574350541616e+02 1.251025470069172485e+02 2.300274523019465178e+01 3.218923210348671127e+00 2.369436837245152194e+00
2.422091810595138099e+02 7.852262490651803262e+01 3.196387153811572546e+01 3.207585261434017099e+01 7.862135537567769461e+01 5.692814967488946110e+01 2.462126710469404856e+01 1.058744453662212948e+01 1.647702919279806721e+01 2.063701898989294392e+01 1.860647520684996614e+00 2.039851141407826862e+00 2.982395570714040378e+00 6.271208100123257800e+00 3.549123561988665898e+01 1.361812243627887256e+02 1.267671559153860130e+02 5.016671224650665977e+02 5.956506523493295617e+02 4.649528681868166586e+02 3.449238133574336871e+02 3.979023350193523356e+01 5.655965561331879776e+00 1.089292560022479073e+01 4.768492361745948926e+01 1.175520819017191059e+02 3.108330273744378474e+02 1.691648076655491195e+02 4.069600226616638672e+00 2.900853913542411178e+00
8.791675543915525282e+01 3.648252855855449184e+01 4.074356246626010147e+01 7.362956348725464295e+01 4.425686231042232066e+01 2.095421407397088132e+01 1.006109119870223623e+01 7.430916466065367487e+00 2.449814156783362407e+01 9.118219427460829252e+01 6.008026441941820117e+00 2.017316731741733538e+00 3.213280377495777884e+00 6.528434509393594709e+00 2.895259582390868047e+01 4.866337596647034047e+01 3.088316439223927290e+01 1.426062716614090320e+01 2.106756056877881633e+01 3.545808706671451205e+01 5.715515039289269339e+01 1.203366325129716330e+01 5.867429676458361776e+00 2.964031616545413783e+01 7.163628162765678553e+01 2.517279326766217906e+01 8.529558264371594589e+01 9.190605514239626928e+01 3.156518829650235247e+01 4.602160483928551926e+00
8.923088964456037786e+01 7.486206924066509316e+01 3.813909669156440430e+01 2.994904252384767318e+01 3.066235521588188817e+01 1.215035819258919503e+01 8.395680634319990787e+00 9.053391389473517847e+00 1.040238371092426206e+01 3.990007512857975058e+01 1.091108591625788904e+01 1.009929152646071593e+01 8.987227546610231599e+00 1.046633445328617640e+01 2.841108637815495186e+01 1.875816916706830995e+01 1.212924839407891575e+01 6.985460323773853730e+00 5.942360820639557950e+00 4.380803583665513479e+00 3.337868189535038610e+00 4.710813149337016448e+00 7.313381989902257629e+00 1.796369683484591917e+01 3.100483991052394117e+01 1.464949528171130666e+01 2.295333010999064527e+01 1.471548724167309175e+01 1.436886028636854817e+01 8.965155698434605469e+00
1.211416499272623923e+02 6.601449512199783953e+01 3.923008726623221776e+01 5.738654306259437021e+01 5.552883647915032839e+01 3.185054707468392365e+01 1.138043729370523636e+02 9.079440042698475111e+01 1.396204309800346977e+01 9.735579051452642574e+00 3.366458644983228332e+00 7.529792266329908834e+00 2.109646937976850722e+01 2.194722772233049568e+01 6.404172405506571408e+01 4.570162309079658058e+01 1.389396898616609732e+01 1.595357736634510992e+01 7.140851870860855044e+00 3.017584901998684010e+00 2.685156589889713175e+00 4.032233048841206369e+00 6.186675268514452597e+00 1.893107234185393040e+01 1.903828850498240755e+01 4.473062960373002994e+00 4.886588431658615228e+00 6.161754384858370237e+00 1.965679580855935882e+01 3.984844586053946092e+00
1.628956620085541545e+02 1.474175220355703004e+02 4.681940820012019344e+01 1.713350854301533843e+02 2.191346685619428740e+02 4.365361251830022411e+02 3.069119366372414106e+02 3.671721425540123818e+01 1.375895659946664473e+01 7.651625060142189128e+00 2.188396922362898067e+00 2.663108888295456111e+00 3.153584526618492312e+00 1.202093392037716768e+01 1.435847425182927495e+01 6.230333016854964434e+00 5.908779680427505454e+00 6.928605947768277318e+00 9.211649596167083232e+00 4.853341401492904161e+00 2.606157250996489871e+00 3.548134906405842059e+00 3.994656700176014930e+00 6.588668637915630732e+00 2.022513258200996944e+01 3.120509338890681938e+00 4.443660594654453178e+00 7.263865922040496415e+00 8.677538571115695376e+00 1.719084677616736201e+01
8.923013951365817320e+01 2.329447645717999080e+02 7.342064709993643135e+01 8.433584116461435087e+01 4.466493388014788479e+02 4.956341740003948644e+02 3.443242012519248192e+02 2.481214737142796167e+01 1.806058863326914121e+01 1.639044174886004868e+01 6.490569962979615859e+00 3.114739689017473445e+00 1.908515426883167887e+00 3.192817629813542446e+00 1.469609448794460249e+01 4.161409982006247787e+00 1.435736740556858848e+01 8.311135560659892008e+01 1.410036278977932511e+02 1.876287112555435854e+01 3.585168004736166036e+00 4.548591336882379821e+00 3.879517594886598530e+00 4.227198232408500012e+00 5.527001437469026612e+00 4.179790980251802957e+00 4.854714702120541681e+00 5.981453715878103594e+00 8.047718146260223193e+00 1.967463601741910040e+01
