9.168431590580209192e-03 1.342098600536742459e-02 1.070674791083761797e-02 1.337255488522073529e-02 1.008389055795933485e-02 2.205482757202845492e-02 2.195089170221376645e-02 5.954818556027066667e-02 1.080567176714575806e-01 4.832102663096595613e-02 2.826156261741336745e-02 8.375573614885060969e-02 5.223851771323246435e-02 1.420234807439293284e-02 1.387381011568327056e-02 5.567419666995813282e-02 1.109905821083319137e-02 1.771088249350922031e-02 1.632219870762645700e-02 6.224534930248100222e-03 5.340596903247340176e-03 2.570801751901086521e-02 2.023600064915362373e-02 7.824515095420309096e-02 5.378086801468562328e-03 1.179350902398533241e-01 5.563120511080302255e-02 4.863027668753890607e-03 4.598202477242297782e-03 5.726877056863282321e-03
8.739900101876300897e-02 1.574918338208412469e-02 2.639855015989019463e-02 2.148394510452445241e-02 1.489877423257197735e-02 7.007146519091160541e-02 3.503159591338579626e-02 4.397423582908459305e-02 2.729299301373646486e-02 2.234238447007881948e-02 1.945071131687167026e-02 4.366157950851802527e-02 6.252815848443901703e-02 1.168230102275149944e-02 1.377106237258042022e-02 8.785088705333553641e-03 1.103925766057074764e-02 3.311683090458600320e-02 2.532911000716410455e-02 8.422343078703965757e-03 9.663339719791330662e-02 2.447704866725981115e-02 5.238244490807505982e-02 4.525896740305984656e-02 3.981958015215222163e-02 5.309087086843208153e-02 1.925383222169311376e-02 4.881039522850719528e-03 6.904990573584730666e-03 6.859803780198865837e-03
8.661206557859495170e-02 8.689513858997190143e-02 1.735159929352782515e-01 1.413723138576322425e-01 2.994715422612078126e-01 3.207684666929252332e-02 7.298832298350144132e-02 7.641471833251560486e-02 1.052777611802891145e-01 3.086299916165593030e-02 8.345908928178297215e-02 5.937441908931560125e-02 2.193865807816290994e-02 3.338573200795792034e-02 6.314804631115453551e-03 2.646204212360346586e-02 1.615136773243884549e-02 3.041021754600380794e-02 1.021573612916737150e-01 1.882615328761269233e-02 6.076289272395431901e-02 2.017180333062319406e-02 3.155712417969834538e-02 1.097914848886490623e-02 6.484583442513023981e-03 4.267207348805496930e-03 3.805089079079887384e-03 2.984419719796747687e-03 5.075255145792064923e-03 5.671918959071093995e-03
3.800390504116786528e-02 1.089229707212849840e-01 2.390752074769772473e-01 1.934747317344938933e-01 8.338806943799006999e-02 1.357478513047634741e-02 1.426403193003581045e-02 9.153315307702880946e-03 4.997283600078197136e-02 3.842823516110771553e-02 2.388607688953028885e-02 4.782677844720151228e-02 2.175031611948149979e-02 1.965779246946506437e-02 7.182325852924564824e-02 6.287379368226742038e-02 7.391266391029059461e-03 1.170536370848114342e-02 8.295385615840023680e-03 7.344134004966791293e-03 3.715269527652515641e-03 4.076213176938859456e-02 1.401560735994292206e-02 2.734580670920570139e-02 5.279636545947022711e-03 3.799775213195323402e-03 3.261775115667229878e-03 3.079113783038556814e-03 6.220332067430544946e-03 6.724239534241097452e-03
2.200948868523649668e-02 6.871806251939285848e-02 1.920476537718237842e-01 7.449727754607560204e-02 4.676834962357998005e-02 8.390220864866493322e-02 1.547993806596622939e-02 7.999843323761725300e-02 3.108087254340027514e-02 8.862864795823119368e-02 1.050008150702763238e-01 9.603947870042468804e-02 1.577605896819299011e-02 1.904253747894271015e-02 9.394718976423142853e-02 3.807096483515272356e-02 2.545493593275053451e-02 1.129748109627785706e-02 1.815294707659509052e-02 9.819839107052778446e-03 7.322636422227518996e-03 5.324826795739785734e-02 5.142341645709079881e-03 4.327276950020193802e-02 9.546697345306861052e-03 5.125956161762272936e-03 3.571382505626550293e-03 4.095903831843834830e-03 6.354016202905077813e-03 2.317472311843299035e-02
2.569746259752757334e-02 2.745857942003184990e-02 1.140133520189841321e-01 8.690384239976357839e-02 3.702667891404202299e-02 4.861005743523797579e-02 6.075788257793804381e-02 6.379305025621574698e-02 5.343641176912627272e-02 1.308743169743137313e-01 9.967727064901055201e-02 6.073679998347730757e-02 8.285157839928225521e-02 3.083237728602210986e-02 2.550456898829367089e-02 4.277641210617117579e-02 1.453216378728179430e-02 5.615408468899367456e-02 9.747445662359063845e-03 2.995767086433253831e-02 3.977366025245888947e-02 2.466435605354157234e-02 7.155651815476735469e-03 2.560466647968525147e-02 1.430014103246586912e-02 1.353396096955991786e-02 8.491718342549222157e-03 5.790042039175244230e-03 7.556785012246499712e-03 1.343963606589708079e-02
4.669259851742386253e-02 6.980055145797467442e-02 7.033041203463266666e-02 2.763761973373822858e-02 1.331641994922416576e-02 2.396363151584448431e-02 3.882369327746103965e-02 2.139867477507493079e-02 2.265343947900877800e-02 2.566069179257473090e-02 1.945743834423904403e-02 9.825635533094680477e-03 4.683688027946474736e-02 2.200347267738709048e-02 1.265771221547239839e-02 2.121516782135265608e-02 8.134156705162666132e-03 5.310769484184815759e-02 1.560501956647643296e-02 2.173393730430934340e-02 1.211561680574106681e-02 5.452143789042572519e-02 2.546989255342143113e-02 2.402166884150566672e-02 9.787015154023281580e-03 1.015807842039635756e-02 9.003402808786116832e-03 7.660891887009056885e-03 8.636246692068371561e-03 2.025374207378774841e-02
7.902801164468653203e-03 1.509076623721178345e-02 8.067317078425480584e-03 1.631617315281696720e-02 2.402048114145280758e-02 2.671014576619621175e-02 2.313181371410755194e-02 2.131107500517836692e-02 1.655217279098537830e-02 1.004558861651271180e-02 5.483973606826001573e-02 1.487327488548376847e-02 3.960403691093331013e-02 1.442785914977913996e-02 1.617079436384013039e-02 2.903142399322606454e-02 1.505421038551670032e-02 2.046935800047644527e-02 1.803315080265406947e-02 1.425237410587745432e-02 7.866712433330853849e-02 4.651780331954825931e-02 1.874050566476329754e-02 1.572800075043867887e-02 7.502189878812791889e-03 7.773559111024530913e-03 1.197422029881010756e-02 1.342193707859505418e-02 1.273504035886355475e-02 3.655594300244589118e-02
1.830869855291496900e-02 1.213795103929407940e-02 7.031059137794516342e-03 4.048142969362997917e-02 2.775251493166179528e-02 1.160328561082604910e-02 3.654536075804529216e-02 1.671036821436965372e-02 1.382372753706764303e-02 1.478781499281003366e-02 1.193278127042488208e-02 1.666982044566662699e-02 3.495796034508673322e-02 2.526224219285711989e-02 5.225122536309712712e-02 4.356306757279269914e-02 1.316735693038550113e-02 3.672373082651756576e-02 3.638988086207925465e-02 7.490223778931103492e-03 2.125698048707773055e-02 2.215112514707097413e-02 2.396957990888949966e-02 1.563918394431359701e-02 9.118122253388502227e-03 1.268390299632420233e-02 4.477864220703332843e-02 8.022621737181673263e-02 1.074366891160967973e-02 4.847760985048741797e-03
3.085855016132435513e-02 2.033951580336421094e-02 3.186684107356636125e-02 2.971585527759709050e-02 2.885158332698240652e-02 6.419412187211724630e-02 3.126040510066491890e-02 1.334067783698845468e-02 6.304221647014170149e-02 2.301948109417333715e-02 2.142980989743265008e-02 2.093789249896530966e-02 4.444626878577141726e-02 5.027395600469852094e-02 2.445804811360243955e-02 2.655012755813549244e-02 1.369988398721479206e-01 1.399210230472867911e-01 5.888160544249922829e-02 3.106332605219992021e-02 2.766160563542702233e-02 1.742345138414586742e-02 1.980261363880549824e-02 2.162206025931750347e-02 1.196727508643695079e-02 1.422755435092787173e-02 5.897853069980598349e-03 8.678882564126598476e-03 1.121704385961331228e-02 5.862010098691266408e-02
3.410690392007872940e-02 1.767024819982396938e-02 3.184478875694102956e-02 2.552109123348467179e-02 4.030628766668684082e-02 4.033697522124354146e-02 3.849146735489656496e-02 3.458756326853280189e-02 2.328232138695680506e-02 1.363763478104800843e-02 1.720906482847371910e-01 2.878244711865811101e-01 5.973824728060809219e-01 2.944555492738377134e-01 5.417179243558283702e-02 1.066467197442731579e-01 2.006978145516040979e-01 5.591600337633621798e-02 1.566388833767982935e-02 4.665007942709939459e-02 1.942994980744373532e-02 1.715573211528594738e-02 2.190813242736671176e-02 3.038921666785527817e-02 3.217109538869460800e-02 1.671110434979324391e-02 2.459691833423458332e-02 1.809843752648844159e-02 1.636412102604684407e-02 1.178962167020122971e-02
7.170598528477577227e-02 3.904121858962342900e-02 3.584985599106529919e-02 2.899317132388979507e-02 2.429859911965048802e-02 6.325553529609430348e-02 3.010522886377112184e-02 2.068121962564777733e-02 2.435036055685756498e-02 2.544503613983331580e-02 5.312240345536265590e-02 3.496401445523746876e-01 6.224545172842914642e-01 3.237153245330893214e-01 1.168088197925380156e-01 1.325054590702044177e-01 1.472128009220581013e-01 8.705893319633668803e-02 2.544573985001215288e-02 1.075751198142073511e-01 1.881973347803689994e-02 1.895326771012917008e-02 2.217257102447953501e-02 3.928560823304017707e-02 3.698449909840644673e-02 2.603915620901335604e-02 1.974325726567724773e-02 1.759907376885247454e-02 1.891305905966651421e-02 2.013033110148699720e-02
1.672098275873471276e-02 3.931428633504932546e-02 8.580022429813125018e-02 2.705216496667661730e-02 1.539486187661774121e-02 5.137345377012429715e-02 2.935943533852134954e-02 2.625509169052100272e-02 3.341063778174604981e-02 1.356516624512422650e-02 6.357829235429410253e-02 1.134101689462118229e-01 4.643815357045828485e-01 2.010955794685851672e-01 6.371960107289881270e-02 7.440743230462279478e-02 2.754553623471698437e-02 4.046257721828735998e-02 5.151671860286050758e-02 2.074216499903867167e-02 1.823305712858305783e-02 1.978215229293147845e-02 2.457677172192671705e-02 4.043034030144484342e-02 5.073580695582739775e-02 4.440352013791894203e-02 3.242448448203635869e-02 3.005081882749809086e-02 2.601048814864436592e-02 2.126719959002629917e-02
1.419475578518346673e-02 3.898534277755924538e-02 6.035146338292132762e-02 4.132809096713641051e-02 2.383980456354589314e-02 1.097252717759546886e-02 2.747186272376668167e-02 2.175842342289810438e-02 4.665772366780463615e-02 1.502917066409586826e-02 5.322831860397027326e-02 1.855743881137309273e-02 2.124556803379237246e-01 2.920822655820144442e-01 3.155073648596161129e-01 4.314904533826954824e-01 3.887136764398702038e-01 2.525312332843221430e-01 6.901676953991242591e-01 3.212616183511173840e-01 3.175288644572962782e-02 1.191222365142077244e-01 8.779874565973645739e-02 1.989683202678867863e-02 3.914421657099078494e-02 3.381799350574775376e-02 8.740515178735525081e-02 3.186526909764871712e-02 3.573466016867894723e-02 4.076319570822227456e-02
1.338813117743375969e-02 1.295752741110923340e-02 3.104263503227894933e-02 3.613221752812809801e-02 7.839816679013723866e-02 1.956864582255928020e-02 1.478347960652569813e-02 4.159631186737314940e-02 2.981041271117381222e-02 5.773798666121505996e-02 6.306043471066424475e-03 9.273994211185347669e-02 1.936447534330464904e-01 2.488977484512037985e-01 2.272071050028116601e-01 2.773190391968916035e-01 4.739000279352962863e-01 8.198213203290244389e-01 8.345279506196162655e-01 6.517700232814236383e-01 3.133891590456309995e-02 3.516803234204510242e-02 3.063603267678023656e-02 8.392851105835991143e-02 1.104322268338542301e-01 5.580997428318738018e-01 5.498671359594754504e-01 1.175893342906419031e-01 3.676034647071453609e-02 2.782766116193077788e-02
1.247136801771489729e-02 1.321006044390537690e-02 2.580185221441584978e-02 2.715143537619976039e-02 1.759472741379825358e-02 2.111391910130015065e-02 8.184765515691843490e-03 2.163420220075576786e-02 4.654402941531925880e-02 1.661972035027624306e-02 1.715092063908248143e-02 1.434354920251169202e-02 1.121970411594786915e-01 2.282714384085630377e-01 2.136433646172269385e-01 3.286782073310978713e-01 5.703365883207480724e-01 6.939359393697134282e-01 4.008820709092387746e-01 8.685746405614046262e-02 5.156717055440621783e-02 3.509754799426353378e-01 5.084356132435010611e-01 8.392154173921335669e-01 7.770134252540616959e-01 1.000681170284700272e+00 7.900078550810977207e-01 2.325684708421117686e-01 5.314714928988452380e-02 3.090634929177755660e-02
1.616864124179289916e-02 1.836367786736071983e-02 1.718159865841404482e-02 1.548611600701890224e-02 2.249865694806073985e-02 3.949018115366014631e-02 1.293171000546230465e-01 4.252323781376421974e-01 2.072619447961311923e-01 3.547562010859833803e-02 2.635818520168204185e-02 4.126667223375726085e-02 8.178950849996577399e-02 1.203858553405983689e-01 1.588255111100519701e-01 2.844426930594944891e-01 6.144279369186236295e-01 6.180212635515214270e-01 2.922407808387346151e-01 9.980085277784978004e-02 4.259568941742326031e-01 7.659268205821432307e-01 9.737726024944786118e-01 9.807920400100361702e-01 8.481756804975749686e-01 7.224153566630122647e-01 1.053168625367297162e+00 1.858963054585277275e-01 6.930334218989024631e-02 3.719262408150809940e-02
4.048009361581450527e-02 3.173047099981615021e-02 1.528302135042264483e-02 2.128231111109488496e-02 1.442934056506994626e-02 6.493482345604280337e-02 3.548270104767484168e-01 2.885070453833109005e-01 2.833496239998848920e-01 1.419668001469716612e-01 5.440446337653824516e-02 1.481295878762907414e-02 1.444983596050412704e-02 3.507650547450380518e-02 7.852774685647948005e-02 3.576594536678009417e-01 3.764571674487645625e-01 4.378398977589758045e-01 7.622571704109763757e-02 1.339717614627100317e-01 4.693893007816421492e-01 1.003259835816087575e+00 1.220951676063661839e+00 1.237245431614472091e+00 9.995167731608175510e-01 9.491386607981630030e-01 8.711298189376597279e-01 6.899090764242010732e-01 3.308799493862654706e-02 2.211934524685586420e-02
1.588785792790567766e-02 4.393200672669192453e-02 7.655791753903007368e-02 2.710636898832467778e-02 5.266310805917529675e-02 7.316430600029710796e-02 2.302289908025946519e-01 2.874688736109061171e-01 1.965690674695114160e-01 1.529747255208609991e-01 3.534055622121627660e-02 7.962643355196027950e-02 6.146436091605523427e-03 1.514620981486987199e-02 2.820799071938463395e-02 1.631624774422558710e-01 6.224510136815306766e-02 1.986307076510896580e-02 6.668782084674492079e-03 4.831906016208557114e-02 1.816670307485742097e-01 9.547727729876893665e-01 1.190606870827579211e+00 1.221772874260355746e+00 8.755285521329777554e-01 3.994705250913081485e-01 6.409684990328944343e-01 4.345881376037054045e-01 3.897689404106146477e-02 1.511909890920728333e-02
1.806176795632648616e-02 2.546328951326687698e-02 1.664229950383725939e-02 1.930047335441514855e-02 4.196274108677933851e-02 2.409866638498164501e-02 1.233569958070516587e-01 1.587318915325257873e-01 1.453941086683846751e-01 3.420515106862648258e-02 1.104130131712912147e-02 5.433648575554555354e-02 9.256946370995515483e-02 1.212074443319631663e-02 3.652423244072902642e-02 2.329027770011533882e-02 4.172085467439122508e-02 1.234569399689208063e-02 2.330351184314617685e-02 1.106574973163121089e-01 5.886939314240838828e-01 1.097287639715404772e+00 1.158878492948135941e+00 1.081744991319609106e+00 8.170920285784923909e-01 5.898313851220718940e-01 5.654816553768411413e-01 3.881932485616773620e-01 4.494564586552386026e-02 1.683213964367165014e-02
4.453633329245519634e-02 4.169520101295844799e-02 2.175088569609013797e-02 1.592252072767484303e-02 2.104114432830041931e-02 1.130150131729604213e-02 6.512215772687929283e-02 5.781398158266809473e-02 1.594831878664718441e-02 8.771526792828705441e-03 4.225981222661577726e-03 8.263877386943363490e-02 4.561715528283008525e-02 2.064959100376900780e-02 4.320900305700413335e-02 6.491378718264769615e-03 2.287649622512059541e-02 5.238580966929947541e-02 5.067880810737367125e-02 2.261206472981338034e-01 6.077664730399424675e-01 8.639628202869432672e-01 3.449151137643701737e-01 5.100635553298126235e-01 6.508566463665614865e-01 3.643428412687074180e-01 2.692072195795033318e-01 2.300985385666532435e-01 9.242772387824810254e-02 1.007500809529271873e-01
3.622393585374946573e-02 4.255220048502591362e-02 6.989558988026728023e-03 5.015538505255127608e-03 4.256735058251912181e-03 5.626117820469627058e-03 8.278873976203653465e-03 6.113676667074360860e-02 2.786089207310033997e-03 1.466308039017973769e-02 2.166563422365044150e-02 3.443784935358669419e-02 3.197163731280471682e-02 9.736938823017456113e-02 1.115469385157855445e-02 1.184064214878902122e-01 2.247150507389173157e-01 3.271737788587366080e-01 2.247680953337063137e-01 1.681081389572038620e-01 1.163277997775856859e-01 4.059797690341362952e-02 1.543015449653625457e-02 3.316289402320785062e-02 1.190224361098920075e-01 3.979136566856887602e-02 3.983554460033000150e-02 1.658323556547361757e-02 1.770846281457840593e-02 1.656758354178809386e-02
7.739678884814688020e-02 6.339615076934923543e-02 7.821314352253061139e-03 9.323739605697706212e-02 5.518774430896511776e-03 3.627646156290969745e-03 5.789762542188523625e-03 2.157292680642134558e-02 2.033740313204354319e-02 8.822728711863160600e-03 2.219890409786882610e-02 4.038823192851193067e-02 4.134061948470189179e-02 1.012756217831033666e-02 1.293240198237366988e-02 6.927025334101635790e-02 2.556429411122908002e-01 4.797912743131803603e-01 5.462262986776986740e-01 4.683682742934264231e-01 9.640844832776178375e-02 2.087554484134913554e-02 2.537387447755826489e-02 6.248837845037770455e-02 1.382280322509762405e-01 4.053571157838691680e-02 1.675870998568483594e-02 6.425945890905004898e-02 2.427821862434061465e-02 2.338375119098990915e-02
9.776547283409259270e-02 1.323733484681408924e-02 9.426058403220083370e-02 3.895940927720998453e-02 4.950293526933399052e-02 1.093778702131803920e-01 4.313099047249387488e-03 1.760978142187721862e-02 1.025282880787341949e-02 1.171192404064868436e-02 2.123285820801618443e-02 3.561680995074105460e-02 3.098767482833790499e-02 6.990368421439487751e-03 2.164100225315871220e-02 9.974879917330455037e-02 1.950010422147291922e-01 4.521193467943538380e-01 5.720234775302753816e-01 4.793625154998916726e-01 2.315685062377813574e-01 1.390175565119558705e-02 1.020535071364525419e-02 2.171436807594428336e-02 1.179149893143519728e-01 6.814031064625403200e-02 6.596932384424444851e-02 1.513411216227805722e-02 1.950740391863189580e-02 1.760381558973315649e-02
5.453004654375939037e-02 1.805331361749424116e-02 7.365938064568062528e-03 7.268187827125064358e-03 1.594156064183638311e-02 1.091706812905327874e-02 4.746618275792852289e-03 6.862780393387542255e-02 1.037073937503745769e-01 1.326670256690356542e-01 1.251285704595243679e-02 1.480357837349922413e-02 1.864901175699009220e-02 3.482116252188149214e-02 8.650601114144850640e-03 3.105301199307437116e-02 3.250353631344569949e-02 1.391397880754034755e-01 1.789695497009544944e-01 1.492596973470241284e-01 1.311116659746000557e-01 2.027879726378197661e-02 3.353376396081539368e-02 5.424209206160730129e-02 2.153105059712520294e-02 5.182248723363842846e-02 1.391315922636670310e-01 8.591467643481781602e-02 2.200373662900105901e-02 1.914967995395135472e-02
1.953439868882599420e-02 7.854119478189537998e-03 8.475440055457552496e-03 1.451108025095966710e-02 8.157518235038740961e-03 3.824122798066765128e-03 6.640673309319339301e-02 4.856245794277880279e-02 4.468715355412652274e-03 1.721296818447276555e-02 3.999787103861213861e-02 1.459228787424609458e-02 2.136558715538485267e-02 3.716110741199263323e-02 7.807599044791509180e-03 1.379453035548551879e-02 1.182924451185993382e-02 7.916691526673516610e-02 9.987625613230816796e-03 1.616715640042011570e-02 3.032757885753675775e-02 7.630812286563631863e-02 3.673499529548509418e-02 2.484391407247161024e-02 4.780947451607463206e-02 1.245505448677408124e-02 5.586958484604006431e-02 8.578970752167357217e-02 5.013885962563211646e-02 3.051613635603725450e-02
1.980323143475551731e-02 1.609766409554230088e-02 7.931333241763193279e-03 5.886450163389248848e-03 5.637059238892185367e-03 8.021903602633026487e-02 5.517377103892866924e-02 5.807219592333662944e-02 6.394915888769878154e-02 7.344394734259192259e-03 7.329536306034574455e-02 6.668812703003278164e-02 5.327045659970260083e-02 5.284950580033127149e-02 7.307007650215979928e-03 7.274035158514202508e-03 7.007244385424302169e-02 4.458180270302135317e-02 3.923760222927471369e-02 2.939262983796011100e-02 2.319980073368157342e-02 3.300368720957840701e-02 4.760035731764092337e-02 1.035228815506963884e-01 3.822265992016807279e-02 7.758439424438355603e-02 3.149012193057058873e-02 9.270802352727135209e-02 9.587307076852238930e-02 6.279104493951229160e-02
2.691738030871630716e-02 1.420860084169259241e-02 8.156821327244326986e-03 1.126478421232139128e-02 1.018537191053857198e-02 5.604844101640346632e-03 1.938239885205367968e-02 1.540233736716255589e-02 8.813179835171788823e-02 6.415903454931931593e-02 2.341121346448671314e-02 4.952190263320924851e-02 7.734235000422387714e-03 8.188549279160118460e-03 2.421640907814755217e-02 2.335198949914800426e-02 7.988108409535255028e-02 9.685146555004324476e-02 4.448188285235695622e-02 1.969003496325779853e-02 1.887176112457448346e-02 2.889031662390375427e-02 4.233995765922113352e-02 1.216206209638551472e-01 4.039252810817400841e-02 2.888097919107113221e-02 3.406984978803895975e-02 4.421233811940835506e-02 1.439131800204911105e-01 2.926170762608822085e-02
3.625601467883979301e-02 3.177855646070305851e-02 9.735731195236642030e-03 3.360168690291216037e-02 3.937347041065677317e-02 7.436085698115958709e-02 4.971778079170344894e-02 6.259093441152483762e-03 8.871162429556851692e-02 5.193929610041751049e-02 1.548321059017725848e-02 1.768443120469884861e-02 1.913591012332430119e-02 6.777649927249278228e-02 7.923013459515969303e-02 3.372789058061725215e-02 2.839637997834171604e-02 3.111483345816642293e-02 4.176076404552129390e-02 2.412091192144647650e-02 1.706643540260522132e-02 2.539363952665777205e-02 2.823903565561652895e-02 4.497044679989038729e-02 1.386941970142900327e-01 2.216536409533680779e-02 3.315447595176920087e-02 5.432177640601466156e-02 6.527996581022740830e-02 1.288035866010557584e-01
1.988281405036918664e-02 5.010262010680853473e-02 1.508242862094579841e-02 1.623286797121885686e-02 7.913278950644458964e-02 8.365777388351601507e-02 5.550993259072220520e-02 4.152936578081601118e-03 1.184024218717527194e-01 1.119972690829637574e-01 4.587530855781809386e-02 2.289168768284735242e-02 1.363806136210317550e-02 2.144535566604487478e-02 9.760060189521273244e-02 2.554154632225866597e-02 6.960320660790465797e-02 4.082139127968220649e-02 6.104859328572586480e-02 1.305948964791380472e-02 2.393745127410412329e-02 3.363793601476282313e-02 2.897725132890826075e-02 3.098685140601802404e-02 4.073735374202706871e-02 3.142796038244285300e-02 3.752653435616087191e-02 4.624056230041183324e-02 6.203915755028805573e-02 1.516985631819226243e-01
