1.007075602580704242e-02 1.474544400243600444e-02 1.292422520657450155e-02 1.643969240796250286e-02 1.248839846100167905e-02 2.738244002852683809e-02 2.697529163028802163e-02 7.256114387227155516e-02 1.315054728684942609e-01 5.984253670970898081e-02 2.831633108777766722e-02 6.557966109272424585e-03 3.865761023808331285e-03 1.428453457374467134e-02 1.653841237650442719e-02 3.622992277120991745e-03 1.260053244693593033e-02 2.164059481397723889e-02 1.926562359613523748e-02 6.672336776575944241e-03 5.324359347284142278e-03 6.811899269629161091e-02 5.285525477548300849e-02 2.258734241423065222e-03 4.153538269848215843e-03 3.087544572344210446e-03 1.401594593582895787e-01 1.240206795129583130e-02 1.179215172169926183e-02 1.476763686914754105e-02
7.899579354819649679e-03 1.733223167247296623e-02 3.134477388536659193e-02 2.551638686902775108e-02 1.779168050127047720e-02 7.974962841246983902e-02 3.792092049029269218e-02 4.702612554397177236e-02 3.054366174339655585e-02 2.598871977568728911e-02 1.870460353900260317e-02 3.697990786216986438e-03 4.943893171892766933e-03 1.130324627713893623e-02 1.575859775897135370e-02 1.018232094911753448e-02 1.243379136301929130e-02 3.982573540745115714e-02 2.952848963691470305e-02 8.751724894349144010e-03 3.085348620906912601e-03 6.390678057271330370e-02 1.343142492661063003e-01 1.177964346602793227e-01 1.020479287252814837e-01 1.346161689776275705e-01 4.720660286748945556e-02 1.226335549064672646e-02 1.751948644333869987e-02 1.760515660168177760e-02
9.663707908104635091e-02 9.702359056064138731e-02 2.054253136397287682e-01 1.657194712415448468e-01 3.544482597786851041e-01 3.618560674505266056e-02 6.782639403673377740e-03 7.198406087227743333e-03 1.155549030144190220e-01 3.470282541724459963e-02 9.301891472021520113e-02 6.197694905531314635e-02 2.289941449049216066e-02 3.385688373554690545e-02 6.507708673084011339e-03 2.768872784274466897e-02 1.831372614021939058e-02 3.673813479659331083e-02 1.200252805437688891e-01 1.964709380003900122e-02 1.850408351000322341e-03 5.205668457532271198e-02 7.968331318295668320e-02 2.767950171626029632e-02 1.630578031573237316e-02 1.071010711497724643e-02 9.466998482973833576e-03 7.525924259626461631e-03 1.282947923111453330e-02 1.457015541244635788e-02
4.477738708646025745e-02 1.256440383695813789e-01 2.761576848048385990e-01 2.213236238731425831e-01 9.177715589731762214e-02 1.424976471230628497e-02 1.140734488075081932e-02 7.601937520107988379e-03 4.646885505935363821e-03 4.285174908021611301e-02 2.732127414563013945e-02 5.453980829468212110e-02 2.479663275428808586e-02 1.667721489927329742e-02 4.907287360338829715e-03 3.744700873374735926e-03 7.720764070386561782e-03 1.416758574010691836e-02 9.930078598464807393e-03 8.359517502938996342e-03 3.735924368091139008e-03 1.189875352455008611e-01 3.736002043141908174e-02 7.153403016765283451e-02 1.317088277532621476e-02 9.599027023583613788e-03 8.145657650216877460e-03 7.758069772802861884e-03 1.556868012060122312e-02 1.724652390866684287e-02
2.590617374913638943e-02 7.844531629142446894e-02 2.184275987886535320e-01 8.459753525626616255e-02 4.888049165699377696e-02 7.161691635802510010e-03 1.104938225085068566e-02 6.180533267035052264e-03 1.742255386669966932e-01 9.869440172642794662e-02 1.223962408511894417e-01 1.049595706560121078e-01 1.553184754237832074e-02 1.284196746764575993e-02 5.958066390051216729e-03 1.537392494866026971e-01 2.314139649850646685e-02 1.315270865445047031e-02 2.106251100670285259e-02 1.192043959229601401e-02 8.065967787801131897e-03 2.192173486082513167e-03 4.669085461957718508e-03 1.196074937458871112e-01 2.358323282254641204e-02 1.269289391989937912e-02 8.707222999476221109e-03 1.020390753018946169e-02 1.587262070876797188e-02 5.993804183923599760e-02
2.586806445683457675e-02 2.646393689080771966e-02 1.184169804235138401e-01 9.464843740800303606e-02 3.762731491010590928e-02 4.054606748299386526e-03 4.990156974173451040e-03 5.399012934735306427e-03 5.083398000192536348e-03 1.526251857934998457e-01 1.188262645794746497e-01 6.296537996361413481e-02 7.160653567018628561e-03 1.337999970199721667e-01 1.033938024534311051e-01 1.714716085493307174e-01 1.291885463454280417e-02 3.357996530650485603e-03 1.090516803653759220e-02 3.733089718507887761e-02 4.460755693534838862e-02 2.585118605673418501e-02 6.237501087158232350e-03 7.188819271760707452e-02 3.515600284403258557e-02 3.299430211847903527e-02 2.021725300632571873e-02 1.421172748482621255e-02 1.871631127019729099e-02 3.489545499642542764e-02
2.201932946661401269e-01 5.540957241485016012e-03 5.850292719028681206e-03 2.962469815000374346e-02 1.418844945805882753e-02 2.373570700950198079e-02 3.648941508353112373e-02 2.108744095290613491e-02 2.533153206206740712e-02 2.936585756016858034e-02 2.256214764413649182e-02 9.337746212841431179e-03 2.236206756009121999e-01 8.827061817222602025e-02 4.697488710757592029e-02 8.459003474069208550e-02 7.364564715634651024e-03 3.501748876865841929e-03 1.798317696970363339e-02 2.455028262373493836e-02 1.107421663135930295e-02 2.574256237477835167e-03 8.400853371600182362e-02 6.517875692385614872e-02 2.393305046654499099e-02 2.438683749142848620e-02 2.092772818767320991e-02 1.864870049179922704e-02 2.178615524822873767e-02 5.397913582224683066e-02
7.729839234096886474e-03 1.395972165572712496e-02 8.134017394629322606e-03 1.748030561850830167e-02 2.667847869501415239e-02 3.012062372196756821e-02 2.700026382761112204e-02 2.575545175374491583e-02 2.093048063854566904e-02 1.173410506448341849e-02 4.733157677034388611e-03 1.468809989232115233e-02 1.842962997145614901e-01 6.184472055610035213e-02 6.389469472994360744e-02 1.191424567186686739e-01 1.512007143760263697e-02 2.428787393516256693e-02 2.145463650897872290e-02 1.525643931708273691e-02 4.073904916124113790e-03 1.477603044685058264e-01 5.060047268833536838e-02 3.925701353565654028e-02 1.832503921950539780e-02 1.908041125285547118e-02 2.910910714026977708e-02 3.757595691662127257e-02 3.852184048805052524e-02 1.171430606025465754e-01
2.066357135636462394e-02 1.341666472986611722e-02 7.819482785329689295e-03 4.503602540838719942e-02 2.903764363663223491e-02 1.229433834934307718e-02 3.994695908671794943e-02 1.805030266025731134e-02 1.527500807692340999e-02 1.510662800854998405e-02 1.351511546390369092e-02 1.789897446499082515e-02 3.906081960553148269e-02 2.538269006742245246e-02 2.328202650298764609e-01 2.149928215984252822e-01 1.476862126112243011e-02 4.489011560335767759e-02 4.440025928151283829e-02 7.404212356668963754e-03 8.398020717390353163e-02 6.594481566443838316e-02 6.301836603248799074e-02 3.858837765678449494e-02 2.218094534142822996e-02 3.387945130852638292e-02 1.262846550435495208e-01 2.705229004337932758e-03 8.426092985980940600e-03 4.487655861486672913e-03
3.496547970773694614e-02 2.264809596666866875e-02 3.589664400200864858e-02 3.316125249136699094e-02 2.883457554763250302e-02 5.675764743717419056e-03 2.643708526405574161e-02 1.126166063649058219e-02 4.729789216355682370e-03 1.102832687249381549e-01 2.603072525933227896e-02 2.537405376323787626e-02 5.381235861550277833e-02 5.844774745229505686e-02 2.799918749064308349e-02 3.067729195286653457e-02 1.637381805305804239e-01 1.692718489949416039e-01 6.798029078633037459e-02 3.021528893025379053e-02 1.047479049466207707e-01 5.035431772826846897e-02 5.197858750026859015e-02 5.445960511483833449e-02 2.958534755954153952e-02 3.792602138841015547e-02 3.693544531340098216e-03 6.802146120459279070e-03 9.052777846960497962e-03 2.531983996758690146e-03
2.938583845156264931e-02 1.528651848748611985e-02 3.393651435929938981e-02 2.857435560765572702e-02 3.599663616020300910e-02 1.993741377097620338e-01 1.696518631693834100e-01 1.494250121622897054e-01 9.486036608335014775e-02 1.327842787028415961e-02 2.083290698347654013e-01 3.466324671959583603e-01 7.175000422052630888e-01 3.561787060490609891e-01 6.617617161645276969e-02 1.296451005700264836e-01 2.395727248531628606e-01 6.607498864473346223e-02 1.576715606889426621e-02 2.098342776339377491e-01 7.233528998361643536e-02 5.067455752318711371e-02 6.040781843324434519e-02 8.214843837403429383e-02 8.617170601128562590e-02 4.635252532023689809e-02 7.305771626421150855e-02 5.943180562252056709e-02 5.393691286237574378e-02 3.913596004048007504e-02
5.440223141797771549e-03 1.838135460406561394e-01 2.794999951040408326e-02 2.717515242127692757e-02 2.100195332266618226e-02 4.780651614143776110e-03 1.144465922177311246e-01 7.417669421857418788e-02 9.254639737414274703e-02 2.621332729354742402e-02 6.360545331153380499e-02 4.145628968332747966e-01 7.430601476642906267e-01 3.863522177546502290e-01 1.402213376182867843e-01 1.577875824537663674e-01 1.735755203146612524e-01 1.024230774619502848e-01 2.524921699574894651e-02 7.108632841562999988e-03 6.716160618387387315e-02 5.982213736230995726e-02 6.780063082014563258e-02 1.201604561385478803e-01 1.142256449107068306e-01 8.098857564340816717e-02 6.177974286049109365e-02 5.616248950296358344e-02 6.012364021557382171e-02 6.438701106522871920e-02
6.054370888875333645e-02 1.561530920606812034e-01 6.508536566426303960e-03 1.836529135508128269e-02 1.191636537127047091e-02 2.277633529858840433e-01 1.175104567147977619e-01 9.893235986483647770e-02 1.255419761457216565e-01 1.324598370831895494e-02 4.421252061202845390e-03 1.340295112669649957e-01 5.608523867252438455e-01 2.383443770187596844e-01 7.464287863028296055e-02 8.567600166846602028e-02 3.157414875056006875e-02 4.632650512061269737e-02 5.280874128375118159e-02 1.978439805639577859e-02 8.080053891580211978e-02 7.269282454574207963e-02 8.777030158299546636e-02 1.508472812261859863e-01 1.981389185573083356e-01 1.867066624607405245e-01 1.384703343777756168e-01 1.251243894388847921e-01 9.469623942863567012e-02 7.270643822008376889e-02
4.812892503863527849e-02 1.385096303172267396e-01 4.288161240653354418e-03 1.868466421232113650e-01 1.110498590012959641e-01 7.149622892653875739e-03 2.400032626893172649e-02 2.015564288274328264e-02 1.825559859771774818e-01 5.641405743835230246e-02 3.271850171868097637e-03 2.202010823498092712e-02 2.580972632781727283e-01 3.437560886350268796e-01 3.624550031330242006e-01 4.826016954816204629e-01 4.335759076305160109e-01 2.807709057185532320e-01 7.655859276682941417e-01 3.579775315756950627e-01 2.973976359673776576e-02 8.630784103323489373e-03 6.447681555116602237e-03 1.629937555891882231e-02 3.801059827673986674e-02 3.563140957141902598e-02 9.759064756404407792e-02 3.136878433839547509e-02 1.536313967905187650e-01 1.476978252911368417e-01
4.308081757818581214e-02 4.340387476427856606e-02 1.213021395952001702e-01 1.486249938550394945e-02 5.381356790634490503e-03 7.926894953245824937e-02 1.600181964318624084e-02 4.595161819808821907e-02 3.086315129759652220e-02 3.197548563931401286e-03 6.852495508448270579e-03 1.086689044785285885e-01 2.290419659997915414e-01 2.867086046081954720e-01 2.560460641980717988e-01 3.057097744268454376e-01 5.202080314426719143e-01 8.977340285383093033e-01 9.161153476519745542e-01 7.289594602306503912e-01 3.148476699042753596e-02 3.316478404376255879e-02 2.939106525862481001e-02 9.262845685296772213e-02 1.333787697418867269e-01 6.834207540341952214e-01 6.857040476336996315e-01 1.368804424472805648e-01 1.791191817164857758e-01 1.071543821613319958e-01
3.748316976078541057e-02 4.105412419992213180e-02 9.589158915093795588e-02 1.076251450813947852e-01 7.216085446358261324e-02 8.267955120151784798e-02 8.762447533617510886e-03 2.454633226279823860e-02 5.082727280061098696e-02 1.828711518947132367e-02 1.892839454959345524e-02 1.649034317046312037e-02 1.277221605815981875e-01 2.576147945140936368e-01 2.395918712715279786e-01 3.648428632237706304e-01 6.278741865251752374e-01 7.623685588797721735e-01 4.432083437120106773e-01 9.792889497511363117e-02 5.940047649357982351e-02 4.108180459821625941e-01 5.989984032578405948e-01 1.009206702694835700e+00 9.487316784198692732e-01 1.237118428651007962e+00 9.969007750323816142e-01 2.847093275758153519e-01 2.816641021391091959e-01 1.271868836929223034e-01
4.526206870044042346e-02 5.272079187961282304e-02 5.331196698402661249e-02 5.190400684694918693e-02 8.059173493657903475e-02 1.690087240612378749e-01 1.426634910484693985e-01 4.753189993407169744e-01 2.319602472235745005e-01 3.973815298032663812e-02 2.948557518305745806e-02 4.584200315735469100e-02 9.051287662863044536e-02 1.335009323147619831e-01 1.760604955394891313e-01 3.154734671913451693e-01 6.758841997565394610e-01 6.847164090264181713e-01 3.275155383071549631e-01 1.137193070891520247e-01 4.924876828319525446e-01 8.941561782625875310e-01 1.149665737797787246e+00 1.185504362781758969e+00 1.047142117111006465e+00 9.076520678387229868e-01 1.351550156998583940e+00 2.363494932904157964e-01 7.500418997619747244e-03 1.786767523538294877e-01
1.083180087894530241e-01 8.574839780984501447e-02 4.593834507217938595e-02 7.411630531034382741e-02 1.375848207107261377e-02 6.960980002785399634e-02 3.865981964331569598e-01 3.136279149127689236e-01 3.083320756487500924e-01 1.543176350379192319e-01 5.638409836502687733e-02 1.513831693082698035e-02 1.482923816832183023e-02 3.837364499658054567e-02 8.663852653706172191e-02 4.008665136729637757e-01 4.193651441147774883e-01 4.929448133560300205e-01 8.643322150177221164e-02 1.537587582226488669e-01 5.465546774656294682e-01 1.184234442965813816e+00 1.468568218938622882e+00 1.529155006578612808e+00 1.268209354461554472e+00 1.228032467137485595e+00 1.149263505428709697e+00 9.111798258059822242e-01 4.043760710125088309e-02 2.666120772598136804e-02
4.882670300430591581e-02 1.363409300937623581e-01 3.583207626900314358e-03 2.486977017314365504e-02 5.549004589520356578e-02 7.832801292889129963e-02 2.461732438676810242e-01 3.051602136781960684e-01 2.091402165258138268e-01 1.623878000556743251e-01 3.410659823433476873e-02 3.338965684266509068e-03 5.094051189702923990e-03 1.451249522798424285e-02 3.176177960314988807e-02 1.893176966616093582e-01 7.210440999243246385e-02 2.318308988617861360e-02 7.792781236971383849e-03 5.658476025595379072e-02 2.144780243135017417e-01 1.139616202973273484e+00 1.444408776857101451e+00 1.517824378731516433e+00 1.113844721173315344e+00 5.189456257477979007e-01 8.434983098610867591e-01 5.789873651550191402e-01 5.221152178370379315e-02 2.061185961702071204e-02
1.780394028157659264e-02 2.264211904562251493e-02 1.509938685165991210e-02 1.865080754082912642e-02 4.378566357155302957e-02 2.500025574199579020e-02 1.282274506783265267e-01 1.642417150574271567e-01 1.510814851096705658e-01 3.564781485826851171e-02 8.960595010850509745e-03 1.891555780724675506e-03 3.344308294299035058e-03 1.004054117737555180e-02 4.047070981416980850e-02 2.766355225718481262e-02 5.046302261123573191e-02 1.491593074129925547e-02 2.788240795046158932e-02 1.311425191994976813e-01 7.010477611839260881e-01 1.324024450724254010e+00 1.422120469060504044e+00 1.357563042453578506e+00 1.048542846792921868e+00 7.721811348735100333e-01 7.510114716747773311e-01 5.060298906738456282e-01 4.556172560822370488e-02 1.621936771735008748e-02
5.047365094886479414e-02 4.576672226073949523e-02 2.342605726412792105e-02 1.673093263756452592e-02 2.156558493941317448e-02 1.146307813758734931e-02 6.490547504517060751e-02 5.741320090731259762e-02 1.569100973842538563e-02 8.554018519489765479e-03 2.958917758631686695e-03 2.360156279815411699e-03 1.296435654163778373e-01 7.131860828405374442e-02 2.266645644176340599e-03 7.925652610685247207e-03 2.818125660566278903e-02 6.399020918052548967e-02 6.126042844463494563e-02 2.717912794701302648e-01 7.377317963939437062e-01 1.067657708081055201e+00 4.347572557349740352e-01 6.548733764615000119e-01 8.488926877054787656e-01 4.827978824393728274e-01 3.619442146587961151e-01 2.972826110282311696e-01 1.089700327995461911e-02 9.850552286080517181e-03
4.096916596008367412e-02 4.673524923818234145e-02 6.846787805110067168e-03 4.692179588399503047e-03 3.803882988625976840e-03 5.621195136026225711e-03 7.966376730181258178e-03 1.970994820991617789e-03 2.534755474037946130e-03 4.107548967006884044e-02 5.334306533844423992e-02 8.056478049243735728e-02 8.912977675301639313e-02 3.664020064415571872e-03 1.086829075678734380e-02 1.470264848083453479e-01 2.782487184273227387e-01 3.995830371312448781e-01 2.709009083012789976e-01 2.033424254054559677e-01 1.438373711872104888e-01 5.149906745802167868e-02 1.991882957066908044e-02 4.299644281535203866e-02 1.562422757185418232e-01 5.310801064115198283e-02 4.928534663905171503e-02 1.666112532796805781e-02 9.605648431910766838e-02 7.859901104742890443e-02
8.677409256792158188e-02 6.634101048088140995e-02 7.086310647038024033e-03 3.013948082878419640e-03 4.349104249625087432e-03 3.360297279388485808e-03 5.154910317820438764e-03 5.570759763283831406e-02 4.741607734503434923e-02 2.038849776512163467e-02 4.805150087563823252e-02 9.037658080070758160e-02 1.205397920014976421e-01 7.484077889114724991e-03 1.299559758826175637e-02 8.554848486981277145e-02 3.086096410105734211e-01 5.706009834362451016e-01 6.417134485279375467e-01 5.579862042699361702e-01 1.198341765230154649e-01 2.692155669101620186e-02 3.344816215554344274e-02 8.173183581080789573e-02 1.821392647736204407e-01 5.382489566663076902e-02 2.075732337457726270e-02 7.843420015704070242e-03 1.248479486478104861e-01 1.122519888463736348e-01
1.088985388632282003e-01 1.376455668184021694e-02 3.744124995141510145e-03 1.060046734245045225e-01 1.253843199292138666e-01 2.903971088280570337e-03 3.714134081420865721e-03 4.175759362381223361e-02 2.326344577701944943e-02 2.672715759828601240e-02 4.709381847697564905e-02 8.002946466668874048e-02 9.098019014940686433e-02 5.778677838253325552e-03 2.397791228184501661e-02 1.224962116165747572e-01 2.341975094306369964e-01 5.337073896032412668e-01 6.658369279915123951e-01 5.657164272638535163e-01 2.869827512225965327e-01 1.675026537380027575e-02 1.199205891408691889e-02 2.588875138071655008e-02 1.489360530681440864e-01 8.918761479815025262e-02 8.061346829718996077e-02 1.525392386914178194e-02 1.116643217936837823e-01 8.609022379191036412e-02
6.082850233392589345e-02 1.865966454863711432e-02 7.112383991826537466e-03 6.470774876397307473e-03 1.415168386647816350e-02 9.592418881938657646e-03 3.935635410679557029e-03 1.615776763304295482e-01 2.361692827246293473e-03 3.108203337110043360e-03 2.932211533475325219e-02 3.289594295343932495e-02 5.160555872358522922e-02 1.182937671118253486e-01 8.636176125829540112e-03 3.755593098396390467e-02 3.762096840396608050e-02 1.599987490067918960e-01 2.041092970035959242e-01 1.767376922876991163e-01 1.518868213644177512e-01 1.997994262100046686e-02 1.781548367983606662e-01 6.089507566187849288e-03 2.690962228043760132e-02 6.716131503085751020e-02 1.808694091763384804e-01 1.024852359196306156e-01 1.330541192371824943e-01 1.009656429309689352e-01
2.179009740188161265e-02 8.560944871517430291e-03 8.965910126066491126e-03 1.475844817349214293e-02 7.941002545616155511e-03 3.530479596629056051e-03 1.585575543465112536e-01 1.133482821871660273e-01 3.501103366802019515e-03 1.367736384833186623e-02 9.434748266109352355e-02 3.237445604037780117e-02 5.514024319594225398e-02 1.225254072090162516e-01 7.011509924718047765e-03 1.341868507773935973e-02 9.254753731884751700e-03 4.599168891837316503e-03 7.264038175754294370e-03 1.339495406328414066e-02 2.448759484750112278e-02 5.730556048019157592e-03 1.785290742810097808e-01 1.556413367023975688e-02 3.810051584808564484e-02 1.357053009930241430e-02 4.703147095616903861e-02 5.309349487382544058e-02 1.898119723411369891e-02 1.553217406845185944e-01
2.209229843904247231e-02 1.756037853351514327e-02 8.388607749621959306e-03 6.009248832727845033e-03 5.510979854124082276e-03 2.052420279653403845e-03 1.324457657943640398e-01 1.380635719285649710e-01 1.542527246864028589e-01 5.988771932252489986e-03 1.701727237325114956e-03 1.625982929778890590e-03 1.537160712748841807e-01 2.178301444224211778e-03 6.801013500881886165e-03 5.114127567612706399e-03 3.603151250950501448e-03 1.666663259437978495e-01 1.476334939250593947e-01 1.135391967741567754e-01 9.030788678882985254e-02 1.318481752500344495e-01 2.096313137408915561e-01 8.693582237945161884e-03 1.573648697933991217e-02 7.760276350269799256e-03 1.267790665914559495e-02 8.506537252456385437e-03 8.642629429509371408e-03 2.999787758818152072e-01
2.993053687363290624e-02 1.545837871897064175e-02 8.620337139858106484e-03 1.152270943555285844e-02 9.974857677061922320e-03 5.372989869650981326e-03 1.818476554779116516e-02 1.363814997459131609e-02 2.002081934536038138e-03 1.494071239412264884e-01 5.286935929551394436e-02 1.205593539376181855e-01 3.796990118412486501e-03 4.567057090181589861e-03 1.533528446040063539e-02 1.244854860557579636e-02 4.114994410054263405e-03 5.094484340365449185e-03 1.764620749321268722e-01 7.702606527133165626e-02 6.995391783373228201e-02 1.067667501417505771e-01 1.660080911204915577e-01 8.356817604369105867e-03 9.169904940563966544e-03 1.356878734388547725e-01 1.531810593505787410e-01 1.952691114523741611e-01 1.179653181158566919e-02 1.311481219737804793e-01
4.013822116897765302e-02 3.441589960935668990e-02 1.023317292558540564e-02 3.428632891468229998e-02 3.919905446282910544e-02 7.330720767870703425e-02 4.894705020270762041e-02 5.516184003195635094e-03 1.978769651218271163e-03 1.174793028207653522e-01 3.443454129827110827e-02 4.273691434694570218e-02 5.405489657602613462e-02 2.503921461822935027e-03 3.439895583604741895e-03 1.339529850872724359e-01 1.326821453646473414e-01 1.607719243211619131e-01 2.202689789834838541e-01 1.205595634726613352e-01 6.541452150578608293e-02 8.859530123443730421e-02 9.928095944007121754e-02 1.749299098055247248e-01 9.225978257511797606e-03 9.389537728542707296e-02 1.391670549385806699e-01 2.281844311780487911e-01 2.690163925879600626e-01 1.064861651293461629e-02
2.178757380030098972e-02 5.389645000160828148e-02 1.580649970917051561e-02 1.669011323051300746e-02 7.982420402559096961e-02 8.405669982220885517e-02 5.604778518034773949e-02 3.848899258905235168e-03 2.714869287413939399e-03 2.604800404603193828e-03 1.062094394724563406e-01 5.234709495061590223e-02 3.412415066520130963e-02 6.178500340646971012e-02 3.771402192060548976e-03 9.276729217016464746e-02 4.580554896137526734e-03 2.936590846603734373e-02 5.478773277828169475e-02 7.678012310572525714e-03 9.814665191691797352e-02 1.238498607750387892e-01 1.050541650925862491e-01 1.208667936122908571e-01 1.682108630470338373e-01 1.339086719850491602e-01 1.615550447565388681e-01 2.001824226110943128e-01 2.621093270815496590e-01 1.334336113411370775e-02
