1.107714690935195437e-03 1.615147444019022008e-03 1.432582245434578429e-03 1.843606649422908483e-03 1.416477071446025065e-03 3.135971804033810435e-03 3.115634082765780279e-03 8.452899504571422667e-03 1.545276597443199021e-02 6.965876981323553853e-03 3.255544375153076979e-03 1.102352352457827839e-01 6.547841002201500171e-02 1.612953184996003628e-03 1.872193591973078056e-03 6.876450474470610641e-02 1.463005770704150100e-03 2.593934392314938778e-03 2.385709525221482805e-03 8.470426465263565389e-04 6.640766263845349418e-04 1.936930807906676183e-02 1.489777636659304211e-02 5.884510165306790913e-02 4.995007962725025227e-04 8.815515799727841051e-02 4.054054185141640898e-02 3.624000022878989119e-03 3.479075713044346534e-03 4.397610879418302650e-03
1.258048340857124692e-01 1.914614342775104771e-03 3.483091485986835635e-03 2.852330894126486535e-03 2.000659774287312336e-03 9.057589445390550401e-03 4.366990140055065917e-03 5.493350228583260969e-03 3.620094818795480552e-03 3.065744571523088859e-03 2.181168298387081792e-03 6.530268275099984643e-02 8.824962866004058826e-02 1.278430651142636442e-03 1.774351180603322628e-03 1.139064947929488121e-03 1.432752264766916101e-03 4.786147233400284487e-03 3.703518055723304270e-03 1.134480160686137133e-03 8.266533742345091862e-02 1.843448380936566627e-02 3.845618145592465120e-02 3.375675576945560974e-02 2.940828048883928347e-02 3.900306730106238573e-02 1.374200152848447168e-02 3.599293182071628544e-03 5.183007913220974427e-03 5.248607628820112919e-03
1.085704206214027634e-02 1.071305154866658560e-02 2.268807718492884401e-02 1.830909778557526443e-02 3.917799982537186615e-02 4.040889245627211045e-03 1.115294548491067295e-01 1.205200436853479662e-01 1.370325150471520502e-02 4.128010454547880771e-03 1.099198314754941050e-02 7.197281556536639507e-03 2.613932021909004359e-03 3.832001653669043183e-03 7.284794771772826888e-04 3.053651482097097594e-03 2.093413220450166066e-03 4.424570655889855514e-03 1.523722927221201132e-02 2.599234342287002741e-03 5.265955820029358248e-02 1.523183011928058543e-02 2.317737561959909431e-02 8.051668552775941012e-03 4.759143068028005505e-03 3.133453753734703577e-03 2.774031575273575891e-03 2.219092667866776405e-03 3.806167328633861500e-03 4.348664710854504949e-03
5.090433014814032923e-03 1.414249976056858836e-02 3.107809671477375704e-02 2.490194049325877845e-02 1.032425248730838366e-02 1.613920421162245294e-03 1.308795613965133475e-03 1.289889233591772488e-01 7.904832135445358232e-02 5.086424711813909011e-03 3.240530219512102652e-03 6.400783251683207428e-03 2.870956047347538245e-03 1.910783673131395775e-03 9.315464159301040104e-02 7.249727865361840773e-02 8.834498117793130592e-04 1.688399441011670474e-03 1.233421606951515910e-03 1.073738491609022450e-03 4.787464578960566293e-04 3.465411664528569857e-02 1.088335895100361883e-02 2.092010493209709929e-02 3.867764340144356789e-03 2.827202806049223475e-03 2.402972908959890609e-03 2.295345833588908688e-03 4.620244857585662987e-03 5.134287440893834861e-03
2.982764216913062760e-03 9.017035950733869737e-03 2.510230369750892157e-02 9.720165888570334728e-03 5.615082123977139725e-03 1.219053303509128883e-01 1.278850919671376592e-03 1.047194652816184068e-01 4.819653483975513270e-02 1.166154312349346883e-02 1.452884352416567576e-02 1.242923516501885824e-02 1.822847007077171583e-03 1.489503157710392149e-03 1.102295049014875850e-01 4.148762752053162389e-02 2.649807584989330098e-03 1.545347059384957755e-03 2.540309611478978706e-03 1.471397062940381362e-03 1.005704692141758247e-03 5.705982990371734342e-02 5.950738308900580366e-04 3.502460577005181430e-02 6.950938644995453136e-03 3.760167667425566226e-03 2.589384419460532410e-03 3.031006264644058121e-03 4.710391606964986488e-03 1.777327727402347110e-02
3.018066528945408979e-03 3.109462647209590078e-03 1.391084571915140317e-02 1.111622551670168879e-02 4.418158779946911030e-03 7.136704958243025865e-02 8.607200186940108799e-02 9.144821479924425400e-02 8.390655652407866261e-02 1.792464658696173857e-02 1.409693155230174258e-02 7.497138868456629940e-03 1.200177977228736592e-01 3.689974439639857884e-02 2.832406346952088400e-02 4.658434008754756828e-02 1.472273634985622748e-03 6.711002315694121478e-02 1.274005192363578988e-03 4.422643475477555305e-03 5.402232069659581790e-03 3.200122423019764739e-03 7.893067490486319667e-04 2.107390923647079611e-02 1.039691033205196458e-02 9.832887307802923998e-03 6.066438242426167200e-03 4.241896999700309721e-03 5.557510834613881359e-03 1.030902123987738166e-02
6.182984248735872573e-02 1.009840885842425012e-01 1.067268526135087131e-01 3.543011870681233265e-03 1.697151988076585002e-03 2.820744166601964024e-03 4.286249809655254955e-03 2.447348611581971495e-03 2.903499559703482703e-03 3.432514383495401458e-03 2.673899246151361861e-03 1.115280315837711197e-03 6.211203769379215756e-02 2.442777599678006353e-02 1.292465250433347083e-02 2.308000055428172104e-02 8.375368668703823873e-04 6.664254392579324615e-02 2.049425010767966064e-03 2.814474509166333197e-03 1.309641924735610412e-03 5.948289537680341577e-02 2.429652033114609519e-02 1.912411081059598589e-02 7.098381508483969302e-03 7.308467224621968510e-03 6.332009124344924536e-03 5.593178910872418155e-03 6.475018138834243500e-03 1.589144960361652675e-02
9.100843338682492595e-04 1.662977279275767821e-03 9.719145218122949171e-04 2.094465961717876992e-03 3.203199630412997736e-03 3.598372271697373222e-03 3.193137100015304604e-03 3.012510402194944377e-03 2.419200835344872090e-03 1.376840070758078485e-03 7.804110671906908103e-02 1.750953210002183149e-03 5.118700445822988582e-02 1.717870023053342382e-02 1.773161327368648690e-02 3.298919933171755303e-02 1.791337260984131275e-03 2.871370276741897886e-03 2.529250711214644717e-03 1.803691907334056908e-03 8.592001747144495383e-02 4.210231090964396128e-02 1.468751796323975248e-02 1.153469640154595327e-02 5.431241438077988662e-03 5.702527013249686708e-03 8.768111239523913164e-03 1.126973281863648257e-02 1.150077004092899674e-02 3.480211994849920221e-02
2.405716537870582726e-03 1.574420922636670826e-03 9.235716031940864601e-04 5.351233939637469773e-03 3.468891865440331367e-03 1.466781984064676001e-03 4.733412964605441739e-03 2.118707472210851206e-03 1.773510511743496597e-03 1.773268940830373831e-03 1.598142694717626620e-03 2.123811597200471989e-03 4.664554947174177207e-03 3.066634683469000519e-03 6.496102207411016960e-02 6.006337351335940683e-02 1.808926735887611244e-03 5.474819176506340486e-03 5.389589493173604570e-03 8.995544158037305314e-04 2.367666127634151380e-02 1.889439376680059068e-02 1.834549879664746155e-02 1.134182675165647941e-02 6.560665295220761278e-03 1.008374311843900084e-02 3.782709502700488946e-02 7.810387198598506275e-02 1.142878332867444929e-03 6.140067095865332520e-04
4.002756451224653671e-03 2.603588867785016584e-03 4.176902392397346953e-03 3.895299858663852331e-03 3.413641593473073881e-03 9.517237765792187221e-02 3.123921652131944789e-03 1.321776990956778424e-03 8.183936727129453859e-02 3.047901538283777356e-02 3.064043599882151567e-03 2.991497846604956358e-03 6.412064130123201582e-03 7.121928116578191137e-03 3.476902547993216373e-03 3.867209058496448061e-03 2.061617653100739078e-02 2.121183227497886598e-02 8.470293180198294053e-03 3.760826428945672484e-03 2.977119131185973142e-02 1.450525759278206359e-02 1.516942156170111855e-02 1.600169319545338004e-02 8.727468529117182738e-03 1.123627028419646803e-02 4.917456349311491361e-04 9.209790583160069096e-04 1.244530751439637279e-03 6.415366068127636989e-02
3.322176605581287842e-03 1.731366128870769766e-03 3.901775648054339914e-03 3.336856677088121705e-03 4.255194241454122658e-03 5.532842540864399417e-02 4.710148594003402134e-02 4.147887997278104644e-02 2.629425542721627873e-02 1.562059313325273036e-03 2.457194603433456720e-02 4.092281984407447615e-02 8.573997905785964158e-02 4.366758395760441530e-02 8.299115099600551035e-03 1.656660766682208075e-02 3.068522438235383315e-02 8.451245838268416077e-03 2.010928577154207607e-03 5.949667452504364684e-02 2.075508062916778945e-02 1.471081856875108146e-02 1.772426285259418033e-02 2.421959530765870061e-02 2.546967910702881491e-02 1.374272271688261118e-02 2.174295236982777893e-02 1.779673475774078140e-02 1.626246969667462239e-02 1.187526655736940995e-02
8.340999624728004380e-02 4.902450707911336358e-02 3.188255904782288236e-03 3.164159834772995242e-03 2.492435726761857602e-03 8.112110026732013979e-02 3.192804704808187982e-02 2.071148703148559603e-02 2.585836583165291788e-02 3.110134763087481734e-03 7.564416707550155640e-03 4.936492404851536286e-02 8.944027859766467969e-02 4.754283008823474016e-02 1.760943994656185424e-02 2.019025300425500088e-02 2.238045254741787005e-02 1.327268609801788082e-02 3.284828053411117596e-03 1.296251708998721608e-01 1.948724634502366562e-02 1.753923939229997536e-02 2.007988766166386371e-02 3.573676050977637325e-02 3.403595874255917197e-02 2.418608463094305133e-02 1.850225427480357149e-02 1.690555883624928965e-02 1.819294718167686203e-02 1.957334132892076667e-02
1.603061418515492123e-02 4.138231227973298426e-02 1.028209823978769588e-01 2.132972162859770281e-03 1.416886892739087529e-03 6.364541921803100466e-02 3.287964650581956527e-02 2.771924939219932299e-02 3.522315362189289145e-02 1.580828369005991179e-03 8.295428726002626596e-02 1.606915202431168088e-02 6.788215945677431029e-02 2.941836830817944060e-02 9.384393976171532051e-03 1.096236123787860950e-02 4.093540909645032588e-03 6.075987238630477932e-03 6.998799618530926123e-03 2.650207942497199119e-03 2.370333531816322392e-02 2.152141206831040612e-02 2.621883906813930742e-02 4.520896487003181474e-02 5.942735545402272335e-02 5.604301961314146763e-02 4.162279933231747414e-02 3.783081273454025339e-02 2.876299201927491611e-02 2.215192398483998085e-02
1.267440158536567267e-02 3.649473520641570434e-02 6.841084505777207669e-02 5.108217706397704533e-02 3.090778499275066010e-02 1.238500666821784890e-01 2.872755559194344749e-03 2.403277356743377564e-03 5.144864892463429235e-02 1.586479402469957029e-02 6.362544601322345228e-02 2.651042231017768439e-03 3.132963171341001524e-02 4.253022140064412898e-02 4.561594578821415169e-02 6.172852646846441194e-02 5.653328880192133588e-02 3.728071126307316852e-02 1.033554743743908266e-01 4.905865051771454710e-02 4.135320123565456099e-03 1.511277142510525362e-01 1.149469861375682078e-01 2.349593056384797519e-03 5.504192939341860137e-03 5.178219257481129698e-03 1.423557532291866955e-02 4.619509991555437525e-03 4.685976939436640315e-02 4.513417814847289766e-02
1.159748025593928394e-02 1.172425124938121857e-02 3.315317145559613932e-02 1.745115445670737502e-03 9.369350656882978468e-02 2.230633265068278706e-02 1.934359735266078352e-03 5.575232613502111370e-03 3.758298776362099802e-03 6.417736104230992167e-02 8.372835221536086264e-04 1.322988782618070291e-02 2.802255855279507657e-02 3.562201465028972530e-02 3.226633358423421777e-02 3.903963840752692344e-02 6.784758565912341055e-02 1.195276496064596183e-01 1.243203720580883798e-01 1.006523599043814415e-01 4.417628480013219977e-03 4.727670438685493970e-03 4.255580684967411043e-03 1.346346189098044863e-02 1.936289485047677089e-02 9.903254139088783770e-02 9.927313576254492844e-02 1.995817834350986641e-02 5.403386802495907526e-02 3.236426204181385574e-02
1.037050283892523156e-02 1.143313643337773473e-02 2.678080933481163245e-02 3.014109024491325173e-02 2.026219654937072220e-02 2.335475022996699040e-02 1.070772310345637860e-03 3.036872667247852813e-03 6.360028015812251023e-03 2.279078328759059826e-03 2.349525745688747606e-03 2.029895123978782846e-03 1.575042345924716064e-02 3.215539929315855416e-02 3.023318772318592251e-02 4.648445681876152424e-02 8.176130958597890852e-02 1.014598435246999025e-01 6.018362992726812577e-02 1.354809622369961344e-02 8.366121912387206386e-03 5.888409074804865084e-02 8.734664242196915618e-02 1.468683742548284599e-01 1.367632944989511101e-01 1.765732033240017818e-01 1.411511474943515643e-01 4.044189729742367345e-02 8.333989930967783399e-02 3.765346330701027644e-02
1.287154923220433164e-02 1.514338097834245361e-02 1.522809807737821736e-02 1.472914480901061675e-02 2.272780507147958290e-02 4.792512978932748913e-02 1.761115228418452111e-02 5.988053265716661994e-02 2.974580233570475046e-02 5.051605742266907471e-03 3.714179958442900310e-03 5.697936280559120006e-03 1.123447936446385700e-02 1.673126513819957889e-02 2.223729185053650165e-02 4.005454044529083157e-02 8.783645648416288365e-02 9.106412160575720616e-02 4.449094465381454866e-02 1.575933143100492762e-02 6.961084916487515761e-02 1.288125811230345086e-01 1.687322355175949751e-01 1.726236719745871118e-01 1.497824171367800883e-01 1.274981040984701774e-01 1.865702556774366805e-01 3.263371647204649229e-02 1.218721333323379841e-01 5.188832904474540569e-02
3.154188325491221606e-02 2.525891669507012577e-02 1.339376540805339161e-02 2.134192070997257759e-02 1.657279340320551471e-03 8.468534744012996829e-03 4.818205239816227003e-02 4.003034969969511414e-02 4.016556792932939046e-02 1.988970554762983095e-02 7.184686690761159233e-03 1.897530466585207022e-03 1.851738371046530215e-03 4.826501204722105989e-03 1.094377735292557247e-02 5.063127785526017749e-02 5.432226137447751513e-02 6.546183824150764163e-02 1.173598657261965168e-02 2.132384345112970161e-02 7.744708740186805052e-02 1.712978197504413103e-01 2.166494407421388491e-01 2.226152452299493822e-01 1.799117435146730948e-01 1.692195707235819024e-01 1.542110990733626119e-01 1.222938926699724399e-01 5.428504665794774142e-03 3.579844271591546556e-03
1.436337616263789856e-02 4.040585757835522818e-02 7.636708808791767278e-02 3.144605227891532004e-03 6.919593463076629050e-03 9.783187016316134688e-03 3.101372794555423695e-02 3.878070011422787844e-02 2.677602052286461379e-02 2.072400261778537672e-02 4.328633492992711024e-03 8.274384148713699594e-02 6.408687922906198880e-04 1.829854523318587365e-03 4.002235776656443839e-03 2.378343929761644882e-02 9.264546087710982814e-03 3.047880546265214693e-03 1.392749795927742951e-01 7.724739537284166374e-03 2.965283150520014663e-02 1.594958701768710574e-01 2.045982627474527138e-01 2.144964617397259188e-01 1.560562960099946550e-01 7.180766623472334409e-02 1.153880633236970404e-01 7.918852582023924724e-02 7.139600090168407749e-03 2.817975705377332406e-03
2.305969792158329111e-03 2.938459811443403825e-03 1.958237068438456983e-03 2.413871121129671123e-03 5.648607413978885827e-03 3.202881337610770374e-03 1.630313827322883019e-02 2.073200407271703211e-02 1.896680833068409983e-02 4.491661517841415673e-03 1.132544913022453300e-03 4.944077784099597250e-02 8.505265231550945826e-02 1.267843506763026993e-03 5.081312459052900014e-03 3.447782411677261655e-03 6.416802896999532907e-03 1.936379895167508487e-03 3.690458401744521090e-03 1.758818861181313947e-02 9.445351166640207630e-02 1.791782512411828898e-01 1.932939800630815164e-01 1.861524654860389205e-01 1.448617263164432289e-01 1.072535681505026317e-01 1.046339302952791761e-01 7.049004471694175766e-02 6.345644114978630894e-03 2.258578100754417197e-03
6.621221335993788398e-03 5.978357829431691847e-03 3.080880713428109808e-03 2.211528841596365445e-03 2.861487336925254855e-03 1.497665120366265369e-03 8.279036426998287457e-03 7.149537531027014975e-03 1.917424551574557550e-03 1.061333648096045171e-03 3.723642130168336927e-04 6.539162011982056766e-02 3.851627184999780601e-02 2.085649023517466977e-02 5.287683083076291646e-02 9.744919192817339242e-04 3.529457703391943816e-03 8.164390350553257097e-03 7.951964600531160124e-03 3.561116045324306395e-02 9.637352631238751965e-02 1.391000294740883103e-01 5.648635086871654776e-02 8.693020408918009090e-02 1.156395126571827803e-01 6.727306164133180222e-02 5.125351932027071011e-02 4.209064994156057338e-02 1.622555537890766897e-01 1.479430495291986225e-01
5.380658499383683679e-03 6.093544494798262476e-03 9.035745439029438213e-04 6.259161631740549044e-04 5.124825122764524628e-04 7.431764719137998274e-04 1.021376899177712377e-03 6.026355963013908107e-02 3.065141259766539401e-04 1.216193087988826083e-02 1.591991165805927561e-02 2.419530895375590629e-02 2.658626723040588211e-02 9.339706752110664423e-02 1.347878306761156244e-03 1.792111502992132024e-02 3.456206895035348475e-02 5.058341092738730810e-02 3.488326242876269717e-02 2.636663772507757963e-02 1.849941229807284399e-02 6.571801288861828932e-03 2.522390585231521452e-03 5.599071615624316017e-03 2.107842791057781828e-02 7.398716115818365809e-03 7.030165918458824298e-03 2.376046698123012238e-03 2.799011511385995216e-02 2.289396630345036723e-02
1.127230024795760135e-02 8.547656636577558725e-03 9.296312169319673885e-04 8.121354391242256721e-02 5.873381461541047352e-04 4.466864494041828250e-04 6.665989214215473687e-04 1.670220917985695136e-02 1.404512806012647719e-02 6.077287958251484899e-03 1.440503842832210196e-02 2.723569383807850422e-02 3.604130135323758283e-02 9.412862802540113497e-04 1.611981336432857879e-03 1.045190958253491668e-02 3.860232848615192253e-02 7.305777972581817270e-02 8.394266554306317740e-02 7.364186676378763063e-02 1.567078782649436106e-02 3.491225690989566491e-03 4.305313176098731799e-03 1.072898902350353199e-02 2.452823630083384235e-02 7.424032693678512748e-03 2.915564865779419340e-03 1.140625617418259408e-01 3.593022325214828561e-02 3.222952085637503794e-02
1.390256819471494092e-02 1.744376238820183854e-03 9.400990755202637272e-02 3.241418299812136306e-02 3.890458943241145023e-02 8.665752888125005660e-02 4.838438375501011280e-04 1.261002415784063385e-02 6.955597675579273942e-03 8.024433711503426575e-03 1.419373182141214773e-02 2.420818514618008205e-02 2.726852302712233500e-02 7.259747264967456818e-04 2.970827860438737290e-03 1.496168669146744762e-02 2.944261403346671788e-02 6.900462693652975599e-02 8.821024669399521456e-02 7.568790381949896950e-02 3.800013100872708105e-02 2.197537213080547405e-03 1.560569394231260416e-03 3.405788756935924835e-03 1.989402024068429725e-02 1.209071755155374100e-02 1.105074061823069047e-02 2.086412004514680892e-03 3.170404916527192613e-02 2.429256627660100754e-02
7.637925963037955207e-03 2.332863988237741763e-03 9.156600045929059149e-04 8.570751493435246372e-04 1.906900708628385573e-03 1.280236189576382504e-03 5.156398906786368837e-04 4.911539955894446419e-02 7.385225721665873710e-02 9.580724452156613724e-02 8.892700878657044603e-03 9.994263933897915356e-03 1.550319095953755534e-02 3.481376958633403823e-02 1.067798575977772866e-03 4.576855815942765943e-03 4.747772192707551235e-03 2.084701807588438052e-02 2.735853474741101882e-02 2.396259394981499827e-02 2.035465779661244784e-02 2.649151203400614690e-03 5.015718889897263777e-02 9.526488214311949754e-02 3.556166972727124471e-03 8.916561342186110975e-03 2.408483318356170050e-02 1.360343347036083693e-02 3.717955410898701740e-02 2.797135923676901184e-02
2.729753865902362093e-03 1.068476821819776138e-03 1.152585235709616346e-03 1.953844836959870920e-03 1.069234197815319750e-03 1.047200868776550498e-01 4.865960305465039104e-02 3.450485258715484116e-02 4.420915804060388020e-04 1.737567923007693471e-03 2.866141032543046557e-02 9.848500115054156789e-03 1.657390170873852125e-02 3.606446672869512149e-02 8.661792152919321926e-04 1.633868418662273378e-03 1.169673985896413533e-03 9.900546110499156005e-02 9.778164042081923663e-04 1.826247657602591331e-03 3.305598479710368954e-03 1.017805080755475461e-01 5.064951441998137571e-02 2.056749235106845094e-03 5.026651675932132350e-03 1.787632984488557019e-03 6.182590861814772284e-03 6.952057277765575499e-03 2.476142046952317655e-03 4.267587389841467904e-02
2.767076139154664178e-03 2.192244216868261507e-03 1.078692680304266498e-03 7.957361503870690215e-04 7.421148962822507727e-04 6.089097924501728903e-02 4.064321424141410788e-02 4.202504700383750957e-02 4.663245449006241800e-02 7.608536943382041484e-04 5.200646665868506602e-02 4.917666869816572639e-02 4.619416203504780882e-02 5.712224638410055844e-02 8.400701943559625833e-04 6.227338577801678479e-04 7.904136199452176104e-02 4.826231856879691778e-02 4.322139513122003063e-02 3.333818256856301704e-02 2.630735116196187412e-02 3.811377912187494804e-02 6.014954988431076011e-02 1.497123862598027100e-01 2.085766827810278407e-03 1.252244890480425643e-01 1.666490452557047681e-03 1.279767555117212186e-01 1.282744710132933397e-01 8.241608949495177194e-02
3.748100204135063757e-03 1.930332187100880243e-03 1.108821562574412905e-03 1.526167588384316895e-03 1.343367111969285665e-03 7.166714778436918034e-04 2.384042358225872855e-03 1.751551869567047988e-03 6.276291570689390698e-02 4.529927151983530187e-02 1.606140777231875733e-02 3.667575534789881825e-02 4.823540640596764512e-04 5.721434884773023361e-04 1.893964285579548658e-03 1.516390303979703227e-03 9.025087081514526766e-02 1.096086358831421248e-01 5.166659139909868248e-02 2.265355459667372715e-02 2.048885951862361790e-02 3.114288087212153944e-02 4.822482926462143271e-02 1.121999703138546779e-03 1.221424197286996019e-03 3.839199571559834961e-02 4.300814536587937997e-02 5.449242092386644143e-02 1.538798139114100523e-03 3.607015819341082008e-02
5.033904985672003722e-03 4.303253262422790035e-03 1.317438840182531389e-03 4.539969745333521933e-03 5.273863373898053306e-03 9.771112274945091200e-03 6.418640631179089659e-03 7.092669732414735861e-04 6.201088370884381973e-02 3.563684880549704975e-02 1.046242474366723338e-02 1.299889646234392987e-02 1.623656355228521309e-02 6.550204485640939711e-02 8.294130280062501914e-02 3.780873399968432552e-02 3.796606535661625759e-02 4.660847128229232694e-02 6.457868367402552767e-02 3.552756043440987582e-02 1.926828635936021772e-02 2.609004016341223003e-02 2.922751863426373276e-02 5.087995621399572788e-02 1.235213192301035101e-03 2.662612841666351510e-02 3.907069771838762168e-02 6.372333970487958910e-02 7.467191604261513849e-02 1.518457392983371679e-01
2.771425207176105368e-03 6.808792105870323935e-03 2.046262662418408401e-03 2.201489717084668604e-03 1.064121726941309048e-02 1.114341921619794312e-02 7.363482860462591123e-03 5.007918616314045680e-04 8.482651126797771668e-02 7.936034843304311248e-02 3.229472047225301345e-02 1.585862373461875696e-02 1.023007793713778639e-02 1.825720546023165691e-02 8.933376132802714475e-02 2.661569759834562371e-02 9.778622178130166875e-02 3.927352731158679881e-03 7.548913373458123778e-03 1.074760185764305539e-03 2.915348975818604291e-02 3.678549787084264833e-02 3.120042326102357225e-02 3.542627687456294250e-02 4.857462258997143761e-02 3.812752938109777862e-02 4.547306825909987194e-02 5.603655361137202529e-02 7.301634249150884548e-02 1.751613690242575074e-03
