3.469093682088340813e+01 5.228323137703583967e+01 4.518698981624301325e+01 5.711166629121267135e+01 4.136947627648800108e+01 9.137085111194261344e+01 8.669787372621439658e+01 2.421053076348044328e+02 4.318517241989416107e+02 2.051547195064202924e+02 1.000519401966814144e+02 2.443777647632783001e+01 1.465972124338245663e+01 5.743429031339198332e+01 7.140964500724673769e+01 1.700786917405414300e+01 6.434554330462354699e+01 1.237118539606973400e+02 1.263963233490273410e+02 4.900985145567359780e+01 3.895211945850658708e+01 5.631259614393469448e+00 4.374885214868354133e+00 1.777679536172927044e+01 3.530760134452127375e+01 2.847214828193455816e+01 1.354408397985761781e+01 1.207917642793781443e+00 1.168211893298900517e+00 1.495194792402663175e+00
2.810554471661004783e+01 6.861358892846347146e+01 1.240394101994149594e+02 1.054094677069039392e+02 6.953281145579300926e+01 2.937889013397507370e+02 1.168666875377219583e+02 1.623213804812646117e+02 1.003821419881255963e+02 9.588841280212480456e+01 6.598331466186355954e+01 1.567756308329392212e+01 1.986575884205068121e+01 4.993601945547669629e+01 7.167842320996778938e+01 4.949364212591963508e+01 6.685426571971240151e+01 2.377428255908656638e+02 2.049855755515578153e+02 7.007573824665341533e+01 2.469297459718014665e+01 5.560772705733810994e+00 1.181103891647531867e+01 1.082687093114922483e+01 9.922918512735217078e+00 1.387619318670936153e+01 5.142616215984863182e+00 1.298426245424171288e+00 1.825863221943438530e+00 1.811335047077781812e+00
3.048139695408322041e+02 2.115039602581038594e+02 3.373739484124097316e+02 3.230701307973196776e+02 8.748057080881410457e+02 1.339382964173532287e+02 2.178788864582489992e+01 2.503616092165260198e+01 4.008570373902912252e+02 1.400957912291186176e+02 3.064338073347249178e+02 2.852695770308096712e+02 9.190345662375813163e+01 1.682697260733483517e+02 3.226483797607950521e+01 1.447004752360446673e+02 1.050771974614582689e+02 2.359263519756157734e+02 9.037843476930320321e+02 1.719364502372109200e+02 1.631523870496738482e+01 4.803078150413515601e+00 7.487009199235115986e+00 2.725971076923361380e+00 1.712575024446473471e+00 1.205817427193642155e+00 1.151590951302938537e+00 8.631349211040513225e-01 1.404462447261618285e+00 1.519592746220991275e+00
1.663503856853787681e+02 5.641350199051948948e+02 1.357367639339843208e+03 1.178863442597593121e+03 3.843697853437445247e+02 5.775463744438893343e+01 4.017942089082674784e+01 2.718905214386729341e+01 1.833428883203967885e+01 1.759685321844288524e+02 1.301711518753279222e+02 2.540711880401857456e+02 9.833510403832104885e+01 7.849062764529509195e+01 2.334281032333364436e+01 1.875932848675551412e+01 4.159811635492283699e+01 8.344721616624912031e+01 6.701064041839994445e+01 6.450730820447108727e+01 3.067011993749324716e+01 1.091145646639537858e+01 3.501643815465859788e+00 7.085802178830391540e+00 1.364090134358526107e+00 1.063231390966065115e+00 9.811360731020832837e-01 8.743509002236631300e-01 1.663887465728657311e+00 1.729799347493866879e+00
8.739634294714200280e+01 1.582074593850804831e+02 2.761381753012766467e+02 1.076999622335510765e+02 1.290670228732701617e+02 2.601017331214560357e+01 4.030912166647032535e+01 2.272030294572169140e+01 8.928097081973096039e+00 2.192014484153907290e+02 1.998881914720998054e+02 2.887754195100992547e+02 5.721649059408922966e+01 5.564010541110911845e+01 2.716834191710103852e+01 1.029346220917696009e+01 1.140547311160077300e+02 7.046138651958895593e+01 1.258256108804069555e+02 7.864029050477026317e+01 5.838688259968272121e+01 1.747997115588712802e+01 4.017855550609995419e+01 1.134305502468922455e+01 2.329775813985546673e+00 1.348603774133931399e+00 1.008658098380330603e+00 1.096696607715783811e+00 1.604943309503128468e+00 5.641389630797142729e+00
1.034371391925286048e+02 1.235748898277427656e+02 5.572622422482563707e+02 4.417704243519274314e+02 1.638400182029385519e+02 1.620427153063592485e+01 1.854836192048689014e+01 1.999288089822317716e+01 1.914014288471580016e+01 6.509222437537258656e+02 5.206903069411589513e+02 2.563152011676935444e+02 2.806184441672304075e+01 8.438164902213383556e+00 6.681928819438445188e+00 1.110990683150552982e+01 5.975087848303829219e+01 1.634532658677660066e+01 5.695436598312157628e+01 2.076161166160841844e+02 2.752855317679754990e+02 1.781063291556677939e+02 4.713884738457353762e+01 6.382733769811696156e+00 3.315055931662032940e+00 3.370170226664981783e+00 2.265527841487060101e+00 1.466537536767337446e+00 1.806607746334026210e+00 3.105006475691911572e+00
1.328082347416980191e+01 2.084154039226874033e+01 2.079464779426050214e+01 9.977513837520520212e+01 5.444609871753574737e+01 9.337199628135824980e+01 1.366220340330081058e+02 7.748771236485416125e+01 7.645770068916051798e+01 6.335275601200260809e+01 4.100489238101627620e+01 2.627871752641507896e+01 1.272670271908077311e+01 5.194856879305118191e+00 2.749046057195480230e+00 5.287116001528665343e+00 3.250204311603772567e+01 1.578391161981749846e+01 8.359259988504986438e+01 1.187614992691391933e+02 5.953745014263822100e+01 1.557331015909135630e+01 6.527132242242320359e+00 5.424960508470903164e+00 2.149530564209621630e+00 2.398006358342976707e+00 2.278462926003181455e+00 1.854102793271311445e+00 2.006790435237200132e+00 4.549469640155610506e+00
2.597702436095481460e+01 5.035526482089092326e+01 3.138827111734952879e+01 6.962918691662991932e+01 1.074132101665450847e+02 1.160333433280563327e+02 9.936725073362561034e+01 9.445478100119889575e+01 7.867130898264603900e+01 4.422471652067688552e+01 1.739063417413688484e+01 5.080754239751004064e+01 1.032835152746768514e+01 3.442815499667415846e+00 3.550973362408211820e+00 6.998399476582061851e+00 6.102776770055626798e+01 1.007266823152884285e+02 9.265573785069220492e+01 7.008266687932797367e+01 2.090159680695348143e+01 1.043825190928465929e+01 3.762984738693065712e+00 3.103853179682218411e+00 1.547137703554371857e+00 1.730798094161049239e+00 2.885263259115757872e+00 3.497577523173222680e+00 3.333519970025856427e+00 9.308641753548290154e+00
6.420474647739231955e+01 4.341832258994084981e+01 2.686522363041295591e+01 1.604035099715401600e+02 1.073572597416437446e+02 4.535169898082546780e+01 1.455822185606177186e+02 6.523482971617443127e+01 5.602883099243636877e+01 5.437096751811566264e+01 4.806307447114691911e+01 6.281273220828572335e+01 1.384711250184270455e+02 9.149393376926428800e+01 1.362778643198773665e+01 1.217424356138355357e+01 5.374557442702833043e+01 1.692370093429821054e+02 1.768949180085053285e+02 3.202930323074066621e+01 5.519621581785024489e+00 4.480688987968079573e+00 4.534845071999916932e+00 2.929368056858020264e+00 1.768716391805547516e+00 2.848232250623933481e+00 1.150929597313311348e+01 2.244814590460068970e+01 6.199298992223450000e+01 2.925473384971996893e+01
1.039989419199384599e+02 6.873037501498086499e+01 1.169899399287232313e+02 1.149706351591362647e+02 1.060567211227525206e+02 2.104079138112511060e+01 9.751247317513814039e+01 4.181708980130341047e+01 1.808110374795349884e+01 6.819116851963133996e+00 1.078949978872713871e+02 7.692143896111414847e+01 2.102679808817419200e+02 1.857908238005613271e+02 1.062059829429381494e+02 1.013872236714996404e+02 5.551816551400055459e+02 5.978669410429083655e+02 2.588734539953012472e+02 1.263073023967867528e+02 6.681926542358889165e+00 3.305049443161311107e+00 3.618534955514490115e+00 3.961266463038756847e+00 2.236077710273441710e+00 2.967299046059745038e+00 2.923699387458890442e+01 4.868558029798300879e+01 5.852862876665311376e+01 1.482531908955364131e+01
8.838953906171605013e+01 4.661046112215107229e+01 1.088249890030300264e+02 9.448975491952874961e+01 1.296209154569083353e+02 1.229632308969008747e+01 1.044043401262988979e+01 9.173144047040622695e+00 5.866845485158189710e+00 5.571285120563176463e+01 9.811628045166128231e+02 8.608633663888695082e+02 3.383407676203774372e+03 8.688351732831150684e+02 2.621116266602167570e+02 4.028595545271841729e+02 7.833273791030186430e+02 2.216203248998281765e+02 5.712637563562100240e+01 1.235914783466667899e+01 4.404304869262952948e+00 3.150520431993054871e+00 3.960612704830439146e+00 5.562215649987355626e+00 6.003913626390477098e+00 3.317614989862136099e+00 5.400694452475609530e+00 4.178803516042911781e+00 3.647197608896598275e+00 2.547846892403931918e+00
1.703499612060915069e+01 1.020521689343577165e+01 9.327996001234939172e+01 9.340138427826948941e+01 7.626066806258953079e+01 1.832631468948135378e+01 7.085658314550252079e+00 4.415175787148696074e+00 5.709765213693856367e+00 1.172682593800759463e+02 3.167631012882906703e+02 6.363532872299714427e+02 3.768528261916505471e+03 5.642710462189338614e+02 5.436033638655370623e+02 5.067193139892218596e+02 5.759581407028018702e+02 3.429232268823337222e+02 9.027032828130433018e+01 2.673941306985860678e+01 3.897835938184072813e+00 3.442033926076963901e+00 4.056603575629001313e+00 7.376491196893529612e+00 7.182736710584107342e+00 5.230183303343589607e+00 4.072878973901019606e+00 3.556466779207367868e+00 3.699964933609030115e+00 3.850040844384446714e+00
3.251895498325586775e+00 8.907133475060266647e+00 2.226919574612018948e+01 6.401934203128928402e+01 4.339256936549642063e+01 1.417398981143943537e+01 7.120861456281033064e+00 5.877968889571570266e+00 7.850676867941219328e+00 6.081855199781237786e+01 2.402607667618779175e+01 4.422168547429384944e+02 2.889490750934016432e+03 6.173370481648079249e+02 3.287982746092262687e+02 2.786505810155733798e+02 1.168461339763290141e+02 1.361157950842742821e+02 1.866928579593796087e+02 6.506458899656527706e+01 5.007865994404527399e+00 4.113507095896657084e+00 5.024450297740715499e+00 8.940076165567193200e+00 1.201553920758564686e+01 1.174157915862080870e+01 8.888655237628491079e+00 7.902139687382012667e+00 5.536345661318808453e+00 3.998669521619413025e+00
2.528959955389301850e+00 7.709790340148849452e+00 1.452664703348712649e+01 1.075357588182958501e+01 6.501416954535454096e+00 2.682871343534439745e+01 9.389197627725366146e+01 8.475267824285842266e+01 1.175687044369187539e+01 3.609339705225297124e+00 1.730303668306246578e+01 9.688825879293210619e+01 1.260005180247272619e+03 1.110116270942094388e+03 1.562615926089874847e+03 1.424648975245610018e+03 1.749641830635644055e+03 4.352388890228713763e+02 3.093461449004474161e+03 8.926868772973796240e+02 1.083467833909988371e+02 2.776806635175070070e+01 2.105607949192271633e+01 5.313491587039992936e+01 1.146430074831834958e+02 9.568345552996866843e+01 2.676113141913494360e+02 1.014188939027740162e+02 8.472645606741165736e+00 7.549420725234491591e+00
2.267853145249152380e+00 2.391389539403842690e+00 6.851742585334144486e+00 5.241613751129791865e+01 1.956277606984843231e+01 4.776369564251826461e+00 6.473431733004024125e+01 1.987262449730151843e+02 1.444015429152666457e+02 1.539848331696063255e+01 3.635220426276644190e+01 5.571765075498483384e+02 1.182703206604210663e+03 1.113683474772213231e+03 1.205601963101390311e+03 6.941135895739879516e+02 2.503803015335269720e+03 1.061588408099360777e+03 4.016635318177333829e+03 1.236004599389908435e+03 1.068099657507405311e+02 1.104141311931134197e+02 9.874658198793665065e+01 3.241172066165984802e+02 4.359019161630976669e+02 2.293110545501055640e+03 2.210394203502951314e+03 4.449942915981271199e+02 9.590251944328063161e+00 5.128140346202995303e+00
2.032356408638506640e+00 2.301333533855681512e+00 5.550725202678172820e+00 6.307791782553105797e+00 4.327880488382271906e+00 5.279321283775677109e+00 3.931726984679396963e+01 1.133859827280223271e+02 2.463681673223330790e+02 9.271371725118927998e+01 1.046016363695144662e+02 9.208544825578195514e+01 7.103224264378374073e+02 1.175815576830601003e+03 1.220635392617830121e+03 7.342764031646319154e+02 3.513650631585999690e+03 1.102412851321322705e+03 2.027786694810711424e+03 2.218580141883451233e+02 1.995008463191438750e+02 7.678235246735507644e+02 1.052398143034079794e+03 1.605228928551297940e+03 1.454827490561910054e+03 1.441113019365863920e+03 1.318830489301019497e+03 5.964242787843122642e+02 1.438308549685810789e+01 5.758022630888971705e+00
2.591909490869368504e+00 3.098204510636812792e+00 3.154538198552623296e+00 3.130811900388195568e+00 5.132413734789652793e+00 1.167150907424476358e+01 6.812623276077182481e+02 2.292398640831640478e+03 1.159500948784044340e+03 2.105706977244330176e+02 1.710030578362343192e+02 2.886407681180601230e+02 5.639346350681502145e+02 6.921515495804150078e+02 1.001541483654482363e+03 7.355084293624516931e+02 3.873182440008667072e+03 1.170274762423717448e+03 1.347414654810709862e+03 2.737756986804907910e+02 1.690238131485420126e+03 3.215525720256279783e+03 4.804472662942233001e+03 4.887261731856562619e+03 4.284357908078573928e+03 3.561983202377587531e+03 4.849953778181008602e+03 7.125905485335323419e+02 2.188905970657784650e+01 8.004224191490553864e+00
6.504013904989118799e+00 5.305830282651928798e+00 2.832859907069770422e+00 4.699768977031697048e+00 6.762860194515451440e+01 3.588904488410781823e+02 1.976000567496085296e+03 1.612435328750293820e+03 1.648445856057948731e+03 8.794310029040536847e+02 3.532458987486209594e+02 1.079073753460882585e+02 1.061119179331077902e+02 2.355664705767231339e+02 5.333867783756272729e+02 1.433320082466609165e+03 2.231417388150405259e+03 1.327642480286330283e+03 3.235265228067988801e+02 4.280744545775775123e+02 1.109199677742761196e+03 1.232032374909742430e+03 1.413343188745747284e+03 1.396208610214049259e+03 1.213003023617723557e+03 1.171140047540914566e+03 1.449590516605191169e+03 1.511058226706403730e+03 1.044952198598212760e+02 6.381005224664407649e+01
2.929099002802939111e+00 8.515254083986040001e+00 1.655946222115343502e+01 1.243796313277703405e+02 3.104054076243896247e+02 4.653761916978941144e+02 1.481392787312470773e+03 1.859493383328240725e+03 1.330195758781930181e+03 1.080584720598231797e+03 2.431620880970505993e+02 2.591356506745977839e+01 3.977965934098855882e+01 9.887525748371311352e+01 2.047625246556822276e+02 9.726103748569499885e+02 3.759795283889387747e+02 9.480449594911627287e+01 3.108218578327541337e+01 2.055377585105625826e+02 8.129322002163876277e+02 5.236426012553730288e+03 7.154469571989853648e+03 6.722881697500873997e+03 4.256741935747352727e+03 1.695500772688483266e+03 2.551883172980115432e+03 1.570708073751434540e+03 1.325532080923755132e+02 4.637948913494673064e+01
7.622168963998561253e+01 1.050417194825914891e+02 7.608010163364649259e+01 1.043850105017342145e+02 2.800787842077594973e+02 1.757514701591787230e+02 9.443041271950735336e+02 1.243520183011278277e+03 1.198692239792666669e+03 2.899576716628731674e+02 7.422104661462665831e+01 1.536290156951158892e+01 2.690079730381874512e+01 7.526408770301371476e+01 2.715600845740019054e+02 1.642427214938876148e+02 2.638796456365104746e+02 6.791116858073995388e+01 1.100998997057552344e+02 4.137446139679939279e+02 1.183040321437035345e+03 1.675894231786922546e+03 1.615318379056806407e+03 1.435010993540355685e+03 1.155752897787372149e+03 9.162082080086976248e+02 1.294211191969895026e+03 9.240381478237009105e+02 9.894581249725011673e+01 3.413233223679881689e+01
2.270245587033204515e+02 2.267909500294073837e+02 1.305307231908585948e+02 1.069901523630594085e+02 1.616772475661612418e+02 9.802733648284960566e+01 6.026675807752344554e+02 5.638578216757641712e+02 1.647842193836133333e+02 8.718167658607737280e+01 2.748398612820130182e+01 2.041088960353911119e+01 1.192566391280247906e+01 6.810393384980729437e+00 1.670914787199353313e+01 5.318760653796455529e+01 1.739289253552793753e+02 3.522257020852278515e+02 2.965661382925825365e+02 1.193071152872308176e+03 3.023836645479625986e+03 4.263092112214297231e+03 1.621604629118532557e+03 2.122820432748284929e+03 2.476917217996755880e+03 1.199082742405336830e+03 8.467811835618373379e+02 6.601776554906208503e+02 2.339665725518969452e+01 1.926133382203324729e+01
1.912452906307671583e+02 2.400763436349782864e+02 4.044573418555768995e+01 3.220688745874789305e+01 3.078805171302695243e+01 5.184433639092525681e+01 8.135309932658074672e+01 2.182780068029455833e+01 2.944961329913065740e+01 4.160941464833101122e+00 5.237735093667018837e+00 7.678948004593662446e+00 7.915921701017896162e+00 2.858195747638842477e+01 8.374308882346485916e+01 9.870867094369875758e+02 1.393852964785856784e+03 1.397032530562816646e+03 7.781146983184621604e+02 5.050254720932746295e+02 2.684655690970608930e+02 1.345006159436028952e+02 4.860401944966152143e+01 8.553903693387340468e+01 2.876076587024746232e+02 9.603012416633796988e+01 9.398112832725860244e+01 3.265791336635732733e+01 3.653892649027685735e+00 2.777835927954297013e+00
4.179638191022369824e+02 3.468216090713550557e+02 4.296680512250856054e+01 2.095988313621071342e+01 3.530628752449837293e+01 2.943218107204333478e+01 4.766392659229262563e+01 5.376594951480295315e+00 4.685839932509160199e+00 1.947371348147159065e+00 4.500447673585444619e+00 8.332687622366272251e+00 1.030619424556341457e+01 5.813654939923529241e+01 9.579835996951098309e+01 5.753892823202345426e+02 1.962222306227371064e+03 3.359254180727721177e+03 3.503921061314759754e+03 2.639075219299963010e+03 4.784490909521870208e+02 8.980260053273752874e+01 8.990094721613088780e+01 1.913462705511407478e+02 3.922054453734260733e+02 1.072754441247567456e+02 3.914316810413476588e+01 1.458329219195284665e+01 4.442218009088290565e+00 3.873905069380149779e+00
5.476132760521220462e+02 7.424102084549473091e+01 2.332276881212482067e+01 8.451475121775526844e+00 1.081647311338806361e+01 2.525678800059898066e+01 3.374116764931861212e+01 3.920127551774824415e+00 2.183655247922744014e+00 2.439523675459309704e+00 4.252133286324426997e+00 7.169303957222258994e+00 7.498650429395972594e+00 4.349141543992605108e+01 1.715533096763990102e+02 7.610260058215632171e+02 1.063855760508810818e+03 1.785686796724116448e+03 1.798920314895896126e+03 1.711471723022500555e+03 9.840998458872010133e+02 5.239503013795258823e+01 3.013982727940753747e+01 5.825055686978270586e+01 3.147876102094334669e+02 1.766930905908706393e+02 1.529573357827675864e+02 2.824641071575652873e+01 4.050053806498027598e+00 2.993308409659004354e+00
3.272471279335125587e+02 1.067338390249132090e+02 4.554173266087753547e+01 4.592944049901534243e+01 1.137370645589670346e+02 8.170712425022476566e+01 3.480563764129132664e+01 1.472798603687265739e+01 2.269951043606170771e+01 2.842491098816592299e+01 2.577290096304120315e+00 2.888154915179490523e+00 4.124114953021271290e+00 9.600127593405701987e+00 6.026643761965836177e+01 2.393293550165234933e+02 2.317816140336610715e+02 9.206971395284531354e+02 1.074810490518195820e+03 8.194701549903961677e+02 5.804493113630544485e+02 6.187792246310915800e+01 7.520166299062109871e+00 1.371575136920202453e+01 5.912913200387556856e+01 1.430184816223759867e+02 3.748158706090249552e+02 2.038427553581695406e+02 4.973318507604465921e+00 3.633653770881974943e+00
1.184350546921686060e+02 4.968562882490131472e+01 5.765863211144660738e+01 1.050484090647745319e+02 6.407506953290152296e+01 3.001387702901295995e+01 1.415021791345926516e+01 1.027622134198485249e+01 3.366092165368673506e+01 1.251162706914273457e+02 8.317223765040690608e+00 2.881125097589011030e+00 4.537058514726166614e+00 9.378125995635519629e+00 4.426759876324957332e+01 7.627145685870891612e+01 5.038041858522262828e+01 2.320194156210556713e+01 3.344076055891600419e+01 5.560858476568324704e+01 8.874747307209318592e+01 1.764359019519447003e+01 7.674910515377931119e+00 3.706581181215697285e+01 8.827259020800008216e+01 3.038416902401332109e+01 1.022510950671861281e+02 1.100430653143857853e+02 3.807891351301111627e+01 5.665468727076907740e+00
1.197555319084570726e+02 1.020254187846988430e+02 5.342381965566410429e+01 4.253736259303890677e+01 4.420466381899916541e+01 1.728591475952804402e+01 1.176368016302193809e+01 1.251830948647963027e+01 1.429248906303215350e+01 5.474301662808794333e+01 1.519956422271033425e+01 1.472902378762063336e+01 1.291702326305234116e+01 1.482805296272830553e+01 3.990607890330890228e+01 2.640511066471481882e+01 1.730745404609383087e+01 1.009247467627084305e+01 8.595798171013258937e+00 6.338844022573396408e+00 4.719354893854115218e+00 6.475455144212859615e+00 9.537743830598207850e+00 2.253853833174558474e+01 3.854443203112720084e+01 1.799200444279114564e+01 2.797173419186316323e+01 1.763229282638562623e+01 1.719725493730978627e+01 1.082564968789346871e+01
1.615237673100363054e+02 8.949480738622395393e+01 5.474367933797519470e+01 8.092405596391721190e+01 7.974618558290877957e+01 4.539876971241294967e+01 1.600869129103644752e+02 1.257749587978482424e+02 1.910409331250548703e+01 1.332043883313398069e+01 4.707945381526138284e+00 1.100193688377112622e+01 3.052529970256203740e+01 3.103828316377889962e+01 8.929630429234961753e+01 6.362519512346538875e+01 1.959176547776670674e+01 2.262036206179169895e+01 1.011642200201004371e+01 4.271275712911952738e+00 3.746917154852751786e+00 5.537103763611797902e+00 8.233026130256071440e+00 2.420422343105190777e+01 2.406375649443765496e+01 5.573117558768221791e+00 6.001656568212995424e+00 7.357852192426450166e+00 2.315161418772058965e+01 4.718015002206488617e+00
2.159148931753841794e+02 1.986317200547202901e+02 6.510237136309721961e+01 2.407037023961969453e+02 3.149330117077926730e+02 6.253270190238262103e+02 4.334705308348487733e+02 5.099009512931829136e+01 1.883382613788489834e+01 1.049185241927679790e+01 3.044467236844104363e+00 3.873057258970520778e+00 4.564271954199292658e+00 1.686473620142827201e+01 1.989415891699343319e+01 8.660277283837862328e+00 8.064283106813421753e+00 9.221470717488282176e+00 1.225310782327285430e+01 6.521997664272016770e+00 3.602135291456626032e+00 4.863627283625721276e+00 5.378215921804821775e+00 8.567688578690731305e+00 2.589502324567854430e+01 3.899910734404844703e+00 5.402363934449864402e+00 8.596514736191227968e+00 1.010676418097655116e+01 2.009184150417394221e+01
1.171900352134377954e+02 3.104098697817776156e+02 1.000236445389471385e+02 1.153357829253773303e+02 6.216126686771484628e+02 6.874734684847011295e+02 4.716370515511848680e+02 3.348102473895676212e+01 2.411427494516438585e+01 2.200397882259684934e+01 8.787911456651613662e+00 4.306174421718022671e+00 2.711501888866536092e+00 4.472428012555278443e+00 2.057326024567404232e+01 5.995211155944797810e+00 1.988310924846394911e+01 1.108410360915947876e+02 1.876389655764108682e+02 2.520911952734659423e+01 4.969508365100041125e+00 6.255569355280441002e+00 5.310538807822075213e+00 5.612709326339477833e+00 7.207219267572449795e+00 5.286111793271264681e+00 5.967230884825995396e+00 7.191503089122177172e+00 9.440517238453178805e+00 2.318915059774492704e+01
