2.524228728997913174e-01 3.614434286500444737e-01 2.933242200407985001e-01 6.580252527129752151e-03 2.489716580397971224e-01 5.330575005744075077e-03 2.992255000397637740e-03 7.997371781752901643e-03 1.436342150231271174e-02 6.360927362145511223e-03 6.753445596943118481e-03 1.450901208783115792e-01 9.168206991014238305e-02 4.996634289414296146e-03 5.231549277759384338e-03 9.917884612815455747e-02 3.100045485950949243e-03 1.888279158823176701e-03 2.962376638471206965e-03 3.204955187420929219e-01 2.999207995780549529e-01 4.592406076904648887e-02 3.556558295286982307e-02 1.429424886797935612e-01 2.781918743406611161e-01 2.187576004665980622e-01 1.008731730784400427e-01 8.803153731263909862e-03 8.324831909125621557e-03 1.036458762193920649e-02
1.677431673498080145e-01 1.782954779906764653e-02 1.854799347022424022e-02 8.949793492167061604e-03 3.437539256996800883e-03 1.861557287303711866e-02 7.436627156878314500e-03 8.973263181352617371e-03 4.547094070619165686e-03 2.905082315529402756e-03 4.366857428649610628e-03 7.445818797026514113e-02 1.074594861223488323e-01 2.576624311246242804e-01 5.692025762041048181e-03 2.719880183728453638e-01 2.893502368480205169e-03 3.462447453949994789e-03 4.306893689851935998e-03 2.748337068584198219e-03 1.719236131432970160e-01 4.389566650688146721e-02 9.209804155733000708e-02 8.285991553022117873e-02 7.360273162320860041e-02 9.898683559276869048e-02 3.490465182489094903e-02 8.826935036341373650e-03 1.248778747111470820e-02 1.240667770062427525e-02
1.759128477655868758e-02 1.733084829098989130e-02 2.539531684190189306e-02 2.057623657705457548e-02 5.875224989341409215e-02 1.636626338090634361e-02 1.424255512404096480e-01 1.484482898079270974e-01 3.014911394485911972e-02 4.592916415852734031e-03 1.160020401691697588e-02 9.585426437146771228e-03 5.611540319342406616e-03 1.188109858428829622e-02 1.673373272916885424e-01 1.134527950316630528e-02 5.226259978108988360e-03 5.185987318754512777e-03 9.766903847756781831e-03 3.843054602396817586e-03 1.057722382758906760e-01 3.600546822797276447e-02 5.557598067590327484e-02 1.948071208658174597e-02 1.160128188874101282e-02 7.664451448946590049e-03 6.867185735178010092e-03 5.384940290006381275e-03 9.165452300367433330e-03 1.025198063122580681e-02
5.389925001826810676e-03 1.535959327355208848e-02 3.369424859547742734e-02 2.721145077721401698e-02 2.026546639207131920e-02 2.887953195572148801e-01 2.849100324776286386e-01 1.757169280305341530e-01 9.474688822760062024e-02 6.169606743311156771e-03 3.016106004176642708e-03 5.824870749663649955e-03 7.980898608305708047e-03 1.099473086916721680e-02 1.304292818476111282e-01 1.132140573461582339e-01 2.410028011270164694e-01 1.991365720387141582e-03 8.355740549968257306e-04 1.244378139602923599e-03 1.874115800525334719e-01 7.528450380709870993e-02 2.616197650648750123e-02 5.183246808258909488e-02 9.464584030780771873e-03 6.750520622993588446e-03 5.794960286215527882e-03 5.492785878854495284e-03 1.113715895735306084e-02 1.208388662949505706e-02
3.068388843339535810e-03 9.395319397954621579e-03 2.618957961004787088e-02 1.016426588480689487e-02 1.267645064458216946e-02 1.667096299965929174e-01 2.880433291409747465e-01 1.609559737251357592e-01 5.888175632803450271e-02 1.593287080942306158e-02 1.356094133040097217e-02 1.628912446707242098e-02 6.967941777400924082e-03 3.221872241320020147e-01 1.708672250050506658e-01 6.893436854611123543e-02 8.386830818463130235e-03 2.328404371123634926e-03 2.584036815785218950e-03 1.497264597218039665e-03 1.452965730438244250e-03 9.964232245204261706e-02 2.585213662916759358e-01 8.530784809083477582e-02 1.708375442984256740e-02 9.009210459285753661e-03 6.237785246823470547e-03 7.205854629265451630e-03 1.125482466681269542e-02 4.132918559911551160e-02
6.827383327114483307e-03 7.314447553511538649e-03 2.307197022911580686e-02 1.380478580999093714e-02 8.220473224467202480e-03 9.274961203232791329e-02 1.171697081424059872e-01 1.238864891123991480e-01 9.989023147643502631e-02 2.161469497396850681e-02 1.910335350162966489e-02 1.663582326040384182e-02 1.456929211342174180e-01 5.506673358005667596e-02 4.658028699434782482e-02 7.897227020429258004e-02 6.385083322799321726e-03 1.033583275061819018e-01 1.739704820825282213e-03 3.296590213831115859e-03 6.081937737529344822e-03 1.034520576761369451e-02 3.191778321475278735e-01 4.976778683829920225e-02 2.547529033236340182e-02 2.353749986653572504e-02 1.460119571641903084e-02 1.005763435822598119e-02 1.325593849431327964e-02 2.379977761837625758e-02
8.914611455386123318e-02 1.354067964988645290e-01 1.328669815894572837e-01 7.462179891585927691e-03 2.142180016608088208e-03 5.459945415501803005e-03 1.132604965372395293e-02 6.187238738155683565e-03 8.126089292944048761e-03 8.648821750332305949e-03 1.086803774807185152e-02 1.773900302061612311e-01 8.222641796523189051e-02 3.845594422671853169e-02 2.259359064580932983e-02 3.929049409755731859e-02 2.212977734478595859e-01 9.844258052761307998e-02 2.786023858179997002e-03 3.961537397355645133e-03 3.177828817722368714e-03 1.002814008013801078e-01 4.705688172125956775e-02 4.491591885771473863e-02 1.724313458357184387e-02 1.751800073619686968e-02 1.530597473731289473e-02 1.320414096042853147e-02 1.510497159711153559e-02 3.581898020216756073e-02
1.807699442125312861e-01 3.361685613055235278e-01 1.855070228664205401e-01 5.662997188019344361e-03 4.683981913418053256e-03 5.203514567989064865e-03 4.614239877315483296e-03 2.876640176180885172e-03 9.319102208264143025e-03 2.514744439426307987e-01 1.054266141932853895e-01 3.212621292917934301e-01 6.918822747143776875e-02 2.477419506063322646e-02 2.821786842780578744e-02 5.277527645576705895e-02 6.372360364954667705e-03 7.053349660749034904e-03 3.629991185913298158e-03 3.556955177535037552e-03 1.404602557931078355e-01 8.242955762536165187e-02 3.320745540205239515e-02 2.772667018998936986e-02 1.315558946762702443e-02 1.369737468118744327e-02 2.141002495066186492e-02 2.388668757217732308e-02 2.374420786095396071e-02 6.798561467880376297e-02
1.852202694107414963e-02 2.694616327004493717e-01 1.555202188662717089e-01 1.241627491037183319e-02 5.969679245416253596e-03 2.281857129871747436e-01 1.296740428911278241e-02 5.755663349946022085e-03 1.077112980338765236e-02 3.552073729077313557e-01 3.253740433203103355e-01 1.104254944940569888e-02 1.411839827985596034e-02 5.973173966526669487e-03 8.935456726313514841e-02 7.583792353406973441e-02 3.043098680924612998e-01 5.867460967579904776e-03 5.968513257697326095e-03 1.870467362550288226e-01 3.711857707611990187e-02 3.851317866313080235e-02 4.167793692458737764e-02 2.719878824808901960e-02 1.592533570081967192e-02 2.403649280365677959e-02 9.104115385558345097e-02 1.678746636008275894e-01 1.282583083245832090e-02 2.221498587421540105e-01
1.240444019877376576e-02 9.173786636353540788e-03 1.454109415759639000e-02 5.702676722416695314e-03 6.626741154250129391e-03 1.058662528814801745e-01 1.373711696691992841e-02 2.414108102366668840e-01 1.188061900852912522e-01 4.298586691298423440e-02 1.545306296971131650e-02 7.218521992823937090e-03 5.553186722595472059e-03 7.557500366087548278e-03 4.034773139925965958e-03 5.255718157956957778e-03 2.332543736667010495e-02 2.172020961753762941e-02 1.061081878582320094e-02 8.002079523901235378e-03 4.724145822601726052e-02 2.969905205027059333e-02 3.383984538717025453e-02 3.716621736900611872e-02 2.081515986406630089e-02 2.646987110391821676e-02 2.459689228733615840e-01 3.845231866173984825e-01 4.592148652809737719e-01 1.162470949178816965e-01
1.207764122984502329e-02 2.596552342675612635e-01 8.062569641621001454e-03 3.186787491323466240e-03 9.441908834087095123e-03 6.554397940595550753e-02 6.503126229937343517e-02 6.007239162723890941e-02 4.193883000585183624e-02 3.289065363433151257e-01 3.270364595333787039e-02 3.535769340288477669e-02 7.249486157547298248e-02 3.570543861550012216e-02 6.577083932482903454e-03 1.288875997362308456e-02 2.385206628861080008e-02 6.540283387624011048e-03 2.954188577479227584e-03 7.683797002170858481e-02 3.223518260863791202e-02 2.866161413373056327e-02 3.676709541439586448e-02 5.146567405512560145e-02 5.521955504246245372e-02 3.001759985627898766e-02 4.730975362321204747e-02 3.599579510951170236e-02 3.139664495621594803e-02 2.212407654569296250e-02
1.167855656558784150e-01 6.375487393088305477e-02 1.487917583034631050e-02 1.306779582961335034e-02 1.142522868620714921e-02 1.066914013326072108e-01 5.026188478534755755e-02 3.504693307431665239e-02 4.223284490632892019e-02 6.977681901923101643e-03 9.724069672859075864e-03 4.397218536549851037e-02 7.398451827552533777e-02 3.844418579019079352e-02 1.390306594041239470e-02 1.572565195801530272e-02 1.733512351671918222e-02 1.018742310578991950e-02 4.873697595102799256e-03 1.737454169477284371e-01 3.060498765434173027e-02 3.105509080540495501e-02 3.655331099272363798e-02 6.532437686935826937e-02 6.212909219959018847e-02 4.428522308459638401e-02 3.400667269137508386e-02 3.043844605572495338e-02 3.272867796927234063e-02 3.490178803774059840e-02
2.789401777246285768e-02 6.690327939468508622e-02 1.482646503516524827e-01 2.431052606896722673e-02 2.625637491159836245e-01 9.001496600955365135e-02 5.019785678591830863e-02 4.389706042680604353e-02 5.643483108922588837e-02 3.088004740139605516e-03 1.065697009367105597e-01 1.520870376392476422e-02 5.443423350264174621e-02 2.344550395773535578e-02 7.417741058436570084e-03 8.636751652459766573e-03 3.197012238057595716e-03 4.696632953285596358e-03 8.560595099175281539e-03 4.122996032739566566e-03 2.908844468505413991e-02 3.181888361958762346e-02 4.015630750453274417e-02 6.659052254991162934e-02 8.423905061937587979e-02 7.349642401844405648e-02 5.406456235402265498e-02 5.034255282122496872e-02 4.375363994868938788e-02 3.594660340283256650e-02
2.432197080826050892e-02 6.860438123202088068e-02 1.189336687290110939e-01 8.452063707640908308e-02 4.960663554246325796e-02 1.920771842176904609e-01 1.480851645310160038e-02 5.031583747897601551e-03 7.751500719084158941e-02 2.524933570355101728e-02 8.965024176721543558e-02 3.153196314421165356e-03 2.450252892919098022e-02 3.343822342688701488e-02 3.600565140091450955e-02 4.910105631347558980e-02 4.448191933556559091e-02 2.902491555714551905e-02 7.966046996620362863e-02 3.850739485450133809e-02 6.536071280398237683e-03 1.881455883353249092e-01 1.413327468082281324e-01 3.352531169131454658e-01 1.141202791219906969e-02 6.337754767913012822e-03 1.441293732951912966e-02 6.982428277005701955e-03 5.874844456975612805e-02 6.743985420163002564e-02
2.285356261450536761e-02 2.275505041745792129e-02 6.102550110723448801e-02 4.516083318044722406e-01 1.632827398737228264e-01 3.617806703792999373e-02 7.282216385775762239e-03 6.272641411958931185e-03 4.980829061705259811e-03 9.623646021286026697e-02 1.972577833096025024e-01 1.507049795284703779e-02 2.150557373003575759e-02 2.765338116347629618e-02 2.532582434747428571e-02 3.103284797920810578e-02 5.351935853730913767e-02 9.342390957119574291e-02 9.608837424506250224e-02 7.603311449735963845e-02 5.534378801565636302e-03 7.490022378537885758e-03 8.291624905329175385e-03 1.901214771161465616e-02 2.097994829857490612e-02 6.682588538177128279e-02 6.588879560116861489e-02 1.837608652569439061e-02 6.042917602875053779e-02 4.599990669252861791e-02
2.105209399841108733e-02 2.271424382627925190e-02 5.016810750230819849e-02 5.503999635736146062e-02 3.660716643093216843e-02 3.819695476698243414e-02 2.114683541501452269e-01 2.766048155259759594e-03 6.159839397500054860e-03 2.883087351743651456e-03 2.997719858540011471e-03 2.100797586376227689e-03 1.188990257868317163e-02 2.453193093050444820e-02 2.331724427708917885e-02 3.637099594289684018e-02 6.388236882449903342e-02 7.878684758829067325e-02 4.623834866637547419e-02 1.017663447462486929e-02 6.069690304549837587e-03 4.132623269812667893e-02 5.956038075919049823e-02 9.977965527878308871e-02 9.378731740206078249e-02 1.217650018594880479e-01 9.668692898556793813e-02 3.364023721124646815e-02 8.842366273482396566e-02 5.163115043972583973e-02
2.690034440461059467e-02 3.073561802065576110e-02 2.963616350221255982e-02 2.746638455663519274e-02 3.922462429488390856e-02 6.602983642759635563e-02 1.859611653424732627e-02 5.289742875024646546e-02 2.298471972919149259e-02 3.856403809671927162e-03 2.794255691801081094e-03 4.211619486767610374e-03 8.279051030118077248e-03 1.250248881701822475e-02 1.690151328117596094e-02 3.099059400516587445e-02 6.813363713233182295e-02 7.006096259911021029e-02 3.384994062514769253e-02 1.174764100717895672e-02 5.017541834640049797e-02 8.999338437347889630e-02 1.141048723037996065e-01 1.173068352667324815e-01 1.035855249939091893e-01 8.938729620962979072e-02 1.311072210240621927e-01 2.577675962647576688e-02 1.166107244588695940e-01 6.274649311596837420e-02
6.690625055415384825e-02 5.202971342218936507e-02 2.518388308519138238e-02 3.488211898405518124e-02 3.260026608460538967e-03 8.591027556510854105e-03 3.964856613910085897e-02 3.104322368800096349e-02 3.040439260563548851e-02 1.491823989050295243e-02 6.601201700859735816e-03 2.541244936573553749e-03 2.453006705727033866e-03 5.318858313720846269e-03 8.174207046707526042e-03 3.851677252437281374e-02 4.149040791020672941e-02 5.332188065481004852e-02 9.477993439918170129e-03 1.685981667749330767e-02 5.539258930716656898e-02 1.183608342522800144e-01 1.441863565732195707e-01 1.498544586854695104e-01 1.242284814354887856e-01 1.193853277379554323e-01 1.101406448710994385e-01 9.170377644833037356e-02 1.139785677904169882e-02 8.746548465923258131e-03
2.655651736871429344e-02 7.240300869911675541e-02 1.253218094661558701e-01 5.163736882199679128e-03 6.063283788008968882e-03 7.437675077054941783e-03 2.357668734482069525e-02 2.950322589064247394e-02 2.019445527319941799e-02 1.551726711454163958e-02 5.164632334553268499e-03 1.310927444376115136e-01 1.965681684333926427e-01 3.306074176917176213e-03 2.961724213823289584e-03 1.777215774927129802e-02 6.913154237868519500e-03 2.448043827050108527e-03 1.453737297095898107e-01 6.060850065286031360e-03 2.152433234918743263e-02 1.144326770302758201e-01 1.445459092665792589e-01 1.514336714740636691e-01 1.103552779869072936e-01 5.072284065512740886e-02 8.135738547043866453e-02 5.553460226593821825e-02 2.004963142865695547e-02 3.566098872204034875e-01
3.344566688881818114e-03 5.402574162303407090e-03 3.211211054766973782e-03 2.846399617553784477e-03 4.060459310668246107e-03 2.312618348808774191e-03 1.192064006274985710e-02 1.540237185544818255e-02 1.417670883715267498e-02 4.879327342198127616e-03 2.838882691229773977e-03 9.189813634062490855e-02 1.559833383172559984e-01 3.390937489246183181e-03 5.143841297967239982e-03 3.105169618913100962e-03 5.254048691893282129e-03 1.542188229102231002e-03 2.902569105685998390e-03 1.373204976289508876e-02 6.974190021831486175e-02 1.333090214006104335e-01 1.444374330687397956e-01 1.370459157766384939e-01 1.043912635893561036e-01 7.560688379025445882e-02 7.234428019323466130e-02 5.690289776256658022e-02 2.654880947920936277e-02 2.845479495753896471e-01
5.060985631226722417e-03 6.141024975946455730e-03 4.504373861351221135e-03 4.264257962119061100e-03 5.771933547468722191e-03 2.218297096400458513e-03 9.485652595147492719e-03 7.165233808377302616e-03 2.146426650985405228e-03 1.791846915867593504e-03 1.593377013151814348e-01 1.411184093391928407e-01 7.783221073836393833e-02 3.562076965901687930e-02 7.562359889349297426e-02 2.209399456787887739e-01 2.831884108260189232e-03 5.803787321493763390e-03 5.650163526502812415e-03 2.564299186428713878e-02 7.169091510524494559e-02 1.061443164646172638e-01 4.409065237390847464e-02 6.608940692926025540e-02 8.445556184067481986e-02 4.718979189307843936e-02 4.427443029425536664e-02 4.473215123516192243e-02 1.599476600613123078e-01 1.739680290459162115e-01
4.053121274442312433e-03 8.748747648318998607e-03 2.546753209681900665e-01 2.182608745076587697e-01 2.027656835422699533e-01 2.940713246984026363e-01 2.947737189369332468e-03 1.045171031030890790e-01 1.458676758513812455e-01 2.527032579960148198e-02 3.733044632374170335e-02 5.986867139300338508e-02 5.686279312458868834e-02 1.752403221648103082e-01 4.152090803703156752e-03 1.574291164818935468e-02 2.739305932120386297e-02 3.561443838807227397e-02 2.449649639784344524e-02 1.873854349526904786e-02 1.370380192903792975e-02 5.055042082735762728e-03 2.018984096953788457e-03 4.370352614038255229e-03 1.565888884586100552e-02 8.537928733311588719e-03 1.208218867082436199e-02 2.320016800471165486e-01 2.995349288481474748e-02 2.793307383340622174e-02
8.463911342283154254e-03 1.462718575778617323e-02 2.870916053101543741e-01 1.688538756519225303e-01 2.833414145100475734e-01 2.200997588546968198e-01 3.453799573643638321e-01 3.817272146050391252e-02 3.494725138907636003e-02 1.515741442560489434e-02 3.763336211841190881e-02 6.963691393604276580e-02 7.523264785387052955e-02 3.426451886511951428e-01 5.902634223036197503e-03 7.571690149862474704e-03 2.766611672981991732e-02 5.161228591486635708e-02 5.853113530499819139e-02 5.152845261096326152e-02 1.442621756716581591e-02 5.266330960622999172e-03 6.570226607157683696e-03 1.296520432784933723e-02 1.842450065235694961e-02 8.753343212831584189e-03 2.736428421344481721e-01 1.115448001154084462e-01 4.152211629434509471e-02 3.969232519736767828e-02
1.038044556181013170e-02 3.393273632228835726e-03 1.609623647478528041e-01 6.971201780038040197e-02 8.854297124664645136e-02 2.024282923852456784e-01 2.729086283263873480e-01 3.187768584412836725e-02 1.728503581675614256e-02 1.971979400571472266e-02 3.585050791571366829e-02 6.123429965715878470e-02 5.663737088563720184e-02 2.685915075268833219e-01 1.119125852852680472e-02 1.699863807900743595e-02 2.109109981766112488e-02 4.827110482754908005e-02 6.040246640730286692e-02 5.187385073157645826e-02 3.442681510589955252e-02 3.144764277697301158e-01 2.153914355232592892e-01 6.201657711598777475e-03 1.986452268793397966e-02 1.450166783223262937e-02 2.058168730189733828e-02 1.940415772758561086e-01 3.372117347108075786e-02 3.026810674081625158e-02
8.290328915507714364e-03 4.523176995211476009e-03 3.409182299695459051e-01 3.618822629975522176e-01 4.645222533782852187e-03 3.639018727754767847e-03 2.798877270372291948e-01 1.198416658844764227e-01 1.757714527081595812e-01 2.245845415769187892e-01 2.103710599460575578e-02 2.529005185984523757e-02 3.320896878922786205e-02 6.419628590319027828e-02 3.212586231339709664e-01 1.253662080792104609e-02 5.832950280981837564e-03 2.644447854873155368e-02 3.010503082897841159e-02 2.340494820238154736e-02 2.916937816050448398e-02 8.690844208086832140e-03 6.309489526544335980e-02 1.019648591246944680e-01 1.557202679358670946e-02 1.145368219640207838e-02 3.781822382776590941e-02 4.620344948065673724e-02 3.968376077051445627e-02 3.435047140988742309e-02
3.069664112871374299e-03 3.425951683111847501e-01 3.879527463234890353e-03 6.891255095545209541e-03 2.749315156563288381e-03 2.301864576135050633e-01 1.130409373250423621e-01 8.336748133042401476e-02 2.625844058467667885e-01 5.755680840534300145e-03 6.904375170685875251e-02 2.556831618861161309e-02 3.779338026594347699e-02 6.935587661743250476e-02 2.863402773616283148e-01 1.054415559247679109e-02 2.924010915618703299e-01 1.342672628020698533e-01 1.919779823142693520e-01 3.210093712281964495e-01 1.072812741243475004e-02 1.322365990659939983e-01 6.837404819546939738e-02 3.173074174321696694e-01 7.517450576344693325e-02 2.238564414681521453e-01 4.035455622245114754e-02 7.018390851760752946e-02 3.252553195565266453e-01 5.486971761597501940e-02
3.264157014974067728e-03 4.466562411818991545e-03 4.227083523487938366e-01 3.395306881884651018e-01 3.419028424280888823e-01 1.358759997717267076e-01 9.304577590503443352e-02 9.802387182876096117e-02 1.099599001668355586e-01 4.361397915409842563e-01 1.278384774702835125e-01 1.278912452527576071e-01 1.026467074892746800e-01 1.037796949808882929e-01 2.604515787326325826e-01 1.758501467279519614e-01 1.220981382095280149e-01 7.527099180596338868e-02 6.463140531237313025e-02 4.813799912613175164e-02 3.868859600538160359e-02 5.664072830477979298e-02 8.665095408376709274e-02 2.026161766429518396e-01 3.472560138284805364e-01 1.571160693190545576e-01 2.416685493585509215e-01 1.661652356539470299e-01 1.700594317324691240e-01 1.111333085944066906e-01
2.754793833411594683e-03 3.099193690218943718e-03 4.285516207066551453e-01 3.925231686569961853e-03 2.302806300522473783e-03 3.350476036534523749e-01 3.040150049954273067e-03 2.731884815452266003e-03 1.515959270156564953e-01 1.099591540739390805e-01 4.118116299210565490e-02 9.539346237262151529e-02 2.390518871007367985e-01 2.181732504617228952e-01 1.787348822991587094e-02 1.318867246695426716e-02 1.383852356795390592e-01 1.626518503320792675e-01 7.300679359034881188e-02 3.216036172314606922e-02 3.129727487732433810e-02 4.890596464897917217e-02 7.423259912547461314e-02 2.270736581730527504e-01 2.305827558501425678e-01 5.491974608136212382e-02 6.130776817606093526e-02 7.818230088982451587e-02 2.522646999555244185e-01 5.115792011931572653e-02
3.702110824729099026e-03 4.619168039315055437e-03 1.425950241903632589e-03 4.989908505328159889e-03 3.999700226202156095e-03 7.508443838614820010e-03 6.750081032369900820e-03 3.789838509648907894e-01 1.506325105596736103e-01 8.748106813409586846e-02 2.653221075960203110e-02 3.389446206400295591e-02 3.622952580670069089e-02 1.234813660366329835e-01 1.410390468162239508e-01 5.938024848806195549e-02 4.861654879659599304e-02 5.202851070741416201e-02 6.953516766841998098e-02 4.002552045463746849e-02 2.839453316793705273e-02 4.224946237543353300e-02 4.799309045848697969e-02 8.043688185420909409e-02 2.527659653747178492e-01 4.021054721945838129e-02 5.876197860488594632e-02 9.531669388876168325e-02 1.138574826913326399e-01 2.241456425794944030e-01
2.026952955784395907e-03 4.923113897293133687e-03 1.438737653526052981e-03 1.491604462313379960e-03 6.932391440609505032e-03 7.262896853340758754e-03 6.698107522152448035e-03 2.641343640125000669e-01 2.051762292961806233e-01 1.914454057640505302e-01 7.852933863222519295e-02 3.951517389354799320e-02 2.366325943891539954e-02 3.704716158387385411e-02 1.687281526291747324e-01 4.413010560583038172e-02 1.169723649237288388e-01 1.120667405554384016e-02 2.174628310614516724e-02 1.531557631691672916e-01 3.953268726372037578e-02 5.529642538313902372e-02 4.811093550218323300e-02 5.308205232202204554e-02 7.089215242717976373e-02 5.474589375379384365e-02 6.478869239279497205e-02 7.905894311415406772e-02 1.053201572397770847e-01 2.562818504849014856e-01
