3.849984640823246318e-01 5.495518140950669261e-01 4.655695063329662320e-01 5.773215429110553076e-01 4.052135088461054080e-01 8.448981343766197583e-01 7.703177685364461791e-01 2.820377610453809331e-02 4.006830130438097243e-02 5.417177019324610071e-02 9.600746900162329123e-01 2.525908729565756738e-01 1.666156701838710785e-01 6.580180789387348739e-01 8.136709465665461494e-01 1.927233190673111329e-01 7.291389327123233288e-01 1.504682956587444741e-02 7.463332121889871065e-03 5.455845070417189024e-01 5.073727140216180986e-01 7.534674030239291165e-02 5.727347621498427022e-02 2.263138584275570242e-01 4.343084065223858925e-01 3.411658768141917486e-01 1.580729406268474579e-01 1.394300830074001428e-02 1.333010712975340149e-02 1.677669810349253360e-02
2.462729003185612497e-01 5.165593107366444059e-01 9.098530236579173147e-01 6.854653911640145036e-01 4.722008466425654527e-01 7.454058907311110482e-02 2.973067203536803801e-02 2.260842405343577166e-02 1.063873076304928250e-02 7.059840343861040202e-01 5.834956919969632727e-01 1.305612900995659631e-01 1.978901358581430514e-01 5.089533103373741207e-01 7.414947234635858031e-01 5.300593878396410163e-01 6.770089092217941307e-01 3.634716578377691909e-02 1.093404476769334853e-02 6.522858754503153556e-01 2.917811478208712228e-01 7.279505653671654308e-02 1.501701751396331830e-01 1.325933558180293348e-01 1.160202072691328273e-01 1.564346882911605008e-01 5.555017206571392918e-02 1.413691055135175845e-02 2.013480543589880184e-02 2.013816314391884965e-02
4.092616875041752561e-02 5.397369036701334111e-02 1.103048430496507970e-01 7.974662665589832278e-02 1.401715025645318968e-01 2.558281444000672436e-02 1.963877277547661504e-01 2.062876685048396219e-01 5.835737096801241197e-02 1.759861999237013683e-02 5.031269293806222426e-02 6.417473989492070152e-02 9.031050325810578983e-01 8.609508170225507739e-02 3.045775286425705941e-01 5.692710129534717112e-02 1.037644024103025808e+00 3.480936554309430053e-02 6.305426700933583484e-02 1.352719636137610440e-02 1.845129764725322308e-01 6.069140408200175696e-02 9.203304751009926121e-02 3.156960968623552521e-02 1.847322171878998387e-02 1.228723965799699037e-02 1.108871794645554035e-02 8.716385874333329800e-03 1.487649603649574513e-02 1.668316343307761629e-02
1.756317585909491358e-02 4.705880620702769523e-02 5.973539146400920485e-02 4.813499465250187931e-02 3.189886514693351244e-02 4.002939839624005680e-01 3.996873425472821095e-01 2.490163758949018036e-01 1.352438835688602459e-01 1.377107281525961381e-02 7.239767575189157700e-01 4.673481230991175656e-02 8.857746043401982794e-01 7.130398050482447125e-01 2.219953802132778042e-01 1.877251856727652490e-01 4.132450137790821820e-01 8.159396048113963795e-01 6.423249313255170456e-01 5.983725893546134600e-01 3.298536623754391717e-01 1.275426604244763729e-01 4.270310012946033212e-02 8.332183587723455964e-02 1.513174814355009931e-02 1.089342135975209479e-02 9.467492535608914087e-03 8.985031162080837561e-03 1.824828976837476746e-02 1.982248553388333764e-02
7.722342055564759278e-01 7.029043073747774650e-02 7.359788010595917640e-02 1.823569822071098578e-02 2.033051224507671090e-02 2.351140370115998857e-01 4.132491676477305642e-01 2.339861048436277513e-01 8.642238993383355439e-02 3.662012657647251146e-02 3.467009184545028627e-02 7.266281278690811529e-02 5.329911368387739712e-01 5.473383154454822819e-01 2.832132698270771742e-01 1.136982340443014328e-01 4.242946128972913816e-02 7.701999273935128398e-01 2.605826648060270700e-02 7.316471556212806870e-01 5.203934794749990322e-01 1.621377154864632741e-01 4.131766635908509233e-01 1.360544874308338703e-01 2.737311004539514855e-02 1.458067164392487514e-02 1.022781078189640737e-02 1.182732251750029211e-02 1.850103601659301364e-02 6.800348434530265052e-02
8.908411600478594039e-01 8.311137460659996368e-01 6.463227513592273432e-02 3.930974015208205108e-02 3.295790821933621689e-02 1.376337845413505012e-01 1.799497113989045327e-01 1.938925444026025902e-01 1.634023753283943003e-01 1.597276926424072985e-01 8.247827853012033861e-02 4.913208905192777143e-02 2.379030924122271795e-01 8.895707094481587751e-02 7.405919115297351918e-02 1.289733877390197569e-01 7.082005860353431936e-01 1.843475463703337647e-01 5.889325793597881553e-01 4.242562855679658795e-02 3.033004234194248624e-02 2.623331447686996082e-02 5.058849008285303261e-01 7.927673195877470158e-02 4.092553550374276872e-02 3.816847872015763365e-02 2.391706609025115796e-02 1.650119958325757530e-02 2.180260674008282704e-02 3.916661764946009067e-02
1.456947923339022011e-01 2.199080528665655343e-01 2.118643162230541832e-01 4.301662963389794175e-02 4.780959176932592092e-01 8.119716709161937107e-01 9.615486211407323069e-02 7.579385715292956682e-01 8.743573200899926734e-01 9.262465891168549792e-01 6.634320134622003762e-01 2.859814482116316836e-01 1.317342426382266396e-01 6.033268837425582315e-02 3.519778714010384640e-02 6.551140353963899599e-02 3.870165638590711277e-01 1.821266134766212630e-01 8.928468591621149253e-01 4.092878477499264228e-02 5.839359560142870498e-01 1.617896609966264498e-01 7.499585842540684721e-02 7.181062778549994474e-02 2.776793082709305693e-02 2.844359916913645134e-02 2.525245542120773193e-02 2.196532990000047217e-02 2.552133083345003300e-02 6.021873870221622349e-02
3.277549604677479356e-01 6.025315850552563912e-01 3.138217746408363817e-01 6.133838646212611545e-01 9.033537151935117082e-01 6.823221610340074461e-02 9.201581443546716921e-01 9.207919517728855308e-01 8.085026060399802539e-01 4.488012286539420082e-01 1.783627375748552957e-01 5.353415849526461656e-01 1.158095373840460213e-01 4.012993934091044212e-02 4.546287127259333871e-02 8.664898961224173912e-02 6.876713103664132687e-01 1.082462957695674355e+00 9.528225439827744392e-01 7.283161341566268820e-01 2.325105438654344048e-01 1.333917914421528794e-01 5.304492454646630994e-02 4.430943981454327218e-02 2.111784298864047282e-02 2.224738652585783738e-02 3.617031477999223948e-02 4.654185856754866624e-02 4.562381111048602333e-02 1.306549269389735701e-01
8.548870046105392362e-01 5.531193611904138274e-01 2.924698848182638589e-01 1.181376407141211116e-01 9.763691640009252160e-01 4.297213744286121351e-01 1.397705581810000375e-01 6.843097312787768116e-01 6.260689391469682619e-01 6.253253222743146988e-01 5.512502954815642342e-01 6.874042918482354825e-01 5.483741871783297250e-02 9.476997989929545341e-01 1.493027105338697036e-01 1.274500697042694475e-01 5.260751952447056956e-01 6.016554601946371567e-02 5.459614433653046939e-02 3.153796642159555907e-01 6.098273251761940350e-02 6.187129430886890991e-02 6.705894622536570648e-02 4.377590646708429123e-02 2.568613881211428279e-02 3.944013922815178819e-02 1.570194870860733560e-01 3.115773231851239333e-01 8.752960996365983792e-01 4.212764481822304230e-01
1.411335573617664263e+00 8.944160892116529427e-01 2.061123802681406603e-01 1.288864888461456193e-01 9.898110087730065398e-01 2.005648015854366029e-01 9.952330325376244069e-01 4.422336616112189089e-01 2.060898749733193480e-01 7.387043059586385907e-02 1.002708257310616746e+00 8.545667753618874096e-01 4.272144732228480568e-02 3.652260044409843392e-02 9.424201631658717382e-01 9.443609708388081003e-01 6.668218650096613409e-02 5.951272873564897314e-02 2.747266491905558938e-02 1.831019497000945656e-02 7.644183191413331246e-02 4.818635731605966366e-02 5.521829082342426254e-02 6.069899651848403160e-02 3.395747565815494806e-02 4.365863525862420658e-02 4.226044520589271047e-01 7.068371700319291406e-01 8.550498368896487511e-01 2.189525298551942278e-01
1.210104354058939125e+00 6.098049727800376463e-01 1.289459427964076088e+00 1.062269012704975868e+00 1.709844056812862834e-01 1.284789096641865691e-01 1.154071319544989205e-01 1.038889735965526223e-01 6.759671405272350830e-02 5.310420032549643121e-01 1.032882333965819410e-01 1.302594511561172286e-01 1.861471619076031647e-01 1.071599569482766801e-01 2.562993329786070196e-02 4.913304319598744974e-02 7.217628027872419194e-02 2.787495105548764424e-02 5.292996294225388310e-01 1.287924636328575123e-01 5.298474990093718362e-02 4.722430651871864504e-02 6.097503639351326693e-02 8.538291161304338572e-02 9.138091129034171811e-02 4.988131908943042175e-02 8.052895349264774238e-02 6.268447251866812731e-02 5.500373177472054481e-02 3.879381733592431741e-02
2.343278763916724072e-01 1.344658441334820598e-01 1.149821022709014429e+00 1.099694761845300350e+00 8.656273648236230134e-01 2.007520147061742644e-01 8.543096055812056389e-02 5.735057334525751893e-02 6.840258908775033453e-02 2.044605886386383770e-02 3.346706780325520159e-02 9.516718055064056492e-02 1.638484975981943648e-01 8.555810400445111596e-02 3.108834887361196231e-02 3.963952628783615900e-02 4.371864875508098269e-02 4.737304336113750541e-02 8.943334703963583543e-01 2.964556132358073803e-01 5.123490766024361293e-02 5.190574099601230618e-02 6.139100237168956808e-02 1.098486552651609244e-01 1.044331911331160545e-01 7.451813433098668227e-02 5.738741770115032143e-02 5.196930645676998278e-02 5.621673868942475560e-02 6.045444531925634607e-02
4.825790419718127555e-02 1.213079562708233305e-01 2.861916256047488671e-01 7.969406188909116118e-01 5.250791971836094030e-01 1.705995313198437058e-01 9.045374668652336747e-02 7.828346044731959719e-02 9.688555422702244124e-02 6.337732916052466470e-01 1.781841327709091094e-01 3.627619642508738557e-02 1.349315839033631281e-01 5.246915632667334406e-02 1.665016886986203648e-02 2.175565777996663758e-02 8.894357182119571048e-01 1.856980052657173849e-02 2.847808784271591703e-02 6.311905901491421389e-01 4.967217903340093166e-02 5.430471710093774662e-02 6.848043924434231433e-02 1.135858750687325780e-01 1.443505580007356515e-01 1.262901380641199278e-01 9.408923613752598336e-02 8.833489684174222756e-02 7.724923188252873218e-02 6.370160254960775814e-02
4.018558096514392164e-02 1.147353142286202110e-01 2.041219045628185347e-01 1.470264791900646739e-01 8.732993954676609993e-02 3.460150712858519606e-01 1.175671884355453445e+00 1.030405579019270323e+00 1.370411142377458980e-01 4.269778054977511200e-02 1.520093093298892639e-01 8.138977100033122358e-01 6.174777560996308479e-02 7.526930763034553329e-02 8.107752343526650196e-02 1.236809363982581400e-01 1.117618255735547822e-01 7.274712656785478626e-02 2.051776641981609972e-01 1.294965629145896080e-01 9.025442410523686343e-01 3.289889811017678856e-01 2.456509989623660295e-01 5.801713399052973452e-01 2.488511786270426046e-02 9.920040470615087980e-01 4.472571517451347234e-02 1.012774047641768593e+00 1.063170786261918299e-01 1.224835857768585140e-01
3.715863566796717699e-02 3.734893111684071954e-02 1.015235956908989434e-01 7.582134846368617787e-01 2.770568745631131757e-01 6.380611566834878956e-02 7.854184684626581703e-01 1.007141938898945543e-01 3.123288904474486732e-02 1.618852080207803801e-01 3.356598135986702536e-01 5.263067685593480344e-02 6.325916198869242779e-02 6.231401128238261977e-02 5.695106129966501923e-02 6.958107825904227828e-02 1.205417915597468692e-01 2.115341745384200223e-01 2.188501053196705015e-01 2.341971091039191377e-01 8.745971112381851764e-01 9.792134481763659082e-01 8.120864399313469928e-01 4.345227967258979973e-02 5.183883349247859346e-02 1.905385022536765227e-01 2.364661809430757544e-01 5.417816346211953848e-02 1.097374399904670894e-01 8.370167855525506573e-02
3.386253389603147146e-02 3.691681802486165842e-02 8.308380548167296209e-02 9.214981037673647402e-02 6.184350743674418838e-02 6.534893329378971272e-02 3.635256126966854850e-01 9.720666794481276352e-01 1.915252581173391630e-02 8.240146554503168241e-01 8.964105821672380126e-01 7.121273641440619695e-01 3.195959873948227281e-02 5.533532790800713141e-02 5.226209206216617109e-02 8.106297984461573181e-02 1.432975190788521869e-01 1.779644648285454156e-01 1.051617219763194278e-01 2.660909600284352972e-02 1.968216201280097860e-02 1.466485674824896668e-01 1.925312474365500903e-01 2.698655833274933302e-01 2.310566142551448987e-01 3.030980626293668934e-01 2.430705799122327426e-01 8.281780397887333889e-02 1.589053539951983673e-01 9.325088239589818251e-02
4.312727624308672347e-02 4.982566230821272590e-02 4.853118860255440509e-02 4.560583855004490123e-02 6.551423072963674654e-02 1.094353364585239907e-01 4.541399131166296704e-02 1.331704724266368212e-01 7.557876667098469003e-02 1.586933681827755113e-02 1.644691754738049697e-02 2.567483470365278936e-02 3.784678876877623638e-02 3.798290756459320877e-02 3.779440700463315705e-02 6.871131213526968096e-02 1.522954662285723459e-01 1.579338320364226111e-01 7.688447077793697515e-02 2.697131209571315691e-02 1.175758305298391926e-01 2.152404692828004673e-01 2.784661784630895198e-01 2.900435727347864256e-01 2.581671165183073713e-01 2.240803549804869510e-01 3.318247177857547303e-01 7.877720101786489515e-02 2.194821635310080510e-01 1.187245049828098420e-01
1.064013967018607731e-01 8.370749514729133867e-02 4.081081259191874505e-02 5.722424024497598655e-02 6.762719604381000060e-01 2.404163402049505627e-02 8.524452941837362685e-02 6.758680360249250119e-02 6.648096456883337280e-02 3.286143177133750426e-02 1.947435821091398483e-02 8.285537337811019754e-01 8.002389056683987256e-01 2.016186470942422579e-02 2.793588705578041453e-02 8.500679140141045864e-02 1.061941675540874624e-01 1.342458508536165385e-01 2.404210014886051794e-02 3.839933061862191993e-02 1.304615632057335162e-01 2.851501517920816964e-01 3.551582298615167388e-01 3.746701947724041526e-01 3.123334330620288757e-01 3.022091730230297424e-01 2.814388536916524464e-01 2.890708630188779660e-01 1.115232514207435299e+00 9.197720505219136866e-01
4.221214701609843356e-02 1.172084814959451632e-01 2.024658928334704122e-01 1.646315122097002925e-02 1.878955179027910760e-02 2.374137753796545444e-02 5.146426616143435356e-02 6.424852448491509549e-02 4.393186857916832333e-02 4.331891380126538793e-02 1.637436305541672271e-02 2.223880907024066156e-01 3.428082346500946898e-01 8.013502374203850254e-01 1.601751761627965079e-02 3.939281453778709086e-02 2.307498414063294603e-02 7.812047506663402086e-01 2.496758804455069536e-01 1.790192519598413773e-02 5.051217201374101629e-02 2.715598778497577137e-01 3.468854402837596163e-01 3.692575305233640748e-01 2.735934837840770517e-01 1.284745107925526486e-01 2.103912663778102765e-01 2.261726007752563050e-01 8.836538938289434375e-02 6.734054292842927003e-01
8.751639885231796701e-01 1.936033422137486623e-02 7.960443859812884604e-01 8.832260023840524804e-03 1.179870697751364376e-02 6.615625380093028210e-03 3.343425524681020722e-02 3.362448693791849491e-02 3.969272714975898009e-02 1.480360832209859367e-02 5.906348882623795316e-01 1.511884159203613909e-01 2.641590556654617172e-01 6.362068232045479110e-01 2.453930358731190933e-02 6.659159127392435575e-03 1.780144390216635217e-02 5.976400010436199173e-01 9.808050840769493295e-01 4.080845618224517024e-02 1.620118493201174181e-01 3.093170941962180009e-01 3.349707534860407732e-01 3.250016409539105977e-01 2.557837203739138920e-01 1.916712615318863777e-01 1.892361156011368173e-01 1.876176330504559508e-01 1.186908126682470588e+00 5.180584984039622309e-01
2.273171768941461418e-02 3.033542983343792687e-02 1.236136580177912316e-02 1.104028000567397472e-02 1.251616394990964776e-02 7.874783560240643521e-01 2.967412009862001321e-02 1.962140432533360929e-02 5.544737147778898596e-03 6.445688383239804864e-01 2.598272070949160240e-01 2.289350815284247609e-01 1.281464033411898740e-01 5.895754287634862034e-02 1.242705285567776569e-01 3.539961431538452552e-01 8.548278687776819304e-03 2.367081674738157060e-02 2.233987304783681058e-02 7.917163800691941200e-02 1.650846457850126958e-01 2.571295678974098720e-01 1.051797635710614437e-01 1.623111401949625110e-01 2.043877612373037334e-01 1.570477732743900678e-01 1.407736588077423134e-01 1.608031941878976523e-01 2.909062043355223892e-01 3.164582162849680080e-01
8.451515411241748710e-03 1.611049107027212601e-02 3.989050395981916797e-01 3.470494689360481000e-01 3.294280064321175594e-01 4.835966514791520954e-01 6.783145984805826201e-01 1.693261508360118239e-01 2.354628681581549809e-01 4.078750001603058395e-02 6.031325848613235119e-02 9.501921547961421355e-02 9.056119184817257306e-02 2.841330376521801204e-01 6.254974367218575360e-01 5.582757350642443550e-02 6.173237214214725987e-02 8.306230845266425467e-02 5.772173896598967874e-02 4.405626547199249093e-02 4.231817696088228248e-02 2.977245092002589813e-02 5.173340664758856455e-01 2.109027629229691739e-02 3.760604395989337184e-02 2.404539857775293138e-02 1.148865122463927912e+00 4.197677275177440492e-01 5.406524532832839708e-02 5.043838471834592718e-02
2.274946651329298047e-02 3.042696341875721772e-02 4.584556017508820691e-01 2.710320237476585570e-01 4.570167485859595868e-01 3.606818300469860628e-01 5.666621147173126483e-01 6.256904810159605312e-02 5.551479887971999538e-02 2.401036702789132934e-02 5.945407172096588144e-02 1.098734074597127464e-01 1.197730714073877434e-01 5.546678324995514275e-01 7.146196809972632513e-01 2.879284501535984281e-02 6.351257905608094501e-02 1.205604423553361254e-01 1.391135205431594246e-01 1.227859807997685460e-01 4.312525221566129718e-02 8.706310377634171038e-01 1.024257045611078887e+00 6.339243186572751654e-02 6.793594954546991471e-02 2.405299329088048804e-02 4.856457658343816819e-01 1.986213183631417301e-01 7.384023146890296430e-02 7.081414151466589035e-02
2.864441580985958857e-02 7.305896615071354461e-01 2.624771244030270623e-01 1.162781003110295031e-01 1.500745608185505287e-01 3.423644927819007311e-01 4.492874623249850652e-01 5.096446953859269657e-02 2.738909705550820334e-02 3.120180188413612665e-02 5.668324029713195378e-02 9.692880327171489452e-02 9.034408600140807211e-02 4.326101505964808913e-01 2.321026405136553811e-02 4.524279557987119504e-02 4.832000529199743932e-02 1.131726890568537647e-01 1.452696365683446011e-01 1.257726252509780429e-01 1.315441775066870378e-01 5.516664829240844892e-01 3.778884142116143430e-01 6.816397757065542073e-01 1.203664551205617939e-01 5.902703673512200988e-02 4.410431179279167974e-02 3.379226600310642481e-01 5.917123104827774066e-02 5.345217807585888464e-02
2.115685178387045201e-02 1.297003354002705840e-02 5.917225740895796227e-01 6.538041578488361649e-01 1.572438437109332954e+00 1.102206949247946266e+00 4.604717266928721187e-01 1.904618515271682133e-01 2.903590949725500803e-01 3.704970953341376605e-01 3.462912055949968898e-02 4.046320181678610822e-02 5.374651279667856663e-02 1.057629219186041608e-01 5.484142540515902775e-01 5.101457412603559172e-02 3.021598851366866234e-02 6.073940016478655834e-02 6.668783522385575424e-02 8.101186990596290216e-02 1.041039624593275842e-01 6.921365019347140990e-01 1.113237779213647471e-01 1.939702562864615287e-01 7.924943992696057427e-01 1.520260747840460058e-01 9.411738272303372954e-02 8.851884506548726717e-02 6.823278909149717297e-02 5.964274830249304687e-02
6.205340110783428599e-03 5.759099621910791500e-01 7.640007029616644463e-01 1.514610977786693624e+00 8.829468033305210017e-01 4.031349541249047430e-01 1.858755840892709343e-01 1.323058622848917731e-01 4.331139342636224354e-01 1.642278375548983371e+00 1.144247527845680679e-01 4.251435940201037794e-02 6.503255430760367106e-02 1.245256175205578658e-01 5.306942722910417132e-01 8.798856905540959339e-01 5.258630833232580404e-01 2.306829054670427870e-01 3.295835045598359270e-01 5.624426227897965092e-01 9.831844816344790239e-01 2.314801080053721094e-01 1.205432782044301709e-01 5.833483125311952344e-01 1.332402690943149004e+00 4.117676485562734578e-01 8.466493670730386445e-02 1.258432253576546311e-01 5.532442827131012208e-01 9.431195414694154566e-02
9.297560019283997862e-03 1.438361020435745957e-02 7.502480342902688726e-01 6.125575631964713663e-01 6.028871176804693199e-01 2.251475513606020218e-01 1.500298429869054706e-01 1.576710579529439493e-01 1.835784203867729669e-01 7.188358543512577414e-01 2.127635240285642437e-01 2.213924107325005441e-01 1.853958219897419990e-01 2.071822614095274462e-01 5.553841600980784499e-01 3.655172221402240851e-01 2.335948158613943004e-01 1.317699927573744434e-01 1.121894915956118677e-01 8.418174711501145990e-02 6.737993696382849063e-02 9.868508848357247787e-02 1.522450889079600689e-01 3.643464262542375209e-01 6.216883166757743995e-01 2.786425205022827756e-01 4.072412143165669574e-01 2.801464216901064508e-01 2.895952662201915495e-01 1.911180796300741280e-01
9.806843688454160851e-03 1.142327730329118163e+00 7.306922658427170703e-01 1.106358530130875817e+00 9.831948891671575819e-01 5.385777912163782766e-01 8.105329661212528833e-03 1.531746512826769768e+00 2.437529964446611408e-01 1.743733801928973037e-01 6.676608701699786319e-02 1.658032330652627340e-01 4.367413452188254608e-01 4.383174874528438236e-01 1.268495623404297223e+00 8.942748506015971710e-01 2.623249170036369149e-01 2.851301947098924816e-01 1.267526261787949027e-01 5.579910713209936673e-02 5.427472757008154625e-02 8.508418719839538902e-02 1.301834260633815132e-01 3.975015214022269427e-01 3.997828131564406529e-01 9.370482372172343755e-02 1.027321766559424754e-01 1.319501320328606564e-01 4.303317846518783796e-01 8.806340787125795100e-02
1.309351177238918598e-02 2.033159696832875091e-02 8.382049371590345466e-01 2.445641631204848246e-02 1.584370526666064455e-02 2.100546784531031469e-02 1.863810628091085164e-02 6.059396494944839784e-01 2.414120751426142297e-01 1.382514137881678540e-01 4.258783112279512090e-02 5.854653115446085965e-02 6.576817721296626673e-02 2.405421728503890355e-01 2.840998274771527887e-01 1.169348960063376908e-01 9.092421275519413371e-02 9.058539910973745224e-02 1.203785159018985057e-01 6.942640556158111154e-02 4.938468129034912640e-02 7.377753522957852805e-02 8.437977032811903866e-02 1.406408235795121031e-01 4.359014525242732585e-01 6.815268461467847982e-02 9.824395333625537963e-02 1.609890179380916719e-01 1.946477739414013974e-01 3.864426486993693954e-01
4.413571562249763922e-03 2.129298996425196128e-02 1.297800725407267874e+00 7.476725429454572636e-03 1.603249052150292064e-02 1.675006744271382436e-02 1.415003869769211955e-02 4.131208251200236270e-01 3.190611890905062920e-01 2.987967611935841705e-01 1.236699831054840631e-01 6.436732039251441551e-02 4.144397566753090650e-02 6.575707929845331368e-02 2.985993836852083860e-01 7.654539045092094429e-02 1.989230149481369947e-01 2.464955815494762614e-02 4.276713258168722553e-02 2.660710264463911345e-01 6.890652734168478677e-02 9.662051471044282025e-02 8.432024166008440791e-02 9.265919862511771965e-02 1.224041171929707850e-01 9.331402286145359937e-02 1.094400390625297342e-01 1.352761950729127749e-01 1.831345766541359055e-01 4.510568764113584428e-01
