1.347352340505695301e-01 6.334313353193466063e-03 2.132949486916768927e-03 2.663690970307002956e-03 2.008253912016702385e-03 4.386862315334100031e-03 4.348544413105555166e-03 1.175597933019972320e-02 2.131143877092095754e-02 9.508894446645810988e-03 7.158348006717242355e-03 8.072918331123454805e-02 5.035824703994840057e-02 3.607750806779685439e-03 2.962035485049736936e-03 5.407324067564887871e-02 2.410668800488174803e-03 3.313805172451111079e-03 3.020785902389105503e-03 1.275613105911824327e-03 1.237239852801653734e-03 2.522767249593323158e-02 1.989849857939317984e-02 7.943411756243851096e-02 1.546964528473155631e-01 1.217582719212377956e-01 5.615319122734550167e-02 4.904965185357624928e-03 4.645875192377267593e-03 5.797684998346420288e-03
8.856042530490713938e-02 6.708780006307372284e-03 5.298734646328787622e-03 4.294501125381456133e-03 2.979332486509044756e-03 1.507227845367602181e-02 8.008581080615874079e-03 9.939461649059993381e-03 5.786703376556973782e-03 4.395070877325181306e-03 4.822039388822567212e-03 4.217031442728851054e-02 6.037374354921106606e-02 3.307416837477814616e-03 3.467628687820667986e-03 2.277679222160343842e-03 2.352313464980831589e-03 6.126350888375410586e-03 4.628142608990178618e-03 1.781672958470075646e-03 9.499517470584485646e-02 2.408180834440677362e-02 5.165445520630333742e-02 4.619966410649448130e-02 4.106093955450563354e-02 5.527766548537822733e-02 1.950421038380408673e-02 4.934566776345283672e-03 6.987053203856614762e-03 6.948816906170368797e-03
1.962699775657968798e-02 1.931675339693486246e-02 3.496119276985756863e-02 2.839556266632392231e-02 6.029335731064843634e-02 6.944422263935715739e-03 7.197149491056614723e-02 7.547418396175287203e-02 2.823578215068282826e-02 6.405994759327113264e-03 1.703944886103056500e-02 1.280765815717055042e-02 4.711446999479874942e-03 8.937858054830737087e-03 9.214194793807321815e-02 7.484130227407587849e-03 3.421287527829039443e-03 5.577725543144868015e-03 1.847746372966330847e-02 4.826779648321110130e-03 6.086442798088707862e-02 2.042135774558027222e-02 3.117302971523488661e-02 1.089259877009223811e-02 6.491423592467624078e-03 4.302061961526675374e-03 3.860630843196278736e-03 3.024105631237982046e-03 5.143301488378040562e-03 5.748874750572261633e-03
7.754445493615621902e-03 2.201453455780660873e-02 4.828019313102153293e-02 3.898003248850019642e-02 1.818386882040403177e-02 3.158234507881100672e-03 4.796345280973173149e-03 8.583366747255349871e-02 4.944030817548096535e-02 8.191166110807267600e-03 4.707747242135077587e-03 9.341430152606702841e-03 4.200883609388496136e-03 5.917701290338253477e-03 7.038274001088504206e-02 6.183811805315941185e-02 1.715980044272943797e-03 2.164215841835648215e-03 1.521194853516929677e-03 1.738094227812781584e-03 1.066546830472641372e-01 4.102342789436525666e-02 1.388253927622647155e-02 2.714945677531958174e-02 5.276507136586714754e-03 3.817411431269786097e-03 3.291544773648206242e-03 3.108277951978316057e-03 6.281624966416743047e-03 6.792909182820308124e-03
4.511823440304475914e-03 1.396405582764566507e-02 3.894764312105994386e-02 1.510195776171329753e-02 1.079804688425055857e-02 8.262674483718207563e-02 5.443273561410691581e-03 7.920526745079591036e-02 3.067936229899230829e-02 1.969006382344154482e-02 2.086936850328786203e-02 2.094965627021057319e-02 3.827218641089087919e-03 6.053705028139802491e-03 9.134836580416146046e-02 3.709934285260003267e-02 6.941169618049579035e-03 2.335206599529494453e-03 3.767167848943569607e-03 2.199920551509409496e-03 1.809092743960092524e-03 5.335292372006435885e-02 1.332824193939860296e-03 4.309701652184680376e-02 9.543180638957276044e-03 5.132587471763783507e-03 3.579471427638836103e-03 4.109257758626048106e-03 6.381301005341731211e-03 2.329712531899905473e-02
6.532396352281022271e-03 7.035060015309840299e-03 2.643204051290475379e-02 1.863136576565448121e-02 8.642480870954543856e-03 4.810445799827786639e-02 5.995499092940865388e-02 6.263200468251541031e-02 5.215295605451904931e-02 2.807122420658129253e-02 2.369577635423348455e-02 1.679897308026111202e-02 8.066179579394613941e-02 2.987732783719906568e-02 2.477547989050786145e-02 4.235361647742358349e-02 5.547102315930125746e-03 5.667844706625704831e-02 2.214287267978177088e-03 5.672211911741178135e-03 8.422699778075073626e-03 5.539221287831533336e-03 1.945103644436926241e-03 2.560455625213136840e-02 1.429496756236094644e-02 1.350300679160760901e-02 8.452407502861915625e-03 5.773497642033068901e-03 7.549743831859654329e-03 1.344837401186233308e-02
4.748012050121815791e-02 7.216138745145020406e-02 7.090381652410036872e-02 7.595427664549343587e-03 2.888743750526571921e-03 5.740853450539723339e-03 1.007368408946310301e-02 5.488649101880947213e-03 5.302195516156271368e-03 5.819025862500082878e-03 5.016429419202537467e-03 9.761422941333898484e-02 4.559778813789485546e-02 2.132212728918610189e-02 1.230259953524440349e-02 2.105076960051605744e-02 1.193258500924753163e-01 5.352332139845699527e-02 3.533145209731629755e-03 5.005746036659502844e-03 3.354362726487413685e-03 5.466177118230427373e-02 2.561390622228540415e-02 2.411367347239094100e-02 9.781653233033701239e-03 1.009996368837484323e-02 8.904447175638133608e-03 7.604274640825509253e-03 8.618121936255445856e-03 2.025052360475486715e-02
9.751293494172505461e-02 7.192978050021077603e-03 1.001128440223545413e-01 5.203576913743002824e-03 4.931403017135408545e-03 5.436478844518977116e-03 4.670414671686481944e-03 4.265859452833525335e-03 3.292023909001827193e-03 2.212671279532905325e-03 5.359718479967942595e-02 4.479833148594610480e-03 3.866006335782640191e-02 1.400911658643082952e-02 1.575187995699482355e-02 2.891230650407521086e-02 5.421433127918291218e-03 6.583263862736551258e-03 4.575563941261798911e-03 4.029551273074672389e-03 7.903173229663784660e-02 4.651147864792404968e-02 1.878990739159042828e-02 1.574510611483628461e-02 7.493463618485319069e-03 7.765204748219788587e-03 1.194659141256854649e-02 1.336279749092231413e-02 1.317562117725064319e-02 3.787978624534544397e-02
6.221089404545620052e-03 5.225989577477027463e-03 8.611368236476224514e-02 1.224488971236058557e-02 6.125081846822042278e-03 2.539204813149478941e-03 7.952684802812349379e-03 3.787398845607406125e-03 3.183374117690012783e-03 3.693210205152984166e-03 2.690365851623183115e-03 3.989503292427354179e-03 8.004790764659227773e-03 6.529996025833365546e-03 5.099268550630794983e-02 4.259629129885738469e-02 3.051405096312751700e-03 7.287281584818075530e-03 8.532556665657484163e-03 1.069369886564690147e-01 2.123469928356508732e-02 2.205871705310280539e-02 2.392818430819663306e-02 1.559729121303007719e-02 9.093951123152133748e-03 1.334379234611378015e-02 4.678612481028575354e-02 8.285024683939935797e-02 4.545811248079094022e-03 1.152150278963861990e-01
6.199005957091011099e-03 4.838665647050319381e-03 7.689276400304718290e-03 7.145345536027022243e-03 6.712176224391142206e-03 6.285342252388993745e-02 8.641824378648492108e-03 3.746107365065393536e-03 6.072963379831750746e-02 2.222147024311210695e-02 4.333222485008512807e-03 4.171574941189796180e-03 8.907125233623811381e-03 1.090776960206442554e-02 5.552747575735820368e-03 6.019407670125462989e-03 2.884409042064475445e-02 2.811695253511106371e-02 1.452612885059159295e-02 9.071291033007314319e-03 2.747475416911102780e-02 1.725399538936476032e-02 1.967094921466616339e-02 2.147251615522658558e-02 1.189670808768731290e-02 1.468394967195027490e-02 1.262675273689790045e-01 3.876814592584060509e-03 4.640851822485653894e-03 6.004624050409789610e-02
9.121793472399926037e-03 4.639786257122286046e-03 6.918181198996594186e-03 5.124826508126046308e-03 1.041202116443420284e-02 3.937964660688800245e-02 3.744336266029594379e-02 3.347962560257880527e-02 2.243019449613175773e-02 3.495313975645089350e-03 3.454164203475810352e-02 5.679568682885885456e-02 1.188367891585803693e-01 5.952325144983582061e-02 1.111957564401412635e-02 2.209471114404083780e-02 4.123096911931664610e-02 1.137991409868712236e-02 3.847048405381476698e-03 4.568827164342293551e-02 1.911213265694038099e-02 1.694046874786379539e-02 2.170099089501906220e-02 3.009979297066344220e-02 3.185628111055578693e-02 1.690882358044560468e-02 2.510167742618922213e-02 1.840416667714086726e-02 1.622946344463505747e-02 1.171240564462140872e-02
6.836828150556069350e-02 3.724319112976114815e-02 1.029809273046255157e-02 7.109917642622358425e-03 6.532675655625276231e-03 6.167539082922613575e-02 2.928290704476653461e-02 2.003412602011036062e-02 2.348615287309959582e-02 6.134295585676564216e-03 1.060703713465705085e-02 6.972972750293657263e-02 1.232701279140755030e-01 6.529445740787807873e-02 2.401041896787424121e-02 2.762546161098286199e-02 3.065153338470546704e-02 1.808287885939039927e-02 6.440553990596484951e-03 1.056736879909803278e-01 1.855055748272230881e-02 1.873927779848310118e-02 2.198623673681806764e-02 3.894326043192659209e-02 3.662176725173450775e-02 2.576785397092259261e-02 1.952781604232255858e-02 1.741131542119238318e-02 1.871844316464974303e-02 1.994143648959837214e-02
1.598905538054482336e-02 3.759641913886578590e-02 8.238635752978043514e-02 8.441280456143314750e-03 5.718386529407355409e-03 5.089787789645754124e-02 2.902976852978497724e-02 2.541168487032597831e-02 3.224534254925661564e-02 3.410337055815947614e-03 6.180316507670104847e-02 2.324525772749660990e-02 9.189640057355194513e-02 4.052525288439920437e-02 1.308919769668648141e-02 1.554422529540643375e-02 5.782590230253137516e-03 8.517152703830081079e-03 1.248688363794247733e-02 5.456766480647043047e-03 1.801302074352028465e-02 1.959652769212683054e-02 2.440312423382009696e-02 4.011690325408635849e-02 5.024092621653032664e-02 4.388085873054531350e-02 3.198395916608291062e-02 2.966480241432929016e-02 2.569938031389782870e-02 2.102640457785928674e-02
1.360391048213197701e-02 3.734874759587866050e-02 5.787266819963288872e-02 3.985139830536776201e-02 2.349574906832065796e-02 1.028906143855758820e-01 1.052029729514012031e-02 5.522301651438886634e-03 4.500470890265209634e-02 1.469636552392528106e-02 5.225776381562026451e-02 4.336091936548550768e-03 4.193257465686262009e-02 5.881098224416381887e-02 6.483683088217630230e-02 9.033701931488959114e-02 8.218304517426376632e-02 5.375212134429879079e-02 1.478506874825520623e-01 7.011401635748049088e-02 8.683359493777553437e-03 1.182450816579800335e-01 8.731568116281276937e-02 6.204920556500334583e-03 1.082946433191647566e-02 8.716818500195863337e-03 2.138618566716289290e-02 8.874408461618949959e-03 3.525111380418199242e-02 4.021282365644290868e-02
1.290088322570647969e-02 1.248297816217162036e-02 2.989250224569077116e-02 1.382231503934815142e-02 7.725095292156036741e-02 1.941216623059641502e-02 5.207957179381076003e-03 8.502123318532747373e-03 6.614958024981275504e-03 5.651206167167785455e-02 1.161260406279552987e-01 2.145625241885703097e-02 3.777192019197185557e-02 4.947042648175722923e-02 4.602438977821084881e-02 5.718432187469646433e-02 9.906875970240582030e-02 1.735200862000073063e-01 1.789387394902415829e-01 1.416321971930817880e-01 8.040087892444808607e-03 9.795885033527096733e-03 8.423430040317541820e-03 2.032190832410787559e-02 2.418730842071098799e-02 1.215967766085746249e-01 1.190735764055755042e-01 2.814656960370106806e-02 3.617425289584600551e-02 2.738219273109119417e-02
1.208235100694863250e-02 1.279964250715867093e-02 2.495069048362512712e-02 2.631253257758870562e-02 1.707413777591737514e-02 2.055559505076990853e-02 1.776056736934199243e-03 4.196306018253751283e-03 9.539490911435008491e-03 3.960446152704278321e-03 4.114822389839305553e-03 3.199099503933374583e-03 2.153162347414576058e-02 4.465383149822364089e-02 4.258593589668385748e-02 6.660367371374918688e-02 1.175889136237396881e-01 1.456913826920351596e-01 8.580350306771054869e-02 1.890938628515895226e-02 1.128954081446641340e-02 7.706554573151706833e-02 1.116215096203104634e-01 1.843701735357998195e-01 1.700975538175321378e-01 2.174687975726697642e-01 1.705287797314151144e-01 5.343889167797694767e-02 5.214545894640684048e-02 3.032875454443047583e-02
1.575114043103851766e-02 1.789511750784737038e-02 1.671169182510696266e-02 1.503777677084057809e-02 2.182470747462245467e-02 3.828152013157684608e-02 2.595333467661810681e-02 8.256117683281830044e-02 4.034440694787297388e-02 6.857009751636386659e-03 5.044810567673391200e-03 7.784465129470530612e-03 1.545137237031902512e-02 2.316643002744119342e-02 3.107238505982033369e-02 5.647139004412696228e-02 1.248319811631099369e-01 1.289309622753022355e-01 6.256106508483313955e-02 2.177431550072056812e-02 9.319892835227679140e-02 1.677403500009973236e-01 2.135313895154755393e-01 2.153080972038111107e-01 1.854675754786105635e-01 1.566800995581713318e-01 2.264181440833985537e-01 4.164116146876215702e-02 6.776716861826490024e-02 3.638999948051127586e-02
3.962814239244286801e-02 3.107451786947686145e-02 1.492301078065803172e-02 2.072558709208780978e-02 3.377130349189722165e-03 1.302481782589199819e-02 6.870012650841289537e-02 5.554383339121081453e-02 5.477352760009962518e-02 2.721388669841675115e-02 1.096398188621604611e-02 3.626128804454260314e-03 3.524069444467104947e-03 8.170957061522075154e-03 1.509711313386559277e-02 6.970640193031421572e-02 7.553572502296838909e-02 9.408562974706820292e-02 1.686569291674981305e-02 3.020869351739485439e-02 1.026648615872584602e-01 2.198684699168142187e-01 2.684308979098296022e-01 2.723773252733880379e-01 2.190545370305962414e-01 2.056768133668679388e-01 1.865236313378631494e-01 1.507067290830342021e-01 8.112362125790289341e-03 5.583182831642708593e-03
1.558826604059376959e-02 4.309636174120362595e-02 7.496367565342909600e-02 6.439055994712703651e-03 1.025716213076929839e-02 1.368117850457827370e-02 4.318726892051185512e-02 5.396981241267368584e-02 3.694793467721901870e-02 2.861376729424737128e-02 7.607160440814722362e-03 7.903966540974999289e-02 1.183867073695227257e-01 4.120897087445952491e-03 5.397632131717696943e-03 3.169447657206817676e-02 1.242786179837711454e-02 4.255574049741290762e-03 8.988121407653455741e-02 1.074911124472019593e-02 3.917049208271079080e-02 2.066393009463453889e-01 2.590253500545582899e-01 2.672543312299664464e-01 1.918574575000397409e-01 8.728838199454219682e-02 1.391470386175723828e-01 9.468738977146699820e-02 8.512234598398338292e-03 3.318628799952550498e-03
4.243636726305909795e-03 6.410995711744339742e-03 4.010802790922097724e-03 4.149495297140390858e-03 7.752778169290707420e-03 4.417110565584553283e-03 2.255370354983443626e-02 2.890891288517353705e-02 2.644069468475128415e-02 7.489598834516856748e-03 3.186537931103146110e-03 5.448562349728662546e-02 9.213250461311485451e-02 3.694044149473284938e-03 7.362020557279071349e-03 4.609223804818423677e-03 8.264968022233008110e-03 2.634871259113286818e-03 5.054088346956257111e-03 2.414829831131207541e-02 1.247607770113192543e-01 2.342029953084084348e-01 2.493033532616041603e-01 2.351933202381836507e-01 1.791341498336323779e-01 1.299381530541273144e-01 1.246949334084462707e-01 8.951145865438757399e-02 1.367515137940515310e-02 5.345956640057597867e-03
8.672571690267003724e-03 7.972137503433123981e-03 4.099289733456953910e-03 3.578461744682427496e-03 4.721638959849074578e-03 2.485629479955997305e-03 1.194674245337480623e-02 1.162834492685532045e-02 3.291289314714986470e-03 2.294502630903932743e-03 9.315179345888656426e-02 8.214157403562165338e-02 4.489248254167740870e-02 2.032898481814040745e-02 4.258119848901256721e-02 1.267349927034718167e-03 4.447552256330976859e-03 1.040626183490586144e-02 1.027103997797346180e-02 4.654200331404148572e-02 1.264377072782508216e-01 1.818805599280309271e-01 7.346709312613725062e-02 1.104408927067062202e-01 1.429427858348607250e-01 8.091808938343103552e-02 6.776738504550805509e-02 6.182872150647406029e-02 9.105950582491308121e-02 9.890415689434900459e-02
6.972155496726717763e-03 8.042275720658041693e-03 1.527172057867675530e-03 1.314132145113457032e-03 1.149816006438907079e-01 1.544768949632343864e-03 1.954736329981600958e-03 6.044821825682989563e-02 8.541548068700303975e-02 1.475292467914636994e-02 2.167805120918910033e-02 3.432857098251426015e-02 3.141751601731607862e-02 9.585530779336456919e-02 2.673382604295568201e-03 2.294224546104914331e-02 4.314156857607762130e-02 6.397164934059561270e-02 4.473433170659715796e-02 3.405275238182239872e-02 2.395135600912599513e-02 8.500649253840988906e-03 3.274975137088112411e-03 7.149058637949126487e-03 2.610358525588508949e-02 8.870358249998579192e-03 1.143422080914963807e-02 1.343668383472026440e-01 1.748636323808439724e-02 1.631447642018426375e-02
1.473290133583744256e-02 1.276201305554600443e-02 1.877680673921191916e-03 9.340494690782641385e-02 2.007769938973450602e-03 1.221559953767191314e-01 1.860957505410995279e-03 2.172375517684752705e-02 2.041543457648387766e-02 8.847949582652158210e-03 2.184788480474637168e-02 3.966342688434875557e-02 4.061901194590310238e-02 2.872430998401342105e-03 2.949910360410774608e-03 1.309126397051786801e-02 4.903771733881207712e-02 9.357478025976276315e-02 1.083393707001680112e-01 9.470636128577945845e-02 1.989725154365450457e-02 5.838684509552211424e-03 7.114268150568338160e-03 1.686562692586182285e-02 3.007074878070197313e-02 8.926391305937227474e-03 5.490664603756696682e-03 6.389156303644941137e-02 2.403861739833468292e-02 2.301605066903359212e-02
1.835572074022134501e-02 2.646193492511744304e-03 9.265821393034781583e-02 3.851117591105400473e-02 5.005013758186680622e-02 1.126160990571814374e-01 1.548277687159779203e-01 1.786724250551988830e-02 1.009675470607210995e-02 1.151995409071694502e-02 2.086975908287916348e-02 3.497720348359333042e-02 3.046825812288964444e-02 1.826505226216335563e-03 4.361752213915194576e-03 1.891559896796928680e-02 3.750395383566740987e-02 8.826874323934216782e-02 1.133482588659843332e-01 9.665987133484146843e-02 4.765406528145724879e-02 4.126171984969790284e-03 1.205971534902322145e-01 6.405891775264819718e-03 2.693314770757205059e-02 1.469280632624540839e-02 1.884468461257537281e-02 1.097007876275925692e-01 1.924264668587654867e-02 1.731243788604661799e-02
1.010413415953505083e-02 3.609468495492741246e-03 1.573420469296699011e-03 1.647072430431127665e-03 4.009012633036697013e-03 3.815139669703722109e-03 1.660479176159119497e-01 7.051421959330464451e-02 1.028347929095705798e-01 1.314327009926730128e-01 1.230498044063331985e-02 1.459228433264393721e-02 1.840191450324042341e-02 3.441643004892064317e-02 1.978085262470683295e-03 5.892047758120884729e-03 6.559654077177942688e-03 3.064215941239174096e-02 3.962715915011175843e-02 3.232051040631499228e-02 2.995417123995347194e-02 6.992309649063509908e-03 3.314813020523017101e-02 5.347565980429791477e-02 4.837404485611125106e-03 1.092063035773539748e-02 3.517189187234901621e-02 2.369676712421868101e-02 2.160559334246982613e-02 1.875109569321514735e-02
3.612132901148566895e-03 1.439887234323803137e-03 1.558046848468995797e-03 2.666328112212935919e-03 1.792142406401686433e-03 1.370977027303278695e-01 6.731964036450684141e-02 4.915377805647801884e-02 1.511936102974072715e-01 4.849976490908050955e-03 3.988327278978719137e-02 1.486267136326040877e-02 2.164501374628599248e-02 3.729245009162465013e-02 2.681963213767582510e-03 4.428657798005296298e-03 4.210469711339338665e-03 7.888528114043615036e-02 1.156837690036210259e-01 5.075188511459287691e-03 9.761588074075502539e-03 7.552995051137587068e-02 3.656235918939670232e-02 1.068734862707439517e-02 1.964035971798751279e-02 5.876391046506071469e-03 2.741984942639230649e-02 4.170714519268283599e-02 2.411486008712737314e-02 2.989830089757910050e-02
3.660740465915710527e-03 2.951316159847252457e-03 1.457859196228445970e-03 1.082072509051581815e-03 1.254308573112696609e-03 8.046084358047518592e-02 5.517303428516044661e-02 5.780508743817781847e-02 6.328713333481596204e-02 2.023984836651007094e-03 7.385431429349188781e-02 7.449362590452622557e-02 5.908796938703550494e-02 5.734289731239677890e-02 3.474604610657971732e-03 9.491703493913047907e-02 7.020288785945624777e-02 4.443215713373387110e-02 3.907406933334297422e-02 2.926632835984542200e-02 2.308708587271798840e-02 3.297486461900104443e-02 4.814476777834554577e-02 1.085334223743075893e-01 2.906968242628486451e-02 8.331420361732981561e-02 1.328322690292302322e-01 9.180972418688328196e-02 9.420074294901184531e-02 6.170714726586334214e-02
4.971901914975848484e-03 2.603737685329802088e-03 1.499195774377772234e-03 2.071671875521930752e-03 1.954534214855075964e-03 1.094739877515274375e-03 3.862257608030644079e-03 3.344506897787018467e-03 8.657750419308346546e-02 6.312463479344032624e-02 2.375052212796896836e-02 5.559876504187755142e-02 1.381989105110064397e-01 1.231663011200648111e-01 1.225765954488499537e-02 9.349314881521681234e-03 7.997095584403740576e-02 9.640910920372947057e-02 4.427113643447106589e-02 1.965868405646361422e-02 1.889804729281656034e-02 2.905294863098584895e-02 4.315580563034946554e-02 1.274471492769954917e-01 1.270879162652275296e-01 3.001876121642660378e-02 3.399858164549362377e-02 4.367265774508600346e-02 1.414564822137835964e-01 2.877871212011326452e-02
6.698771699173186427e-03 5.824521010343911530e-03 1.788203391903844157e-03 6.175260250814416235e-03 7.211807955668602180e-03 1.343948618830380880e-02 9.456998842666236582e-03 1.453824163078494547e-03 8.759802375947542408e-02 5.114677376671425413e-02 1.552196967704940964e-02 1.978165846417162185e-02 2.100980543413233023e-02 7.112196200040178662e-02 8.049173081656006701e-02 3.359918908589402953e-02 2.819470222826234510e-02 3.089888965394733608e-02 4.223912179706438424e-02 2.455708500924022944e-02 1.734059078381671587e-02 2.566816284665572948e-02 2.885141650503020988e-02 4.707886749631292472e-02 1.443321063131329796e-01 2.258634131290653685e-02 3.273396770673452777e-02 5.340938999598903586e-02 6.414069658721785472e-02 1.266666174531831390e-01
3.695000857487650697e-03 9.230689932048940019e-03 2.773929079391015528e-03 2.977794141984658159e-03 1.442850275192530084e-02 1.508914570568852323e-02 1.059122674452587023e-02 1.533668189046566432e-01 1.177296511308463939e-01 1.107813044259844254e-01 4.557258485280999555e-02 2.298777382497747129e-02 1.375222281745093998e-02 2.145935414303895561e-02 9.727454267079811701e-02 2.531862906971380639e-02 6.865615270497998912e-02 1.234673157496442644e-02 2.421907336920095521e-02 9.443175060983734215e-02 2.427545940235497843e-02 3.384213652692392299e-02 2.931350193002047258e-02 3.163788592228664737e-02 4.144184737894283238e-02 3.153146760652247860e-02 3.704752532323084963e-02 4.547517714943859896e-02 6.093291378113788875e-02 1.490024834884116356e-01
