3.341571496106170245e-03 4.361774504505885539e-03 3.827203458879400132e-03 4.873156886671442881e-03 3.705149963615064074e-03 8.132797970019367551e-03 8.023578767401756684e-03 2.161481779190902938e-02 3.923464342618830647e-02 1.983688068710982855e-02 1.037452596567757859e-02 3.616961731613760334e-01 2.282836978777204873e-01 5.984771431214267259e-03 6.879424551924099608e-03 2.342973900626892647e-01 5.215021879670400998e-03 9.014451155575258987e-03 8.080472538555687895e-03 2.812608061078323684e-03 2.230531438796655701e-03 6.299504215582242550e-02 4.881541525697292300e-02 1.603137517005812362e-01 9.582914386557576632e-04 9.057852748053143999e-02 1.416613465871918200e-02 3.057260308378176306e-04 9.043965824127934679e-04 2.905038655622056189e-03
2.718573236053970499e-01 3.701273552240771057e-03 6.712339344255596578e-03 5.479257390403432203e-03 3.830768349310609971e-03 1.720539280202059915e-02 8.193793452830892138e-03 1.017852903050803400e-02 6.622157412990855967e-03 7.069779547376415021e-03 6.209619886442843163e-03 2.057780160784053736e-01 3.080927115166722796e-01 4.800443136782119209e-03 6.603785097157425371e-03 4.204335331283971626e-03 5.135395111025744218e-03 1.653331724969043376e-02 1.232132971507970444e-02 3.662625758142594359e-03 2.627228383148407231e-01 5.899257503865694419e-02 1.238374064373983369e-01 8.666240588847927417e-02 4.522311867468589708e-02 2.557777125183220007e-02 1.376671570326512247e-03 1.167967701396812165e-03 2.831333750131030755e-03 4.038637992685971054e-03
1.984645772622187915e-02 1.337799523268324957e-02 2.846711598664040249e-02 2.307899529205852118e-02 4.960585752256966435e-02 5.081171862026512449e-03 1.262148291953627266e-01 1.350671211753937395e-01 1.634567159809240111e-02 7.448067192974734338e-03 2.770827666731956115e-02 2.382804386946488912e-02 1.002698288087445523e-02 1.456667598253167870e-02 2.746924702607838210e-03 1.142897180817544975e-02 7.544724438199658031e-03 1.519182804971845775e-02 4.978994145228074486e-02 8.156166488878046836e-03 1.648738615396863616e-01 4.796339425686611813e-02 7.333874610773701008e-02 1.941505809751374947e-02 6.029013011238656440e-03 1.001793430825042262e-03 2.079847128636469651e-03 1.749850038568330881e-03 3.160435927490140746e-03 3.805511036711247894e-03
9.120001934764612045e-03 1.717192436555333226e-02 3.774055397032732850e-02 3.024460854139622221e-02 1.254106551320688899e-02 1.941720363967275450e-03 1.547013746519681002e-03 1.384976654437233834e-01 8.393484119889633999e-02 8.959742291237337772e-03 8.052395974061807293e-03 2.102595342399789582e-02 1.074051037729337882e-02 6.745006163139100758e-03 2.855948876606014819e-01 2.102360183146769756e-01 2.660431618655408580e-03 4.891066588891106355e-03 3.434406607110739376e-03 2.893205174236949777e-03 1.288535919327787015e-03 9.206271790250873666e-02 2.895887872084267761e-02 4.311600632017400375e-02 4.459686158797670358e-03 1.055810004637644560e-03 1.075537777148221751e-03 1.035660795629086148e-03 2.101066679901410737e-03 2.352685532846414320e-03
5.261749556410358353e-03 1.078688077329687835e-02 3.003380609218411421e-02 1.163148386206187997e-02 6.720199369601819253e-03 1.321081212512368042e-01 1.501816148562726142e-03 1.124451055553543355e-01 5.149226033348633380e-02 2.066564276659928548e-02 3.613803900181934009e-02 4.069004954782785843e-02 6.612139295947522082e-03 4.787493304984986354e-03 2.870328270443320284e-01 9.398450423281119737e-02 6.159910581187296418e-03 3.495864311274579032e-03 5.590688964384444605e-03 3.160872206220871009e-03 2.137254688518166416e-03 1.175740596334194366e-01 1.234087158070794549e-03 5.852179228154583135e-02 7.602066948574766683e-03 2.140107985194463370e-03 2.981027736166719840e-04 3.361548979554378376e-04 5.026657546086007707e-04 1.822726211007532401e-03
5.239190447884766073e-03 3.661279946684764790e-03 1.638212245243844331e-02 1.309311164657135478e-02 5.204697512687231527e-03 7.655376494376733842e-02 9.239678921983468518e-02 9.825677104370479642e-02 9.017894400520225229e-02 3.198627076265741359e-02 3.512622110154520194e-02 2.447248121777697086e-02 3.889425730279926219e-01 9.903812593120231433e-02 6.117012287788958780e-02 7.780020384449022608e-02 2.475476507502506491e-03 1.043022229218583952e-01 2.074966865336528264e-03 7.085214079133725883e-03 8.479642759903911406e-03 4.919545836589147778e-03 1.187630573162161895e-03 2.754075649748609009e-02 1.081493049040228860e-02 7.684064804879371484e-03 3.273525585605410303e-03 2.262073493836425607e-03 2.928151914917292466e-03 5.365329147080737625e-03
1.164820765090482102e-01 1.386622686083157918e-01 1.406875240973345653e-01 4.924833529863653810e-03 2.269416351341921063e-03 3.699186306909957658e-03 5.589664186750154667e-03 3.176228726545649288e-03 3.752682144267835765e-03 6.501890498754677068e-03 6.845375137421946983e-03 3.662518011012941450e-03 1.973370463528107965e-01 6.102448787640499250e-02 2.405559016661931032e-02 2.934824982741577465e-02 1.038997303502499879e-03 7.629625107701916431e-02 2.469094253706817944e-03 3.328989103938221391e-03 1.494058134358065620e-03 6.330279628660852309e-02 2.523548021580085746e-02 1.966147985462361400e-02 7.284147497333204498e-03 7.489097390220646709e-03 6.474333866216897340e-03 5.646065605916014869e-03 6.469537513631872308e-03 1.575651896966039078e-02
3.101812420286382318e-03 4.817515718735966221e-03 2.536495488614576906e-03 4.892632474465958767e-03 6.649886434789200988e-03 7.066719956193362288e-03 6.224883043111661442e-03 5.835627643599646149e-03 4.662630496889121068e-03 3.294203320488738301e-03 2.091646169994459126e-01 5.989931183950061334e-03 1.663522613212621293e-01 4.711647732942934874e-02 4.005969062620952370e-02 5.943720426983357952e-02 3.250884802631444706e-03 5.160213674154182431e-03 4.502115518669306399e-03 3.165939351368539292e-03 1.406805006372421896e-01 6.746405326441447248e-02 2.303996787344804106e-02 1.794164927053836997e-02 8.437194611165470953e-03 8.849039135180244986e-03 1.350596984506859631e-02 1.543094832167039160e-02 1.388381276179903763e-02 3.668020540513786121e-02
1.185451941567205320e-02 7.108306623398319944e-03 3.643859944347946789e-03 1.821616828830700113e-02 1.003298305648771781e-02 3.931263907283657870e-03 1.257298712494642548e-02 5.583190934689678114e-03 4.647897658359136965e-03 5.170556293260794752e-03 5.156700626581195955e-03 7.547018510540625356e-03 1.671108717741561639e-02 9.805900390400530686e-03 1.737097512100838625e-01 1.420413305911054913e-01 4.370005294367066903e-03 1.315141622133769901e-02 1.287522517334336973e-02 2.127067055276200130e-03 5.269971467863330400e-02 4.126796888533801333e-02 3.932508278108654692e-02 2.413289450418663884e-02 1.393957016157524112e-02 2.139359969284911761e-02 7.924552802878097324e-02 1.362280447302362529e-01 1.604987290387034724e-03 6.733568497272317830e-04
2.470623922032144301e-02 1.562268444797835880e-02 2.239922655224694387e-02 1.780465643961164773e-02 1.288424698431150407e-02 3.007508778431685625e-01 1.067420625857387964e-02 4.475122165855062971e-03 2.550348529048661050e-01 9.778018456026660310e-02 1.092845540824746546e-02 1.101726829737897234e-02 2.347363378001138604e-02 2.460728438710311355e-02 1.133738408986119731e-02 1.189456394724690454e-02 6.267953338322052037e-02 6.434565632918988476e-02 2.564626363280625432e-02 1.130822315797136435e-02 8.489094456191528804e-02 4.068246869839878266e-02 4.185188225657410221e-02 4.385434718436265894e-02 2.387129221396044540e-02 3.066433349891060922e-02 1.321975642191160899e-03 1.952065092211034171e-03 1.998713056078173407e-03 7.513311896046051541e-02
2.173531065106294041e-02 1.118111843523912977e-02 2.321533587064967749e-02 1.778680043218937995e-02 1.944953854459259557e-02 2.151681327197645655e-01 1.820472468632742258e-01 1.594293810715221305e-01 1.004775850980021978e-01 6.248190484105522850e-03 9.542296776640002420e-02 1.544986791339564292e-01 3.150602077048595961e-01 1.564319024650520362e-01 2.903994911238589466e-02 5.671023880622436120e-02 1.046071072989542827e-01 2.879516828963524233e-02 6.852744153358398919e-03 1.949339986515079282e-01 6.710790799118589167e-02 4.695185380519618229e-02 5.586151636526791309e-02 7.597897692409870396e-02 7.980750083621968027e-02 4.299171116530997594e-02 6.664391120332251173e-02 4.252671393273652761e-02 2.877064660889018174e-02 1.434441880417823036e-02
4.921853603704575697e-01 2.866896673044934674e-01 1.954616356782873723e-02 1.805070039415363620e-02 1.303939432583191976e-02 3.735142889533376587e-01 1.462485873194559471e-01 9.440256945872707584e-02 1.170217802362038401e-01 1.408941801497189637e-02 3.156801469421018080e-02 1.891095243411330395e-01 3.238673244529576278e-01 1.694544436285411182e-01 6.186174501620293753e-02 6.999453913069685063e-02 7.711750412787411746e-02 4.552898007750424275e-02 1.122325936400281332e-02 4.235261075013332932e-01 6.291234882684111629e-02 5.595675223584227476e-02 6.332973027960549228e-02 1.121219661967805120e-01 1.065013041077527561e-01 7.544631004660115603e-02 5.637539941622416589e-02 4.023546017054834695e-02 3.209962892302259396e-02 2.358988459266542562e-02
9.481599073093634200e-02 2.436002162041112640e-01 5.845479496646563966e-01 1.283713048930547156e-02 8.124478033471795729e-03 3.282629548003459519e-01 1.689102767287573303e-01 1.418395572664316318e-01 1.788805144286166604e-01 7.931964544265540304e-03 3.448070882017574834e-01 6.242289486566179879e-02 2.425340587013478655e-01 1.044096174629711299e-01 3.312220066205530389e-02 3.851315888930158943e-02 1.425502050497924611e-02 2.097137609095410873e-02 2.395840837228793013e-02 8.977180117004790808e-03 7.636562011189007571e-02 6.860937432236025035e-02 8.272076804950471984e-02 1.417933162460472685e-01 1.856445761076224443e-01 1.743502650012796751e-01 1.261620346695314088e-01 8.972097262327445588e-02 5.061954137406923099e-02 2.663707208703476256e-02
7.510277648549464058e-02 2.162119706104974060e-01 3.981243994557474020e-01 2.919455567761883863e-01 1.734413255074062910e-01 6.894042918585023827e-01 1.729495777315410640e-02 1.441821503559495739e-02 2.828618707690496725e-01 7.965425961839732449e-02 2.813129378230329602e-01 1.043433498534059728e-02 1.105555513514508148e-01 1.504353373679644668e-01 1.618701369825566727e-01 2.200091285675710440e-01 1.990097104293020724e-01 1.294479875234443578e-01 3.543560842952387380e-01 1.659944381130364632e-01 1.375672192473566258e-02 4.813064773725019285e-01 3.627418538537550696e-01 7.456521613700451377e-03 1.727918858630694138e-02 1.608425850519711389e-02 4.271694110147433027e-02 1.075836778280835244e-02 8.225036978652855435e-02 5.414864370747153599e-02
6.319043689755129978e-02 6.414053595482623049e-02 1.832258152214946700e-01 1.064084665708104303e-02 5.251169294550800393e-01 1.248770863258939351e-01 1.165272528808058115e-02 3.335085037191446583e-02 2.221684776197400263e-02 3.235433231013732369e-01 3.975406444418544405e-03 5.206868209163581507e-02 9.867192857738642242e-02 1.256314333943918671e-01 1.141161083355116262e-01 1.386560835069205466e-01 2.381076405135982288e-01 4.140155836978561821e-01 4.254104905792103208e-01 3.397557229854445970e-01 1.463313741048793450e-02 1.536782237797751360e-02 1.357422630871511424e-02 4.134216771386842876e-02 5.678167817516909660e-02 2.772836138839555598e-01 2.602732680249260078e-01 4.168413162834219698e-02 8.762908113888058514e-02 3.775247218504066554e-02
4.976305764333600890e-02 5.560332802354218257e-02 1.375846413683342873e-01 1.617588723991554567e-01 1.125718618942320726e-01 1.303954917213726306e-01 6.389165638981775946e-03 1.789892827155689647e-02 3.685364629666844360e-02 1.214000136148360789e-02 1.106110491445794382e-02 7.962051297188391455e-03 5.545122856222475805e-02 1.130251689279624661e-01 1.062393958324800991e-01 1.635475743129527759e-01 2.847258380021607249e-01 3.495331474878830558e-01 2.052798462770164256e-01 4.560306688002076919e-02 2.754542351313441634e-02 1.896825416310804480e-01 2.753207508972921325e-01 4.291984863090031466e-01 3.603341110134217207e-01 4.157452608207742317e-01 2.925256965822100597e-01 7.007565949943012074e-02 1.183257723930165317e-01 4.205519944186667664e-02
5.148720414801099404e-02 6.263196387234751250e-02 7.158201702988530035e-02 7.585277338645741996e-02 1.252065808712817530e-01 2.668606159672646250e-01 1.041034530265528002e-01 3.478168101625571662e-01 1.690694344037825536e-01 2.654529457482350877e-02 1.734348659076467847e-02 2.228349547917220230e-02 3.954950939541068688e-02 5.860343078889848623e-02 7.762035784370099889e-02 1.395703975466539570e-01 3.035295247852008993e-01 3.120412624863698192e-01 1.512873098613043699e-01 5.290067329467493251e-02 2.278330533892523047e-01 4.113392571903604078e-01 5.258790852504895419e-01 4.791457246396128578e-01 3.506526333496740588e-01 2.445403948493186375e-01 2.881767052940231166e-01 4.515147879941532744e-02 1.487773330066171351e-01 5.545067952697232960e-02
1.052884041054498315e-01 8.912268774051171349e-02 5.693264391696403054e-02 1.042214320347707029e-01 9.661435343561220607e-03 4.995315875669578687e-02 2.789819164290447961e-01 2.274145142898830740e-01 2.229083376730127963e-01 1.024629735602642921e-01 3.306966041851307214e-02 7.375530772207398653e-03 6.493294127445607168e-03 1.669468062830620561e-02 3.744312039852049079e-02 1.718375068036616937e-01 1.835192648864554521e-01 2.202905710263174111e-01 3.936299002355618526e-02 7.077697994389788028e-02 2.504617086465462661e-01 5.401973264137489572e-01 6.667337185961245138e-01 5.853762787314658045e-01 3.692042006573524326e-01 2.530311975636116428e-01 1.609960111067268163e-01 1.275971106368572749e-01 5.645125203087726293e-03 3.700233341625680256e-03
4.525562323237852791e-02 1.389126549222191587e-01 3.004393116534924690e-01 1.489209434743390785e-02 3.585841885393534212e-02 5.173659955539505750e-02 1.632428923483279226e-01 2.030754481245689025e-01 1.385244516216152799e-01 9.918183780641490199e-02 1.860425820065066821e-02 2.941020045004993366e-01 2.168663031709466577e-03 5.737870173960023419e-03 1.161411219862427957e-02 6.377426994896719104e-02 2.464228276571676923e-02 8.092873731125301354e-03 3.551837938233809444e-01 2.037231946788220505e-02 7.704936652741101177e-02 4.084759269043645724e-01 5.164939917676426573e-01 4.693399674682596223e-01 2.747486579162558007e-01 9.685821801167410205e-02 1.172816487149596631e-01 8.049924665449072203e-02 7.258783275346422301e-03 2.865414009653747141e-03
7.224303938232438417e-03 1.036833787736576862e-02 7.490077864105454224e-03 9.977232634203903744e-03 2.515181824860105927e-02 1.463162107608616952e-02 7.518284276705161639e-02 9.649943602529426068e-02 8.832846627588722410e-02 1.943966749094912586e-02 4.519744750061971753e-03 1.702708156487689750e-01 2.619399795144734533e-01 3.572529771146442344e-03 1.222539245749571998e-02 6.969481652012080204e-03 1.281796860090972205e-02 3.870041539446871133e-03 7.384383333480537895e-03 3.517764847044972665e-02 1.880978873004214014e-01 3.552893494666445884e-01 3.816291535288882653e-01 3.268989569013636687e-01 2.142942089121455396e-01 1.302172807528945431e-01 1.048462837346433862e-01 7.064240652732489689e-02 6.360197192066886426e-03 2.264055359364277979e-03
1.931370401037665538e-02 2.025819575409120929e-02 1.068093512986083293e-02 7.854860649551986818e-03 1.042382502751368692e-02 5.591218181001908136e-03 3.165573994016518400e-02 2.800415209903421576e-02 7.636698510013938124e-03 4.071703995547394823e-03 1.374654653804993762e-03 2.183626678801949828e-01 1.140653813044803788e-01 4.988512945034834917e-02 9.841723970593993509e-02 1.382337428869304628e-03 4.922539470568735968e-03 1.142263556854277579e-02 1.116732073398548838e-02 5.025659015862216084e-02 1.368406951983209552e-01 1.986467583329943887e-01 8.112830331957708585e-02 1.161963295879220731e-01 1.398084790133655997e-01 7.308258982167413487e-02 5.067251143618183712e-02 4.161857933781762386e-02 1.613469234215196835e-01 1.471776078819679312e-01
1.720215150060970186e-02 2.216540280788108219e-02 3.075473651606043003e-03 1.993638569448982593e-03 1.527121344583743474e-03 2.270977211839925788e-03 3.310327105138267077e-03 1.937218624227095565e-01 1.104229229543129054e-03 4.031005767990158278e-02 5.246171092886148940e-02 7.927727040722759577e-02 7.786788546048675763e-02 2.178011069770630359e-01 2.479889265559997481e-03 2.310287902964329801e-02 4.346925700435284173e-02 6.324109304787355057e-02 4.340265698438117853e-02 3.276302658899377107e-02 2.307428742484122705e-02 8.226828416149476256e-03 3.168889158971887991e-03 6.865913700520050351e-03 2.506660333119418993e-02 8.545071890776946566e-03 7.930777064685831310e-03 2.668889596058411206e-03 3.159402266371343776e-02 2.573353820110432441e-02
4.430851597001442266e-02 3.632221800941321660e-02 3.348932254993439335e-03 2.343767776123755475e-01 1.425474170033055920e-03 1.127885681517478865e-03 1.913498888992001563e-03 5.074598779336619153e-02 4.651062175243470681e-02 2.002433501156566584e-02 4.723436687055714012e-02 8.888969251627676371e-02 1.088166559094308761e-01 2.571069253990639764e-03 3.690590550952920542e-03 1.954867409992943825e-02 7.092129245428215045e-02 1.329436945626644440e-01 1.515067982207188024e-01 1.325269886794487040e-01 2.832607120060033970e-02 6.336485828691023996e-03 7.842946358914564681e-03 1.922466788031685150e-02 4.302389836759246133e-02 1.275679596471684420e-02 4.925782788803945850e-03 1.932525386143691959e-01 6.077880390187568455e-02 5.439684015575012299e-02
6.449731338504971490e-02 8.333745584291675848e-03 3.408596000830017014e-01 8.713246230795783365e-02 7.137676689128802376e-02 1.687638623916938307e-01 1.217747189715243225e-03 3.616770602446241212e-02 2.286270664553645762e-02 2.627011186648410893e-02 4.628600283964147410e-02 7.865164977523877998e-02 8.486918960371092613e-02 2.202102859879804999e-03 8.232697894062373373e-03 3.759595562636931787e-02 7.269380548336923376e-02 1.680072748602460531e-01 2.120723133159764240e-01 1.810179375931902923e-01 9.132140237733087085e-02 5.304653414388821320e-03 3.782235838708795234e-03 8.175716989315944677e-03 4.714573583974524668e-02 2.829148272885469509e-02 2.558576583359272946e-02 4.819260847322039479e-03 7.331414442486763883e-02 5.618580925764655315e-02
3.976380234295149446e-02 1.219351310521413559e-02 3.645348209071223086e-03 2.226824855912497639e-03 2.662054958965824353e-03 1.997156330239993702e-03 1.124072727449557671e-03 1.328000709830237935e-01 2.407525720569443917e-01 3.114247624712900286e-01 2.882282375838950486e-02 3.231334107310348397e-02 4.975671576676515828e-02 1.103346958905915137e-01 3.506516276182051074e-03 1.471341124735894845e-02 1.494825400670241576e-02 6.438389608696550026e-02 8.304307441120178934e-02 7.218649943677624137e-02 6.163978788007815762e-02 8.062755398195663517e-03 1.519043522405118807e-01 2.876005228207909603e-01 1.078454900638041968e-02 2.690307564592053086e-02 7.234108262714079862e-02 4.076500129988366861e-02 1.111507856791176668e-01 8.374639345422463244e-02
1.444896523357582299e-02 5.651290719595665826e-03 4.611309557229911586e-03 4.982375474357410815e-03 1.382838289162106318e-03 1.483464956723062333e-01 9.811541552777236497e-02 9.223862988549590136e-02 1.535417023107532239e-03 6.010864551517709417e-03 9.274778594952839961e-02 3.179791983066908301e-02 5.364058616573250809e-02 1.173003665041769117e-01 2.978161197480929615e-03 5.613346266690345115e-03 3.937493434090136475e-03 3.196145486323567764e-01 3.175307476349013662e-03 5.890012532377644598e-03 1.072515017613882501e-02 3.301407344039235525e-01 1.652507307319275032e-01 6.765424349183565660e-03 1.655203805796220951e-02 5.892303332667201722e-03 2.039397953733481164e-02 2.292737247804116710e-02 8.161922345623911709e-03 1.410204399917885099e-01
1.466174410634867552e-02 1.157221101459807514e-02 4.299707716681069360e-03 2.018659375379785320e-03 9.515958032220896015e-04 8.659370327618301499e-02 8.219821061585026734e-02 1.126184578685760218e-01 1.517071623064845387e-01 2.631964790259156382e-03 1.682881685796515647e-01 1.587737640370874559e-01 1.495126350360493628e-01 1.857994046437547730e-01 2.888389470254704855e-03 2.139305727020179501e-03 2.571316133577759566e-01 1.557925259970235066e-01 1.386090820269786916e-01 1.067302909239708636e-01 8.457507456051337191e-02 1.230448749518760765e-01 1.949876592216071014e-01 4.868288712715870825e-01 6.847564237614255957e-03 4.093191560826103248e-01 5.497108363111564804e-03 4.202005877538759204e-01 4.224099880044031030e-01 2.723462077590657060e-01
1.988044472626660300e-02 1.016951676732607765e-02 4.403404747899704492e-03 3.851548203495514487e-03 1.707792545741854779e-03 1.064790849079657199e-03 5.075012950468435133e-03 4.984436778613808919e-03 2.041782180937316560e-01 1.469682843215811829e-01 5.197207957706342224e-02 1.184104305596798412e-01 1.655533742487666883e-03 1.966215762931114008e-03 6.511959658673615974e-03 5.208254682306115955e-03 2.935753064253180944e-01 3.537971457843886447e-01 1.656828204057495812e-01 7.246294176903279871e-02 6.568015964463645717e-02 1.000503295169259815e-01 1.552701116915835844e-01 3.652917102701782291e-03 3.997000990891036443e-03 1.254527701972185383e-01 1.410997815126415200e-01 1.790677014140686085e-01 5.072168886586148409e-03 1.191247023422215001e-01
2.628663835632347179e-02 2.235338070006536934e-02 5.136362124048663921e-03 1.127943685117520529e-02 6.631556678798332036e-03 1.430820331187055393e-02 1.329656933300483665e-02 1.953105464481247637e-03 1.951191617515743992e-01 1.127938061163713396e-01 3.326881819889519060e-02 4.149032183650368938e-02 5.219951332671368682e-02 2.123436643450719308e-01 2.707427893672742503e-01 1.240095918353115584e-01 1.234894582305056804e-01 1.503339577793738335e-01 2.068907280506781798e-01 1.135230335185005990e-01 6.158515079628462674e-02 8.339916600527563784e-02 9.344372404782232133e-02 1.637086154520725478e-01 4.028727160312397214e-03 8.689455242388623157e-02 1.281849920044073055e-01 2.093022537380147541e-01 2.457237079093683441e-01 5.010960728557960486e-01
1.274762913737658224e-02 3.209689041587553832e-02 7.086505471669491546e-03 4.991800661939405429e-03 1.301422899097034840e-02 1.357225915847108666e-02 1.073321216757416874e-02 8.589484518160618890e-04 1.599102066407785405e-01 1.650355240958372438e-01 7.350141898071939350e-02 3.923217770395916876e-02 2.737256995086785952e-02 5.258146197413064021e-02 2.756440773578370251e-01 8.740345682542692562e-02 3.176287638523014878e-01 1.290298049484148515e-02 2.429997907785093683e-02 3.424014722979358636e-03 9.257311536434759125e-02 1.168145868517876107e-01 9.908479538483101756e-02 1.133960336008814906e-01 1.569068313449180352e-01 1.242445575929203710e-01 1.492628402820409816e-01 1.846576807588137248e-01 2.414653918923201914e-01 5.850393850502224810e-03
