4.886831757529164211e-01 4.903668757939653663e-03 4.264035142546055909e-03 5.380470918060703892e-03 4.053679208202565568e-03 8.816343472090322486e-03 8.618320585234588715e-03 2.300258544772564376e-02 4.136118335494200215e-02 1.826809614311752927e-02 8.365700220583265415e-03 3.004602047000292653e-01 1.762494142936487651e-01 3.914501767099315410e-03 4.464848442699054926e-03 1.792716189412809358e-01 3.299000347282793517e-03 5.574233965144247994e-03 4.876075431669298944e-03 1.667087180220033814e-03 3.289794611867609131e-01 4.849137417615553142e-02 3.822043823954580227e-02 1.549440611588062400e-01 3.056633822927813937e-01 2.436196584577192958e-01 1.145227369304816362e-01 1.015465795964630782e-02 9.668303854872226447e-03 1.212023865166976869e-02
3.843578316721784627e-01 5.989463219203829993e-03 1.079030902776138140e-02 8.749487543009592388e-03 6.075964862530244814e-03 2.700847357026259915e-02 1.268816321207758696e-02 1.554112158532699323e-02 9.964901435808620062e-03 8.222010857521149657e-03 5.701188499405601337e-03 1.789061009045478656e-01 2.379471600907650530e-01 3.133665629558394020e-03 4.274126891681630062e-03 2.700490261721869706e-03 3.234265408571465345e-03 1.015636553556541373e-02 7.368917510278927621e-03 2.145740622648262524e-03 1.972892164502737522e-01 4.486184410455922728e-02 9.533645192012291103e-02 8.615756926011318428e-02 7.776690532288188518e-02 1.065254963533165677e-01 3.873138804446511069e-02 1.006620725157483451e-02 1.438294267734451654e-02 1.445318778182518547e-02
3.380251179960178098e-02 3.460945463733200445e-02 7.324974990556673560e-02 5.906440497967621606e-02 1.262641052523952312e-01 1.277509565566287662e-02 3.458356319336909346e-01 3.659088300724590570e-01 3.876880100015726166e-02 1.130699489426617924e-02 2.920199159185791343e-02 1.860539940286961083e-02 6.603059691080735705e-03 9.489057893260155474e-03 3.340070622515300958e-01 7.313430378462165357e-03 4.727058159819759117e-03 9.265536038874427546e-03 2.949500530037389365e-02 4.719250654049711446e-03 1.228378027743031731e-01 3.601321926690276981e-02 5.546721618006175691e-02 1.991521226608498549e-02 1.231137326644375467e-02 8.456310427044528080e-03 7.796599458969921508e-03 6.192086047495154802e-03 1.054554800688268547e-02 1.196439180429407709e-02
1.555378268491630113e-02 4.440662817823082947e-02 9.761279702941969005e-02 7.823677475380624857e-02 3.244681397405157347e-02 4.994697574806834274e-03 5.860911968005250161e-01 3.907967802757104092e-01 2.355795634654081760e-01 1.397881395636505798e-02 8.649868378060136809e-03 1.663489202229992414e-02 7.315207969645121794e-03 4.809628558206413204e-03 2.526024589789473418e-01 1.963449648251445467e-01 2.073945176758135688e-03 3.714514656625376825e-03 2.536461651686857527e-03 2.087841146436034741e-03 2.433619055637380735e-01 8.452344769880387743e-02 2.670764114975188869e-02 5.263542489300303967e-02 1.008926823777940400e-02 7.635372825095343256e-03 6.708641069826964086e-03 6.368855374876547862e-03 1.274068525665949213e-02 1.407032891223707581e-02
8.925361807281050747e-03 2.741851208291914629e-02 7.635415112138239924e-02 2.957549201773424646e-02 1.709023497067140018e-02 3.725432608138002366e-01 5.688056742787647169e-01 3.153718429548820201e-01 1.439091674530246778e-01 3.213366181914065894e-02 3.897452141437101475e-02 3.247937527546816694e-02 4.690111779426658044e-03 3.821359812898848796e-03 3.063274851915177011e-01 1.159482773213933726e-01 6.527379299744188491e-03 3.620976368766778107e-03 5.654588777542891506e-03 3.135410241072603219e-03 2.121217774574177262e-03 1.458626621380886001e-01 3.279604858695999159e-01 9.099824811152401605e-02 1.846934032078237364e-02 1.021650225799908447e-02 7.186453144978021540e-03 8.365296789173319938e-03 1.292690043823161751e-02 4.849821650065987144e-02
8.831479149597771389e-03 9.139449696823826949e-03 4.090150635525217904e-02 3.269561136192725148e-02 1.299897390482732985e-02 2.138656340175172366e-01 2.579955666309273754e-01 2.740266813318124606e-01 2.509238324877475779e-01 4.958985822646840014e-02 3.804766949496369427e-02 1.976167319465250982e-02 3.345258344636545811e-01 1.039848908369996328e-01 8.077943679148218148e-02 1.345054054262106169e-01 3.808907311629488104e-03 1.873375660560464562e-01 3.062135139073898782e-03 1.028405149373869468e-02 1.230370918286564919e-02 7.127745031524237648e-03 1.716542090165764116e-03 5.645310825454374209e-02 2.813718249662857523e-02 2.690115630971395486e-02 1.677124119555422829e-02 1.166221917798922203e-02 1.519495815290497140e-02 2.803061013494982309e-02
1.801608390868700560e-01 2.944188083046401783e-01 3.115569729216072781e-01 1.007985795319194314e-02 4.831168361757866986e-03 8.024779640362194807e-03 1.217754523790103363e-02 6.943412710168638674e-03 8.224569063851066078e-03 9.487297936269871099e-03 7.225072695500935407e-03 4.242973182225745488e-01 1.745552585914370569e-01 6.965963921006791681e-02 3.745285052426835376e-02 6.803532512368952456e-02 4.044031332028727999e-01 1.924934088186076309e-01 5.227456218323953650e-03 7.015498026040482490e-03 3.174369822275806274e-03 1.652327720810599643e-01 6.696441681874962248e-02 5.254732683644211533e-02 1.951016663831867115e-02 2.011276729977658911e-02 1.744878595567694521e-02 1.532379706349183690e-02 1.764081104963162450e-02 4.306005503063426582e-02
3.620080950448769652e-01 4.573682225824953276e-03 4.026609806476320053e-01 5.791994856343533372e-03 8.876483496167845641e-03 9.960211993527572777e-03 8.815135083878058997e-03 8.301601985399441330e-03 6.660078596865740691e-03 3.711173955404730058e-03 2.199933157522729610e-01 4.553813821996826813e-03 1.414062885275984283e-01 4.758970318939922256e-02 4.931714852700842810e-02 9.220156612790691986e-02 4.473148546252518620e-03 7.063878467099900423e-03 6.131153876935486330e-03 4.302774743044588193e-03 2.330143546915890707e-01 1.135105611964601913e-01 3.936121428235193898e-02 3.084902349299316338e-02 1.453225171875332719e-02 1.526956512756856219e-02 2.348567963350604165e-02 3.008476589908862242e-02 3.060378547963437529e-02 9.233214325483822538e-02
6.347491601549832760e-03 4.169543369296301386e-03 3.526203728671815085e-01 1.434196904634194719e-02 9.343287193571902030e-03 3.944776736383331581e-03 1.267840687303586379e-02 5.666761670993555183e-03 4.743113013975974214e-03 4.660407607207028673e-03 4.137127552350225446e-03 5.432851164771696113e-03 1.173923135473742795e-02 7.537296419578223480e-03 1.736085681411738413e-01 1.594967155163828920e-01 4.235253606331472465e-03 1.273427909355353410e-02 1.245418806027068052e-02 3.799562268956877542e-01 6.218622559173341002e-02 4.943269707146637215e-02 4.779454674200804554e-02 2.951277254942860639e-02 1.707759239699204942e-02 2.625202070485553596e-02 9.842459357133226394e-02 2.031426776151985802e-01 2.326377626712246034e-03 3.053770229258333524e-01
1.011992321912539086e-02 6.605910351104883442e-03 1.070505619258084289e-02 1.007127947441623095e-02 8.899764345106062763e-03 2.609657948528799065e-01 8.107617965415484657e-03 3.426717987287495812e-03 2.260142461041139972e-01 8.347774004287451810e-02 7.768467701301597778e-03 7.527177288118922296e-03 1.579133385929741909e-02 1.686051176698694087e-02 7.942065723553378559e-03 8.558374046485751549e-03 4.541486640711413919e-02 4.676686064557948608e-02 1.869931503172635179e-02 8.276479795708474585e-03 7.575522775504053841e-02 3.681751591283181912e-02 3.840848476227388258e-02 4.049251838243012741e-02 2.208433758087225557e-02 2.841494532983699847e-02 2.673100891287526482e-01 1.833190924745288107e-03 2.471701783660601014e-03 1.635541758200771967e-01
8.308518102257144572e-03 4.342217857056386576e-03 9.834541163135228012e-03 8.440451829111610821e-03 1.080017810016506083e-02 1.482070522062675366e-01 1.261588377769134461e-01 1.112117342330551928e-01 7.067521174841681630e-02 3.881958664859169912e-03 6.059375040596525624e-02 1.002902853174452713e-01 2.056671183421909521e-01 1.006387776340779971e-01 1.843379343842517504e-02 3.560847218981724738e-02 6.567950843142020267e-02 1.811946784529425147e-02 4.323281934456212061e-03 1.482716173312816077e-01 5.155475589073625631e-02 3.642249106748449844e-02 4.377941648828858473e-02 5.974265642062108472e-02 6.273069320159614659e-02 3.377098065176469682e-02 5.330441959807645513e-02 4.391551757712970627e-02 4.041015912591804093e-02 2.970598422701383606e-02
2.146523340298976401e-01 1.265532306934715745e-01 8.040737739279152710e-03 7.925558098332792512e-03 6.204599424372397344e-03 2.128468753524059842e-01 8.372288945436481833e-02 5.429813839881729443e-02 6.778875974790703196e-02 7.489306015033576208e-03 1.805682838252392966e-02 1.169046187691921285e-01 2.084273822618604721e-01 1.080255789941907130e-01 3.909189967195263182e-02 4.387687990519500286e-02 4.830748772715350026e-02 2.853871991055283164e-02 7.040940920725517402e-03 3.191648169194379325e-01 4.772686749710869369e-02 4.273163599732571205e-02 4.867729239065898827e-02 8.627426824538381167e-02 8.181895629465342490e-02 5.786478974552117238e-02 4.409389821304544876e-02 4.069597125840312968e-02 4.423427956486435803e-02 4.802717851043526720e-02
4.154518543966841809e-02 1.075313180554775955e-01 2.663271356217554175e-01 5.289541271127542327e-03 3.459709828010556869e-03 1.637621746113989973e-01 8.454443141684371554e-02 7.122244980088346389e-02 9.041071999188900199e-02 3.700226465558719216e-03 2.111040792598598281e-01 3.685584435297227512e-02 1.540353224051484171e-01 6.599707984194412569e-02 2.085319981311431134e-02 2.416842016434169599e-02 8.932336953165524729e-03 1.312621790990060704e-02 1.498067591078779820e-02 5.608065860837957960e-03 5.729142027378851532e-02 5.164697173278857967e-02 6.247916414387548467e-02 1.069696869295069241e-01 1.396181820891648773e-01 1.307280309244643890e-01 9.657802110100170701e-02 8.885235331006111070e-02 6.841039977145212114e-02 5.331569647489084462e-02
3.304983768834007796e-02 9.537836627607998441e-02 1.768819804452715916e-01 1.306882890161142896e-01 7.833461543496468560e-02 3.128991522946276693e-01 6.762325901412400905e-03 5.615526693101302071e-03 1.297061297641810829e-01 3.975637480200165663e-02 1.587260143308041049e-01 5.906953810929637186e-03 6.944562797295181222e-02 9.434776024505361902e-02 1.016159450172079703e-01 1.384142159568501895e-01 1.248706125886852453e-01 8.096525867026353740e-02 2.209683821692573213e-01 1.032451748334440450e-01 8.535854848926110669e-03 3.573546821634254189e-01 2.693542282000446209e-01 4.569627950552883518e-03 1.051037385460708642e-02 9.707952793988275028e-03 2.624039369054300200e-02 8.481956967590947166e-03 1.090012087561135073e-01 1.065536066220933165e-01
3.039653151528995054e-02 3.061524532718479588e-02 8.550298426349291214e-02 4.227222486894011318e-03 2.366038932400311157e-01 5.605333286585355290e-02 4.484104185098371567e-03 1.278828910957028123e-02 8.520324503639100169e-03 1.593109089530123090e-01 3.404871262099173346e-01 2.919605524410507844e-02 6.166413168907388526e-02 7.859379352205841940e-02 7.156442120025255371e-02 8.725405892598769864e-02 1.494190321161127932e-01 2.589112855258368096e-01 2.651483585291193878e-01 2.110018559463525678e-01 9.045382855778329526e-03 9.451323616555817875e-03 8.300754086030948456e-03 2.600672395059037273e-02 3.725709065779855833e-02 1.896512064772568618e-01 1.890788303022567229e-01 3.785939666597296083e-02 1.279116029831589840e-01 7.758160321695672934e-02
2.724307993516972282e-02 2.972931325048147957e-02 6.881851704547338466e-02 7.665970001203306627e-02 5.108216152226159601e-02 5.849225481999477394e-02 4.165710036436165997e-01 6.834050447237970984e-03 1.410268549464519655e-02 5.036531601529540061e-03 5.176726458843319660e-03 4.459796445926823491e-03 3.455243472061515081e-02 7.061034659971561489e-02 6.658267455687880143e-02 1.028813827971318956e-01 1.786126754722932586e-01 2.185394731965203119e-01 1.279401088918421803e-01 2.830072799315630841e-02 1.697060827319471846e-02 1.159726404401199562e-01 1.669709877197001480e-01 2.824335397385098756e-01 2.679960420142392663e-01 3.518656115016917107e-01 2.849835880028825930e-01 8.137917624110649339e-02 2.051854527667956174e-01 9.345992509664347025e-02
3.382712868954194235e-02 3.913485380544669268e-02 3.896153721897464839e-02 3.735387648777609149e-02 5.721459799353960374e-02 1.196436095565067831e-01 3.959162423555240284e-02 1.320890091438803038e-01 6.443844856506918128e-02 1.098728941920082761e-02 8.104220220669052996e-03 1.246499276365212183e-02 2.457282197688310729e-02 3.655029422536625050e-02 4.861714521399056188e-02 8.786459502180851699e-02 1.903939694343712574e-01 1.950681140583815643e-01 9.427398980126024119e-02 3.279765112674603439e-02 1.398685721166764151e-01 2.500146397689131383e-01 3.163994227522895497e-01 3.309337481416619320e-01 2.990421910476516176e-01 2.642799970612509375e-01 3.985690046344745330e-01 6.962159536890019651e-02 3.116302901873724274e-01 1.333463081860197519e-01
8.269246175545896804e-02 6.482331444197826642e-02 3.406038046725765045e-02 5.386749044117606494e-02 3.792538832916263116e-03 1.909490364568786416e-02 1.066126360051983246e-01 8.675698843573376173e-02 8.537311458506199879e-02 4.271473450980587533e-02 1.556614431673058498e-02 4.141260131665438875e-03 4.044482092826500244e-03 1.050791019739896401e-02 2.380576610098912582e-02 1.104317877026438494e-01 1.170976627661516611e-01 1.396154987077629084e-01 2.480748949134440468e-02 4.424592894033915758e-02 1.543853751634521598e-01 3.283065970866564376e-01 3.994716964951687266e-01 4.260605371097934135e-01 3.661895613651412473e-01 3.648118626777950291e-01 3.483764535894856018e-01 2.761207925411259811e-01 1.224966618965427426e-02 8.073320423825518233e-03
3.735887572841679882e-02 1.030582433105836915e-01 1.925263589475169068e-01 7.025783057549133716e-03 1.522136991128394956e-02 2.140216267995135799e-02 6.767433624531116187e-02 8.427160090406773940e-02 5.793786805713144888e-02 4.520142000689003625e-02 9.502593113675001854e-03 2.094778902924927244e-01 3.167117438745981617e-01 4.042441296235358208e-03 8.850390870499014531e-03 5.271971598089803673e-02 2.030087501864338492e-02 6.605477316514551771e-03 3.450993047161100558e-01 1.640311964101284076e-02 6.174966406214133646e-02 3.257866143306721307e-01 4.098617753780448569e-01 4.376844134610707870e-01 3.281294761365513013e-01 1.555805930565417605e-01 2.561319751134409350e-01 1.758078845858410122e-01 1.585335110551997981e-02 6.258256588135968981e-03
5.353517826458860027e-03 6.647362194517114631e-03 4.327696011805218929e-03 5.213493084259774105e-03 1.193024685784540434e-02 6.793588143684741766e-03 3.505829799249163964e-02 4.515087281475564651e-02 4.175195204216315681e-02 9.932969745120610872e-03 2.515431029657986400e-03 1.266181591720220712e-01 2.190597118540170141e-01 2.838737330115892552e-03 1.141094871831865344e-02 7.772511196667491497e-03 1.430475731976457027e-02 4.270627355948925646e-03 8.065198826077481578e-03 3.825768302239044433e-02 2.054358343891676264e-01 3.894542785371955529e-01 4.196439549825782267e-01 4.037593040228817376e-01 3.145418379670250619e-01 2.333409125367905124e-01 2.280262155678335345e-01 1.536426046754631458e-01 1.383341576780987292e-02 6.422302962878436716e-01
1.501216396791503135e-02 1.323743854290007280e-02 6.623524506398599694e-03 4.618256344019925665e-03 5.805579678214274619e-03 3.078685181649753674e-03 1.754041673244374072e-02 1.560169830108448959e-02 4.291193555110329669e-03 2.377543738477276482e-03 2.133755862475713028e-01 1.694815287860231834e-01 1.005752912052334247e-01 5.490584295072396814e-02 1.404832189810497067e-01 2.235182651336035942e-03 8.008165333436291847e-03 1.833788531726806420e-02 1.770517137421424858e-02 7.943083133117473382e-02 2.189515566697076143e-01 3.214688758942648161e-01 1.326585965083078855e-01 2.001808161203155745e-01 2.590208696277780942e-01 1.469196163726634863e-01 1.097216746620745254e-01 9.012017735326210977e-02 4.181065646537019398e-01 3.815154190465224193e-01
1.194152822196495670e-02 1.325926642717045745e-02 1.915621201754274042e-03 3.090796111774024024e-01 2.701750595513620623e-01 1.518827639887746026e-03 2.159724959344000959e-03 1.525015044486048854e-01 2.002798698741897199e-01 3.135526493687502969e-02 4.113377524334033142e-02 6.276240426242801762e-02 6.951378471987684771e-02 2.470938959526820800e-01 3.096419382576619250e-03 4.152711768077773508e-02 7.897238200598323543e-02 1.140245361082107417e-01 7.772063383813732074e-02 5.902093027745519693e-02 4.268984917766893011e-02 1.561263220154747791e-02 6.161553034867209983e-03 1.328541587578560036e-02 4.794094849433569450e-02 1.616854568514690393e-02 1.488547241421182138e-02 6.231950214908030805e-01 7.153149704169067813e-02 5.852358065234611328e-02
2.448914205763891294e-02 1.831481913400096959e-02 1.968847586207634216e-03 1.995929684548719552e-01 1.207748932223994421e-03 2.506769833714132534e-01 1.426128055370204546e-03 4.257545997522356462e-02 3.621283326643130046e-02 1.560889025793577023e-02 3.688237446202295017e-02 6.956108181700761117e-02 9.270742233310610980e-02 2.120922954940160712e-03 3.680427427064127555e-03 2.416887019433925851e-02 8.706380300532225169e-02 1.608162549921391404e-01 1.807286385461999156e-01 1.583990446153352438e-01 3.474597495949290765e-02 7.964599213837436631e-03 1.008770380623158491e-02 2.467193985275189377e-02 5.475986931705809080e-02 1.611176087043057759e-02 6.187192120865191332e-03 2.894814684779293268e-01 9.138507696144847203e-02 8.206309630656240250e-02
2.960247706983320029e-02 3.692239988125557443e-03 2.291855321811346879e-01 8.028533904678974986e-02 9.781972919809837907e-02 2.195699301936487602e-01 2.862524415447050830e-01 3.236942048092442126e-02 1.795002610074235977e-02 2.051646747221163095e-02 3.597128906725516329e-02 6.083623493567472118e-02 6.898174580573937509e-02 1.616851730963727793e-03 6.742286959597307977e-03 3.455977885136719135e-02 6.553356374937838180e-02 1.481863799338592469e-01 1.835654599137987453e-01 1.565751291200656037e-01 8.103759783490668833e-02 4.820489001551265043e-03 4.974973821134007212e-01 7.603059017078615117e-03 4.365879003743441261e-02 2.609255315981355572e-02 2.352764509381962202e-02 5.225475786342479445e-01 8.016079842366501118e-02 6.164897781352838418e-02
1.597523667672660908e-02 4.880613694718888979e-03 1.939365681162778928e-03 1.833358945656298053e-03 4.110924113960155724e-03 2.780530163536137564e-03 3.073767308562493916e-01 1.269869675106115869e-01 1.908092548199211702e-01 2.436548929045768419e-01 2.228130479363771982e-02 2.468831683219474896e-02 3.856113782242900911e-02 8.847981557795779606e-02 2.410717387055116845e-03 1.058238115347869858e-02 1.043540812831160458e-02 4.372727373602472434e-02 5.501459735920425503e-02 4.762605700824467519e-02 4.171257305558936923e-02 5.584416067865027866e-03 1.266016262633419265e-01 2.402388667504362918e-01 7.667447451340127576e-03 1.913170970110979890e-02 5.145229367110169816e-02 2.899880721155849439e-02 9.352974916617030898e-02 7.071317477427260800e-02
5.693548827480058964e-03 2.231493946424537023e-03 2.441794080853371043e-03 4.189650690033668717e-03 2.316125395157495308e-03 2.714993260133103381e-01 1.260376937859981339e-01 8.934537990747254410e-02 2.836455960065100701e-01 3.794734265898019009e-03 7.158855592326815453e-02 2.421176028537194713e-02 4.103834078565946064e-02 9.133815461775970923e-02 1.953303554763018059e-03 3.780402521870973934e-03 2.559866133830033912e-03 2.458435649349481611e-01 3.704504310065491191e-01 3.571810499054807811e-03 6.630832621623098180e-03 2.491896851385060341e-01 1.255399727229812024e-01 4.353790144502630091e-03 1.068574584343225803e-02 5.136587051387568881e-01 1.322836192326894318e-02 1.483519308758560022e-02 5.269202075659308419e-03 1.077050264689182191e-01
5.770971831074875324e-03 4.579111220964075454e-03 2.285589979260810225e-03 1.706481931713404272e-03 1.607657430855798705e-03 1.578650222628660837e-01 1.052726948371222049e-01 1.088182585965045968e-01 1.204607792655245369e-01 1.661354887535724471e-03 1.298783750894691169e-01 1.208786920128274989e-01 1.144058243861243440e-01 1.447003926891405334e-01 1.894950047139248514e-03 3.027543976332302544e-01 2.023188913577104175e-01 1.198083763972672966e-01 1.042548804012146946e-01 7.939178849658698467e-02 6.321337731589281306e-02 9.239404541516019198e-02 1.470801947329586357e-01 3.685209668485193157e-01 4.381683470929445545e-03 3.118223137443800197e-01 4.994584987405655818e-01 3.204948152026146913e-01 3.222705844731736935e-01 2.080067297279362404e-01
7.816421314477574669e-03 4.032617704531174345e-03 2.349778924242443279e-03 3.273261699851805380e-03 2.910389751359555941e-03 4.133387194689461808e-01 5.239775384451778907e-03 3.880173495064348239e-03 1.621017757348201804e-01 1.149871014573760342e-01 4.010482046182678451e-02 9.013722556995469593e-02 2.684987736883320819e-01 3.032009383219537169e-01 4.273330194993560024e-03 3.506570334806530242e-03 2.309400664106331658e-01 2.720214463558157103e-01 1.245920297947967770e-01 5.384972306669497111e-02 4.893061902971711924e-02 7.472075199668509748e-02 1.162470812926943847e-01 3.710874143328199981e-01 3.904233602599866959e-01 9.547568193585705132e-02 1.077899541407619372e-01 1.366412848166589367e-01 4.357774845031782696e-01 9.094383619416827880e-02
1.052855440674439758e-02 9.010764551287095067e-03 2.796857360287304146e-03 9.748693741216028774e-03 1.143501325652449517e-02 2.132629457244129140e-02 1.411341553479995674e-02 1.571377886962542145e-03 1.603252682544069607e-01 9.057468111563513058e-02 2.615878901965864450e-02 3.198877573930283824e-02 4.026952533677892465e-02 1.660753975088409828e-01 2.149495168065847783e-01 9.998117733037810428e-02 9.711938784502356647e-02 1.155323893054475554e-01 1.554903091821134287e-01 8.427190896974526280e-02 4.572353201095677444e-02 6.192825839621587253e-02 6.940020015290597477e-02 1.224729885506690014e-01 4.035814930725476479e-01 6.603327400407066339e-02 9.792309154854189623e-02 1.596671980197786056e-01 1.873761270196442619e-01 3.823628646991380498e-01
5.899447817819982245e-03 1.444830243135010461e-02 4.390917907944358843e-03 4.765234052865740567e-03 2.320091870414086807e-02 2.443403322673031591e-02 1.624011738737877325e-02 3.123025475819675711e-01 2.231652762782981858e-01 2.062049562308475859e-01 8.284363600593928900e-02 4.018032200128970888e-02 2.600651948598402957e-02 4.701292237323560774e-02 2.331867667776150455e-01 7.030064614333141060e-02 2.488237774626059218e-01 8.120138008730307111e-03 1.487054849878527082e-02 3.494671782261015713e-01 6.829309937669328368e-02 8.618172563112860840e-02 7.310570599463005192e-02 8.415967195355275599e-02 1.172469255172285257e-01 9.347814540307258779e-02 1.128990936885477664e-01 1.397454787164518208e-01 1.829063543000963854e-01 4.613503229993088373e-01
