4.091487359781699751e-01 5.843704897199879511e-01 4.924474973186112603e-01 6.093112166889285142e-01 4.232995864635074601e-01 3.632442144103489173e-02 2.428578117853711499e-02 6.556983603368485292e-02 1.192658278782095238e-01 6.404268179815203466e-02 4.374468480219385891e-02 2.510121584628415836e-01 1.724827060379787724e-01 6.857047670831547537e-01 8.493603586666405025e-01 2.016405902828967978e-01 7.633406771563153725e-01 3.783993491520728364e-02 2.363187323440146467e-02 5.749945461024871252e-01 5.356930993862308865e-01 7.973936420686841831e-02 6.078523734423862956e-02 2.424241076880461754e-01 4.718652382889861885e-01 3.721062438581667076e-01 1.714605045899772751e-01 1.517387981735852064e-02 1.456956731458737553e-02 1.843431228296070826e-02
2.682460512995917812e-01 5.651513267373659000e-01 1.086318248313166007e-01 7.452412882314624065e-01 5.086699439364130715e-01 1.127134107903816629e-01 4.324186568447085932e-02 5.377757544379539734e-02 3.175987040483917861e-02 2.863237996712442862e-02 5.831291718464558516e-01 1.279263323696884225e-01 2.020696167980726432e-01 5.250256314900081378e-01 7.742557329226656959e-01 5.499584010197734463e-01 6.964187460101634031e-01 6.723888863078204825e-02 3.566652215045985203e-02 6.871216072848917999e-01 3.074288864083176143e-01 7.673863306791672834e-02 1.584737728961710390e-01 1.414724080394324235e-01 1.263468264409914887e-01 1.712297894488438443e-01 6.061136745949084748e-02 1.546436897090089704e-02 2.208918978375631198e-02 2.216329146564797667e-02
1.258695095556912613e-01 1.248553040662823826e-01 2.564428857881222434e-01 1.917952309525872145e-01 4.483665157014964375e-01 6.828148366640658662e-02 2.203715054176700050e-01 2.314444309720325443e-01 1.550188144858440642e-01 4.053230820566125492e-02 1.079072043772261874e-01 8.267515883829615331e-02 5.738589351530568733e-02 1.340676966705346418e-01 3.161542713920660885e-01 1.050683842014402958e-01 4.330007523110041695e-02 6.248177031353059629e-02 1.786929934029034273e-01 3.522438507190867735e-02 1.939945388818922201e-01 6.374610658583214351e-02 9.660807639280102888e-02 3.354855799020586837e-02 2.016632523827843054e-02 1.348215555172134830e-02 1.220069563472824664e-02 9.595503576453586272e-03 1.638731731814886683e-02 1.838992366903306752e-02
5.264925865260230292e-02 1.473877973930913521e-01 2.594328383450919540e-01 2.103223096780280632e-01 1.099462845976563741e-01 4.475304988384232741e-01 4.448710522551598268e-01 2.762039362100010553e-01 1.496657151564258492e-01 4.406695563483766648e-02 2.562388230815106777e-02 6.400588493695411052e-02 6.558810438026591028e-02 7.187618830508437640e-01 2.299185132725785619e-01 1.937051757471660862e-01 4.254971300442435544e-01 8.382827648892939854e-01 6.762670477101826449e-01 6.311243846545222524e-01 3.478225006552969067e-01 1.345030702192392402e-01 4.503186952130437681e-02 8.928630228598460894e-02 1.658671998296166322e-02 1.201818718258942237e-02 1.045745340063034337e-02 9.923091692224203508e-03 2.015221673484681592e-02 2.188847545121612448e-02
8.019733821007084540e-01 9.292847533713938235e-02 2.057366279628186079e-01 7.974995657903079238e-02 6.411445639546956010e-02 2.612675778991171427e-01 4.553732900742111234e-01 2.559285440973242953e-01 9.399205952078884541e-02 1.076797613375384960e-01 1.155217496072274141e-01 1.381450176845168132e-01 5.467974804460133953e-01 5.634074648295636090e-01 2.954286205317470104e-01 1.199649051029153812e-01 8.658025015941640812e-02 8.146940876172152901e-01 5.837169420122693964e-02 7.781025975361909319e-01 5.549636252134190206e-01 1.730992887964912519e-01 4.415884738659275888e-01 1.473359297058294548e-01 3.012018778606054617e-02 1.619588980624682428e-02 1.141311391313088418e-02 1.319526267253417519e-02 2.063884835371920454e-02 7.585153590675366986e-02
4.348039656940572151e-02 4.571907855106238650e-02 1.416838120763618258e-01 1.155257135020675563e-01 5.339410465826086027e-02 1.479577357773010082e-01 1.910659120751622697e-01 2.059512029777489095e-01 1.684691389528286121e-01 2.648147253640762977e-01 1.574044578982872478e-01 1.182441380743847748e-01 2.497362725178155218e-01 9.355063238237808221e-02 7.829066350371824412e-02 1.366901073135324551e-01 7.494053804731894974e-01 1.940281934864543922e-01 6.224828568245928118e-01 9.094625765066184642e-02 8.135158967500685789e-02 6.292002586630734973e-02 5.454106092534806161e-01 8.629303112251945906e-02 4.517153048042390345e-02 4.269119892584745390e-02 2.706679761189050709e-02 1.866894548866292192e-02 2.466298452347854414e-02 4.429615623980383970e-02
1.445351838361173535e-01 2.226155188021965436e-01 2.200995329084874663e-01 6.054365921373699999e-02 4.914720237912729162e-01 3.605672301428058252e-02 8.535606749647704772e-02 7.503862262574798603e-01 8.617503033644727806e-01 9.818925791965574246e-02 6.877650536065935682e-01 3.027840604902090060e-01 1.394731730459474184e-01 6.416376458200409583e-02 3.756567968663840351e-02 6.919294002457418435e-02 3.978457862254655697e-01 1.838768540535837825e-01 8.887792272876399169e-01 6.535537084074148628e-02 6.237060635537874376e-01 1.739279979389188879e-01 8.077312490130031386e-02 7.814932867516846682e-02 3.071893903510219612e-02 3.201853222103589330e-02 2.892812715000114138e-02 2.515913653324343413e-02 2.922980930418103002e-02 6.895300332021450651e-02
3.049925187195391962e-01 5.711716400924315984e-01 3.087813235156066649e-01 6.086142359177715289e-01 4.628322914365580465e-02 3.994400687548588236e-02 6.367543569156439154e-02 1.124285013024385188e-01 7.988184900931845078e-01 4.556167397454650159e-01 1.835088286294365711e-01 5.605726750089063959e-01 1.216559005781589209e-01 4.237233536714071075e-02 4.816111412870925645e-02 9.106297810767451095e-02 7.012504383448884271e-01 6.928598958810934516e-02 4.471324927359331125e-02 7.505787982480071063e-01 2.482322797598633668e-01 1.435848051726994756e-01 5.727532696270778989e-02 4.823333661822053892e-02 2.325527428886807468e-02 2.479331023557384064e-02 4.079914738921475853e-02 5.277256631627177952e-02 5.196817661395833343e-02 1.493770540849085338e-01
7.386570935895078183e-01 4.752312500528688144e-01 2.683823108493921805e-01 8.726525100324503126e-02 4.705525395238542574e-02 3.769597072255708725e-01 9.259977746475187010e-02 6.485367477091188437e-01 6.241184277737763519e-01 6.375288657451058105e-01 5.677530171030626960e-01 7.098175644426198971e-01 1.099250395933132618e-01 9.869595757470392972e-01 1.545287361078616362e-01 1.315438813261335105e-01 5.288052812217471921e-01 7.121984861553709578e-02 6.322131079315478075e-02 3.237733316747282153e-01 6.466669385587876795e-02 6.619332045287276700e-02 7.202207556640963237e-02 4.728060844906704918e-02 2.793420364575965181e-02 4.319616462690219205e-02 1.733024921300226062e-01 3.484054703733550085e-01 9.899292306930407292e-01 4.807499053577525272e-01
1.404542540367514358e-01 6.975735186734842719e-01 1.061441938387178985e-01 4.330195290521569873e-02 4.093227496335942461e-02 1.806461504829333098e-01 7.918012241909616611e-02 4.317908504540106662e-01 2.110968043310944564e-01 7.605534716344981849e-02 8.899282385585019495e-02 5.163401742678611073e-02 9.537848765377193727e-02 8.393362616511043650e-02 4.205701347362910542e-02 3.524529521214395805e-02 1.733680497812646326e-01 1.900224806048928794e-01 8.362450249858716100e-02 4.808880332864156476e-02 8.077854073863485751e-02 5.113685372469792267e-02 5.878863122133985708e-02 6.479493505721231617e-02 3.633906979708777241e-02 4.684767021052735347e-02 4.553292520933619469e-01 7.772759708046783622e-01 9.586339973544260040e-01 2.492890540390435006e-01
7.773978909064119258e-02 4.650901976040979768e-01 1.723712850532428398e-01 1.485138090857936466e-01 1.625080508610536323e-01 1.211755279126927043e-01 1.123035100095332167e-01 1.022333642781221852e-01 7.057512848108804526e-02 5.553235497790405262e-01 2.233667465944568775e-01 3.152108684536790717e-01 6.519294694876052176e-01 3.219104449748179109e-01 5.934089946986945141e-02 1.169760643441931369e-01 2.186296507512105469e-01 8.476514899282891480e-02 5.562564226279943513e-01 1.353475388583874339e-01 5.575267090786413526e-02 4.976243242256110644e-02 6.436943998735832062e-02 9.016930433584760540e-02 9.646498764421126970e-02 5.264512948812913318e-02 8.509274354294431297e-02 6.768399331555996490e-02 6.083503336097220021e-02 4.380832619676908180e-02
1.890705355727027859e-01 1.109845201901798473e-01 1.031981586896633996e+00 1.019386724888200035e+00 8.285006070364331343e-01 1.988749981086678775e-01 8.647821144459731657e-02 5.891942833102669502e-02 7.168145804403619481e-02 4.805841960076431829e-02 9.138687767891875979e-02 3.843946809100904916e-01 6.766458237842858381e-01 3.503970293380856416e-01 1.260571872871987242e-01 1.422667542358781456e-01 1.574352733741521126e-01 1.326578020318958662e-01 9.335663138546732576e-01 3.094171911660886787e-01 5.344697468758837638e-02 5.416602493031490856e-02 6.411382334783639891e-02 1.147317879591567558e-01 1.090258015556332394e-01 7.772302356155880165e-02 5.986685662963178722e-02 5.496316364581069897e-02 6.084613810060890415e-02 6.690309137359627678e-02
4.472907913829499843e-02 1.125401401695505649e-01 2.714788220415087494e-01 7.661819098717703724e-01 5.111333016509967964e-01 1.651567662925204627e-01 8.629806917385660081e-02 7.352007045394624851e-02 9.629197450582813178e-02 6.626940970689465527e-01 1.861075942813841255e-01 1.268744542891150351e-01 5.043781576380910181e-01 2.158298705875946744e-01 6.769094396726658969e-02 7.820363532259722028e-02 2.892272456217715587e-02 5.478127486452235434e-02 7.802834422241232415e-02 6.516133318404583319e-01 5.111642133013436645e-02 5.586432027291904356e-02 7.082016276050638603e-02 1.176496136314228030e-01 1.489739613286605868e-01 1.300911416211973370e-01 9.596808570059470189e-02 9.116773889207305248e-02 8.161277697172858447e-02 6.921344150924614580e-02
3.858255464414943325e-02 1.103688250290036366e-01 1.987294386502928556e-01 1.446183817321327059e-01 8.633614583291744637e-02 3.341743660861522525e-01 7.860188705866281988e-02 3.684137604812200151e-02 1.318309773299103094e-01 4.386188125796756931e-02 1.572348309230220120e-01 2.302347520884096693e-02 2.306598597169836617e-01 3.107467832108904982e-01 3.300336809981032071e-01 4.439743063099790277e-01 4.003275255252190523e-01 2.607736195022557490e-01 7.572008464330821642e-01 3.573910453996787528e-01 4.007707727036652345e-02 3.331845091238574974e-01 2.511895685640245235e-01 5.978233468410922846e-01 5.907964231007493960e-02 4.159334976193953398e-02 1.050059378595687432e-01 4.210492805283357759e-02 1.101688647596632820e-01 1.305745604257689818e-01
3.733059078975248940e-02 3.747985686855145882e-02 1.018412022954546803e-01 7.602773852292927792e-01 2.765762404489763848e-01 6.172508673545027552e-02 7.163082124816870788e-01 6.745928881556964574e-02 3.763476644754887301e-02 1.637087001110257845e-01 3.416552629868526147e-01 1.209583183790105543e-01 2.212611555618936021e-01 2.607058966261012745e-01 2.349257518241764098e-01 2.832001176416322208e-01 4.850238833811060246e-01 8.425161722900124106e-01 8.617676282249790987e-01 6.792562497561058787e-01 3.631595556152716897e-02 4.552968535218833435e-02 8.297330418465753699e-01 1.220592082734903716e-01 1.485720141728906762e-01 6.298937676840750122e-01 6.294185139458140510e-01 1.452068124433493757e-01 1.136573766562789106e-01 8.884766862882920169e-02
3.490104121392849368e-02 3.796051956882076639e-02 8.485469480693359767e-02 9.329767023398846670e-02 6.203602518019889211e-02 6.496834539974605249e-02 3.587915940005811377e-01 3.294311907180917653e-02 5.460728922240225963e-02 8.360795778740977013e-01 2.512742266925455104e-02 7.324406590233537573e-01 1.252049056710199393e-01 2.350043295343998695e-01 2.189183093209468578e-01 3.351485180262973596e-01 5.834369480718637480e-01 7.134135348293831891e-01 4.146903474896181940e-01 9.082923698035039184e-02 5.484597480521477553e-02 3.994453778426546586e-01 5.845074772121013895e-01 9.805409393993904654e-01 8.819743961816148836e-01 1.158382227450672763e+00 9.341726671974328600e-01 2.911199133472028300e-01 1.668414702768555025e-01 9.919038295247185888e-02
4.488027925685712100e-02 5.172138541478415313e-02 5.007258211732317638e-02 4.662562786829906047e-02 6.626673551379719251e-02 1.105878993044077940e-01 1.388248557634845504e-01 4.381232291740951301e-01 2.327261090893101292e-01 4.081187468076728775e-02 3.344614763329278873e-02 4.548321256437070498e-02 8.969413388545158239e-02 1.218166881212473518e-01 1.611335145442672756e-01 2.895182702573129152e-01 6.283428060560499739e-01 6.368658069432165947e-01 3.034736075385556786e-01 1.048151975257240881e-01 4.554819511111206642e-01 8.326988381145017382e-01 1.076449954769970851e+00 1.107657331255902378e+00 9.836224022517123800e-01 8.625901012151381275e-01 1.296336449706546157e+00 2.378395704622006945e-01 2.306806958034418598e-01 1.255662587338564617e-01
1.121542628138922082e-01 8.788725419319221022e-02 4.252424547342961714e-02 5.922886325270827756e-02 6.928039716201375153e-01 7.745543377210035996e-02 3.482275976118034411e-01 2.814805623961137426e-01 2.774021371305561701e-01 1.399976987525336503e-01 5.567527388214562473e-02 1.817346647066506171e-02 2.148045887189735381e-02 5.076036719760378124e-02 9.666907399384010169e-02 3.648879150854688058e-01 4.108377121785006802e-01 4.934323358033015916e-01 8.656354469416421837e-02 1.448713492870754849e-01 5.049209008938900789e-01 1.100595472278644626e+00 1.366624427580361623e+00 1.421157328701272871e+00 1.189302220517109543e+00 1.176328081619371302e+00 1.119951855004891028e+00 9.021002871385741528e-01 1.097818382805215293e-01 9.730739831579741095e-01
4.497912722289030413e-02 1.246414941388501174e-01 2.137613608539474241e-01 4.293806932011573485e-02 6.313604537283315499e-02 8.419708380488044597e-02 2.233145981399329016e-01 2.789889635729662087e-01 1.911161593832581274e-01 1.672609011149857050e-01 4.219813793416742065e-02 2.273999445569280797e-01 3.523645172088673005e-01 8.324109539826607396e-01 4.631188172104582640e-02 1.705488882565204811e-01 7.890537434753278068e-02 8.087855497565413776e-01 2.578400536225094464e-01 5.336455308221153826e-02 1.987798289657568551e-01 1.063198540517967361e+00 1.350448942190255908e+00 1.426084331467853072e+00 1.058113129842995770e+00 5.015784724145050388e-01 8.298262194997541030e-01 5.655973881121409974e-01 1.549040796994512748e-01 7.080753689921933658e-01
9.411851069829818561e-01 4.793215565930846606e-02 8.491842778102864919e-01 2.635180682112682471e-02 4.052415601590173000e-02 2.311465674805728704e-02 1.182454837591904173e-01 1.520047750522804386e-01 1.567535012894336055e-01 4.731241437273715766e-02 6.178569523835177879e-01 1.586293176243629977e-01 2.776630548084842998e-01 6.699791965640967684e-01 6.726202863602304127e-02 2.681544357345840707e-02 5.881011640927372858e-02 6.301251347262644131e-01 3.205566599347207252e-02 1.254981356631987566e-01 6.599366746709945941e-01 1.249602054449753030e+00 1.341367077961415522e+00 1.287697588102709068e+00 1.005400364595993912e+00 7.498095151187225138e-01 7.377477725757439764e-01 5.227082908462232780e-01 1.245342845251069253e-01 5.459199669191026061e-01
6.922999344515369524e-02 8.209865164772472967e-02 3.618634624537445110e-02 2.968295601731166938e-02 3.182020028447635901e-02 1.624014763640623318e-02 8.228061449799671523e-02 6.855267185042315803e-02 1.917282441225965500e-02 6.757774852395502796e-01 2.734331282272472463e-01 2.420706307063036078e-01 1.358283876989506977e-01 6.277170675294102553e-02 1.338285743630839852e-01 3.875809969798613142e-01 3.112585502036361446e-02 6.815928126303769097e-02 6.544010614912525170e-02 2.583263854029074214e-01 7.037042222800391489e-01 1.042292215876483796e+00 4.216211887093024302e-01 6.388885502272414474e-01 8.160725009269215180e-01 4.690469901276737019e-01 3.870738440001706415e-01 3.451776378942666978e-01 3.070738507407792528e-01 3.339034683008528237e-01
3.767338156277176553e-02 5.616392862446965839e-02 4.291712625726296082e-01 3.700888048025661181e-01 3.462278731271584142e-01 5.064542194007792819e-01 7.077684147489589073e-01 1.779387460982327085e-01 2.471361999724362990e-01 4.294290067382770804e-02 6.372634323672175805e-02 1.008005548879293278e-01 9.628717666644058537e-02 3.037857620284587501e-01 6.772951749689191114e-01 1.880633301038520111e-01 2.689518843953905280e-01 3.750105627259650021e-01 2.577976217996692521e-01 1.944227606261839658e-01 1.548643060181843223e-01 5.654583350818166709e-02 5.583639073858887025e-01 4.227341126355613904e-02 1.505473996081047039e-01 6.273441348513303373e-02 7.301688326127847573e-02 4.419358311771204861e-01 5.719152582595457557e-02 5.337550984751065347e-02
8.910689718199658882e-02 9.351708873200625938e-02 4.895227024304424912e-01 2.879634418161158838e-01 4.896809058487912036e-01 3.855143739970878780e-01 6.015227456622868063e-01 6.607702193741481211e-02 5.844748024437106809e-02 2.532458002373762923e-02 6.282716344816838272e-02 1.163506291564905260e-01 1.269754947469931561e-01 5.898368553829467231e-01 7.654923236063978509e-01 1.007689447972977825e-01 2.843828749386602128e-01 5.315315125187067835e-01 6.048310831755839834e-01 5.251363287585779638e-01 1.377651676370169054e-01 9.053797010390719491e-01 5.704934660977686867e-02 1.151952519976804368e-01 2.116436752091488405e-01 6.229768880798521036e-02 5.000637282765487690e-01 2.046866181559406916e-01 7.660191210959460539e-02 7.349109234894325715e-02
1.112291230855842195e-01 7.723023701560554066e-01 2.775915962740264642e-01 1.199639358095601072e-01 1.579908410090822279e-01 3.605715505760313522e-01 4.818133126365318764e-01 5.422293383346635243e-02 2.888627059285086424e-02 3.290780655355959178e-02 5.984005791984782496e-02 1.024278563631359773e-01 9.552885888018967930e-02 4.584119203428348444e-01 5.650932975615004933e-02 1.492904960642222889e-01 2.126172081850116746e-01 4.892397504298469646e-01 6.182028386876293746e-01 5.256515020390875037e-01 3.722952998221433774e-01 5.594198843167373925e-01 3.845160978382609063e-01 6.936518811725447264e-01 2.855090980752622021e-01 1.490243580222231912e-01 1.164180139517944079e-01 3.449721520206119330e-01 6.041286992965973907e-02 5.457456776011640476e-02
6.728020731452281911e-02 3.013378931543688952e-02 6.054765510144987095e-01 6.469989773130309096e-01 3.368657463724270690e-02 1.165662230766197682e+00 4.996544052863112761e-01 2.042233538288619199e-01 2.948163217340996622e-01 3.760604946062781062e-01 3.524000842133465095e-02 4.265397606788957907e-02 5.670636996453162770e-02 1.118871835856477537e-01 5.818131368406599391e-01 1.132426801672277439e-01 7.438279932110931914e-02 1.928750952828769960e-01 2.262397518850735312e-01 2.353255678985812227e-01 2.570203117561808415e-01 7.104926197770407015e-01 1.142860765840139903e-01 1.991197019161700110e-01 8.126993070920400797e-01 2.906884466878781881e-01 2.624428090337712072e-01 2.042325217898946776e-01 6.968016229779587511e-02 6.084954284778371081e-02
2.134605009585633512e-02 5.587843746881453466e-01 7.774964730882638619e-01 3.997219848069581000e-02 9.069495575571560053e-01 4.269571814082120942e-01 2.024046583865892479e-01 1.420626539233156849e-01 4.408689198998170244e-01 2.490447124243429233e-02 1.168571513339844714e-01 4.477330331203360075e-02 6.857719102301197689e-02 1.317025002841091252e-01 5.628830077046271807e-01 9.358018516332153869e-01 5.525532399423234153e-01 2.400747364263424721e-01 3.405941100358154672e-01 5.793128946047753081e-01 1.011667034267748733e+00 2.380056639571115351e-01 1.238999203576580804e-01 5.996998419914020273e-01 1.369829959304835088e+00 4.234126347169324678e-01 1.696771866074901214e-01 2.368899472999367317e-01 5.683711034879375124e-01 9.682306314041276563e-02
2.204089685055481834e-02 2.718522587423962897e-02 7.527079390862124741e-01 6.203756944891435365e-01 6.387771039958010100e-01 2.488266906255966471e-01 1.616162748235289714e-01 1.668856130242897251e-01 1.846407806217677250e-01 7.310959850742253519e-01 2.179786288474242772e-01 2.332536703342875661e-01 1.955174439614620896e-01 2.191531687707468645e-01 5.891577378160199885e-01 3.887815013666566788e-01 2.454309640456287800e-01 1.371255625447488913e-01 1.159266091285050260e-01 8.670709526210909623e-02 6.936199553141114693e-02 1.015470302648743411e-01 1.566318587103974758e-01 3.747959315270160685e-01 6.392752861447674739e-01 2.864368977147646600e-01 4.186116351080527154e-01 2.878148794809239908e-01 2.973815201352115745e-01 1.961567008661569411e-01
2.517438693857085644e-02 1.936473021054388108e-02 7.546438050917604334e-01 1.164928790975888528e+00 1.096492243494055607e+00 5.993886877919147871e-01 2.186696642895833570e-02 1.716464807865847320e-02 2.543681045962934428e-01 1.841987335077604204e-01 7.042549091240275783e-02 1.747065362454260085e-01 4.606048048738193845e-01 4.636601759699425784e-01 1.345652276738257491e+00 9.510499838005432860e-01 2.755848523719768295e-01 2.967052908273113410e-01 1.309743530259144251e-01 5.748188981709932699e-02 5.589553190705828095e-02 8.761236010056716594e-02 1.340491128924423958e-01 4.091293703670388915e-01 4.111876198183000986e-01 9.631753643872800752e-02 1.055518227152682786e-01 1.355423052654256277e-01 4.419027799024750625e-01 9.038989136812021485e-02
3.422282332397097449e-02 3.703966464454995500e-02 8.569452223770405164e-01 5.263389193921953063e-02 5.322602242595740607e-02 8.459369569960761837e-02 5.495985864513988628e-02 6.455482513989221349e-01 2.528542905664435958e-01 1.466100266776805827e-01 4.504127223387406620e-02 6.174467544552147275e-02 6.939556453065778840e-02 2.545348685873189964e-01 3.014335364531846029e-01 1.243535720405976319e-01 9.552181652566242576e-02 9.429703759325072654e-02 1.244495641051260038e-01 7.155353194171112929e-02 5.088810940743250522e-02 7.602913004686051579e-02 8.696717966826568447e-02 1.448500363093905841e-01 4.485098059283173511e-01 7.006626508977316370e-02 1.009475253541734369e-01 1.653892639380871721e-01 1.999162825229612028e-01 3.967321677338591646e-01
1.965795458647027344e-02 5.467675645947905894e-02 1.666810292489854378e-02 1.834382584663406604e-02 7.983543033832278535e-02 8.412822174513853724e-02 6.055144481290867381e-02 4.542465037715725518e-01 3.477169593927917357e-01 3.239255736776366912e-01 1.333060738294962189e-01 6.899334678033823554e-02 4.429532057752841312e-02 7.017602294560083831e-02 3.181351703997234992e-01 8.137714782002786196e-02 2.089653965590453910e-01 6.131101431261281459e-02 1.075065059486252084e-01 2.739526270109570172e-01 7.092073672154552977e-02 9.945048045546373006e-02 8.679866076961341437e-02 9.535679742646700763e-02 1.259120394791820585e-01 9.596548303118263012e-02 1.125754063940958560e-01 1.393014642328367358e-01 1.887507817613815475e-01 4.651287417108159739e-01
