3.079712883033660642e-01 1.191977451898058871e-02 3.598987922182421695e-01 7.478159972971534786e-03 3.287006193287470013e-01 7.035472309626879771e-03 4.014759366351612797e-03 1.077470187364069389e-02 1.942923886381173193e-02 8.665272098103103671e-03 9.112425112947679373e-03 1.971222650290201106e-01 1.247113960198119043e-01 6.682851816258723876e-03 6.914413119053256299e-03 1.310001613265901754e-01 4.034906421696082129e-03 2.510871998523486574e-03 3.882327799771138725e-03 4.319020943100230214e-01 4.008475018250681199e-01 6.082392583751866644e-02 4.665028908364873134e-02 1.870682125645289628e-01 3.652880318779451740e-01 2.877605612568751581e-01 1.322158868611520710e-01 1.162814850003453769e-02 1.108342914359178658e-02 1.390980869791850170e-02
2.040561823223250582e-01 1.222965794571027540e-02 9.793458946525069805e-03 1.014569841111883676e-02 4.419265174891394247e-03 2.403990303919131821e-02 9.704581676396054069e-03 1.180287411136908896e-02 6.049121581344229018e-03 3.910835012502577625e-03 5.841010953133112145e-03 1.009032893933545921e-01 1.459585271095458214e-01 3.468198746955404865e-01 7.487523352216728274e-03 3.596480320452679624e-01 3.773451205895569406e-03 4.616226947279053125e-03 5.663603600703660985e-03 3.561766016708497930e-03 2.304243256321993338e-01 5.829781998830542433e-02 1.211491971201958118e-01 1.087898437849168509e-01 9.734075737230668546e-02 1.315184360253491280e-01 4.627444812493065190e-02 1.175663623923758720e-02 1.671167344741005326e-02 1.668470811931998740e-02
2.051065686390089737e-02 2.012905405680642801e-02 3.197583006433058622e-02 2.596345455063277588e-02 7.388573624912671278e-02 2.056450183290393224e-02 1.817611838640809385e-01 1.912485729596886119e-01 3.956659173942325691e-02 6.103793032717286932e-03 1.553173886645843604e-02 1.288960112613552443e-02 7.501451815325216321e-03 1.570597285429822798e-02 2.232227481850879158e-01 1.477564399943738505e-02 6.818689978333226237e-03 6.843077955476901085e-03 1.309483847476880861e-02 5.043646401944100986e-03 1.422060661382710811e-01 4.797649065678499108e-02 7.336518592968069297e-02 2.571750233760391677e-02 1.546882077416555576e-02 1.029416471986677357e-02 9.209106866559757867e-03 7.232472642593293886e-03 1.232949966491539602e-02 1.381546984830125772e-02
6.902310063486264899e-03 1.950453120662625286e-02 4.279040160919228564e-02 3.455620458221284746e-02 2.549887362975070820e-02 3.673628522340386948e-01 3.668492707263411035e-01 2.289199059869596320e-01 1.248473390743944644e-01 8.312946575855821238e-03 4.091325319990833133e-03 7.940798427658164738e-03 1.070056346473404960e-02 1.462318373733930213e-02 1.752151117194710728e-01 1.513255955565006861e-01 3.231231683249343734e-01 2.668365843326241105e-03 1.133457260195229336e-03 1.662149311312145468e-03 2.520416662582433132e-01 1.003854311699656776e-01 3.457192390074814020e-02 6.861306499803926373e-02 1.267453840080759453e-02 9.111670960806318720e-03 7.833300810769241312e-03 7.429146824147057210e-03 1.507103147567695478e-02 1.636332393449313125e-02
3.946144176155702392e-03 1.201013482290812923e-02 3.347668062964765517e-02 1.299140578584785828e-02 1.601187057121402496e-02 2.140346419526996946e-01 3.754194991724012498e-01 2.127946487233574047e-01 7.890322164600027666e-02 2.180877816840614408e-02 1.865645377927030446e-02 2.218618809304598316e-02 9.374786256155686476e-03 4.374096734066856285e-01 2.315052839576157429e-01 9.324831314521798975e-02 1.135005834271428371e-02 3.165631240859277315e-03 3.523373057225499729e-03 2.034954402959487669e-03 1.953095997610339784e-03 1.329565027132636745e-01 3.422680052479927237e-01 1.133406463476204912e-01 2.293310246951740100e-02 1.219081415263213557e-02 8.480086311167348359e-03 9.793673037010390547e-03 1.528979313511912713e-02 5.612423899834968061e-02
8.706995256231133892e-03 9.293551309848629982e-03 2.943962038769323830e-02 1.768516352829570260e-02 1.045979071308072127e-02 1.202239705397026431e-01 1.546843302759109695e-01 1.663546613239119398e-01 1.362347754166368941e-01 3.017577669778086918e-02 2.636842449461864607e-02 2.265897718867315724e-02 1.987371906498285878e-01 7.519171585325515328e-02 6.367861168776123293e-02 1.082209262003515360e-01 8.831553470625249508e-03 1.412057963118779624e-01 2.409561169775928727e-03 4.599550268636799430e-03 8.361700935542431407e-03 1.398279267708357927e-02 4.240370188081903913e-01 6.633727796448571357e-02 3.426465374536065422e-02 3.192240922530101277e-02 1.994055339977646862e-02 1.371083549811515090e-02 1.803185296416219899e-02 3.230687162781026994e-02
1.154392639838893037e-01 1.749449147057385578e-01 1.718204796439385951e-01 9.550639112408007905e-03 2.761839011695220621e-03 7.126562036118320488e-03 1.517598729751404654e-02 8.516747951328597355e-03 1.079197552188808709e-02 1.099269562983568906e-02 1.404398083348621859e-02 2.425780444669248803e-01 1.123849330810129943e-01 5.275144201013883677e-02 3.108781343825548632e-02 5.429311762934858204e-02 3.050450346991423478e-01 1.351772920253367927e-01 3.926329024636507348e-03 5.539630980793147468e-03 4.383765341684643657e-03 1.344322603486074463e-01 6.269226865591090436e-02 5.999517317094427843e-02 2.321555500113246448e-02 2.378124227804771090e-02 2.094830019016159436e-02 1.800641430238415427e-02 2.051570398053467748e-02 4.847601795549381920e-02
2.340651552365377031e-01 4.357458803655624990e-01 2.414414324430168013e-01 7.252297189895785291e-03 6.087159274260625468e-03 6.876996650056963790e-03 6.230208157636782200e-03 3.972877702636511132e-03 6.078285665902341192e-03 3.334573150834335142e-01 1.403966373170167925e-01 4.378848701569981738e-01 9.455239346218588525e-02 3.384758647236486839e-02 3.850013844278334790e-02 7.160343658040016490e-02 7.819317420114798092e-03 8.378330048444312603e-03 4.966484804414413728e-03 4.819898739667390249e-03 1.876761579070511943e-01 1.098684971470030997e-01 4.416084581647781310e-02 3.692490306824665336e-02 1.758188459941904813e-02 1.832763372185916909e-02 2.839820990700678977e-02 3.195228955387501707e-02 3.161422879910774641e-02 9.151854711156871824e-02
2.310163596124500951e-02 3.484928369280927973e-01 2.028110589481495474e-01 1.600540474031492827e-02 7.822217700425123516e-03 3.052047822894740636e-01 1.729144699851514408e-02 7.419994945146336264e-03 9.077526078670307072e-03 1.100386541942421567e-02 4.320175097410761667e-01 1.383655058551829832e-02 1.894068537197935581e-02 8.115690429714000551e-03 1.209602407491783688e-01 1.015057902313812183e-01 3.179953255788257015e-03 5.987346889930741239e-03 8.010010945966299784e-03 2.474480112794699149e-01 4.913187049119603633e-02 5.104294509349430187e-02 5.532189723211444060e-02 3.609821134202498977e-02 2.111350764060215823e-02 3.163520575778998312e-02 1.174013484519850214e-01 2.080153685444882938e-01 9.483374833367117646e-03 2.811557013030401286e-01
1.582507498913131305e-02 1.167749014040703019e-02 1.854713686067850642e-02 7.435506323456370775e-03 8.750840783862999864e-03 1.425972141500277124e-01 1.826635290426457253e-02 3.277865812379313626e-01 1.572289765569160613e-01 5.670815404639534263e-02 1.146666475736055069e-02 8.887555847030617628e-03 7.758070298964641828e-03 1.033247801321712442e-02 5.410734212028690121e-03 5.708681535696585353e-03 2.442983096336410337e-02 2.207611580454870923e-02 1.393100748492316979e-02 1.040268461281170301e-02 6.205855935238015209e-02 3.916745155109010307e-02 4.484453499858943870e-02 4.915807612303833840e-02 2.738671118586108802e-02 3.447813415315154756e-02 3.130591709332497530e-01 4.749676554182650778e-01 9.768797739799004246e-03 1.481562106041746929e-01
1.553466848111871579e-02 3.402572741269191958e-01 1.045397684431704360e-02 4.207948361706748304e-03 1.243964300756935162e-02 8.803773351087315624e-02 8.752743810336684194e-02 8.093047667260264144e-02 5.666495378280167472e-02 4.455840510264774679e-01 4.400271422325113119e-02 4.914125789808564820e-02 1.005013436379602887e-01 4.874638034855999225e-02 8.841147021203152670e-03 1.707572413723315585e-02 3.145234310454257665e-02 8.601435824142760270e-03 3.812008335489609160e-03 1.000937258113891865e-01 4.215670283203550028e-02 3.763951661310852709e-02 4.855348137984677459e-02 6.783159058061054292e-02 7.236572729249958480e-02 3.900752552708929705e-02 6.051103515334442517e-02 4.508459229219170805e-02 4.018558073515811346e-02 2.892347530129757427e-02
1.523301502672917140e-01 8.320336960683338834e-02 1.913898540549319877e-02 1.691167521696818749e-02 1.486044578014236381e-02 1.418353099208869150e-01 6.688413793181249845e-02 4.669706432516093630e-02 5.635419693639913408e-02 9.141578827817690295e-03 1.295178645238064322e-02 5.984719073226953123e-02 1.007159218721771915e-01 5.173282476263221796e-02 1.849533480642829436e-02 2.068268639320685817e-02 2.272435042124344717e-02 1.332856372564949696e-02 6.261562884234667288e-03 2.262558668589945698e-01 3.998063222366958491e-02 4.070420235312657842e-02 4.807190135553490729e-02 8.595291784352986075e-02 8.166134159022850336e-02 5.812069848220258184e-02 4.456251229711005735e-02 4.048988956246001025e-02 4.433132019189842121e-02 4.834826760551277913e-02
3.623486921563677521e-02 8.692998758710288043e-02 1.936588921028247201e-01 3.137053263367191314e-02 3.465604844539765805e-01 1.190553681618797821e-01 6.640066443320792600e-02 5.807898944899388127e-02 7.469071906047410059e-02 4.013683372749802039e-03 1.413580441787548048e-01 2.024923065782877063e-02 7.279725395454293702e-02 3.111329205580216223e-02 9.768884006246952856e-03 1.128901558923674220e-02 4.171680624995944414e-03 6.123674830978716351e-03 1.101745535749667701e-02 5.286453916075442051e-03 3.803192842446299904e-02 4.170801989149608424e-02 5.277110163213620531e-02 8.778676975574183083e-02 1.113778913693155015e-01 9.742241090342511345e-02 7.187832857349620019e-02 6.778060841844378570e-02 5.981043483040519859e-02 5.005053416801549110e-02
3.145604938364804370e-02 8.871741968170052117e-02 1.545793762277047345e-01 1.103569978179861771e-01 6.513703606995219220e-02 2.528583390197589043e-01 1.915125951625354025e-02 6.514441650261801157e-03 1.019437445475534498e-01 3.314734405988327415e-02 1.174801605707570529e-01 4.100084868633824958e-03 3.224551616600840331e-02 4.378424475942375993e-02 4.696495010275987536e-02 6.380130134228494121e-02 5.781087295569871387e-02 3.774956800466122697e-02 1.036826050493436235e-01 5.015173052250361529e-02 8.407210343083683021e-03 2.469262505835794486e-01 1.858423432666552744e-01 4.432631960160484663e-01 1.496659998489034867e-02 8.421087689330445866e-03 1.932832852935943355e-02 9.491452183365306494e-03 8.079941271727449081e-02 9.418023935729555318e-02
2.944725984753395268e-02 2.934313378168808967e-02 7.911887484258520176e-02 5.888626284725539950e-01 2.142548743560887536e-01 4.758314734273474261e-02 9.415304454356746011e-03 8.187987724933525405e-03 6.457631204019598226e-03 1.262040099574057439e-01 2.585960844453427665e-01 1.960478737796800958e-02 2.832980354285054639e-02 3.619300919806757444e-02 3.294987591986343889e-02 4.014346491174846515e-02 6.932929664390589941e-02 1.212939356904905869e-01 1.250356715366056637e-01 9.927245024397551854e-02 7.168840189112821865e-03 9.714663093648876965e-03 1.078369180129148779e-02 2.506322002043789854e-02 2.804359913796200532e-02 9.110689664636856255e-02 9.066028646956258985e-02 2.550582541901857958e-02 8.335388538807297909e-02 6.420367409510781276e-02
2.705800135525665562e-02 2.923405038223764185e-02 6.494324660682432304e-02 7.172145481096252329e-02 4.802955596106091990e-02 5.020799345799392688e-02 2.775522474385031524e-01 3.613206033030445016e-03 8.002558813469499988e-03 3.720200593944926557e-03 3.867923792896040165e-03 2.752327805558711475e-03 1.575592663112074937e-02 3.220550732240566594e-02 3.032923442420460552e-02 4.688085551091340092e-02 8.252066894731666102e-02 1.021288773416983708e-01 6.015441801248698483e-02 1.330952719870518580e-02 8.008697760073449010e-03 5.500706215329147220e-02 7.996849812403000746e-02 1.352855480761506191e-01 1.284918893374114579e-01 1.686228801614395034e-01 1.353958637791081998e-01 4.744308694417679467e-02 1.221482304111104755e-01 7.188250338143621632e-02
3.465971184496176999e-02 3.962105814749686261e-02 3.834890937730573574e-02 3.577845141949855673e-02 5.145406276314489630e-02 8.670718888015413461e-02 2.418911509341314936e-02 6.878636286134774680e-02 2.987453846529453116e-02 5.030500939961451805e-03 3.660192111048617830e-03 5.600649591214196601e-03 1.103626890992020354e-02 1.646594916492714888e-02 2.198929035761220535e-02 3.985186251377095812e-02 8.780024114269005531e-02 9.068800345765502813e-02 4.402727179869255630e-02 1.538953839823209262e-02 6.649363625458917793e-02 1.205868124863007651e-01 1.545268716282052757e-01 1.607949849047573543e-01 1.438203860557622504e-01 1.257438952626038220e-01 1.875673653920973405e-01 3.705472617920377992e-02 1.612501838698125189e-01 8.711017445620364286e-02
8.664056169860188950e-02 6.737633172689118377e-02 3.261571091033151071e-02 4.537827660483760572e-02 4.186294815645527807e-03 1.117230465000744813e-02 5.159459115783134042e-02 4.024378408123689688e-02 3.925728320039457986e-02 1.937987966167580359e-02 8.589626686208440276e-03 3.334513272493208873e-03 3.233149871091625313e-03 6.961475270167711074e-03 1.065356198910049484e-02 4.959443675562053705e-02 5.347342471397928398e-02 6.886804987766442787e-02 1.231002454932303251e-02 2.209190529743458239e-02 7.372758816265137516e-02 1.595873451596064030e-01 1.967594606670295121e-01 2.076001915018285959e-01 1.748385165195932844e-01 1.715294882363385121e-01 1.615658375779284450e-01 1.343209829859243476e-01 1.634167893171164024e-02 1.252297059985913417e-02
3.457764894991688376e-02 9.423478284323413834e-02 1.629031790017295978e-01 6.530640225972501878e-03 7.825883324612002701e-03 9.631520268680936192e-03 3.037430594553232333e-02 3.781170582067059499e-02 2.576906140824497191e-02 1.987182764939297505e-02 6.597291505610704265e-03 1.729610283152403505e-01 2.601147659093610010e-01 4.281942095872722474e-03 3.896846135045389185e-03 2.337617550494752033e-02 9.093063504912252820e-03 3.215956319966486315e-03 1.913842466013365995e-01 8.037721131995190227e-03 2.888378724903611222e-02 1.550310252680150436e-01 1.976532614206183147e-01 2.098282916160136846e-01 1.553815443955597897e-01 7.298407789924121758e-02 1.193107023576823189e-01 8.144201483851123968e-02 2.859183744854938009e-02 4.926930314583732318e-01
4.315412739096671259e-03 6.908625269068650009e-03 4.093278367106109074e-03 3.631600527312646258e-03 5.229542745214007908e-03 2.963933912187323699e-03 1.520126286828284851e-02 1.953580021590934496e-02 1.790209616111131802e-02 6.131781107640457522e-03 3.543239404694724891e-03 1.199223525572711835e-01 2.044923033638856580e-01 4.367664920523792876e-03 6.799898162314606601e-03 4.167817617244251246e-03 7.054435307861936857e-03 2.066042891707939831e-03 3.889559213570090331e-03 1.845219884520887116e-02 9.430305822734268151e-02 1.810122653707035290e-01 1.969673026648685599e-01 1.896227142184485903e-01 1.473393634760739312e-01 1.088945658628538704e-01 1.059913812586295856e-01 8.288771406359896066e-02 3.767173378000694683e-02 3.925792047989813405e-01
6.710660485520381080e-03 8.042364287332150891e-03 5.799969025930573965e-03 5.358860844617542585e-03 5.885944833391557746e-03 2.087817828651569729e-03 8.234942229372653119e-03 8.964233838027189580e-03 2.668069032771108219e-03 2.218491931955363962e-03 2.060998451119238351e-01 1.823272248725206768e-01 1.013307173165416408e-01 4.702895930837679844e-02 1.012497865181659490e-01 3.002665494928766221e-01 3.923131361200575366e-03 8.031641612025809326e-03 7.798610973976948663e-03 3.530947612772336597e-02 9.837720145955150541e-02 1.451816518220156449e-01 6.011967595423267641e-02 9.153622972333427810e-02 1.193951756733701991e-01 6.802509681671697894e-02 6.426564030675496753e-02 6.454645911433543048e-02 2.203990204264693609e-01 2.397232589499352917e-01
5.365951104108758821e-03 1.134230736729883310e-02 3.339993272442943750e-01 2.848099454101787886e-01 2.608241956725543265e-01 2.503036329348950172e-03 1.798482165808033221e-03 1.333961613082134123e-01 1.896067999795116588e-01 3.272135979514842474e-02 4.812029297631784802e-02 7.697635117942468186e-02 7.368463476190065253e-02 2.308160241342455676e-01 5.526126716226017858e-03 2.203534763230522234e-02 3.834151119488149462e-02 4.983140453729167224e-02 3.420025940742379977e-02 2.607030621179002097e-02 1.892325067022890620e-02 6.925748629749790310e-03 2.743532201160842673e-03 6.026873985303818002e-03 2.203009936602137384e-02 1.206192352016165203e-02 1.715890125815038025e-02 3.183692814609552779e-01 4.113549957329459134e-02 3.839782757095668020e-02
1.107020906780146509e-02 1.869446860315765110e-02 3.759535344124064205e-01 2.208450435789407473e-01 3.648211439388274746e-01 2.760268378607337869e-01 2.116466883144819868e-03 4.795228105596046481e-02 4.526374697312377654e-02 1.959902731101871576e-02 4.852550930849819366e-02 8.958952284498519769e-02 9.728075210379519278e-02 4.478609989440708872e-01 7.695122023700086585e-03 1.033515164408455728e-02 3.779630414788884979e-02 7.056828174962168077e-02 8.016503949565664811e-02 7.060223248066876955e-02 1.952961767804755819e-02 7.021605011136708950e-03 8.732183711713650820e-03 1.748680915695556559e-02 2.549516670697175164e-02 1.209065075946385258e-02 3.694830818630048253e-01 1.512485700193715588e-01 5.652259493276751146e-02 5.425547882035836739e-02
1.353783824822059334e-02 4.262705382185590780e-03 2.106675871909075570e-01 9.141669166544605374e-02 1.163467859756923961e-01 2.569785832185575436e-01 3.417698603651230793e-01 3.943903285978979378e-02 2.234404421015132730e-02 2.547863765494374697e-02 4.625924655229168847e-02 7.892298699081547186e-02 7.315044704360453010e-02 3.484382908107825916e-01 1.431739182342871286e-02 2.235677297542704861e-02 2.815543023868163214e-02 6.476020048390426775e-02 8.172693447349239915e-02 7.060488039409223981e-02 4.642882207766215602e-02 4.148861890769091620e-01 2.825141115146809212e-01 8.272513753520734092e-03 2.703730856157832499e-02 1.974128727186956825e-02 2.797176930452565866e-02 2.608364841969616488e-01 4.563672518757505570e-02 4.124921327546267336e-02
7.349672938602211381e-03 4.635291332705040318e-03 4.416272179395588360e-01 4.770267138874503265e-01 5.883438839843062665e-03 4.445185851400700744e-03 3.670280352711167704e-01 1.558635783737519209e-01 2.273190098439520357e-01 2.901357817413409146e-01 2.716890890117363427e-02 3.265611467900667031e-02 4.285883759583156843e-02 8.272664899575413178e-02 4.135323561305100371e-01 1.587334650882689033e-02 7.511902466089958284e-03 3.440900272119152420e-02 3.977883270548831368e-02 3.134713044835231444e-02 3.882824679006895846e-02 1.146098300582318492e-02 8.280856883149244341e-02 1.338384084700733889e-01 2.066039497803230304e-02 1.546196850411384396e-02 5.096002812469391241e-02 6.228529738754230716e-02 5.345374470067485589e-02 4.670809057747903753e-02
2.621576570535443570e-03 1.808065936471681210e-03 3.290928749074734355e-03 6.942935227635086901e-03 3.496576513685507263e-03 3.063278933955602135e-01 1.487810155118644562e-01 1.086788771631659739e-01 3.396190372510763389e-01 7.000899609202634183e-03 8.917915848623239605e-02 3.303199762655266436e-02 4.876477519988769299e-02 8.922062975867522949e-02 3.672945106622217404e-01 1.319193524123593239e-02 3.767138176976663755e-01 1.746990675932728887e-01 2.528677658284194663e-01 4.260053346357424164e-01 1.413797528590364158e-02 1.746508315430720382e-01 8.999601670352661009e-02 4.170974966739509071e-01 9.918212284550367852e-02 2.938395952726052807e-01 5.336312647397151165e-02 9.381034252571734955e-02 4.372171417276402572e-01 7.452715187414138409e-02
2.655909688341364944e-03 2.090018659927902166e-03 1.447727217462818367e-03 4.359031261070818175e-01 4.570478224044093318e-01 1.808072707243768007e-01 1.224726470434432113e-01 1.278060629405201876e-01 1.422300145289069617e-01 5.633992833477137196e-01 1.651137025183382345e-01 1.652242322800110408e-01 1.324220609242660329e-01 1.334830558594495564e-01 3.340715269549832112e-01 2.249678454560719021e-01 1.572588161706145460e-01 9.791062461568351971e-02 8.511696478814224920e-02 6.388120971828589734e-02 5.127749991683992759e-02 7.495212331585375531e-02 1.144035444123795153e-01 2.670200249738308718e-01 4.568741438466972782e-01 2.063761073199670004e-01 3.177959353571814805e-01 2.208720137841306275e-01 2.285079220872847094e-01 1.508884413498687294e-01
3.604874320737982713e-03 1.841552054097676415e-03 1.486451836654742627e-03 2.771502161031574700e-03 2.923943384535245254e-03 4.458717480286540913e-01 3.869830830527718531e-03 3.404565183863734155e-03 1.960674270077886749e-01 1.420268843754492194e-01 5.318291367820726645e-02 1.232411529322944982e-01 3.083811355608092608e-01 2.806053823953038040e-01 2.230192196401208082e-02 1.649480323605271442e-02 1.782444316717886612e-01 2.115893496595243339e-01 9.615537539313576132e-02 4.268205558821089318e-02 4.150620211472197396e-02 6.480038916763466994e-02 9.823982878927814411e-02 2.998780942295384833e-01 3.037836152551934843e-01 7.215578375525644184e-02 8.057838091178085027e-02 1.038703400499819407e-01 3.387372973218656380e-01 6.939846513607225709e-02
4.844003780721379410e-03 4.107121942229029210e-03 1.212724397498854238e-03 4.054421540818150572e-03 5.321892437054040470e-03 9.908124770461776767e-03 8.659306730049535009e-03 4.945031913422759384e-01 1.949800509602033771e-01 1.130718218111315815e-01 3.428450300826231534e-02 4.381160216414162201e-02 4.675336358455385588e-02 1.588076128853931346e-01 1.808579983364142774e-01 7.594896825942400176e-02 6.262263766853867764e-02 6.769339571473953487e-02 9.158582868777014052e-02 5.311371521660535749e-02 3.765510841019052701e-02 5.600597048705566877e-02 6.359082799003300257e-02 1.063990473260103820e-01 3.334159550998574417e-01 5.283768093501745727e-02 7.716554187737725834e-02 1.265641132832784899e-01 1.528907183310932172e-01 3.039490697312887124e-01
2.635283676824919010e-03 6.415676599374208616e-03 1.874214200227928770e-03 1.969212405144367406e-03 9.369799284392521521e-03 9.789102930631045363e-03 8.814255698756759058e-03 3.477427735064331227e-01 2.683376930717377706e-01 2.502295073916654955e-01 1.025706488088891227e-01 5.163767291146667548e-02 3.082613216063720407e-02 4.795433152434786656e-02 2.171829203093154637e-01 5.647680806446386814e-02 1.508226410152831987e-01 1.439601248697220184e-02 2.826267333179974250e-02 2.035865125614484961e-01 5.253820496349091013e-02 7.347567454966544287e-02 6.391391993822485851e-02 7.048261613958353711e-02 9.402933983636149740e-02 7.248347334440330414e-02 8.585080230120985256e-02 1.058031667268888032e-01 1.424062511487688698e-01 3.496481720601262166e-01
