3.276223121135171112e-01 1.401009967291122656e-02 4.380840768255194265e-03 5.545900604152029061e-03 4.235765280215662149e-03 9.315086950918255795e-03 9.239830286768495327e-03 2.498705263431422186e-02 4.531009318728067281e-02 2.047114783656123205e-02 1.652458751552467880e-02 2.131432257043631429e-01 1.337203433192067081e-01 8.451167330069238315e-03 6.653819574858055308e-03 1.435430722617823118e-01 5.286958260769178408e-03 6.803960660904367214e-03 6.009510812949573136e-03 3.925218514283328880e-03 4.420789986130123639e-01 6.856876883551504820e-02 5.262748005826925479e-02 2.100452061318880959e-01 4.081469691027077018e-01 3.212147795870634592e-01 1.482341400204533477e-01 1.307059781691858290e-02 1.249676234653079691e-02 1.573890777173506464e-02
2.141324081622150988e-01 1.472035238344884811e-02 1.077269391156809343e-02 8.791484118074066600e-03 6.147170157971931087e-03 3.272073585788373012e-02 1.803951473301991862e-02 2.231399892805093974e-02 1.254132764301650604e-02 9.129177726986471494e-03 1.064002677378689948e-02 1.082370276943848825e-01 1.557455859871381965e-01 7.538960038642255126e-03 7.759538322887191662e-03 5.158343614726616094e-03 5.141422529563699842e-03 1.261446480365573108e-02 9.273485211021406660e-03 5.201669999816360690e-03 2.563796440839921642e-01 6.605676107388060159e-02 1.375583337843056808e-01 1.228152716304704295e-01 1.090861882637074037e-01 1.471128051757974453e-01 5.203677779722144098e-02 1.324914333757578645e-02 1.887957258892760184e-02 1.889485356251214762e-02
4.038702309881953695e-02 4.033899883157991695e-02 7.143037242990278590e-02 5.801450171600561895e-02 1.235019058300618894e-01 2.828233476243260242e-02 1.883946081789853455e-01 1.992562852968465248e-01 6.850554438683828518e-02 1.317519171752706310e-02 3.440088025381216053e-02 2.631475996172154622e-02 9.751037367020935070e-03 1.944272925510800998e-02 2.376258057589493711e-01 1.965857289186765874e-02 9.326049923781078860e-03 1.548477153795019094e-02 3.729525708885490787e-02 1.040142803357538628e-02 1.624195657174855034e-01 5.476822738880543495e-02 8.380759853436932361e-02 2.917538856314626575e-02 1.737962748740927085e-02 1.153851557645495067e-02 1.039890135384466223e-02 8.176584444815124600e-03 1.395770532073766466e-02 1.565648870531233944e-02
1.535938367268048846e-02 4.401341201588641200e-02 9.654500061112977760e-02 7.795241784220181824e-02 3.987382133630726355e-02 2.070320105076471628e-02 3.803573022762265499e-01 2.375436244939931607e-01 1.295054084078504364e-01 1.724885573015207119e-02 9.491942584012142206e-03 1.875639278755903902e-02 8.477410745622459068e-03 1.329106478002814798e-02 1.822576245165112296e-01 1.641108848317469615e-01 3.569628454390900707e-01 5.981372934120691813e-03 3.142600173681155129e-03 3.717524454585437697e-03 2.855473693039819461e-01 1.134508473889603297e-01 3.896204817205881771e-02 7.686945065689364254e-02 1.416638774291249618e-02 1.023136921777141606e-02 8.863672610593347975e-03 8.417042144622497585e-03 1.710252486072815284e-02 1.858989722819484602e-02
8.809036528431702165e-03 2.731319098672169154e-02 7.618145950432217428e-02 2.955270434439915064e-02 2.408773541762095766e-02 2.224920044177236267e-01 3.887179334827849386e-01 2.198368614131331333e-01 8.121624452279881112e-02 4.283199525029833532e-02 4.281878171040165437e-02 4.368380248814829336e-02 8.237843371881461291e-03 1.402168396142371327e-02 2.382363376679237366e-01 9.913596309909387949e-02 1.885903679597094110e-02 6.467460884045895045e-03 8.210620411725029141e-03 4.749641725121761006e-03 4.028577414297557398e-03 1.454715953557497721e-01 3.721613146003390771e-01 1.198750624564397238e-01 2.558479010016609378e-02 1.369909177681240438e-02 9.575953476686509605e-03 1.108815520069715566e-02 1.736540748431622885e-02 6.392180945535286263e-02
1.320091419208990063e-02 1.420331449448907282e-02 5.221813302710521382e-02 3.615329097186249785e-02 1.900474734450183917e-02 1.256804095119571085e-01 1.603952836390656889e-01 1.709626441083241244e-01 1.389741702582335536e-01 6.136046574301611684e-02 5.076316931987107095e-02 3.681475770923142710e-02 2.045629390750274834e-01 7.709676484022046083e-02 6.510067437879506203e-02 1.134489723056112259e-01 1.374359785586288900e-02 1.526910571618962653e-01 5.046649453958115296e-03 1.221176788812121383e-02 1.846904943077446598e-02 1.631578078147764843e-02 5.715182002905070356e-03 7.067743343060853278e-02 3.817948545699818147e-02 3.586467860970182775e-02 2.241206616724805700e-02 1.548429839022195768e-02 2.047646071545870111e-02 3.687374704813989323e-02
1.124173827653352914e-01 1.721477644811535979e-01 1.694624156129887482e-01 1.490562728341013332e-02 5.713202570283061783e-03 1.273859284761716913e-02 2.475972926384832629e-02 1.385863006890940101e-02 1.678468251852327509e-02 1.722865356613938886e-02 1.425888709273567985e-02 2.478796449446067640e-01 1.162357370923988720e-01 5.528600922848564414e-02 3.248376056619435570e-02 5.668159337687477678e-02 3.226283629308359102e-01 1.447549260672962579e-01 8.186121256012684338e-03 1.152189685661276879e-02 7.854305686651014487e-03 1.469057786791013176e-01 6.863318782583324729e-02 6.440399523263456993e-02 2.602222587095509229e-02 2.668463043392081332e-02 2.339435421563055076e-02 2.025635943648302489e-02 2.326767339053757710e-02 5.539491971515306951e-02
2.287667285095039416e-01 1.475503907237642187e-02 2.356226598295707020e-01 1.028662078217227639e-02 9.208984677440834252e-03 1.040918209455287714e-02 9.300722705482359146e-03 8.845403869067567856e-03 1.026825233837474170e-02 3.300923065373846388e-01 1.381842452791874620e-01 1.010414222805779659e-02 9.815056132412966483e-02 3.601420550664198583e-02 4.103270694831906429e-02 7.638825956140629647e-02 1.291678978017280106e-02 1.527507680906283957e-02 1.025276297081083483e-02 9.167359082385329386e-03 2.088570560279718324e-01 1.230417503394739126e-01 4.972592283600199559e-02 4.165381917259902006e-02 1.980056145957631922e-02 2.047721187751933014e-02 3.145536755892633374e-02 3.573839904116568600e-02 3.580450395509726658e-02 1.045997764494903948e-01
1.262238383786863129e-02 1.069684729109792766e-02 2.033067129445828014e-01 2.429963651384453235e-02 1.182299816103072644e-02 4.991741427382487099e-03 1.612165904999331503e-02 8.040033405953489823e-03 9.460354118237110019e-03 1.082307279694885022e-02 8.228351189933664350e-03 8.765750022121779339e-03 1.718260046274341230e-02 1.443073039028472393e-02 1.311638533946341278e-01 1.105966681403020013e-01 6.653055282559934384e-03 1.521528154954492409e-02 1.815515144809357051e-02 2.763651450882748106e-01 5.511236917085433201e-02 5.751790986069198197e-02 6.263474490984645426e-02 4.095729823588709073e-02 2.394056189541195895e-02 3.518712655494907193e-02 1.236692004346889862e-01 2.227467581042759104e-01 1.067533592392575816e-02 3.214255983371117065e-01
1.200031529952250674e-02 9.537233564213924708e-03 1.510974407032295540e-02 1.402824690905994653e-02 1.336121615248341173e-02 1.525763316638923672e-01 1.861746936113892886e-02 8.308047910481782677e-03 1.535666395371497184e-01 5.602690241972124729e-02 9.068247077709496590e-03 8.679417853776440206e-03 1.847384786804191423e-02 2.288995638399737159e-02 1.171690168367637772e-02 1.267451042553656773e-02 5.939806908586675593e-02 5.698526257046283156e-02 3.034040610534602042e-02 1.957658047351528569e-02 7.019195636944514094e-02 4.442408627668674448e-02 5.101408127155512839e-02 5.605619158261017365e-02 3.125527139819298666e-02 3.879858670254216629e-02 3.357049705688252006e-01 9.006219803336637866e-03 1.101083937981726935e-02 1.692951944302667211e-01
1.913221563984132678e-02 9.686472006256406642e-03 1.379241439465742763e-02 9.974975595608307974e-03 2.223861279713230943e-02 9.605049605911558652e-02 9.230874140423731000e-02 8.332567043912569860e-02 5.650661440683734521e-02 7.704612459833701937e-03 7.186328163121044610e-02 1.178031224089540752e-01 2.451501775127231664e-01 1.210139732188320327e-01 2.231401682605552161e-02 4.386700032209711608e-02 8.134725914674209579e-02 2.233757315854763975e-02 7.875972085824599345e-03 1.137644541601544046e-01 4.801545246787380233e-02 4.295521661178228201e-02 5.553291898791453546e-02 7.775421556430361925e-02 8.307722976720323393e-02 4.450712473350262183e-02 6.673148993770508519e-02 4.988967061363685368e-02 4.493850501032775613e-02 3.320743640052474521e-02
1.631961929510656328e-01 8.895318435374606481e-02 2.220459967656242609e-02 2.365676193177065553e-02 2.177849136388586293e-02 1.548290736343246321e-01 7.240913114836895759e-02 4.990341599194898087e-02 5.907196907232370453e-02 1.325416482928691228e-02 2.194702458350439658e-02 1.447582395985989590e-01 2.526404043569171476e-01 1.306928883097772665e-01 4.700551675005244096e-02 5.293952356939832932e-02 5.835535633361928209e-02 3.429563978222776449e-02 1.278246812045931088e-02 2.581200543677293346e-01 4.571397677214655841e-02 4.659378027633457459e-02 5.514499652962011333e-02 9.870939554448106279e-02 9.389300521468675609e-02 6.683367378907727197e-02 5.128405291250016929e-02 4.676185343970422348e-02 5.148909880292536906e-02 5.628911612365529449e-02
3.868491240678893772e-02 9.094837630239002713e-02 1.997395838926082079e-01 2.556685845612833088e-02 3.674418077617952472e-01 1.283766321215009942e-01 7.216161328338255299e-02 6.338053674737936793e-02 8.112629186156075645e-02 7.380534121011327053e-03 1.567865141528810569e-01 4.845491304850770009e-02 1.870732434298484903e-01 7.982169649957085444e-02 2.498807024414240532e-02 2.879785328540390016e-02 1.064709087885729044e-02 1.564308340860172744e-02 2.371487510239912375e-02 1.055915744373753067e-02 4.361736127252488493e-02 4.786377911404179203e-02 6.011726516591489600e-02 1.000129435307226672e-01 1.269517448009678529e-01 1.124066667768795630e-01 8.314770604840510115e-02 7.898687878958950137e-02 7.027543517331993894e-02 5.918235766560655392e-02
3.331441298356692393e-02 9.136202977644636292e-02 1.415376775258900821e-01 9.932851036090631358e-02 5.885174503799253665e-02 2.594707988240969598e-01 2.506502366098091114e-02 1.183663420044238183e-02 1.130203862244990032e-01 3.715751929220115907e-02 1.329020474892500248e-01 9.183719624862659789e-03 8.481740731398197675e-02 1.139118327505668632e-01 1.206964469439882059e-01 1.619090796813174027e-01 1.464753188263734629e-01 9.569820399663062083e-02 2.630273837775304879e-01 1.253815775219914719e-01 1.649949744123416912e-02 2.839880207171968096e-01 2.114843651943426051e-01 1.248135963442554945e-02 2.171509630819480965e-02 1.755965396615592408e-02 4.348887842061406606e-02 1.915451552093362306e-02 9.592072954266570028e-02 1.130454954626192304e-01
3.134120137194749967e-02 3.024480581689374670e-02 7.256538702348142023e-02 3.161743555106749648e-02 1.885773153405859437e-01 4.770804661472671793e-02 1.232769045675189551e-02 1.814003478599651026e-02 1.353464647321862141e-02 1.418538384398546903e-01 2.926900198175936829e-01 4.437470275646106244e-02 7.488651087061928835e-02 9.471389381047856659e-02 8.527145849298797819e-02 1.026708887356006794e-01 1.766667868608734482e-01 3.083654154255547897e-01 3.170855380879275542e-01 2.514401322019017004e-01 1.501736971612975882e-02 1.879960992523655589e-02 1.627722365181126854e-02 3.895971526400318630e-02 4.636577864493317963e-02 2.388062482587969271e-01 2.395757188099572610e-01 5.967448743023989755e-02 9.914964537885331830e-02 7.720021040621988240e-02
2.903731794140093636e-02 3.062682124409722706e-02 5.994126944217430253e-02 6.346577100197470234e-02 4.132548597587643729e-02 5.015577810551699600e-02 3.074083482888014807e-01 8.660260393753470287e-03 1.872112193982652939e-02 7.967330021480189053e-03 8.314492764964178523e-03 6.406179235924774201e-03 4.172734498831891931e-02 8.462955147856029980e-02 7.903459993562211849e-02 1.211597159045430389e-01 2.120725792969579970e-01 2.609817068040442001e-01 1.527842374989896168e-01 3.370604808125138296e-02 2.043154336801147192e-02 1.415286989689166774e-01 2.078665437196689225e-01 3.523731877555976721e-01 3.351837893580749128e-01 4.417895161258440506e-01 3.566729381760208595e-01 1.157533218838796840e-01 1.448876057226997638e-01 8.589500901130268928e-02
3.749017575577961309e-02 4.232704037417657494e-02 3.977736896966474478e-02 3.601656931906018627e-02 5.256574233324304291e-02 9.297771089344356032e-02 5.315567302746651568e-02 1.667091068387887842e-01 7.639389016646774833e-02 1.299374595123777010e-02 9.560246690963978416e-03 1.480174784202369434e-02 2.927600144752841305e-02 4.346440152495276849e-02 5.777123147224523525e-02 1.041933418554889801e-01 2.276909819456157114e-01 2.328307909867736170e-01 1.119406591309596577e-01 3.897062127209467014e-02 1.700300795775892548e-01 3.117152267484555872e-01 4.040101266531687663e-01 4.203943221114054829e-01 3.757397524610899819e-01 3.294937898598503390e-01 4.938115620497439129e-01 9.277301956015455986e-02 1.908266055252559601e-01 1.034722519674028535e-01
9.391814714345930737e-02 7.304313764823031074e-02 3.531241077538246897e-02 4.941379406628765292e-02 6.697775690404547330e-03 2.491363646063039783e-02 1.292479348326783239e-01 1.036386770690532894e-01 1.017682247687005798e-01 5.048658587816033660e-02 2.063853624868209821e-02 7.034562441433578339e-03 6.848214545977693649e-03 1.570528096337282450e-02 2.819417187099451660e-02 1.309591021199769112e-01 1.397257625984423823e-01 1.724913654586288647e-01 3.051339388421655738e-02 5.459286439944902036e-02 1.889181304301971731e-01 4.137316089288847198e-01 5.162709985265251378e-01 5.436191110128234527e-01 4.566271017695604506e-01 4.494464182026766119e-01 4.256240114473714975e-01 3.454873477630379663e-01 1.913075783279130290e-02 1.325585049857353794e-02
3.727476243357633751e-02 1.020843376879564113e-01 1.784931323017641958e-01 1.243761339355094891e-02 1.908785902299795639e-02 2.524749586317635158e-02 7.965262592309488299e-02 9.937956135297801308e-02 6.790141497404021675e-02 5.250360128834984097e-02 1.449105739740035384e-02 1.927150656350173907e-01 2.899376960808512371e-01 8.301628169487608108e-03 1.032388611148857965e-02 6.171234778047536562e-02 2.381534496833165662e-02 8.064006791324858370e-03 2.185743438596274846e-01 1.996507737626955839e-02 7.386086298020941299e-02 3.974140661960036680e-01 5.079652479668885778e-01 5.411966805365484579e-01 4.035234318438132850e-01 1.915176513067693154e-01 3.166968966989104350e-01 2.157097845096820621e-01 3.496430517718638470e-02 1.521036945567787180e-02
8.272889927480178013e-03 1.245433852395219122e-02 7.738791142477398008e-03 7.806861966916225914e-03 1.400403492437119965e-02 7.986379317340508086e-03 4.085926444142729680e-02 5.243855206143943626e-02 4.797935578610858232e-02 1.402067558929650723e-02 6.338733431548710003e-03 1.332301840955081862e-01 2.272838607141429157e-01 7.715561121670905242e-03 1.469222872659840633e-02 9.393491679562477811e-03 1.644459630119785021e-02 5.176943887084662493e-03 9.731663457054662986e-03 4.615809354205473169e-02 2.412146825965001684e-01 4.602917814367009086e-01 4.979549188515420832e-01 4.831083869038994005e-01 3.807543192112664565e-01 2.861483783805202075e-01 2.830274934822242239e-01 2.072769976017197480e-01 4.956183256858868319e-02 4.607824835688981158e-01
1.636397035981237286e-02 1.468216210364129901e-02 9.585466020128705078e-03 8.521237782946878420e-03 1.138711350875387315e-02 4.710667570111118016e-03 2.152174869987242417e-02 2.138139754151211283e-02 6.113127105411706591e-03 4.402875885090966335e-03 2.283034159089520898e-01 2.014043955313623846e-01 1.116906064845175350e-01 5.189360595162664097e-02 1.115666984563063735e-01 2.697644626218053017e-03 9.231458016453388676e-03 2.113922124565045108e-02 2.042508509552503487e-02 9.170171710447319602e-02 2.521406479856666549e-01 3.671094403605069112e-01 1.500533497274284533e-01 2.308595144893958728e-01 3.071304059278427423e-01 1.789128218783699875e-01 1.560811718258924286e-01 1.457042017101477793e-01 2.654699217962960822e-01 2.887274011689762165e-01
1.322146485010306308e-02 1.490314253313477187e-02 3.668541743448787765e-03 3.062838818772842808e-01 2.900964222848403939e-01 4.363327350620289924e-03 3.747083496005725219e-03 1.478182188091891613e-01 2.093297321399458233e-01 3.614910627918387076e-02 5.314215057240986861e-02 8.447034917016024713e-02 7.853250689854630873e-02 2.464925166826979763e-01 5.827697687720701306e-03 4.982492708906585688e-02 9.125874755900555135e-02 1.323697501582380143e-01 9.057668327626813842e-02 6.835040152515081679e-02 4.867013886448905147e-02 1.747747628340188750e-02 6.806616168397251580e-03 1.512504634069260223e-02 5.640496236971297844e-02 1.960028543744013821e-02 2.685303489190830201e-02 3.799344454964313500e-01 4.963040630037805073e-02 4.634779300841367078e-02
2.784959739702073597e-02 2.414657052011482535e-02 4.534117282388203801e-03 2.366009766067716513e-01 4.042268052156520186e-01 3.075114978065799365e-01 3.756612435156205659e-03 5.312821589216448065e-02 5.001726787112983907e-02 2.167624838784221880e-02 5.361272563086911386e-02 9.784947814322206283e-02 1.035258614093909069e-01 8.020643063871546116e-03 8.604181230623317994e-03 2.761386973205128686e-02 1.013196371150872910e-01 1.891774930359535201e-01 2.144885302402713412e-01 1.867529989539281066e-01 4.007541700992613143e-02 1.245397249946418768e-02 1.542004088446558702e-02 3.689719217144301483e-02 6.474920978294197715e-02 1.951451425406817985e-02 1.283492126971570030e-02 1.769975942950620662e-01 6.683386278550206006e-02 6.418697431504183371e-02
3.471858880644348999e-02 5.040655554346130419e-03 2.253090047588298950e-01 9.648832535442022906e-02 1.269644779850966909e-01 2.856872196672395336e-01 3.794830693482063033e-01 4.370771600229082093e-02 2.471859236006362578e-02 2.821366575561992662e-02 5.119826487593702458e-02 8.651467731558003249e-02 7.785043651110483409e-02 3.711081154077318089e-01 1.349993846047544549e-02 3.905102859097404205e-02 7.583448930483178974e-02 1.748626928703306826e-01 2.206971340426519546e-01 1.885660818261662430e-01 9.575441733425800461e-02 8.981902570087775539e-03 3.162244899037385260e-01 1.446573943825371633e-02 5.918799190411186406e-02 3.206931065030776962e-02 4.318802809690955313e-02 2.993279870058104808e-01 5.279155129410239428e-02 4.774543383009953457e-02
1.911334690818677906e-02 6.911956664472573668e-03 3.016406143934267838e-03 3.166775557201582762e-03 7.883206960408135205e-03 7.687398625662984764e-03 4.070449336585148514e-01 1.726575012041643431e-01 2.517401754451853435e-01 3.216255111820374157e-01 3.014182914973270039e-02 3.600819909773352728e-02 4.707403811804712623e-02 8.856972732649384672e-02 5.963866858954345110e-03 1.190682789589130215e-02 1.315063148770554205e-02 6.101861607398026410e-02 7.774048283440983254e-02 6.326118150037528254e-02 6.221071093903499105e-02 1.616980712939974224e-02 8.769509705847505776e-02 1.422464361127930010e-01 1.437248535659585089e-02 3.198591153583597857e-02 9.918569478276186013e-02 5.476438026494461625e-02 5.872704305992801355e-02 5.134395623697800282e-02
6.830180333047941588e-03 2.693611275445869507e-03 3.478740545560545655e-03 7.128326465055759460e-03 4.821185118278866269e-03 3.399359993595775786e-01 1.649534983335597393e-01 1.203677149944716862e-01 3.700749143127440299e-01 9.496533813366380902e-03 9.768159090985543969e-02 3.660993713099035263e-02 5.390291323552729580e-02 9.640687726248720057e-02 8.333722463127220606e-03 1.363420618772954833e-02 9.368179388642346520e-03 1.986395361273418370e-01 2.890387416193175296e-01 1.073093265215136274e-02 2.181466472852519253e-02 1.964468009255578851e-01 9.751664124016332091e-02 4.793424362699349323e-02 1.046897874578684717e-01 3.298792323811584049e-01 7.838428342750472511e-02 1.061942819725497367e-01 6.180976015514254296e-02 8.174176675900551858e-02
6.921869448002790012e-03 5.520084266214283879e-03 3.296879491540942453e-03 4.867606520737596254e-01 5.077275653557278279e-01 2.005939531752888028e-01 1.357681218952445923e-01 1.415220346925372963e-01 1.548940500451394808e-01 3.946334318236374011e-03 1.809622766045589914e-01 1.832878206444342739e-01 1.471153955869656249e-01 1.469309140091563937e-01 3.682089952282578404e-01 2.488567066692921048e-01 1.785018488617767241e-01 1.118673640236213795e-01 9.763793197020877168e-02 7.320522357148746828e-02 5.854638741251202982e-02 8.503353391587162302e-02 1.271212368416706484e-01 2.971519191846981878e-01 5.081124732917452480e-01 2.325171789043330439e-01 3.586335973455340165e-01 2.472229862519834120e-01 2.555813506432846327e-01 1.686905793968185574e-01
9.400041766720098474e-03 4.868231596369510840e-03 3.388600717172494427e-03 5.658148354583200472e-03 5.669310882667442063e-03 4.946818874301167068e-01 7.615475107945763461e-03 6.241756382403652360e-03 2.119328814900814928e-01 1.544640949252806539e-01 5.821841748880680206e-02 1.367809127380971712e-01 3.435119816948459803e-01 3.141497732704760515e-01 3.295245654315570594e-02 2.481058352526251121e-02 2.033010483733294071e-01 2.427058293900693497e-01 1.106186729361511856e-01 4.910269202065999095e-02 4.763870340113814106e-02 7.404262659100439847e-02 1.119189269297490297e-01 3.408204673594442680e-01 3.442375004491140533e-01 8.164174046419245268e-02 9.113270690942210095e-02 1.175939749803924239e-01 3.838356220445487965e-01 7.862963423169536115e-02
1.264890845985246551e-02 1.087218585279390790e-02 3.260385587706494774e-03 1.100507025056977548e-02 1.370038585373534179e-02 2.554006416993070266e-02 1.826495843311869843e-02 2.750929868067219716e-03 2.147859462960697852e-01 1.253242764307138102e-01 3.806351380954173941e-02 4.865822516465215242e-02 5.216121199168118755e-02 1.784533698156287596e-01 2.044369315817840538e-01 8.634834466307009238e-02 7.161382843102473417e-02 7.777503967195895096e-02 1.055271972023021781e-01 6.123309972637010212e-02 4.339788888193889943e-02 6.451001257544934642e-02 7.319624000295205102e-02 1.219565803581152408e-01 3.800960819165634108e-01 6.002917512769733593e-02 8.747551474909037728e-02 1.436512664717352616e-01 1.738749510463112602e-01 3.455466676174836493e-01
6.919801397891231845e-03 1.706859530243442710e-02 5.040630569000538463e-03 5.344501084528220126e-03 2.576652932003059560e-02 2.705585786137480742e-02 1.937576743346245203e-02 3.827752954482663839e-01 2.946505988273846466e-01 2.764403563573182843e-01 1.134429806000802066e-01 5.716887180855214495e-02 3.426816661756176829e-02 5.366097251753186581e-02 2.444545342242482322e-01 6.394378144956397447e-02 1.722192623896047770e-01 2.596313160336616993e-02 5.077661653530174402e-02 2.355256927198828842e-01 6.074529255498102576e-02 8.491965765283895906e-02 7.383628163232863750e-02 8.100357301808276678e-02 1.074286028722619413e-01 8.245386186738681844e-02 9.746478228440734470e-02 1.206146343650706942e-01 1.632569848929203427e-01 4.020226195236927813e-01
