2.059926034641105019e+01 3.101212018324399367e+01 2.674120577549087585e+01 3.354411955637590381e+01 2.521687526711926353e+01 5.547705387918783515e+01 5.539994344131510218e+01 1.513131597620567561e+02 2.789983410744648609e+02 1.264775081029869312e+02 5.993216982727358300e+01 1.395566342395002479e+01 8.429866874102161844e+00 3.299899382159116357e+01 4.069328034667556437e+01 9.554678587636917797e+00 3.659636229543159658e+01 7.021024913005440737e+01 7.041329770210089123e+01 2.716782765042636427e+01 2.204849330757900105e+01 3.239310086508986331e+00 2.551275364378469135e+00 1.035780717040523413e+01 2.057947839066603635e+01 1.666079345078130203e+01 8.000554398209844820e+00 7.150362744733631537e-01 6.907546254775628336e-01 8.855163936106331679e-01
1.528580185262670810e+01 3.460569434780751408e+01 6.206823920658642635e+01 5.014087691691297977e+01 3.472775727181347349e+01 1.565887032506221317e+02 7.589607142850877608e+01 9.646712263232480211e+01 6.461812324669455165e+01 5.616328946587107396e+01 4.143962891742866361e+01 8.436391020768528648e+00 1.168455873968448877e+01 2.786977562448876000e+01 4.072707158540839600e+01 2.772115418563228673e+01 3.740570211837392378e+01 1.352626116514156820e+02 1.142587242249891517e+02 3.818346269892499834e+01 1.390857047624249887e+01 3.195216227696933586e+00 6.882179703840113127e+00 6.288096419067910503e+00 5.761679699792106035e+00 8.092176365370423952e+00 3.036355646892020310e+00 7.692486580089468173e-01 1.078260476154637271e+00 1.069031152580926847e+00
1.783500643736943232e+02 1.855022561178238902e+02 3.927478427645295938e+02 3.168156405657757659e+02 6.774609461300559587e+02 6.981929387186292502e+01 1.340582229731164077e+01 1.471632706127137169e+01 2.472425713142133077e+02 7.750040275376682075e+01 2.179461017792490338e+02 1.532411833051301073e+02 5.929715719425530551e+01 8.995222302150850169e+01 1.783211812147331443e+01 7.877398004408513543e+01 5.768192681035813507e+01 1.318979092290868493e+02 4.969400811565785716e+02 9.287416603592984643e+01 9.163972453065060364e+00 2.751153242172918567e+00 4.360005856429060245e+00 1.598260528148976345e+00 1.011873437983326962e+00 7.205279546315115358e-01 6.949056125977162157e-01 5.173015115989372248e-01 8.327852514936678885e-01 8.986948477670028135e-01
8.516524623229827284e+01 2.494657763290645676e+02 5.480624474934916179e+02 4.390845967938682861e+02 1.819942069419537916e+02 2.829834324927634981e+01 2.285515332786628306e+01 1.546127338810419971e+01 9.664276467550850569e+00 9.159124153028065507e+01 6.028666879396720901e+01 1.246488786137219051e+02 5.899436493217668698e+01 4.148362646958300104e+01 1.281359472300950486e+01 1.031058623467413682e+01 2.320386777064636163e+01 4.730644129075734128e+01 3.717101059751178127e+01 3.496307775814629792e+01 1.672701904455776756e+01 6.006719909014222480e+00 1.970428981959051029e+00 4.022441232203906480e+00 8.030737485568725242e-01 6.388699261127157580e-01 5.941212425822134380e-01 5.247105011773145478e-01 9.829885332122576536e-01 1.021745952596627705e+00
5.110751730997421305e+01 1.635185422419409633e+02 4.550372137524934715e+02 1.761465677942172761e+02 1.017344673105964716e+02 1.478430023545210403e+01 2.257566017104436895e+01 1.255123644560112339e+01 5.793311257462969266e+00 2.012679431810874462e+02 2.517791336689761295e+02 2.181856697031471128e+02 3.332434701195496984e+01 2.939621282147504289e+01 1.461102503932855967e+01 5.743820218054988658e+00 6.541555092638751034e+01 3.996275330270628956e+01 6.915760656842331855e+01 4.247934702228263149e+01 3.128050416922357613e+01 9.311797839890944672e+00 2.185247663704541665e+01 6.362793169294304718e+00 1.365360883078053256e+00 8.035019550687976242e-01 6.035334071906625075e-01 6.546761480106194631e-01 9.473246203327549964e-01 3.343458426391984872e+00
5.337351978897110172e+01 5.848402203851325254e+01 2.615322845853053764e+02 2.089135415237441009e+02 8.300840788720665842e+01 8.764560668482715755e+00 1.045428838866454768e+01 1.101348582897674788e+01 1.013392988025213270e+01 2.992321021546688939e+02 2.296416622874804716e+02 1.202188000680791049e+02 1.401127052656712735e+01 4.508308585256394885e+00 3.638011085110561815e+00 6.324440640880298226e+00 3.454409951670972134e+01 9.360212890630073446e+00 3.182722148693381214e+01 1.155032385255334475e+02 1.519506857240687339e+02 9.777700641815012261e+01 2.642828421617785040e+01 3.639409950685472239e+00 1.942284453372189024e+00 1.999853031539070347e+00 1.344200015119159097e+00 8.711006148240368896e-01 1.063233663894686654e+00 1.844449813063913091e+00
7.503144999336840648e+00 1.255280498935506728e+01 1.330005466544024628e+01 6.757993731764247514e+01 3.247249540106221843e+01 5.294779870465391980e+01 7.798939248611716835e+01 4.337207875662731738e+01 5.035828542971963628e+01 5.637542928649076401e+01 4.196420674565264619e+01 1.686722985432111699e+01 7.016620620181219792e+00 2.892134103695959801e+00 1.615294414531959433e+00 3.069403828225547581e+00 1.864069477228064642e+01 9.032111894010984798e+00 4.745858197706653669e+01 6.749403387824195022e+01 3.374215485158954664e+01 8.803201890976758648e+00 3.767404941601000701e+00 3.156053044204778502e+00 1.265245211983443197e+00 1.419875143834389508e+00 1.342603324463933490e+00 1.097474634793582648e+00 1.184047315093144537e+00 2.722497207358105520e+00
1.528404509961606905e+01 2.911439930878710669e+01 1.716911184747166175e+01 3.739744932103808139e+01 5.794612123209756760e+01 6.488304544880095648e+01 5.690559538213991431e+01 5.335124134967119858e+01 4.276815028201453117e+01 2.319924500766729736e+01 9.078054625958213109e+00 2.740200790533762643e+01 5.851388549383349513e+00 2.013478385665872228e+00 2.142445186471477747e+00 4.127346374825563657e+00 3.538141341583116173e+01 5.862666363487920052e+01 5.360975797551809308e+01 4.008511763077040513e+01 1.186301282906689636e+01 6.037771964842878702e+00 2.201213246884723862e+00 1.824508025534536948e+00 9.163065086381013691e-01 1.033745593896848725e+00 1.705608980349144987e+00 2.043254949838425372e+00 1.953239429541258065e+00 5.559528715286036871e+00
3.856454273245196873e+01 2.585420988487430094e+01 1.536460351395330370e+01 9.068422428648604239e+01 6.020245367797902247e+01 2.569746589785256674e+01 8.324612018006484959e+01 3.774564304181902941e+01 3.226167664426293413e+01 3.093882148288770040e+01 2.694206060916977563e+01 3.485070162979782538e+01 7.575798665202836446e+01 5.034626201873496143e+01 7.645834631264541770e+00 7.138071676722422154e+00 3.213680451588598430e+01 1.019403808819660213e+02 1.056669197897980723e+02 1.872581245931070271e+01 3.179757151047846619e+00 2.635469100007951315e+00 2.670025216908967103e+00 1.727730790494410140e+00 1.052824907026699952e+00 1.719603903429987923e+00 6.843750089057392572e+00 1.321841021640090119e+01 3.684769142256622132e+01 1.766965860347704620e+01
6.243961075132689587e+01 4.085142212958317032e+01 6.609610360179702582e+01 6.315601794669513680e+01 5.738792706168030122e+01 1.155690878688740497e+01 5.457580916427319551e+01 2.383641935167077719e+01 1.038629722574759562e+01 3.796597372628425227e+00 5.451034602042255273e+01 5.228972841902026403e+01 1.093545742828520559e+02 1.170857836910114429e+02 5.548148257084162083e+01 6.038887619361332781e+01 3.348080088832248293e+02 3.643313237673689855e+02 1.554382612233282259e+02 7.427842674728348982e+01 3.907496692359003987e+00 1.975723539101731596e+00 2.154491311893709682e+00 2.358894844476050690e+00 1.340432426541942945e+00 1.816707092310754668e+00 1.797681981276690166e+01 2.967080199318257172e+01 3.577531275875909955e+01 9.142386370733284195e+00
5.254644057805201385e+01 2.739702047249429029e+01 6.171276636011837979e+01 5.354749736744918209e+01 7.050458765619748647e+01 6.662499731773102063e+00 5.761718337506740895e+00 5.201737072195720124e+00 3.413130612274996700e+00 2.994270736808927680e+01 4.598581045426207083e+02 7.540521158794173289e+02 1.524192861753064562e+03 7.286050259057753919e+02 1.307904074288103402e+02 2.484270783232519761e+02 4.716398983152037090e+02 1.358738876171033496e+02 3.422934203589674951e+01 7.272737212025683462e+00 2.603016598299989326e+00 1.901886776983178873e+00 2.375136665295907612e+00 3.331868237072646011e+00 3.608275672742292883e+00 2.025836149197704827e+00 3.338671065655963943e+00 2.590903501096029959e+00 2.261966137194983517e+00 1.587944315763575531e+00
9.984749806482426493e+00 5.865410836252019422e+00 5.170755862321472307e+01 5.130183750208571780e+01 4.102177608728423053e+01 9.731854136481434381e+00 3.931586085499652050e+00 2.639117028853996239e+00 3.432193099427732985e+00 6.266666384049264593e+01 1.480732459830721837e+02 9.448454049365915353e+02 1.640031604511925252e+03 8.140822483402786247e+02 2.829670454274819349e+02 3.058695217300322042e+02 3.374391196660279775e+02 2.020779301310817289e+02 5.092365716558596489e+01 1.483869890698851890e+01 2.260951534510605931e+00 2.068173973680948130e+00 2.415265084796938133e+00 4.351350059480576959e+00 4.199429214138449495e+00 3.051970466573803886e+00 2.391010083517151052e+00 2.133292561938969101e+00 2.253960700522241289e+00 2.391365928699856092e+00
1.965416276166310094e+00 5.072583989172398944e+00 1.230584865547152518e+01 3.502769129750008403e+01 2.328478508750868414e+01 7.639477135860617274e+00 4.093465673882532130e+00 3.608871739355229202e+00 4.822604582116172267e+00 3.376611727477347102e+01 1.090182331826532547e+01 3.214008131851730354e+02 1.291811258661444754e+03 5.190461504402541095e+02 1.543065908510665167e+02 1.688111629691487394e+02 6.086226532640728237e+01 8.805680403161946401e+01 9.952600337252900431e+01 3.748196657860869152e+01 2.561238639296418818e+00 2.338148762304963046e+00 2.870569917876096167e+00 4.945640145497810281e+00 6.501224098489152503e+00 6.176851525748713101e+00 4.640545141422546926e+00 4.202588719316111998e+00 3.208903896401849920e+00 2.506242438660892802e+00
1.596935707606562449e+00 4.599475436644472559e+00 8.321675603638437835e+00 6.068873291220814536e+00 3.631202001386625966e+00 1.490025097725100878e+01 5.486558086806258672e+01 5.135264227592963948e+01 7.305005437702655868e+00 2.192238710892650211e+00 8.583838414923944171e+00 5.587429620844061162e+01 6.233363487163405807e+02 7.760053366447918961e+02 7.698553738856261361e+02 9.708593321192579424e+02 8.317250766629383634e+02 5.163457390840950438e+02 1.357801877034522477e+03 6.206425583572486175e+02 5.190917586927473337e+01 1.524516605004938441e+01 1.159259094854844818e+01 2.900484776311932222e+01 6.649881963680095964e+01 6.223086816793946241e+01 1.729735358670845358e+02 5.821900950920083062e+01 4.781902875981069556e+00 4.793401172323266124e+00
1.464435141539206731e+00 1.480918730383636195e+00 4.085060341913924198e+00 3.077728196759458257e+01 1.134942140329160765e+01 2.750275969799687914e+00 3.777611443902976873e+01 1.171042542307274203e+02 8.514939996583271409e+01 8.744000104390725170e+00 1.862036094713563728e+01 2.945188314289263189e+02 5.984729180361698582e+02 6.955656761422458203e+02 5.803847784309994040e+02 6.512519412776146055e+02 1.033384702063887971e+03 1.669904179512134988e+03 1.606767929281188572e+03 1.226870314784201128e+03 5.260609526539879255e+01 5.528358167570731041e+01 4.921658253653525605e+01 1.515926188803765342e+02 2.129156502185989552e+02 1.082708085105862665e+03 1.096869554798307945e+03 2.291012740913924404e+02 5.275171210351683904e+00 3.279238261968071999e+00
1.313723328169741800e+00 1.449161222264092608e+00 3.351423987384106074e+00 3.765851705944366135e+00 2.555800713559136739e+00 2.976286673360392321e+00 2.157242896454073389e+01 6.304520627879300321e+01 1.366749317803134431e+02 5.041484614267166364e+01 5.376016426276608229e+01 4.852555786398491477e+01 3.678852161646848913e+02 6.839705988356404305e+02 5.899845142996672394e+02 8.380638812527993196e+02 1.313731470239769806e+03 1.459926998827444095e+03 7.840043987167523483e+02 1.635274456773969973e+02 9.743160462325840854e+01 6.650982621045591259e+02 9.624161227916624739e+02 1.575667136701526488e+03 1.444530390582625841e+03 1.877302187886660249e+03 1.529808792411137119e+03 4.528824190713421558e+02 7.995177087553482664e+00 3.693673427985916469e+00
1.646189110132096456e+00 1.937767671841403638e+00 1.942439790180237935e+00 1.901171525812736185e+00 3.004130734603585928e+00 6.357214228883130147e+00 3.719541480590909259e+02 1.262304595829092023e+03 6.339673133633018551e+02 1.130123011634478871e+02 8.895068770466053820e+01 1.485729034814283409e+02 2.911171109078428572e+02 3.920250887653234031e+02 4.755259288677412997e+02 7.893730062930592339e+02 1.499644449933339047e+03 1.354801681338293292e+03 5.860798393221818969e+02 1.889960970299468954e+02 7.955634639791632026e+02 1.410301398670855178e+03 1.778512474465764399e+03 1.772118758875471030e+03 1.533450001511027949e+03 1.333414685525779987e+03 2.020984244635080131e+03 3.601784053668184242e+02 1.167452903507364326e+01 4.966122279372951809e+00
4.078268271080196961e+00 3.276042282515704507e+00 1.746860197152294569e+00 2.851031591032751500e+00 3.921184192743819352e+01 1.995705475873402293e+02 1.099541350695736810e+03 9.012553121936838352e+02 9.106609471057283827e+02 4.734953492225208720e+02 1.845402908072358628e+02 5.453056017515557841e+01 5.341786186848186446e+01 1.248711293222089580e+02 2.572236755417177392e+02 1.097941771913847788e+03 9.917732731550798917e+02 1.013922011019482852e+03 1.575063988249212059e+02 2.562586773903866515e+02 8.733734988058060935e+02 1.824442117992908152e+03 2.193963702536024812e+03 2.199728948883293924e+03 1.795740568386358518e+03 1.761978211787929922e+03 1.696456202238367041e+03 1.345958221891147332e+03 5.979759033394648782e+01 3.950166320445221402e+01
1.856298715676059086e+00 5.305840305826946768e+00 1.023912625465531967e+01 7.544108193737145029e+01 1.817566709600154979e+02 2.617224757444548118e+02 8.220009466911552636e+02 1.032868787195733375e+03 7.275977494568226120e+02 5.776704419235053365e+02 1.262259441321878910e+02 1.302891248351006226e+01 1.931899491088383058e+01 4.950016351850854335e+01 9.813172865995264260e+01 5.343892106753228290e+02 1.779976035218035406e+02 5.035577669625359221e+01 1.505220745639349644e+01 9.998811367954674267e+01 3.590628361643236985e+02 1.814150202177669144e+03 2.198883208207124881e+03 2.201104810158059081e+03 1.564878149826577783e+03 7.212452990383085307e+02 1.181585744082331757e+03 8.114383453799389372e+02 7.320575768131885752e+01 2.892330130453474268e+01
4.824419073429550764e+01 6.597887148823615178e+01 4.747571345331440540e+01 6.424196151128379029e+01 1.676276408061361849e+02 9.967115432972096301e+01 5.196998536033381697e+02 6.814845129887914936e+02 6.440033606116835472e+02 1.512395062140961954e+02 3.809275287063908877e+01 8.097717596399551354e+00 1.353175898637187302e+01 3.633707864929196774e+01 1.319311472474821585e+02 8.187012319633069524e+01 1.322311471835360805e+02 3.478469724529308849e+01 5.825753690258596151e+01 2.496192051309206477e+02 1.245383931401076097e+03 2.207888052069693003e+03 2.237540052412286059e+03 2.003882880987174303e+03 1.469091596836786721e+03 1.045356042469085423e+03 1.003098791737097372e+03 6.761553651642550449e+02 6.090724411128304894e+01 2.169563012950038683e+01
1.441067851554947197e+02 1.439885769521952170e+02 8.209843626690016549e+01 6.644355138987380371e+01 9.862756410996675527e+01 5.587060882516593097e+01 3.275163102684991259e+02 3.021093795487496436e+02 8.559828897707296846e+01 4.439213232109396046e+01 1.467511588651725774e+01 1.124598912464390921e+01 6.353037623293726455e+00 3.268099131516446487e+00 7.919745816072795819e+00 2.502305017474247961e+01 7.947795175027812320e+01 1.621467779115047279e+02 1.403102974153653690e+02 5.672677488225066327e+02 1.413559470687582689e+03 1.890083174618055637e+03 7.164360694736549249e+02 9.905530619095195561e+02 1.190951829282722883e+03 6.392429765589032513e+02 4.645169465883615203e+02 3.816861130045897426e+02 1.399744186016416769e+01 1.265830030420794827e+01
1.220307747361474640e+02 1.537441278918144008e+02 2.544113076979246912e+01 2.002300136287458088e+01 1.895181289696853355e+01 3.025780410754329353e+01 4.505334526674300122e+01 1.178688838370153569e+01 1.582758057032179266e+01 2.352002651759332430e+00 2.936429487829482987e+00 4.276626143217868048e+00 4.472633816651732097e+00 1.491159635828594965e+01 3.940180585131733437e+01 4.787819870919804544e+02 8.178296463843148558e+02 1.066547467742057734e+03 6.606544324061317184e+02 4.524054717057897506e+02 2.890594522772906885e+02 9.416811311501859905e+01 3.341553545546152293e+01 6.554051956380770605e+01 2.181415444321807513e+02 6.890023591189660124e+01 6.090505212638426258e+01 2.053400313482623929e+01 2.329924273736411866e+00 1.904119461605354946e+00
2.681071567414749097e+02 2.226286089364249960e+02 2.662426439940589518e+01 1.284739059926245908e+01 2.131643585947939101e+01 1.774365671700333635e+01 2.867186855541993040e+01 3.214817784198087836e+00 2.803677136909498824e+00 1.160164750771972786e+00 2.637384888937315708e+00 4.793990126380638372e+00 6.033649138839288106e+00 3.032369097923261592e+01 4.645546930488373505e+01 2.717488366817041197e+02 8.941367969186966320e+02 1.515521334548757295e+03 1.570218040798730726e+03 1.241690705359106460e+03 2.371891562593857543e+02 4.780814203363784998e+01 5.369235721751405777e+01 1.213489141025636968e+02 2.528390931086792079e+02 7.033383592951309993e+01 2.588506798489640914e+01 9.624226139528293089e+00 2.981686625956232461e+00 2.660123434075050142e+00
3.549687521590713004e+02 4.808567314110125324e+01 1.437967468052898568e+01 5.157046975183082083e+00 6.511062098092778250e+00 1.513143812168537750e+01 2.042798343871194078e+01 2.399038483571556579e+00 1.370046555261351884e+00 1.520068462426568123e+00 2.592521151693261583e+00 4.272150299354283476e+00 4.574054950479599313e+00 2.357329925725586506e+01 8.553379365583788285e+01 3.849570833167447859e+02 6.764337450309936912e+02 1.425230894391732136e+03 1.651379812861242954e+03 1.273747896839824080e+03 5.665350703121686138e+02 2.932689510961645851e+01 1.880754548130730797e+01 3.842751940719404047e+01 2.122160673712760115e+02 1.222300088149746955e+02 1.066191114874617085e+02 1.958877212838221027e+01 2.770039735532709102e+00 2.062981416913174826e+00
2.138574291897369903e+02 6.930406223989280079e+01 2.822721819910186269e+01 2.811393966559087332e+01 6.853078820237902846e+01 4.963345559880157509e+01 2.152977231757487431e+01 9.282469828944496015e+00 1.444983277261702170e+01 1.810024608376165034e+01 1.628548865065069684e+00 1.779885172938556970e+00 2.624032815192564705e+00 5.521852907457114767e+00 3.112368932961596002e+01 1.187157009250547901e+02 1.098872420833279904e+02 4.348662597484109824e+02 5.193764499508765766e+02 4.073603945599580811e+02 3.026837803275695933e+02 3.505355244501949841e+01 4.901581861170134502e+00 9.286509767416990968e+00 4.055108888975271952e+01 9.998159809626886840e+01 2.639291340476685264e+02 1.433228011012456022e+02 3.458082100979000373e+00 2.506227971364250351e+00
7.771175335392069883e+01 3.219688220782364851e+01 3.585202392149658124e+01 6.438315881679088193e+01 3.850482241302997721e+01 1.826008507791030411e+01 8.799808376713826874e+00 6.516964551953638995e+00 2.145649488824820494e+01 7.992065705867301517e+01 5.255757897582633120e+00 1.759689586991061150e+00 2.814083544204123655e+00 5.732985087283884340e+00 2.537522385662969882e+01 4.262345972933513849e+01 2.720906468245673793e+01 1.260751083011358631e+01 1.869969688829596066e+01 3.157016080068114405e+01 5.086309592957442760e+01 1.063438559091128077e+01 5.081677997281452086e+00 2.532227109569760160e+01 6.089545556865358833e+01 2.133008847007929987e+01 7.219202761480357822e+01 7.771587857022035450e+01 2.672701464101343305e+01 3.943817181808543459e+00
7.883175026635566951e+01 6.607341105159645167e+01 3.356847357820215194e+01 2.624038352737494151e+01 2.675223314010014519e+01 1.062108407398714860e+01 7.352974420388273202e+00 7.940868915223890490e+00 9.110615612612379621e+00 3.497920527236995980e+01 9.534101590268035054e+00 8.784584519430566729e+00 7.838169994134431384e+00 9.075047842095754547e+00 2.457861992420169273e+01 1.622625554394527825e+01 1.058563817961183773e+01 6.144006093603209706e+00 5.262729188362586186e+00 3.897770435980789649e+00 2.956677632907237729e+00 4.132437969379672893e+00 6.312651031949839897e+00 1.537647944464663752e+01 2.644716093994223627e+01 1.245110396106234063e+01 1.945284304201829073e+01 1.244783996859124642e+01 1.216592593012282819e+01 7.615292045442029867e+00
1.068580685701234643e+02 5.819038868974914180e+01 3.452136599918740956e+01 5.036429842895191200e+01 4.847532610882225867e+01 2.781855128348741957e+01 9.958621332203996701e+01 7.963171899179884861e+01 1.225769757439454466e+01 8.551496696577052248e+00 2.943673387194510660e+00 6.549978475221886143e+00 1.837917167608160085e+01 1.899997140106755822e+01 5.534801121384326450e+01 3.946608328608351712e+01 1.208022269595133835e+01 1.394689260957820132e+01 6.288362543938022853e+00 2.670488481590401530e+00 2.365147470362106930e+00 3.522338510042260395e+00 5.348277025462726542e+00 1.623932864978143797e+01 1.627211934612184407e+01 3.814527552543838240e+00 4.162435039141936244e+00 5.215687195277626920e+00 1.659876382920549531e+01 3.362447558113617063e+00
1.434608996268887324e+02 1.296734693150829116e+02 4.106340825443277964e+01 1.500884700016324018e+02 1.905401304555884963e+02 3.790700894675763948e+02 2.675364305764302912e+02 3.212334062369986043e+01 1.206213119789058297e+01 6.705833862873520346e+00 1.912429459757245986e+00 2.316510803721673284e+00 2.747221515413373893e+00 1.038230274698249822e+01 1.238445914923733326e+01 5.353365307371490189e+00 5.078514535357728121e+00 6.002148828313275786e+00 8.010517889493042887e+00 4.236579957078237868e+00 2.289593683762101151e+00 3.096282067681430217e+00 3.462971158511154890e+00 5.676295845090264081e+00 1.735127184311917148e+01 2.666650189381044811e+00 3.780537265704468908e+00 6.149350985647461521e+00 7.343881209790202647e+00 1.450778372286598383e+01
7.866732200005171194e+01 2.050819949423964204e+02 6.438422544268959768e+01 7.385047689154875172e+01 3.884402774556033933e+02 4.307692833649349495e+02 3.005572646971378958e+02 2.173035757440045757e+01 1.583550760964025983e+01 1.436717445745798472e+01 5.685891518701517100e+00 2.725081033366759442e+00 1.670532023828152912e+00 2.793396056823335805e+00 1.286761433593898474e+01 3.626236928557257322e+00 1.236614116230280302e+01 7.163338019170453208e+01 1.217404790973191950e+02 1.626762390251141355e+01 3.153049269728143589e+00 3.981947927406785492e+00 3.380346973448897341e+00 3.654843811452555880e+00 4.766811394878527786e+00 3.586905886355942208e+00 4.148650365842974530e+00 5.080242591188797618e+00 6.806005712218982318e+00 1.662562225258526638e+01
