4.854372245778979522e-01 6.952307686106964368e-01 5.816642709595210015e-01 7.176854655713490461e-01 4.984512047960936165e-01 5.933701907620313187e-02 4.304239316536701693e-02 1.162327116282515366e-01 2.110617714371029741e-01 9.429023570641836827e-02 5.968801481660104824e-02 2.796685691457669876e-01 1.833201099669526379e-01 6.736918067575214941e-01 6.542438603455065504e-02 1.912737230364191243e-01 8.065300878194945344e-01 4.536224285649444882e-02 3.439637913685905657e-02 6.302927307692844927e-01 5.841973189646663123e-01 8.855980802883549330e-02 6.784425054278662992e-02 2.745534003153267677e-01 5.262453731265740453e-01 3.910419127264718187e-01 1.680950400829844538e-01 1.483480029586257791e-02 1.448925993902704622e-02 1.891824049833609050e-02
3.193002577967792299e-01 6.650824606995604515e-01 1.518685558561824189e-01 9.528767247343311597e-02 5.936834156091350678e-01 1.813843601245055948e-01 7.291854726068904002e-02 9.093526817130108408e-02 5.458907254631518297e-02 4.325242833631816330e-02 4.026520083074550810e-02 1.440083502212277100e-01 2.149550910023040329e-01 5.169421824563550372e-01 6.447498312141899945e-02 5.245945375086057405e-01 3.320650333885070971e-02 8.237259377111606773e-02 5.265562536381337283e-02 2.160333317335276157e-02 3.356737100752759662e-01 8.489216330292082002e-02 1.761617697011126082e-01 1.612700893900967658e-01 1.415897078512654561e-01 1.783504504542322566e-01 5.976288459519635277e-02 1.545548787326345153e-02 2.245178809035847448e-02 2.297616972280791536e-02
2.061428794793912778e-01 1.994469808474447214e-01 3.762389877840339736e-01 2.838338178233078546e-01 6.555443032784068480e-01 1.033310692422767102e-01 2.514633331289796159e-01 2.638802455640569256e-01 2.464212435451042515e-01 5.963958204425233445e-02 1.590213970551769551e-01 1.151917558062841018e-01 5.343642348355361060e-02 9.484300185971671071e-02 3.191214036432726830e-01 7.987836233314674073e-02 4.348831992097726418e-02 6.434314868443642699e-02 2.030098010639441730e-01 4.420767324640176299e-02 2.108476513288304321e-01 7.017954194223943731e-02 1.068892333721628701e-01 3.860442378296370658e-02 2.277777708009906185e-02 1.402520330769673786e-02 1.263331286140957285e-02 9.970000220167843721e-03 1.709255476119749331e-02 1.926027889806222401e-02
7.137031026095569386e-02 2.001853764788529833e-01 4.386177524801598837e-01 3.558787932293778211e-01 1.776744825670898975e-01 5.101461023466342670e-01 5.066348977997049419e-01 3.144354951224226369e-01 1.704423137606472793e-01 7.532998766106488442e-02 4.516401404932075814e-02 1.036116211604654475e-01 7.043620113972198782e-02 7.193120231427499456e-02 2.526644678673075628e-01 2.195765478475873722e-01 4.714005387252656609e-01 2.575451529624850702e-02 1.722578851003021133e-02 7.031193710201749658e-01 3.866616633863785846e-01 1.534059404572306051e-01 5.148914274177358169e-02 1.028299468635485020e-01 1.831553016244067203e-02 1.229139732937312157e-02 1.044407435186279695e-02 9.908936388841627432e-03 2.012166248539762684e-02 2.184827748859217988e-02
4.108965022155221941e-02 1.250597790671958420e-01 3.494743708427187068e-01 1.358008832739826532e-01 1.025026577150532220e-01 2.980005801790730491e-01 5.186737938809867776e-01 2.914671525700656685e-01 1.070883464350568387e-01 1.774489442440799480e-01 2.005353186316742586e-01 2.178320839951770060e-01 6.013339887109943049e-01 6.294709041186292708e-01 3.341921872818049977e-01 1.396882430521905749e-01 9.850880000381853629e-02 4.969082062862370530e-02 4.931151646072683831e-02 3.114121209025196013e-02 6.332491472057334425e-01 1.996951023389366420e-01 5.064492777982662064e-01 1.652270749207751799e-01 3.210990379644652892e-02 1.622570065494332789e-02 1.087864328756019475e-02 1.256769228118225640e-02 1.964472039040652401e-02 7.213813394435127091e-02
5.777004403406052480e-02 6.052392909105594465e-02 2.306219115679548348e-01 1.886005700777845795e-01 8.507699079777551743e-02 1.690814604919090858e-01 2.135351631918678272e-01 2.269154921532245406e-01 1.835966394663485768e-01 2.615234875874028475e-01 2.163459525684088003e-01 1.567131766102724533e-01 2.822392005530606762e-01 1.071953875204093021e-01 9.064610040948142822e-02 1.590117625939126977e-01 8.575629843525874874e-01 2.171369572527671599e-01 6.768685215806400368e-01 9.141790999869436884e-02 1.056694973899425655e-01 9.095336462665515320e-02 5.991455694027576495e-01 9.209856677025074490e-02 4.640608341178609209e-02 4.211330534054796154e-02 2.568558921450419044e-02 1.769602878156833342e-02 2.335616975749068083e-02 4.190252321163138310e-02
1.725758774886987645e-01 2.591697267793565129e-01 2.556557808433270185e-01 9.346275298406442333e-02 5.694572045685890593e-01 5.614241102161796060e-02 8.703740493849623783e-02 4.884938308475833546e-02 6.387401531842225311e-02 7.249720946718463122e-02 7.378810309659028510e-02 3.411621535092534407e-01 1.582288031281462726e-01 7.381836784930839723e-02 4.341219523183760531e-02 7.954705839713167859e-02 4.554342440114153567e-01 2.062963573409475615e-01 4.005485743062456305e-02 5.937132104618062650e-02 6.651892575989927225e-01 1.843804458874317709e-01 8.310456797000881357e-02 7.880139565443719518e-02 3.056354496061381223e-02 3.141226484486507597e-02 2.799143263460227016e-02 2.428324925430271411e-02 2.815964283896777928e-02 6.632503701111054639e-02
3.583246680904734749e-01 6.775366668867986997e-01 3.679846069436359390e-01 7.268830012806761776e-01 7.524296088184541376e-02 6.677977355473688204e-02 6.865818012868828146e-02 8.509004029253536272e-02 1.037643857881932058e-01 5.035794928142185434e-01 2.085189134558531054e-01 6.313795536034891853e-01 1.358050685483161435e-01 4.795336557574681607e-02 5.514838363934131821e-02 1.073427373057723733e-01 8.264500585027128032e-01 8.962292971394254792e-02 4.258990825275431324e-02 3.754923101399822855e-02 2.746460017582850743e-01 1.587356753270333376e-01 6.201447414796543156e-02 5.151101408748903765e-02 2.460930472580680206e-02 2.597689983696318400e-02 4.229290411374515835e-02 5.360928371340117210e-02 5.169489314462381163e-02 1.454112015243159695e-01
7.740847131047527974e-01 5.108597151391234270e-01 2.980017547156684765e-01 1.337181283885029992e-01 7.645755278599959681e-02 4.466536646125334742e-01 1.351544245785067933e-01 7.339861401398279916e-01 7.054559442975355532e-01 7.130881194650259269e-01 6.443169707819002001e-01 8.017680858329037097e-01 1.293433331458743174e-01 5.293557856795341743e-02 1.749700262498323222e-01 1.548310281146611789e-01 6.243345483676988605e-01 1.144444381449442188e-01 7.863931554730205220e-02 3.694538363437733230e-01 7.289406619094299100e-02 7.514035195453716565e-02 8.072111839865767080e-02 5.256837199231279012e-02 3.089374560523782537e-02 4.749357097287319057e-02 1.892231713188925191e-01 3.699402959709833794e-01 1.014942588067077045e+00 4.735761473553835588e-01
1.555361465172115654e-01 1.020039480737937043e-01 1.021935712263596086e-01 5.973834800142521773e-02 6.034441264097563373e-02 2.057542260891254693e-01 1.092643707523998781e-01 4.874129731801141729e-01 2.370617232483788750e-01 8.506435685075675046e-02 1.156444129634230933e-01 7.444841339939271829e-02 1.124851716313461092e-01 9.542367775769007576e-02 4.747477351515515254e-02 5.672034863390494619e-02 2.871739961128317309e-01 3.111180300784280317e-01 1.330503015621570528e-01 7.334809359941832363e-02 9.193508146686223126e-02 5.801247653006005173e-02 6.643054740093891353e-02 7.307358345171238723e-02 4.093584517072159507e-02 5.269810612877523504e-02 5.110482688803539286e-01 8.530871080470999734e-01 1.009771031834660215e+00 2.484085750491699940e-01
8.418593534623243502e-02 5.139444812870765933e-01 7.029964167048152746e-02 4.383148275084147727e-02 7.760425952783617243e-02 1.232769076705090283e-01 1.216065327642280591e-01 1.115759219620384435e-01 7.715878348999012648e-02 6.116869232941110068e-01 3.581660842003709933e-01 5.273584451966917275e-01 1.092006667180585255e+00 5.369573205643526359e-01 9.864479405470109874e-02 1.939300018661481995e-01 3.632230110882553875e-01 1.090952035797000119e-01 6.086796707897654812e-01 1.483033507997707778e-01 6.228058511584241147e-02 5.575570824441308804e-02 7.223072488221149445e-02 1.013431209942277089e-01 1.085803522635771512e-01 5.933621453724677308e-02 9.606863336122060948e-02 7.576734246809091466e-02 6.561455793229813149e-02 4.442046595081833305e-02
2.310017266839038963e-01 1.259342020132905304e-01 1.352107706950483323e-01 1.269182930574542234e-01 1.024309224013638803e-01 1.976923220882676746e-01 9.154013384349958538e-02 6.327815700129432730e-02 7.726863697635480421e-02 6.979106816292324211e-02 1.385116310320071431e-01 6.373539730347945742e-01 1.134759805037595104e+00 5.862690651677724407e-01 2.103720150804726796e-01 2.371095725317454717e-01 2.623721494458299830e-01 1.686726445598654700e-01 5.467098669524799587e-02 3.404966329784706591e-01 5.990973918928290537e-02 6.088768337524309848e-02 7.213617060557865612e-02 1.292563005147456534e-01 1.229987662689989159e-01 8.779349414818712893e-02 6.780440979618564123e-02 6.236491474363706211e-02 6.710620784214818557e-02 6.986639601020760981e-02
5.478918705761019747e-02 1.319399126930748678e-01 2.971836710097642831e-01 7.867881123697069157e-01 5.227449129028296504e-01 1.729453489512147168e-01 9.502706896848792106e-02 8.226764679767489818e-02 1.078226272139952702e-01 7.189503231443405973e-01 2.010694867659008067e-01 2.075531932361188159e-01 8.454500973209528869e-01 3.617371181993991880e-01 1.133938149898782999e-01 1.310085495246063880e-01 4.839632545050071011e-02 7.104752834927138827e-02 9.926106144464885706e-02 7.210130024699061835e-01 5.745525529196202075e-02 6.286975835045585659e-02 7.970807188520605269e-02 1.325720568734000959e-01 1.680979553430009266e-01 1.469938138941980499e-01 1.088641904386659226e-01 1.047973873931623279e-01 9.203045523642773562e-02 7.440892346918996647e-02
4.734228574926984540e-02 1.344409868824535947e-01 2.386619246348065104e-01 1.714011755018944871e-01 1.022396929108374541e-01 3.957789835430630121e-01 1.096529098931090518e-01 5.950978099013668615e-02 1.591428434616088960e-01 4.900672167993826156e-02 1.689677322669737303e-01 3.646303691144982262e-02 3.861281402734654811e-01 5.216080986390898566e-01 5.547891884964430975e-01 7.475315075937289944e-01 6.729827789138198568e-01 4.377384718836643263e-01 1.251540144105382613e+00 5.878575615698494738e-01 6.210267781145165089e-02 3.742960469547498281e-01 2.819819000841695678e-01 6.714976134894909965e-01 9.002847883112231886e-02 6.630701811834573134e-02 1.705925207970141189e-01 6.782905539505593162e-02 1.269539108726008558e-01 1.444218593213927593e-01
4.207207423299606786e-02 4.233635117374186935e-02 1.166249194487809782e-01 8.883823601011727744e-01 3.332349337366861119e-01 7.514764281484523356e-02 8.763957958654058356e-01 1.145512216509969178e-01 5.883853644069839128e-02 1.823950638293192206e-01 3.621048228934853341e-01 1.795403903625088227e-01 3.464686789462374517e-01 4.393627180882198058e-01 3.962807719256319361e-01 4.781260295278808581e-01 8.173170346918963158e-01 1.416948794059313510e+00 1.446198671919192824e+00 1.136376760727865420e+00 5.776042403850109586e-02 6.751132882380303513e-02 6.731048361796981849e-02 1.841207694088268787e-01 2.406345142698745054e-01 1.067995676844489150e+00 1.075701616306901975e+00 2.439005051119250145e-01 1.310681765710456914e-01 9.890549612866056384e-02
3.703642648785893804e-02 4.039490156288554068e-02 9.207259480993487677e-02 1.059985099191279451e-01 7.423093354874268912e-02 7.933834336585393610e-02 4.423971234219696846e-01 5.668835469149656470e-02 8.774804357142111655e-02 3.205055385758593528e-02 3.217255257343197561e-02 2.697160878727223460e-02 1.968652463356137527e-01 3.978949552285420133e-01 3.703132584322551546e-01 5.664656988233532919e-01 9.839996972833737754e-01 1.200179870112271674e+00 6.956334279795834963e-01 1.518400462062471368e-01 9.139544623647073707e-02 6.299162585108218915e-01 9.230449956673654199e-01 1.571543654135851842e+00 1.504530290472588128e+00 1.991362428840204313e+00 1.605519635584297333e+00 4.871605365713369551e-01 1.895857557737212762e-01 1.097120272276559255e-01
4.820434485141304737e-02 5.514283026059719345e-02 5.351993951899675778e-02 5.182805398591146251e-02 7.866123233667929315e-02 1.349634529344150291e-01 2.535041589545039553e-01 8.120700206922297770e-01 3.804441461415372094e-01 6.079194250833248880e-02 4.356993306338947936e-02 6.964886309351010774e-02 1.407845227986080916e-01 2.072147821928029265e-01 2.734268213409413173e-01 4.898445891368330418e-01 1.060528116025306833e+00 1.070806369381630763e+00 5.084874518971516100e-01 1.750747891365706244e-01 7.589605084268857826e-01 1.384810723825249390e+00 1.786489191468643378e+00 1.875569676929183416e+00 1.687905196164415145e+00 1.473828947850349902e+00 2.173521876959819465e+00 3.897762057006493586e-01 2.574253702423709989e-01 1.380160430765229873e-01
1.250619704368105267e-01 9.686061956198607770e-02 4.561452238034960360e-02 6.462420335421185935e-02 2.903625661792770887e-02 1.201220432763898949e-01 6.415157444477550541e-01 5.204887934419029083e-01 5.084984196888175934e-01 2.389234294505520606e-01 9.037028454680157141e-02 2.884226100595997655e-02 2.866071095776553251e-02 6.845472957709743123e-02 1.350392743464952638e-01 6.196516871357158340e-01 6.537081180482526843e-01 7.794747169934237441e-01 1.361964323819730982e-01 2.411498823725554685e-01 8.424165985637901422e-01 1.831655280907492189e+00 2.268133485113140946e+00 2.418009428354809476e+00 2.034690236074200964e+00 1.960131406480769556e+00 1.789698249120442952e+00 1.433754878579716729e+00 1.522621598959544298e-01 1.062775688942628971e+00
4.989026312176092492e-02 1.345557922731868694e-01 2.280666654191962350e-01 4.683752240478672446e-02 8.779549408459036419e-02 1.219026343379961130e-01 3.845116682505785866e-01 4.808292106906025820e-01 3.282376428256322254e-01 2.731147981156964999e-01 6.670795636306589560e-02 2.518907084972453192e-01 3.904960826718527622e-01 4.012415281562191349e-02 6.427598023402400496e-02 3.009532935299144008e-01 1.270656482936218246e-01 4.155251559301159636e-02 2.999588622844593377e-01 9.164440660922157367e-02 3.424591606852045444e-01 1.827520880591703811e+00 2.315183113593392239e+00 2.447905196168433939e+00 1.792566089607676716e+00 8.250357601993503209e-01 1.320050869831707274e+00 8.992438872952980278e-01 2.124850245918107894e-01 7.731013373418683665e-01
3.363739582377008736e-02 4.666492143515634655e-02 2.952034937202644219e-02 3.254019919047185933e-02 6.703438301664280119e-02 3.845815792154856638e-02 1.969890722338037414e-01 2.536171573204131224e-01 2.326592132100424593e-01 6.806002869927627041e-02 6.776712523054664317e-01 1.768332961058128872e-01 3.093090403566025604e-01 7.590392606713762813e-01 9.190774303905424603e-02 4.678879788523671035e-02 9.329637441695465272e-02 7.350028137799196060e-01 5.074061228755612218e-02 2.160211058552839458e-01 1.139806006778665282e+00 2.153130084627499219e+00 2.305343490784940386e+00 2.187662380582666710e+00 1.673728600913300779e+00 1.217090040056343581e+00 1.169478164097559336e+00 8.192925397606182214e-01 1.716878382055943009e-01 5.959936387648950840e-01
8.078251367002985128e-02 7.886661430418824559e-02 4.596958190935925698e-02 3.721924485154627649e-02 4.945290117009767256e-02 2.300743642065036787e-02 1.179378945679039614e-01 9.954095798116492644e-02 2.778888797562644938e-02 1.974830429757842148e-02 3.023529067261895298e-01 2.709778820751927442e-01 1.530731617740981876e-01 7.101134693547575538e-02 1.520491900157612819e-01 4.381772460321440854e-01 5.153343754004394844e-02 1.132241117032165845e-01 1.081242799488531664e-01 4.354034205678367075e-01 1.182761795502638380e+00 1.736822750653773895e+00 7.008482197843680650e-01 1.049200046777448270e+00 1.326937130320505975e+00 7.508643393998793991e-01 6.014144516021944220e-01 5.278046629405335199e-01 3.352015417613014026e-01 3.644520772031444311e-01
6.394439527133202739e-02 8.757140866854526418e-02 4.711369726705910144e-01 4.123083390764789025e-01 3.899655484065409627e-01 5.642307567972126847e-01 2.181287926769417268e-02 1.968576053523409808e-01 2.725284155361065164e-01 4.727872467829013353e-02 7.019963864057474079e-02 1.130090802548996687e-01 1.082718650643133274e-01 3.384923366210817464e-01 3.094486468168212295e-02 2.413348985005506764e-01 4.501205025022393946e-01 6.321217534346733613e-01 4.325458132159484270e-01 3.241726878146117818e-01 2.269044072039100024e-01 8.221025224207161031e-02 6.184268932755100368e-01 6.871241584170510730e-02 2.443423465747310841e-01 9.760140202887748750e-02 1.091120136398226470e-01 4.892225986269360671e-01 6.328919005432914746e-02 5.903104032690170699e-02
1.249469598284557725e-01 1.231311472288769138e-01 5.181458415711628351e-01 3.224840455577240306e-01 5.615570226240278462e-01 4.335821734945651817e-01 6.686243316033775308e-01 7.260656484323496640e-02 6.545431793052837455e-02 2.836791943824619466e-02 7.043016190208828409e-02 1.301513946686813916e-01 1.422670550370860876e-01 6.585577477859270168e-01 4.049159020029613476e-02 1.333216390440470356e-01 4.914570716262172123e-01 9.223928448330128704e-01 1.051192323334768863e+00 9.094907679129855538e-01 2.050504863689806834e-01 5.611256196275452024e-02 8.029481243988280392e-02 1.788171088772386730e-01 3.404470216358336798e-01 1.011313596187138064e-01 5.769509296450074931e-01 2.360185972044238356e-01 8.829728534644588900e-02 8.465475996178523088e-02
1.527303181898829465e-01 2.706515235315325868e-02 2.835363025202393139e-01 1.351111493103898664e-01 1.783592426559978406e-01 4.025857633440995675e-01 5.330072175405753399e-01 6.100154969962288953e-02 3.247787874722638662e-02 3.696295813416988069e-02 6.707716601385560473e-02 1.143020461691712508e-01 1.066288536981776225e-01 5.119712004937517769e-01 7.491729439230859766e-02 2.143440835855912607e-01 3.687230037513939407e-01 8.543707443140313718e-01 1.083273557111741781e+00 9.189379381811485503e-01 5.473667411863889498e-01 6.465378578614459082e-01 4.426778450628570116e-01 7.944458934512457216e-01 3.667674412767795156e-01 2.038186014240459809e-01 1.830002650717959534e-01 4.034481068567564166e-01 7.061076585769082703e-02 6.373882011580409013e-02
1.022380770221144458e-01 4.438666359579433729e-02 5.942150890792987639e-01 7.340935594040216561e-01 4.345942562607067045e-02 3.071174859160056766e-02 5.458440289196604400e-01 2.298346994961827094e-01 3.320683199239671257e-01 4.222656060004772449e-01 3.942245874483396584e-02 4.722258908424348256e-02 6.223479770086567942e-02 1.212355040207040019e-01 6.094757555500254220e-01 9.660681489684855294e-02 6.876490299868165401e-02 3.012262939414305785e-01 3.711145561597200548e-01 3.089990843934438125e-01 3.296424484748489148e-01 7.954709955701040336e-01 1.261468156333209190e-01 2.062330752603822592e-01 8.359226784485548345e-01 1.658653089594445962e-01 3.773458127394254680e-01 3.070741604695983451e-01 7.990247868275544840e-02 6.970536943615331105e-02
3.769169126631412986e-02 6.641980315698633452e-01 7.676761665495025477e-01 5.864682070966133198e-02 9.942578806159622085e-01 4.612847313139369909e-01 2.200463449103006175e-01 1.598294842184893039e-01 4.966593980561944122e-01 3.861344668699888405e-02 1.294918651632273598e-01 4.783477918387624150e-02 7.089737345387732426e-02 1.319537614824450311e-01 5.498168740212415750e-01 6.861925255075318475e-02 5.708030139615409837e-01 2.644264981072726450e-01 3.816336675647048482e-01 6.407936749306696322e-01 7.753081491696439675e-02 2.615646731328363783e-01 1.342556142799183339e-01 6.238293964175174455e-01 3.444256704700252580e-01 4.382868588524724274e-01 2.107537352678318099e-01 3.201082151921972874e-01 6.396485042975781354e-01 1.088331424532007485e-01
3.886004833590600560e-02 4.417437555018761258e-02 7.379921774848896554e-01 6.941385757739352291e-01 6.974521491685260477e-01 2.726954609963948561e-01 1.810832073507864792e-01 1.879853917369107286e-01 2.080141461854865814e-01 8.205976958878977712e-01 2.398405374724296990e-01 2.397641538303516284e-01 1.932635417371036390e-01 1.977445821790633218e-01 5.295058258846425669e-01 3.600204547640027397e-01 2.494931956439427334e-01 1.494826998353860348e-01 1.291062140439117600e-01 9.633302488431882971e-02 7.692958666637816911e-02 1.121700951410791736e-01 1.712060967973549341e-01 3.986024727265864431e-01 6.789069212904353945e-01 3.047578955074425333e-01 4.664717655657061313e-01 3.238517598406705500e-01 3.345975102455843730e-01 2.204543464309732248e-01
4.604667574189537371e-02 3.228361261326483794e-02 7.404675868903789482e-01 3.319369799530156456e-02 2.326940066450445752e-02 6.593334779818427194e-01 3.648863590001447110e-02 2.855114665757178122e-02 2.864972466624535197e-01 2.066885451981061439e-01 7.722489862844417186e-02 1.788705401113611093e-01 4.503791036016295823e-01 4.173658255030908149e-01 1.455251894412631919e-01 8.879943472533111670e-01 2.827884971114490442e-01 3.233895210271519050e-01 1.458967837927256650e-01 6.445526202121329429e-02 6.251303134435184927e-02 9.753058782359896872e-02 1.479682698387528861e-01 4.502707967434822489e-01 4.526750017778679025e-01 1.067107551331504256e-01 1.183170274924026794e-01 1.525663291502430685e-01 4.974422211543663153e-01 1.016366057618722507e-01
6.085279717109061404e-02 6.219824141156783670e-02 8.504023831964534486e-01 7.142896532379403030e-02 7.040982006642000635e-02 1.309183606628573360e-01 9.324562378956686992e-02 7.277298852218632152e-01 2.852172784679789519e-01 1.648977126161298434e-01 4.987582647344387943e-02 6.369359536330146399e-02 6.838758416256565664e-02 2.354841540396040989e-01 2.812408990974982204e-01 1.191267025129698343e-01 9.893431071879821292e-02 1.033126854012411389e-01 1.390122237193890942e-01 8.038329517629327903e-02 5.705297660817275351e-02 8.499400711042572054e-02 9.677054976596033420e-02 1.609052839784144706e-01 4.989316331616370226e-01 7.833751540465883068e-02 1.135474936737031204e-01 1.862873968996943130e-01 2.251595176774461582e-01 4.463930084882740679e-01
3.040024397163540795e-02 8.301064864511104036e-02 2.663036831392059933e-02 3.162367153414332582e-02 1.378153980033798298e-01 1.433591207567788406e-01 1.014599333619139315e-01 5.014944963894814034e-01 3.873354561562766252e-01 3.673537738945209519e-01 1.521758554069441716e-01 7.699312277686826134e-02 4.594581460899584829e-02 7.187450325655281302e-02 3.260538944007828066e-01 8.518279576870382841e-02 2.280966987674707402e-01 8.731126916274813132e-02 1.621411742913722032e-01 3.085731888268334333e-01 7.966217451856602572e-02 1.115022738347039299e-01 9.709961455793962581e-02 1.064282962051673054e-01 1.406243544136367707e-01 1.075045614082831419e-01 1.265039415160543745e-01 1.560498104040438649e-01 2.106575501319783994e-01 5.167528508581622493e-01
