3.268278926792680394e-01 4.727660643880759461e-01 4.002793541481071138e-01 4.960721463424982436e-01 3.477213693740381917e-01 7.246421415350827733e-01 6.607582829442542049e-01 7.081944386506651076e-03 8.964951853098198503e-03 1.613047300918542953e-02 8.012584714594140900e-01 2.082947213627846794e-01 1.360924875502666220e-01 5.322486727967445930e-01 6.523954898568292693e-01 1.533490581656104523e-01 5.760406677757774485e-01 3.517648044088416900e-03 1.274895702758626964e-03 4.209895399180275666e-01 3.948205579025733103e-01 5.911864255267718082e-02 4.531289303495972948e-02 1.807495459751890521e-01 3.501690264031026567e-01 2.756962758152732285e-01 1.277144424731861683e-01 1.125683178740966711e-02 1.075543828205839138e-02 1.353510510384235005e-02
2.144177158134819572e-01 4.586015937897073291e-01 8.081317279952398014e-01 6.091803838398590631e-01 4.233213557354119638e-01 2.502737019036092164e-02 9.889086177608747211e-03 6.342469211505616725e-03 6.837143553374436244e-01 6.181108762599282214e-01 4.934846391955902689e-01 1.075291129319293909e-01 1.602180444416200500e-01 4.088913835744641956e-01 5.919263221257463625e-01 4.212331545961772727e-01 5.348189539332887099e-01 9.345056018253659891e-03 1.774987637263600402e-03 5.026092490560893911e-01 2.261808925842459517e-01 5.675298606114263789e-02 1.177737388266733576e-01 1.051201635334264306e-01 9.324354973728564422e-02 1.260645282571701276e-01 4.487004418105573073e-02 1.141618373363708500e-02 1.625062927826308179e-02 1.624882281217642985e-02
8.367268042519734883e-03 1.328104086561682044e-02 2.643024257426518364e-02 1.789319158103556962e-02 4.202469315686397505e-02 8.506681144602719069e-01 1.799419768456157753e-01 1.879977219663813148e-01 1.722941285636101633e-02 4.883610537074568880e-03 1.083029442647544596e-02 1.672464495464857231e-02 7.267599946990036530e-01 2.506078338175845438e-02 2.433450726443328604e-01 1.747420422606370954e-02 8.332400424001454864e-01 1.100781858712514619e-02 1.606217833899081099e-02 3.210049373241405206e-03 1.425220508751118831e-01 4.702659506947474977e-02 7.154683038708771481e-02 2.485244704711648753e-02 1.480888063098997551e-02 9.875854732822505685e-03 8.970956475235575267e-03 7.046738239538126621e-03 1.201497015923333814e-02 1.346588433783404634e-02
3.445281370518629357e-03 8.816522245941989244e-03 2.360252503824863523e-03 1.904163197070928753e-03 9.355649372395849137e-03 3.651511471030290945e-01 3.628716098361294828e-01 2.241289022411772358e-01 1.212438664311267789e-01 1.902834761439064310e-03 6.213917429295613415e-01 1.148241657741411355e-02 7.158123665564922744e-01 5.766381337197337142e-01 1.808251240978039631e-01 1.662695445680993922e-01 3.771649320089036084e-01 7.433317613062081497e-01 5.250156310316428376e-01 4.697823801050209358e-01 2.591611108313667255e-01 1.002734302547170914e-01 3.361538871166232928e-02 6.625971439630319593e-02 1.216981825443493211e-02 8.768504950508987372e-03 7.621723815548129416e-03 7.220418915175563085e-03 1.463085903694380345e-02 1.586813383182179155e-02
6.870829415773900273e-01 2.217446831048203865e-02 1.246655997786166349e-02 7.201998206239033917e-04 4.399170541575758188e-03 2.118759766594409677e-01 3.709011531097996528e-01 2.094124167996035402e-01 7.703886348929187000e-02 6.065355294117493086e-03 3.270783927093976005e-03 1.680081836848995244e-02 4.337731931465896862e-01 4.490483502449180153e-01 2.363429766196236681e-01 1.036713327634694176e-01 1.220863023836382899e+00 7.143166873387438720e-01 1.044774627875033265e-02 5.925622066026918766e-01 4.181949562279517196e-01 1.301548168288624296e-01 3.314683529179325294e-01 1.095323103844450807e-01 2.211659201815645986e-02 1.177775371054060050e-02 8.238623530545590573e-03 9.499223017765966864e-03 1.480713834125662806e-02 5.427639833216491017e-02
8.001320979361451480e-01 7.564776416279308524e-01 3.579553550681420504e-02 2.578964740293244670e-02 1.977485720086280541e-02 1.259697230376464472e-01 1.621576065016053503e-01 1.723226522585240006e-01 1.448830096443007864e-01 4.677900156630086098e-02 2.065949301446756009e-02 1.245606933349177776e-02 1.950122431105943133e-01 7.411035820788655637e-02 6.308960743104374824e-02 1.190463803089992501e-01 6.628750346363514456e-01 1.701617974966607716e-01 5.159962708521798058e-01 1.884246551500530845e-02 1.435300703453704606e-02 7.485499265099308450e-03 4.106517736575415745e-01 6.425960087253412834e-02 3.319579127052645073e-02 3.097144856822371672e-02 1.939473509722517211e-02 1.332698193933729014e-02 1.752722128784224911e-02 3.137422099405975939e-02
1.357392435874643921e-01 2.083795429043260594e-01 2.051863025555563935e-01 9.684367931074771008e-01 4.830555467124351132e-01 7.911146711559385869e-01 4.959731709109777009e-02 6.733894146088386101e-01 7.702790426612303731e-01 8.035909539907324373e-01 5.641696520312323715e-01 2.374773976315340540e-01 1.084886171892723433e-01 5.074235615313117675e-02 3.034760896477866482e-02 5.833137376515798445e-02 3.423059097508127646e-01 1.589806491462997518e-01 7.759153420816560232e-01 1.053477171726270756e+00 5.037897621315891028e-01 1.336850776736725754e-01 6.110447660525721719e-02 5.832542704212202722e-02 2.258993445846172246e-02 2.319765536547163318e-02 2.064626578963303649e-02 1.787264144325025061e-02 2.066082968526216507e-02 4.854888531088670522e-02
2.974641983723578798e-01 5.552946880694256127e-01 2.975728425720448045e-01 6.084260160750922797e-01 9.122018220289928037e-01 9.843358207527113102e-01 8.455615934715886572e-01 8.069851107950201108e-01 7.074212975009985804e-01 3.856490025757778328e-01 1.502407665971466355e-01 4.415079670752806718e-01 9.457752912464650885e-02 3.315565850703579981e-02 3.804685525380837458e-02 7.361094964589040557e-02 5.819396318431327986e-01 9.124705898152331018e-01 8.138798588642797149e-01 6.220813144665308103e-01 1.981543591886760769e-01 1.097436537646859916e-01 4.312563321071027911e-02 3.589679917166986589e-02 1.711114145496129418e-02 1.804555348320251856e-02 2.936297435680911352e-02 3.767090762857541741e-02 3.679294014264675866e-02 1.050574184755940221e-01
7.606772529082892476e-01 5.011862469604300152e-01 2.814672885083320808e-01 1.821748299406669436e-01 1.013679504147463772e+00 4.163869010551766170e-01 7.383367246948685514e-02 5.948085033858152570e-01 5.433417722961570995e-01 5.324267835627674028e-01 4.605989779301045139e-01 5.637806646013935330e-01 1.626158491457596958e-02 7.698941690334037968e-01 1.216554370646417832e-01 1.043559442103803164e-01 4.305336621637669281e-01 1.813429225822291851e-02 1.677072370734537798e-02 2.585939771789929620e-01 4.973039186846497234e-02 5.009663609172939486e-02 5.394104388329637456e-02 3.512782378985306042e-02 2.060015896767119006e-02 3.162305512836924987e-02 1.258223007445810337e-01 2.496872088979040782e-01 7.015584999761926843e-01 3.375826279995181589e-01
1.252487468085720312e+00 8.106709802506348872e-01 1.254767863831727226e+00 1.173644471568430436e+00 1.040429489768889937e+00 2.021526566385679624e-01 8.730686408841200619e-01 3.808859047526362840e-01 1.780166847702022437e-01 6.248936912621366746e-02 8.331043257695557314e-01 6.977100789269613523e-01 1.103214891510568424e-02 8.396380901391943888e-03 7.499335872318454443e-01 7.483027541447544451e-01 1.089030275572684843e-02 8.245774890756325456e-03 4.587224303649588969e-03 4.130317150542711646e-03 6.070507826077124747e-02 3.819786950543037352e-02 4.369240559334426621e-02 4.797954100506747477e-02 2.683651968242443259e-02 3.448198404663390532e-02 3.336630130301884156e-01 5.606016497417721789e-01 6.812566632340147921e-01 1.749150534522007916e-01
1.068961681739389213e+00 5.528213762998746006e-01 1.228469876927902771e+00 1.052955476696089576e+00 1.377386013711432877e+00 1.263454349795845033e-01 1.019817832843603611e-01 8.962450629590973383e-02 5.859116562243767840e-02 4.520926127626202495e-01 3.591137503999054098e-02 2.131424957222745331e-02 1.425584355599823078e-02 1.170772197014546823e-02 3.931157294106559646e-03 7.179855302766290082e-03 7.330122140664931639e-03 4.558648390212686162e-03 4.139217003869830602e-01 1.008884740428045712e-01 4.144412351894065372e-02 3.688208758764859041e-02 4.752674190481252781e-02 6.650763235912732219e-02 7.116907316484258339e-02 3.881728326011049668e-02 6.260784272888175739e-02 4.900784631910908712e-02 4.329096396160794086e-02 3.068285554308391311e-02
2.065846577590783606e-01 1.206753387178022274e-01 1.055792907628855692e+00 1.035594838015652552e+00 8.229922133996169231e-01 1.938878117283370228e-01 7.567860910394152985e-02 4.894815650333283336e-02 5.860734870633027560e-02 9.144908620486777995e-01 1.228834913811191823e-02 4.569972568021652554e-03 5.099942827201647128e-03 2.653118748732641308e-03 9.634105758249347654e-04 2.372935010747621171e-03 2.591250016973321857e-03 8.177198869990999486e-03 6.929166188007289673e-01 2.298191185674819947e-01 3.964496971053173974e-02 4.009686489625723799e-02 4.735661376529054500e-02 8.468380693893229338e-02 8.047918994126262993e-02 5.733869445996191833e-02 4.404392793855363419e-02 3.990662776237408060e-02 4.332122240809968550e-02 4.677004891762902294e-02
4.177371441465151103e-02 1.069106575698532124e-01 2.560852443078591723e-01 7.195528157850518136e-01 4.739705896392313322e-01 1.524904931321119927e-01 7.794478684845916605e-02 6.567206548289462875e-02 8.137281087358139153e-02 5.260146992269649768e-01 1.457381027017280173e-01 3.391566841272715491e-03 7.801930810095248151e-03 1.587665155189345138e-03 5.085058636532012802e-04 1.285397336698830247e-03 6.839244805900119850e-01 2.745477621809086066e-03 5.416772456223018818e-03 4.848447154497399492e-01 3.807677234506209873e-02 4.155490338656769866e-02 5.236668212443577886e-02 8.739080455787848201e-02 1.110242389441084138e-01 9.705632188640059277e-02 7.137885563068843697e-02 6.666643201201832847e-02 5.827550038740789140e-02 4.820615436195330172e-02
3.438858562599670515e-02 9.867652292682937976e-02 1.755434649486873611e-01 1.263540063733681884e-01 7.465039430504322171e-02 2.954686937590507156e-01 9.833250350423408115e-01 8.461105590689226297e-01 1.111383052144163525e-01 3.412676616680787589e-02 1.201455321920794628e-01 6.371620737044820793e-01 3.603779502628942470e-03 2.226199899569836910e-03 2.448461998428350279e-03 7.312961899996475550e-03 6.458071835906879429e-03 4.093683530147641803e-03 1.290175448060400937e-02 1.609387435195112556e-02 6.866171394674485118e-01 2.498480372194550325e-01 1.865327845538268803e-01 4.440990350973311740e-01 8.920239392818714030e-01 7.568436651259481396e-01 7.167249326021122094e-03 7.527573876613991022e-01 7.867165030589935715e-02 9.078313159057954662e-02
3.096641404973377032e-02 3.116994509398744381e-02 8.486494591084620120e-02 6.339856722623518070e-01 2.314864230912528353e-01 5.320905644354965991e-02 6.489132692169941041e-01 3.643477202526018699e-02 9.180187313766786233e-03 1.282709474592106103e-01 2.639770788471466623e-01 9.907295559719347250e-03 5.745457111949908366e-03 1.789934648986190712e-03 1.673889381547089515e-03 2.095669988919797271e-03 3.699713662937095283e-03 6.604321350281355807e-03 6.954370732532313970e-03 2.342843306335938569e-02 6.633852479471060715e-01 7.408720480198178748e-01 6.133587153445687612e-01 9.675437551346477427e-03 1.033926069446862786e-02 2.853104911831139817e-02 2.543839735529671714e-02 7.153765437660906945e-03 8.108255664433446086e-02 6.191239030916293601e-02
2.741017004444416816e-02 2.992230271253970564e-02 6.816752500518939717e-02 7.611978925791952622e-02 5.140609005508284257e-02 5.412277049299382692e-02 2.935391487864090210e-01 7.812650233400231237e-01 2.937865376666801923e-03 6.528978693377838205e-01 7.067497498426170699e-01 5.601770120038399581e-01 2.214955005061601100e-03 1.540833851017567747e-03 1.489493989068097326e-03 2.366325826512118147e-03 4.296432271114545079e-03 5.480595135289675728e-03 3.327355200945613170e-03 1.716245131661143716e-03 2.080810002421492472e-03 1.727974639075062838e-02 1.862117553185326652e-02 1.509796642185636494e-02 7.220097051293694959e-03 9.437020939849764811e-03 7.528498870624973811e-03 6.409256793757477609e-03 1.184733272879666122e-01 6.959285730109024404e-02
3.421270855352138984e-02 3.950054631182829679e-02 3.898781925705996354e-02 3.710310864610337489e-02 5.367400724681674340e-02 8.875161026911733420e-02 6.157650913206660220e-03 1.308429975300836462e-02 9.552643050662492849e-03 2.560586456262081180e-03 3.317580355783179055e-03 5.156035061746847871e-03 6.113583910423720479e-03 3.582799020820120160e-03 1.041868021620698768e-03 1.938676330680075841e-03 4.455225979325521009e-03 4.804153880702229269e-03 2.424634076493904257e-03 8.685961231995981092e-04 3.745134779644762602e-03 6.766459649623158060e-03 8.633190363479342766e-03 9.033635244223018473e-03 8.104906423286433945e-03 7.055461606392750100e-03 1.046133416179167996e-02 8.448085842172076143e-03 1.648787585971312197e-01 8.924583390080170764e-02
8.438496364804029537e-02 6.598728246571988754e-02 3.231925746107636166e-02 4.554116602301884476e-02 5.399586962546749636e-01 3.822752576298521932e-03 3.387317811804271307e-03 1.918377189235999890e-03 1.860439332191768207e-03 9.017295278531186221e-04 2.584672741022309150e-03 6.574195423699287222e-01 6.345929033151607168e-01 3.877372956660741533e-03 3.405568171926823349e-03 2.324946611024223016e-03 6.810889207013136326e-03 1.004013837318392006e-02 1.768453918395534443e-03 1.758084017377457581e-03 4.145002429785899639e-03 8.954383776304794540e-03 1.102988072061847347e-02 1.173350657455816612e-02 9.920277734016255677e-03 9.677678492657323245e-03 9.058267612929321935e-03 2.830924393145354059e-02 8.444369243775551315e-01 6.964486759156280904e-01
3.460836164736476317e-02 9.532416198454093936e-02 1.673712944427776517e-01 6.178980428946675638e-03 5.873432096438034253e-03 2.971746111603550556e-03 1.352592591668008324e-03 1.679627925193245309e-03 1.140211355384277260e-03 3.659273463872299292e-03 3.000392960885175844e-03 1.757786013158719740e-01 2.714256628644048375e-01 6.352359972908356855e-01 3.059491121229813201e-03 1.078583569121362162e-03 2.789735383085591245e-03 6.079158673281579439e-01 1.923030050948165981e-01 1.793480555770503044e-03 1.589151839887550368e-03 8.581453988104063152e-03 1.101288614464684436e-02 1.184246889906446880e-02 8.851828038418678782e-03 4.169043521121757606e-03 6.815883469773203855e-03 3.071910433088703013e-02 2.472744281678894429e-02 5.068741617796339582e-01
7.371604364124650921e-01 9.656545368975841814e-01 6.814798285735668149e-01 8.356772840475927833e-01 7.255820704725545779e-03 5.699086614536195711e-04 2.823824291444989188e-03 8.038856303436279398e-04 3.386052127229916345e-03 2.486041750770231172e-03 4.644155903813592112e-01 1.192395033271619054e-01 2.092024781837252267e-01 5.072426805870279276e-01 5.263032735545160323e-03 4.770953677703080481e-04 2.579471928679869398e-03 4.725365155773987857e-01 7.666430061173344912e-01 4.178442362010351477e-03 5.062915932153384292e-03 9.875811110272145546e-03 1.092658993126799025e-02 1.071277852822110320e-02 8.450636573814857694e-03 6.313010868408346944e-03 6.195312476205150527e-03 2.335465605263870037e-02 8.884707460285417024e-01 3.878430043742636668e-01
1.096509578280688811e-02 1.440748629425465943e-02 9.421896556395749703e-03 8.844138276788440223e-01 6.618012599073693804e-03 6.109629149153557037e-01 5.522157687960094902e-03 2.852455723555113662e-03 8.443674927898418663e-04 5.058234698068745372e-01 2.042777075891000216e-01 1.804299053544460851e-01 1.016497033696395769e-01 4.733052423562902206e-02 1.010271100872525835e-01 2.909451067001773694e-01 1.047969968325312019e-03 3.622360531748397301e-03 3.208651103806250352e-03 7.675751136118149492e-03 5.141106094222009856e-03 1.302639594167614989e-02 9.990543803814278326e-03 1.484574494475746076e-02 2.735773835664780107e-02 2.295393771314753473e-02 2.376236975970215382e-02 2.956221575915437758e-02 2.167079431995103667e-01 2.357877192840094061e-01
2.471850345479096440e-04 2.632725886458544412e-03 3.286442581398069107e-01 2.822567377655503806e-01 2.648800144701365378e-01 3.764112084585268247e-01 5.287577471262694395e-01 1.324481583779720806e-01 1.848657129022419632e-01 3.205163628426525857e-02 4.743246430511575962e-02 7.482996685993467678e-02 7.178746298850952057e-02 2.282145260186043689e-01 5.090248914108960188e-01 9.184662448134955914e-03 3.097706093805144192e-03 2.286458212735731268e-03 1.626263081865600641e-03 1.285850590330495482e-03 4.566024565653107811e-03 6.715968716173361178e-03 4.223931682412075950e-01 8.116764130024457513e-01 5.234990880879903004e-03 8.863262583506864578e-01 8.593218368488051428e-01 3.125338314121766659e-01 4.017093001248853157e-02 3.747918566987197553e-02
2.226315110980311290e-03 6.391263691659106183e-03 3.644630263032774820e-01 2.139422327137941726e-01 3.603705759062010294e-01 2.836221338085248012e-01 4.444100766423493276e-01 4.908238986061379261e-02 4.359502999896708308e-02 1.885240973909729084e-02 4.666671783737880858e-02 8.629018084719160264e-02 9.441410435139369062e-02 4.411345135616257518e-01 5.739365213855545100e-01 4.056342289615637135e-03 1.681628170861741538e-03 3.226719644000067971e-03 3.780825550852688361e-03 3.468191027696077011e-03 6.244560032920472466e-03 6.908233631308939859e-01 8.199649601877759819e-01 1.628801795241397593e-02 1.375277165891741066e-02 4.741875339967695051e-03 3.657328261400826785e-01 1.487854983740327097e-01 5.514773348736451419e-02 5.286559579105572920e-02
2.917148139206582509e-03 5.832677790041751464e-01 2.059521681673119331e-01 9.095136177403735644e-02 1.188820652354721508e-01 2.712571895502453589e-01 3.545812294748103000e-01 4.009161965782392228e-02 2.150909977788253297e-02 2.447786275645958548e-02 4.440891524426274217e-02 7.589113423060026009e-02 7.083487594789192321e-02 3.407492661994742100e-01 6.007167496276631657e-03 7.326833248015219083e-03 1.267376187205616206e-03 2.965687818002190126e-03 3.840751222963288344e-03 3.460037752844102171e-03 2.394295767048428350e-02 4.314524814073504855e-01 2.974396764426305850e-01 5.326681995477449139e-01 2.890425176249964215e-02 1.279095095396254669e-02 8.431739265501118213e-03 2.556777874083036584e-01 4.458951039681519762e-02 4.022838209148119071e-02
3.602147130703209962e-03 3.521806544810693242e-03 4.604238309266608931e-01 5.102178298588488925e-01 1.257347601193167907e+00 8.815017569050341839e-01 3.659020506265735495e-01 1.503672864859915970e-01 2.279883102920551297e-01 2.903072141327579514e-01 2.707117050678615328e-02 3.157217885724367124e-02 4.191251977287163699e-02 8.252105127415394759e-02 4.283876731070971333e-01 1.476460305474133067e-02 7.641471120996883026e-03 9.629512521049377050e-03 8.268438316436170152e-03 1.452214842684300053e-02 2.405232464005466891e-02 5.373589793559865324e-01 8.703394874690592586e-02 1.513306447786194608e-01 6.164827175585556596e-01 4.641649183865163841e-02 1.785863101328655916e-02 2.246163397618962387e-02 5.228205643576664535e-02 4.559361830934967330e-02
2.478883103528408370e-03 4.583784213273763286e-01 6.069027926977517140e-01 1.183258810233875025e+00 7.075022822694931879e-01 3.229977017772728831e-01 1.479224422630362190e-01 1.045413403789671042e-01 3.400246030196691360e-01 1.286232921854256306e+00 8.937457674404850061e-02 3.313860853670271001e-02 5.064106048540443356e-02 9.692204023042695626e-02 4.130504712041785931e-01 6.852236514615563934e-01 4.051922031792390966e-01 1.764805530514992893e-01 2.511447637209867634e-01 4.292862911152048877e-01 7.554960160764250254e-01 1.790193679032343610e-01 9.377653677269903731e-02 4.540296494271355288e-01 1.038589334621392801e+00 3.215831020594493439e-01 2.573348943396493865e-02 4.002385446361977905e-02 4.280818625474462902e-01 7.279902887789183041e-02
3.991999686602446321e-03 1.049321817516676081e+00 5.986883017674962115e-01 4.795556277615724561e-01 4.834328787119639426e-01 1.804426464959796028e-01 1.193985452936138225e-01 1.245630002044090801e-01 1.441148633108001453e-01 5.629920050485281990e-01 1.661577248347026470e-01 1.725439024602201110e-01 1.442606675371086722e-01 1.609356520341074792e-01 4.312517181821956536e-01 2.840477734836046042e-01 1.796894215357083269e-01 1.006700874998990719e-01 8.539211083543826741e-02 6.414512623992424389e-02 5.158508473662257870e-02 7.587465901399653712e-02 1.173831068029355940e-01 2.814015042811336409e-01 4.821856373312751742e-01 2.171327979077485315e-01 3.181383263852415322e-01 2.173672418371992432e-01 2.237945436068485283e-01 1.474289626864868918e-01
4.336135426830782166e-03 9.143389300764963590e-01 5.843028651264081663e-01 8.649544615639808143e-01 7.880807953162062285e-01 4.314499440056826507e-01 1.809972854981642312e-03 1.209821545302957269e+00 1.914176651047284350e-01 1.366076575639394441e-01 5.214741411239780938e-02 1.292206374052263795e-01 3.397880507165050301e-01 3.404217263411549732e-01 9.851187702749191200e-01 6.950440049761239525e-01 2.018164387067089005e-01 2.178007929854657299e-01 9.646153075677325883e-02 4.247624310546724985e-02 4.140354598838345834e-02 6.501593469618734134e-02 9.953210818866997656e-02 3.049406463912355814e-01 3.088478207222984939e-01 7.284874552168375816e-02 8.012606760970075737e-02 1.022108808003333313e-01 3.317308223655707211e-01 6.780529439152502280e-02
2.280389665388346705e-03 5.484708585591271252e-03 6.553824006669516367e-01 8.119652728669577574e-03 4.752337763541717407e-03 2.675271079615352404e-03 3.622590142373410989e-03 4.792341781697730951e-01 1.898800261405855505e-01 1.084137185885233889e-01 3.328859241347172787e-02 4.565511906423050381e-02 5.119315805620082427e-02 1.867053171197846362e-01 2.204776080651731363e-01 9.079046302088224218e-02 6.993654423559839128e-02 6.918814058522192167e-02 9.158250011978741334e-02 5.275307840383013092e-02 3.746931226527348835e-02 5.592241533504711121e-02 6.384568020031558544e-02 1.070912252939849457e-01 3.351967715393436853e-01 5.283233618476422533e-02 7.648026739037311339e-02 1.245008489592704104e-01 1.497106662201860283e-01 2.969468039500168799e-01
1.154660819199818068e-04 4.180582514909689067e-03 1.011525534952286032e+00 1.193889045530535098e+00 3.581866242846636419e-03 3.645954847079823573e-04 1.433347921822923513e-03 3.333325519442643103e-01 2.574092658026563840e-01 2.397588542024245428e-01 9.860329881403590013e-02 5.098940043836221181e-02 3.266693065127224821e-02 5.153603037499104866e-02 2.330511189164115593e-01 5.948976044435724808e-02 1.528502119541923499e-01 5.700879384972736691e-03 9.403619274039144021e-03 2.016352249281213038e-01 5.218108478185029542e-02 7.313201665581856026e-02 6.378041044356222433e-02 7.047069352492574268e-02 9.385023080454572841e-02 7.201561346607381064e-02 8.471892061392327644e-02 1.039758385536154739e-01 1.396493177052828272e-01 3.429199491253087650e-01
