1.078158452930121081e-02 1.591355978849495756e-02 1.382238093544371944e-02 1.739994690733903671e-02 1.317828288965000247e-02 2.888403442163632248e-02 2.871686088868798808e-02 7.790485899403813697e-02 1.416129390862110038e-01 6.346280716880767225e-02 2.924999629952659483e-02 6.637583108296045593e-03 3.866860788039223895e-03 1.428287735710423445e-02 1.643725067268895362e-02 3.565471569926040567e-03 1.228919676187444424e-02 2.100939536795381687e-02 1.854986471434158513e-02 6.392198338043383193e-03 5.151979851564998311e-03 8.007065077304289765e-04 4.242917338644427300e-02 2.416335134446742725e-03 4.210400660026839166e-03 3.266634920466630464e-03 1.513359193483116826e-03 1.070803193936236547e-02 1.040024619805080854e-02 1.307288163763098768e-02
8.557168657049248756e-03 1.906017730352751322e-02 3.415968718588959646e-02 2.787728128599728863e-02 1.937397717042983053e-02 8.663047710166559001e-02 4.118032754665307965e-02 5.211679087933782095e-02 3.406363799893035588e-02 2.877703652399061021e-02 2.009262843847584024e-02 3.894669841621548403e-03 5.135653496443022548e-03 1.160417685468554880e-02 1.603428186687379936e-02 1.015531686154812728e-02 1.227528173121544830e-02 3.916093295857581147e-02 2.876087498211487431e-02 8.446022340812481613e-03 2.974636877350649716e-03 7.136335350027304611e-04 1.524605853796034147e-03 1.323372105781997271e-03 1.044811514783697097e-03 1.366873972419550918e-03 4.075021446754827081e-02 1.081581895102630246e-02 1.569864148069291185e-02 1.568835755940309676e-02
1.045257798258288351e-01 1.074389818332385782e-01 2.271300495845462175e-01 1.848255874713443103e-01 3.917950625918620311e-01 3.985718756054708323e-02 7.397192898622730398e-03 7.947657913402156327e-03 1.279289596418332620e-01 3.832640722964341523e-02 1.009807596308373301e-01 6.642503855868107931e-02 2.424257893772634176e-02 3.501731217732610701e-02 6.629527455905375594e-03 2.750586035406922536e-02 1.803720811935064991e-02 3.593018700093937590e-02 1.161362908733186566e-01 1.880669011763123552e-02 1.768160118793641331e-03 5.313583356281421444e-04 8.258508804627899590e-04 2.312637426060017848e-02 1.385378829876741935e-02 9.346349712876423146e-03 8.486102208105354705e-03 6.797252949594550717e-03 1.159240627464103168e-02 1.299091970350134406e-02
4.858419159358955131e-02 1.401317257472695366e-01 3.076684739651353584e-01 2.486440244488307971e-01 1.013179181205209195e-01 1.563261691263341871e-02 1.234659710982808148e-02 8.330415573533360429e-03 5.123449282430012942e-03 4.736034220314389726e-02 3.001537614180638941e-02 5.896719674973534275e-02 2.650814864602523552e-02 1.740717443856216323e-02 5.060949289702861009e-03 3.798871359524332719e-03 7.761720456911517900e-03 1.415265145552768028e-02 9.752085810437250910e-03 8.113481187733546235e-03 3.603453218465441435e-03 1.248299423006422014e-03 2.957546076600455626e-02 7.813705889477566471e-04 1.143032226787092306e-02 8.563803040163206134e-03 7.394352832682032570e-03 7.003990981798235461e-03 1.380806098569507291e-02 1.501246208101677561e-02
2.792727606707206059e-02 8.685188855116757201e-02 2.425946620400452614e-01 9.402971758071120012e-02 5.329847736765568750e-02 7.761550352379677394e-03 1.190405338449383732e-02 6.644464406983773171e-03 3.107473418782873316e-03 1.074334484852593197e-01 1.338847941381677009e-01 1.122518634675091775e-01 1.642229873543524232e-02 1.336425589082822565e-02 6.152050304290268383e-03 2.247642954522678562e-03 2.361201314868974221e-02 1.328463788634569320e-02 2.087270436134125093e-02 1.174494732800071203e-02 7.994134757250042148e-03 2.225598301346469986e-03 4.764303992059039199e-03 1.365678526086239186e-03 2.056199284599624644e-02 1.153320889424906508e-02 8.047201752208840708e-03 9.278318649720325093e-03 1.413183704174008487e-02 8.349719651209933221e-04
2.770712527916262269e-02 2.892591889056150486e-02 1.297416546585113961e-01 1.039612142384370719e-01 4.097993503951389421e-02 4.404808726872275551e-03 5.396275788143667373e-03 5.812552288092925727e-03 5.516999034065365841e-03 1.654821207309689624e-01 1.290427166333992792e-01 6.687525776797387245e-02 7.530223477203395674e-03 2.555843545867461826e-03 1.919878729538308315e-03 3.101418863665084645e-03 1.345630546316827977e-02 3.457228445997341613e-03 1.099714221931207513e-02 3.736858529517852329e-02 4.481485793345215546e-02 2.599995560661072860e-02 6.275253498621071249e-03 8.616896788756934090e-04 3.075713474258629648e-02 3.041227279610527953e-02 1.904924033340653702e-02 1.307443456951236545e-02 1.683022788453285984e-02 3.020896088470246751e-02
3.825189738619058817e-03 6.019006959722867506e-03 6.367851810483760727e-03 3.229920603065671025e-02 1.547168822880468260e-02 2.579297069375013907e-02 3.941472287907022559e-02 2.265908311054918439e-02 2.726973956189305062e-02 3.144592678397325342e-02 2.405958141133989620e-02 9.791157631091968599e-03 4.127459882356441373e-03 1.952681441005526966e-03 2.647810271768091112e-02 1.710326535981957245e-03 7.758380694058043293e-03 3.636839262216695189e-03 1.832986522108247598e-02 2.478670317705120030e-02 1.124715521836852118e-02 2.906899818311590479e-03 1.252011446345559611e-03 1.137412364573729684e-03 2.141108643953295101e-02 2.275047979766703365e-02 2.006022508683037026e-02 1.721192543605315484e-02 1.909128309178217270e-02 4.526520831943747769e-02
8.222958411679491542e-03 1.495077415936510792e-02 8.741534586401604814e-03 1.883637753190668673e-02 2.896213889559677915e-02 3.276084739604132740e-02 2.925849377159262660e-02 2.783628719116551867e-02 2.240811995682127564e-02 1.245265821367652799e-02 4.984299327156968377e-03 1.535298474716675909e-02 3.376326082724178008e-03 3.021472546292942526e-02 3.408625326602884864e-02 2.396897448366229824e-03 1.548972719311214261e-02 2.474386850603852925e-02 2.157278012604051110e-02 1.515188874521554777e-02 4.046711595435398615e-03 2.085192899977714349e-03 3.730001524474828994e-02 3.247848130518323634e-02 1.627100578901550382e-02 1.682905694376794770e-02 2.516054373430935687e-02 2.900985544946094175e-02 2.797328508233145813e-02 1.661964753528923653e-03
2.187565917124465603e-02 1.436681953512113086e-02 8.376901530529142284e-03 4.848624336959883596e-02 3.132436898785648932e-02 1.328957489909619871e-02 4.290784712062824940e-02 1.938922103391401211e-02 1.621420956706219260e-02 1.590990994882189938e-02 1.414003209839425658e-02 1.865855243674191880e-02 4.209947858072533855e-02 2.910380714840608840e-02 4.273950879344850726e-03 3.684412882736525559e-03 1.490049505436758133e-02 4.537747609036434093e-02 4.452127211394182882e-02 7.322685744961717966e-03 1.354579688465035701e-03 1.412653013022064806e-03 1.643258495319263992e-03 3.079719357810839844e-02 1.859908142213113208e-02 2.717787556833962601e-02 1.749251706005925657e-03 3.156735589371851593e-03 9.243970936976160513e-03 4.633236433021056290e-03
3.662478666084519746e-02 2.402610819613221205e-02 3.791911787058131061e-02 3.542397244176630211e-02 3.075615614556584387e-02 6.062594779165462328e-03 2.797287113918921209e-02 1.193921194063644192e-02 4.968362997846590551e-03 1.863080449945463731e-03 2.727989187541023444e-02 2.674447808070464644e-02 5.617984372526407116e-02 5.967091055730609078e-02 2.786167963682390988e-02 3.015018195888442137e-02 1.618547541977023441e-01 1.679607182209413851e-01 6.704376860412633587e-02 2.955855846860537192e-02 2.098693475258242482e-03 3.310548265301711812e-02 3.613168118977857363e-02 1.158459718620494629e-03 2.198351669087294374e-02 2.805605331122234397e-02 4.901205874622484304e-03 7.353068257365208936e-03 1.040420653257587841e-02 2.870599960916368331e-03
3.060613416899900241e-02 1.618432984986068260e-02 3.571808103902478215e-02 3.038586101154866492e-02 3.802456309097776432e-02 3.476783273413019439e-03 2.885203824031122230e-03 2.489972392738662790e-03 1.532627990948402493e-03 1.374931150526734723e-02 2.166416596294581942e-01 3.637427769414968148e-01 7.461894034716974877e-01 3.617669642170758815e-01 6.556201198572866873e-02 1.271373326765686818e-01 2.366699228709353009e-01 6.535129810625471547e-02 1.548895825018332083e-02 3.382133470280226928e-03 1.908526445959503499e-03 3.254780122022096073e-02 1.740166164153280617e-03 1.428204194277193917e-03 1.367748299444346283e-03 3.074498384583240068e-02 1.232336708300191177e-03 1.164702056381121658e-03 3.420257797850580206e-02 2.515549225699947183e-02
6.930358716787665858e-03 4.038525899822700133e-03 2.937753702489055013e-02 2.881775937605988991e-02 2.211127429939240691e-02 4.991579001049788189e-03 1.894026038200469306e-03 1.191574856763800462e-03 1.441527907548825326e-03 2.693047485810050323e-02 6.549870759575242285e-02 4.294049759240005093e-01 7.646426105799913886e-01 3.905733459444447608e-01 1.386645907121783483e-01 1.545455092025016242e-01 1.702686870896824856e-01 1.000819987193506816e-01 2.448096145825957165e-02 7.614567952923144943e-03 3.687551929291205122e-02 3.557772441193821078e-02 1.545665513631415931e-03 1.642578508594005459e-03 1.666088098578490453e-03 1.156417908321396909e-03 1.063218327802868072e-03 3.590289785993395349e-02 3.750941922783378180e-02 1.217570895431977765e-03
3.154922250475959700e-02 4.541499657862832842e-03 6.841625297575435263e-03 1.927986325267943418e-02 1.243428286295355373e-02 3.864200060697682917e-03 1.922441215167365255e-03 1.552320569082560418e-03 1.947493920332076835e-03 1.385116070747880943e-02 4.566829073542588366e-03 1.345913718476620391e-01 5.622655900617781199e-01 2.383651199719024616e-01 7.409726163861488080e-02 8.490588861374148699e-02 3.124322571017211850e-02 4.569087296973935869e-02 5.182168999356161904e-02 2.089701390483285695e-02 1.693326794449725396e-03 1.568243307514090778e-03 1.711488982289052774e-03 2.256181925152484467e-03 2.928964056928181833e-03 2.712420549159046037e-03 2.310607067219406369e-03 2.474401357163403224e-03 1.890648793563729684e-03 1.252957110333407847e-03
2.769761766998077995e-02 6.324516038565755269e-03 5.613823182710725446e-03 3.306572757462564703e-03 1.936700790218495423e-03 7.410857718883364156e-03 2.494590644135042529e-02 2.100256795056796438e-02 2.738117394051700106e-03 3.137386683773969037e-02 3.332257618274632807e-03 2.163421831570105924e-02 2.536484349881825695e-01 3.400878283392565482e-01 3.597237535015956889e-01 4.823518774120146846e-01 4.325529060607113396e-01 2.800887117498066514e-01 7.634237455311925213e-01 3.532768183251033811e-01 2.892624664734981532e-02 8.305389460009584071e-03 6.205973369861169514e-03 1.557452229804713248e-02 3.622806563037996030e-02 3.394928583757392260e-02 9.253433095979368694e-02 2.956352873073378809e-02 2.254635520923175315e-03 2.058763170194947891e-03
2.620110276739658073e-02 2.460924429718185438e-02 3.462408670489998744e-03 1.559018794295664000e-02 5.595368277913344117e-03 1.284203531717224758e-03 1.659237368435410864e-02 4.783184606734047079e-02 3.290381363868642717e-02 3.338644121685883578e-03 7.021214902224864711e-03 1.074919891995290144e-01 2.271635452744779349e-01 2.862728036504533780e-01 2.568375120539042045e-01 3.084695789129743293e-01 5.248979655927642485e-01 9.056117483111052469e-01 9.204609669937414695e-01 7.215228372020378034e-01 3.070697535605967227e-02 3.194659345203876288e-02 2.843614053614675757e-02 8.931240046691583945e-02 1.288989214311268006e-01 6.613463436069316748e-01 6.602402302920449273e-01 1.303200721084913916e-01 2.776107584367285778e-03 1.582244858199227840e-03
2.435575512926220834e-02 2.517355880027014742e-02 3.962919220733805009e-03 2.448770539434721137e-03 1.252527293069465638e-03 1.283361066305932757e-03 9.063339324951331585e-03 2.562444193243054724e-02 5.285856589052717602e-02 1.868053355507433289e-02 1.912337287265359134e-02 1.667061508534295466e-02 1.292350036210620778e-01 2.598075684804901364e-01 2.405879114882012171e-01 3.662553728418625476e-01 6.328129341455998036e-01 7.680964820177270669e-01 4.433773809462312476e-01 9.650903767766869090e-02 5.794990370354799469e-02 3.982221085946577310e-01 5.813139914143985454e-01 9.779176804735159045e-01 9.244244146601366952e-01 1.213192427687997732e+00 9.737540905548983661e-01 2.740099862575031131e-01 4.560515863358580169e-03 1.994960528869405784e-03
2.952389507853501668e-02 3.304752725205424568e-02 3.175853260514605036e-02 2.946896816385714130e-02 1.343159492841572477e-03 2.519045767881376678e-03 1.478542109153236916e-01 4.963463733922521826e-01 2.413317061856378176e-01 4.101243721831161759e-02 3.022683129519657119e-02 4.702950827672985196e-02 9.262008879949150397e-02 1.355738107259995551e-01 1.779565278305021425e-01 3.174558158336606706e-01 6.828699037012843087e-01 6.862311967116573319e-01 3.244727765224051375e-01 1.113205004966237865e-01 4.807441753997170331e-01 8.738157829875006222e-01 1.123277876739820380e+00 1.158494550451119931e+00 1.027718369204531967e+00 8.958790206190732075e-01 1.334330209682065727e+00 2.299427580689842321e-01 7.226531796528459957e-03 2.977240716066871084e-03
3.835746465072811546e-03 3.553680295052000660e-03 2.831656928203199128e-02 1.721729537048583090e-03 1.576206474545871830e-02 7.219961669261507065e-02 4.046977645301677029e-01 3.305578797634973198e-01 3.237743272879546330e-01 1.611269503087736643e-01 5.866852546112584499e-02 1.578383220942698034e-02 1.536710804988077397e-02 3.915268978460618998e-02 8.780350499707248457e-02 4.018648632662554787e-01 4.207766146113948169e-01 4.886131460706592544e-01 8.496366994561715957e-02 1.499468307607678130e-01 5.325061086341569272e-01 1.153841623695904151e+00 1.424986351084837732e+00 1.484902893789968870e+00 1.235816288044627731e+00 1.207953080962020254e+00 1.137193781938794279e+00 8.924245301266701125e-01 3.930451420817072244e-02 2.563767072118407903e-02
2.852071965453090163e-02 2.249158091139303803e-03 3.969318784343318918e-03 2.746144686986502770e-02 5.755024836449246228e-02 8.186355470205264329e-02 2.583067111171378771e-01 3.228175928320238253e-01 2.208366355305172446e-01 1.707556491397171916e-01 3.561691444261788630e-02 3.482774303370994237e-03 5.280515434047072104e-03 1.485002093305781354e-02 3.224570916578790164e-02 1.896666551798151801e-01 7.185563853364793085e-02 2.278383190829690388e-02 7.604834986422609813e-03 5.513775607618670582e-02 2.104557768285054420e-01 1.123843652397249926e+00 1.425642344807979578e+00 1.494019790050380880e+00 1.093668753275465644e+00 5.105788449743766666e-01 8.337832885412097550e-01 5.664549908839751069e-01 5.081031737166973039e-02 1.977317700815500040e-02
1.931632851634344436e-02 2.462943455873824530e-02 1.573367213193874875e-02 1.947687130786360243e-02 4.556391579484994625e-02 2.615916960539507730e-02 1.346245079312155535e-01 1.739445834187753059e-01 1.599227896694185025e-01 3.750600458482716837e-02 9.383138175104836082e-03 1.982245458424692405e-03 3.481876273450737816e-03 1.029451052198680598e-02 4.090986270817571768e-02 2.754360452102502799e-02 4.979623417782304967e-02 1.457313308827558329e-02 2.717215409753465094e-02 1.287170264302565093e-01 6.966344883283681622e-01 1.322144826518984351e+00 1.422471310124863830e+00 1.347852503329687313e+00 1.033347112198601314e+00 7.569844677372941089e-01 7.337978200855886923e-01 4.900649545420775466e-01 4.390065159704650832e-02 1.544506065249949198e-02
5.272217351762800708e-02 4.793943321830300419e-02 2.437202382031238013e-02 1.735888488653831302e-02 2.229001920705877063e-02 1.192716332678500288e-02 6.786929023420064377e-02 6.067486508815163326e-02 1.659389281420629858e-02 8.995535745560237495e-03 3.107367070081872365e-03 2.486882121285786257e-03 1.515508743551359418e-03 8.630531212719698073e-04 2.299272308224990010e-03 7.958678526252722235e-03 2.818924552836421515e-02 6.356149656861842523e-02 6.055831806701813397e-02 2.694410497726430487e-01 7.387516556396769296e-01 1.071637003211761252e+00 4.363989009985473899e-01 6.505332498671800856e-01 8.342601785425770577e-01 4.697640502105852045e-01 3.486701805143015975e-01 2.839948075019057550e-01 1.210123831370951697e-02 1.121208223153258993e-02
4.284246888821052757e-02 4.896694628464966226e-02 7.114582366706075599e-03 4.858521141683842803e-03 3.935850098247135539e-03 5.850723400106760605e-03 8.320321778121708006e-03 2.074094533230289635e-03 2.721909989003669546e-03 4.357256300577353478e-04 5.871010981825938117e-04 8.920329145099372466e-04 1.016283591803886482e-03 3.754733627667021338e-03 1.098342670589516970e-02 1.474676254439366008e-01 2.802068965385062782e-01 4.007751414603232254e-01 2.707406018512991119e-01 2.024770140355862946e-01 1.437446080852093355e-01 5.142856190290447105e-02 1.998235482030257665e-02 4.297715699233567443e-02 1.539918011226967531e-01 5.150603309869839636e-02 4.679226229775806239e-02 1.572831149008850279e-02 2.112955866934199036e-03 3.363414957734836563e-02
9.021230240289077051e-02 6.906871335283561175e-02 7.306701062105843553e-03 3.114504027843744815e-03 4.518897102663530473e-03 3.510799593923362091e-03 5.480342268598292071e-03 5.917113988358786844e-04 5.344597063403733845e-04 1.759613634970841334e-02 5.789096346797237714e-04 1.039159230929649538e-03 1.362077438989842907e-03 7.663950677420325666e-03 1.316826008015403032e-02 8.591442767220752730e-02 3.114165113582265110e-01 5.739770759126333610e-01 6.425568252329874053e-01 5.533127230846331956e-01 1.178873063650698882e-01 2.635086306439798215e-02 3.289715747759255904e-02 8.102057984274869951e-02 1.790292905132001289e-01 5.243949410561642155e-02 1.972176393016101051e-02 7.395278512078166250e-03 3.898907790124853199e-03 3.634719917909976991e-03
1.132683354485725102e-01 1.439061144337900819e-02 3.865299514275026202e-03 1.252380607893028219e-03 1.409463690476969776e-03 3.073719874840465625e-03 4.003146377599728356e-03 3.538335252966980093e-02 2.028446550067349724e-02 2.323232217434714406e-02 4.058855410052293611e-02 9.824751702908274612e-04 1.058516499401354703e-03 5.887880576563784413e-03 2.409712793128881980e-02 1.215346484666158522e-01 2.332156465372294263e-01 5.308300571803857837e-01 6.613751297627912251e-01 5.583201164215556567e-01 2.808340912499104891e-01 1.629553095042989702e-02 1.169547079360595473e-02 2.553198424556374357e-02 1.466803972726283822e-01 8.835386001961770264e-02 7.872298861787950519e-02 1.468336108198693181e-02 3.000050817060123751e-03 3.620572911779434966e-02
6.320827738959115816e-02 1.953881534467319728e-02 7.361246095480035445e-03 6.766478157149865419e-03 1.493596379497034304e-02 1.015075644262085873e-02 4.242237178890647352e-03 1.750670215582634604e-03 2.660144285952011339e-03 3.651440544399951055e-03 2.474921738169644225e-02 2.765622254805445018e-02 6.135239056426060886e-04 1.352157453691110170e-03 8.665601677795242014e-03 3.711902695123539542e-02 3.707593608275033814e-02 1.566828768025137208e-01 1.990550997479530460e-01 1.718167314828716874e-01 1.468217891885684745e-01 1.923764660622922715e-02 3.012569069722392454e-03 5.965068074931099973e-03 2.645421910898637999e-02 6.679966094090911133e-02 1.786288346039203168e-01 9.971124092312830256e-02 3.467566133120957017e-03 2.704001522490739190e-03
2.264833673647783860e-02 8.975781649882504099e-03 9.322238843575764849e-03 1.548098642344632354e-02 8.400289357289985812e-03 3.735899831401545690e-03 1.698012255934514946e-03 1.179753211303387946e-03 3.721422082795133868e-03 1.468865733535741278e-02 1.138739389247987515e-03 2.657557174221164206e-02 6.571099778469359238e-04 1.396531477347186852e-03 7.019200532342671425e-03 1.321230895413495754e-02 9.028408693251024214e-03 4.446749982938914998e-03 6.975583076281436506e-03 1.282331951854127558e-02 2.342018612568853159e-02 5.495021428308711521e-03 2.918099038267044868e-03 1.519717165392569895e-02 3.729703194186394927e-02 1.341362050809735175e-02 4.640097286281263250e-02 5.175361900976459956e-02 1.811071772166238450e-02 2.694872300507944116e-03
2.295991346318626211e-02 1.839316346329128091e-02 8.723091784164747550e-03 6.283924132698292218e-03 5.801178357155857557e-03 2.159965039985630927e-03 1.414774031026661211e-03 1.436388059990011687e-03 1.580946999914354181e-03 6.335668294617412960e-03 1.905048219497102249e-03 1.797317793304525034e-03 1.743563013451805699e-03 2.241701175696285235e-03 6.898431703761922010e-03 5.101600669508267807e-03 3.551769334211207080e-03 2.185196492102934717e-03 1.975106709624888275e-03 1.559920129200113945e-03 1.294014405946439456e-03 1.970611877762241081e-03 3.275461893946342642e-03 8.552613726017795071e-03 1.546375013951650432e-02 7.599949520014854035e-03 1.228060140049722429e-02 8.221110288386382706e-03 8.257098423975100729e-03 5.240276039955556533e-03
3.119398518887429861e-02 1.622281936496023855e-02 8.967711037384510156e-03 1.202726362351463733e-02 1.049937137334710537e-02 5.665521743700330237e-03 1.918558342600266281e-02 1.439738909554968277e-02 2.117943310232956247e-03 1.600164169607973773e-03 5.722814239583468411e-04 1.309791964028158770e-03 3.954917940324251258e-03 4.701594574757535748e-03 1.553741514001603236e-02 1.239682254612339482e-02 4.050921764817342133e-03 4.964364877966750272e-03 2.361060594248226910e-03 1.258252102605032612e-03 1.173693570578658064e-03 1.823873647912477303e-03 2.445728520244310616e-03 8.217843563259302764e-03 9.001656538693924778e-03 2.283317539517499672e-03 2.630142840312881154e-03 3.444491529444876007e-03 1.133704772919470229e-02 2.330147308612749799e-03
4.188265655249229918e-02 3.616488306442958156e-02 1.068382445026110072e-02 3.587347586030818075e-02 4.147002212293127155e-02 7.790928217991631433e-02 5.192405570627654787e-02 5.846615326547654687e-03 2.098394135621095037e-03 1.265586644360629709e-03 2.892676338829419658e-02 5.543223300691798834e-04 6.769864642541829208e-04 2.860766127902417653e-03 3.500288121677337314e-03 1.694061770907283934e-03 1.721013848172081584e-03 2.194090613171280346e-03 3.093192244536474220e-03 1.913102004697140538e-03 2.763227633116430854e-02 1.450343488494284074e-03 1.377364703159669008e-03 2.589086835547181782e-03 9.062942118996063917e-03 1.568363021670391095e-03 2.409571579985383613e-03 4.094141051314323376e-03 5.091401126818866779e-03 1.017661955514734262e-02
2.255321501112500862e-02 5.605138353260733647e-02 1.643859239709882097e-02 1.740487151442864089e-02 8.409904049271058057e-02 8.894081337226050765e-02 5.914919272023377167e-02 4.057662388396224978e-03 2.866066587639590213e-03 2.850220055790303464e-03 1.182548477912790785e-03 7.280932384959756505e-04 2.534144131087994259e-02 8.222756675398450394e-04 3.814567518637286374e-03 1.201596135320681180e-03 4.525692454677771558e-03 2.916555720051117878e-02 5.374631475470163094e-02 8.479221548768657579e-03 1.672426897649794851e-03 2.137041044192326128e-03 1.532373145218323329e-03 1.866890581414846128e-03 2.753332360315750155e-03 2.322962177346876798e-03 2.909957807360927587e-03 3.686791289035307000e-03 5.131525207185549595e-03 1.268790021338736529e-02
