1.030917785822084605e-02 1.525658617392858935e-02 1.334706444253907706e-02 1.691777397483747170e-02 1.289848610351138070e-02 2.834129020081119915e-02 2.814718979414584585e-02 7.627430154516359750e-02 1.384886523236929512e-01 6.249330196291334738e-02 2.898820163707269831e-02 6.615237729782414561e-03 3.873590631246896874e-03 1.437428633556659188e-02 1.660585275959435697e-02 3.612885040211085037e-03 1.254677911607587210e-02 2.164362319354841413e-02 1.927513883656217092e-02 6.673184354579819039e-03 5.302048983532011220e-03 8.157890526979750308e-04 4.741637929490653824e-02 2.412765148622691286e-03 4.208285834400329189e-03 3.299188289127721538e-03 1.545453469994753854e-03 1.235250867976457785e-02 1.202148717346174928e-02 1.513596234200535393e-02
8.233619099963005936e-03 1.835040818687661696e-02 3.300240298939629419e-02 2.702954598426959495e-02 1.885196781389162843e-02 8.436561376587009553e-02 4.003121583719913140e-02 5.056463419449306468e-02 3.297580126239101073e-02 2.808697086740820012e-02 1.972710084952929155e-02 3.836668159853976520e-03 5.081679467571233871e-03 1.158262734264399116e-02 1.613145572612859416e-02 1.028866495216883108e-02 1.254961025895247849e-02 4.043107491966568129e-02 2.998233002160800853e-02 8.854808906571380936e-03 3.075765214923430885e-03 7.313785505846726650e-04 1.543960045454478760e-03 1.335014110126759527e-03 1.055762346163957111e-03 1.395428844103811794e-03 4.703470417918234614e-02 1.249921284727370518e-02 1.816452083632599107e-02 1.817085194181579030e-02
1.008230235777104189e-01 1.029523969651270077e-01 2.176888577033910532e-01 1.772009154793963981e-01 3.757448486283501699e-01 3.821402846163396427e-02 7.082584235500450145e-03 7.595652593897832434e-03 1.219628470252147046e-01 3.693659428704014480e-02 9.805091626876266675e-02 6.466408049096199206e-02 2.370072718351266816e-02 3.466943224080040742e-02 6.642337929302973010e-03 2.786706443870309163e-02 1.846486806863624139e-02 3.717144636714436734e-02 1.214611801498917121e-01 1.980658669896024487e-02 1.837907567786244405e-03 5.468814246106160201e-04 8.415170776411851072e-04 2.598959863837218762e-02 1.574872622981172629e-02 1.075458095155235223e-02 9.818196841418201995e-03 7.868187924466226238e-03 1.342530697034361419e-02 1.505007273167556676e-02
4.696005218610517506e-02 1.347034407857292393e-01 2.957325960042777035e-01 2.390007639962077324e-01 9.737673507617294888e-02 1.503172428468443032e-02 1.187273572588014997e-02 8.006159735785656900e-03 4.917398193355333388e-03 4.590094889979422915e-02 2.925618366794640809e-02 5.753371309234075331e-02 2.593914077896308443e-02 1.722606553205095065e-02 5.066334957101585081e-03 3.847550784366007837e-03 7.945189460465556380e-03 1.464134120386616396e-02 1.019948201436553584e-02 8.543562834808055353e-03 3.747068942821489383e-03 1.284504835793730346e-03 3.331552145548838384e-02 7.969286605041601794e-04 1.294536593481891013e-02 9.762417195405893519e-03 8.448982517596112518e-03 8.026773356728114997e-03 1.587019016799764287e-02 1.730323757112667282e-02
2.705266027557380604e-02 8.379723442412968792e-02 2.340538064249412520e-01 9.071655621960744709e-02 5.141355990626082784e-02 7.498029678458766403e-03 1.151987641980763491e-02 6.435261433893259275e-03 3.009548877499916824e-03 1.048917038615580360e-01 1.312007631312649969e-01 1.099477255930473851e-01 1.610578573315488496e-02 1.321543805875589547e-02 6.137321560653595867e-03 2.263208703953334053e-03 2.405426006473426748e-02 1.370080744646843054e-02 2.179082413513811281e-02 1.235445207574535284e-02 8.310376401368160457e-03 2.288434982389171961e-03 4.839213535065313432e-03 1.387998695108349665e-03 2.311870903052705775e-02 1.296207538898603261e-02 9.028177317096489768e-03 1.047018623991329347e-02 1.604024334325988149e-02 8.677807894712155764e-04
2.690151903618260426e-02 2.801558844821737393e-02 1.256537953963291765e-01 1.006835111387012621e-01 3.968457551528160876e-02 4.276183184450176727e-03 5.255879934234265229e-03 5.673300266967933915e-03 5.390373346820374889e-03 1.626691726219358924e-01 1.270720990264158912e-01 6.573847894642594059e-02 7.397858938173343044e-03 2.532507243438590714e-03 1.911847599095337514e-03 3.103351229716918083e-03 1.357703995601244537e-02 3.544201822788159081e-03 1.144785740740541201e-02 3.927000556889870958e-02 4.657395840366540529e-02 2.670727251953124159e-02 6.368556584908744746e-03 8.731270448481276165e-04 3.430965998565096292e-02 3.370764594844245787e-02 2.098582658119391847e-02 1.452178230758933292e-02 1.884762830340484460e-02 3.409846093417401303e-02
3.725076268320347186e-03 5.865358024642592857e-03 6.203711830757687243e-03 3.145863391593529956e-02 1.506501508068916820e-02 2.518677503870386108e-02 3.864660953307853808e-02 2.228059839960944491e-02 2.685709002138649687e-02 3.107928275382631708e-02 2.377852067992660898e-02 9.650542907844462601e-03 4.064382848402341500e-03 1.936405804011653029e-03 2.905834290443162077e-02 1.695522708046519724e-03 7.750862690409756998e-03 3.702445045643791652e-03 1.900227096226521709e-02 2.599108653148192796e-02 1.167230929373750878e-02 2.998361200922610315e-03 1.285373571153631796e-03 1.164148365076384320e-03 2.370516461837384251e-02 2.490232797158728126e-02 2.174885619493854144e-02 1.884641512842833572e-02 2.111460566990800564e-02 5.055767663178106774e-02
7.986742981396415322e-03 1.457791345071611684e-02 8.530698372681931943e-03 1.839428615092639219e-02 2.829772488456552479e-02 3.211678930809853949e-02 2.880901930433441699e-02 2.749481992213245740e-02 2.217498027768011887e-02 1.232770020522461207e-02 4.926308105510858633e-03 1.512653241424556129e-02 3.329958389719090816e-03 3.330275240591166336e-02 3.778782961327815937e-02 2.421844596197825304e-03 1.567710414308191857e-02 2.527935251638049885e-02 2.224206854152920715e-02 1.570273084595589369e-02 4.162749058695763837e-03 2.139954940219539279e-03 4.214654601126909678e-02 3.640631661416676018e-02 1.807428458801616650e-02 1.852768334121519811e-02 2.749453273795611843e-02 3.205272982191228331e-02 3.126019474970030687e-02 1.708664690268929401e-03
2.104379677472013183e-02 1.386841290777546948e-02 8.111847741414634702e-03 4.708545133898756063e-02 3.049435700610983804e-02 1.300601689062525629e-02 4.224215493140749678e-02 1.917311769635803714e-02 1.608033691545728353e-02 1.575632505320857107e-02 1.396933527348666326e-02 1.837235994444371551e-02 4.157600588301108707e-02 2.909200486765940036e-02 4.317186392448033039e-03 3.756573585532702216e-03 1.519813267963829317e-02 4.633571436752988160e-02 4.550939468050026193e-02 7.483558703478457308e-03 1.387692915001872713e-03 1.455735716624368889e-03 1.699407833866482809e-03 3.449128062702280784e-02 2.069713592613989239e-02 3.004753360908119994e-02 1.743917750589347180e-03 3.170679328426553346e-03 9.412308210480691342e-03 4.785947390226129652e-03
3.479621117891304460e-02 2.286687256718469147e-02 3.628545502436497650e-02 3.407995385824443696e-02 2.972802178018715130e-02 5.905365744893797779e-03 2.746526638930351510e-02 1.179354603280532467e-02 4.928123528893779866e-03 1.844058568244247428e-03 2.692862011212335260e-02 2.631636541145961072e-02 5.548160987084842927e-02 5.969441297324340479e-02 2.822364453955294311e-02 3.091827802088823601e-02 1.656004354951953195e-01 1.709436348422970486e-01 6.785347652909266836e-02 2.978145489229834519e-02 2.138145711519879189e-03 3.709935880391924262e-02 4.050556651482853376e-02 1.185944952716564684e-03 2.448859953065870079e-02 3.112828887853844040e-02 4.907522297268740973e-03 7.438443839483475234e-03 1.075069955589950943e-02 3.019932926688634160e-03
2.891592381759936631e-02 1.530288704641900865e-02 3.395203776715181171e-02 2.905153892510497354e-02 3.655958017212744549e-02 3.369807012703503885e-03 2.819228565013267955e-03 2.448994243480503465e-03 1.514827917784478464e-03 1.359779041884514456e-02 2.143000216192363916e-01 3.597465216956208245e-01 7.411001499854049657e-01 3.628145081988992104e-01 6.634889113643308023e-02 1.297518563747021292e-01 2.406138751008546350e-01 6.601157919328035084e-02 1.553483012106330295e-02 3.384458042244732363e-03 1.937926267179005454e-03 3.628222407089806700e-02 1.783692951421031936e-03 1.449511045435091135e-03 1.383093039226232675e-03 3.425056414653464276e-02 1.248598400890013962e-03 1.203560890216183107e-03 3.914992936053368622e-02 2.920063542869705611e-02
6.563256621940126087e-03 3.823915702775142547e-03 2.782498939874529509e-02 2.744965112137386434e-02 2.118161216752004194e-02 4.813049214546889602e-03 1.837825889975234096e-03 1.162673176918142814e-03 1.413560757852980144e-03 2.658020464335048710e-02 6.505792672892965478e-02 4.291595350558576327e-01 7.671497810929450711e-01 3.922218242992759896e-01 1.393294352488087529e-01 1.553364314032833482e-01 1.706539727717287236e-01 9.994332573591657720e-02 2.435014820682373377e-02 7.576797614939147912e-03 4.087408485786010737e-02 3.949283513487868158e-02 1.564047545729014979e-03 1.644274160321838743e-03 1.676045864287629234e-03 1.165936462020001479e-03 1.082166430013413840e-03 4.057386581484047350e-02 4.276233113429565164e-02 1.287407385926837757e-03
3.331933463679183360e-02 4.312213848942124568e-03 6.457267642261664900e-03 1.829452639773782724e-02 1.186429862025795839e-02 3.704000393212056493e-03 1.849771209696726617e-03 1.499077377169022278e-03 1.890179305211478131e-03 1.362127175369051701e-02 4.550253941585045807e-03 1.357797793990654645e-01 5.693172844963665380e-01 2.395161425847836534e-01 7.389751898756383164e-02 8.406144120791486651e-02 3.088783457586952857e-02 4.513687209322600480e-02 5.114576697924502757e-02 2.066546034337492926e-02 1.686811550073232056e-03 1.567343640047515543e-03 1.711530511272886827e-03 2.250964754516115215e-03 2.938666194087007251e-03 2.735849353062776330e-03 2.354752580402470763e-03 2.553394785832355848e-03 1.966296275901769936e-03 1.309034353396114174e-03
2.919296460849298697e-02 6.021870428434288394e-03 5.306210644989388728e-03 3.125860204408296983e-03 1.840517085969107765e-03 7.057922585123599206e-03 2.377057467447210234e-02 2.002602181501236117e-02 2.618654407721064583e-03 3.429882834274940173e-02 3.321912201463982431e-03 2.200871228548544750e-02 2.589870207711301719e-01 3.417019823359013220e-01 3.559548521750213745e-01 4.705250187237547399e-01 4.220515468269908643e-01 2.738576837714645218e-01 7.478934750030026279e-01 3.466794286590829111e-01 2.843540716054794582e-02 8.180270806823094348e-03 6.126146145232715459e-03 1.548428696235856425e-02 3.632673566351718453e-02 3.431411318055671567e-02 9.420740957583549624e-02 3.022672880259836756e-02 2.314016284003070096e-03 2.119306348615880142e-03
2.784692531123893200e-02 2.614982151111879677e-02 3.303960406455439501e-03 1.477349398448859000e-02 5.318813497953709876e-03 1.221834126244901886e-03 1.578554640165711481e-02 4.550747224016450654e-02 3.137648266819680065e-02 3.241972341445514307e-03 6.946020607356112250e-03 1.082847553824956566e-01 2.297140406262095924e-01 2.857526089460776242e-01 2.532301956145133204e-01 3.006486216055074268e-01 5.117881847942584717e-01 8.845870729726509341e-01 9.006770293353694168e-01 7.076281678124238805e-01 3.023264409932755609e-02 3.157841006329970696e-02 2.822597579365083639e-02 8.915266035632915531e-02 1.294585991637704492e-01 6.682443769213812779e-01 6.708535260206065498e-01 1.326679629882967781e-01 2.830593548092737166e-03 1.614965726745490717e-03
2.618829759909760760e-02 2.706206290031235029e-02 3.828002817429085845e-03 2.347260806614373269e-03 1.194688030128009202e-03 1.220975453307816426e-03 8.622053569224751718e-03 2.437921044400439413e-02 5.035006025384412137e-02 1.803617389905765728e-02 1.872399634410792588e-02 1.655923707910943871e-02 1.288688438707941974e-01 2.572383105420928406e-01 2.366566386050011350e-01 3.581594838031583183e-01 6.188836735449391169e-01 7.517275700782336534e-01 4.342424965747782029e-01 9.476194660761130817e-02 5.729165913263900567e-02 3.963686885156835205e-01 5.825263468193780936e-01 9.828809293862152963e-01 9.306674318831806847e-01 1.223572364460183026e+00 9.837023513189175894e-01 2.769825881226820052e-01 4.612340663881961053e-03 2.018386221683079497e-03
3.215613109825995325e-02 3.598058595284681777e-02 3.436100061162869479e-02 3.170288004721127928e-02 1.283120251015202121e-03 2.396761656661893555e-03 1.406554530176878093e-01 4.722314984319986864e-01 2.298394841183283577e-01 3.941268982829655709e-02 2.931829917518828654e-02 4.604906610150447110e-02 9.105762124738152330e-02 1.331375039336478161e-01 1.746584627071285645e-01 3.115392013284683514e-01 6.698992020110408063e-01 6.728970206979316693e-01 3.180542489885544999e-01 1.094337922707102062e-01 4.772146977389953859e-01 8.755265689220834702e-01 1.135668826418155808e+00 1.171918171813805865e+00 1.036844220264086847e+00 9.012983594395351794e-01 1.339020152800850516e+00 2.307486345186661736e-01 7.251999239093313149e-03 2.987644769675971632e-03
3.788115512577473840e-03 3.518031906709997471e-03 3.090165796609798191e-02 1.669865279570113782e-03 1.509030158788298229e-02 6.877417522628503921e-02 3.852989510665513206e-01 3.146360517474423579e-01 3.083134925610843124e-01 1.542067769255299481e-01 5.643584812041267662e-02 1.525814024289118276e-02 1.491850239118651215e-02 3.817209643090603566e-02 8.602466602295798237e-02 3.958465135737860296e-01 4.141041602844448555e-01 4.801169630288341650e-01 8.336978489386534519e-02 1.476044686055978383e-01 5.306532982607508053e-01 1.163185672808202398e+00 1.452512784368241716e+00 1.511141197669453096e+00 1.248965125332245130e+00 1.211556407256017875e+00 1.132797250018577229e+00 8.889855487499116471e-01 3.915422360582158923e-02 2.553892677982782036e-02
3.160042833757550212e-02 2.207654073199939899e-03 3.869397749395194451e-03 2.661799033186413449e-02 5.536606176089386294e-02 7.850431067023436182e-02 2.471196908631722311e-01 3.081048301373143228e-01 2.104178055183011098e-01 1.634883672607739258e-01 3.425918683059809428e-02 3.364677884524670468e-03 5.126728971166254721e-03 1.450692455750620183e-02 3.171656375725162569e-02 1.879295981976237540e-01 7.113892631426325941e-02 2.252073451399160681e-02 7.505686947713895336e-03 5.452747769668422201e-02 2.098763894066280056e-01 1.129505861707756020e+00 1.443280748380812772e+00 1.511634153811596271e+00 1.103107358401761218e+00 5.133236511918470857e-01 8.358915126607631141e-01 5.678260566444411905e-01 5.092972478863948965e-02 1.981652638722139134e-02
1.910191420899845158e-02 2.429405113033003549e-02 1.543233010267578559e-02 1.901493440496876061e-02 4.425855470236426947e-02 2.528697507440830911e-02 1.295142341437343081e-01 1.665325384684246957e-01 1.525163386434158774e-01 3.592725735059573017e-02 9.026142763070850450e-03 1.914566385883595834e-03 3.383025836586398688e-03 1.008511813673384008e-02 4.043313076946306039e-02 2.747760674416768745e-02 4.963196306029771243e-02 1.449978210051241535e-02 2.698820461023862874e-02 1.278620907129758844e-01 6.944660411482851403e-01 1.322398801445338723e+00 1.427189254527789330e+00 1.354898834381909500e+00 1.040175348170210290e+00 7.628695644827026001e-01 7.400970234190327179e-01 4.942235792257765326e-01 4.427049431844931604e-02 1.557290168409397775e-02
5.246544435418359215e-02 4.755151331017952454e-02 2.410191330302840704e-02 1.710710350669285978e-02 2.187784758437317373e-02 1.162754994866774423e-02 6.565081964017455141e-02 5.823787763584050564e-02 1.582714187787664928e-02 8.616962581191635329e-03 2.988972972509378913e-03 2.401685356067392342e-03 1.474266804853189639e-03 8.484575559173964786e-04 2.285257475076968390e-03 8.000323256930712973e-03 2.830863672409685006e-02 6.370708863108669184e-02 6.057106712846717367e-02 2.688913772811709069e-01 7.355384472539601148e-01 1.064703676423126133e+00 4.327409315243629928e-01 6.489551762913431388e-01 8.380110967524589949e-01 4.744947812754834460e-01 3.535238942765069892e-01 2.879229156589676042e-01 1.233124667883256018e-02 1.143446468891200565e-02
4.257529067282078000e-02 4.843382144757549246e-02 7.036708137874063754e-03 4.803948696741237347e-03 3.889405495490721662e-03 5.741810156438283304e-03 8.089213676977336648e-03 1.997562788885944018e-03 2.605531975754040407e-03 4.187234831698649802e-04 5.663368137455161407e-04 8.619314527899299243e-04 9.894860916660331955e-04 3.698530621277887429e-03 1.095045196321159028e-02 1.488613226275904700e-01 2.825039182533856108e-01 4.032241309375374505e-01 2.718142324252342812e-01 2.025130387718193370e-01 1.428579021719036668e-01 5.079929744816336773e-02 1.962384866851673085e-02 4.256624505264006847e-02 1.541142247504437013e-01 5.197048074435037246e-02 4.747930848275874749e-02 1.597407157914228909e-02 2.159294110840527265e-03 3.769900229435108746e-02
8.852443951366834041e-02 6.732927738762482794e-02 7.164725083094099570e-03 3.069634092766919918e-03 4.473399781053979604e-03 3.457184361277577597e-03 5.354849820013586614e-03 5.736348329129789883e-04 5.173122963436846411e-04 1.932107958855025162e-02 5.634384272001950137e-04 1.008716704570510438e-03 1.326292799633202284e-03 7.541887628881701645e-03 1.310393856581179746e-02 8.648516255122065677e-02 3.129546746260638557e-01 5.756468927775133526e-01 6.433414211895316370e-01 5.522597214110031016e-01 1.169696820499678963e-01 2.599655766041780031e-02 3.227590593381106376e-02 7.993998119817613546e-02 1.779557160916221958e-01 5.245539047583452213e-02 1.983207221441323984e-02 7.468484451993435795e-03 4.009027994671780781e-03 3.754126558974805235e-03
1.092323680864335927e-01 1.377999519684891538e-02 3.754507625831490607e-03 1.230596617799921931e-03 1.396969348393415321e-03 3.034862722378327445e-03 3.926390349823269399e-03 3.909785599450461141e-02 2.230965429686239052e-02 2.557119904874757821e-02 4.470642019885329860e-02 9.599139244267304322e-04 1.033867274926224527e-03 5.785356874490413422e-03 2.390372390889144646e-02 1.217534145842966292e-01 2.332678145731557906e-01 5.302683755443690083e-01 6.603772578847070251e-01 5.564201829545172284e-01 2.783787420361032994e-01 1.606844417833320701e-02 1.147462800405572338e-02 2.512173331451020980e-02 1.449627110708036348e-01 8.767752561684968859e-02 7.848177103857661985e-02 1.475360388017900488e-02 3.068714231467106063e-03 4.052143089292251782e-02
5.975378340140165279e-02 1.836436310080344358e-02 7.077692548801505119e-03 6.628949445543192917e-03 1.480992546058800680e-02 1.003889373270378492e-02 4.173674816136892923e-03 1.712533094474051869e-03 2.590096212719604149e-03 3.568210094665451738e-03 2.730222616032013452e-02 3.050562593493812494e-02 6.007401494522967818e-04 1.325930763957768911e-03 8.558950252191737176e-03 3.693611543425600469e-02 3.685968673060887463e-02 1.557782217059194563e-01 1.982023324175639090e-01 1.710511168304232887e-01 1.454733914510997206e-01 1.897454834644392990e-02 2.958238921281014337e-03 5.858862392982736034e-03 2.601666004720900455e-02 6.578376623399850853e-02 1.765433150696867626e-01 9.970524257419349778e-02 3.541847427645248517e-03 2.794166322293132124e-03
2.134137479841249213e-02 8.412988370341328501e-03 8.948643323375386413e-03 1.516048523950054572e-02 8.330047474333962879e-03 3.695385580692911107e-03 1.669054455529982335e-03 1.151513404570377258e-03 3.610033413385785577e-03 1.426846864855190258e-02 1.115278803397517279e-03 2.931748933112465760e-02 6.436801758330535110e-04 1.368816102018504451e-03 6.923711339992401348e-03 1.311778539874558502e-02 8.955990229291398846e-03 4.413581132645714479e-03 6.939132972754801822e-03 1.276591580942100165e-02 2.322939328850347207e-02 5.430859642828567840e-03 2.873983954129059274e-03 1.494987268378246414e-02 3.666465430397074232e-02 1.317799287517090398e-02 4.570218215378855225e-02 5.165408850620910319e-02 1.830383141634805283e-02 2.756386990670818809e-03
2.163023641744597769e-02 1.724332961686384294e-02 8.375351623635181320e-03 6.154575418351946638e-03 5.752772222027966072e-03 2.136253627124077778e-03 1.390508470401475736e-03 1.401901545107034266e-03 1.533627819256775130e-03 6.148036264349665374e-03 1.855965351056403350e-03 1.750236963632185398e-03 1.702403094864736628e-03 2.197569895514339677e-03 6.805653796241569256e-03 5.065694242783658555e-03 3.523502030672503137e-03 2.169017776412167278e-03 1.964896335733994255e-03 1.553647586092627569e-03 1.285671294150777903e-03 1.953022219065488627e-03 3.238594064985919445e-03 8.440050038732197293e-03 1.523172227057332379e-02 7.472272651405003144e-03 1.209598190031976710e-02 8.205953122201511268e-03 8.346069542105968853e-03 5.360628907948656457e-03
2.938228065995656182e-02 1.521231740788029849e-02 8.612195629016591858e-03 1.178132310808560623e-02 1.041263825055610374e-02 5.603188421916744863e-03 1.885594786719289179e-02 1.405081903715210169e-02 2.054403343817856782e-03 1.556937389127543330e-03 5.567722614152277637e-04 1.273895000745887008e-03 3.853727982123865241e-03 4.609311180579475468e-03 1.532916812686438771e-02 1.230894120939932633e-02 4.018617762918948871e-03 4.927681483782203262e-03 2.348932076371375126e-03 1.259172253904762475e-03 1.173008011100388961e-03 1.820061190987008748e-03 2.427950110925990081e-03 8.135311323852529100e-03 8.883993003114758202e-03 2.246809790991463954e-03 2.590928819010200959e-03 3.438537494404040034e-03 1.146085095786985100e-02 2.384005655537555467e-03
3.954962136068583545e-02 3.399346743633790274e-02 1.027774538942974498e-02 3.516864901695691825e-02 4.114092968496367575e-02 7.708900406203514355e-02 5.107566962017587309e-02 5.713054920528592116e-03 2.038572306698959846e-03 1.232801026284649970e-03 3.193722408420414383e-02 5.441113001622638681e-04 6.641439097564564350e-04 2.818032163652566154e-03 3.453599727265372829e-03 1.681976076856221865e-03 1.707416791171807984e-03 2.178317913813678734e-03 3.077963789562248881e-03 1.914073000233365053e-03 3.055617509154452682e-02 1.451854707999748273e-03 1.373112177615018296e-03 2.571511033121381355e-03 8.962418344329608003e-03 1.544590181881719520e-03 2.374095652929968450e-03 4.087792572473326370e-03 5.148108306368429955e-03 1.041380896204951306e-02
2.166892382780548354e-02 5.350240118581704729e-02 1.597389853700785511e-02 1.714539216493044319e-02 8.356712705408980701e-02 8.832260304328302947e-02 5.860526057559518887e-02 4.010946507211009780e-03 2.826550950624443902e-03 2.811792451509192037e-03 1.163345466429995412e-03 7.207964647800272923e-04 2.812290271838171346e-02 8.112907176491522283e-04 3.755102240196717296e-03 1.185673734136299430e-03 4.473124002194928464e-03 2.891791281779056144e-02 5.354801211256164650e-02 8.503928300291301381e-03 1.678121142038267732e-03 2.144622287118716497e-03 1.531982511102742035e-03 1.862269831283222543e-03 2.739695261995018019e-03 2.306125608883304035e-03 2.889552218935849577e-03 3.685534081984243905e-03 5.163112495191255272e-03 1.284592627568195006e-02
