22.0133161879152 22.0133161879152 22.0133161879152 22.0133161879152 22.0133161879152 22.0133161879152 22.0133161879152 22.0133161879152 22.0133161879152 22.0133161879152 22.0133161879152 22.0133161879152 21.9873467070757 21.9124866911363 21.8385588420536 21.7655616572683 21.7490412822434 21.7507094383423 21.7523757936805 21.7659553476882 21.8393100114977 21.9117376244414 21.9832396891991 22.0133161879152 22.0133161879152 22.0133161879152 22.0133161879152 22.0133161879152 22.0133161879152 22.0133161879152
22.0133161879152 22.0133161879152 22.0133161879152 22.0133161879152 22.0133161879152 22.0133161879152 22.0133161879152 22.0133161879152 22.0133161879152 22.0133161879152 22.0133161879152 22.0133161879152 21.9694510499586 21.8460457635037 21.7235724015455 21.602029461865 21.5747641777683 21.5764320679246 21.5780981576074 21.6008392717418 21.7227401001988 21.8437141186299 21.9637628293744 22.0133161879152 22.0133161879152 22.0133161879152 22.0133161879152 22.0133161879152 22.0133161879152 22.0133161879152
22.0133161879152 22.0133161879152 22.0133161879152 22.0133161879152 22.0133161879152 22.0133161879152 22.0133161879152 22.0133161879152 22.0133161879152 22.0133161879152 22.0133161879152 22.0133161879152 21.9506217851637 21.7786722186211 21.6076543342326 21.4375666301202 21.400487036698 21.4021546609172 21.4038204849496 21.4366497603691 21.6070957629376 21.7766151963025 21.9452095624628 22.0133161879152 22.0133161879152 22.0133161879152 22.0133161879152 22.0133161879152 22.0133161879152 22.0133161879152
22.0133161879152 22.0133161879152 22.0133161879152 22.0133161879152 22.0133161879152 22.0133161879152 22.0133161879152 22.0133161879152 22.0133161879152 21.9715233876988 21.9290234839323 21.8874580180817 21.8270369466247 21.7323456074723 21.6357887113948 21.5373692623976 21.5144821465566 21.5128147882692 21.5111492298815 21.5366576222402 21.6759059238051 21.8160811343134 21.9571817514773 22.0133161879152 22.0133161879152 22.0133161879152 22.0133161879152 22.0133161879152 22.0133161879152 22.0133161879152
22.0133161879152 22.0133161879152 22.0133161879152 22.0133161879152 22.0133161879152 22.0133161879152 22.0133161879152 22.0133161879152 22.0133161879152 21.923905118382 21.8328615261872 21.7427521288542 21.688986779427 21.6913853216944 21.6919187919796 21.6905901936081 21.6887593608019 21.6870922684412 21.6854269756931 21.7024125208912 21.7931139294504 21.8847420061374 21.9772952490048 22.0133161879152 22.0133161879152 22.0133161879152 22.0133161879152 22.0133161879152 22.0133161879152 22.0133161879152
22.0133161879152 22.0133161879152 22.0133161879152 22.0133161879152 22.0133161879152 22.0133161879152 22.0133161879152 22.0133161879152 22.0133161879152 21.8753506554844 21.735764364795 21.5971120259309 21.5528032426522 21.6522896860668 21.7499115424067 21.8456718143173 21.8630366116272 21.8613697851879 21.859704758074 21.867240981781 21.9093964877384 21.9524784210262 21.9964852800363 22.0133161879152 22.0133161879152 22.0133161879152 22.0133161879152 22.0133161879152 22.0133161879152 22.0133161879152
21.9624088501046 21.9641041934228 21.9657977379173 21.9674894835748 21.9691794303813 21.9708675783237 21.9725539273884 21.9742384775622 21.9759212288311 21.8098750034855 21.6414606033472 21.4721101087105 21.4388669846266 21.6100851640613 21.7822349337497 21.9553147922309 21.9947464949386 22.0022569079342 22.0088384297535 22.0133161879152 22.0133161879152 22.0133161879152 22.0133161879152 22.0133161879152 22.0133161879152 22.0133161879152 22.0133161879152 22.0133161879152 22.0133161879152 22.0133161879152
21.7881358197373 21.7898308925529 21.7915241668321 21.7932156425612 21.7949053197261 21.7965931983142 21.7982792783111 21.7999635597042 21.8015055461436 21.6825726467166 21.5627023950796 21.4418962922608 21.4205361662822 21.5432094682864 21.6668141182483 21.7913486150473 21.860417205921 21.9164710830529 21.9715963105043 22.0133161879152 22.0133161879152 22.0133161879152 22.0133161879152 22.0133161879152 22.0133161879152 22.0133161879152 22.0133161879152 22.0133161879152 22.0133161879152 22.0133161879152
21.6138627527206 21.6155575550393 21.6172505591083 21.6189417649139 21.6206311724431 21.6223187816817 21.6240045926167 21.6256886052345 21.6265963031084 21.5562063187472 21.4848792258147 21.4126165249989 21.4012722885824 21.4754017030067 21.5504622231101 21.6264523481117 21.7270166521503 21.8316130038223 21.9352809472917 22.0133161879152 22.0133161879152 22.0133161879152 22.0133161879152 22.0133161879152 22.0133161879152 22.0133161879152 22.0133161879152 22.0133161879152 22.0133161879152 22.0133161879152
21.4395896490592 21.4412841808863 21.4429769147506 21.4446678506386 21.4463569885368 21.4480443284315 21.4497298703099 21.4514136141576 21.4526238398967 21.4307757810758 21.4079908573042 21.3842705689303 21.3810755892686 21.4066621057096 21.4331794855691 21.4606262284064 21.5945445969228 21.7476824337924 21.8998921039194 22.0133161879152 22.0133161879152 22.0133161879152 22.0133161879152 22.0133161879152 22.0133161879152 22.0133161879152 22.0133161879152 22.0133161879152 22.0133161879152 22.0133161879152
21.370346002797 21.370346002797 21.370346002797 21.370346002797 21.370346002797 21.370346002797 21.370346002797 21.370346002797 21.370346002797 21.370346002797 21.370346002797 21.370346002797 21.370346002797 21.370346002797 21.370346002797 21.370346002797 21.5041248494579 21.6623228753115 21.8214476108056 21.9454752571359 21.9669281136297 21.987455456345 22.0070587855037 22.0133161879152 22.0133161879152 22.0133161879152 22.0133161879152 22.0133161879152 22.0133161879152 22.0133161879152
21.370346002797 21.370346002797 21.370346002797 21.370346002797 21.370346002797 21.370346002797 21.370346002797 21.370346002797 21.370346002797 21.370346002797 21.370346002797 21.370346002797 21.370346002797 21.370346002797 21.370346002797 21.370346002797 21.4638879727159 21.5735425306885 21.6841235571353 21.7844935971847 21.8544882665791 21.9235576629013 21.9917032860331 22.0133161879152 22.0133161879152 22.0133161879152 22.0133161879152 22.0133161879152 22.0133161879152 22.0133161879152
21.370346002797 21.370346002797 21.370346002797 21.370346002797 21.370346002797 21.370346002797 21.370346002797 21.370346002797 21.370346002797 21.370346002797 21.370346002797 21.370346002797 21.370346002797 21.370346002797 21.370346002797 21.370346002797 21.4227226880728 21.4838347673814 21.5458730740151 21.6244370139039 21.7429725072543 21.8605829682209 21.9772698963458 22.0133161879152 22.0133161879152 22.0133161879152 22.0133161879152 22.0133161879152 22.0133161879152 22.0133161879152
21.370346002797 21.370346002797 21.370346002797 21.370346002797 21.370346002797 21.370346002797 21.370346002797 21.370346002797 21.370346002797 21.370346002797 21.370346002797 21.370346002797 21.370346002797 21.370346002797 21.370346002797 21.370346002797 21.380629232204 21.3931998218117 21.4066963976133 21.4653052714023 21.6323806000169 21.7985311369196 21.9637583813108 22.0133161879152 22.0133161879152 22.0133161879152 22.0133161879152 22.0133161879152 22.0133161879152 22.0133161879152
21.370346002797 21.3812629707008 21.4245334069971 21.4668628001409 21.5082526489727 21.5210503073744 21.5193661107006 21.5176837106222 21.5132167398501 21.4714657086114 21.4306506180599 21.3907699692322 21.3888697424516 21.4268860048123 21.4639723224765 21.5001301944995 21.4698847979055 21.4322504531367 21.3955436501912 21.4132209543273 21.5574636532829 21.7026296867472 21.8487175552168 21.9164645889247 21.9509413350806 21.9844974400669 22.0133161879152 22.0133161879152 22.0133161879152 22.0133161879152
21.370346002797 21.3942429091905 21.4860502814851 21.5769168556737 21.6668441302569 21.6953249802206 21.6936410525715 21.6919589212311 21.6832995524702 21.593010681537 21.5036575077625 21.4152385325238 21.4129397484194 21.4994948225482 21.585120194149 21.6698173619374 21.600213325889 21.5140397344542 21.42879344346 21.3996367272081 21.4953376102236 21.5919615873707 21.6895071594857 21.7773569019634 21.8603740496072 21.9424707956586 22.0133161879152 22.0133161879152 22.0133161879152 22.0133161879152
21.370346002797 21.4081652762986 21.5485085966339 21.6879113638917 21.8263750762332 21.8695996896474 21.8679160310181 21.86623416841 21.8524469622459 21.7136212396847 21.5757309707724 21.4387746572249 21.4379412048576 21.5730341026167 21.7071975399986 21.8404330153787 21.7296144291046 21.594902579202 21.4611177883745 21.385127749552 21.4322878051926 21.4803707146052 21.5293749789656 21.6391696490422 21.7707262098631 21.9013626086516 22.0133161879152 22.0133161879152 22.0133161879152 22.0133161879152
21.4093481341603 21.4545607351923 21.6221680882973 21.7907181366066 21.9602093816852 22.0133161879152 22.0133161879152 22.0133161879152 21.9965327346889 21.8240359854915 21.6506052348539 21.4762419813622 21.4773687446275 21.6502508696011 21.8240645931932 21.998808416753 21.8490500743965 21.6699575683558 21.4908647712988 21.370346002797 21.370346002797 21.370346002797 21.370346002797 21.5022161890702 21.6819975812762 21.8611726447265 22.0133161879152 22.0133161879152 22.0133161879152 22.0133161879152
21.5836215673864 21.6165040332161 21.735573993702 21.8555864040843 21.9765397662666 22.0133161879152 22.0133161879152 22.0133161879152 22.0000807358422 21.8761228211386 21.7512311482116 21.6254072153067 21.6282172667789 21.7525601204325 21.8778343302735 22.0040383979908 21.8473397013752 21.668249040495 21.4891580886122 21.370346002797 21.370346002797 21.370346002797 21.370346002797 21.4676786107449 21.598882370581 21.7310045953004 21.8434516284976 21.8450970418951 21.8467406595652 21.8483824814952
21.7578950372052 21.7775050684075 21.8480386240955 21.9195143843892 21.9919308515321 22.0133161879152 22.0133161879152 22.0133161879152 22.0045640481566 21.9291439800065 21.8527903968318 21.7755047965378 21.7781345026955 21.8539390730299 21.9306747571383 22.0083400570498 21.8456296196705 21.6665408036361 21.4874516966136 21.370346002797 21.370346002797 21.370346002797 21.370346002797 21.4322206881075 21.5148840444492 21.598465626426 21.669171220538 21.6708163709573 21.6724597259366 21.6741012854625
21.9321685436114 21.9375640811777 21.9595622196353 21.9825023174259 22.006382877133 22.0133161879152 22.0133161879152 22.0133161879152 22.0099824329989 21.9830992237147 21.955282742587 21.9265344871814 21.9271206899867 21.9543879647497 21.982586110891 22.0117136307799 21.8439198292674 21.6648328577646 21.4857455952886 21.370346002797 21.370346002797 21.370346002797 21.370346002797 21.3958426559714 21.4299665967499 21.4650085239325 21.4948907761287 21.4965356635754 21.4981787558689 21.4998200529958
21.9955974600022 22.0052466995842 21.9803998999522 21.9564930198651 21.933524562233 21.9457645213159 21.9702252526274 21.9937484637201 22.0133161879152 22.0133161879152 22.0133161879152 22.0133161879152 22.0133161879152 22.0133161879152 22.0133161879152 22.0133161879152 21.8598488002597 21.6983191741252 21.5358646173333 21.4254101189995 21.4073096684223 21.390132954873 21.3738784809268 21.370346002797 21.370346002797 21.370346002797 21.370346002797 21.370346002797 21.370346002797 21.370346002797
21.9631621531897 21.9891485386969 21.9157680260753 21.8433271880489 21.771824527867 21.8074491448922 21.8804440289796 21.952501637013 22.0133161879152 22.0133161879152 22.0133161879152 22.0133161879152 22.0133161879152 22.0133161879152 22.0133161879152 22.0133161879152 21.9051575257521 21.792166031758 21.6782498481218 21.5813399353347 21.5147030044786 21.4489895700955 21.3841981350998 21.370346002797 21.370346002797 21.370346002797 21.370346002797 21.370346002797 21.370346002797 21.370346002797
21.9316691710196 21.9721090399628 21.8501958011649 21.7292219920302 21.6091861161479 21.670071085864 21.7915991358533 21.9121901539354 22.0133161879152 22.0133161879152 22.0133161879152 22.0133161879152 22.0133161879152 22.0133161879152 22.0133161879152 22.0133161879152 21.9513929303318 21.8869385811058 21.8215597832351 21.7363463980125 21.6211739739787 21.5069248058802 21.3935973969711 21.370346002797 21.370346002797 21.370346002797 21.370346002797 21.370346002797 21.370346002797 21.370346002797
21.9011182728842 21.9541284437361 21.7836834653225 21.614177671658 21.445609566671 21.5336301049002 21.7036903341702 21.872813775662 22.0133161879152 22.0133161879152 22.0133161879152 22.0133161879152 22.0133161879152 22.0133161879152 22.0133161879152 22.0133161879152 21.9985547774489 21.9826365858711 21.9657941866285 21.8904297427988 21.7267228124354 21.5639388974864 21.4020765015468 21.370346002797 21.370346002797 21.370346002797 21.370346002797 21.370346002797 21.370346002797 21.370346002797
21.8979336321371 21.9496256872883 21.7705523349561 21.5914786870108 21.4124047437664 21.5073615000571 21.6864360329579 21.8655108602156 22.0133161879152 22.0133161879152 22.0133161879152 22.0133161879152 22.0133161879152 22.0133161879152 22.0133161879152 22.0133161879152 22.0133161879152 22.0133161879152 22.0133161879152 21.9540754330367 21.8065025041713 21.6580080140993 21.508593459528 21.4545393048022 21.4234118074055 21.3932031829038 21.370346002797 21.370346002797 21.370346002797 21.370346002797
21.8996711554402 21.9478900064031 21.7688184965035 21.5897466910051 21.410674590222 21.5090898111257 21.6881625015362 21.8672354862894 22.0133161879152 22.0133161879152 22.0133161879152 22.0133161879152 22.0133161879152 22.0133161879152 22.0133161879152 22.0133161879152 22.0133161879152 22.0133161879152 22.0133161879152 21.972711401358 21.8736749562157 21.7737171900931 21.6728395993577 21.5886205624302 21.5089579927941 21.4302140566259 21.370346002797 21.370346002797 21.370346002797 21.370346002797
21.9014083825163 21.9461546214311 21.7670849536498 21.5880149902843 21.4089447316488 21.5108178275375 21.6898886757719 21.8689598183349 22.0133161879152 22.0133161879152 22.0133161879152 22.0133161879152 22.0133161879152 22.0133161879152 22.0133161879152 22.0133161879152 22.0133161879152 22.0133161879152 22.0133161879152 21.9922703973345 21.9417694491936 21.8903474202813 21.8380058066255 21.7217831012573 21.5935864458489 21.466308184499 21.370346002797 21.370346002797 21.370346002797 21.370346002797
21.9077890431438 21.9471425187042 21.7745011171099 21.6009206235352 21.4264025336341 21.527088284404 21.7001162182771 21.8740808465325 22.0133161879152 22.0133161879152 22.0133161879152 22.0133161879152 22.0133161879152 22.0133161879152 22.0133161879152 22.0133161879152 22.0133161879152 22.0133161879152 22.0133161879152 22.0127521852274 22.0107857476195 22.0078984694315 22.0040918463518 21.8540271559848 21.6772974010182 21.501485800718 21.370346002797 21.370346002797 21.370346002797 21.370346002797
21.9388430336744 21.9646206180487 21.840511551537 21.7154636379124 21.5894783724903 21.6640297459013 21.7885249051585 21.9139565147142 22.0133161879152 22.0133161879152 22.0133161879152 22.0133161879152 22.0133161879152 22.0133161879152 22.0133161879152 22.0133161879152 22.0133161879152 22.0133161879152 22.0133161879152 22.0133161879152 22.0133161879152 22.0133161879152 22.0133161879152 21.8609864013878 21.6819139872104 21.5028412843855 21.370346002797 21.370346002797 21.370346002797 21.370346002797
