3.220615602790218190e+01 4.816798263844181349e+01 4.197393153757955986e+01 5.314545562047871385e+01 4.025016756543663377e+01 8.857651224935052880e+01 8.719018232178383698e+01 2.327787882968948736e+02 4.241145056703044816e+02 1.940518989690147862e+02 9.197060624967700448e+01 2.108353617818551839e+01 1.250176047087153997e+01 4.787349250810959234e+01 5.760421177505956791e+01 1.315704589389622470e+01 4.914243868721693076e+01 9.180342397488412587e+01 8.933077377945211595e+01 3.349409130901319998e+01 2.700861020624026310e+01 3.937151493320908191e+00 3.072986971240741827e+00 1.232026852643734571e+01 2.408547355552401115e+01 1.913035497889161363e+01 8.988300028446206014e+00 7.969167336685196723e-01 7.595192652639641828e-01 9.544427813089941814e-01
2.472927122663916322e+01 5.381902027534410138e+01 9.648430458800905285e+01 7.603576628410340277e+01 5.334030041805162625e+01 2.428988225308256119e+02 1.197924383383614213e+02 1.453535051088375383e+02 9.537197019181559199e+01 8.174972929318698789e+01 6.220381801347001272e+01 1.254542331985342685e+01 1.698045409606689304e+01 3.983822998767428203e+01 5.713433669303883278e+01 3.807512467553024038e+01 5.004804830546790839e+01 1.755145536208476642e+02 1.432319541589401695e+02 4.630015361266629270e+01 1.668413384912999220e+01 3.785779743335109693e+00 8.043092054097291665e+00 7.198214550912882537e+00 6.417737879216419472e+00 8.737476460017751023e+00 3.168869454361426641e+00 8.138743106306449704e-01 1.150908534279575290e+00 1.146349020441140176e+00
2.940322757912536531e+02 2.853883449363037244e+02 5.928846724298567779e+02 4.682307322610995470e+02 1.031984486273938955e+03 1.091661507120756056e+02 2.187446083247664319e+01 2.345495066855606581e+01 3.853418765525225922e+02 1.168980797075960538e+02 3.246046766944817250e+02 2.230589600718668066e+02 8.394997744791770344e+01 1.260516536843041706e+02 2.467143864435234235e+01 1.072540892514341238e+02 7.647614514838963373e+01 1.689675923327590965e+02 6.120903243417594695e+02 1.101468835665683059e+02 1.071655014764385072e+01 3.165002336286838691e+00 4.923903777784926383e+00 1.753375330796687726e+00 1.067387024567174825e+00 7.269594059779863615e-01 6.674577918048106850e-01 5.167546811321727107e-01 8.600204373920892209e-01 9.556912806892426948e-01
1.392057082284000842e+02 3.763049881309466400e+02 8.106235568442560862e+02 6.386054589235212688e+02 2.786329532602468930e+02 4.495859662351200825e+01 3.760259355909687429e+01 2.522670641266609692e+01 1.535622035239702399e+01 1.388014538472556865e+02 8.927428893431586232e+01 1.847564473625816959e+02 8.808928154760803864e+01 6.102805478951735552e+01 1.847676942571592562e+01 1.454181269066457105e+01 3.190228413328873813e+01 6.310856926705844216e+01 4.792823743458966845e+01 4.357345894994884361e+01 2.040249404935876498e+01 7.157875464632190265e+00 2.290464691425615040e+00 4.513129987392302311e+00 8.613018474277975844e-01 6.517730387975392281e-01 5.742538560936225611e-01 5.299640488330819021e-01 1.032845448397401000e+00 1.113484121746683986e+00
8.487628389461281131e+01 2.527336408682408830e+02 6.863811005171454553e+02 2.665862409924894791e+02 1.631988535747071012e+02 2.440238098979675385e+01 3.720671295865896155e+01 2.062551063638106186e+01 9.433050941913162291e+00 3.166720548472292194e+02 3.831488033698431082e+02 3.419793610591386255e+02 5.316175119356705636e+01 4.573729422563149427e+01 2.210943200048424373e+01 8.436549128638230144e+00 9.382921707812914747e+01 5.595944038603252579e+01 9.431305093947983664e+01 5.633955433566731585e+01 4.038159500500981380e+01 1.167513624721445531e+01 2.656312230335314695e+01 7.431759111193997569e+00 1.520251878510089139e+00 8.496043040187207795e-01 6.045802004970771693e-01 6.846326847766395218e-01 1.031137096554805010e+00 3.776803964530836222e+00
8.817491821635533711e+01 9.449666694861043936e+01 4.156151415736540002e+02 3.317063949696666896e+02 1.358171680185110120e+02 1.439129535378772751e+01 1.721762673421468648e+01 1.816862830060063771e+01 1.658825033547847383e+01 4.806863094527874409e+02 3.642281754990630134e+02 1.989231012222006143e+02 2.367138126898575479e+01 7.380269784600324456e+00 5.752760018050006252e+00 9.626059313916609739e+00 5.146929544029067927e+01 1.368831822637448425e+01 4.558378994122591621e+01 1.615536310627292096e+02 2.062922723700735901e+02 1.283807159343259059e+02 3.343191671086916728e+01 4.406186765174081366e+00 2.236026438764407764e+00 2.180813076823178598e+00 1.387440453552652109e+00 9.390279130658764073e-01 1.192948429053795278e+00 2.149277032731621073e+00
1.240885579495630076e+01 2.055752748705307198e+01 2.175145250345436310e+01 1.102950548268107696e+02 5.305541159644452875e+01 8.675112422457935679e+01 1.282177604149217132e+02 7.153149438743390931e+01 8.281057209487434534e+01 9.382044837252254865e+01 7.073313846974076569e+01 2.965468668786016337e+01 1.230978769592136857e+01 4.910314973252932091e+00 2.640446771951955540e+00 4.803679729903063134e+00 2.864686445528277403e+01 1.368568765128959797e+01 7.072806655075105198e+01 9.857912466540915375e+01 4.780581356715889285e+01 1.202700317673004093e+01 4.931083499979537876e+00 3.946840832040928504e+00 1.502833981334682711e+00 1.592783328704748147e+00 1.421020240122559786e+00 1.215052827752940212e+00 1.364464072233966485e+00 3.254726466505546423e+00
2.585832329962715548e+01 4.897644937932308551e+01 2.888859635284185501e+01 6.287674850957935746e+01 9.681565809733191941e+01 1.068814343256602086e+02 9.297419359760721136e+01 8.669085833678821018e+01 6.935482076354756487e+01 3.847992669181162739e+01 1.536092225281550583e+01 4.718390105143066648e+01 1.007176614580540708e+01 3.378055538911105771e+00 3.489123317666821489e+00 6.506767656675751077e+00 5.492038614463170632e+01 8.979891163300302992e+01 8.085670474425103293e+01 5.934482259363755219e+01 1.707919427650507060e+01 8.416666800648709312e+00 2.959120332842482437e+00 2.357431248184283401e+00 1.131031207482342538e+00 1.212822183186387015e+00 1.902959581720810700e+00 2.374346310296266971e+00 2.355451236601744824e+00 6.938577599605801893e+00
6.636483408741931100e+01 4.398947607058759246e+01 2.623679159913925929e+01 1.540324820073387571e+02 1.019635037783345695e+02 4.285242533047396307e+01 1.375621289207770701e+02 6.123168157216514373e+01 5.114534977916808600e+01 5.009134267203116053e+01 4.441931102502466899e+01 5.836891062370152383e+01 1.270353096586509025e+02 8.291114614110554726e+01 1.234163012110684576e+01 1.127419856066038051e+01 5.019355264180953213e+01 1.573560609347902641e+02 1.608395770790329209e+02 2.801366912111007679e+01 4.639421532535057402e+00 3.739196186733135363e+00 3.673264351105018921e+00 2.297521108770276044e+00 1.345071254928292603e+00 2.095583211993541806e+00 7.955960521739445568e+00 1.597477780491092858e+01 4.610114310272251714e+01 2.282499574011532673e+01
1.084398797641511862e+02 6.960572904715064624e+01 1.136975812505062180e+02 1.073750454801818819e+02 9.864134370702231536e+01 1.966809971114862421e+01 9.069153414904803867e+01 3.827133628715454705e+01 1.602674267626040105e+01 5.967461253303091517e+00 8.699820752929224454e+01 8.446348766701038357e+01 1.771120301841774847e+02 1.881551321615471011e+02 8.832356014629920082e+01 9.501790248521496096e+01 5.231511870544370595e+02 5.647455457269245471e+02 2.378846076959566176e+02 1.118261286698449624e+02 5.762217293672689422e+00 2.845303384704128025e+00 3.022125135317816902e+00 3.215804056389445442e+00 1.763281546761399587e+00 2.284769195278131715e+00 2.162328410016312574e+01 3.708312390643511236e+01 4.622523484307085084e+01 1.216678181561781180e+01
9.111794853140290229e+01 4.682570341169113703e+01 1.067106769497906100e+02 9.147899518932935337e+01 1.232003255723159896e+02 1.144685538891434362e+01 9.550056265818755108e+00 8.259702836708799012e+00 5.158461226069675831e+00 4.596279789720422571e+01 7.150567845875730200e+02 1.183011066573517837e+03 2.401428284703658392e+03 1.148604658296640082e+03 2.058877533000057269e+02 3.888633389665999971e+02 7.287945359468999413e+02 2.111934368772818971e+02 5.313282082884691704e+01 1.115924062586997856e+01 3.935447460177119439e+00 2.824793549092867728e+00 3.456026759714028174e+00 4.749800250511119870e+00 4.998682643273628656e+00 2.700879339518867273e+00 4.273251379426356245e+00 3.422657387933882855e+00 3.066131685543912244e+00 2.200671335277672114e+00
1.702494457393256155e+01 1.001947164678490410e+01 8.985773211707439145e+01 8.888861853177861860e+01 7.214321198018578229e+01 1.674662600091917852e+01 6.496129125627607692e+00 4.157130320483987340e+00 5.126140392746497909e+00 9.479476213440491961e+01 2.263855052910229233e+02 1.455008136462943185e+03 2.521323931935011387e+03 1.262326253608288653e+03 4.433448187081130527e+02 4.806452437810693255e+02 5.335595188141871859e+02 3.219010082345411092e+02 8.130021423652308954e+01 2.363120158985520192e+01 3.574115006623419077e+00 3.239846318348686971e+00 3.740591593846194662e+00 6.671562422593457775e+00 6.346522397162363660e+00 4.505597194288345264e+00 3.441278229700394320e+00 3.112728269305078399e+00 3.319726852602785883e+00 3.545738212443882986e+00
3.282754410399395972e+00 8.484127841016769978e+00 2.113485584232520154e+01 6.118657073815641922e+01 4.101951767563778617e+01 1.314971786666050590e+01 6.737587138632000539e+00 5.634983095830152777e+00 7.103164603569186220e+00 5.025928546028073640e+01 1.637294840062123669e+01 4.854848404545111293e+02 1.967291634699761971e+03 7.983767538877231118e+02 2.403158386334322358e+02 2.649103500127935718e+02 9.678807940026956658e+01 1.418740227809436192e+02 1.630017922698730501e+02 6.174720733048609134e+01 4.213835330044434890e+00 3.834456552098052473e+00 4.685718238357687859e+00 8.070071681934997798e+00 1.057650328222667646e+01 9.947287515710163674e+00 7.370768256496791793e+00 6.690283482796289150e+00 5.088096958844558593e+00 3.926949992050822402e+00
2.604632945547253442e+00 7.507013850073132488e+00 1.408095984405169254e+01 1.052929611725646986e+01 6.391657837759924021e+00 2.562815274192910664e+01 8.990215842042705674e+01 7.939871314622619991e+01 1.059469369783147386e+01 3.207864214526308100e+00 1.265062545474543043e+01 8.260780890363669471e+01 9.310099271999591792e+02 1.181460655696038430e+03 1.192572614036050709e+03 1.524154834686023150e+03 1.316759852213831437e+03 8.171151149305421768e+02 2.169289144830677287e+03 1.026229571589474745e+03 8.847718108684787808e+01 2.601996249249895854e+01 1.975965267518521529e+01 4.976095888739038742e+01 1.149018882652486013e+02 1.061791093737948302e+02 2.932268022004375325e+02 9.973565834464088198e+01 8.047223964485255010e+00 7.837560527896326512e+00
2.386504148206132214e+00 2.412435995728409388e+00 6.826625354198879059e+00 5.225319736111711677e+01 1.939072009696998578e+01 4.607827865795989020e+00 6.109096013796914804e+01 1.817529954180642164e+02 1.265454505960270097e+02 1.294068785270822985e+01 2.741435715192442402e+01 4.305860255952304669e+02 8.777898425651142134e+02 1.036934816116242018e+03 8.756700711595537996e+02 9.803851824587775354e+02 1.568586249476826424e+03 2.551346224949488715e+03 2.517948550690543925e+03 2.020158795984569224e+03 9.048904181875425934e+01 9.610563321142262794e+01 8.418571061395726929e+01 2.567095450057757944e+02 3.493095168121239453e+02 1.740360349073923771e+03 1.778635730653136307e+03 3.925732557215300176e+02 9.169760734781593925e+00 5.555134434017851675e+00
2.135874920600027593e+00 2.351981649214386572e+00 5.516240032164572149e+00 6.223584391325434950e+00 4.198496951614391293e+00 4.813160250079842051e+00 3.416373361654356700e+01 9.736089658375456679e+01 2.055430691674825425e+02 7.487560981034884833e+01 7.866577488914595051e+01 6.976068155221850020e+01 5.267878122458041616e+02 9.913215080491702338e+02 8.641832405887030291e+02 1.229263702787497550e+03 1.942052250277534768e+03 2.202867418367416576e+03 1.233061007355180209e+03 2.714164491399552617e+02 1.640952676640089010e+02 1.111070790406811511e+03 1.563677124033549262e+03 2.540435527087979153e+03 2.283980364406127592e+03 2.910580541791461656e+03 2.410647399032377962e+03 7.536968653912489344e+02 1.412025658257557126e+01 6.426280728216242188e+00
2.660421696555446580e+00 3.120888723763216355e+00 3.138821478793089703e+00 3.044007743172019165e+00 4.714897830264731304e+00 9.853577265684817732e+00 5.714589738469558142e+02 1.910053351968467723e+03 9.412178976172855300e+02 1.661279832463193316e+02 1.281277055678678209e+02 2.083031649816541631e+02 4.038970372949803505e+02 5.489824203143216437e+02 6.704998105504827208e+02 1.115528787064343760e+03 2.172522757791431104e+03 2.062415323444713067e+03 9.517158098592439046e+02 3.215627361704126201e+02 1.320236363331823441e+03 2.251737497596869161e+03 2.767432746980607590e+03 2.749782958527840037e+03 2.369180395299026713e+03 2.044565591996313970e+03 3.136925091989905468e+03 5.866783600879997493e+02 2.064483512497110951e+01 8.816466933795826577e+00
6.543903905976152124e+00 5.223875748550746323e+00 2.764310273475855340e+00 4.412651183984622527e+00 5.865982783369012310e+01 2.952816349558349884e+02 1.619988077185960719e+03 1.309357638673686552e+03 1.296282275018026212e+03 6.732798859165617387e+02 2.585835281400354688e+02 7.405961953585432411e+01 7.153823827002426583e+01 1.686329189772879431e+02 3.488852390149864959e+02 1.488522621369055287e+03 1.434466359769702649e+03 1.571662740228538496e+03 2.609791513629080555e+02 4.392421812770558063e+02 1.434737559079229413e+03 2.874090882704097567e+03 3.388143098311442373e+03 3.413684365568892190e+03 2.819939932290098113e+03 2.755113874132496676e+03 2.670523917678782709e+03 2.192329231510038426e+03 1.045448032450798905e+02 7.076762205033533348e+01
2.976252047594932115e+00 8.374953459317758586e+00 1.579838483662626913e+01 1.126484710206778175e+02 2.602463687026908019e+02 3.684646454425547404e+02 1.147593352628290404e+03 1.418503233778325466e+03 9.777167143922050627e+02 7.780787838378803372e+02 1.688588252300876889e+02 1.718680717027974225e+01 2.549333716061436306e+01 6.633590833992802516e+01 1.331690914760213218e+02 7.315134050267923840e+02 2.593697466575716248e+02 7.805452499164017865e+01 2.467801989489494829e+01 1.694905555684445346e+02 5.738723256935617201e+02 2.786536859993073449e+03 3.322984812017911281e+03 3.370889316686622806e+03 2.447673273745290317e+03 1.141460436389216738e+03 1.885548230455714020e+03 1.336947837073543496e+03 1.274668479503572485e+02 5.273056117549337785e+01
7.685013491197636881e+01 1.021935793673675050e+02 7.100036434026023358e+01 9.197117011757561045e+01 2.279357129324272364e+02 1.319511405750768347e+02 6.754599947907289561e+02 8.658789230291429249e+02 8.000609461270853444e+02 1.900835932314332126e+02 4.825537579465716931e+01 1.031018038387547797e+01 1.748460081615138861e+01 4.804928083624913882e+01 1.779838528402744373e+02 1.122745699323821782e+02 1.914060833331949993e+02 5.309763219430634251e+01 9.346906647089898001e+01 4.117966877432074853e+02 1.939456471803696559e+03 3.359707819369116351e+03 3.384420315455650780e+03 3.096965781657222124e+03 2.333774495983855104e+03 1.697282199028762761e+03 1.661463370732095882e+03 1.153751488862712449e+03 1.091936378558536944e+02 4.014528578530648417e+01
2.265068744260600226e+02 2.170321410850308439e+02 1.182051314299317397e+02 9.051170332667948060e+01 1.259907269640758329e+02 6.868055046537493524e+01 3.909427063459079932e+02 3.487070647160127805e+02 9.601289850422452332e+01 5.135393301131715305e+01 1.746070071030680282e+01 1.371967703572380159e+01 7.976341112865238614e+00 4.232968531482121044e+00 1.054128774942239133e+01 3.410029022608110694e+01 1.135298635404410561e+02 2.423619223146794184e+02 2.188500629160958511e+02 9.049816115076657752e+02 2.192063061641672448e+03 2.922430513194778541e+03 1.117924959107876020e+03 1.586268726064701468e+03 1.957084534671132587e+03 1.077130649778571069e+03 8.040956414785872539e+02 6.814083593061241118e+02 2.597820244418091562e+01 2.367193937457979658e+01
1.879145062179942727e+02 2.266395396910614579e+02 3.573128182532159514e+01 2.654818406459003555e+01 2.350581355796343530e+01 3.589092889079795157e+01 5.149210576735601563e+01 1.293202373173350850e+01 1.681061032459759375e+01 2.602841087912465490e+00 3.376462110827793239e+00 5.093730458406760420e+00 5.531219962880086882e+00 1.915891826325966463e+01 5.239018659380622012e+01 6.561820917539164384e+02 1.165307508748519012e+03 1.576504852999919649e+03 1.005529492293723933e+03 7.038003510629305310e+02 4.557393464572446646e+02 1.531276353524212368e+02 5.515653926413774855e+01 1.087295761039093094e+02 3.691655801277466935e+02 1.201881396751667523e+02 1.118291586561625337e+02 3.878835973552198624e+01 4.441082584563678992e+00 3.630437118591481660e+00
4.006407535140970708e+02 3.213139795160641938e+02 3.690711714359857609e+01 1.697249404864107447e+01 2.663002636395888345e+01 2.126442665964315637e+01 3.310972314530972938e+01 3.566963970227615910e+00 3.016060119691673869e+00 1.294947371532528368e+00 3.047139135193559500e+00 5.721767993490862736e+00 7.493003803483624381e+00 3.937124448271154620e+01 6.282343432517103565e+01 3.813688658864552963e+02 1.293164956365822036e+03 2.239272988537416950e+03 2.343517991019974033e+03 1.925569630221751595e+03 3.882643888559449010e+02 8.098260637149728325e+01 9.381871265527703940e+01 2.094758494846755923e+02 4.370330877781228764e+02 1.226469093370244821e+02 4.797181122457250524e+01 1.849312356830012405e+01 5.805626650941297484e+00 5.195814414148898663e+00
5.094424418303173070e+02 6.719650164251386570e+01 1.954029216594554441e+01 6.757449217177495804e+00 8.154540894795594852e+00 1.824687552064116147e+01 2.375427733741444314e+01 2.681496988542205084e+00 1.485276094294620375e+00 1.703414906509740145e+00 2.995893392831494584e+00 5.081194504018526459e+00 5.671876709551261442e+00 3.072851791964021118e+01 1.168273234700574363e+02 5.488993325943680475e+02 9.870036933146448064e+02 2.123579796370167060e+03 2.477679113042489007e+03 1.974648451656094494e+03 9.307781859832540476e+02 5.023788411478561500e+01 3.343664537896651723e+01 6.735557900211223625e+01 3.653091705732499008e+02 2.036134194458184368e+02 1.814265333583745416e+02 3.450900047776977431e+01 5.244649061226082765e+00 3.996334899391068785e+00
2.914227555321481304e+02 9.276112901724275162e+01 3.735032054087200493e+01 3.635814112659569730e+01 8.560981255251456901e+01 5.996801870779533061e+01 2.512217903311858436e+01 1.041065584095846752e+01 1.570557094943825049e+01 2.027345059381985948e+01 1.873657085550013424e+00 2.097621069940845295e+00 3.229617216187270046e+00 7.183367965749104300e+00 4.262768587181390956e+01 1.703941526921678360e+02 1.604939998403360164e+02 6.446606343493516533e+02 7.799914813704078824e+02 6.313188397888886811e+02 4.962090390332871266e+02 6.021745905895112827e+01 8.746559769951891994e+00 1.656533365632372679e+01 7.046610093745691472e+01 1.654159766824716939e+02 4.370404181582658794e+02 2.438609610892917203e+02 6.302651022040998363e+00 4.704608160888223978e+00
1.049162842680993322e+02 4.274215267904685334e+01 4.717985689266455296e+01 8.299773728438717058e+01 4.803281199304994686e+01 2.205560189212621935e+01 1.026894752346138695e+01 7.308844677599513062e+00 2.332487894109328863e+01 8.946449492286545535e+01 6.036579388214759589e+00 2.067138347748109339e+00 3.454231700647990344e+00 7.448414561680952062e+00 3.474852842620543214e+01 6.118868225677817207e+01 3.968533866880468963e+01 1.863346098031495046e+01 2.793562446584008185e+01 4.845737305978276055e+01 8.207868984183082262e+01 1.790948197613279902e+01 8.866729813431247109e+00 4.464893981379036347e+01 1.069366560479013799e+02 3.604984078952309545e+01 1.208202356149901533e+02 1.322206257029633889e+02 4.789481838280646997e+01 7.250726173655007045e+00
1.064032212007307976e+02 8.771211357146322030e+01 4.416835523862903301e+01 3.381805270762635018e+01 3.335924370167421671e+01 1.282471002374742142e+01 8.577462869864710626e+00 8.902140761273667380e+00 9.906988925063725304e+00 3.916659513468200515e+01 1.095307831134582699e+01 1.032153759359909451e+01 9.626636013592383634e+00 1.179650651406490880e+01 3.367272553283847714e+01 2.330038123883009860e+01 1.543970061440561814e+01 9.080231192827667996e+00 7.861542609666770431e+00 5.941104460961909695e+00 4.667981677400302232e+00 6.735635439962507576e+00 1.058968489093048859e+01 2.628733958185533481e+01 4.591207204884329229e+01 2.188752104095446782e+01 3.472737618155381512e+01 2.209787160684797414e+01 2.197149970799322105e+01 1.400183705426572089e+01
1.441964678901285311e+02 7.724522832093254010e+01 4.541541168064280498e+01 6.489093868045779345e+01 6.042405026209031860e+01 3.357988386200462116e+01 1.161290703523140451e+02 8.923519836641153802e+01 1.333326265412934397e+01 9.577732203756182727e+00 3.382578976928033221e+00 7.697511739735267255e+00 2.258570051028070225e+01 2.471078049880126670e+01 7.586426051991007569e+01 5.668201261080568543e+01 1.762258797227849882e+01 2.061522029823567692e+01 9.394740549428121312e+00 4.040640865056531084e+00 3.646224217020593628e+00 5.529891053338827689e+00 8.544393591272694266e+00 2.687814081335450922e+01 2.784734894821544771e+01 6.712019278177123738e+00 7.479134190109165914e+00 9.402038197113368412e+00 2.973209627215935313e+01 6.133542248891455273e+00
1.935922106628812571e+02 1.721473040532957839e+02 5.400037747827875023e+01 1.933188919974888336e+02 2.375625170560153379e+02 4.581230089520389583e+02 3.126191714266196868e+02 3.610109604091512381e+01 1.317346322533131087e+01 7.534985729299819468e+00 2.203425159721783544e+00 2.728277333107423708e+00 3.382773754991807102e+00 1.352195726823521049e+01 1.699199317783571672e+01 7.691916267100993743e+00 7.410239730887201226e+00 8.767768000811098972e+00 1.174659370448774887e+01 6.344107393747932200e+00 3.439774527882382138e+00 4.656966829218900372e+00 5.216070122698604372e+00 9.020763317938872206e+00 2.907329094790345536e+01 4.660097818092904909e+00 6.793813936463838132e+00 1.099890620157758292e+01 1.280426752332661877e+01 2.584889090127172295e+01
1.061363682100841288e+02 2.718636569362784599e+02 8.430985298464256061e+01 9.477840669225639658e+01 4.845423966621519298e+02 5.255884550876637604e+02 3.583652395700138982e+02 2.522170995310463582e+01 1.804875202794101341e+01 1.681008710551664365e+01 6.811407961382892395e+00 3.333497430458225885e+00 2.127812154181837556e+00 3.743543913985385885e+00 1.808832868164057572e+01 5.321424332849251648e+00 1.867762556914351535e+01 1.094821552689013089e+02 1.881936231979537979e+02 2.586437200947437987e+01 5.047932968173155288e+00 6.371279902053864852e+00 5.405520076595911050e+00 6.107041625910101246e+00 8.329205025802993489e+00 6.506103961782195633e+00 7.720545352906811765e+00 9.465511053748667081e+00 1.228852836448856678e+01 3.061615086245115691e+01
