2.475043685105721147e-02 3.659761755384555865e-02 3.194115296850957852e-02 4.037532176830167796e-02 3.077231383324112446e-02 6.772103132497078737e-02 6.759020270895987892e-02 1.840617605935852275e-01 3.352344022007749391e-01 1.520221772871821198e-01 7.087398441527859028e-02 1.631229368437659560e-02 9.668111177277276258e-03 3.639661387706379786e-02 4.262740883303164918e-02 9.398794883611999787e-03 3.306187313909412367e-02 5.786448336755852656e-02 5.230341948538706764e-02 1.836005640526638602e-02 1.466660993890746972e-02 2.197334353029001437e-03 4.879817017567252696e-02 6.541927093301215176e-03 1.171919694889583460e-02 8.959796521364183503e-03 4.058608515347400178e-03 1.201194513123167093e-02 1.165102441870930101e-02 1.463272989517848399e-02
1.954386667883615744e-02 4.371373464561216504e-02 7.851529660922670906e-02 6.436796324669605274e-02 4.485457131290967320e-02 2.008423405337148027e-01 9.555926657587789086e-02 1.216796917427012958e-01 7.976211923493871370e-02 6.836763798930321767e-02 4.836379953281806643e-02 9.522026077225140619e-03 1.278114661133422127e-02 2.949432598140842854e-02 4.166097099925346325e-02 2.691089258799428396e-02 3.328590537536935817e-02 1.089490099966623216e-01 8.213756518602578771e-02 2.462915110187718221e-02 8.610369904730850663e-03 1.995750041442273352e-03 4.189131568672071690e-03 3.609003695588185092e-03 2.920038385653598700e-03 3.768676631068387968e-03 4.567284585578215012e-02 1.210887701203663784e-02 1.756723073663023216e-02 1.755444483536951900e-02
2.375455827777640527e-01 2.455953822174795909e-01 5.198287494187785462e-01 4.238025674243984797e-01 8.967266543885754615e-01 9.115652213588910924e-02 1.690643587763138861e-02 1.827469419661151631e-02 2.953701741721050378e-01 8.978301412856255770e-02 2.403858474491785968e-01 1.611126969813910237e-01 5.993177394739131886e-02 8.856250661647621647e-02 1.719923812960209158e-02 7.310426932108898823e-02 4.920284417270420763e-02 1.007239736115657924e-01 3.351843307035641262e-01 5.561013811931529716e-02 5.209308182748754665e-03 1.535681453324073270e-03 2.347256701157407997e-03 2.672074489072242751e-02 1.585275275261210579e-02 1.057815927119460861e-02 9.474975548381061111e-03 7.591702774494809951e-03 1.295763136075745586e-02 1.453012215985580516e-02
1.111927795991022316e-01 3.233467158451390211e-01 7.106680473819895205e-01 5.749940329958773688e-01 2.334007744280004459e-01 3.594810882087424303e-02 2.832382389930214114e-02 1.922064053670816813e-02 1.186777045311759871e-02 1.110946728025274111e-01 7.139430062418057610e-02 1.421547168481453738e-01 6.486924577242905721e-02 4.335184405400627911e-02 1.287326345729891686e-02 9.868319489038825457e-03 2.067797419374478932e-02 3.875118214106169912e-02 2.743133077707728129e-02 2.337180730219684532e-02 1.038362124122052879e-02 3.561736807558247946e-03 3.422304707985340810e-02 2.135480974062623459e-03 1.296630439589376883e-02 9.605511331949765155e-03 8.203484754620645955e-03 7.796292631325225410e-03 1.543273983880920526e-02 1.683083854681052469e-02
6.423423114112505883e-02 2.019607794016549107e-01 5.650359951065537789e-01 2.189458917255441284e-01 1.234731000817819307e-01 1.794906492243837984e-02 2.751788999531591326e-02 1.536592296636978341e-02 7.224174196609627757e-03 2.520490204119614774e-01 3.176048878335659964e-01 2.681322173150426647e-01 3.961277245934970853e-02 3.262468005223769646e-02 1.525018769696773191e-02 5.672941983614115426e-03 6.099402606456163362e-02 3.522415318019155028e-02 5.674547060603407633e-02 3.270322279868303345e-02 2.240451831765961216e-02 6.217445174274009549e-03 1.334611659957845621e-02 3.667630367245135192e-03 2.303622408499014437e-02 1.277638121634287922e-02 8.831256044369229646e-03 1.025204907624447347e-02 1.572893498054259154e-02 2.016219808307759351e-03
6.407567547085851745e-02 6.774067069723949119e-02 3.041813065509952896e-01 2.437942460996127825e-01 9.583370265362209373e-02 1.029574229072953255e-02 1.260588149940757539e-02 1.356239631948441202e-02 1.290489553739655217e-02 3.889255883923513624e-01 3.049338579950086614e-01 1.583454329770097035e-01 1.791830881049241014e-02 5.810155591738655478e-03 4.388789330205799047e-03 7.156539409730528108e-03 3.379634330854559138e-02 8.906628174814659044e-03 2.901726538712694203e-02 1.008550439893831918e-01 1.219413013869159179e-01 7.126896137581074930e-02 1.732725951740089060e-02 2.264519138069914436e-03 3.402399489688867629e-02 3.324056344135468966e-02 2.061021795202525736e-02 1.430225251610784537e-02 1.816398615756254289e-02 3.304321585675265571e-02
8.898615180176301306e-03 1.417809691137787362e-02 1.502022784417548704e-02 7.624037749741569003e-02 3.652347942921306545e-02 6.087327318390409192e-02 9.290636250918610228e-02 5.328939745784573578e-02 6.408510553223016604e-02 7.388782001452891268e-02 5.657206925008773091e-02 2.300147079286633464e-02 9.579072617893022445e-03 4.213383169343570649e-03 2.817162283289714048e-02 3.765132641972106144e-03 1.906919335005631891e-02 9.153634250741926257e-03 4.720458874370060676e-02 6.515943645025397413e-02 2.984426825811349951e-02 7.446710640777524405e-03 3.070128238842401679e-03 2.594974849282557366e-03 2.342050777423375016e-02 2.455615431155711015e-02 2.139731864188624752e-02 1.864246959496550227e-02 2.058383958080230863e-02 1.871048049725218890e-03
1.916348393606294095e-02 3.508342115171945996e-02 2.054990563374693366e-02 4.435159050517989421e-02 6.838009216185229888e-02 7.751926181468203614e-02 6.928864385978371343e-02 6.592127558423452327e-02 5.293690340969882391e-02 2.935527303369175542e-02 1.174611727264933750e-02 3.620728365559032491e-02 7.887980096074340489e-03 3.257657974550583896e-02 3.682836833602291110e-02 5.376834172669280390e-03 3.858034719747940877e-02 6.287878459181066304e-02 5.585654607120323772e-02 3.986148377560605471e-02 1.074482282907753689e-02 5.329071831611223789e-03 4.210086008838443555e-02 3.642403027779366614e-02 1.806887008834772226e-02 1.850603379719044372e-02 2.744205624017392875e-02 3.203501051285679441e-02 3.087478135524532319e-02 3.771002315051078836e-03
5.152465230175284905e-02 3.396615662563057941e-02 1.979416436087832326e-02 1.146823348828401867e-01 7.415373767302453623e-02 3.153198478042996966e-02 1.018987668957725690e-01 4.613239180121737198e-02 3.852270464275514561e-02 3.772215460929102815e-02 3.352118694737732385e-02 4.428284573520857581e-02 9.910187983197135675e-02 6.751436705590684040e-02 1.002792769968971487e-02 8.932258801054573580e-03 3.777801786452762711e-02 1.168376131889697633e-01 1.161828159376021297e-01 1.931617210811049923e-02 3.354179930782214859e-03 3.168436343043913757e-03 3.477220251200165320e-03 3.497190745871193995e-02 2.098241351250056466e-02 3.047461739692184507e-02 4.300775673893432113e-03 8.334274115677714825e-03 2.489031560438735927e-02 1.266844915809726968e-02
8.711852119178792320e-02 5.733331308734321979e-02 9.037258693001032350e-02 8.454458335038711470e-02 7.331385954785850367e-02 1.446755394887549659e-02 6.670911161440994108e-02 2.854745424720025668e-02 1.187815940982836840e-02 4.455342957435213733e-03 6.531183017867057961e-02 6.422408887089267604e-02 1.359776171302145842e-01 1.468082469149663838e-01 6.963687565001991375e-02 7.686862099064281639e-02 4.176834133981719432e-01 4.373201000847176667e-01 1.757146730052203398e-01 7.798652717905962817e-02 4.851117395530270271e-03 3.804864451887157023e-02 4.158034629481967975e-02 2.601829210872207664e-03 2.518812521356788778e-02 3.205496587486166699e-02 1.236105035808508432e-02 2.003373291952490615e-02 2.745385643067565357e-02 7.539493859091062587e-03
7.289856753979892523e-02 3.870943762091305640e-02 8.544346451708879908e-02 7.294115858594849011e-02 9.121711326807027675e-02 8.350471533467284171e-03 6.926281123284059454e-03 5.996149770370487117e-03 3.698057820294736904e-03 3.326367635684997215e-02 5.271365529667633165e-01 8.909288365949632471e-01 1.843073179612497947e+00 9.055996948697456750e-01 1.663381371718432034e-01 3.283603175305109811e-01 6.158125733436954352e-01 1.705987296359727790e-01 4.048245447818961396e-02 8.529070834815580954e-03 4.096905880605307936e-03 3.757847160251115426e-02 3.665955999084471659e-03 3.467727273646466473e-03 3.406078177650966737e-03 3.557637967686727576e-02 2.965503262244201590e-03 2.696991223835636803e-03 3.956696764223668894e-02 2.903508286916916398e-02
1.529145308819203353e-02 8.991939271036464981e-03 7.025788309916594643e-02 6.927188561704725189e-02 5.322486214613245809e-02 1.203727020329797143e-02 4.574796632645954618e-03 2.895045339891554308e-03 3.527035505735737556e-03 6.633639305094564398e-02 1.630175660118246550e-01 1.080750310449292373e+00 1.938715994074275972e+00 9.944168966395063869e-01 3.541435313360115633e-01 3.971212531206829155e-01 4.384886625025791185e-01 2.576978588619510679e-01 6.294337822469145416e-02 1.886532507618228494e-02 4.248603353085637913e-02 4.106543135540625250e-02 3.482156541727179748e-03 4.415968012718918950e-03 4.353370341125498144e-03 3.033048652221672498e-03 2.594956696268808493e-03 4.170153003804467906e-02 4.353333290957967644e-02 2.908007003094026984e-03
3.446511884836998135e-02 9.195215941064566190e-03 1.637075285362210239e-02 4.632703779660606730e-02 2.998147240918785233e-02 9.364909990073642249e-03 4.690475160073721145e-03 3.818673228332201963e-03 4.775185719887555316e-03 3.427177132320803621e-02 1.147110547771583097e-02 3.471251904861062942e-01 1.459452820385622740e+00 6.163827227294500499e-01 1.905402285475895074e-01 2.172420355376305512e-01 7.980591364796531251e-02 1.165739769835529849e-01 1.320015642920941423e-01 5.160867727373785740e-02 3.906722914722560343e-03 3.596332059322999899e-03 4.067019546041801895e-03 5.909135296900810616e-03 7.708894438886206880e-03 7.183003839986649985e-03 5.802396539038773282e-03 5.864102839015570071e-03 4.485330939012452910e-03 3.116644408604785869e-03
3.018870029014378287e-02 1.141079559487357016e-02 1.245425377906117168e-02 7.967190966508162428e-03 4.690333124404235700e-03 1.804989615047020157e-02 6.139412958350519423e-02 5.231150915086270337e-02 6.816218450105576698e-03 3.509869055651648750e-02 8.543744094419913546e-03 5.731126275486587290e-02 6.748812994709812996e-01 8.925472784337276089e-01 9.293258963622186286e-01 1.225703918394946523e+00 1.095023348820148845e+00 7.084403883332158758e-01 1.928670260022861349e+00 8.903337540467691769e-01 7.286267961264455972e-02 2.095465026151527646e-02 1.575646638218243523e-02 3.978355422941889236e-02 9.331506025141202143e-02 8.825097590012657978e-02 2.424787524279718998e-01 7.796617188188555148e-02 6.013509479822476238e-03 5.574718691027319775e-03
2.857770122137043289e-02 2.686190021687675372e-02 7.044774508740439707e-03 3.784601678987539741e-02 1.365057647846341753e-02 3.147692383962504697e-03 4.100060583937768094e-02 1.192738363316467459e-01 8.177261432758320403e-02 8.403430756118905262e-03 1.794407338731511883e-02 2.836256135157747549e-01 6.031162522775247448e-01 7.521690784568835220e-01 6.665877414629893805e-01 7.899760126483815759e-01 1.337131613803946628e+00 2.297856181225649053e+00 2.324184228077650793e+00 1.812954352933117352e+00 7.721111479357500862e-02 8.052908366324793010e-02 7.231010170955629035e-02 2.279870735180811181e-01 3.304780173861444070e-01 1.704110987765018459e+00 1.709381240944125135e+00 3.389766625115213095e-01 7.274511061700494538e-03 4.201397548239917817e-03
2.661882031748565719e-02 2.755741029612835541e-02 7.320847297413782956e-03 5.322863448500426628e-03 2.983371711548335296e-03 3.168226373495152022e-03 2.250970861534316164e-02 6.407322614888966150e-02 1.328468637977082978e-01 4.746798810963447079e-02 4.922499780021064031e-02 4.362930287238946797e-02 3.405444955311580091e-01 6.807464027946696916e-01 6.262173160344350897e-01 9.475170364370412157e-01 1.626409920638475004e+00 1.959026864149135960e+00 1.120677921564322554e+00 2.423695113323069972e-01 1.462516443193085380e-01 1.012194909764606798e+00 1.491439075546490134e+00 2.506879992391030765e+00 2.365582235433275393e+00 3.106305690485393178e+00 2.495288784013621086e+00 7.034632650352710126e-01 1.172532240808194133e-02 5.169181963467007687e-03
3.234893102683390059e-02 3.629689972382198898e-02 3.487929712935688986e-02 3.237764695598187997e-02 3.200277250330643437e-03 6.282102183159469708e-03 3.699762868236550206e-01 1.246696820341911094e+00 6.077285356219999102e-01 1.040959916513165551e-01 7.745797691973661803e-02 1.220339424018432317e-01 2.420719414537974012e-01 3.543295586952681653e-01 4.652999623773760862e-01 8.309060618367841711e-01 1.770588104915645333e+00 1.756513190890205856e+00 8.196404237554566485e-01 2.793297667409118112e-01 1.218065378724393799e+00 2.237490872296771460e+00 2.904404128432121368e+00 2.979229420053221222e+00 2.624011036176025158e+00 2.278220984487713707e+00 3.386362609027179449e+00 5.828654523298165691e-01 1.830570132845662362e-02 7.551354465011311280e-03
7.297758647730658715e-03 6.561705859722453960e-03 3.116250454295357852e-02 3.663756196312000293e-03 3.808869479163571464e-02 1.825367751928294036e-01 1.024610302357010116e+00 8.385431435829571178e-01 8.226794227534786064e-01 4.103851452818747525e-01 1.501240468982595333e-01 4.073392830342801446e-02 3.992618470746682469e-02 1.021021114370976313e-01 2.305167488442642632e-01 1.062364900479843666e+00 1.098730366820950266e+00 1.254476185682610101e+00 2.147805693771258628e-01 3.765293656587624382e-01 1.353327900289929442e+00 2.966093786467276949e+00 3.698817670756670672e+00 3.818316145471625234e+00 3.140519332166415101e+00 3.049142475863735324e+00 2.861211067167722000e+00 2.237682947774159992e+00 9.820446972028669397e-02 6.384528244325096691e-02
3.132651715204833043e-02 5.404272164984255319e-03 9.740606165070530773e-03 6.805408972084492358e-02 1.478192975373359974e-01 2.110299118599018864e-01 6.650590936574608536e-01 8.314164230794720556e-01 5.685797655958967356e-01 4.402577088870007760e-01 9.198011652506354885e-02 9.030900805024371508e-03 1.374709503103943055e-02 3.879219353048909968e-02 8.473400202616321319e-02 5.012956832100532445e-01 1.878261635578958311e-01 5.869908343474589119e-02 1.934140917490222156e-02 1.394655870069521353e-01 5.354114153306728241e-01 2.871887625370816988e+00 3.652693035783767250e+00 3.801294621208351376e+00 2.761438789938985838e+00 1.282867262121642371e+00 2.092546618113550139e+00 1.417216415889816172e+00 1.268097343315575942e-01 4.913790406963730595e-02
4.739355038862459041e-02 6.132209093736294692e-02 4.025378410347960761e-02 5.048143316952902193e-02 1.196188425362179758e-01 6.886277593408798858e-02 3.536155642365352847e-01 4.563617346839289324e-01 4.185547675099298148e-01 9.801178109038199970e-02 2.449308961560713038e-02 5.179237891518248711e-03 9.114434778950020188e-03 2.701036306066381329e-02 1.077254544604911296e-01 7.282394741165269803e-02 1.303535032205843935e-01 3.771426526713091837e-02 6.967793639148771312e-02 3.284479076451492507e-01 1.774675403543076513e+00 3.358223184381528892e+00 3.599117388450522981e+00 3.392821758537048815e+00 2.591160151129801470e+00 1.894293345269939755e+00 1.836433175067713863e+00 1.223277373468343532e+00 1.093408251677067816e-01 3.833552819704268838e-02
1.329562373630220617e-01 1.230239917367572933e-01 6.339527777217622562e-02 4.586083505317546660e-02 5.985626887083660835e-02 3.211301198681283664e-02 1.820821909439623854e-01 1.624758977559226381e-01 4.426445912279595302e-02 2.387173074971405198e-02 8.214428815430978997e-03 6.561566164376884079e-03 3.997289055721590760e-03 2.280544480729952608e-03 6.088897965156055136e-03 2.115301308180492570e-02 7.440293673239227468e-02 1.663555580371230691e-01 1.572398966790686525e-01 6.939397843320861403e-01 1.883135517458893515e+00 2.701220838868389151e+00 1.087717054336392319e+00 1.616998422239682931e+00 2.075602660327179105e+00 1.170664925698984726e+00 8.708313227119265365e-01 7.150221879410496584e-01 2.877773180172548892e-02 2.644322944599001440e-02
1.091491077935307918e-01 1.268950171513364977e-01 1.867634512207250880e-02 1.294941594843590504e-02 1.067383955996215224e-02 1.591008839598120200e-02 2.254993790491297695e-02 5.609078500638572246e-03 7.271023539308862915e-03 1.156886116209290003e-03 1.552600688019800321e-03 2.373778388932451348e-03 2.696642563367420819e-03 9.969839123198587921e-03 2.923130839592653213e-02 3.941564871735158126e-01 7.461356085151020778e-01 1.060435582316346936e+00 7.116467451385359855e-01 5.261241816561629259e-01 3.667458681401223330e-01 1.287999890799107761e-01 4.924718434934533678e-02 1.060753229792052998e-01 3.815248286706542924e-01 1.279655177222255302e-01 1.163208934188550148e-01 3.950709079030996496e-02 4.137863575299025043e-02 3.883343042872160200e-02
2.318270543683732532e-01 1.797674844970285069e-01 1.917334384624268945e-02 8.275194962077264682e-03 1.218323138124004397e-02 9.496808522429350460e-03 1.471448826026588649e-02 1.579141444037068234e-03 1.380800238675781999e-03 1.933493036901520398e-02 1.478181956860829573e-03 2.720184150236209381e-03 3.627896926942155223e-03 2.043876665982431728e-02 3.525740148935925522e-02 2.313417474419235953e-01 8.364439755276292798e-01 1.534433350470941093e+00 1.708271744722066554e+00 1.452104083603469986e+00 3.025295719525580296e-01 6.620845884124561265e-02 8.132912840135701760e-02 2.008049894377147149e-01 4.448312983594986392e-01 1.305693177887491119e-01 4.898332584839978909e-02 1.857555787674163711e-02 8.327506423650909637e-03 7.730215375219208485e-03
2.933604736780202060e-01 3.756797100472588496e-02 1.015903229643874521e-02 3.323703445044573143e-03 3.781159785688006057e-03 8.284599427976241381e-03 1.071917914001901256e-02 3.894381212639694279e-02 2.229378042308020891e-02 2.554899277836058386e-02 4.468619206699108587e-02 2.497415487590091791e-03 2.776719167991941514e-03 1.576568753154026364e-02 6.471025893022185060e-02 3.279435158163531705e-01 6.286086347368079474e-01 1.426937724378121386e+00 1.772226117084803487e+00 1.478784383635942223e+00 7.268046451519194484e-01 4.126788826705375668e-02 2.912392685472851850e-02 6.368120655321989065e-02 3.666952764461680614e-01 2.216290747635265013e-01 1.974484226659282970e-01 3.686224479302475932e-02 6.658613244945937523e-03 4.192037262328713459e-02
1.638978670969056806e-01 5.089460059930660252e-02 1.937830779590117222e-02 1.793310795534789476e-02 3.982870398876146856e-02 2.719660008415381025e-02 1.131304736018651225e-02 4.650722979480127577e-03 7.029069328560528379e-03 9.435684839481983666e-03 2.728558736525059369e-02 3.051787588564718393e-02 1.591116386375726393e-03 3.638108157658468018e-03 2.335967374499673538e-02 1.003109326441206928e-01 1.000542224271565861e-01 4.220129768061304798e-01 5.354155283692935141e-01 4.576637996420325760e-01 3.821332555634164851e-01 4.903044390650626583e-02 7.554755312784357246e-03 1.498163116414320470e-02 6.657440380994895934e-02 1.686666491379794630e-01 4.513581907777211577e-01 2.529206486083631633e-01 7.759777486758765927e-03 5.972914496159992606e-03
5.869756531558498192e-02 2.336913471954971122e-02 2.456803937256421544e-02 4.103709831893467136e-02 2.238165636878557130e-02 9.998418922687019039e-03 4.564296103522212308e-03 3.187812028214941605e-03 1.010807200725344357e-02 3.955152187241296746e-02 2.903948408842959867e-03 2.934830861345665703e-02 1.705991060281219704e-03 3.765673567355631423e-03 1.894017057968864354e-02 3.569126878072607228e-02 2.430184077700749123e-02 1.193999489977345778e-02 1.871046138865212899e-02 3.414407415434329851e-02 6.123755478450233769e-02 1.414491724101871531e-02 7.417603707162961045e-03 3.856591084848993989e-02 9.448187076090751313e-02 3.397946494448297883e-02 1.175229880015974393e-01 1.318428465254786741e-01 4.626223746199064485e-02 6.893947691001771523e-03
5.951129051367428507e-02 4.789415852407450519e-02 2.299196392431011871e-02 1.664910349730119171e-02 1.544543867124348324e-02 5.776098589823596557e-03 3.801702316596007342e-03 3.881336658985013680e-03 4.294099015372818476e-03 1.716979951990547579e-02 5.032873730801792553e-03 4.766154214292022372e-03 4.639419078653528664e-03 6.064011658685487458e-03 1.867922939056385068e-02 1.382864166218580534e-02 9.586595384979922779e-03 5.878996991670442859e-03 5.304974355128892066e-03 4.166000349423131487e-03 3.416551764800512293e-03 5.149681139643596736e-03 8.488828536249741138e-03 2.203477370688266060e-02 3.951796644079109272e-02 1.926122279400691376e-02 3.094164666316472426e-02 2.088475042126280989e-02 2.109239962950644823e-02 1.343587274138033708e-02
8.089527606104912616e-02 4.226684026478442352e-02 2.363992592055966929e-02 3.185387855994744472e-02 2.795149350969570665e-02 1.515436531828224034e-02 5.156869322910397069e-02 3.890688718781373789e-02 5.748913238019671273e-03 4.264438377744077940e-03 1.527933533572715073e-03 3.508057630361282458e-03 1.068899935403238091e-02 1.272217848959587665e-02 4.207244630023419807e-02 3.359947586260182695e-02 1.093442174580796893e-02 1.336084835081828917e-02 6.343336873500894646e-03 3.162620300799912857e-03 2.936940141826150947e-03 4.553862659660679046e-03 6.462178551539969791e-03 2.147954191944389385e-02 2.319906890651111941e-02 5.807141628812535934e-03 6.625896349557433389e-03 8.750516687651942183e-03 2.901469879045941169e-02 5.989637880745471259e-03
1.087634106884558249e-01 9.437099057495550170e-02 2.819076672224734431e-02 9.505783292065202172e-02 1.105190235598102894e-01 2.087073577561628923e-01 1.396984344061038552e-01 1.580771696772056284e-02 5.696342314971850757e-03 3.373232731631166555e-03 3.191176707720309175e-02 1.380587828868895355e-03 1.730485572003100624e-03 7.422764213003836889e-03 9.481874557963490893e-03 4.595727511375420279e-03 4.658893653726692459e-03 5.947715147624675625e-03 8.374557125590686643e-03 4.904081600447952015e-03 3.205554008185802078e-02 3.683187004990855912e-03 3.721392884925621945e-03 6.872850245891360885e-03 2.356642689898401713e-02 4.005637100068445977e-03 6.083759222325896623e-03 1.042246911161986631e-02 1.307325807936997666e-02 2.624403445023313838e-02
5.878520093547072445e-02 1.469848557799779964e-01 4.341269821409366597e-02 4.615235408791541760e-02 2.243443327523912401e-01 2.382819027816390489e-01 1.589637675494524338e-01 1.094642333371110415e-02 7.753400255901533172e-03 7.556024404723374333e-03 3.128520522769736439e-03 1.766765247866098742e-03 2.806845165008544501e-02 2.087829319504637404e-03 1.012070090997687320e-02 3.180825671662786125e-03 1.199126530286648111e-02 7.760998515119713059e-02 1.430260794499372823e-01 2.144442145062551430e-02 4.189759380427286392e-03 5.350317008080531303e-03 4.071806207843997952e-03 4.884643396356177190e-03 7.074844911471467150e-03 5.877147264745901517e-03 7.280781171884614239e-03 9.251831280688597656e-03 1.294665447048472598e-02 3.205610493874027495e-02
