2.096164308445684545e-03 3.041514353281894994e-03 2.693411376133977853e-03 3.461001859544334154e-03 2.655625551798546091e-03 5.866699340540015850e-03 5.810153112877801049e-03 1.571213999651417323e-02 2.862905651983767286e-02 1.307466736551687013e-02 6.200163375291874689e-03 1.437314622861527412e-03 8.457734952551443711e-04 3.106208456011670324e-03 3.572356163510480818e-03 7.771788015520054386e-04 2.714128355292745425e-03 4.696470868926503131e-03 4.211136091325487843e-03 1.468650585297252885e-03 1.180451524909273495e-03 1.659037695937289059e-02 1.289222851797031458e-02 5.006311980804438368e-04 8.938216251049378031e-04 6.440175998045662414e-04 2.730474474227759154e-04 2.863527293842560786e-03 2.735939184085614973e-03 3.445736109103183543e-03
1.625410273203146613e-03 3.504472121483969815e-03 6.371988177004254440e-03 5.215370858704947848e-03 3.656443676741557430e-03 1.650489321668967974e-02 7.914488107562076338e-03 9.899617096009220851e-03 6.486751186756536253e-03 5.579137999624291834e-03 4.039782921621497443e-03 8.008330673871113343e-04 1.071185128361686620e-03 2.448466252878536090e-03 3.409899291099829661e-03 2.199396744985512679e-03 2.702695551243971227e-03 8.736680148020896028e-03 6.539987096916197867e-03 1.958786480650642672e-03 6.991832136767114469e-04 1.580711474186630855e-02 3.269749348378531823e-04 2.727433613589250292e-04 2.169488631037549812e-04 2.613552618884320633e-04 1.092404934743677891e-02 2.846341337445773209e-03 4.080071892048681668e-03 4.115226799025624785e-03
1.954782949173125214e-02 1.908429117647980275e-02 4.042609019082112065e-02 3.263118664312918138e-02 6.984007732923773470e-02 7.176466961944132257e-03 1.360813570166565000e-03 1.461556191196764073e-03 2.375353176318242138e-02 7.279783201028819199e-03 1.977820053918064730e-02 1.324182427186564731e-02 4.906508358741790143e-03 7.299061246283879492e-03 1.411163150426679794e-03 6.030297320552749710e-03 4.020319029363689928e-03 8.149224842714922201e-03 2.694869890573010213e-02 4.476828832697037595e-03 4.294180313214642896e-04 1.309651044448149372e-02 2.024213379580115657e-02 6.959272437030383958e-03 4.000691195374793396e-03 2.562486271569151819e-03 2.207092294612064253e-03 1.757064530308227257e-03 2.999621053550035124e-03 3.411826404775981578e-03
9.077923635490814380e-03 2.482569394992311523e-02 5.456233415887529192e-02 4.372614525029654836e-02 1.813103718986882121e-02 2.836766403497534977e-03 2.302724694153214426e-03 1.556069438304598981e-03 9.646227769388472911e-04 9.091156135294408899e-03 5.892260863337096116e-03 1.186143763153010844e-02 5.417393038023732114e-03 3.663150235214411750e-03 1.083442285757031318e-03 8.306793266991182451e-04 1.721612202833933429e-03 3.178317094796708625e-03 2.243330969294108062e-03 1.906154145227402768e-03 8.653256926328660057e-04 2.934794799828614265e-04 9.462231377309386626e-03 1.802152065788259483e-02 3.261357876989444925e-03 2.333245810722377536e-03 1.940293832551379018e-03 1.844723723714538971e-03 3.695986107401782409e-03 4.088290466370467918e-03
5.267175590320779047e-03 1.559237387786878773e-02 4.341369783849846620e-02 1.681321638870070939e-02 9.714125657682658871e-03 1.436516316817948707e-03 2.252612487353378330e-03 1.280166638240912494e-03 6.007817275833851351e-04 2.124674923727102455e-02 2.683902911220783019e-02 2.330938830183577198e-02 3.471223405529008654e-03 2.879765260743127886e-03 1.340314325875785343e-03 4.915961847849243012e-04 5.235591644388806580e-03 2.979769987463660487e-03 4.777346784704075179e-03 2.711361215827583909e-03 1.853872969316669363e-03 5.099855392462985648e-04 1.101832027602127253e-03 2.813089367720699330e-04 5.876129271066041909e-03 3.138525712655350179e-03 2.133120693470448668e-03 2.485577890605235058e-03 3.845243062696582659e-03 1.444225789909781704e-02
5.276644264278692285e-03 5.294354338346816957e-03 2.368880507849904782e-02 1.893278290394549701e-02 7.526254570280275710e-03 8.197360719000155093e-04 1.027255570821562249e-03 1.130808345392155271e-03 1.082446449419688459e-03 3.331132871165076725e-02 2.646185154839178488e-02 1.423399351332320026e-02 1.631823011235165703e-03 4.843756516159385041e-04 2.577099145083512621e-02 5.679462113906190391e-04 2.949425128629633297e-03 7.650152007698169700e-04 2.476851201915106562e-03 8.459240939197344711e-03 1.015708418022881129e-02 5.928376542769075302e-03 1.444256895959214687e-03 1.794003380836251688e-02 8.814313130157376899e-03 8.303473849255428585e-03 5.100789725045169407e-03 3.550130928826022471e-03 4.629379746014257620e-03 8.545361079809557850e-03
7.374955580229827605e-04 1.127429053527532771e-03 1.189855583761288303e-03 6.022582709079397911e-03 2.883208342174327886e-03 4.872474638233940426e-03 7.618640502111456020e-03 4.473932351256358977e-03 5.456844446614201108e-03 6.487551545965326155e-03 5.089315783055784782e-03 2.141269663686906979e-03 8.828526582771204726e-04 2.216442039822071747e-02 1.178401533162196438e-02 2.117405567153186549e-02 1.687879367619459382e-03 7.994416996899844641e-04 4.083997178903630426e-03 5.545911878177712563e-03 2.503121379685939452e-03 5.836264108507278545e-04 2.067662619550756156e-02 1.620720588591371622e-02 6.036735604570276324e-03 6.242567533149766604e-03 5.431268581670487330e-03 4.774755556818415479e-03 5.500521095667097911e-03 1.343028958168374087e-02
1.638742313722919711e-03 2.939620422295616004e-03 1.715306359199497612e-03 3.691318429164857154e-03 5.638805662803622956e-03 6.404109936244965079e-03 5.793302819744558865e-03 5.572269787925091845e-03 4.562788596532999126e-03 2.613331082612414293e-03 1.072884234899788283e-03 3.379521786691765031e-03 7.222766272255026505e-04 1.550647054833342864e-02 1.598745117824837414e-02 4.198659747540629534e-04 3.465689316159531810e-03 5.554351582180190247e-03 4.892546204773575921e-03 3.472782371384004058e-03 9.316967830292485157e-04 4.266346687271929325e-04 1.256559476454015278e-02 9.828868079490746604e-03 4.633103979815722875e-03 4.873233068231169231e-03 7.503991604984393965e-03 9.596879468943296521e-03 9.743552665719929645e-03 2.990288080339476517e-04
4.455548708647370966e-03 2.885933580947818745e-03 1.689036088835471627e-03 9.769662937879154685e-03 6.325960435128824728e-03 2.688764493492257213e-03 8.762626030169895150e-03 3.965030018614595572e-03 3.358331198420518721e-03 3.381812707032699414e-03 3.073340756918585027e-03 4.123943710422855666e-03 9.047874441254452269e-03 5.853581363635619941e-03 8.610854407738978899e-04 7.757676029226458518e-04 3.366831455181011623e-03 1.024474604456618310e-02 1.014538395356371150e-02 1.697095810608221633e-03 2.078231622816260893e-02 1.640425399846700411e-02 1.577923219084163831e-02 9.714856997635986854e-03 5.611376377204296828e-03 8.618882644840142673e-03 2.987301657463551524e-04 6.458863893510838469e-04 1.997044783340800982e-03 1.055778435285918693e-03
7.627360985590567188e-03 4.943531410826765976e-03 7.904615376579335675e-03 7.358864347286818777e-03 6.445912281391767348e-03 1.270410213608843099e-03 5.898659562330195102e-03 2.502254871274575253e-03 1.045726524881308633e-03 2.736335554920779622e-02 5.928310059783979853e-03 5.849084992299497833e-03 1.245307891605248150e-02 1.342884119926838170e-02 6.377919870988043097e-03 6.913248574501013044e-03 3.699691850064142085e-02 3.847461663117902886e-02 1.555539718324635071e-02 6.973155471653773307e-03 2.606206056672871751e-02 1.261140057343231730e-02 1.311878565295418117e-02 1.377484865465991755e-02 7.482334839474059050e-03 9.602348924079280243e-03 8.820176559343492848e-04 1.621014383932832190e-03 2.153151465647654833e-03 6.009496131799158414e-04
6.451859220924847753e-03 3.356536906438371218e-03 7.518867249222530025e-03 6.402754182122809105e-03 8.145647974987893156e-03 7.453790737835890544e-04 6.213138521947070194e-04 5.332484664161001335e-04 2.342663145085793763e-02 2.989257784982201575e-03 4.738252954860291966e-02 7.961472535111482896e-02 1.650438455815454175e-01 8.112876131011928504e-02 1.490505472346474215e-02 2.879960538734657044e-02 5.350210844520531667e-02 1.489775659402561153e-02 3.592510758335404168e-03 7.234306229772954596e-04 1.800892699010521805e-02 1.270802464682128756e-02 1.526861092576326309e-02 2.077603704916342053e-02 2.174305889143401602e-02 1.168206341105054377e-02 1.841543433329242280e-02 1.502773495244173578e-02 1.370322545869812406e-02 9.995263223614846149e-03
1.193676161833500012e-03 6.976678697533122454e-04 6.183581492779038555e-03 6.083790843517915617e-03 4.758472814947059190e-03 1.084972508023631212e-03 2.845770266396328851e-02 1.838691527753080410e-02 2.287391510557221230e-02 5.906968568340220660e-03 1.441298113537680184e-02 9.444407219079895000e-02 1.689126069114443851e-01 8.679008759416750873e-02 3.110296781358700899e-02 3.453163661667338347e-02 3.822782998839248381e-02 2.278452773610428403e-02 5.676474414179585523e-03 1.616182945094369380e-03 1.660341065094695853e-02 1.488381805141834879e-02 1.698913034172996189e-02 3.985953079819154303e-04 3.711636591648077355e-04 2.030894486250879247e-02 1.550816807971332201e-02 1.420787820039090196e-02 1.533630117997303657e-02 1.655571466968454308e-02
1.475754264390527135e-02 5.813333177520728758e-04 1.438110047967428896e-03 4.109164110710807061e-03 2.698178833408957158e-03 8.429635252924199806e-04 4.188117748276865481e-04 2.449281982840443433e-02 4.098166841651916439e-04 2.985553065892287018e-03 9.981450439001597445e-04 3.026817271717071461e-02 1.259015470165144035e-01 5.279114337744501839e-02 1.630965338980408519e-02 1.846549989217416421e-02 6.855073942254068763e-03 1.016432049830943637e-02 1.171127078183842839e-02 4.434889345036815110e-03 1.983833787354085526e-02 1.795095825529092332e-02 2.180852835344668575e-02 5.431561103111804800e-04 7.083586430286252164e-04 6.595697871619720385e-04 4.826902712227396086e-04 3.167654525855939651e-02 2.426523862103648760e-02 1.883812923420509142e-02
1.171032599099940119e-02 5.045386271930617141e-04 9.464643528254335254e-04 7.022754793949522638e-04 2.762778161849648029e-02 1.622898582193811612e-03 5.435655895608667264e-03 4.555493349748644845e-03 5.765176214240909196e-04 1.386683311656853636e-02 7.358600296461282903e-04 4.922445142786744353e-03 5.712443815013913684e-02 7.505349529527741148e-02 7.803840512096771320e-02 1.025327022041325198e-01 9.288161393665765597e-02 6.081473789868362123e-02 1.676372729574384934e-01 7.918818262508980910e-02 6.640524467886483977e-03 1.946122070750478609e-03 1.468981874261009353e-03 3.728132103139387976e-03 8.701182172072658219e-03 8.166516249663939228e-03 2.248187540465536663e-02 7.471983137816095091e-03 5.881494010198098574e-04 5.518512545459165839e-04
1.052311760970785562e-02 1.058114791878484937e-02 4.387650133198661836e-04 3.336940529321529361e-03 1.219714391637858643e-03 1.970616336322414397e-02 3.603867139095328319e-03 1.029601938964094972e-02 6.886644104382470474e-03 7.164040347561860143e-04 1.542040637858597702e-03 2.447175974134094267e-02 5.110688301083771146e-02 6.279966709982456874e-02 5.508406264242680928e-02 6.465795865596526970e-02 1.110092351381207487e-01 1.938514456569907785e-01 2.001485506620149235e-01 1.609967002201739827e-01 7.022682663570428349e-03 7.474482442065685447e-03 6.697050015070536363e-03 2.119708350485967688e-02 3.057185178465048753e-02 1.569682866529680809e-01 1.584275354700269423e-01 3.255264604919370919e-02 7.180312911001514135e-04 2.782925889307704542e-02
9.213638836335639321e-03 1.008749693621734805e-02 2.366956879703913108e-02 2.667498930487601297e-02 1.794859381431116938e-02 2.050579226649214964e-02 1.959107364025803287e-03 5.439654187116336678e-03 1.118725894333946931e-02 4.071275772811817212e-03 4.266369800568502874e-03 3.751747113504079988e-03 2.886351547599624867e-02 5.687699681185421491e-02 5.171396038940484496e-02 7.704623625772111239e-02 1.338537473589082871e-01 1.646237362944054095e-01 9.694214228063621763e-02 2.168023684856841549e-02 1.330159666345381159e-02 9.308937341737752447e-02 1.374109465124555285e-01 2.325890283685250748e-01 2.190553140133268684e-01 2.863343275716097591e-01 2.318279530217596252e-01 6.740010166545337689e-02 1.155768910971804878e-03 3.250544210037995679e-02
1.119003554521300417e-02 1.305570482043533556e-02 1.323419192388040899e-02 1.289613959554562414e-02 2.003585188660044966e-02 5.516323657631869160e-04 3.165671946653858537e-02 1.041874797745136472e-01 5.039714611574383496e-02 8.792316951888531212e-03 6.655296230948130193e-03 1.053185680412399919e-02 2.070058076121409490e-02 2.970660556978280131e-02 3.813187478126356389e-02 6.650178941395125387e-02 1.439681472631667014e-01 1.478553504004245511e-01 7.170992119273293663e-02 2.523240336910640910e-02 1.107119113249654674e-01 2.036661189054304599e-01 2.653745168109156172e-01 2.750474360250540484e-01 2.434259485807798717e-01 2.114293679968880513e-01 3.151057614218748526e-01 5.551004633193139248e-02 1.774698948300013502e-03 7.427050264156901359e-04
3.649991042152935872e-04 2.138877786283045757e-02 1.147154245748921789e-02 1.848024415663801490e-02 3.129550582105993656e-03 1.563230208556500023e-02 8.535626573169056985e-02 6.816310305664913249e-02 6.627286283200213568e-02 3.394471363414371806e-02 1.272202722536021693e-02 3.499780718129622686e-03 3.420757139979592552e-03 8.594281053295956679e-03 1.882841268309941307e-02 8.440411418130322474e-02 8.933462710458608957e-02 1.065578294517229158e-01 1.895737348889753315e-02 3.420521199718598582e-02 1.233252247563272341e-01 2.709927387127433196e-01 3.408054991671355394e-01 3.569994374826431782e-01 2.966639497757761479e-01 2.868494651285731223e-01 2.674445509533748266e-01 2.120939493122467323e-01 9.416156826962399778e-03 6.211331275968392726e-03
1.224827488185681323e-02 4.460959039984758795e-04 8.282396433345251205e-04 5.757493771758064385e-03 1.282256020270340288e-02 1.782838812438274079e-02 5.487054903517014914e-02 6.659486107226036955e-02 4.486627278142168995e-02 3.551099322521819590e-02 7.598371319576502012e-03 7.577277895308766895e-04 1.156108707364014027e-03 3.234410229470512967e-03 6.941780171628648619e-03 4.053459020592081741e-02 1.563591842729486481e-02 5.102581555223495782e-03 1.738999928389308759e-03 1.275143218786865817e-02 4.843749350915919905e-02 2.580335901119706898e-01 3.280455705759737217e-01 3.475108607444662434e-01 2.572498175151502475e-01 1.205088471635151481e-01 1.966307756702608267e-01 1.349681521570245679e-01 1.217093680141437088e-02 4.804750908110244981e-03
4.158397229567765280e-03 5.303769793366401065e-03 3.545668480496783938e-03 4.386318501096372023e-03 1.030283948626029879e-02 5.778748966213297956e-03 2.888420469240612215e-02 3.600991032257541691e-02 3.235665763593399691e-02 7.732737868402712531e-03 1.968970973565056706e-03 4.211180302217726237e-04 7.471720946492940935e-04 2.228269300934609433e-03 8.909427393301080217e-03 6.034730944837980726e-03 1.115834636662199446e-02 3.346368023515962353e-03 6.342499376768599532e-03 2.996652445517107577e-02 1.584756600199424548e-01 2.963417115665774038e-01 3.153937299573290054e-01 3.043285405532627497e-01 2.386369096583179639e-01 1.782305012339001349e-01 1.752812506976199058e-01 1.181032723326697620e-01 1.063367084975835528e-02 3.785418334835702163e-03
1.198914106456509115e-02 1.090522768062750919e-02 5.595267556899546565e-03 4.001277647695714035e-03 5.158314925042021930e-03 2.684341691605916878e-03 1.472290850144405971e-02 1.259134214394337821e-02 3.339655709683072692e-03 1.836062825712663242e-03 6.404422724219753504e-04 5.145311495577350493e-04 3.180709628233347819e-04 1.734680605603140455e-02 5.026123958879983190e-04 1.759789145747842282e-03 6.346083981744504027e-03 1.461213000495316036e-02 1.417407488699321330e-02 6.284276831160919008e-02 1.664749312321923136e-01 2.353314438519650831e-01 9.368330171521313532e-02 1.432292851180770876e-01 1.903066547686010912e-01 1.107622570611296597e-01 8.453878217797552996e-02 6.943567904666131385e-02 2.545182415054010258e-03 2.300750133268154602e-03
9.777398128148054313e-03 1.117183410346339958e-02 1.640571324013164346e-03 1.125878490287962868e-03 9.130629084413087980e-04 1.320551430133004621e-03 1.813723823126328757e-03 4.336899457741727514e-04 5.411471773333097809e-04 9.879878530592099695e-03 1.288220218077440471e-02 1.824927918365189076e-04 2.125250426736027180e-04 8.115490055936097277e-04 2.429333211458659710e-03 3.308353310015826887e-02 6.352178385296861074e-02 9.249993873002382294e-02 6.354135657772796986e-02 4.754639110182123929e-02 3.262433167805583317e-02 1.133303272718895471e-02 4.253726136088138363e-03 9.336735785945949467e-03 3.491506394775957534e-02 1.219249573490850148e-02 1.155194474267244933e-02 3.906985928201911137e-03 2.377375461137855306e-02 1.945906518296145263e-02
2.052322559355912804e-02 1.566244161822448119e-02 1.679474114874853798e-03 7.149852632090713048e-04 1.031640279786076586e-03 7.836443132635273218e-04 1.173745598176030537e-03 1.366223997499150210e-02 1.148057516017343335e-02 4.957932419044448411e-03 1.173007180444072053e-02 2.073725760391370912e-04 2.905980555969748711e-04 1.678083317668160792e-03 2.927551104854725621e-03 1.932898069333726862e-02 7.080936958315017793e-02 1.329202352377708840e-01 1.516781566826785888e-01 1.319824413615059422e-01 2.774607207170721665e-02 6.101671108937908525e-03 7.419788449791788962e-03 1.834674100917686040e-02 4.172482698866087497e-02 1.257366810687588800e-02 4.925492314354825221e-03 1.865831710535783509e-03 3.123153373059771309e-02 2.813204878793036309e-02
2.539376671390061735e-02 3.198348370831714457e-03 8.756455191263039922e-04 2.819702392743105826e-04 3.140089452942632282e-04 6.714658709993730993e-04 8.448720812425859934e-04 1.029917305479471044e-02 5.691554483294850031e-03 6.568436821448694202e-03 1.162131268804087944e-02 1.851585166260865745e-04 2.207095854795031805e-04 1.310909670562919720e-03 5.435390421898367817e-03 2.771988391685776404e-02 5.393399882105682358e-02 1.250531765796330796e-01 1.584034978432161400e-01 1.351585113539647276e-01 6.770475038861110961e-02 3.902196082590574273e-03 2.758936884321828032e-03 5.998063464048625573e-03 3.492193196178019349e-02 2.115983981445244966e-02 1.932108448748743462e-02 3.672543742893170492e-03 2.815941288429275186e-02 2.180551102378149378e-02
1.401414597202705822e-02 4.283513085845794092e-03 1.639308501061250128e-03 1.498083222194620222e-03 3.258109578757882249e-03 2.192334958999616473e-03 8.930503115307635844e-04 3.583251196944325836e-04 5.277174841895894940e-04 7.023681146335551250e-04 7.314631426928068676e-03 8.241868005111714288e-03 1.288200888474396247e-02 3.050811422379600324e-04 1.967887488344837420e-03 8.498263087034465396e-03 8.692167451546307932e-03 3.768020210756334309e-02 4.891249554792189563e-02 4.272799767860685494e-02 3.656532493118186400e-02 4.792042049141775548e-03 7.455894584906630311e-04 1.457531420286171291e-03 6.461495140530807736e-03 1.618058241300105587e-02 4.375716739580499948e-02 2.495812977204133962e-02 3.384275977913221711e-02 2.582839593276074069e-02
5.013067767545583905e-03 1.962078416446916794e-03 2.061473843375335579e-03 3.408467398074736896e-03 1.821767221921473997e-03 8.048145217455814678e-04 3.648110688676013333e-04 2.516162378960374213e-04 7.848659925702337285e-04 3.103169441384091842e-03 2.149276271524519434e-04 8.135709959092705945e-03 1.379584860676741007e-02 3.158502290510176885e-04 1.599727621829546845e-03 3.035697806072270959e-03 2.140898921765866346e-03 1.085243442235714903e-03 1.745952129937491807e-03 3.253454204623276030e-03 5.941853258271906010e-03 1.389783147640906349e-03 7.331002677836668613e-04 3.773207053983715711e-03 9.236384370351636772e-03 3.289700333248843887e-03 1.142076867738299126e-02 1.299039621172497737e-02 4.677402772792577969e-03 3.989987504670111651e-02
5.082293458867480351e-03 4.024641225822313782e-03 1.928835101428102517e-03 1.387835022088993201e-03 1.264140764699988196e-03 4.678530112315412042e-04 3.046293993393655577e-04 3.063692171190074724e-04 3.334677659954605805e-04 1.358905667057652266e-03 3.900694731453983443e-04 3.761474567283165866e-04 3.740476437628873635e-04 5.006938290247138663e-04 1.551568563788591898e-03 1.156981899985498521e-03 8.336867387196316218e-04 5.292825500139008033e-04 4.917084672854803726e-04 2.882786422947083635e-02 2.290087558550776836e-02 3.339182495554322838e-02 8.165804992131710368e-04 2.108003455124462210e-03 3.815283236658756003e-03 1.881270678918895919e-03 3.078851486120535389e-03 2.081445824300198321e-03 2.129879892350623402e-03 1.385655612279363021e-03
6.885061188269796933e-03 3.542875098936410297e-03 1.982217839947001802e-03 2.661156685003696586e-03 2.287819960389816682e-03 1.224728155405172686e-03 4.123177466802777427e-03 3.070067737292233451e-03 4.489275714690308490e-04 3.323906927161166805e-04 1.322653792357294383e-02 2.805781329703308956e-04 8.783548730502781492e-04 1.049693898140161615e-03 3.498274641113882470e-03 2.816885714982612053e-03 9.523143368201855696e-04 1.202541333485133285e-03 5.880010157368767507e-04 1.956173908962300159e-02 1.775468972135881354e-02 2.708048084899452451e-02 6.092959345344958364e-04 2.027040989316660630e-03 2.223520824818967130e-03 3.426020167258608806e-02 3.870115630457314493e-02 8.725296130175988485e-04 2.907304305571815125e-03 3.366274318184772629e-02
9.249668265024057340e-03 7.902446711948132863e-03 2.358578961434755657e-03 7.934055934256799281e-03 9.008106320324745994e-03 1.674732579900415144e-02 1.112668057624885930e-02 1.245212877090049125e-03 4.449826417597109278e-04 2.622615313037774103e-04 8.619222159870616046e-03 1.074280124850873763e-02 1.352168945255959737e-02 5.756264617377832970e-04 7.848214342824624216e-04 3.827844041014548805e-04 4.008797404144926651e-04 5.180153796615890932e-04 7.496927237817350032e-04 4.136734156696908688e-04 1.661654311834075831e-02 2.250412544222488154e-02 2.521723823663713643e-02 6.382108873170884607e-04 2.237589643026289665e-03 2.371720695369172044e-02 3.516257540949143529e-02 1.029252804400070239e-03 1.286822182708635080e-03 2.642070581304491357e-03
5.096600502406225738e-03 1.256692234136238054e-02 3.707629175953161375e-03 3.921805570076031949e-03 1.866390514060040084e-02 1.959383880000297590e-02 1.304046623785158621e-02 8.936031655364801152e-04 6.295966799617820370e-04 6.057968734772993047e-04 2.530044699876103859e-04 1.319172964432623399e-02 8.558517935778473668e-03 1.537675552180661070e-02 8.697708096547687555e-04 2.269856004613127892e-02 1.066690129607239350e-03 6.921165167925945674e-03 1.304917619047673248e-02 1.839317728284977499e-03 2.475899961239609245e-02 3.124515351048359757e-02 2.650513006038419245e-02 3.042708980133473212e-02 6.807398753973378184e-04 3.355839318470120458e-02 4.050015990233866298e-02 9.242597694117411083e-04 1.290603319614000389e-03 3.268909280171254650e-03
