1.069457993047385341e-02 1.586186641086097943e-02 1.390856155457682701e-02 1.769948185246160086e-02 1.345160946223110734e-02 2.950909358276817412e-02 2.908527797719611535e-02 7.828123910539377950e-02 1.419612504197338976e-01 6.344928753826196977e-02 2.945463009283080108e-02 6.705981362342744098e-03 3.916658271884133208e-03 1.447583518837030660e-02 1.675925684677146907e-02 3.670413824347884199e-03 1.283520683158119804e-02 2.221210558541809876e-02 1.993110804895734806e-02 6.952153744341474720e-03 5.557015939495067031e-03 6.913785701035329856e-02 5.378658781972163461e-02 2.409676766436787219e-03 4.598551214301358110e-03 3.561994249267265867e-03 1.619912828644769383e-03 1.440396707946542225e-02 1.379373015642582599e-02 1.738194286633115357e-02
8.594702357805697468e-03 1.911668626234805379e-02 3.457785531546425650e-02 2.815344267109505527e-02 1.963440977660280487e-02 8.806475314605533011e-02 4.192034725728979727e-02 5.205100529191494796e-02 3.385579245809181015e-02 2.832529427149075088e-02 1.989772343893522061e-02 3.842346117017501547e-03 5.076463291412260451e-03 1.156137712373945040e-02 1.604687844353622564e-02 1.031761302102381615e-02 1.266389242807929201e-02 4.090593836451839049e-02 3.058935313671128087e-02 9.135288773888604330e-03 3.227039197297863066e-03 6.476357500439811066e-02 1.477673277371338665e-03 1.275403220594677981e-03 1.101046817387511898e-03 1.449305148125596982e-03 5.505611890634025396e-02 1.435787640379421193e-02 2.058423897729677252e-02 2.075321151393481195e-02
1.069001108695631086e-01 1.079668679772984030e-01 2.285929682517073291e-01 1.844085836376715415e-01 3.944216974622549166e-01 4.029893385208160178e-02 7.566816811727423639e-03 8.047232228420551220e-03 1.294946823649781309e-01 3.863588459210860748e-02 1.012274159536164925e-01 6.544931977133366940e-02 2.382515753606993802e-02 3.495313659539236312e-02 6.660080648621887617e-03 2.806634378674167235e-02 1.865334944341455817e-02 3.776364189263201748e-02 1.245057840963436774e-01 2.054462620308447618e-02 1.939711526876686156e-03 5.268189562596437003e-02 8.078160830490779820e-02 2.859563243161159646e-02 1.765025228309449051e-02 1.217757116433288399e-02 1.115364744394659394e-02 8.872627214656383932e-03 1.513519467052099228e-02 1.719969802898574027e-02
4.968529512049903174e-02 1.404521301081539941e-01 3.086904447402274432e-01 2.473857708430561853e-01 1.025792803794784019e-01 1.591489274989017766e-02 1.272648056458304359e-02 8.473849065038813189e-03 5.176914780086745542e-03 4.754301887839751384e-02 2.973511453137334115e-02 5.775754093938927775e-02 2.590868087826381574e-02 1.736455632366951454e-02 5.092674622587143457e-03 3.873681520805069122e-03 8.012078263930820510e-03 1.477681082406380984e-02 1.041184447481801993e-02 8.810730029643108405e-03 3.953139793168020458e-03 1.323064078841932212e-03 3.839808940124209147e-02 7.521870551475631772e-02 1.443655718663550136e-02 1.094691403977951678e-02 9.570633589969275087e-03 9.102527980405677663e-03 1.824169396148195982e-02 2.018014465444372893e-02
2.883920762713334737e-02 8.814422558348962433e-02 2.454209380871909540e-01 9.504711037852152378e-02 5.491553423924129540e-02 8.024577217867825962e-03 1.232506597195918985e-02 6.864400019983042667e-03 3.158769646588214033e-03 1.088539472736559932e-01 1.328402148669796112e-01 1.112509120425917708e-01 1.628868274216572348e-02 1.351851791832432356e-02 6.308061512440859067e-03 2.321683221011117126e-03 2.473180938006870264e-02 1.407012998200645945e-02 2.255584697139199207e-02 1.279429766458761372e-02 8.711068689162604350e-03 2.382851182604347508e-03 5.109395351891788360e-03 1.340446165391072711e-03 2.620971781833713807e-02 1.449301927271602446e-02 1.016484481861696515e-02 1.186399075241262313e-02 1.838025680074630019e-02 6.912452681454901715e-02
2.890108731351007446e-02 2.990662364394488376e-02 1.338137230706975545e-01 1.069485864936036423e-01 4.251502725487623507e-02 4.559102918564630381e-03 5.565027161293689510e-03 5.973042072442359858e-03 5.580221502315203981e-03 1.673316578493454498e-01 1.286058177582983519e-01 6.680148283872319737e-02 7.544097397610033048e-03 2.264393160659883362e-03 1.114296318173440131e-01 2.736476694065237848e-03 1.425166452940581675e-02 3.697077713095326713e-03 1.197954853394187641e-02 4.100553181528893143e-02 4.942292543276400468e-02 2.889237565586120354e-02 7.032751303145596579e-03 7.947716083196466885e-02 3.956858791412463244e-02 3.775958220560191037e-02 2.347992909802295095e-02 1.638916690900737994e-02 2.142871360515883478e-02 3.965850636200171642e-02
3.967740588065476505e-03 6.254425232206844987e-03 6.611369121421514089e-03 3.351527667590172010e-02 1.606806733872455026e-02 2.671017880006178527e-02 4.059832129308365428e-02 2.320329005459818156e-02 2.757245226960386431e-02 3.195639138631119897e-02 2.430721764577979671e-02 9.901174080954233334e-03 4.036359011433635069e-03 9.484590410828637463e-02 5.151497331344700309e-02 9.466976973719774813e-02 8.303916936143686603e-03 3.936627543188794993e-03 2.013923119373169437e-02 2.746267915639852633e-02 1.252559322133705959e-02 2.943864936626051053e-03 9.411194065760923599e-02 7.346969644788070575e-02 2.719067077173676489e-02 2.796319343891939466e-02 2.422696015486548726e-02 2.138408841149754339e-02 2.473067379479857580e-02 6.062232806601045021e-02
8.255355666375110285e-03 1.519285764422855303e-02 8.916446022069051194e-03 1.929515314927473385e-02 2.964573421067517867e-02 3.337019110984423137e-02 2.962447705524326805e-02 2.798223989018269048e-02 2.251507232111272377e-02 1.259594243713001854e-02 5.037500830955903355e-03 1.546221271674017017e-02 3.276158690213545541e-03 6.548017641472084205e-02 6.850346960056041823e-02 2.003920094760038538e-03 1.658739869181300244e-02 2.656043333025478320e-02 2.337902286562042881e-02 1.661355920634118369e-02 4.481424610900872768e-03 2.058804417416401807e-03 5.512150559044219633e-02 4.308612190851924401e-02 2.030350651823276814e-02 2.136280355069639786e-02 3.293936655315912732e-02 4.238604041517422816e-02 4.330430292672487330e-02 1.499795397997965261e-03
2.128456878133140606e-02 1.392592048794517000e-02 8.198686466070801912e-03 4.778604288350681711e-02 3.121563634635509538e-02 1.325703889391327897e-02 4.287797712973232672e-02 1.926903870598319773e-02 1.620473382920834676e-02 1.598344564335914958e-02 1.422068879222302545e-02 1.872479785372916511e-02 4.082927328531328615e-02 2.666472753919672117e-02 3.970509761330090655e-03 3.626899897704702943e-03 1.573893831657092318e-02 4.773361758135716282e-02 4.710513586469424613e-02 7.857635726724149575e-03 8.798259832648493151e-02 6.944939389576031130e-02 6.671069645572511031e-02 4.120709156093427944e-02 2.395293900975656656e-02 3.702421274404435469e-02 1.436591430912617087e-03 3.134881897721257527e-03 9.792491176108348780e-03 5.231192216811570393e-03
3.641849911805875029e-02 2.354199132575172243e-02 3.710982680706405301e-02 3.427881534771662353e-02 3.005537719204313257e-02 5.945378314269952370e-03 2.768051802803232417e-02 1.177926290899941608e-02 4.938388564293900822e-03 1.150850381865497485e-01 2.712212240037310124e-02 2.640966931703650489e-02 5.600367730046351689e-02 6.082736745481535923e-02 2.913303216749361935e-02 3.190853725397913010e-02 1.702434636718070382e-01 1.759382399926779639e-01 7.064265535695400666e-02 3.144660514126709772e-02 1.072909902674178129e-01 5.178234006537062173e-02 5.366932136181506996e-02 5.675602564323337096e-02 3.121827068155298007e-02 4.054275652318806850e-02 4.174493823598180581e-03 7.747237853124889877e-03 1.040979312441310881e-02 2.942641867485396197e-03
3.081934181670902689e-02 1.601212888571439466e-02 3.534411146044903751e-02 2.960358887052349369e-02 3.725761876185142152e-02 3.411336317226645182e-03 2.856101965308095389e-03 2.463070485336628021e-03 9.798009116057909695e-02 1.374107827166782571e-02 2.158177024932966259e-01 3.594105499691950811e-01 7.445606860858119402e-01 3.697038606646933512e-01 6.864668878831260701e-02 1.342855649141974916e-01 2.483084788703598944e-01 6.855852659432859486e-02 1.637911945767924621e-02 3.266283238787307669e-03 7.383989253303856193e-02 5.183695095037350875e-02 6.192878927178804838e-02 8.488884445075862983e-02 9.004972667324472047e-02 4.901213380876593556e-02 7.817283580665765341e-02 6.418802426080576218e-02 5.904832758743459864e-02 4.354717801586158177e-02
5.696049977503691610e-03 3.332812882580155327e-03 2.913531680254919168e-02 2.823026988978682289e-02 2.177131206562097493e-02 4.950912670211337838e-03 1.179466413474668796e-01 7.634232415454922371e-02 9.514662829257099219e-02 2.706700583877778843e-02 6.569087306690107875e-02 4.281442928019059679e-01 7.691310398672881465e-01 4.019560037542543318e-01 1.466111011307693057e-01 1.657794587357807603e-01 1.827281009333168726e-01 1.079826447867180128e-01 2.665809202693059793e-02 7.519593641017521812e-03 6.953855649264924221e-02 6.200885181566066773e-02 7.035746070738763125e-02 1.811502680929842016e-03 1.710298542615368289e-03 8.582351458350201412e-02 6.599255676419023275e-02 6.052575967124387141e-02 6.569849507740421757e-02 7.164239943735667415e-02
6.338551585873150596e-02 2.781502843979895452e-03 6.791893325588964012e-03 1.913978838157672641e-02 1.240166359291337492e-02 3.865433164084230294e-03 1.927029145637619394e-03 1.022549277106488685e-01 1.897583046679885430e-03 1.370382918069743168e-02 4.555638697296410591e-03 1.377825084121396260e-01 5.787869653062286401e-01 2.485904558574375811e-01 7.873806221049135801e-02 9.147771134926105385e-02 3.382090464137973984e-02 4.970846319913844319e-02 5.675719754700848940e-02 2.130049053115944113e-02 8.502470808013604109e-02 7.653077458522644649e-02 9.244422941548757766e-02 2.540702386619256726e-03 3.333292016862746728e-03 3.119938499250440520e-03 2.289820481927636823e-03 1.345423805421792629e-01 1.032342975320411360e-01 8.079636562873726557e-02
5.031583216918643353e-02 2.418198256755464421e-03 4.480260985229026632e-03 3.283334155957428561e-03 1.157400727459539230e-01 7.488098339233643236e-03 2.518495011584568136e-02 2.119517181235530678e-02 2.691020578442991119e-03 5.795781996678499304e-02 3.366479253143779722e-03 2.251679881916808165e-02 2.654477770063987663e-01 3.595269724494430386e-01 3.861696066530212468e-01 5.247545387569959585e-01 4.734689783748122216e-01 3.071602581579805924e-01 8.389644107034693876e-01 3.928812979907458924e-01 3.268939845085074014e-02 9.501500433176763086e-03 7.109472136291160142e-03 1.795865489673006618e-02 4.180985663787974149e-02 3.913693162877041054e-02 1.071710999920644225e-01 3.480562726786419481e-02 2.694271602299491784e-03 2.514250414515291875e-03
4.482157824490333453e-02 4.517690962897094598e-02 2.063855151755653906e-03 1.556060812073709054e-02 5.641807925091134324e-03 8.271053051966567593e-02 1.685684803518664246e-02 4.854732426990115979e-02 3.267318936471576285e-02 3.344953536709693084e-03 7.096457816403891131e-03 1.119240730516101456e-01 2.370236991799136161e-01 3.005132914997837856e-01 2.722580436280547800e-01 3.303395118340357595e-01 5.658664597615787883e-01 9.816524818583615142e-01 1.006902902367799335e+00 8.042768633701922187e-01 3.477540428775775794e-02 3.667220559030003740e-02 3.253864582273802847e-02 1.023536588431268046e-01 1.469671880486361215e-01 7.513146716371452705e-01 7.533591540824114974e-01 1.519924534856257059e-01 3.308906374225097438e-03 1.188217445534613115e-01
3.887878560591041116e-02 4.263448895926794796e-02 9.971453216344963733e-02 1.120855086308288617e-01 7.525090404460826887e-02 8.633376883625495934e-02 9.259041126154356899e-03 2.602423253375236306e-02 5.401758716980756270e-02 1.924380469205246719e-02 1.976045537876178898e-02 1.715610467763697272e-02 1.332769597190979205e-01 2.705590900248693309e-01 2.534808028020968940e-01 3.891950611795805814e-01 6.756735137226280719e-01 8.278117822480892674e-01 4.857092004493909765e-01 1.080287100429326019e-01 6.555078442709094677e-02 4.535259365052908276e-01 6.615454140251778581e-01 1.112994774698923273e+00 1.045347707572029217e+00 1.364054030610332369e+00 1.102436642053799210e+00 3.179123987421141329e-01 5.429205593675007907e-03 1.412209086209525177e-01
4.715026257666883602e-02 5.495423530584883642e-02 5.546715434894170654e-02 5.403437008660847557e-02 8.405707324984107442e-02 2.591367697425431878e-03 1.512469103434334050e-01 5.058556944315537596e-01 2.475904351139886217e-01 4.207165965701716026e-02 3.102594872082858890e-02 4.815360715157314397e-02 9.518621613697415829e-02 1.404792944546847666e-01 1.854252698710393832e-01 3.326240897433113686e-01 7.202048652045999200e-01 7.386164419828333827e-01 3.579404466410703867e-01 1.254310689747387131e-01 5.430128071057239714e-01 9.854759525544867227e-01 1.266553870655999114e+00 1.305265010428564132e+00 1.155393510117350475e+00 1.007230873552753980e+00 1.513107689019087321e+00 2.662817762671634281e-01 8.509845018446749593e-03 3.562312504315987612e-03
1.719953533042142520e-03 9.027275914293916848e-02 4.795147388066393901e-02 7.718573524748326142e-02 1.452400037743385892e-02 7.373831536479838467e-02 4.110713773990447573e-01 3.348635876680847723e-01 3.303290361887449844e-01 1.642689178471634648e-01 5.975747512082692225e-02 1.604438006540056041e-02 1.570868259101694531e-02 4.047235748648531084e-02 9.095402683347564299e-02 4.187576422026813017e-01 4.432278461592957242e-01 5.286828426006602299e-01 9.422076408576526840e-02 1.695496206486026836e-01 6.020435925201245153e-01 1.302905435424705605e+00 1.613647217039507087e+00 1.681440490121195896e+00 1.403471023448034094e+00 1.377051901369889197e+00 1.311142354914087038e+00 1.039590567797868292e+00 4.614640313708150143e-02 3.043626346750145928e-02
5.168309059616669338e-02 2.067046927953830431e-03 3.802422551728482959e-03 2.632960598720836959e-02 5.883032546492078518e-02 8.321246658063977120e-02 2.620031204384364321e-01 3.254834286276863664e-01 2.234721017809966348e-01 1.729401315232807768e-01 3.629618336028156422e-02 3.562485079436639775e-03 5.435406379211715246e-03 1.542606005787230776e-02 3.364487263361417430e-02 1.999276711927657213e-01 7.681008738986018491e-02 2.497464088809758440e-02 8.504468151834178313e-03 6.232053592979348855e-02 2.359040149231640404e-01 1.251733702761908429e+00 1.584374290869664970e+00 1.673249613445469741e+00 1.240391014944054682e+00 5.861008183265244975e-01 9.675408947627416323e-01 6.641046517110968939e-01 5.988480241699147694e-02 2.364018298923106429e-02
1.917763862169670486e-02 2.419340573149959817e-02 1.610587388069959630e-02 1.989051707091554072e-02 4.676978594615126272e-02 2.671635803236080409e-02 1.369564651034540781e-01 1.753788890000560485e-01 1.613217513214558751e-01 3.808025583141799730e-02 9.594902098155860815e-03 2.033761222439279051e-03 3.598802249475799298e-03 1.078611557444288799e-02 4.346688676646442984e-02 2.973870803487869627e-02 5.457188531105639645e-02 1.625597432162473321e-02 3.067428552641477887e-02 1.451933459798147863e-01 7.746427356998532021e-01 1.460301279096334781e+00 1.565725325019351466e+00 1.505899181998485714e+00 1.176805978889841287e+00 8.782511935478388709e-01 8.650404388771206765e-01 5.828425603909412889e-01 5.247602305499366598e-02 1.868013217911368429e-02
5.467616023975041539e-02 4.893736803352186776e-02 2.514439423528506273e-02 1.803221733337264168e-02 2.334821500711988310e-02 1.239264475879168874e-02 6.991020035016562439e-02 6.163204161892461841e-02 1.680619351723054017e-02 9.194083548605101047e-03 3.193667220184232686e-03 2.559841968204657273e-03 1.574464053650995567e-03 7.564380683903691727e-02 2.476551610732832809e-03 8.707552556601117974e-03 3.107336909215983184e-02 7.089402036208096447e-02 6.828669203738310656e-02 3.040785239816754526e-01 8.229853779579360262e-01 1.187957865787840461e+00 4.826032824261152765e-01 7.331036108833255405e-01 9.613243078803147545e-01 5.529226013633267156e-01 4.183123454868836744e-01 3.435716212841249395e-01 1.259341171863325587e-02 1.138371120429884469e-02
4.386037970628195448e-02 4.958436885063467747e-02 7.345116918690868663e-03 5.089878517769002957e-03 4.172344976756147891e-03 6.153916578064366934e-03 8.665318589316654482e-03 2.131043418912210476e-03 2.728829231255496847e-03 4.311991999846231938e-02 5.622685790867812394e-02 9.168997056278744813e-04 1.059757132733159897e-03 4.006085236776949117e-03 1.193452904521063486e-02 1.624218245521273363e-01 3.084205879370585102e-01 4.448271993511417333e-01 3.032793162903832940e-01 2.283058454038293661e-01 1.609144320021922980e-01 5.742668387605549124e-02 2.214884794648520200e-02 4.817651295624123670e-02 1.767803549659628659e-01 6.060137517507106775e-02 5.656707463192964247e-02 1.912284014868105564e-02 1.069542000852022473e-01 8.752112739366715854e-02
9.144267672851327799e-02 7.011023891601263214e-02 7.565415673524865034e-03 3.271037078826701319e-03 4.821016464773600699e-03 3.721147959344738368e-03 5.656687621015398480e-03 5.882839580300448096e-02 4.981423825186406806e-02 2.147091747749971247e-02 5.072495987554113961e-02 1.020869369592091076e-03 1.418533607091329064e-03 8.111827313563493153e-03 1.406230284810621248e-02 9.253941933541577625e-02 3.355374192896668495e-01 6.246583492579136365e-01 7.086300919020396272e-01 6.189268480153171659e-01 1.322988386478645695e-01 2.959672583882799052e-02 3.663460508211303229e-02 8.994197254213429082e-02 2.017425359515273575e-01 5.996813852487983820e-02 2.321987658319539863e-02 8.764005344267057629e-03 1.357157431695603655e-01 1.219186119936408602e-01
1.155565202077234871e-01 1.472824042542356104e-02 3.994364910703524993e-03 1.306178988485306048e-03 1.506018937058231384e-03 3.260957456656039029e-03 4.119251819550701597e-03 4.441981906094472771e-02 2.456630996832659397e-02 2.824259657054173367e-02 4.979640946269153073e-02 8.940124305333453213e-04 1.056258391515848627e-03 6.217066561894145187e-03 2.561478361344102228e-02 1.300274158927312296e-01 2.505425349309722827e-01 5.768238028241556847e-01 7.286600460350346475e-01 6.230725546718015595e-01 3.142647996852270809e-01 1.824870321390587719e-02 1.300549797849966972e-02 2.814391445432826849e-02 1.625523943749272726e-01 9.770827661500110228e-02 8.852770453156748320e-02 1.671262237959928593e-02 1.193549282416969670e-01 9.181258339632369925e-02
6.573754182175800542e-02 2.027912749655539498e-02 7.614928906034569393e-03 7.030754682222663948e-03 1.612483415387053545e-02 1.094139600106719228e-02 4.418045409321958925e-03 1.763404201309040934e-03 2.585799840990140978e-03 3.397289930630608985e-03 3.105970908341932485e-02 3.480639293828997893e-02 5.428237012144989521e-02 1.423396155016995500e-03 9.133221763783264460e-03 3.928192945931006236e-02 3.980975101072667388e-02 1.717540387278758129e-01 2.228225158522605387e-01 1.945893738911886883e-01 1.660986765952803812e-01 2.171931015732714298e-02 3.374159765655675852e-03 6.584884576506680985e-03 2.913555334441243067e-02 7.281145137722144778e-02 1.961400114193648236e-01 1.107500982491951558e-01 1.405989996716504598e-01 1.063302742175712134e-01
2.360599473450875063e-02 9.321483885286424229e-03 9.608720280754609946e-03 1.604209576366281975e-02 9.079764164565668969e-03 4.039811332944536447e-03 1.810647663151560872e-03 1.239231449140598337e-03 3.839344648472777389e-03 1.496580573440635734e-02 1.023943038456396303e-03 3.425477926294766273e-02 5.796154642349745506e-02 1.467495011563525829e-03 7.397556548094334251e-03 1.398849140011822548e-02 9.774962806224600856e-03 4.934840854762289827e-03 7.938397690678420521e-03 1.477989967728825238e-02 2.686000825462020458e-02 6.252019519408107823e-03 3.282808526390422043e-03 1.687013045314712106e-02 4.126019588630003287e-02 1.468334551841352260e-02 5.080902153424186884e-02 5.712442514467856031e-02 2.034205833908124539e-02 1.629137019585152057e-01
2.393669861418769307e-02 1.911882929837933204e-02 8.989146536980551980e-03 6.534244458535055228e-03 6.304899975955137112e-03 2.348130429932100693e-03 1.511820345718512502e-03 1.508802307537524803e-03 1.631000762374401093e-03 6.552794815735774742e-03 1.858137207010778901e-03 1.772054569100586004e-03 1.747985489698380013e-03 2.326186211885016095e-03 7.174604589425665618e-03 5.331072567737525462e-03 3.806193207170596900e-03 2.406728458337530161e-03 2.235702760172481388e-03 1.214272088120376403e-01 9.641767610932677757e-02 1.405411001417722350e-01 3.675165627612477816e-03 9.462475402581556339e-03 1.708494965934033091e-02 8.405482688989088583e-03 1.369573604684447277e-02 9.152042257971854805e-03 9.261923010006991794e-03 5.962743221909799080e-03
3.243377497639497731e-02 1.682884629237484456e-02 9.236601474168009210e-03 1.253389413587752826e-02 1.141842496666514890e-02 6.146106628057693665e-03 2.046081533742200032e-02 1.511850136037979492e-02 2.195408532324530197e-03 1.602613529506663470e-03 5.602656696539473624e-02 1.321685235826537078e-03 4.104453505228035717e-03 4.876539317611745111e-03 1.617579659254383267e-02 1.297811741962272801e-02 4.347478039089947531e-03 5.468058905065371206e-03 2.673562754718432702e-03 8.240652583618694738e-02 7.477329964606331536e-02 1.140219714670279993e-01 2.757053314071236660e-03 9.137583655764183743e-03 9.982554969123196009e-03 1.440337309843274516e-01 1.622947986822342870e-01 3.836070803092467112e-03 1.264132328027810573e-02 1.375807755707849911e-01
4.343139775636763872e-02 3.742412711127798136e-02 1.095887020712775148e-02 3.734387877208291545e-02 4.490463491063803603e-02 8.393031463808126036e-02 5.518186129969913228e-02 6.130322276538181792e-03 2.175124990060918299e-03 1.264045556968650770e-03 3.652396835545014542e-02 4.523812529020652257e-02 5.682787169471180400e-02 2.674464576595336675e-03 3.629547638677727353e-03 1.763648834948072092e-03 1.829993923087249244e-03 2.355427213571242070e-03 3.408801544172647413e-03 1.883354970260325487e-03 7.000753276470993158e-02 9.481091888805731616e-02 1.062388692451870786e-01 2.889384858936782426e-03 1.007210637884077553e-02 9.971202122815880919e-02 1.474424237940462623e-01 4.524619797133966163e-03 5.594697515741398411e-03 1.136716160229691436e-02
2.327466334473417969e-02 5.802437294271282214e-02 1.694759649227331466e-02 1.833865888210248207e-02 9.162445390367583709e-02 9.721985472912830772e-02 6.466179827700757610e-02 4.428433924793842916e-03 3.107205289417516031e-03 2.940403643730290714e-03 1.209152990993090553e-03 5.608825825040122254e-02 3.630175930567528658e-02 6.533968860518912791e-02 4.061272574537299132e-03 9.696621982622809222e-02 4.931549254398434959e-03 3.188808097986563228e-02 6.015230564851394013e-02 8.491216140000057769e-03 1.051464105902540913e-01 1.326815342065943149e-01 1.125444907210740864e-01 1.291089456406895042e-01 3.114162011235397775e-03 1.421735287874241749e-01 1.711522765335413143e-01 4.137237158510068125e-03 5.715484070221273083e-03 1.433019919497845532e-02
