3.477392579114125248e-01 5.016400267363112508e-01 4.182091304044592284e-01 5.144008217784764581e-01 3.562601232218768899e-01 2.788630576142423542e-03 3.283251653382346109e-04 8.680468946724083455e-04 1.547371366715966914e-03 6.804665939240895018e-04 2.762788034550430621e-03 1.953299093972015454e-01 1.280617420548187113e-01 4.684488387773492191e-01 5.838002646545901141e-03 1.290194644169628257e-01 1.286229164525751157e-03 1.682466029916298959e-04 1.014334534362567415e-03 4.255010198291721557e-01 3.963128898182406434e-01 6.035964374767790325e-02 4.646662933594111755e-02 1.894163466420663855e-01 3.790042844991917681e-01 3.060922489101375321e-01 1.449526675840494272e-01 1.288674664843257600e-02 1.241288433982118064e-02 1.574404130457923712e-02
2.328196518235642887e-01 4.977589196134247218e-01 1.772952207817013806e-02 9.355738865217065256e-03 4.421426065720805432e-01 9.555411450378590091e-03 2.407887250533556622e-03 2.833156159435424801e-03 1.048055561674672911e-03 3.118712636953606008e-04 1.721492660878790526e-03 1.003892817003930182e-01 1.499992376725757248e-01 3.590340378124596832e-01 5.769777133820278014e-03 3.543265526713874625e-01 1.168858014063898750e-03 3.032599163127237818e-04 1.415198173851072100e-03 1.466489922736366122e-03 2.273246912707856671e-01 5.776461266861216554e-02 1.205136327791378609e-01 1.103638268856103333e-01 1.015810793024206765e-01 1.413949799935134977e-01 5.160778952267526531e-02 1.318949430945560997e-02 1.885729215235347478e-02 1.893610824769279694e-02
1.013031158711506265e-02 9.533311411765138521e-03 1.187792409721313835e-02 5.575432256273931721e-03 2.174760978600347519e-02 8.877464497542853980e-03 1.977311132981007524e-01 2.060832197394558141e-01 1.221037361587591630e-02 8.543058041167671778e-04 1.983632114067965507e-03 2.838536674320973202e-03 2.639018263466437822e-03 6.114616410589569090e-03 2.206087748869404452e-01 5.502647965842483516e-03 2.321011429655532501e-03 1.542239279698880529e-03 8.009215701416990546e-04 1.723436811411779195e-03 1.403316116399466740e-01 4.762203114734440274e-02 7.299560000835168816e-02 2.612717739161234815e-02 1.623045610934722299e-02 1.118486584572127990e-02 1.045223082598377082e-02 8.215229163018877151e-03 1.401698101948361218e-02 1.572063007293587195e-02
6.217558215259776566e-04 1.773798797950851486e-03 3.882704199380047471e-03 3.135920965300003499e-03 7.123888462247298693e-03 4.021435967407403500e-01 3.976411640939781500e-01 2.456730308167610621e-01 1.326349806493373473e-01 1.377601814748767584e-03 3.207470198573869721e-04 2.833713129292518389e-03 4.836704785769358264e-03 6.833229892794016359e-03 1.736632115219910732e-01 1.503663021010681888e-01 3.209159510481606747e-01 5.747344055358243530e-04 7.243903593379050481e-05 7.792378775628671077e-04 2.568727251266499922e-01 1.033708109897547717e-01 3.489190792010753162e-02 7.043129197707716227e-02 1.336374522692819131e-02 9.896745954344681601e-03 8.815691960474951808e-03 8.355569813524817147e-03 1.694060549268968860e-02 1.838301650244944171e-02
3.496122727857651808e-04 1.069879604596921932e-03 2.980211516832669948e-03 1.158744905330814619e-03 5.106464808717862437e-03 2.328116630521533947e-01 4.040808109742331511e-01 2.265463298809693438e-01 8.305361172314983109e-02 4.372089380278118033e-03 1.477688442421888626e-03 8.558469475258199954e-03 4.169352210134279479e-01 4.357664972268162074e-01 2.308061138804284318e-01 9.350868761704754506e-02 4.200938356361418220e-03 1.518875237708458862e-03 1.834307131355948335e-03 1.508498514943757817e-03 4.297018054681985277e-01 1.375681962163602390e-01 3.519550952888685913e-01 1.180044938416824063e-01 2.431127684528920987e-02 1.318553682284124770e-02 9.381296195010905767e-03 1.083152202909488764e-02 1.690968885401912189e-02 6.207945171360985254e-02
2.744922347230959164e-03 3.053540082335972228e-03 7.383422700882661532e-03 6.384821600047771613e-03 4.458794772475369560e-03 1.307414221750391459e-01 1.652272840623780492e-01 1.755182762886336734e-01 1.418403349468296271e-01 4.931505644282378406e-03 5.231518759983537145e-03 9.327674176336279988e-03 1.956139799259233314e-01 7.492622566466933254e-02 6.387004814270133557e-02 1.096075119382645957e-01 3.582326636045131754e-03 1.456855880880315590e-01 4.754543034520075095e-01 4.905480611230704328e-03 5.510807705295829063e-03 8.218557157574140834e-03 4.451083622520520811e-01 7.013831857950406090e-02 3.654501544963577320e-02 3.438275857376091316e-02 2.171214259388113549e-02 1.494912152084032497e-02 1.970443840947916359e-02 3.535059452533816787e-02
1.211615982051510165e-01 1.867370949893316368e-01 1.837699906001580286e-01 4.037137577978046170e-03 4.183698741317377623e-01 3.014230369792547833e-03 5.187120781500118016e-03 2.785026587245335167e-03 4.179475504632912918e-03 4.259551788123382837e-03 5.887937127957610858e-03 2.370918093674965199e-01 1.094883642419160336e-01 5.221328813499276356e-02 3.127821091450921215e-02 5.544824564897922470e-02 3.132100501151061089e-01 1.407742280820828418e-01 1.759943174972600135e-03 3.588620204154237617e-03 5.058545820229018997e-01 1.445445474083014437e-01 6.721976835880247303e-02 6.435186487579841463e-02 2.488888265002365055e-02 2.551803643565140819e-02 2.268780694574583368e-02 1.968416115316040313e-02 2.281099042818602804e-02 5.373097661269488068e-02
2.379779126773812203e-01 4.477332807984801266e-01 2.498839091694634584e-01 3.091868920416394363e-03 2.287895090273332939e-03 2.536777454880682642e-03 1.306009924835068239e-03 3.894476300863179436e-03 8.697833058533027684e-03 3.555900057182906915e-01 1.435369257057988734e-01 4.290939725925633219e-01 9.202316957367118189e-02 3.330878904133557222e-02 3.836364236336527178e-02 7.256800354828114863e-02 3.366575340202395891e-03 3.339878540267711762e-03 1.263076451133974924e-03 2.186410240369089826e-03 1.971899989140952492e-01 1.164225884630588764e-01 4.647730675080066071e-02 3.884114746248350236e-02 1.851305472474985142e-02 1.950697616449485056e-02 3.172637584196485311e-02 4.093585151805129163e-02 4.021688483002103243e-02 1.155129216803604669e-01
9.373004333016259418e-03 3.470582286529104166e-01 2.044506214553390711e-01 4.885560833735750307e-03 1.966488868205062274e-03 3.138646283620188937e-01 6.240320815648718426e-03 5.542933773568700304e-03 4.869703621532375237e-01 4.955892618790109228e-01 4.401645447819563239e-01 6.050913843654309385e-03 6.764113521083430294e-03 2.433612833262592100e-03 1.196064686561469220e-01 1.018338721730000229e-01 4.092271461103754726e-01 1.354278868811151053e-03 1.480647743442652358e-03 2.527181698185235748e-01 5.040122474938252967e-02 5.251657691440556747e-02 5.701459863463224920e-02 3.723143991824498511e-02 2.184744140207980218e-02 3.353397120436790030e-02 1.334802639699033400e-01 2.677676736696826820e-01 7.598379583605765486e-01 3.691002705863170030e-01
5.059466212241557105e-03 3.910250769980034256e-03 6.380996164643695269e-03 1.556580137988205830e-03 2.390153537289937263e-03 1.443985953078896767e-01 7.306301864645869081e-03 3.348715534495840807e-01 1.636961631778793835e-01 5.925719607875363365e-02 9.162594684030550551e-03 3.273684735409655711e-03 5.937226350507907946e-04 1.656433928183949963e-03 1.068380997043821921e-03 1.670148005921573550e-03 5.964440539151032519e-03 7.926062130591797136e-03 4.571848585461567131e-03 4.257731959509881980e-03 6.267380393676709460e-02 3.953602900868635056e-02 4.523057824260735132e-02 4.971145941206752544e-02 2.782823776890048714e-02 3.578458456742004273e-02 3.469138390591125498e-01 5.928543165895400202e-01 7.314613363569894000e-01 1.903008495686069335e-01
5.294589030991744480e-03 3.184037489847785229e-01 2.832354515718478374e-03 3.427826741870164070e-04 3.621242253251850691e-03 8.726047830514292725e-02 8.605365825029057114e-02 7.900897813429677563e-02 5.480191319142178885e-02 4.321097112201565671e-01 9.689760385404913232e-03 3.685282553601332105e-03 7.564288505854491716e-03 3.711236866981879653e-03 6.814043354217528018e-04 1.329566396862055062e-03 2.435452400675084533e-03 1.818783313101597415e-03 4.158147358065790167e-01 1.014408471764545738e-01 4.236481254857472900e-02 3.772493008633267392e-02 4.856126158104540763e-02 6.793102698673321449e-02 7.270146218817610806e-02 3.968077508077817728e-02 6.416960737144231097e-02 5.130839190790303234e-02 4.619013178507128115e-02 3.326375353687209546e-02
1.419386331366239151e-01 7.772551241802765076e-02 7.067512842784796565e-03 6.003347052857327046e-03 5.390583294678887201e-03 1.370538288843263786e-01 6.421522350819575120e-02 4.456438721635740119e-02 5.458925174501490923e-02 5.601991884979494810e-03 8.052326861367800279e-03 5.887874295796779837e-03 7.543958982426879345e-03 3.945345562222253404e-03 1.437340709708157752e-03 1.634503021404666492e-03 1.796771952563065494e-03 2.924013589197316850e-03 2.321163831264863586e-03 2.304864059744310134e-01 4.040855014207731660e-02 4.105751080144901671e-02 4.842967241251838750e-02 8.648496844513806070e-02 8.208316761263051431e-02 5.844763791332788921e-02 4.501095021854598782e-02 4.161902021300416255e-02 4.610481945034392709e-02 5.061616624064525782e-02
3.376001547112214562e-02 8.104573594681933890e-02 1.810282001133615426e-01 1.247165754187534205e-02 3.257228462598196761e-01 1.118336134915712821e-01 6.219985529340076036e-02 5.432709032897682644e-02 7.157643860610134190e-02 4.954504765423944357e-01 1.401046743428905617e-01 2.785253562435431249e-03 5.436944913463369160e-03 2.377595781100871625e-03 7.647147567102048019e-04 9.043561159113459912e-04 3.363927693780127161e-04 4.958881428083158384e-04 2.658627610681823031e-03 1.586986296233106487e-03 3.860983535006051043e-02 4.229254396178110109e-02 5.347665252292967131e-02 8.863038791441221753e-02 1.119289098159005763e-01 9.750781880842179783e-02 7.184655490069424832e-02 6.889100952943685852e-02 6.167983064520051600e-02 5.217768238146031773e-02
2.930348416619426438e-02 8.253316090064186095e-02 1.429404847218061769e-01 1.014507942472176183e-01 5.954397792076792512e-02 2.306878372709451619e-01 6.966084026725952172e-03 1.979334070281499932e-03 9.619988162442913437e-02 3.209920142155202327e-02 1.161597916820825693e-01 8.708149598800245597e-04 2.396225279585081740e-03 3.349571552677990584e-03 3.703323098518142547e-03 5.182311719450864544e-03 4.750051303150590494e-03 3.126618997225049344e-03 8.648326020344706405e-03 4.942519685453202263e-03 2.550249896233459067e-03 2.515337460293090022e-01 1.892695805466890757e-01 4.487850132426186578e-01 5.166147987836486495e-03 2.159132820663691756e-03 4.199166316657726786e-03 2.998841423408282313e-03 8.313314680011654745e-02 9.820396509079321046e-02
2.818580633733396359e-02 2.797302763398220454e-02 7.432393036847563528e-02 5.452520410459150701e-01 1.956168811988698020e-01 4.325318301424008888e-02 3.219202889405003640e-03 1.401872812008609628e-03 1.469333155512919566e-03 1.183074824180754270e-01 2.481800942756279271e-01 4.010406814449037072e-03 2.050939423875436807e-03 2.703722035862200345e-03 2.542355754051200869e-03 3.198736101090925762e-03 5.626350601198026706e-03 9.998819102648950907e-03 1.046300238987700644e-02 8.398626635315658770e-03 1.814156956421687870e-03 2.977295104696703592e-03 3.670538460652712255e-03 7.132236575951475879e-03 6.335902436189084011e-03 7.552806585327006932e-03 7.468241596480341277e-03 5.253895789953291762e-03 8.640783128822501769e-02 6.733164413642096779e-02
2.655107902102358738e-02 2.850932331205386500e-02 6.203611147291036160e-02 6.707259188973697939e-02 4.396233679840213376e-02 4.566929831316953597e-02 2.528020087770823654e-01 3.815728233689220862e-04 1.075615043193642924e-03 7.983167239327175696e-04 8.721123072176112422e-04 4.857764195386411786e-04 1.102571486003306933e-03 2.330743533585357026e-03 2.271138941942190716e-03 3.629129281823162932e-03 6.555874159201574396e-03 8.314006692750492908e-03 5.013651562424900100e-03 1.126520837823338263e-03 6.744825612245125123e-04 4.600664192824288623e-03 6.623420381087910883e-03 1.129572216338129050e-02 1.084214728803095489e-02 1.428953036150895986e-02 1.149971468488423208e-02 7.939466492161300487e-03 1.281650250345487130e-01 7.600550254910963532e-02
3.467957455626959756e-02 3.933030008236998443e-02 3.717650520532472802e-02 3.377766306866818169e-02 4.722633266740437763e-02 7.894047843612569948e-02 3.687439260508184290e-03 7.139600120206850836e-03 2.008824912571925778e-03 3.401452523043624917e-04 2.472883329537090046e-04 3.745360780102384261e-04 7.459542369772450719e-04 1.152656889271034798e-03 1.592831153315987791e-03 2.984895461616423034e-03 6.813558008520141131e-03 7.291133576973394398e-03 3.656155239356948233e-03 1.302615661338329825e-03 5.583422709827564993e-03 1.003135395690960517e-02 1.272935458726569789e-02 1.346601592468656128e-02 1.228948146749857424e-02 1.088582172158395617e-02 1.633195644572131219e-02 5.189383454117475931e-03 1.712673441553152764e-01 9.287346374619530331e-02
8.775723034957140511e-02 6.761459102831315904e-02 3.197215067276158035e-02 4.327959658516133956e-02 1.240009963034402040e-03 1.642223488987047415e-03 4.209527505406015016e-03 2.670291749743929684e-03 2.609047343682086018e-03 1.291624784386398179e-03 1.169151363947770793e-03 7.962590970434996543e-04 7.746865810879372243e-04 1.358783420863378562e-03 7.478021698460705783e-04 3.597072193691371739e-03 4.059035637464703319e-03 7.396347061624118299e-03 1.340846617684736180e-03 2.401604734728489746e-03 6.174377043150341797e-03 1.324385777208883508e-02 1.618630465854758657e-02 1.749306682884093148e-02 1.516388543634060969e-02 1.512759280795279715e-02 1.437963013270411421e-02 1.494116865793138765e-02 6.293210800924053244e-03 5.103608682176571237e-03
3.493858285403284025e-02 9.432807644208972275e-02 1.604331669163746310e-01 1.907657991972399724e-03 9.281876551705871845e-04 6.194734025452598714e-04 1.968263136866753651e-03 2.460138685355180762e-03 1.680344808155410496e-03 1.298943768390980504e-03 1.387198829716620140e-03 1.702836362043803342e-01 2.587912899034024994e-01 1.291966423185711595e-03 2.732653240948050501e-04 1.692101393892903646e-03 2.427765705419201916e-03 9.037294779636475357e-04 2.000500065142058193e-01 8.823311410312719262e-04 2.424825571083161907e-03 1.303157234130994900e-02 1.663251937591798263e-02 1.805442546377266158e-02 1.369560665830136560e-02 6.541408571903327071e-03 1.079897307506561162e-02 7.396750620031361002e-03 1.230317075970456704e-02 5.325753890369637755e-01
1.186891310171932007e-03 2.247958431550119412e-03 1.248622141814980562e-03 8.276697935597953021e-04 3.327142026015615173e-04 1.859993256165461291e-04 9.560197950905176311e-04 1.231218814471162024e-03 1.130731579019630039e-03 1.170646565619809683e-03 1.252174842663739997e-03 1.185821505092573280e-01 2.042575493437832901e-01 1.575077190473077879e-03 1.215426055939034791e-03 6.016923018279927461e-04 2.313222265001891719e-03 5.003184278194167112e-01 1.137863991087278244e-03 2.031604025548178812e-03 7.907173216400520746e-03 1.538420585572463674e-02 1.695441728842557796e-02 1.664143274097716618e-02 1.318668184558264081e-02 9.911110601839053305e-03 9.760626517272401673e-03 1.305181396676443131e-02 1.788526338431515456e-02 4.261067885780793763e-01
4.869106147585037722e-04 1.414500615998828077e-03 1.582966198314860080e-03 1.791796678947123146e-03 2.492238141275038895e-03 8.072796773262658687e-04 2.653359787302723982e-03 1.579954017083239071e-03 5.520963655319893011e-04 6.830416149132442468e-04 2.041034112761129227e-01 1.809127687193630152e-01 1.015523463204085625e-01 4.790180858622029858e-02 1.046897549006263889e-01 3.144611915169036598e-01 1.273075379264390758e-03 2.321941394081308060e-03 2.104463220083073287e-03 2.854438263081256807e-03 8.184212443343658397e-03 1.775319735885468042e-02 7.400036976996212691e-03 1.126384136106144997e-02 1.085572040126407851e-02 6.283864410286114227e-03 1.211300821644626519e-02 1.652773535311161807e-02 2.400525205261420381e-01 2.611066741674819003e-01
3.793696280297818857e-04 2.985237774758441390e-03 3.318199407158182179e-01 2.846282383252801140e-01 2.644221662438630549e-01 3.827525985883367121e-01 1.533157730977343378e-03 1.355390032634762043e-01 1.888095007715295814e-01 3.255085573792361464e-02 4.783738764174079450e-02 7.646465840052532603e-02 7.389738856167807346e-02 2.355410606131059514e-01 2.128747780671338616e-03 3.200227682518508657e-03 4.326749513112022015e-03 3.701910797321955517e-03 2.616261269080078899e-03 2.060876540625748710e-03 1.557369095100722507e-03 8.876232491556731259e-04 4.481068912086769718e-01 7.618656652238114989e-04 2.011376518904994977e-03 3.128289490689413824e-03 6.128773278711088617e-03 3.454066926933304638e-01 4.464609548558894081e-02 4.168731416605290369e-02
7.652824715437716360e-04 5.591281499553759499e-03 3.730076645947542069e-01 2.225864558055681008e-01 3.786642460681639011e-01 2.927576685998830031e-01 4.543077061682753714e-01 4.967311820211535445e-02 4.504837776502609858e-02 1.947051485281664496e-02 4.818013164744778393e-02 8.888171051274812440e-02 9.729232967814673005e-02 4.544985947883630195e-01 3.065485757055064642e-03 7.246501733351397214e-04 2.704713208168216688e-03 5.174159222474499116e-03 6.019875274631558866e-03 5.476404874105635784e-03 3.463262313301266812e-03 2.393783976684305068e-03 2.908270954610546119e-03 4.773193904629797514e-03 2.272000874726337518e-03 3.062113091599264186e-03 3.921650929762495186e-01 1.605883188189263511e-01 6.005039785414258841e-02 5.767711603230042672e-02
9.110922109966398215e-04 1.456505894190440308e-03 2.090288157003988845e-01 9.310836076570322417e-02 1.214356891750803524e-01 2.750558513011054362e-01 3.635738424394798773e-01 4.163711571969568037e-02 2.219269143460158786e-02 2.526980041085585479e-02 4.585762092446610261e-02 7.819173807389702413e-02 7.294442761612952852e-02 3.514909536284479552e-01 5.723596980843131607e-03 4.830619189511695805e-03 1.999525256651956025e-03 4.677301508323860463e-03 6.008125283464695737e-03 5.347030163585937343e-03 1.734067961835109722e-02 4.362840508076897827e-01 2.969812849085880502e-01 2.826309912139193543e-03 5.042343317591978236e-03 4.836876077648753249e-03 9.638840876727181387e-03 2.707242480359730585e-01 4.740353976763454075e-02 4.289452732951513914e-02
2.219951617061971354e-03 2.898060564524193063e-03 4.495077188962505188e-01 5.048844670604546447e-01 3.733738998032308173e-03 2.934573680667712080e-03 3.782245663997260698e-01 1.573357466632772927e-01 2.250593009055173732e-01 2.870630490791776790e-01 2.687378516016653354e-02 3.230700933258169594e-02 4.260113933130875441e-02 8.291479475941282429e-02 4.177621411602200352e-01 5.896951730293819444e-03 1.837225451913507973e-03 8.983725214633192860e-03 9.403254581225456432e-03 6.403787072415521690e-03 1.680048716817667334e-02 5.384490595979222194e-01 8.475227550731698201e-02 1.361763979423516180e-01 8.695352331878276539e-03 3.646594021009717801e-03 1.491667077971950417e-02 2.594246719970712614e-02 5.421340831706442098e-02 4.746096382819842141e-02
8.644112213176850324e-04 4.326294462310167344e-01 5.825773656858720395e-01 6.482558240123096130e-03 7.008058929977191154e-01 3.272740981518125203e-01 1.532068867996302652e-01 1.095476208679521807e-01 3.360296698607326826e-01 3.375530518277092967e-03 8.817510805042487465e-02 3.266076888847991438e-02 4.842086230260227858e-02 8.924198767412307165e-02 3.699031344203708160e-01 5.702572882780598991e-03 3.823348087152710906e-01 1.774741589838884359e-01 2.567906933169409323e-01 4.318325189077345527e-01 6.695460015658538135e-03 1.776343038780722750e-01 9.112339430334813473e-02 4.206395485881831431e-01 4.642151063584648574e-02 2.958529167875706412e-01 2.404043544561645582e-02 4.458221918544572060e-02 4.389684817042565079e-01 7.496983118196692830e-02
9.760660634363217767e-04 3.140419374202688130e-03 5.591666745248384807e-01 4.768000892425776627e-01 4.924539253148587092e-01 1.936545829481099434e-01 1.260662748606071748e-01 1.287215023251347124e-01 1.406913400259376112e-01 5.572101112581090421e-01 1.632574115959168348e-01 1.633441004854077339e-01 1.314936975550048959e-01 1.335128389198311227e-01 3.364017173184901122e-01 2.280276892867778293e-01 1.596372403957939945e-01 9.948231633314058575e-02 8.644496316393877888e-02 6.477509715279415603e-02 5.195560201433845060e-02 7.588771375637767824e-02 1.156825707083343202e-01 2.697018094517008024e-01 4.609823976151873337e-01 2.080037555678673211e-01 3.198420397946266092e-01 2.218652543267008725e-01 2.294961227251301195e-01 1.518140539782470988e-01
2.344988606330660104e-04 1.278825101267261431e-03 5.558483046895155155e-01 2.328207158204385462e-03 1.283408428628908613e-03 4.676307758725284369e-01 1.249032619140884358e-03 1.251113412962359716e-03 1.940526103351430665e-01 1.405501027981436446e-01 5.260743677224653803e-02 1.218367789997203410e-01 3.062415792869941922e-01 2.806895545779671264e-01 9.847275895096461312e-03 7.259017641913161935e-03 1.809463478209871190e-01 2.149905691113160877e-01 9.765626283917530626e-02 4.328978948968162377e-02 4.208036533154400904e-02 6.566572730152718529e-02 9.949315986628803898e-02 3.033074816947826102e-01 3.068969910748112206e-01 7.279760168607114779e-02 8.113590469459229515e-02 1.043740254471669376e-01 3.403720910297597380e-01 6.985818984879531290e-02
3.144513765445914482e-04 1.239242613835688650e-03 4.175734653767937095e-04 1.639836663084462756e-03 7.238025076669891283e-04 1.363440746913709319e-03 2.196141942757958918e-03 4.987493003690857685e-01 1.935248416834478569e-01 1.121467800344684712e-01 3.397148441191706614e-02 4.336312501367577121e-02 4.646592448295203126e-02 1.589559270481841202e-01 1.822277498388177874e-01 7.700842685683438604e-02 6.357136249006579976e-02 6.877341928622125733e-02 9.301095315370583316e-02 5.388490483693728766e-02 3.821039466496284343e-02 5.683403340701311673e-02 6.452094444296209430e-02 1.077649911814963085e-01 3.371595018749086736e-01 5.334438236783418247e-02 7.774811138646224584e-02 1.272347000420626928e-01 1.536698042558775623e-01 3.060721448771570041e-01
1.745086268044213041e-04 4.176137219284510485e-04 1.231684714584037538e-04 1.291213662514558661e-04 6.084243489838491847e-04 6.241660089572300318e-04 1.848612881423881060e-03 3.607085775277432682e-01 2.762170990330302112e-01 2.560991581752524726e-01 1.044040398174174156e-01 5.228609731189240439e-02 3.117870912486292792e-02 4.857971903312938156e-02 2.202738027871016246e-01 5.732381270831859305e-02 1.529735805081761379e-01 5.252777742988680269e-03 1.060161840525607885e-02 2.057934278958324370e-01 5.311566889284786291e-02 7.428673676248812030e-02 6.461747849873779315e-02 7.111035630895999604e-02 9.466509994150430762e-02 7.282151519230495307e-02 8.613569967283683793e-02 1.062628418362052546e-01 1.434314384799867670e-01 3.539188938463380119e-01
