2.142111561271158138e+01 3.174376871871471195e+01 2.739252604135290881e+01 3.438461432891916303e+01 2.587031987509134723e+01 5.692620264904622474e+01 5.678918110163380106e+01 1.550461979892151589e+02 2.856460790081844152e+02 1.296568917305602611e+02 6.149246443148086883e+01 1.453924169776461284e+01 8.810060627161792723e+00 3.426793797083325188e+01 4.259375489681364968e+01 1.022681259752256899e+01 3.880288624379325313e+01 7.480375908206291058e+01 7.536651734810689618e+01 2.916751119086948663e+01 2.357337819580489224e+01 3.501120400650379771e+00 2.745782952853797365e+00 1.106842477034970429e+01 2.177099167964283311e+01 1.742637508982173244e+01 8.267434843643549414e+00 7.372773716380995879e-01 7.107145443729803169e-01 9.089800393092978270e-01
1.596776114901337706e+01 3.561846010181363908e+01 6.391887655955184755e+01 5.164669434654952340e+01 3.578954264867543600e+01 1.612968426057610714e+02 7.810026251053848512e+01 9.913476988205425755e+01 6.634607303412789747e+01 5.768048222857748897e+01 4.262984644360464870e+01 8.804052638606727044e+00 1.224474704208228637e+01 2.903340182168436456e+01 4.277971462399298730e+01 2.934339725277562394e+01 3.979360040560924006e+01 1.445030431809539664e+02 1.225654302645040588e+02 4.105151699720400416e+01 1.509848702386948460e+01 3.452029959443445151e+00 7.397779477623160460e+00 6.711845755100532607e+00 6.088283711719035374e+00 8.454117950723009756e+00 3.133516812574681509e+00 7.924137912849099630e-01 1.108724508381777829e+00 1.097070968937637225e+00
1.844990152825056384e+02 1.921956567833304916e+02 4.070456323258640623e+02 3.282716643965053436e+02 7.018630111825505082e+02 7.223638646826196918e+01 1.404376189032805478e+01 1.539146707803365999e+01 2.544189043249572251e+02 7.983338898228049629e+01 2.246836633693608576e+02 1.581180613362399754e+02 6.136763588435494654e+01 9.395022181712117515e+01 1.906115329427807481e+01 8.362567350523660537e+01 6.152554585990750269e+01 1.411848385715721292e+02 5.337760116459097617e+02 9.990796584551142701e+01 9.947594895640463619e+00 2.970359820794694183e+00 4.680157390641306314e+00 1.703062163346042546e+00 1.067567188844869897e+00 7.515021335988576467e-01 7.159157841869240313e-01 5.322461735815176009e-01 8.556884093914731704e-01 9.219714080047415328e-01
8.813678387490998034e+01 2.584724391242911565e+02 5.679202548209190127e+02 4.548617901222373803e+02 1.885810397321246796e+02 2.928028487504609245e+01 2.359557930129421166e+01 1.618254713982661741e+01 1.010362217676089358e+01 9.437781858299894111e+01 6.215481683484328812e+01 1.284064834887712436e+02 6.096603107753958284e+01 4.324879228170888013e+01 1.365970801594807327e+01 1.107145545755791360e+01 2.467155376047559656e+01 5.050329370777490112e+01 3.982824761491238519e+01 3.752401447547320146e+01 1.809344831701032774e+01 6.455251529048310566e+00 2.103425362040872049e+00 4.264510675522484640e+00 8.442069105453890998e-01 6.654716688559221272e-01 6.130301662989660061e-01 5.405213165749975790e-01 1.010993497360008320e+00 1.048910668703765481e+00
5.290541536783887011e+01 1.693663028715289158e+02 4.714811321702960640e+02 1.825044585066548564e+02 1.053516865470805897e+02 1.551720318530980514e+01 2.330884920113383885e+01 1.314352331572445998e+01 6.067405063391620779e+00 2.077073366993666923e+02 2.595894574041778924e+02 2.247737814279998929e+02 3.440782471795117914e+01 3.054799273199166976e+01 1.550620104570930913e+01 6.136621144979136133e+00 6.920667173341715284e+01 4.248098271507448942e+01 7.383303904645562454e+01 4.544745997903183365e+01 3.320772659924409709e+01 9.950758481553961587e+00 2.280569663628635624e+01 6.697371990008459619e+00 1.429019116977330306e+00 8.360923769224577473e-01 6.243827499471069631e-01 6.757436307530567676e-01 9.756740168558136750e-01 3.435188743277491241e+00
5.522122117909317751e+01 6.054227193946127272e+01 2.707392213258689253e+02 2.162396425373703437e+02 8.588927518171524866e+01 9.192000192859264729e+00 1.095725938908170960e+01 1.154020688157076791e+01 1.062790308450538390e+01 3.089826065640825163e+02 2.367309787560724317e+02 1.237272123980383753e+02 1.465153207030091487e+01 4.737173674597462636e+00 3.843869656207100860e+00 6.720500734877009386e+00 3.635498603593375577e+01 1.005384639262207358e+01 3.384636422004360412e+01 1.230763639449237132e+02 1.604176479129870927e+02 1.021941712607886927e+02 2.733345360081471398e+01 3.801050029373660877e+00 2.023757752740358740e+00 2.078690190928170978e+00 1.393856274358292957e+00 9.007105312516121565e-01 1.096395140422515402e+00 1.896277964406141825e+00
7.898381618944719129e+00 1.320983986162426405e+01 1.399488347911424491e+01 7.007186779269520116e+01 3.366657362285696564e+01 5.487251125281696318e+01 8.078933728236651746e+01 4.491641786549217841e+01 5.214443575952267196e+01 5.827531346887556651e+01 4.327797797474896413e+01 1.762054095861852332e+01 7.330859839897521546e+00 3.032044922163085410e+00 1.700768108091756270e+00 3.245298584059637115e+00 1.981662797435526358e+01 9.656140793058936467e+00 5.024671469024295334e+01 7.157393987843803984e+01 3.541452728863900035e+01 9.272048107260454586e+00 3.920393260131286972e+00 3.271630389687405049e+00 1.312714516318998825e+00 1.474270134906447538e+00 1.394873406713174280e+00 1.136380454556089603e+00 1.221996230246581217e+00 2.799817109899128020e+00
1.623470822105578293e+01 3.047935694023234987e+01 1.825074046766247449e+01 3.919815466971806472e+01 6.075785570569779992e+01 6.798151598929428019e+01 5.954637443998993263e+01 5.575272386690522808e+01 4.464894569535212554e+01 2.418928213912076330e+01 9.591537026706495439e+00 2.847194882507297109e+01 6.166278937158584661e+00 2.124813108831145048e+00 2.264233454904604592e+00 4.368305564782590800e+00 3.701784812630646115e+01 6.156329278048981735e+01 5.646994247605019268e+01 4.222757090799856883e+01 1.257231025204935371e+01 6.339796059494786640e+00 2.289563479383648126e+00 1.891809607602086274e+00 9.506456740039249675e-01 1.072996814346794503e+00 1.770897465863704445e+00 2.113218526672396180e+00 2.012228995897055839e+00 5.703116008950734894e+00
4.069395394613603401e+01 2.729309014076915929e+01 1.647649678240624738e+01 9.597070223370712938e+01 6.376765294263940120e+01 2.719232917005957262e+01 8.790358982162672419e+01 3.977779296693104527e+01 3.393010156107360586e+01 3.251333424054788424e+01 2.828350641895089979e+01 3.655107932880530797e+01 7.937037241214822814e+01 5.267356132583654471e+01 8.107798249633322740e+00 7.564709419185913220e+00 3.360014559011131041e+01 1.067002612939883761e+02 1.106883751953787396e+02 1.987792550105254463e+01 3.352171203393826904e+00 2.758821041000434349e+00 2.775005877616053773e+00 1.791275294969466803e+00 1.091820717626246440e+00 1.783687430036191568e+00 7.099199159406946791e+00 1.365606875409553567e+01 3.733054950489735546e+01 1.808075150153639044e+01
6.627070692693052933e+01 4.339239012147062624e+01 7.040699632430039401e+01 6.739813358490732753e+01 6.133267231580511236e+01 1.251454605274648557e+01 5.809069034447500002e+01 2.530516420069458405e+01 1.115950997464616812e+01 4.080414916300819428e+00 5.773816462815933193e+01 5.536803695537096814e+01 1.155521303612206196e+02 1.232378908024236637e+02 5.818470502740509431e+01 6.309337993806283862e+01 3.493014252250477512e+02 3.796531073161187351e+02 1.617100802327545921e+02 7.704646837603834797e+01 4.094122312575374067e+00 2.060768605473774606e+00 2.236385296232191511e+00 2.444353052811076843e+00 1.388946923937275368e+00 1.882305992362141911e+00 1.861882121123050027e+01 3.014422043569235754e+01 3.616762000961198709e+01 9.330244685298792362e+00
5.605066320254643131e+01 2.924857615639414377e+01 6.600724541202632167e+01 5.735977019267977539e+01 7.560349371783948413e+01 7.232923010216476989e+00 6.231705714950148689e+00 5.607502962263405166e+00 3.666438570054271651e+00 3.172651946358622510e+01 4.882060584931364247e+02 8.009992167114261292e+02 1.615931478897882698e+03 7.687125551956750087e+02 1.373708193606692021e+02 2.596226624217968038e+02 4.916561477557860371e+02 1.413293779846237896e+02 3.550857650177062652e+01 7.627988433088930265e+00 2.720901148903720035e+00 1.981892281861040050e+00 2.466417206229032821e+00 3.454835532390747144e+00 3.740038452373435796e+00 2.098907481796578711e+00 3.456274109531924932e+00 2.669010081738220741e+00 2.317995047860466951e+00 1.617475762655810279e+00
1.085527250676545030e+01 6.382627414145396472e+00 5.545638726004565910e+01 5.499666488047042634e+01 4.394204757825029617e+01 1.053938159977374767e+01 4.233432691015897475e+00 2.829392819201191678e+00 3.665115610203195651e+00 6.602824653033459867e+01 1.563810916194987044e+02 9.982021600247617243e+02 1.730870241685014662e+03 8.562008824031688619e+02 2.968429075142501006e+02 3.198818057498244798e+02 3.522792096391389123e+02 2.106434044362729878e+02 5.295754976821813642e+01 1.561253148804210511e+01 2.370484218395497056e+00 2.161223308824728129e+00 2.514857438528629086e+00 4.522955830326172766e+00 4.361582100494771908e+00 3.167108805635429736e+00 2.478052420722173022e+00 2.198601945716483819e+00 2.309737488729811883e+00 2.434409718940319323e+00
2.145501973833648712e+00 5.545304722506550377e+00 1.342290491610964942e+01 3.756363659784014430e+01 2.489616095577552457e+01 8.244872367773663058e+00 4.389489443372607269e+00 3.847384875250314362e+00 5.114249700690441713e+00 3.533667452317035895e+01 1.161346982305366637e+01 3.378272526247510541e+02 1.356904108523380501e+03 5.443392509762347800e+02 1.616096691719138221e+02 1.765997314142354071e+02 6.362608073961714439e+01 9.195862281563574925e+01 1.038449188899535045e+02 3.904236720910676439e+01 2.694745178094896332e+00 2.448973673402498719e+00 2.995234379035840888e+00 5.149158995288459550e+00 6.760783622027515705e+00 6.416859780283417081e+00 4.813182643299612984e+00 4.333335664417191424e+00 3.287874877074930424e+00 2.549458763886780055e+00
1.751211389875829028e+00 5.048425340235758618e+00 9.096187345763723897e+00 6.604240391093137319e+00 3.932470511454583040e+00 1.602654438267880721e+01 5.773886416103822228e+01 5.366238908682257147e+01 7.694302426408027529e+00 2.312996832639877098e+00 9.082842719086563932e+00 5.839550103426311267e+01 6.516732849061261277e+02 8.117340840866195322e+02 8.064369293657543949e+02 1.017915128847010124e+03 8.717025479549176907e+02 5.407828571873787951e+02 1.420923385069729648e+03 6.488119109727105069e+02 5.401665620618143748e+01 1.600088566770301668e+01 1.211593966734737648e+01 2.980229114522525435e+01 6.832382815622986527e+01 6.388502170908997613e+01 1.772228713602571020e+02 5.925254191043405427e+01 4.897710196223224344e+00 4.870501117296375249e+00
1.596385892575913124e+00 1.614226755884583975e+00 4.427603213403769722e+00 3.267915112205565720e+01 1.215390205247187083e+01 2.926897950048727104e+00 3.939833539381753980e+01 1.214447597173157192e+02 8.780776809906647884e+01 9.179399860098961028e+00 1.961658580589498513e+01 3.070190294010925527e+02 6.247778779338407276e+02 7.259922646271916165e+02 6.059822237024714013e+02 6.804011163595628204e+02 1.080995792941535910e+03 1.747692293624101467e+03 1.682252833728945689e+03 1.283833942916151273e+03 5.485660451648273295e+01 5.739996341174051508e+01 5.097054406436227225e+01 1.566131146384975352e+02 2.194371072018477662e+02 1.113020533253236863e+03 1.124576242903682669e+03 2.337700059198167537e+02 5.418587361350347464e+00 3.343687595574884597e+00
1.421471648024022372e+00 1.566098114276186060e+00 3.595715394292965605e+00 4.011114468128385901e+00 2.702027523761153738e+00 3.130111920063304520e+00 2.228291640876366131e+01 6.487656854320425737e+01 1.401279147423159372e+02 5.191159623741823737e+01 5.562712197585503304e+01 5.046977488673752532e+01 3.834492410778675548e+02 7.123911789442361169e+02 6.143433449744268273e+02 8.723912709024713195e+02 1.370363722986677658e+03 1.525465198651532319e+03 8.199852892221508682e+02 1.710267150387755635e+02 1.016951530827814025e+02 6.932478797002169131e+02 1.001643190795223518e+03 1.634919770623487238e+03 1.492763206333036123e+03 1.931593982741941545e+03 1.568116844648659480e+03 4.629579252120624346e+02 8.245960337457061584e+00 3.788656644551241293e+00
1.765515228864046549e+00 2.073980100047222663e+00 2.061708051859939328e+00 2.000286350720160922e+00 3.133488582368301412e+00 6.606563092714685226e+00 3.802968592759955300e+02 1.288037637863390046e+03 6.457850793485572467e+02 1.158346441177508837e+02 9.172554378902486860e+01 1.541318804655438157e+02 3.028831257041794061e+02 4.073747150068790006e+02 4.934990589640407848e+02 8.181029174345284218e+02 1.558799210845480047e+03 1.412498166850688449e+03 6.126890565213916489e+02 1.978283609297413648e+02 8.321288239809309744e+02 1.474462597783634465e+03 1.859206122540949991e+03 1.845703330853816624e+03 1.588461446475829689e+03 1.373395450936606494e+03 2.071211813125482877e+03 3.686112176255978738e+02 1.209545537874420873e+01 5.124623448440317475e+00
4.330203292224860334e+00 3.468172821047353693e+00 1.834216931625772595e+00 2.966152351786387698e+00 3.980793544631924874e+01 2.020488754701304686e+02 1.113264465646742792e+03 9.120781162516130962e+02 9.217792678007328959e+02 4.830590578349647899e+02 1.896796025944848907e+02 5.643363607465794729e+01 5.543190601170830689e+01 1.293807400762387374e+02 2.661944266904522465e+02 1.133346613264564667e+03 1.027613701688137098e+03 1.055153594383229574e+03 1.645344292436398632e+02 2.682607810950760268e+02 9.150904340247234359e+02 1.913673779216541789e+03 2.303793208869689352e+03 2.299545451798067006e+03 1.864558558937406360e+03 1.815792686732328093e+03 1.737765266971118990e+03 1.379024108872814850e+03 6.128507115395746041e+01 4.039232696679593460e+01
1.951814611196923899e+00 5.555477256785876783e+00 1.064128107204857798e+01 7.666152051673354606e+01 1.831426503153885506e+02 2.632603622527145717e+02 8.274195359339275910e+02 1.040145629759718986e+03 7.335443225255369271e+02 5.871526952820526049e+02 1.292255457393771962e+02 1.363416198875034979e+01 2.028071148296599091e+01 5.117283997192038925e+01 1.014812057510992247e+02 5.518428356063914180e+02 1.843799718935721899e+02 5.234275233187539556e+01 1.592065292080195249e+01 1.045597858170769143e+02 3.764018251651668265e+02 1.907337386288033940e+03 2.316539455339286178e+03 2.308711483369682355e+03 1.629677894679538895e+03 7.452410239831074250e+02 1.213196257926043927e+03 8.331406964917778168e+02 7.518427598490971775e+01 2.965744446036869419e+01
4.946829812946116789e+01 6.728845561143268128e+01 4.809938552418304880e+01 6.465538145098454947e+01 1.675026251750901451e+02 9.950903647472155455e+01 5.196886421737826822e+02 6.824669371662627100e+02 6.462503004683915151e+02 1.529936160719478835e+02 3.882928448632373630e+01 8.444272048445622403e+00 1.416468615910654805e+01 3.747984959285913931e+01 1.361823759115491725e+02 8.450042786213001023e+01 1.368147484176946875e+02 3.606631745915831999e+01 6.059499151000462547e+01 2.609062741112634853e+02 1.306530863562215245e+03 2.325618954359375948e+03 2.365473070297671256e+03 2.108638774516300145e+03 1.533872633194250056e+03 1.082607447463638209e+03 1.032062838667752658e+03 6.957628567254448626e+02 6.266872416848332250e+01 2.230073448125699542e+01
1.462760471876932229e+02 1.451530347736582485e+02 8.225375960933642716e+01 6.615451163396392076e+01 9.755236456658018085e+01 5.527063585752382835e+01 3.248203447835578004e+02 3.003987820246480283e+02 8.537065074375786367e+01 4.466066809492689060e+01 1.511753178564845612e+01 1.168414506161301603e+01 6.627510001738214029e+00 3.413164545249795179e+00 8.279584903864265044e+00 2.579971877236008737e+01 8.212472373437046258e+01 1.679265001053093158e+02 1.457053930216038680e+02 5.918173990381690146e+02 1.483415418834835918e+03 1.994140925605345274e+03 7.597725976756432829e+02 1.045449085717704747e+03 1.246985506391160470e+03 6.638713843590821853e+02 4.791417357733471363e+02 3.936129541012309687e+02 1.463612571326558154e+01 1.323636020872122998e+01
1.241789439980547769e+02 1.552007093102002102e+02 2.554756977370698934e+01 1.999957622191376316e+01 1.911274094978281468e+01 3.003049018299223150e+01 4.474437949546125992e+01 1.189186391911519536e+01 1.599361245688342059e+01 2.394630487488992099e+00 3.012535498329953931e+00 4.417396647852949165e+00 4.636022897988512526e+00 1.548200749610572657e+01 4.039587566163549326e+01 4.922474319330366939e+02 8.426852136273803353e+02 1.100648558542683531e+03 6.827393435279498135e+02 4.692867674955037955e+02 3.019853628300550668e+02 9.908119710701811300e+01 3.539452910964980248e+01 6.912945780753683778e+01 2.283924039724010413e+02 7.159600154303448960e+01 6.286946238412562593e+01 2.149564185003237782e+01 2.439799217110942386e+00 1.995552864208177013e+00
2.764043923461084660e+02 2.275851957813028434e+02 2.713165351453108087e+01 1.325011625848945229e+01 2.159021487483948931e+01 1.818198816437998389e+01 2.884069528454932296e+01 3.271461888015033459e+00 2.845755744584906211e+00 1.181025959349593313e+00 2.692689971549358408e+00 4.907888124332920654e+00 6.189957507398037961e+00 3.072364594560697881e+01 4.723494000914993762e+01 2.773145284447014092e+02 9.135988423715423323e+02 1.550515990865966614e+03 1.608036768096449578e+03 1.275475497006351816e+03 2.453732984195374911e+02 4.977533064246286187e+01 5.631888758027459119e+01 1.270173444236130820e+02 2.632587552158381641e+02 7.283409486298133118e+01 2.668646328993228778e+01 1.006840942341864142e+01 3.122524635875261190e+00 2.788079545098498535e+00
3.702366223798993019e+02 4.971964419135573365e+01 1.508865085577519949e+01 5.408433986147533012e+00 6.819309520161016991e+00 1.575756349884168728e+01 2.111463855277370882e+01 2.460745446192093233e+00 1.395460598010354270e+00 1.545995914989230169e+00 2.633225942130601460e+00 4.333293125743330698e+00 4.643114152227200364e+00 2.365157178309608810e+01 8.615387802530108274e+01 3.894618483198054264e+02 6.852938114886460426e+02 1.444724996356744214e+03 1.674201682922205009e+03 1.294907442292523228e+03 5.800800002133671569e+02 3.021740107188544400e+01 1.981624090845539143e+01 3.989820826518170804e+01 2.196626202465280926e+02 1.260798394586661004e+02 1.097326176977885694e+02 2.045934628428181412e+01 2.896769445585804625e+00 2.160022302678692885e+00
2.253620657067137074e+02 7.241791227501410333e+01 2.957852445453402268e+01 2.951108913074192941e+01 7.189278302360646933e+01 5.164823086118298789e+01 2.249910536362819613e+01 9.588088877464793214e+00 1.476341324009960942e+01 1.839148880113704720e+01 1.645520018664660133e+00 1.788493262940074269e+00 2.635392432208676361e+00 5.567637308071983426e+00 3.105151351457707420e+01 1.189603093449611322e+02 1.102292881176525157e+02 4.362568023257277900e+02 5.207299896434578841e+02 4.094907492518611889e+02 3.064721388094873760e+02 3.572311442640725687e+01 5.107013092346115890e+00 9.691926709310475729e+00 4.170559414145516541e+01 1.027218297972703169e+02 2.710637790249728596e+02 1.474496033618449360e+02 3.611845810248771826e+00 2.619762727694593174e+00
8.201553530406464176e+01 3.370490922405523548e+01 3.766303546211378261e+01 6.778035240706842046e+01 4.052128075846987088e+01 1.934307064193891179e+01 9.215961986838443920e+00 6.741083130588600980e+00 2.193694773725721703e+01 7.997038107662450557e+01 5.303619158678925416e+00 1.763855850159707916e+00 2.818854407952361640e+00 5.765040071765881180e+00 2.524040869860989034e+01 4.256205585060928343e+01 2.718395057146261706e+01 1.278397767350082503e+01 1.894736338258522679e+01 3.157833870398501119e+01 5.116848000668993279e+01 1.092190791108368231e+01 5.253961865446281188e+00 2.587351696120438760e+01 6.232374328491699345e+01 2.186398242999229069e+01 7.409366492473830590e+01 7.990838100443843928e+01 2.751582627633759159e+01 4.121456101484508139e+00
8.319323703712777274e+01 6.917083721382702777e+01 3.526496224202711005e+01 2.762208662214836963e+01 2.814877956473581477e+01 1.124803069188564564e+01 7.699218561883422574e+00 8.212898084603885707e+00 9.314067181578053578e+00 3.499839487306533670e+01 9.620782463939233864e+00 8.805917774281397215e+00 7.853356656335531483e+00 9.131814929899590538e+00 2.446484729409083059e+01 1.645520596316640649e+01 1.073635078299545320e+01 6.230038104019842038e+00 5.332499792929252358e+00 3.953752706468387501e+00 3.011658202048861810e+00 4.228049542157990004e+00 6.489497284050356640e+00 1.586008162923965514e+01 2.697620236467560062e+01 1.292083966080776136e+01 2.024328371130670945e+01 1.297653109536370764e+01 1.270358912507131777e+01 7.963539978121077390e+00
1.127646225083801426e+02 6.092469041995748569e+01 3.626704643904407988e+01 5.301115644082931055e+01 5.100240691430565221e+01 2.901692090353795095e+01 1.027065244951870824e+02 8.111750670533433549e+01 1.252932448107235075e+01 8.684812883696714891e+00 2.970146363286545910e+00 6.565426237811470500e+00 1.841648444015137187e+01 1.912130210327947921e+01 5.509720316333202561e+01 3.943890072369295297e+01 1.225688025041659301e+01 1.414924723854695898e+01 6.374216658849872985e+00 2.707702953795999345e+00 2.403781964552501815e+00 3.589064605520834395e+00 5.464455113769568939e+00 1.667158557771911731e+01 1.678788653843249534e+01 3.953914455842875153e+00 4.331738835262429532e+00 5.439776466282704170e+00 1.734366030500019917e+01 3.519070051727665849e+00
1.513455733524478148e+02 1.357681856968852969e+02 4.313291056226653097e+01 1.579029071346452042e+02 2.003850349810301736e+02 3.952851477462592698e+02 2.758754189546871203e+02 3.272195801383230673e+01 1.233113172058725837e+01 6.811505611498844814e+00 1.929800058834411303e+00 2.322074094650494303e+00 2.753128031861284963e+00 1.045135635769262095e+01 1.251602233926357144e+01 5.433121754264786496e+00 5.159183576943123128e+00 6.088832778450099070e+00 8.119777225185680791e+00 4.292923859745724435e+00 2.321227603823799335e+00 3.141215689413715317e+00 3.515399488493829772e+00 5.798091318794661220e+00 1.784634078400655000e+01 2.761101757382685484e+00 3.935792102326214348e+00 6.415100599454295782e+00 7.673592680620776818e+00 1.518836508571329524e+01
8.281999209084602853e+01 2.144141238667276070e+02 6.741656222309136126e+01 7.731912499158389096e+01 4.061997722689897046e+02 4.470687627543367171e+02 3.089740538899200715e+02 2.245533502698700445e+01 1.621210625874729772e+01 1.461725829714102431e+01 5.748180655432268082e+00 2.736673138483881829e+00 1.677088855925338962e+00 2.814741779609710726e+00 1.300940582164799153e+01 3.680526556412736738e+00 1.258573757016405459e+01 7.191424270361017079e+01 1.222868302881715579e+02 1.656952677824278197e+01 3.211277697752202620e+00 4.057362951207238666e+00 3.445335556238635188e+00 3.745327475708200460e+00 4.913343754911799977e+00 3.718718626535866711e+00 4.322089790476996818e+00 5.306096667727880245e+00 7.123824655210380996e+00 1.743762343010116922e+01
