1.449342947202326426e-01 7.313132590302702518e-03 2.495419065778161152e-03 3.117982398129621763e-03 2.351841597342342605e-03 5.130158627589597592e-03 5.070059184713890041e-03 1.366622906029222283e-02 2.470063669775742626e-02 1.103418155147271873e-02 8.260657908100448379e-03 8.723492067913973802e-02 5.436669858882311329e-02 4.130671144904375647e-03 3.379147096502586184e-03 5.733328547407064851e-02 2.706714824986035470e-03 3.714291813029257840e-03 3.369076464808834145e-03 1.411265824160286763e-03 1.359896198355814824e-03 2.640332157232662055e-02 2.083363314694029050e-02 8.266987924807549237e-02 1.593930858426863273e-01 1.243327296032610135e-01 5.689909180504054004e-02 4.965610819759714613e-03 4.698342052699076322e-03 5.855239220827008519e-03
9.462950377358868292e-02 7.660895689450177536e-03 6.115290719581036906e-03 4.959143520044498842e-03 3.442315912287012038e-03 1.733865869579010247e-02 9.156926012193282102e-03 1.131567472875010319e-02 6.569785297883336782e-03 5.028550742380386018e-03 5.519634855877742635e-03 4.528550050203400401e-02 6.488602521850682370e-02 3.779375156806638603e-03 3.946000897471394799e-03 2.571820281339043477e-03 2.641172130567264256e-03 6.858156733120305583e-03 5.149368676459693470e-03 1.960693266433471103e-03 9.930076663174387808e-02 2.514813903559257394e-02 5.388653312412106794e-02 4.790726918198954382e-02 4.218848294352230133e-02 5.633468706227468675e-02 1.973721732159777753e-02 4.990042730262355883e-03 7.059969888770397696e-03 7.014982708540490504e-03
2.247234487838426290e-02 2.192659036818303542e-02 3.978227554801287702e-02 3.231647493931457532e-02 6.863178056237144442e-02 7.866166960740543501e-03 7.563473858019408025e-02 7.911257194802336079e-02 3.137733426792287117e-02 7.219510463236445894e-03 1.943074947200731928e-02 1.473788402196984058e-02 5.443252465323714442e-03 1.022145000809797540e-02 9.760684624138640797e-02 8.441004599816359991e-03 3.844501055209296071e-03 6.237907823933976602e-03 2.050859877679868035e-02 5.271733166260313477e-03 6.357317218105622281e-02 2.127790689465149099e-02 3.240450829480192446e-02 1.125322798915281627e-02 6.651029782799988167e-03 4.374755544979692587e-03 3.899294001209725660e-03 3.053696435649243951e-03 5.192007238885409069e-03 5.801315962341263566e-03
8.815420510056732120e-03 2.475199098983402873e-02 5.428977554705937542e-02 4.383640875569867756e-02 2.041178477662663332e-02 3.538268065192280622e-03 5.340476379932517989e-03 8.997299593553045871e-02 5.186386616782388131e-02 9.241204133860160194e-03 5.373075027995216114e-03 1.076450186610068520e-02 4.860504637767576464e-03 6.750068998262745597e-03 7.469385626535617051e-02 6.539658193725865487e-02 1.929719795995739687e-03 2.424141670024063458e-03 1.687831597728152444e-03 1.899939579765034170e-03 1.107405196809996134e-01 4.241527079266322470e-02 1.429779597847014375e-02 2.783844149754568717e-02 5.386363574042118442e-03 3.882092481707672630e-03 3.335812901590486362e-03 3.148533202111987971e-03 6.359228175485527775e-03 6.872875901934467728e-03
5.082999651779230785e-03 1.553534320670198893e-02 4.333438972760960545e-02 1.680448529925235995e-02 1.198104982932386015e-02 8.594691078439387066e-02 6.035794832493879963e-03 8.315750099171091703e-02 3.236111524039683024e-02 2.228246385413634734e-02 2.384393579232651009e-02 2.404712726817562554e-02 4.393549371580283101e-03 6.891956677467706363e-03 9.718653073887560667e-02 3.941343194509221853e-02 7.804626831612336557e-03 2.612658969089933642e-03 4.168324794822109332e-03 2.405581590548272562e-03 1.950399055583248303e-03 5.464133999396880714e-02 1.399995112592848688e-03 4.379332754447116255e-02 9.705038046984493585e-03 5.225719520148619686e-03 3.649072277689909428e-03 4.183876520195205055e-03 6.488364070448463840e-03 2.365689586555736607e-02
7.265902185084565160e-03 7.719799381218528378e-03 2.906234897226463512e-02 2.051561766516768470e-02 9.499320376255141959e-03 4.979847447637081315e-02 6.254161858736699553e-02 6.588279420883227933e-02 5.535664651728871427e-02 3.193415365722316462e-02 2.703092519497750368e-02 1.917013629075701650e-02 8.590393450901834260e-02 3.183701487062676194e-02 2.641288299714541696e-02 4.516768593667806753e-02 6.231669023927730901e-03 5.948671712297199515e-02 2.444214568443593520e-03 6.209450353928727510e-03 9.054402721352607444e-03 5.860626412674450024e-03 2.019501780966428180e-03 2.578754433415158739e-02 1.448587168717438076e-02 1.376999358233159734e-02 8.672282116971971946e-03 5.910294316993255394e-03 7.710456397558554734e-03 1.370349068587487472e-02
4.935064918199993239e-02 7.437774466720349642e-02 7.303840289526360163e-02 8.326996788492996293e-03 3.170713167224365348e-03 6.317319710798372477e-03 1.117724885847105713e-02 6.160773247267350289e-03 6.040905040252190529e-03 6.641171577380406039e-03 5.722557473269957590e-03 1.037799673671633560e-01 4.848563862918531253e-02 2.271114215289737545e-02 1.312472770291737111e-02 2.248906949558365787e-02 1.264536931697629041e-01 5.613972211080321684e-02 3.897970097057661554e-03 5.436782923605811869e-03 3.564903260596729000e-03 5.498697182946336859e-02 2.551108447054784359e-02 2.409667963751576172e-02 9.883410983385475940e-03 1.032092507883384559e-02 9.198224699728002607e-03 7.828897829889974042e-03 8.842386030902000399e-03 2.070560239306009492e-02
1.026365125904977194e-01 8.044729757111814678e-03 1.042536121564915513e-01 5.790660240869728234e-03 5.491958158466199273e-03 6.068931841869556337e-03 5.259197232646958299e-03 4.853379426634527732e-03 3.789709998184289177e-03 2.538863940522996868e-03 5.720415272869231599e-02 5.112987022622139666e-03 4.112798554856061939e-02 1.488900693655459927e-02 1.672645800012035125e-02 3.067515089651109625e-02 6.054192927481819551e-03 7.301782743322207322e-03 5.033861949280445634e-03 4.370981465771865866e-03 8.052218512054325206e-02 4.693434671537807801e-02 1.878496937404420739e-02 1.578871552798194119e-02 7.588988553516417233e-03 7.943732916032366503e-03 1.233670954986119082e-02 1.375242937125089812e-02 1.351574036063997626e-02 3.873511479936293106e-02
7.209120960671546938e-03 5.995172176025592541e-03 9.078314198915288236e-02 1.385258499542758523e-02 6.893728872386745317e-03 2.858747462817564245e-03 9.018537531096864485e-03 4.325105994110033970e-03 3.667339790619509460e-03 4.240629609572600829e-03 3.094934031185455400e-03 4.577757610040093100e-03 9.162977676076312222e-03 7.394687696567709377e-03 5.386650036830641780e-02 4.485397296981843973e-02 3.396862607030428152e-03 8.091945973542439066e-03 9.393131895143421936e-03 1.103012473812892691e-01 2.170078709973705111e-02 2.233919631396860672e-02 2.402037435892899128e-02 1.570036931246616974e-02 9.234926023555693059e-03 1.366812134099085543e-02 4.830153064046358025e-02 8.526232213226021817e-02 4.765484687707188458e-03 1.179293656507688082e-01
7.384016899118360684e-03 5.720726308013999485e-03 8.982034072794492507e-03 8.242402306721118357e-03 7.638100486387965592e-03 6.609144070277347960e-02 9.829528617656216674e-03 4.286089000329830652e-03 6.556815931904093342e-02 2.390359640822091458e-02 5.012723432523046203e-03 4.818076978901638698e-03 1.022231909083150259e-02 1.234486936335352746e-02 6.211375351206726778e-03 6.665337103600540818e-03 3.189309191535732307e-02 3.106766711284190963e-02 1.596713363201867145e-02 9.888417794881358691e-03 2.817902846462598879e-02 1.754563000048042429e-02 1.983730569092231194e-02 2.170428841729815650e-02 1.211723914623196244e-02 1.506608370260671161e-02 1.303701197124903510e-01 4.088494780403323370e-03 4.865064320899466395e-03 6.156958345251429404e-02
1.082840987305017794e-02 5.498472547452913639e-03 8.143729370886577251e-03 5.973436661430523570e-03 1.190137573332101552e-02 4.159111719165575066e-02 3.982157400499731353e-02 3.588304059315937378e-02 2.422926489048071730e-02 4.025214836321859037e-03 3.989432251499570870e-02 6.538964583087283899e-02 1.357563563744994262e-01 6.713908980293496753e-02 1.239462792391600975e-02 2.434308038029240825e-02 4.537079072456480511e-02 1.253206820310093575e-02 4.218045277315876987e-03 4.733361635944121487e-02 1.964757889916227129e-02 1.728587335917091197e-02 2.198071790990735117e-02 3.055225801576338940e-02 3.254775635280375556e-02 1.738376595145158313e-02 2.593823497580054552e-02 1.897257316390379284e-02 1.670318878957812933e-02 1.204339935153088924e-02
7.418257206903408618e-02 4.036127678972815935e-02 1.202480134725547600e-02 8.246832303456456958e-03 7.480049142762425912e-03 6.533642069852171885e-02 3.120044700062325066e-02 2.147723789754453147e-02 2.532938754667560938e-02 7.050497428165397422e-03 1.218459721960825533e-02 7.962893376181391647e-02 1.397162293716674164e-01 7.324208710782408038e-02 2.666884109890086535e-02 3.039744764701011320e-02 3.368256228195098262e-02 1.987354927769701199e-02 7.043582820985257696e-03 1.092481549788844181e-01 1.906902497014609579e-02 1.915470188968000295e-02 2.234937184638753974e-02 3.967890859030002992e-02 3.753446920898362293e-02 2.655916481379001770e-02 2.022303181610084211e-02 1.800602522709869591e-02 1.933468165617150195e-02 2.058071674059362352e-02
1.729778788733519340e-02 4.065611386292072860e-02 8.853925937529839862e-02 9.748182528021974436e-03 6.539570749262414891e-03 5.406258795612645801e-02 3.097902715790213854e-02 2.724878523810306957e-02 3.472432881340979660e-02 3.902264538719082704e-03 6.562164628425577739e-02 2.632659319762585201e-02 1.033625528542704147e-01 4.520824847227046528e-02 1.448853911464109863e-02 1.707937693522629252e-02 6.343001937356375700e-03 9.336237622391375252e-03 1.363216064747014081e-02 5.933728811930949650e-03 1.850558098704022450e-02 2.005697240650563401e-02 2.488241057442266285e-02 4.100937835964091338e-02 5.163342424266544745e-02 4.533739891587791615e-02 3.320334803402285456e-02 3.078783463510268228e-02 2.665129093871889190e-02 2.178751223355144054e-02
1.467384818551790461e-02 4.030062052191773353e-02 6.218473805227136414e-02 4.263113768328983394e-02 2.501067236193288065e-02 1.096022783737472250e-01 1.206082518153893390e-02 6.364924603622584311e-03 4.844218876654984851e-02 1.567416735488507545e-02 5.525909417740899887e-02 4.862284951126867941e-03 4.678961580840645951e-02 6.525029512174068680e-02 7.153361219580660346e-02 9.916876631099963424e-02 9.001436337697922563e-02 5.877732347677618735e-02 1.614472587378177892e-01 7.637121334330156108e-02 9.362692876121011393e-03 1.211743812247499247e-01 8.929364023027890063e-02 6.614677940740400740e-03 1.160975673492032137e-02 9.393406363112631954e-03 2.314756979579932206e-02 9.548595094237284642e-03 3.671773253796521697e-02 4.185754741221026087e-02
1.382344663343543743e-02 1.337396755569477021e-02 3.195692547566663516e-02 1.584223807054618155e-02 8.214108119159586885e-02 2.066180958177397248e-02 5.964536911831476093e-03 9.804290575974079422e-03 7.602168853297501527e-03 6.013356045426231089e-02 1.226017864054886747e-01 2.404057490331677066e-02 4.214481333974995358e-02 5.491172507287050975e-02 5.084287388718349010e-02 6.290262932681450758e-02 1.086634987437040956e-01 1.898573338378714559e-01 1.953530994739403615e-01 1.542121073006961218e-01 8.682137822627047571e-03 1.051430918833216356e-02 9.001324957098299703e-03 2.179974886803186587e-02 2.612012979508107624e-02 1.319547833562963179e-01 1.297636161003777600e-01 3.051470696443299435e-02 3.783512142173098280e-02 2.862441482073347504e-02
1.286030345751149571e-02 1.361283894308247880e-02 2.652766374549292080e-02 2.795251159942482161e-02 1.812592640222432036e-02 2.184877861080335507e-02 2.035079876909507649e-03 4.812000436163869216e-03 1.089521653967522562e-02 4.487332698168212605e-03 4.636890166869038835e-03 3.588086922957593045e-03 2.406823916139173153e-02 4.966554069871673832e-02 4.715653518105820952e-02 7.346086904269016893e-02 1.292560837692967313e-01 1.596488556662783442e-01 9.374989374054312763e-02 2.059612639405663040e-02 1.224425896310109806e-02 8.320350875426840709e-02 1.199291228598459158e-01 1.985976441162309591e-01 1.842447006086268824e-01 2.368831843033679385e-01 1.866309444517922911e-01 5.827704103442836459e-02 5.474985074852659062e-02 3.183350968254779895e-02
1.663908231139200194e-02 1.888366032152482415e-02 1.766661926759687321e-02 1.591896408739073773e-02 2.313417613962348920e-02 4.063307180218996700e-02 2.964022130897022225e-02 9.398670539206820107e-02 4.574769470381252062e-02 7.759877438643353505e-03 5.697695993181674072e-03 8.762682146751988102e-03 1.731134710467630358e-02 2.582454301368527702e-02 3.448610900649230759e-02 6.242752180546875390e-02 1.375016292833244336e-01 1.414912759608592530e-01 6.841085556665139900e-02 2.372627956703752747e-02 1.011478336657023747e-01 1.812882259999800683e-01 2.297705135452007830e-01 2.324847629258949278e-01 2.015258515964286623e-01 1.712977114699938130e-01 2.486810276073648518e-01 4.562593627030524929e-02 7.141390547563000735e-02 3.834337694851594480e-02
4.158654470330117731e-02 3.256767177356996446e-02 1.569584777918076393e-02 2.185489632812057451e-02 3.843933103927652407e-03 1.485984331191995446e-02 7.808160621272600133e-02 6.282225122533270645e-02 6.167369767110436607e-02 3.067035378058625972e-02 1.234552119379471978e-02 4.067066481845173394e-03 3.938926882816069092e-03 9.099198419872545768e-03 1.678211104432252715e-02 7.714844702622047912e-02 8.331468165750283150e-02 1.033228932448297249e-01 1.844695046587684767e-02 3.291630308905358487e-02 1.115041730261497888e-01 2.379386799742430059e-01 2.894435589193088965e-01 2.949329520106158675e-01 2.387967975511745278e-01 2.255355109148778070e-01 2.053669654864919980e-01 1.658549581117582106e-01 8.900806457663248267e-03 6.121093845525145752e-03
1.632992978719731772e-02 4.510576323581127339e-02 7.856530517495155519e-02 7.211077011302126534e-03 1.156511202771822767e-02 1.545274262365534459e-02 4.877028260148699723e-02 6.092649774661842293e-02 4.169628267412944095e-02 3.227681894598763424e-02 8.543259498875492228e-03 8.308799795085711204e-02 1.240365102463901054e-01 4.562936425180107343e-03 5.980141823361653612e-03 3.495372652879284725e-02 1.366494163677912065e-02 4.662648608143325768e-03 9.277564060209532448e-02 1.170579112767722654e-02 4.256585671282085009e-02 2.239828224432431902e-01 2.800585144733814813e-01 2.896162601303373663e-01 2.086864026731404531e-01 9.521438413900450148e-02 1.521147482778712756e-01 1.035196105447130505e-01 9.306778350441378966e-03 3.628704671558719182e-03
4.701488390550103737e-03 7.091166110365039466e-03 4.439229463982584389e-03 4.603341503299953306e-03 8.635898701058224852e-03 4.936168897793563777e-03 2.531844020007173804e-02 3.260706011458385650e-02 2.993951551988224477e-02 8.435386100898204301e-03 3.558439930380885661e-03 5.731611217406033798e-02 9.658768259417496727e-02 4.069620271495872146e-03 8.120302430255153803e-03 5.063380882388376913e-03 9.061985428130062484e-03 2.880117928295868306e-03 5.513364499746475737e-03 2.628859688494585012e-02 1.356517893410383035e-01 2.542637988032655505e-01 2.702971521423507828e-01 2.550463288853253574e-01 1.943166181235224943e-01 1.410292353028993195e-01 1.354235023318934306e-01 9.711231187287187872e-02 1.473853295942890822e-02 5.756786592551137345e-03
9.576762739985773126e-03 8.808996167458945509e-03 4.518106962305987531e-03 3.924404537565028342e-03 5.168046724594609065e-03 2.737847515644440191e-03 1.332523757626286054e-02 1.307541435147546553e-02 3.726695834774242707e-03 2.577099360114736872e-03 9.834859316515476291e-02 8.647835568813867779e-02 4.707295668966586522e-02 2.123336795399961147e-02 4.434471558693612453e-02 1.387065039853276754e-03 4.861562173436918301e-03 1.135666643622381365e-02 1.119206784307507849e-02 5.063982196957257653e-02 1.374151445710360964e-01 1.975699692631369131e-01 7.980493990315537522e-02 1.197257474651742121e-01 1.546295203918951477e-01 8.741715390225765492e-02 7.304321715873964005e-02 6.655244114731417859e-02 9.518386851787077885e-02 1.033888945214343075e-01
7.706695560596972007e-03 8.894108939750454065e-03 1.672118158652243468e-03 1.428134977118501302e-03 1.191017069051751864e-01 1.682193307351991093e-03 2.155134074639366258e-03 6.366037487839927567e-02 9.048259367938560338e-02 1.559693016354808670e-02 2.287494389928696956e-02 3.613462483573625511e-02 3.292758902555598111e-02 9.998857646267936272e-02 2.916168440642105501e-03 2.500836502844560466e-02 4.699751491274614668e-02 6.962848895113027403e-02 4.865479411838400520e-02 3.701155242696804043e-02 2.602778642015375968e-02 9.244314371545868728e-03 3.566893671626482961e-03 7.763869917842262762e-03 2.824965356456885651e-02 9.575167767176814143e-03 1.227521963506133726e-02 1.402888324223445504e-01 1.825647941960064150e-02 1.703485293408149581e-02
1.642202507215752630e-02 1.419570889684242977e-02 2.059690047243318504e-03 9.695654765944063114e-02 2.154197718444464133e-03 1.265485468558256721e-01 2.026541066379158873e-03 2.277451245159139645e-02 2.151626118378290389e-02 9.318063304577088937e-03 2.299015180623754928e-02 4.169473938175181915e-02 4.250788635160147877e-02 3.136666238586373941e-03 3.211712092551300204e-03 1.421408677946992341e-02 5.320498067064302616e-02 1.015192828254704721e-01 1.175752891140116052e-01 1.028640003408692188e-01 2.165314620544452062e-02 6.344370723427084080e-03 7.757502589488646585e-03 1.837758447637127465e-02 3.278770126015136815e-02 9.711800136368062275e-03 5.931521144202487987e-03 6.700163442497117372e-02 2.521499184600527535e-02 2.415287463703748305e-02
2.059385645435996351e-02 2.957618547421493951e-03 9.685218970109091274e-02 3.995770099944767617e-02 5.155995713723398460e-02 1.162390490796966214e-01 1.606556351889966150e-01 1.864215489262907241e-02 1.058684360677170609e-02 1.208451849392470044e-02 2.190332818158870556e-02 3.672671323425693440e-02 3.184703297270676664e-02 1.991941857186670280e-03 4.743390332819303473e-03 2.044916596676401785e-02 4.053222990272251081e-02 9.544965343042619010e-02 1.226309743616384867e-01 1.047818346625133540e-01 5.187247375489879159e-02 4.486694058947754069e-03 1.264345221650250151e-01 6.998304798286485856e-03 2.949745117155807422e-02 1.609299971435587326e-02 2.052005830619642313e-02 1.154980252843113148e-01 2.026559655785124467e-02 1.824187823666113817e-02
1.139831278830665331e-02 4.053568487592768693e-03 1.741543541432663371e-03 1.794875591557540612e-03 4.287922665191628777e-03 4.065205216488984412e-03 1.715250176392331682e-01 7.319259868637903454e-02 1.072290763177198153e-01 1.373312433658488152e-01 1.288261805836813344e-02 1.530826353182082947e-02 1.921432606834512849e-02 3.562121320359011578e-02 2.138956880136472834e-03 6.344611200612123268e-03 7.054676592655045875e-03 3.294029085159939224e-02 4.264774460654426752e-02 3.493052618879832066e-02 3.252876219992459350e-02 7.596886774257124303e-03 3.494931271755828683e-02 5.646361481866236237e-02 5.326665494204969008e-03 1.203922134120389946e-02 3.864964156295515318e-02 2.596821447866863239e-02 2.284028719205258642e-02 1.982908202422340935e-02
4.078526216085650961e-03 1.623035852935266572e-03 1.733352550517157104e-03 2.923299625020901217e-03 1.921612171941518375e-03 1.408605404286982776e-01 6.947595488925727147e-02 5.096394557934588038e-02 1.574556852021518627e-01 5.295171632412046768e-03 4.173325750253730620e-02 1.558954680405914318e-02 2.259451868196306334e-02 3.857225957193270022e-02 2.885094297948994409e-03 4.726627285046524317e-03 4.490220314355433673e-03 8.081613900733904121e-02 1.189155379494666320e-01 5.446106712971084986e-03 1.052524775070038179e-02 7.894233941429923407e-02 3.845874385860705708e-02 1.166281074410419928e-02 2.147754109079592563e-02 6.431275653791756163e-03 2.997810454951352344e-02 4.552547568358003560e-02 2.626247603483335136e-02 3.166075919791153798e-02
4.133598256121116983e-03 3.326325674651233952e-03 1.621673671705045660e-03 1.186192470213791707e-03 1.344322238295474507e-03 8.267527161512756850e-02 5.694264192733273361e-02 5.993602266960311453e-02 6.590987686505769827e-02 2.211244694439661387e-03 7.728467231311084151e-02 7.813163318880680941e-02 6.166736342313043628e-02 5.930449886110864682e-02 3.735988490002236252e-03 9.670036982075055909e-02 7.170823749004942571e-02 4.551593100207670245e-02 4.016219777571097133e-02 3.019656850997325462e-02 2.391263985330771558e-02 3.429245750616012611e-02 5.028062398761130175e-02 1.137634323951730170e-01 3.163070269604442014e-02 8.792511456476467813e-02 1.405294975089851628e-01 9.714968534217854890e-02 9.971323407954597873e-02 6.534256840597854610e-02
5.614304770042623065e-03 2.934200754097269961e-03 1.667420911806651853e-03 2.270658179213890307e-03 2.101380118418441634e-03 1.178968420223572809e-03 4.189456792583280513e-03 3.643889258079346504e-03 9.016932996859980398e-02 6.590132747735617802e-02 2.485534353679817038e-02 5.831536838228988662e-02 1.442160831795511466e-01 1.273652016150979838e-01 1.316508073657673798e-02 9.950277670058444920e-03 8.168612330166261093e-02 9.876144655789756421e-02 4.550477094419344559e-02 2.026834361593120998e-02 1.952123520180898061e-02 3.006976815964889499e-02 4.475634977013388111e-02 1.327969281922688483e-01 1.331610102880516622e-01 3.162540223040759269e-02 3.596212437154039376e-02 4.620546482670182670e-02 1.497144440020022338e-01 3.047063026164954780e-02
7.557563488998990386e-03 6.557360425617862060e-03 1.987488402724485199e-03 6.765434051010177710e-03 7.767141984852038439e-03 1.451842820079805342e-02 1.028481060665941034e-02 1.578168536407171954e-03 9.118206238260201379e-02 5.337512111147949684e-02 1.623912846676139540e-02 2.074582961368403103e-02 2.192189538714322053e-02 7.353740703648635468e-02 8.255557887088518787e-02 3.423319107503557807e-02 2.880052374229193080e-02 3.165409845551486051e-02 4.341957767739897806e-02 2.530092087546547894e-02 1.786697892487575448e-02 2.644974014628230161e-02 2.973338626018298680e-02 4.878779288053151919e-02 1.506753077651039052e-01 2.375631104067000079e-02 3.462458748702783307e-02 5.650924114769163148e-02 6.788976364448409684e-02 1.341171660391614340e-01
4.144612705763037197e-03 1.033252883852743553e-02 3.070755937332728027e-03 3.255052252125985052e-03 1.555634557266793137e-02 1.627396807838200204e-02 1.144635731708553393e-02 1.581716469460240360e-01 1.217579471926458073e-01 1.150029322866403664e-01 4.749095533694677740e-02 2.404471001986326767e-02 1.434231889971056967e-02 2.223757704584294545e-02 1.002613389433258950e-01 2.598581715920409568e-02 7.059078628241863274e-02 1.326921733444424295e-02 2.602760329169873793e-02 9.775605156751202007e-02 2.512528432205764564e-02 3.502309357590009664e-02 3.033469020376711525e-02 3.287124072285845661e-02 4.328287438699258277e-02 3.310280858610781946e-02 3.906559590893604605e-02 4.803733254458024404e-02 6.445900801692663884e-02 1.578583392613620573e-01
