3.282839346764072630e-01 9.623885985937110157e-03 3.786196355954871140e-01 5.654298703384604344e-03 3.428773054319982361e-01 4.798056305982391530e-03 2.246989032947268629e-03 6.026677442667508801e-03 1.086207040012514800e-02 4.913893222479849554e-03 6.765393148989501913e-03 2.107683467162264901e-01 1.344720998959239855e-01 5.440299269270174737e-03 5.639974941878728512e-03 1.442690032257292754e-01 3.355664560918666505e-03 1.531564518149193055e-03 3.120824904074206464e-03 4.784954636825580754e-01 4.442293677543164288e-01 6.735357956505090560e-02 5.151238063452683730e-02 2.050199006578214966e-01 3.957537857661251324e-01 3.086933820691595831e-01 1.410365151645767146e-01 1.234463542651071874e-02 1.171924231738559474e-02 1.464761950554880135e-02
2.139793166649112677e-01 9.411108013102100628e-03 6.745171358094210860e-03 7.277811950980189910e-03 2.886349523380557069e-03 1.631044751702177831e-02 6.269286313167765808e-03 7.598924015187575112e-03 3.649514859571481237e-03 2.178916184849516262e-03 4.255593836308162702e-03 1.073584602431205820e-01 1.572493669097406177e-01 3.764237733729887125e-01 6.197905850542032719e-03 3.958651097733899560e-01 3.122564832648625378e-03 2.804773053404228944e-03 4.501632465889269206e-03 3.548837885097923771e-03 2.542202873011330522e-01 6.441688888924912426e-02 1.335872855423729522e-01 1.190757699026565586e-01 1.051006163338604193e-01 1.404798942537407724e-01 4.917854297215587533e-02 1.244794767604559538e-02 1.764604127104404951e-02 1.756145226473528401e-02
1.273245491681544543e-02 1.219277836822565790e-02 1.723505092826351295e-02 1.400006264249350520e-02 4.410460022438206923e-02 1.434793404538778350e-02 1.848503954722840459e-01 1.936726786663689470e-01 2.623937112261352789e-02 3.559167201535918829e-03 9.250536596088560631e-03 8.598300013306251627e-03 5.709635637892603553e-03 1.268352904046049327e-02 2.440042644036599095e-01 1.258794949206914864e-02 5.777744019341730063e-03 5.163689869044277465e-03 7.876922980063250784e-03 4.510636065830991859e-03 1.560102297488650258e-01 5.278854124784378155e-02 8.066436190991915778e-02 2.802334924813357220e-02 1.659005913156126957e-02 1.090845935943295271e-02 9.731925012674353531e-03 7.629505714602751072e-03 1.299234876376000915e-02 1.452559030261690171e-02
3.776922795510093394e-03 1.050586346850236434e-02 2.304184606810100178e-02 1.861981137107675960e-02 1.636240364874619671e-02 3.754983146855615517e-01 3.733867948614194021e-01 2.315796938155001983e-01 1.251454714925556710e-01 4.944593245285788807e-03 2.272225556841394722e-03 4.520029557303750084e-03 8.158800017057286913e-03 1.192543991701932454e-02 1.883764783245003849e-01 1.629948009249581331e-01 3.480854336562178020e-01 1.927962930726844198e-03 6.694042646685848625e-04 1.312197127584019711e-03 2.730893236777091615e-01 1.090316543511336000e-01 3.760427170400326008e-02 7.417135176423510223e-02 1.353975542283261495e-02 9.640092090666321084e-03 8.268303209855597594e-03 7.841309432240648955e-03 1.592524121331185399e-02 1.727168648034530310e-02
2.151517446905511655e-03 6.468470135552123815e-03 1.802563976814437405e-02 6.997705652017766065e-03 1.069447550382083417e-02 2.189436069302548582e-01 3.817941209103225542e-01 2.146166815538436412e-01 7.868386523856786552e-02 1.336374179779874390e-02 1.027016142477515416e-02 1.430353578518562228e-02 7.217785844560922065e-03 4.611759041457622610e-01 2.437665964639886551e-01 9.782827119281022055e-02 9.030778349520172943e-03 2.322607225216365492e-03 2.395281238262086249e-03 1.430297602486428014e-03 1.541134664877923761e-03 1.424214786394332188e-01 3.672192239217835219e-01 1.214020303759024977e-01 2.443127395872557450e-02 1.291673105406020844e-02 8.967604832575347754e-03 1.037336221843190159e-02 1.624661989472083248e-02 5.969693531760135452e-02
5.854557591360890628e-03 6.294728117506601106e-03 1.852606454275764966e-02 1.031999279752566709e-02 6.833748190885635156e-03 1.228181624719314469e-01 1.567208329791797694e-01 1.667632160935935137e-01 1.348603326965170379e-01 1.766829585736221300e-02 1.649052823460791031e-02 1.612065310661723455e-02 2.075496988573113932e-01 7.807485263874844317e-02 6.568267197413196756e-02 1.106605640088927506e-01 6.954747253248444623e-03 1.461420532023082475e-01 1.697618347703873419e-03 2.621463556877388044e-03 5.737455776768100174e-03 1.179367541530664150e-02 4.497508983929545678e-01 7.048958842401123470e-02 3.640660817689807954e-02 3.384775608581420958e-02 2.112692238703126404e-02 1.458834347126812710e-02 1.930492557894299827e-02 3.471270844856639420e-02
1.195006562915410381e-01 1.807275124748326245e-01 1.770558423391502267e-01 6.391191457030141222e-03 1.659750767247821900e-03 4.716487880394235055e-03 1.039236010909747390e-02 5.711077418031324134e-03 7.259447351931704734e-03 7.460536560140449032e-03 1.034582307445022428e-02 2.497907259209031783e-01 1.164671794723001336e-01 5.406336355644739827e-02 3.153521461097335415e-02 5.450586944192616079e-02 3.079499874251654945e-01 1.377587772211107675e-01 2.638570770737992330e-03 3.852291183284790432e-03 3.457621380415084548e-03 1.409494396379393222e-01 6.597878604116580448e-02 6.343902708897333764e-02 2.462950123063300037e-02 2.523989921053051630e-02 2.224248070191079535e-02 1.924474308424528254e-02 2.210328710416653575e-02 5.256978655352092383e-02
2.472582016078486711e-01 4.586916146744806078e-01 2.531222683715234067e-01 5.142425576293385356e-03 3.873648627580029546e-03 4.329132742427578909e-03 3.867629555366580880e-03 2.134654156468904825e-03 3.961058469030520092e-03 3.362236828919228926e-01 1.436018540950361466e-01 4.540563816861911683e-01 9.860677179421481475e-02 3.510449234269585883e-02 3.973813328589771016e-02 7.351753912831168747e-02 6.017452184096909983e-03 6.205773967308609446e-03 3.478024920090873849e-03 3.666641953416683707e-03 1.985578196931870876e-01 1.165111334018935768e-01 4.694024797545110622e-02 3.942165456107095400e-02 1.885452297427523197e-02 1.969968066633338497e-02 3.059420173345070090e-02 3.439102052831305434e-02 3.410817190954865130e-02 9.876477286570929659e-02
1.801867955691719564e-02 3.753875645252485738e-01 2.171497476811000693e-01 1.137080817051093831e-02 5.282883228750367977e-03 3.195792550453141478e-01 1.240344687934457832e-02 5.286589796745170232e-03 6.638148161707793822e-03 8.379005355397399143e-03 4.453492123520940704e-01 1.088001110183301270e-02 1.448073640129815369e-02 5.979508033117838899e-03 1.270372840707418849e-01 1.066554399417573296e-01 2.197385779121433652e-03 3.460052896381771680e-03 5.334661179291851421e-03 2.651954673959839304e-01 5.270690540380657679e-02 5.480489822881903783e-02 5.939867742421848368e-02 3.892869814747387802e-02 2.290925381285709855e-02 3.447684175160890818e-02 1.285358739015557694e-01 2.263687794828020128e-01 8.844509337674779162e-03 3.023114746886886861e-01
1.191843025141514634e-02 8.905225894497175235e-03 1.426302251714581595e-02 4.969286822879110180e-03 6.194556828894554924e-03 1.519056286081310880e-01 1.396641979989611190e-02 3.398628074167573399e-01 1.604632481015282330e-01 5.837912390188034623e-02 8.607474563932330028e-03 6.493006988149490136e-03 4.405901201097808806e-03 6.662794095916900819e-03 3.688673561611248344e-03 3.918570198023565120e-03 1.543583580110736465e-02 1.309661778867090946e-02 9.901157349379321321e-03 8.310812530615272961e-03 6.744402852970360351e-02 4.255254799608060301e-02 4.865623441992389386e-02 5.359758616852202534e-02 3.007619752289276277e-02 3.810056357868919080e-02 3.474958282250503183e-01 5.217863533463069636e-01 8.986457645284117585e-03 1.589328683113581386e-01
1.212084165858508256e-02 3.727250777880499744e-01 7.644791013831350734e-03 2.468037978063972009e-03 9.025419740358286633e-03 9.489386206352033726e-02 9.351741569215284156e-02 8.543052679709614572e-02 5.900102001627043763e-02 4.661042219223519023e-01 2.945659801976703226e-02 2.793309449726873173e-02 5.782127117591298604e-02 2.862056368399967798e-02 5.294474826167577461e-03 1.041519997309967201e-02 1.915981620529981153e-02 5.213890255050760564e-03 2.920454109510977822e-03 1.101383230605714331e-01 4.639242589768172859e-02 4.139089691424058248e-02 5.333123772559385245e-02 7.482350018350129861e-02 8.034380357549472662e-02 4.355439993285660505e-02 6.783341685915716957e-02 4.996556683325403120e-02 4.398782138670626063e-02 3.112204936825051921e-02
1.668498569703197876e-01 9.124468288622940293e-02 1.511406644236967280e-02 1.297620803909873589e-02 1.149244561270123914e-02 1.540639424312330308e-01 7.219864046590324103e-02 5.003953513960526789e-02 5.992658438871286547e-02 7.054704021388974108e-03 8.921318586754080349e-03 3.583944289009306783e-02 5.926261555925853297e-02 3.093990653883780390e-02 1.123680900925691679e-02 1.276363988662974035e-02 1.401019213986025996e-02 8.185329202063782242e-03 4.855379447139106068e-03 2.511548280657535659e-01 4.438397076220562676e-02 4.514910222182238336e-02 5.330320226342568496e-02 9.554956673633922815e-02 9.110737285515405071e-02 6.503145283189686043e-02 4.994724130506345700e-02 4.493156822921931526e-02 4.870712964842613402e-02 5.231436228357208562e-02
3.969287542640445587e-02 9.543673669855959329e-02 2.119931397730488443e-01 2.419938443281580490e-02 3.783328461876038218e-01 1.297635183631729028e-01 7.214807764142174007e-02 6.287505192677259047e-02 8.061745044091264689e-02 3.103177264519975300e-03 1.540550442116211116e-01 1.296260077149493511e-02 4.370399179591224342e-02 1.892277517807062354e-02 6.013918961838014658e-03 7.030316561032252769e-03 2.595769374223702748e-03 3.800235375254680092e-03 8.197703460027429972e-03 4.172948562731017275e-03 4.249920551299259802e-02 4.658018527282277443e-02 5.893462518969602715e-02 9.802555335772748790e-02 1.245069980360110629e-01 1.089798931820039340e-01 8.047664357054692963e-02 7.526301905746658749e-02 6.597604318853525496e-02 5.443107253830175435e-02
3.443680419165301432e-02 9.746704087910677827e-02 1.700937378560827828e-01 1.215251478775794952e-01 7.161732611992943642e-02 2.763034648888593181e-01 1.511154856434759192e-02 4.993712321738863827e-03 1.112101427129328080e-01 3.646522048423230661e-02 1.300815425442199968e-01 2.940592445679354652e-03 1.969581658811097105e-02 2.703656418967585739e-02 2.924399502511750709e-02 4.000775809026782537e-02 3.623084631212319939e-02 2.362559248751100460e-02 6.479629122554293741e-02 3.184928059514672422e-02 6.713596487993427411e-03 2.769495271533370384e-01 2.083437782846173647e-01 4.962591950156907128e-01 1.239940624242866045e-02 6.404755941114578452e-03 1.421319358690096256e-02 7.640982988722700223e-03 8.921875795996055125e-02 1.026626898226879053e-01
3.231428807388270208e-02 3.232626911263723757e-02 8.730124362589770926e-02 6.491241226982256141e-01 2.356241068460070420e-01 5.199396681173775597e-02 7.285907927033256903e-03 5.426203753594690225e-03 4.614593284303964218e-03 1.389640171557172954e-01 2.861310823933582714e-01 1.396984551825844641e-02 1.717144445872307787e-02 2.220570091791140496e-02 2.042938868896643570e-02 2.511730556980966075e-02 4.340917016074415102e-02 7.592927329702735262e-02 7.824091145148880100e-02 6.203557536975769227e-02 5.451286903088229698e-03 7.787654668131751938e-03 8.933178948921094431e-03 1.957066133963236351e-02 2.060713312484883930e-02 5.683065623066214933e-02 5.660884303522997069e-02 1.826627495563493478e-02 9.182501865876702141e-02 6.999759714242279052e-02
2.963935079810606221e-02 3.216554546079150589e-02 7.160659052670195757e-02 7.902905380799074564e-02 5.277401293636670154e-02 5.488495749277971791e-02 3.033460723769682565e-01 2.220663890451728302e-03 5.166441791059962242e-03 2.685354352158739709e-03 2.833843530134078949e-03 1.893811972546557195e-03 9.408688009253316983e-03 1.951122485607135332e-02 1.862377148774515059e-02 2.915088464363462320e-02 5.145252587749032241e-02 6.375951558036072053e-02 3.758339985691250967e-02 8.312282039538473888e-03 4.991753414296543935e-03 3.421050811957400406e-02 4.962704397380582333e-02 8.393249178027618884e-02 7.974168054904071101e-02 1.046186833758412787e-01 8.384572682537924648e-02 3.220466456701472774e-02 1.337480634798279000e-01 7.817410227903140441e-02
3.776138147125837619e-02 4.340440152837383297e-02 4.197589706974784451e-02 3.912554939479104266e-02 5.622887142880992478e-02 9.481481155838673847e-02 1.578327619964741552e-02 4.242769920211080653e-02 1.753222841656804781e-02 2.955198470132489388e-03 2.150795631188793123e-03 3.272762454751898271e-03 6.485455084418274667e-03 9.845184002556512173e-03 1.336576339751398279e-02 2.458805581249637676e-02 5.448379609676045482e-02 5.644609393865663433e-02 2.746183136273874087e-02 9.605901503714651610e-03 4.146118473845619018e-02 7.510810437486180324e-02 9.613058520504039195e-02 9.982527003719549041e-02 8.902128053778422812e-02 7.752956084277783100e-02 1.148084487915847079e-01 2.402204373499047460e-02 1.755307405486322136e-01 9.449971044394708808e-02
9.330260266096646049e-02 7.302357167196055210e-02 3.551814068831878751e-02 4.954772323614386326e-02 3.176822900154812387e-03 7.260491947976270392e-03 3.084771383877691828e-02 2.365135389197824817e-02 2.317344569529214068e-02 1.138411951450882600e-02 5.525206535224854408e-03 2.422563537883115625e-03 2.339412784994120836e-03 4.804554248480525161e-03 6.401689692217973383e-03 3.025621808367643523e-02 3.294311883149939058e-02 4.419384745936040526e-02 7.910544174971034445e-03 1.418318106811631250e-02 4.597388825839687082e-02 9.950824959415388582e-02 1.226866875018625264e-01 1.289179162040601789e-01 1.078489171217578979e-01 1.046717885153737732e-01 9.737240176806631620e-02 8.308105688595381066e-02 1.356884143953959385e-02 1.061329038505631935e-02
3.676693158544677015e-02 1.009372315991247659e-01 1.754969743909511326e-01 4.941985406670053836e-03 4.874738556105061293e-03 5.582211469065307546e-03 1.772771974266926232e-02 2.223183916417348707e-02 1.524099219565566710e-02 1.170378907577296172e-02 4.672370526581211270e-03 1.882895424724795874e-01 2.828103827713164264e-01 3.299074909833446794e-03 2.312989995654292624e-03 1.399009803856774738e-02 5.498285382380309165e-03 2.043789892836347238e-03 2.128849758626849276e-01 5.105656549561369585e-03 1.778229465934654321e-02 9.545482457535899024e-02 1.216939515037248065e-01 1.292365220026768513e-01 9.559367792380543682e-02 4.465204547192018480e-02 7.256368023907890097e-02 4.953949817221534047e-02 2.488844136002885468e-02 5.372360147573657096e-01
2.993177783211833573e-03 5.174757179503450613e-03 3.059405799500582342e-03 2.550611894144393012e-03 2.991207344594443325e-03 1.709490963675969243e-03 8.841452713412275080e-03 1.146689597263123028e-02 1.058684140067794877e-02 4.299260780561296215e-03 2.965600125334475097e-03 1.307950700454426074e-01 2.224131533660491655e-01 3.559280217737713012e-03 4.546067124735512707e-03 2.662627978905450499e-03 4.392977730476773854e-03 1.301597387220201907e-03 2.450474202679242108e-03 1.157684286959537179e-02 5.730346146449430411e-02 1.101579965590830101e-01 1.200102784582102039e-01 1.159280060549510993e-01 9.026950372807887590e-02 6.679538789516759056e-02 6.504437034553665897e-02 5.515227658318034437e-02 3.423256732287144333e-02 4.306283786978860606e-01
3.597480259521312115e-03 5.013611114348540468e-03 4.127048616794364196e-03 4.156003414676757469e-03 4.602681556706717143e-03 1.499305200917595100e-03 5.053870376357172227e-03 6.141763313267092558e-03 1.924368571412034311e-03 1.809207365520708712e-03 2.252781291472413239e-01 1.988903098788068757e-01 1.100235742618694695e-01 5.070406819616597727e-02 1.082977497839810593e-01 3.183452655884231319e-01 2.386489551810210257e-03 4.687518888430170470e-03 4.596656188153813022e-03 2.096828667873042520e-02 5.870806211224383064e-02 8.700277184591997948e-02 3.616402945258917478e-02 5.543079271892299015e-02 7.284774179392917992e-02 4.182048288094096511e-02 4.460328222513868651e-02 4.818474559994111867e-02 2.426254165034469057e-01 2.638320946551107604e-01
2.885393410739685739e-03 7.921989253702623954e-03 3.531366188803378714e-01 3.030781173441607357e-01 2.789448325977307852e-01 2.267109826307246809e-03 1.454944792645299556e-03 1.448926779210893134e-01 2.071034629343566635e-01 3.572755989973263463e-02 5.257895319976856052e-02 8.391671065794821527e-02 7.994371234249851577e-02 2.483885158387512115e-01 4.459166074506133552e-03 1.368781453902152487e-02 2.305314832798711910e-02 2.876431860797541706e-02 1.994729916097415928e-02 1.532454195885926684e-02 1.118642686898034533e-02 4.116223558377787167e-03 1.639106870107228872e-03 3.632455827247714052e-03 1.341024407416696769e-02 8.998050644058671471e-03 1.414789729383729780e-02 3.507263554737337086e-01 4.549700750692663859e-02 4.243416703839993781e-02
6.098758693584211028e-03 1.394750302955501120e-02 4.026604189739729778e-01 2.365174017123430061e-01 3.900430424961399689e-01 2.960093175451856684e-01 1.999853803791252094e-03 5.202479411258268543e-02 4.944769883043195757e-02 2.139738165071988080e-02 5.300080794684518953e-02 9.751382308835110369e-02 1.055715298126695817e-01 4.838753527889604333e-01 6.301906427753880408e-03 5.906739137654154828e-03 2.186846018379492648e-02 4.132010165372276139e-02 4.744028917497466330e-02 4.204739148540356797e-02 1.316575247521358481e-02 5.467829750608536703e-03 6.657622523418525728e-03 1.258273773330808101e-02 1.549765614469999359e-02 9.001834218404615798e-03 4.072120119708947383e-01 1.667865894687494133e-01 6.257890010311721596e-02 5.996895373482099417e-02
7.589866748640815806e-03 3.391492715943846166e-03 2.282992752585806251e-01 9.844276504829341246e-02 1.241753531830136065e-01 2.747784591007129684e-01 3.677704160090832786e-01 4.273818377668456292e-02 2.435158170488648660e-02 2.773045855569722037e-02 5.034006613818898385e-02 8.565982687945893070e-02 7.930142822941373126e-02 3.777461351046545457e-01 1.183156064725113428e-02 1.535614964622669838e-02 1.646780940631953349e-02 3.833973331742105556e-02 4.882469388551749501e-02 4.235269422065198602e-02 3.141284671363431258e-02 4.564002149349727921e-01 3.101132543259310093e-01 6.530593904736794499e-03 1.840445384836396012e-02 1.457428107473197551e-02 2.295199152491910616e-02 2.870495912975544739e-01 5.042208882388526936e-02 4.549694079414469405e-02
4.171478903227151223e-03 3.643103808719757794e-03 4.833532678970652863e-01 5.152318428619061530e-01 5.435569946072831525e-03 4.394889840499573500e-03 3.933254164964726796e-01 1.682016016683548221e-01 2.461884605227179224e-01 3.139974428781258653e-01 2.940192668113675301e-02 3.534887747938828678e-02 4.641323970884299321e-02 8.999350066588610031e-02 4.512369419682986660e-01 1.287266486359917896e-02 5.500901105525212581e-03 2.584664601188944519e-02 2.951123650516498248e-02 2.232127560293068608e-02 3.037106340603232604e-02 9.905871425173219669e-03 9.105455749954849409e-02 1.469643170321287273e-01 1.736362157336599973e-02 1.108693319979531244e-02 3.910844695116800357e-02 5.408174862520065407e-02 5.881710736214151858e-02 5.133067644350794434e-02
1.490538548923843465e-03 1.378741319715821477e-03 2.942207428324892984e-03 6.535047749521237168e-03 3.326816348609083675e-03 3.252552359786362590e-01 1.592160128546731557e-01 1.171159717736163508e-01 3.675759162472965746e-01 7.453826615918759772e-03 9.649268288013923556e-02 3.573735298784026099e-02 5.283395287229224191e-02 9.720626476666034688e-02 4.019136696622779281e-01 1.125711018792269896e-02 4.169259349097816370e-01 1.942857216442057944e-01 2.817594029165568781e-01 4.738870795718952422e-01 1.211413458397594782e-02 1.930429369380716742e-01 9.925785144193485787e-02 4.594492584754982234e-01 8.480188609269338762e-02 3.226476923683282982e-01 4.617369503474165471e-02 8.352347631492046398e-02 4.806949023406679178e-01 8.178100740059789098e-02
1.509852006970436927e-03 1.198979619003607460e-03 1.062979534292231689e-03 4.706263283236148953e-01 4.846904503582323276e-01 1.920148608101971965e-01 1.309530662062664830e-01 1.375004229755726615e-01 1.538260436050286062e-01 6.094031377902403568e-01 1.787488195771380906e-01 1.787576041200489296e-01 1.436920312349436457e-01 1.456177864466156602e-01 3.656502330463249906e-01 2.475029713447603197e-01 1.745933152192939986e-01 1.093093579634551171e-01 9.515698633651080429e-02 7.127689925064251142e-02 5.707240867785664390e-02 8.327637461598598467e-02 1.272882341874905510e-01 2.968088837066882868e-01 5.058503480406405517e-01 2.273691867494065932e-01 3.494565143583637790e-01 2.439458972193645492e-01 2.522524970163674829e-01 1.659947845780359033e-01
2.049745662520060900e-03 1.056184395358344096e-03 1.090941111347880788e-03 2.328246951769715953e-03 2.596303435227140244e-03 4.727098988397742674e-01 3.272179395712730005e-03 3.164522287784889577e-03 2.122258102144293224e-01 1.537945041122968370e-01 5.764450946888818178e-02 1.333237252894809710e-01 3.347098533579333512e-01 3.061641914490254024e-01 1.895652231676134281e-02 1.406364676445086802e-02 1.979691972928658006e-01 2.362991622154082261e-01 1.075362712761110673e-01 4.769638073584440974e-02 4.637073174133928000e-02 7.243772374407249359e-02 1.101377089600808767e-01 3.366032590285472081e-01 3.387603033568916677e-01 8.005689380019051504e-02 8.904088180943275921e-02 1.153064929156139423e-01 3.766564657082108192e-01 7.681240902400407466e-02
2.753656809679809903e-03 2.354607436324087418e-03 6.950227226339560386e-04 2.302388306196920514e-03 3.334930544041370386e-03 6.268617159451560228e-03 6.651609335241730377e-03 5.304267705334315686e-01 2.108039875420496534e-01 1.224192972779575561e-01 3.715043235160473550e-02 4.739388732488377526e-02 5.073514561578727766e-02 1.736804121746279017e-01 1.985766547166970541e-01 8.382627832782994781e-02 6.958264023133362008e-02 7.556875496026106698e-02 1.024605092748221008e-01 5.951942873031584175e-02 4.239984293522097714e-02 6.324865888620874455e-02 7.213266762748961336e-02 1.203829458915335882e-01 3.739317025970828046e-01 5.894764024403141567e-02 8.576705190092190345e-02 1.411825879063264289e-01 1.710177898033377053e-01 3.385578167069236977e-01
1.491734058732055229e-03 3.660469558091843968e-03 1.064487730930614457e-03 1.104435163712297807e-03 5.162833100202500296e-03 5.377690142252242178e-03 6.202849968043059638e-03 3.659376535528297558e-01 2.835838737974846202e-01 2.656841098847442795e-01 1.094383739902380775e-01 5.529594236526253620e-02 3.314540940448161555e-02 5.202735875711170244e-02 2.372534164698212877e-01 6.213178108429483898e-02 1.668930980059696312e-01 1.178577010043057108e-02 2.381398981486507888e-02 2.275903135221259976e-01 5.888629438160163793e-02 8.247995616471019698e-02 7.187766438588573392e-02 7.906094984466272013e-02 1.047183226475127404e-01 8.042979866710424364e-02 9.501889685665600160e-02 1.175139996516528229e-01 1.591712406404304780e-01 3.900493756183269767e-01
