1.039584041588562276e-02 1.546687833332557362e-02 1.342734311783505899e-02 1.692101852321185873e-02 1.273770223155615798e-02 2.773522643810357596e-02 2.718253932337164405e-02 7.275648757427798097e-02 1.312321523881910534e-01 5.823613116370025822e-02 2.682506306788210934e-02 6.046918536381938949e-03 3.505720172901267018e-03 1.299597189945776721e-02 1.510205451168065115e-02 3.322305407772002585e-03 1.151928041078654000e-02 1.968314483790160191e-02 1.743980322820812626e-02 6.032580653222400710e-03 4.890359496399756742e-03 7.148135341572702970e-04 3.678171413037285842e-02 2.181032660987570950e-03 4.074382791296014480e-03 3.071441456948573439e-03 1.363830995666791539e-03 9.024688866295725587e-03 8.528036354929319565e-03 1.060649797317333477e-02
8.369142658897625250e-03 1.873145808993918054e-02 3.370877276836965059e-02 2.730593730493613772e-02 1.894679738343871267e-02 8.434292415673602661e-02 3.976903734671703716e-02 4.892423888962430661e-02 3.153566059437222513e-02 2.621672320322603056e-02 1.832304183269861317e-02 3.510617543226262315e-03 4.590715502602640483e-03 1.045781095924117228e-02 1.452691362271826651e-02 9.352492326170086176e-03 1.135596982117747893e-02 3.614287091048760947e-02 2.661857720624273560e-02 7.859730478613690882e-03 2.805373482611723916e-03 6.284330562827951210e-04 1.313682390893525492e-03 1.133857191056616108e-03 9.543592198438207753e-04 1.217515978254385227e-03 3.429666929059914382e-02 8.873581356201967404e-03 1.262092963618369201e-02 1.262263134026418883e-02
1.044760143956906390e-01 1.073075522245445501e-01 2.271127227574308571e-01 1.831300733532138514e-01 3.914714076734567283e-01 3.968305978823450514e-02 7.349586390633888050e-03 7.712364223883077206e-03 1.224954730498123145e-01 3.608620093302006976e-02 9.416148323225906336e-02 6.060423143901765008e-02 2.178522537129205794e-02 3.186330988837089706e-02 6.057504420077448534e-03 2.547529051303493511e-02 1.671363319494916996e-02 3.327085309484320574e-02 1.077348316091019109e-01 1.751805192894163518e-02 1.664239506174163431e-03 4.775558292995996990e-04 7.182333015781520785e-04 1.902552104028283619e-02 1.138840039926046488e-02 7.597737511612548574e-03 6.821216955041992276e-03 5.411114038633160761e-03 9.203980490509616058e-03 1.042835110910567652e-02
4.819647703215101942e-02 1.379314729637239889e-01 3.031889946872152741e-01 2.430081085203371072e-01 1.007767056935005567e-01 1.550669122663046740e-02 1.222155916808730439e-02 8.026027633809867251e-03 4.839342590789179679e-03 4.398985031708842197e-02 2.749272557772755587e-02 5.332751764746639783e-02 2.371422423285753783e-02 1.584520376039222703e-02 4.628984761596850739e-03 3.504479762849025282e-03 7.154246829517721395e-03 1.299010730555963736e-02 9.005427828155275136e-03 7.521011937179222437e-03 3.386239014376271964e-03 1.137437958158845491e-03 2.549427075358638717e-02 6.412635885264349319e-04 9.221134403356435680e-03 6.808744884484585654e-03 5.848837565260548398e-03 5.552663994677787401e-03 1.110767539193789621e-02 1.226594768509118270e-02
2.775480775388608490e-02 8.542659159089675824e-02 2.378850537097291495e-01 9.214051632018402382e-02 5.324313354121318342e-02 7.710810237309844752e-03 1.166559927859630794e-02 6.407678978476224509e-03 2.911780537949559995e-03 9.962503338224010241e-02 1.217432915938206767e-01 1.022452168024777369e-01 1.489802582074579995e-02 1.230703166976794549e-02 5.700472381351654079e-03 2.078609829561863138e-03 2.184800448238703383e-02 1.225468085937699535e-02 1.936960993852640880e-02 1.086532359538560158e-02 7.402714097521577094e-03 2.024090127541805333e-03 4.337075142384494084e-03 1.124836165195850857e-03 1.662729508101064291e-02 9.043694888852277930e-03 6.262530823309614587e-03 7.292828265720663686e-03 1.127324798938950795e-02 5.436956062737836361e-04
2.759167584419824903e-02 2.859687696908030236e-02 1.279701737648664406e-01 1.022917270625178093e-01 4.066928756800932548e-02 4.319844783695141535e-03 5.192836081633985315e-03 5.499388896011800365e-03 5.079715200418317630e-03 1.516288048190771176e-01 1.168786276397340562e-01 6.100345093933468021e-02 6.880049413754515085e-03 2.049125106637518859e-03 1.520665085632221620e-03 2.408966009031270322e-03 1.236765789500713329e-02 3.166342824344526609e-03 1.013108208200004003e-02 3.432414694499189706e-02 4.122173767291146401e-02 2.399826036616848485e-02 5.813814423687939381e-03 7.051622806545825364e-04 2.495299770042791118e-02 2.363801973414197954e-02 1.460635958093492275e-02 1.016646690731098229e-02 1.325642323984394140e-02 2.446883307782279915e-02
3.777694810197318800e-03 5.925551908107811426e-03 6.253475261309491065e-03 3.165297017682703468e-02 1.515407270351489671e-02 2.496457729121437027e-02 3.745665791312718235e-02 2.117915730578566469e-02 2.495948260326189688e-02 2.882609643537956817e-02 2.198484717837523653e-02 8.999168342190669995e-03 3.666152576287383912e-03 1.397150656337538136e-03 3.449011893473905022e-02 1.223064892999845563e-03 7.100585173636286308e-03 3.324663778557565043e-03 1.681404702728648073e-02 2.270455777031805261e-02 1.028105412670054716e-02 2.396921934567101866e-03 9.033493957983462601e-04 6.631800463187581584e-04 1.707701415947336307e-02 1.756496512408581637e-02 1.520095956485896342e-02 1.336891619780085534e-02 1.541050066840107813e-02 3.766021593030488557e-02
7.938479896455227780e-03 1.451130108432548659e-02 8.456955753760979355e-03 1.817568768451878480e-02 2.771587485678757290e-02 3.096532433309004406e-02 2.734787448427544038e-02 2.575126145908305728e-02 2.069910833311082790e-02 1.150495474703113440e-02 4.587921964191339630e-03 1.405700250938873158e-02 2.966041794538779811e-03 4.447179857296324618e-02 4.613573804569072456e-02 1.753914801811072913e-03 1.438458372018905883e-02 2.286656395908720843e-02 1.998967215659998992e-02 1.410659774530081088e-02 3.771036325164915139e-03 1.715024680696272674e-03 3.521960433766599396e-02 2.744864319233379299e-02 1.292046937683477038e-02 1.356205135181836122e-02 2.082930538715009605e-02 2.658919933179200099e-02 2.695347649672348925e-02 1.181475556854569807e-03
2.042743675035418524e-02 1.336866760577970145e-02 7.802545047326811881e-03 4.499380620898541655e-02 2.903850267513007413e-02 1.225895570274565180e-02 3.965774791388639725e-02 1.785931578638471143e-02 1.508054383844670276e-02 1.472410502745202451e-02 1.299503162715910827e-02 1.696755993825262501e-02 3.672647693046188211e-02 2.385820162482160667e-02 3.526365822576343467e-03 3.192645495031419967e-03 1.380091333156958054e-02 4.175028942073383958e-02 4.110606324291600500e-02 6.834104226455783512e-03 1.047734972371323903e-03 7.765028755594143451e-04 6.975210664902852745e-04 2.666037628960320552e-02 1.543305168409045067e-02 2.372879246205349818e-02 1.189325550679944761e-03 2.545005037406153185e-03 7.787971407842617620e-03 4.075867010708390283e-03
3.289383797154796923e-02 2.139816909813054002e-02 3.420418594640967785e-02 3.172090077385165269e-02 2.763194333488466076e-02 5.461005694879991768e-03 2.559640923238035506e-02 1.098001577770384325e-02 4.644263931850790145e-03 1.716443958598198437e-03 2.478943512195477469e-02 2.380364688966977657e-02 4.996406219162762008e-02 5.401278119528767768e-02 2.575695185255737901e-02 2.809053910463612386e-02 1.499767397059202367e-01 1.552790191595668778e-01 6.248321250915061381e-02 2.780390183714376989e-02 1.324318539262989624e-03 3.447575630688046872e-02 3.539998709623906614e-02 5.867662068545454954e-04 2.030052683969294641e-02 2.615861829743455422e-02 3.473148845495516602e-03 6.292843215712084701e-03 8.242306486404261945e-03 2.267767820383200135e-03
2.719886732340588004e-02 1.416973114109138822e-02 3.163004097489499622e-02 2.682708962564213373e-02 3.388904758155984742e-02 3.118060034262719587e-03 2.638206820766520865e-03 2.300942021587667682e-03 1.439115073207699593e-03 1.274852613356494864e-02 1.968331841939433557e-01 3.225086399648208202e-01 6.601640420687078237e-01 3.257240338627953036e-01 6.017757689116427777e-02 1.172337057134611726e-01 2.172201758844711228e-01 6.017867709172938090e-02 1.443190011375515037e-02 2.880053202667898996e-03 9.448988521713827266e-04 3.444885648599759626e-02 7.053297120351781965e-04 9.311875914384572239e-04 9.565849213162739379e-04 3.154087280122087888e-02 7.633456747974847259e-04 6.341646231789936465e-04 3.647772243933288666e-02 2.637888755337794433e-02
5.047031927537970475e-03 2.962492536030860487e-03 2.606753595306784965e-02 2.546398528205078005e-02 1.977242978716601401e-02 4.529245361494281877e-03 1.750527309109175741e-03 1.110527631218382076e-03 1.351239351080623730e-03 2.502768966817616944e-02 5.977437477037084862e-02 3.835515925134599935e-01 6.803012110556322378e-01 3.523477458851285715e-01 1.274744297429300510e-01 1.430866825360275207e-01 1.576679961990630208e-01 9.326550416217291306e-02 2.305321924705931030e-02 6.494400844848541819e-03 4.559650738511407397e-02 4.044248601705613400e-02 8.690869049844508016e-04 1.508545102244613842e-03 1.413446443133163253e-03 9.807523202723356613e-04 7.303185405237269971e-04 3.763704681014919812e-02 4.026630697412220128e-02 7.482086227635946973e-04
4.178734927250024600e-02 2.482782439505801762e-03 6.075304115996720163e-03 1.718226455653123000e-02 1.117366195005191354e-02 3.499749897806764178e-03 1.755025216337511174e-03 1.429077735396612481e-03 1.748448034269100030e-03 1.256192545808156209e-02 4.135599521990492716e-03 1.233684479209529727e-01 5.112296953989936554e-01 2.169618779427150423e-01 6.793408447339771561e-02 7.805548237934889499e-02 2.876535610879832339e-02 4.219794431305475685e-02 4.809950126847567509e-02 1.799246526905998178e-02 1.186733263792664073e-03 1.041246989747325992e-03 1.223656860689681467e-03 2.074598508683948676e-03 2.696536547983368129e-03 2.500466967344678552e-03 1.818130846484306310e-03 1.612055063940482291e-03 1.188963708733982005e-03 8.818562773207579185e-04
3.329367915794789745e-02 2.166793911534937566e-03 4.006343822213783053e-03 2.934075480959877791e-03 1.729479167651140278e-03 6.703337510015194324e-03 2.260145084272003821e-02 1.906700036136358203e-02 2.426707033827490458e-03 3.912059342520123051e-02 3.047911023495902642e-03 2.016941766172407335e-02 2.342989799998713984e-01 3.126315827979492812e-01 3.307634714225366479e-01 4.427972129548375935e-01 3.968504906774929508e-01 2.560971228827261248e-01 6.960122309698258958e-01 3.241860611541848569e-01 2.678399265170473137e-02 7.729153436958198682e-03 5.740618583476677847e-03 1.435541912860749218e-02 3.307426954480330306e-02 3.065965971592011716e-02 8.322058063916898396e-02 2.679980028699509992e-02 2.041942066444967733e-03 1.853220746843368657e-03
3.031062056228106538e-02 3.052513546735947936e-02 1.873178594945454963e-03 1.401743985791391658e-02 5.048673070281379724e-03 1.168568758596256162e-03 1.508343250301638974e-02 4.348199823071022263e-02 2.929762536595430233e-02 3.014453753717789408e-03 6.418124392457504740e-03 1.003648328486381608e-01 2.099196840795315433e-01 2.631708153309320064e-01 2.357756934947123351e-01 2.829309582830797365e-01 4.789413787154432334e-01 8.212443124458583821e-01 8.328864992480347063e-01 6.582021501816548437e-01 2.818062808956298473e-02 2.942496027993557473e-02 2.584813526863848770e-02 8.075950676065235534e-02 1.153532440609130877e-01 5.866559606949551808e-01 5.850749524194772677e-01 1.170151535669152476e-01 2.509594181678221920e-03 1.424909501300099333e-03
2.694065152268908941e-02 2.942743898919332815e-02 1.452344670602702652e-03 1.598091445899258974e-03 1.044087750808263401e-03 1.177726712921136872e-03 8.278316403983489863e-03 2.327092533377913761e-02 4.832052965070528922e-02 1.732364717473203197e-02 1.787363599258318808e-02 1.540518416645948567e-02 1.185915727064501685e-01 2.393486262467566794e-01 2.230493295028998790e-01 3.408142823587132497e-01 5.816859996203579408e-01 6.997982563001576839e-01 4.032424370346752163e-01 8.820448197223847153e-02 5.279493359468179214e-02 3.603412560183933966e-01 5.185316212453767726e-01 8.707833559525939293e-01 8.192048478550509882e-01 1.069119227634077962e+00 8.622210185745317057e-01 2.462339707925598753e-01 4.144036602938988047e-03 1.809848670982665449e-03
3.319190328148945157e-02 3.850210044129372816e-02 3.837679416417551920e-02 3.677583457219138485e-02 1.116012539507349379e-03 2.317149804333453258e-03 1.351598883362573333e-01 4.516937511934350780e-01 2.210315805687832758e-01 3.784316386792573733e-02 2.807930018681704595e-02 4.333460894355051912e-02 8.516680704832955973e-02 1.255900611479565943e-01 1.657904148867689886e-01 2.976496394969215253e-01 6.303542669232713447e-01 6.307710384175321261e-01 2.982372007134461156e-01 1.021825572873435312e-01 4.347211989215722938e-01 7.756236923112828086e-01 9.803186501701864897e-01 1.013023236230818247e+00 9.030283034266092246e-01 7.897093879220475898e-01 1.180620973771096427e+00 2.061266797031323650e-01 6.529948610214509827e-03 2.707362263176863165e-03
1.644970792384677560e-03 1.269675798226086198e-03 3.346350898966079374e-02 1.028888006276758131e-03 1.314854672733072743e-02 6.620461845889859254e-02 3.685560074235931238e-01 2.997983224030613125e-01 2.955670743961643643e-01 1.482130237876545520e-01 5.428669968469327506e-02 1.451413617745882061e-02 1.416299363845862670e-02 3.657517696561812109e-02 8.250816030566145154e-02 3.817280631327448215e-01 3.935079396403773355e-01 4.556275597853413073e-01 7.877273637860493505e-02 1.378706269983625832e-01 4.794744573831972723e-01 1.016931051028650446e+00 1.234967990718563557e+00 1.295099888163004032e+00 1.092567816060719288e+00 1.071431157371785625e+00 1.010698650730930792e+00 8.012257796374805396e-01 3.555272333206125485e-02 2.343632665647437524e-02
3.636714044398882406e-02 1.958101354032146333e-03 3.583603887618727092e-03 2.460090222309654906e-02 5.410819186805749387e-02 7.619175544547361623e-02 2.400193421117364778e-01 2.983043266794650483e-01 2.050854367828808256e-01 1.599919994763802922e-01 3.365705127448645473e-02 3.292913125649657522e-03 4.988030221807228035e-03 1.404133103163814240e-02 3.039383549221880837e-02 1.793682522213903008e-01 6.734378639957458446e-02 2.135905471033420003e-02 7.087915219737008291e-03 5.083751715847534963e-02 1.902675031491778135e-01 9.983182281361238086e-01 1.249618503446278783e+00 1.315358800647910886e+00 9.704783255111861795e-01 4.527660900267864719e-01 7.363246276389159295e-01 5.054611015489126613e-01 4.558471950062142203e-02 1.799721023302956399e-02
1.803583405919513202e-02 2.281524532688843088e-02 1.513369855813334608e-02 1.861507943879691512e-02 4.357413240939094629e-02 2.490795314304469765e-02 1.281325395574081094e-01 1.646237168724317135e-01 1.519581289511342248e-01 3.597480982622342643e-02 9.070397143311132934e-03 1.920235214050750386e-03 3.357791444145356505e-03 9.857519268594520240e-03 3.890664394961688283e-02 2.608240506178551715e-02 4.693851620004037273e-02 1.370496260689421132e-02 2.532739024765494687e-02 1.181380416687317220e-01 6.293332921362299048e-01 1.184299148956317271e+00 1.267305490892778552e+00 1.203039073613800358e+00 9.221430367355852864e-01 6.735972649863828376e-01 6.504539546146610451e-01 4.383080891264969914e-01 3.946730416539512287e-02 1.405091287741246781e-02
5.093554584026738219e-02 4.594081286407274839e-02 2.352982285600704881e-02 1.683568169034492870e-02 2.176694078782374919e-02 1.161725140226979071e-02 6.603025228275288816e-02 5.863705942566811019e-02 1.609617093275235444e-02 8.830723525417324624e-03 3.074184321145561304e-03 2.464133005965173095e-03 1.487489248156351846e-03 8.329034887891022558e-04 2.182198042502463565e-03 7.397011322286779940e-03 2.597785346424759043e-02 5.834895734222981384e-02 5.528854180930367623e-02 2.442817264470711625e-01 6.669571538894097928e-01 9.707515794834298273e-01 3.975110962734046405e-01 5.915796073453535309e-01 7.535276841659104274e-01 4.210277988153393602e-01 3.110273762179366352e-01 2.554818979779758248e-01 9.365502221335865810e-03 8.466727178219845412e-03
4.103524721320830904e-02 4.653814934338385001e-02 6.860147544610773612e-03 4.734768328258298457e-03 3.868762776755394362e-03 5.752149524414201971e-03 8.193745527773573650e-03 2.037124748140135312e-03 2.633537456817283250e-03 4.239277890722817398e-04 5.709638009012654074e-04 8.907307736225810943e-04 1.008555560952781359e-03 3.664801135611892892e-03 1.047753848632906187e-02 1.366795009736496702e-01 2.554544635070525871e-01 3.628104458274494792e-01 2.433866879973317077e-01 1.822406644421803168e-01 1.303275735976809069e-01 4.718854936306910580e-02 1.846249245957260962e-02 3.927733270678326893e-02 1.395981000502193592e-01 4.640364629903230564e-02 4.226711923603837517e-02 1.426618773349957667e-02 1.620420860383309973e-03 5.278237863064866309e-02
8.569142309781714595e-02 6.504000782477148412e-02 7.052456113309554797e-03 3.035131811006058257e-03 4.429951510794362217e-03 3.448580444842714882e-03 5.323081859883278637e-03 5.673530563573103529e-04 4.768251198122822228e-04 1.511538735704634831e-02 5.119304456719934093e-04 9.891888724592433086e-04 1.352322846078035309e-03 7.495973257426385289e-03 1.258917792941109844e-02 8.021604345525214230e-02 2.849948726880998651e-01 5.196054174348302412e-01 5.766384855283598343e-01 4.987948689640318012e-01 1.079586371337665635e-01 2.445783279011186709e-02 3.066070413399066275e-02 7.418280591803796953e-02 1.628162737399883597e-01 4.738241216233055053e-02 1.802371482036762770e-02 6.763805297371713529e-03 2.113553794516541753e-03 1.899117713510649948e-03
1.053167637955757380e-01 1.322661728423311055e-02 3.693138091400326433e-03 1.209107086247922930e-03 1.367884098164484120e-03 2.986518893056286112e-03 3.847520987030493902e-03 3.098437820243793439e-02 1.727339577698920256e-02 1.989318708112956802e-02 3.513222424234878349e-02 8.617952953115391636e-04 1.006256608318511310e-03 5.798048651763933713e-03 2.334569499044285290e-02 1.158272554846453972e-01 2.173453990445664286e-01 4.867519442526637707e-01 5.964382941546345629e-01 5.021177653296827748e-01 2.559331120766318857e-01 1.502456547893100264e-02 1.082948153342306631e-02 2.325770684137445921e-02 1.326606252164516109e-01 7.875651635877900514e-02 7.051246930421473103e-02 1.317821409784030416e-02 1.887221581243178278e-03 5.681888458634302280e-02
5.764761295703782484e-02 1.763208838534484346e-02 6.947971013108887074e-03 6.494024443002233138e-03 1.438412294124339665e-02 9.842444133692786548e-03 4.080804925956357104e-03 1.665821611175425645e-03 2.484724610965880539e-03 3.265863765214780355e-03 2.188385396121408227e-02 2.452844049491854223e-02 5.601266456360824491e-04 1.336364181837840616e-03 8.460133231811632279e-03 3.586453468214129831e-02 3.511177933662572304e-02 1.459892706156929731e-01 1.821047441601770511e-01 1.557293937234821013e-01 1.340686522799418579e-01 1.769437394166850988e-02 2.776643802211395048e-03 5.415383456448910962e-03 2.387710702479911226e-02 5.945243296182036591e-02 1.591708745446415163e-01 8.855998326954242494e-02 2.174643454290322783e-03 1.596092429035384603e-03
2.059243528058755587e-02 8.072467564382460742e-03 8.746927288462371872e-03 1.480994194574814654e-02 8.065527734463730572e-03 3.620747197322262811e-03 1.668471486565255464e-03 1.168872799947450998e-03 3.685395804655026367e-03 1.437214672323612434e-02 9.816905027152772988e-04 2.411981233457607260e-02 5.952432611115496654e-04 1.379813767874469872e-03 6.881100651027125675e-03 1.285653031370644767e-02 8.654378164501487850e-03 4.197141615993190203e-03 6.473369446373539345e-03 1.177752578666991200e-02 2.153860116011547393e-02 5.047979988172911735e-03 2.670684964622966132e-03 1.376375530066325896e-02 3.371917455976853467e-02 1.201949972676770624e-02 4.148870052475617937e-02 4.587772288983769930e-02 1.607308412350879484e-02 2.400294124412972845e-03
2.087358800623884472e-02 1.656358720161561077e-02 8.186228169741557870e-03 6.031446262963433350e-03 5.597547629796134974e-03 2.105142891256561559e-03 1.393436500303898203e-03 1.423442476748180453e-03 1.565607767429645983e-03 6.292888780547527608e-03 1.781421763514208934e-03 1.695080240377620003e-03 1.660135941448625738e-03 2.186990170816268883e-03 6.672923470662605119e-03 4.898715154782613476e-03 3.368633638559373131e-03 2.046131499315766329e-03 1.822365380815351311e-03 1.429628703356719717e-03 1.183993169514158724e-03 1.796856691419003102e-03 2.965247035781437557e-03 7.666386916261264638e-03 1.389892270783632533e-02 6.866705803199391403e-03 1.118168585658824848e-02 7.349048269701339772e-03 7.317107022913845946e-03 4.635812570612347742e-03
2.827342094361629324e-02 1.458546132794415889e-02 8.414941289244581846e-03 1.156761802360785005e-02 1.013179497907147793e-02 5.511646837032176463e-03 1.886304800276416074e-02 1.426622136648842201e-02 2.107395476889696757e-03 1.539055668571101369e-03 5.501978683231491599e-04 1.264248257713252799e-03 3.897781891109942248e-03 4.584302678084377011e-03 1.504296106512277575e-02 1.192132662659887467e-02 3.846302270365045683e-03 4.646931682181837907e-03 2.178393247391085304e-03 9.619484771952262724e-04 8.922491544922044179e-04 1.390679679163406204e-03 2.207749243972414489e-03 7.355455982866168987e-03 8.085731561777283194e-03 2.058725087008766476e-03 2.393088825344003891e-03 3.079869082360877936e-03 9.985371923047388354e-03 2.047349502290961819e-03
3.804489624175529106e-02 3.256612342211136213e-02 1.000767411894938445e-02 3.443328514429516707e-02 3.979731378401667186e-02 7.515910516620612214e-02 5.075626027156000114e-02 5.769142211111781375e-03 2.082463548089325336e-03 1.211716759563760465e-03 2.570730028338791273e-02 4.488160406497402406e-04 5.850221403578949406e-04 2.513064330910235594e-03 3.374123954716861263e-03 1.619272679340630784e-03 1.618416743608663919e-03 2.000910424846921373e-03 2.776328897038119782e-03 1.497254081454227640e-03 4.309455493691465716e-02 1.099339419493633582e-03 1.234034570493242229e-03 2.312100218796086376e-03 8.124762076351908086e-03 1.408143456558979580e-03 2.174333093880724023e-03 3.632118323375961143e-03 4.418570746204793405e-03 8.834881614972528788e-03
2.118156441912744797e-02 5.199875139350568914e-02 1.563747223905022354e-02 1.678555088450307473e-02 8.071953064089311403e-02 8.568302461208260334e-02 5.771987328313519378e-02 4.004371626552755484e-03 2.846192484266006194e-03 2.723254243567631815e-03 1.130714075832843588e-03 5.644896661268761478e-04 2.520312872094667561e-02 7.207081413493865397e-04 3.730006415511284354e-03 1.169702039875140194e-03 4.317929308662162534e-03 2.684325908911800590e-02 4.861432634124294994e-02 6.707582496958765066e-03 1.298060951834440662e-03 1.637087110574207954e-03 1.387829914564918518e-03 1.685686998323338752e-03 2.490349307646558610e-03 2.095621149135862282e-03 2.629621817211037944e-03 3.296704362788879360e-03 4.492562876739852884e-03 1.110803365695225975e-02
