2.498953146705666650e-01 1.392137635610608479e-02 4.482497375476407128e-03 5.614157105453304770e-03 4.241996130903989519e-03 9.246817198872190474e-03 9.106630193297902964e-03 2.445408579992475184e-02 4.403673017810163376e-02 1.943560324649988916e-02 1.493108570263569808e-02 1.508251547824786820e-01 9.349476294835362689e-02 7.303981715089920626e-03 5.820032281960240035e-03 9.909411211596017011e-02 4.558340743441329466e-03 5.932290624272529289e-03 5.199831507732439670e-03 3.199987309298850478e-03 3.037885123949737864e-01 4.778595218385028182e-02 3.721417404363153852e-02 1.517673265490150636e-01 3.019341451304005108e-01 2.421307451469610350e-01 1.137034035787182346e-01 1.001222484269634685e-02 9.554931941847925186e-03 1.201058393181339903e-02
1.676732186387655810e-01 1.516761644507009892e-02 1.145307520288281998e-02 9.296059984443216795e-03 6.463722835111116415e-03 3.382135424016600306e-02 1.832529318425844128e-02 2.242614880346570708e-02 1.254587979539093130e-02 8.972567637793390019e-03 9.892770642511608536e-03 7.748941129962472196e-02 1.096111193231018854e-01 6.566107193678482820e-03 6.776808976878640964e-03 4.455121127135840305e-03 4.430553101029967647e-03 1.095022057948838792e-02 7.961783800852204052e-03 4.195499205624537466e-03 1.744068186241158613e-01 4.537164831499444079e-02 9.544851714433150169e-02 8.730293302845650028e-02 7.985002200461811805e-02 1.102828130610985086e-01 3.987861873956774494e-02 1.013982621030583980e-02 1.442405630027365250e-02 1.441194812309035123e-02
4.276959758775786269e-02 4.363001623768195114e-02 7.799091987930791003e-02 6.331372984956502858e-02 1.347136870841530998e-01 2.971981531212217892e-02 1.510332396269327415e-01 1.583748160228030388e-01 6.921927455636252280e-02 1.327921835454063705e-02 3.362404760618121352e-02 2.464150722249158765e-02 8.901432975476434792e-03 1.725837100757696141e-02 1.655844516987529380e-01 1.680473243987937182e-02 7.953405571138976587e-03 1.313249753324527772e-02 3.177819666068296828e-02 8.399789791206079340e-03 1.093609428536800598e-01 3.706805358619145313e-02 5.702898833388297950e-02 2.040035425719894172e-02 1.259053510657162298e-02 8.606659745519015456e-03 7.963272790533295481e-03 6.252540609759391424e-03 1.065656532192381205e-02 1.193783851772266952e-02
1.639836957606194759e-02 4.774825732705762632e-02 1.047509252414197678e-01 8.457749082030985299e-02 4.281047848869001804e-02 2.141084859158787906e-02 3.037630548614845272e-01 1.883165899982148228e-01 1.019759509992865104e-01 1.730706985729808800e-02 9.341991728719164015e-03 1.788729282702964524e-02 7.910049167204582371e-03 1.185059418639546405e-02 1.291847271729361923e-01 1.156892113737004041e-01 2.497448140738434130e-01 5.185306385283359673e-03 2.733263149953871034e-03 3.110905888018807106e-03 1.963147182426983328e-01 7.844084745693576111e-02 2.708697740297409673e-02 5.462344349498731572e-02 1.034601100589196097e-02 7.648866041047319014e-03 6.757042020901595988e-03 6.404078996083908612e-03 1.298346432253469351e-02 1.408804730484542606e-02
9.380827258280197145e-03 2.941095221696487377e-02 8.204054265745146235e-02 3.182674788586780518e-02 2.551670832020041038e-02 1.779417187234574316e-01 3.089360377671605540e-01 1.736728354003250208e-01 6.380175333093227041e-02 4.262709846420034004e-02 4.211737718871667174e-02 4.138641001894203392e-02 7.584757317619966049e-03 1.259102095703514175e-02 1.722435436904381223e-01 7.158581417063990260e-02 1.660024781042246031e-02 5.712855298561981751e-03 7.235145581332615844e-03 4.131347382666096350e-03 3.476904199078638402e-03 1.036266651999479399e-01 2.670809700571874501e-01 8.729580937925711381e-02 1.894777422816770751e-02 1.030012025125704410e-02 7.288540761053356222e-03 8.415811158950604887e-03 1.313912466546583724e-02 4.824015837361089742e-02
1.375242873534482553e-02 1.485385798146164962e-02 5.513033383866143555e-02 3.843489532550731225e-02 1.994397688194834983e-02 9.992179372773450641e-02 1.269419313375444724e-01 1.346893450961194338e-01 1.089620237955912507e-01 6.107074304275149357e-02 4.939227582255030502e-02 3.454042359153715325e-02 1.501466527208144275e-01 5.670540109408564455e-02 4.800949920329602300e-02 8.382257213094912451e-02 1.228573345095084791e-02 1.110746849226668109e-01 4.510836686419330936e-03 1.105738390806701790e-02 1.661231784564887876e-02 1.445193014786116080e-02 4.995689286987421013e-03 5.261575813255423700e-02 2.866224759879326678e-02 2.715473566112872397e-02 1.709950885257101316e-02 1.176708528424899071e-02 1.549553196052182516e-02 2.780798459339820297e-02
8.833440891028672415e-02 1.357380419542043859e-01 1.337762896102083210e-01 1.547602242446259255e-02 5.994208306092569695e-03 1.310761350956234257e-02 2.497012192549738843e-02 1.381952999512944640e-02 1.648917295218147935e-02 1.677358836674157014e-02 1.362422103798927725e-02 1.850958616568487425e-01 8.595471585488233257e-02 4.108341227579873772e-02 2.426346740442656899e-02 4.253390542365101390e-02 2.406178762082174238e-01 1.070695668058383870e-01 7.452040138507086929e-03 1.039046264357362630e-02 7.015020253566195234e-03 1.097107603124495151e-01 5.178178215199886331e-02 4.880390427260389297e-02 1.976110273867509939e-02 2.034413558481688172e-02 1.791854577383604485e-02 1.543624294084293760e-02 1.764138725267032706e-02 4.181882201640386987e-02
1.723646847808434912e-01 1.442086085036324052e-02 1.804793590317514129e-01 1.032501704442903567e-02 9.500909513488035169e-03 1.069418109846759397e-02 9.470647732500839938e-03 8.931168295387776485e-03 1.008856833012973346e-02 2.517751448139509129e-01 1.036411552331867741e-01 9.311283012090464106e-03 7.155884272444258676e-02 2.626820690000394171e-02 2.995708240167653871e-02 5.580903639074725336e-02 1.149192370050276107e-02 1.362427089195943596e-02 9.179654967464838042e-03 8.098087897297682677e-03 1.522506748168447333e-01 9.056624125840972983e-02 3.694870804738233094e-02 3.109587359961878475e-02 1.482110453171557249e-02 1.538145568091614859e-02 2.371029187700012322e-02 2.685192500614383415e-02 2.680406732340959511e-02 7.808055398326606278e-02
1.169841285729474219e-02 9.936179861483752235e-03 1.485468461453590683e-01 2.339584139357711243e-02 1.164075488589456399e-02 4.926103204110483108e-03 1.586802088799160737e-02 7.833194927167356700e-03 9.074032647474625235e-03 1.015907549380745678e-02 7.633677037518730481e-03 8.054835843899450093e-03 1.564536539745768270e-02 1.287488170714583442e-02 9.355139412042665081e-02 7.863202672878259747e-02 5.890129131786072531e-03 1.367178803179780466e-02 1.612564617794495433e-02 1.966177822767613270e-01 3.957503995432517380e-02 4.167452091285604038e-02 4.578259695691117015e-02 3.007762146684524532e-02 1.762717933949827995e-02 2.597626288456220470e-02 9.152440801117732450e-02 1.648474519677856631e-01 9.274251853124516193e-03 2.373395553704346628e-01
1.080562547924768940e-02 8.564769835881110710e-03 1.381558637396827077e-02 1.302792494846838865e-02 1.255395778066907379e-02 1.115182272347063214e-01 1.740359007163884419e-02 7.761785194594718156e-03 1.148420293601596226e-01 4.131897142893035252e-02 8.483016066767724503e-03 8.005672052475959477e-03 1.677572732920009149e-02 2.031656545841433251e-02 1.022247595758254968e-02 1.093002074257018279e-02 5.167768618103985717e-02 5.000608270537196254e-02 2.635566846696560384e-02 1.683186967869853071e-02 4.957565124597909656e-02 3.163739807501778079e-02 3.662045210107506971e-02 4.040837824932367456e-02 2.258211621139405781e-02 2.808447551964874181e-02 2.434631382954018375e-01 7.746608691747398391e-03 9.448379775168441394e-03 1.237044325152198004e-01
1.651775609812276835e-02 8.401985322120256519e-03 1.235887961951844319e-02 9.153577888829559847e-03 2.025137870930982312e-02 6.871138686031476317e-02 6.650266502485056852e-02 6.049327195831546988e-02 4.133339046912765102e-02 7.005861104369280959e-03 6.612700251006525809e-02 1.070763159306104828e-01 2.196833226014469342e-01 1.069977438141431481e-01 1.948749958297433388e-02 3.787914858926446499e-02 7.040394495063126423e-02 1.943430439524423958e-02 6.752580779348193833e-03 7.892417098184917323e-02 3.353139793104534944e-02 3.019575390348016100e-02 3.928372559334575298e-02 5.514777815091195107e-02 5.896729370717410795e-02 3.160504459416919876e-02 4.742321926758823192e-02 3.567519868237307296e-02 3.229263485799160893e-02 2.392367147265198751e-02
1.102026547236666515e-01 6.024423025765202055e-02 1.943450880327573030e-02 2.092655953005011574e-02 1.941812073361430177e-02 1.092885136629234144e-01 5.134548495894422637e-02 3.556369205518276205e-02 4.230141756832495742e-02 1.190666644505820708e-02 1.988409359848049632e-02 1.294945758308992112e-01 2.243236990566671862e-01 1.155185959911848165e-01 4.138188503688810388e-02 4.643822028091233733e-02 5.123191174543016702e-02 3.016709443689570558e-02 1.103345108448833788e-02 1.791530340353034989e-01 3.184743057934925209e-02 3.258441800790072562e-02 3.870447569310975916e-02 6.926313447814314017e-02 6.574772810349693852e-02 4.670387467914595414e-02 3.578437842633075405e-02 3.279369278552258377e-02 3.622835661106538901e-02 3.966190267521727680e-02
2.615334246942780175e-02 6.163319519236567373e-02 1.364510594620289285e-01 2.228720880320508857e-02 2.548604257415821306e-01 8.941198648620375666e-02 5.037691522352334000e-02 4.436320841740778315e-02 5.691334939916100483e-02 6.498205106128273657e-03 1.087989573424491818e-01 4.267666246441559341e-02 1.648868221289280789e-01 7.060067592502207445e-02 2.219040391291522002e-02 2.568621804823333077e-02 9.485574867753338024e-03 1.391162044495980986e-02 2.073736319251383298e-02 9.154026221531920415e-03 3.031218480985616720e-02 3.329460440523271392e-02 4.185784966125784268e-02 6.942377843191561981e-02 8.769722802346641144e-02 7.727822287327829054e-02 5.694601400259766133e-02 5.430368380818139523e-02 4.837632385929920703e-02 4.073218476969769908e-02
2.255236911075272563e-02 6.196218522583774729e-02 9.643696570306037330e-02 6.794532362714118812e-02 4.044264866091086541e-02 1.786690311581493606e-01 2.180785362066689839e-02 1.038476541656840890e-02 7.796794567503664841e-02 2.550657661430654269e-02 9.099123140182230340e-02 7.933327655252567917e-03 7.433128505675364039e-02 1.009184210395662196e-01 1.082031253941256599e-01 1.470074820355946332e-01 1.324951787277908466e-01 8.606154337402395493e-02 2.352416891730208792e-01 1.114446302126784333e-01 1.428228011247690936e-02 1.965644341251230887e-01 1.461001553421860111e-01 1.049230263621936214e-02 1.817637086395940821e-02 1.459213486560876315e-02 3.587691678084857505e-02 1.552992148831772688e-02 6.461192709559364367e-02 7.597679211401806021e-02
2.158509534586802378e-02 2.080969804079637123e-02 4.988618231298137806e-02 2.737548642766745449e-02 1.296046259576698334e-01 3.280587180451299822e-02 1.076827308555694009e-02 1.616283787984856488e-02 1.196852047318027086e-02 9.722853871330028319e-02 2.003877232158750576e-01 3.852463682324530625e-02 6.595718079248925891e-02 8.423598618459607335e-02 7.664849859488277739e-02 9.335345411718029562e-02 1.599643449778093141e-01 2.775600931523760084e-01 2.838001784642478209e-01 2.236283262075387246e-01 1.302524055219220038e-02 1.605998909683878026e-02 1.379689088062491763e-02 3.311141230598703411e-02 3.947010144169094126e-02 2.017442922757133605e-01 2.009463300494069293e-01 4.919356081175019213e-02 6.688826547894789754e-02 5.192484263725636456e-02
2.037625613169826225e-02 2.140286824615019942e-02 4.163863723756129620e-02 4.384930398740829322e-02 2.844491742449031454e-02 3.449064113891472938e-02 2.114565472442795357e-01 7.766000092072847943e-03 1.671947855525620155e-02 7.014367907975839998e-03 7.292738062292560865e-03 5.623678656021371784e-03 3.704529435150366590e-02 7.559983635107953015e-02 7.108566138318878069e-02 1.097811268590887790e-01 1.913803426865673674e-01 2.343375878678102264e-01 1.365460082991395985e-01 2.991261437472981025e-02 1.789364532216492984e-02 1.223061868076260883e-01 1.772179445347004390e-01 2.996738376539405668e-01 2.854727421396598408e-01 3.766439770873212800e-01 3.040772928883973547e-01 9.742475763668749511e-02 9.919013247946512069e-02 5.866804505061171821e-02
2.674836319270997367e-02 2.998772554615516256e-02 2.791724909595058243e-02 2.503280002162252757e-02 3.624024673253325307e-02 6.395986896912778108e-02 4.750919552483246627e-02 1.494966110141669746e-01 6.869693088182829421e-02 1.167527732280332353e-02 8.592661748371289987e-03 1.326291040355359260e-02 2.621610421212575148e-02 3.900092772908200778e-02 5.198406735540674062e-02 9.408585784091906545e-02 2.048203610298284238e-01 2.085836227377285412e-01 9.991229580714917902e-02 3.451009964267963415e-02 1.479311304386973780e-01 2.665197560537385657e-01 3.395202824837493250e-01 3.546166077519813942e-01 3.202095831122468983e-01 2.832604505558051766e-01 4.262142171103799893e-01 7.942086814353480073e-02 1.325440961597958711e-01 7.177122715777912998e-02
6.801594121024213957e-02 5.239836413024842598e-02 2.501427592185806459e-02 3.454771004947071456e-02 5.932560596567397829e-03 2.231497459729687299e-02 1.164002583377709010e-01 9.343356781610877293e-02 9.170369217985123445e-02 4.562555007388785500e-02 1.858832171836799496e-02 6.259528546561882005e-03 6.086705181875253119e-03 1.400547538381029418e-02 2.541411843792055689e-02 1.180059577494312756e-01 1.254410880288218400e-01 1.539655030882353115e-01 2.716127686490428170e-02 4.818105003744662523e-02 1.634541772447150321e-01 3.504630856382774384e-01 4.283484107228110460e-01 4.552988111819284978e-01 3.894591430275597954e-01 3.884075197908257171e-01 3.709563369313784720e-01 3.005189017402296048e-01 1.642248446696201875e-02 1.134392283087858749e-02
2.727462749975469863e-02 7.398063039214979042e-02 1.274355594861802943e-01 1.124363333642590217e-02 1.727324542536621058e-02 2.289843924576184103e-02 7.251905753597241711e-02 9.080062858548428040e-02 6.226412684237012107e-02 4.840313926873780065e-02 1.320347036164337337e-02 1.361462409036023058e-01 2.054248651100378242e-01 7.439774204224246582e-03 9.450256169464304329e-03 5.625019775079147938e-02 2.162087322937680453e-02 7.276373485535289100e-03 1.545354900130114506e-01 1.787782051964428853e-02 6.548972415173059947e-02 3.483265077765055340e-01 4.402066653376390803e-01 4.684862370937619702e-01 3.496167587264410459e-01 1.656841893335463112e-01 2.734444450325643761e-01 1.862723317787121913e-01 2.929112480470781946e-02 1.269484878630249176e-02
7.896488088936589114e-03 1.167456348283874533e-02 7.136047490176951509e-03 7.131507603170143643e-03 1.277777350324709772e-02 7.292039038948329097e-03 3.759429177799081256e-02 4.861454788456368026e-02 4.481125927242528978e-02 1.299069056791104376e-02 5.759093790963512420e-03 9.560521107010468145e-02 1.636734215424866246e-01 6.967426035502453062e-03 1.355789419388210224e-02 8.632712611823146684e-03 1.508822124197354772e-02 4.717912774863051648e-03 8.850471986048213946e-03 4.191332071331974052e-02 2.189988384949611844e-01 4.169427558872184081e-01 4.500058039776174135e-01 4.311788103210748568e-01 3.346682864237973121e-01 2.478127019545498799e-01 2.421240363363235393e-01 1.763574357633735656e-01 4.056834329044963633e-02 3.220443401428217389e-01
1.599825945128131519e-02 1.421158971536735580e-02 8.965033148695006684e-03 7.726768663083635920e-03 1.009314765965529936e-02 4.238716777782521559e-03 1.988263338439874572e-02 1.982920907723363310e-02 5.707073192194301280e-03 4.076294498802364268e-03 1.648409200671548946e-01 1.468146233208366402e-01 8.172642509197672323e-02 3.795997559140482092e-02 8.160946254222078977e-02 2.496173794011407373e-03 8.523994545598786651e-03 1.945147402367272335e-02 1.874458184589584617e-02 8.426845535704131918e-02 2.333656989083477129e-01 3.420780426633323046e-01 1.407162877065067652e-01 2.117702415917186720e-01 2.737006907262397037e-01 1.551101195297144852e-01 1.312729400243198286e-01 1.217098158395644170e-01 1.847550371185927021e-01 2.009612296245091856e-01
1.277777499736257143e-02 1.427933096225649824e-02 3.368839000044748268e-03 2.183405581236725623e-01 2.040909492734339081e-01 3.825393905232601834e-03 3.403147495018695769e-03 1.050967570761866254e-01 1.496755698932211442e-01 2.604555154484779200e-02 3.858426145021644216e-02 6.181999722613329418e-02 5.769192000485173083e-02 1.812548836057482349e-01 5.374593666404464155e-03 4.636558159902375714e-02 8.457401672999864672e-02 1.219968384336943684e-01 8.310775439708098511e-02 6.286328571201373061e-02 4.533149806639498458e-02 1.647782415691695368e-02 6.493027911020151852e-03 1.406375574382811439e-02 5.067001120124271091e-02 1.703272759679619677e-02 2.227915058494588443e-02 2.641345693858652144e-01 3.446323549985317453e-02 3.218798567006888461e-02
2.618645173063327905e-02 2.234906589142252042e-02 4.091754023898807810e-03 1.689174651658720272e-01 2.887303575229048236e-01 2.200257225662336225e-01 3.356304655645627258e-03 3.820989390094042815e-02 3.605805383999510783e-02 1.563948805308595230e-02 3.871524412172364787e-02 7.076555550018379104e-02 7.508856099383161287e-02 7.271753229042256239e-03 7.861568972050833257e-03 2.590524315970868172e-02 9.392661870226363952e-02 1.734687177141361336e-01 1.947237167643573186e-01 1.692202311948012849e-01 3.668635602769552972e-02 1.129201277516883421e-02 1.413587602971079667e-02 3.333349605434719753e-02 5.789998007274507752e-02 1.704066344768912986e-02 1.072518383044016206e-02 1.234762548192501336e-01 4.656376554728616779e-02 4.472958165293085264e-02
3.173691887881522483e-02 4.545434414137361663e-03 1.585985971640419268e-01 6.902419861544634161e-02 9.208170115516610410e-02 2.077984756568619362e-01 2.759331133406519587e-01 3.177868018917549831e-02 1.796070481547838368e-02 2.038038730905122539e-02 3.676858411431210838e-02 6.180616820620368074e-02 5.574946514455960539e-02 2.679560163582885290e-01 1.237592049907205831e-02 3.680179230186921002e-02 7.019023543662515630e-02 1.590617515795779702e-01 1.974852040607511516e-01 1.676088931121909320e-01 8.577393745919816015e-02 7.901508387829511357e-03 2.273141029356238463e-01 1.271165810053777150e-02 5.211741825644258114e-02 2.803926551603249523e-02 3.660392298330146510e-02 2.089845412242987699e-01 3.680896334817861104e-02 3.329792137942427094e-02
1.706021052876020849e-02 6.096520084074869700e-03 2.717093023899384494e-03 2.904386482409953250e-03 7.254672945231801021e-03 6.914040877911895727e-03 2.999205111494037679e-01 1.268863483696541783e-01 1.843731822599174175e-01 2.326150065629753461e-01 2.152757989020117474e-02 2.540321558896007845e-02 3.327496808665807160e-02 6.336849745879717666e-02 5.430903176972990895e-03 1.128357806894690271e-02 1.208244352744938278e-02 5.446872226191578487e-02 6.785292830925618301e-02 5.478205777643825602e-02 5.372907746378001448e-02 1.370477938253414872e-02 6.163015529029196304e-02 9.989653420810137852e-02 1.237310893495464394e-02 2.756498417260295000e-02 8.454806089530059188e-02 4.638812931059197592e-02 4.088515660843217159e-02 3.575133443172305581e-02
6.075847686050512078e-03 2.394729064595555856e-03 3.139106566278863659e-03 6.515782017529734085e-03 4.406693696888632460e-03 2.517261650551106400e-01 1.218865585362340492e-01 8.867064882239009127e-02 2.714988584819303941e-01 8.468349657949828316e-03 6.965319489351211313e-02 2.573810012138994657e-02 3.796763933274165115e-02 6.879613200781882487e-02 7.510356574289500653e-03 1.243775744271514300e-02 8.329250211026548514e-03 1.404148569930414037e-01 2.007643361518973435e-01 8.977933267565086847e-03 1.825679088181765899e-02 1.360998425614300955e-01 6.779326125872332798e-02 4.023651534458224516e-02 8.794397068573793497e-02 2.298623765280435327e-01 6.559600837823192920e-02 8.800626596528200729e-02 5.059277089808233985e-02 5.683330160888706156e-02
6.156309353544681812e-03 4.909235646154324131e-03 2.972940992262651690e-03 3.493839706159443947e-01 3.745796937739771515e-01 1.485425343007896193e-01 1.003347231882603385e-01 1.042824992356365665e-01 1.136353984876781326e-01 3.527108835199955789e-03 1.290101800108770513e-01 1.288288631249075167e-01 1.036000089513965383e-01 1.048298866753754471e-01 2.661891237563522861e-01 1.821594932348648554e-01 1.283175035567380162e-01 7.900342463095838541e-02 6.775978380034541892e-02 5.033347197160356612e-02 4.035038419037823010e-02 5.873330124365950394e-02 8.799207522080709776e-02 2.060092051652631095e-01 3.530274616016957356e-01 1.618299831762214369e-01 2.497950491489436819e-01 1.718179611213252744e-01 1.775108523639158942e-01 1.172677503749478267e-01
8.358385635068308131e-03 4.330727707841841058e-03 3.056655306301704188e-03 5.166574279001963192e-03 5.207136570987430310e-03 3.663983739105911019e-01 7.206251784564233348e-03 5.831599440617518844e-03 1.554485269805108427e-01 1.116841468754961320e-01 4.149191066462906696e-02 9.612853264113928320e-02 2.419235089807211248e-01 2.241234964229494586e-01 2.961991783186071828e-02 2.247193884165562053e-02 1.461005157257454223e-01 1.713567737986676776e-01 7.674650688684904465e-02 3.373803029219957922e-02 3.276812201721888973e-02 5.097870661123680286e-02 7.708853472484666902e-02 2.351184482873958370e-01 2.383947564897369309e-01 5.671951944758810149e-02 6.342390462054671441e-02 8.162956212749057638e-02 2.661743109103546501e-01 5.460325087156995411e-02
1.127853015310245968e-02 9.695560534565838412e-03 3.002002432887135568e-03 1.044543988729467777e-02 1.315335613697319814e-02 2.465918191941015788e-02 1.752854301451345354e-02 2.542428381394877708e-03 1.576407687046636197e-01 9.066720983210423135e-02 2.714576670351220508e-02 3.422316676264553631e-02 3.676530670231659831e-02 1.273193975325179195e-01 1.477489854680085479e-01 6.313860521137454329e-02 5.145249413018316426e-02 5.490715828717009084e-02 7.320316314287121651e-02 4.203932859198032668e-02 2.977197197237551815e-02 4.423558112181059931e-02 5.014153144939209605e-02 8.378469954937982356e-02 2.625410304119529803e-01 4.164249106917379539e-02 6.084217659705172532e-02 9.965846492190470751e-02 1.204293128368648796e-01 2.397497011432095648e-01
6.292139053540805015e-03 1.546435826360691851e-02 4.695809164627256713e-03 5.089043637590522605e-03 2.489674548551263147e-02 2.628747915902701626e-02 1.871743471838662604e-02 2.854614963084375345e-01 2.195027941262900073e-01 2.034344635700405524e-01 8.243479983239906939e-02 4.101521370387589682e-02 2.459165402671670969e-02 3.880717940041408798e-02 1.782702562260353174e-01 4.698126731046545906e-02 1.239678704183535679e-01 2.259646062332987954e-02 4.286514793372424997e-02 1.609556106091793171e-01 4.148986850222492057e-02 5.798749937865582682e-02 5.040290391980077611e-02 5.544132760765858869e-02 7.385559622402970703e-02 5.688616698500392060e-02 6.739679352535538071e-02 8.322988410814158300e-02 1.123712239768586418e-01 2.771676987493984501e-01
