3.628112313345143747e+01 5.381183860750583392e+01 4.606662187540470654e+01 5.843445125148009112e+01 4.091017603675201997e+01 9.694158310778303189e+01 8.136299764913704280e+01 2.905310914385790966e+02 4.309154679275179660e+02 2.348191434339832426e+02 1.023986682810607221e+02 2.471066844109681426e+01 1.464290802289298554e+01 5.760561594988628542e+01 7.202081646081879285e+01 1.732201495931709445e+01 6.725042491157896052e+01 1.298633798754626696e+02 1.329706103690627117e+02 5.169374079985515635e+01 4.095539900063491245e+01 5.901818483249330782e+00 4.581940363490781820e+00 1.864568934748416140e+01 3.707844643367724302e+01 2.993105514909173337e+01 1.424598760232442807e+01 1.277131299131561981e+00 1.240946236126654112e+00 1.595128602563771869e+00
2.992104128207439473e+01 7.360376069432696511e+01 1.311823046110897906e+02 1.203329880618650236e+02 7.788895282953652099e+01 3.315896633915390908e+02 1.015537136963803846e+02 2.008118114647827213e+02 9.494442981939526760e+01 1.199126444066471038e+02 7.398108005976574475e+01 1.597364083180301719e+01 2.076966333939475362e+01 4.926346463451830715e+01 7.215580738959761220e+01 5.037744770736362909e+01 6.972452872410015345e+01 2.516118093597079906e+02 2.174661676447075251e+02 7.463049314294087822e+01 2.620315902125295437e+01 5.853671499243965570e+00 1.240586069912145284e+01 1.138766119707672431e+01 1.045008459009405932e+01 1.462600550944764066e+01 5.419809452447829301e+00 1.373827482708475767e+00 1.940851943418460124e+00 1.933440949899832173e+00
2.946461332720081145e+02 1.763940412550618930e+02 2.929695288208898774e+02 3.233713040880957124e+02 7.361003013525115648e+02 1.490800348067543837e+02 2.033491638627266695e+01 2.887807310004247796e+01 4.088532696922114837e+02 1.475890178213310833e+02 3.395421859595239766e+02 2.792224541373276452e+02 1.036894295463466733e+02 1.638552369462750562e+02 3.240982804898432335e+01 1.472640457706421842e+02 1.098883067248234369e+02 2.510776987725327274e+02 9.654698277510624393e+02 1.846613316018581941e+02 1.747074314451300836e+01 5.092329771356059354e+00 7.893434959245545279e+00 2.870373988499022921e+00 1.802992116571064951e+00 1.268872810969306597e+00 1.211949974887526427e+00 9.124360097033760164e-01 1.492164954798155030e+00 1.620901230651201619e+00
1.772328300025350245e+02 6.519803228280892426e+02 1.580302147332693949e+03 1.439704795339454904e+03 4.390940741358024866e+02 6.237202738518843859e+01 4.137642125047033659e+01 2.991653984810919553e+01 1.841000473753859268e+01 2.036815688160683919e+02 1.308409198096424575e+02 2.652245554338547890e+02 1.023521496131393462e+02 7.584174095985197539e+01 2.333915408952869797e+01 1.909810985111418091e+01 4.350134226744903287e+01 8.837833444764201829e+01 7.125831208627703006e+01 6.887655232882218570e+01 3.292326341253742328e+01 1.168843020533156718e+01 3.725808404464580725e+00 7.522303418133063246e+00 1.435971988581406400e+00 1.116462183870115865e+00 1.030617175567481780e+00 9.226419087468699098e-01 1.764982390471792506e+00 1.840437152104756002e+00
8.128108946747542518e+01 1.248700230982223047e+02 2.627110370708952587e+02 9.832826723788721779e+01 9.745527001789028532e+01 2.551267973092047825e+01 4.160400891416499292e+01 2.318185939919832350e+01 9.934989008593122506e+00 3.446612724646878974e+02 2.814988188245756078e+02 3.914868772951784877e+02 5.778474955728839291e+01 5.408458983190662650e+01 2.681319510000009032e+01 1.048938286662607666e+01 1.194565482524924249e+02 7.402369425284723548e+01 1.325511539785648836e+02 8.290315630500938937e+01 6.172048866105588871e+01 1.857072777039339684e+01 4.288752284876339615e+01 1.205163620542804281e+01 2.449764569488268595e+00 1.414891176250808957e+00 1.058852302334972073e+00 1.155287358948889231e+00 1.698070563290656310e+00 5.981123179623942576e+00
1.085393367168906309e+02 1.294804725764938667e+02 6.013366956574011510e+02 4.719095763276451407e+02 1.753036816336567085e+02 1.708322664578148675e+01 1.915573694830340656e+01 2.002166299962709317e+01 1.839588557246984735e+01 5.994207100098133196e+02 4.720312129289353038e+02 2.355233196097995005e+02 2.554569016097265433e+01 8.192357955093880761e+00 6.594957500165458342e+00 1.136298776586961168e+01 6.215011899978891563e+01 1.702525301804415747e+01 5.941429333838627258e+01 2.170845794833603861e+02 2.894661651002414260e+02 1.886120951526764600e+02 5.010106243337006049e+01 6.750538290373238937e+00 3.478946542445879864e+00 3.531174252622924392e+00 2.376220717981561315e+00 1.542409060182386993e+00 1.907250692023173766e+00 3.281119510081582646e+00
1.370033417798292952e+01 1.992941729708041976e+01 1.804494810188267451e+01 8.612955313747677621e+01 5.134859909728609750e+01 9.436106381387354247e+01 1.411370982450253564e+02 7.798643800305319473e+01 8.809744586569227920e+01 9.293656350297956692e+01 6.681394649362867710e+01 2.948324733777477746e+01 1.267939141737313591e+01 5.117631014139275791e+00 2.814455057630705248e+00 5.450149422632975416e+00 3.355348293200156462e+01 1.631111852694395736e+01 8.656570463563230078e+01 1.234823124464890469e+02 6.238173139964605696e+01 1.645522339765679831e+01 6.911356015853462154e+00 5.704077429066378713e+00 2.251187362135168790e+00 2.511080359061433231e+00 2.390863451008679696e+00 1.949075597497420098e+00 2.115386074612273681e+00 4.793719278162996922e+00
2.724832806387192363e+01 5.279638496855582730e+01 3.311506946029112441e+01 7.348093497494531334e+01 1.140203986741221485e+02 1.202458615613442561e+02 1.029720690360865518e+02 9.506493253943482102e+01 7.706132081815280799e+01 4.225654959333872540e+01 1.650551437125911747e+01 4.881471058030389543e+01 1.018204382087197679e+01 3.485470616704305691e+00 3.679152272546673430e+00 7.243864531188950906e+00 6.308895061506430579e+01 1.042085859313201297e+02 9.594226190327259474e+01 7.272450541800947121e+01 2.188550862380817819e+01 1.100693051582205051e+01 3.973514950035319515e+00 3.281808935433182306e+00 1.637920238679450469e+00 1.835667919542039117e+00 3.076027059572434830e+00 3.729371656696092607e+00 3.542184825370944701e+00 9.848733955965787601e+00
6.739350994038511544e+01 4.532474013207776409e+01 2.784066899546159846e+01 1.644161765025395709e+02 1.101747895210335599e+02 4.635202055803055998e+01 1.502777289601961570e+02 6.735412956199930079e+01 5.762133755464353158e+01 5.521333543434264612e+01 4.784544444890314452e+01 6.179644634977336892e+01 1.346654960981105944e+02 8.974094416807410823e+01 1.358016530357247831e+01 1.249202963199199345e+01 5.540759493517927581e+01 1.747472649347875233e+02 1.830398088732687256e+02 3.327575598400397183e+01 5.783439052828243554e+00 4.728094079774542102e+00 4.813670495352535994e+00 3.125521037017307435e+00 1.893245249390675067e+00 3.055481599746717514e+00 1.242550357902261382e+01 2.408375273509053471e+01 6.604368674425452923e+01 3.098073922578826966e+01
1.094713207757918383e+02 7.188342044347203341e+01 1.214636143107214252e+02 1.184751543096988371e+02 1.093759359138633442e+02 2.166038389133588993e+01 1.006919960061842971e+02 4.322425736435378951e+01 1.876670019126743938e+01 6.893462308572765096e+00 1.013095908198121151e+02 9.420544859710570051e+01 1.993253287566575125e+02 2.115212215401898561e+02 1.009755864214839818e+02 1.037754824920848904e+02 5.682776813297716672e+02 6.170703533548072528e+02 2.677671173918623708e+02 1.314210053354680099e+02 7.023391255857381665e+00 3.496494219024779415e+00 3.866189960425481686e+00 4.266453517764096759e+00 2.421030848330167906e+00 3.219397275346048914e+00 3.183518007579768749e+01 5.250439771225806851e+01 6.253916565879259082e+01 1.571694925266620402e+01
9.318817043160734670e+01 4.867462023165961682e+01 1.126993233344051930e+02 9.803799103892320943e+01 1.330592931765872891e+02 1.259879161850284568e+01 1.078453821500632870e+01 9.578730649303231814e+00 6.199042314076683269e+00 5.571626601007191937e+01 9.229810953381543186e+02 1.397706685175787698e+03 3.142583566367676212e+03 1.315654221861814221e+03 2.491263017799419686e+02 4.225429093440046699e+02 7.964730378948135012e+02 2.287120078807416235e+02 5.887910156515967230e+01 1.282634687103730187e+01 4.614748466453910680e+00 3.321121111404758075e+00 4.218979058542399407e+00 5.978890468531629310e+00 6.498612686596020538e+00 3.603977822739634185e+00 5.870000320270969851e+00 4.498881414029419545e+00 3.893792938046251706e+00 2.700692059016931879e+00
1.799563389951235237e+01 1.065550894415883576e+01 9.616199536178237395e+01 9.557859279137841213e+01 7.780081516160790045e+01 1.866625192322876714e+01 7.331319153553372381e+00 4.675561911712163621e+00 6.082174091436630903e+00 1.170076331505095197e+02 3.019002518831046018e+02 1.311426988910590808e+03 3.431450869476274420e+03 1.137879904734923230e+03 5.758944569523184782e+02 5.316225324922904747e+02 5.975520099573689095e+02 3.543665019873964184e+02 9.318632814613823712e+01 2.749902527683194009e+01 4.047413700523686764e+00 3.582264187535415978e+00 4.252625049704466420e+00 7.788709465287257494e+00 7.635016540396440732e+00 5.594444843351980445e+00 4.375452866345958647e+00 3.804152819205123492e+00 3.930584619020305315e+00 4.069975528914865137e+00
3.452831541995387887e+00 9.319772865037581511e+00 2.296851923763313863e+01 6.564104257537537990e+01 4.422982058671253469e+01 1.441070332472250826e+01 7.334686228817139053e+00 6.168633811852878956e+00 8.381782759855525455e+00 6.233208197967015707e+01 2.276333458650034913e+01 5.243609049945815741e+02 3.002969299824751488e+03 6.158066140906373676e+02 3.549611451954816630e+02 2.370359926756441951e+02 1.289560388581513735e+02 1.153437098194129362e+02 1.892558862442816405e+02 6.572031912991845104e+01 5.230691747103747069e+00 4.240316468832460828e+00 5.211100075326425163e+00 9.291841554562825678e+00 1.249555260806267754e+01 1.219292716073058003e+01 9.243511047309208806e+00 8.258286174560193871e+00 5.832573197605481319e+00 4.206242077243241617e+00
2.674849339995949649e+00 8.142388587237645581e+00 1.496660446906800424e+01 1.097851035979497780e+01 6.601612455975452320e+00 2.721709607809353670e+01 9.647711928563495576e+01 8.861895622710159159e+01 1.260867800110627712e+01 3.857232477107743751e+00 1.780102667388754512e+01 9.141477982488926557e+01 1.435447730459981813e+03 8.466710818983881381e+02 1.889569776876471224e+03 1.077636727612796221e+03 2.003524728445870096e+03 3.743655666166608853e+02 3.237410236560696831e+03 7.805037944406391262e+02 1.123319012843178939e+02 2.826086381165736583e+01 2.149064927516177548e+01 5.434672659207632250e+01 1.163948195386984139e+02 9.532070795637739025e+01 2.694793124946796752e+02 1.031012292341883949e+02 8.802157296986820256e+00 7.907156689133877592e+00
2.363787945630922316e+00 2.503768012350275018e+00 7.061691877014255603e+00 5.346634450460688015e+01 1.980919922524271470e+01 4.838413554645713432e+00 6.615206522885016227e+01 2.048732656005351203e+02 1.505214846843410612e+02 1.607428320740790539e+01 3.839783105306312194e+01 5.545843446472492815e+02 1.426559951804406410e+03 8.478972077793828248e+02 1.488750332115264200e+03 4.618108309733690362e+02 2.884578759667401755e+03 1.074481388076493886e+03 4.226488790090034854e+03 1.240778538705142182e+03 1.159278528459636988e+02 1.110185248757336893e+02 1.061810496649709705e+02 3.262260594976428365e+02 4.360771568335760549e+02 2.323927303779751583e+03 2.303422810012868013e+03 4.568679984724028600e+02 9.951559050617799329e+00 5.341515542417782925e+00
2.086842831855555858e+00 2.369853433804325338e+00 5.697092057587127556e+00 6.426683475832207115e+00 4.384290051584837755e+00 5.340974287148211985e+00 3.984233925110260088e+01 1.151254466483169097e+02 2.504904918299585574e+02 9.464220460079442887e+01 1.098555588833349930e+02 9.395112427074376171e+01 8.503388475211822879e+02 9.376497848239052928e+02 1.493511272969666834e+03 5.903229246137258315e+02 3.818875137251804063e+03 1.124051380193040814e+03 2.092139605191054670e+03 1.954358243576680252e+02 1.970345063092955229e+02 7.457330126936153647e+02 1.263079350774456998e+03 1.519952276051634726e+03 1.518280801490885096e+03 1.430964984336823818e+03 1.366804129453711084e+03 5.500872317392673949e+02 1.484385958936121952e+01 5.956923278484309137e+00
2.645710142536631171e+00 3.155266909774334216e+00 3.203802180893885243e+00 3.177360458952803501e+00 5.219226434910904544e+00 1.181295689557495265e+01 6.895947028377903507e+02 2.319880991169251047e+03 1.172944742499251788e+03 2.134468673034982089e+02 1.751468536333098314e+02 2.997595981994825820e+02 6.429183532682761779e+02 6.826221106681584843e+02 1.147588007630741913e+03 6.206720068248772577e+02 4.288470659899734528e+03 1.207884361466516339e+03 1.390262563850510560e+03 2.855934204458675367e+02 1.761134243407875601e+03 3.210144139412353979e+03 4.768231035245602470e+03 4.814110924959401018e+03 4.325296831415854285e+03 3.610616108434081980e+03 5.025019957714928751e+03 7.402643746334704247e+02 2.265103747431484038e+01 8.222402973497649370e+00
6.638011180732500627e+00 5.382072312765799893e+00 2.873695487520214975e+00 4.797076319462191485e+00 6.903927684113008922e+01 3.647568776713718535e+02 2.005364430992455709e+03 1.635215942710167155e+03 1.670254076245960277e+03 8.915288757625987728e+02 3.605283195406951222e+02 1.117219287918480006e+02 1.137776517387988093e+02 2.438310562965440340e+02 6.034982188277491559e+02 1.270579678712007080e+03 2.488549130366800455e+03 1.225005562963511238e+03 3.535238424590503428e+02 4.295290260157995590e+02 1.081021289468717441e+03 1.303127669316866786e+03 1.414334653658375373e+03 1.401501162891012427e+03 1.241720730068834200e+03 1.191708328673703363e+03 1.434078367538526436e+03 1.502603027741601181e+03 1.067838355663833738e+02 6.554463078685623145e+01
3.028090270582425525e+00 8.766990794261735331e+00 1.701547955213509766e+01 1.281906159359774051e+02 3.191232318408744959e+02 4.757126928240836605e+02 1.510631886420797855e+03 1.893834759259157181e+03 1.353414843123528271e+03 1.099461119121321872e+03 2.481315139773048202e+02 2.678360448447853770e+01 4.141701918017425044e+01 1.024234372743624704e+02 2.194265025226752357e+02 1.018421228122257958e+03 4.065440031996740800e+02 9.787158947613718851e+01 3.244732846645938196e+01 2.119579611243194108e+02 8.282055555911068723e+02 5.172246723699165159e+03 7.004576412560312747e+03 6.633097987422417646e+03 4.193257283286251550e+03 1.768644962121584285e+03 2.639514634949535775e+03 1.680998086389635773e+03 1.355808597073030342e+02 4.772930551330306059e+01
7.968216235959128824e+01 1.094789346267690746e+02 7.899355869632603344e+01 1.083918317879270745e+02 2.907019547300254771e+02 1.816610620217681742e+02 9.717113871050241869e+02 1.276348337724878093e+03 1.227770116364676369e+03 2.970826742761800006e+02 7.670233432160743803e+01 1.630898940748105730e+01 2.863454757149827401e+01 7.781832704164571624e+01 2.797391087281210957e+02 1.684505971972963891e+02 2.705554188018447235e+02 6.895953906711507386e+01 1.126888224216819765e+02 4.338873710815060463e+02 1.261139658912620689e+03 1.750529586824226499e+03 1.633758946933342031e+03 1.484788661763634536e+03 1.115282606664498871e+03 1.120891816942098330e+03 1.044781541265246688e+03 9.704328029704909113e+02 1.012562349333456950e+02 3.503202283380032611e+01
2.382346941294036924e+02 2.376690060327557319e+02 1.365811089587088247e+02 1.119589568410910800e+02 1.697293625114463680e+02 1.032347344931554289e+02 6.305977830217493647e+02 5.867128183621866810e+02 1.713942158020704483e+02 9.131643808516172101e+01 2.936116816188299339e+01 2.176183853674371704e+01 1.286509863709904344e+01 7.062749234338425275e+00 1.660193147828083227e+01 5.150827596216586812e+01 1.638967694921424254e+02 3.383433471054954680e+02 2.923941944583103805e+02 1.193866339303269569e+03 3.075434031696162492e+03 4.325206468079797560e+03 1.628535153080352757e+03 2.126416516040834722e+03 2.519294235311112516e+03 1.247622044754288936e+03 8.771119906056846958e+02 7.023203077720511374e+02 2.414100185648035080e+01 1.966982663925960040e+01
2.012858603485642561e+02 2.525946500676511164e+02 4.255082528949900222e+01 3.383306104173747286e+01 3.238336958371766627e+01 5.556498236104259547e+01 8.765583767321119524e+01 2.355287407353163687e+01 3.208255568614963238e+01 4.492344242124471698e+00 5.586809292488424283e+00 8.116034248211462909e+00 8.452802654382534087e+00 3.002551411501739054e+01 8.207863803168785921e+01 9.848704953419251069e+02 1.613500941630554053e+03 1.893227612937198955e+03 1.027139295633259280e+03 6.140399966692841645e+02 3.243698312385445206e+02 1.362527106901072216e+02 4.137848544533790118e+01 8.978369824208651551e+01 2.798492812036150781e+02 9.833827431674065167e+01 9.539221301285030563e+01 3.363155883025071091e+01 3.771630348777557096e+00 2.809465374652311720e+00
4.417842723908387370e+02 3.663659129888520170e+02 4.535429672813860691e+01 2.202239776799097370e+01 3.697172173936334616e+01 3.096450635308872634e+01 5.033201188162208695e+01 5.695356699206397977e+00 4.939316807375716323e+00 2.039401629676581784e+00 4.686882837025098780e+00 8.704215663741893039e+00 1.099561381224145329e+01 6.001819503984903292e+01 9.376339102787123636e+01 5.441089511633180109e+02 1.790282382372944994e+03 3.236333993192812613e+03 3.461663948537257966e+03 2.602766889870602427e+03 4.648037050551368452e+02 8.901446696419239402e+01 9.174286449543834010e+01 1.968367568059524615e+02 4.023589962734224059e+02 1.100409024669000075e+02 3.988462483040083839e+01 1.481659885860580417e+01 4.494537279354938519e+00 3.924387724118090226e+00
5.815686868499755064e+02 7.873980760789834221e+01 2.466449346916896701e+01 8.881940894916594331e+00 1.128561206500556402e+01 2.629657401127949257e+01 3.506061149488711948e+01 4.063743363414697995e+00 2.251236582799712060e+00 2.512695381048773768e+00 4.388088573619480570e+00 7.433016548236491161e+00 7.959465296676672352e+00 4.523042985015293738e+01 1.694339663987230722e+02 7.639343682752891027e+02 1.287525205723244198e+03 2.470217161814297469e+03 2.418813140612690404e+03 2.138786419551549443e+03 1.023232401053019203e+03 5.167832436576554755e+01 3.067811228899306997e+01 5.965835496196918086e+01 3.220536113279875963e+02 1.806315836237854455e+02 1.561816178531158243e+02 2.879485697334019179e+01 4.113001076082930751e+00 3.041839065259897001e+00
3.490235496507867765e+02 1.136125120757300664e+02 4.815803407590647822e+01 4.826894997863260528e+01 1.187481661896634932e+02 8.488331685767977319e+01 3.598967319740438597e+01 1.515712678068744879e+01 2.327954784400883170e+01 2.911086026640103697e+01 2.639640289551537400e+00 2.971240012915263407e+00 4.309127128899200798e+00 1.007617104623357207e+01 5.964440248387061416e+01 2.305874656098445996e+02 2.160741118937827991e+02 8.853793993423311122e+02 1.056788743506354194e+03 7.958568651709699679e+02 5.561246246800064910e+02 6.057621937356735486e+01 7.667132860351722812e+00 1.410042429678576426e+01 6.071885893502647491e+01 1.466106203389099960e+02 3.839877603783384075e+02 2.087182836730451925e+02 5.086300992302106749e+00 3.697140443870044813e+00
1.257761546041254377e+02 5.269320513982346199e+01 6.088730287699924304e+01 1.103482595125680632e+02 6.693211870132779495e+01 3.117777522859292816e+01 1.461684830767455523e+01 1.056078155668982532e+01 3.448888539103049311e+01 1.279947294912349207e+02 8.514923823161691274e+00 2.965124404442577966e+00 4.693653657061472195e+00 9.828182903129587089e+00 4.549391064365957504e+01 7.716749195416537077e+01 5.044133368334904333e+01 2.343008715590868718e+01 3.418516586988115336e+01 5.621172330928629890e+01 8.820359945371018284e+01 1.757729539331710811e+01 7.837159629764085977e+00 3.810237827092741725e+01 9.082456753248922610e+01 3.123353807540221538e+01 1.050389854351942347e+02 1.129630683445756176e+02 3.906239665776668346e+01 5.780404383044759342e+00
1.267319596766676710e+02 1.079280125018257905e+02 5.632630067732229406e+01 4.464205015528336418e+01 4.614004119225607070e+01 1.793361609231024545e+01 1.214190341355490155e+01 1.286440544215410497e+01 1.464367026830100649e+01 5.600018726300244509e+01 1.558079938042378743e+01 1.521362076809369057e+01 1.335829205224459137e+01 1.542784472300934695e+01 4.151399578274069313e+01 2.736018538706607472e+01 1.786071831392579412e+01 1.037178828436762146e+01 8.804003676151140212e+00 6.459688864614863135e+00 4.819415420493039726e+00 6.614095606806916550e+00 9.767417180874678806e+00 2.312349515729872707e+01 3.958519302581805732e+01 1.849837091894966079e+01 2.876550517781964089e+01 1.809423973285740317e+01 1.760847890916626213e+01 1.104694924603932193e+01
1.707352583725609918e+02 9.456718516654939322e+01 5.765979467380462609e+01 8.481689138875093192e+01 8.316322372118719386e+01 4.711016883587623738e+01 1.653667109247218718e+02 1.293083827661471901e+02 1.956114943157304609e+01 1.362044339358773470e+01 4.830244434085349425e+00 1.136781203891295888e+01 3.155546763068284477e+01 3.220683212627930914e+01 9.282226612129153409e+01 6.615491425405127757e+01 2.033095566790222364e+01 2.340836057546349736e+01 1.044554717152575662e+01 4.405930869794698168e+00 3.866699820177738722e+00 5.696892127026101704e+00 8.440609601183524546e+00 2.479378331505882471e+01 2.466518298223896011e+01 5.713579555441372193e+00 6.140244546335560827e+00 7.519642617640677429e+00 2.362662951751812201e+01 4.810041302280543718e+00
2.278212515372363498e+02 2.094938319193000780e+02 6.846407760807406362e+01 2.520440288566118454e+02 3.283728876266248449e+02 6.494397673877178931e+02 4.483169610739848281e+02 5.248810918664153746e+01 1.930218968040292182e+01 1.073819442766765775e+01 3.120941362121065765e+00 3.999782309424901872e+00 4.717765768246911406e+00 1.749220779464231512e+01 2.067108194714728597e+01 8.997707503327911027e+00 8.320280389856867131e+00 9.486582433677989812e+00 1.260540624481077820e+01 6.710618163295686500e+00 3.708217760987972067e+00 5.005753850364832225e+00 5.516616065005475633e+00 8.765327975088752055e+00 2.648696388569542748e+01 3.985514811567423266e+00 5.507593506245519244e+00 8.759693395346534572e+00 1.028985779002714196e+01 2.045227464247832927e+01
1.228307221330165362e+02 3.251283830845740113e+02 1.045628814269306162e+02 1.201827624015091516e+02 6.460837105679523802e+02 7.137495873858023288e+02 4.890571296075829650e+02 3.465079912606081081e+01 2.489722088910541586e+01 2.265820133663262581e+01 9.032093003980955714e+00 4.430225587875741056e+00 2.807080727726441793e+00 4.635435092688711123e+00 2.133419568569469504e+01 6.209217761699489024e+00 2.049119300906988173e+01 1.140978165399099424e+02 1.932152373422375149e+02 2.595477856791434590e+01 5.098644972912009798e+00 6.415983407170744890e+00 5.434000775931147054e+00 5.723359688642739584e+00 7.337248670107312520e+00 5.372658654094678354e+00 6.045277379176576815e+00 7.292696184672733395e+00 9.588015553871656493e+00 2.354223823894621148e+01
