1.011383418860463956e-01 1.443913969419862442e-01 1.221248425050210501e-01 1.516535674591207028e-01 1.057236748532761755e-01 8.257468960896440988e-03 5.531163426412896711e-03 1.502101196679426001e-02 2.748349973903255888e-02 1.471330911464399475e-02 1.001353971083791990e-02 6.216160627652348586e-02 4.250012320175371866e-02 1.695842723743438418e-01 2.107311404128066612e-01 5.017908097591737560e-02 1.927839576691572632e-01 9.182228004496336207e-03 5.913167923065554103e-03 1.527650611645285650e-01 1.409644382496260118e-01 2.080075925150768473e-02 1.573111392345524079e-02 6.279624457127123971e-02 1.225778902148929317e-01 9.677132937588765749e-02 4.480606804252725006e-02 3.970636242698640309e-03 3.815848777769996567e-03 4.829975698999641395e-03
6.660677410152934796e-02 1.399434202362514201e-01 2.428085653143897266e-02 1.852225059698878462e-01 1.266514799026945970e-01 2.543537331686552064e-02 9.824333583063773676e-03 1.233011248775378599e-02 7.348725104947302980e-03 6.637466304289640212e-03 1.474687500089519043e-01 3.210333325109682862e-02 5.030060502825540319e-02 1.305624271550336890e-01 1.922369337517639276e-01 1.363089020394757378e-01 1.755839768282418389e-01 1.636249402461460375e-02 9.007986712128893125e-03 1.838246226698639352e-01 8.161739855293249912e-02 2.023342435941805420e-02 4.155828568276376950e-02 3.713286490373212539e-02 3.304337909974014442e-02 4.457892080464765511e-02 1.577967532378054052e-02 4.035416822122843764e-03 5.774961204507256078e-03 5.803035680581775622e-03
2.811926056617996064e-02 2.774996186828434380e-02 5.698853541142615692e-02 4.261505014002605479e-02 9.971799104211971632e-02 1.529945091389916211e-02 5.529107582469031806e-02 5.843577436693333377e-02 3.601176633189195897e-02 9.458701635505982822e-03 2.526233565600542741e-02 1.923666338743714246e-02 1.321889607300605861e-02 3.079199177839232054e-02 7.859507856380093527e-02 2.386290642868117359e-02 1.013189106807043174e-02 1.525101566071924986e-02 4.554431499240388370e-02 9.293654989887456877e-03 5.194549411405135347e-02 1.699140213643476546e-02 2.567440924701015412e-02 8.924095350138971580e-03 5.315564388412697891e-03 3.520178429519018118e-03 3.165347854084368112e-03 2.497248362302074715e-03 4.276637116490289436e-03 4.811872368872442164e-03
1.197547665176991114e-02 3.349710630906097691e-02 5.880155561655965590e-02 4.765746340688770122e-02 2.495146321696483510e-02 1.132079092674003751e-01 1.126733808116681668e-01 7.005333086402505682e-02 3.803065071980542278e-02 1.024450958981530137e-02 5.974923726979227724e-03 1.487699479904842914e-02 1.514754379115077106e-02 1.803099962918988941e-01 5.735952460136093528e-02 4.800038099202372927e-02 1.071298274437259002e-01 2.156439105432921277e-01 1.775770967045291471e-01 1.684467273679865207e-01 9.275452591230175237e-02 3.586622430444190435e-02 1.201691362044938170e-02 2.373101154252645409e-02 4.347396033839514423e-03 3.114383482673097319e-03 2.686806674839565656e-03 2.556181940854486152e-03 5.203593668940170031e-03 5.666230219046603303e-03
2.056264016504607273e-01 2.162735561185312461e-02 4.776407568563623834e-02 1.851038292319129308e-02 1.490750430702649995e-02 6.713828407552255295e-02 1.164942526643616277e-01 6.518824084194764501e-02 2.384438333428682416e-02 2.492556950768844148e-02 2.680125198801436293e-02 3.205291136854699491e-02 1.377039453351974474e-01 1.414184271643658120e-01 7.373701361996405634e-02 2.970619781721592703e-02 1.997174590489596974e-02 2.072213577240926696e-01 1.418794951406383495e-02 2.039285058748414592e-01 1.461461195427989634e-01 4.579331254469067025e-02 1.173778670484726117e-01 3.883915229502720584e-02 7.816550918689869204e-03 4.147637656857201469e-03 2.889692639879367069e-03 3.347344203498252464e-03 5.244762990275589863e-03 1.931304108826659496e-02
1.029311857220529050e-02 1.092187371763900933e-02 3.377416975939399185e-02 2.754694233120230304e-02 1.273499101531415725e-02 3.864244002178942455e-02 4.936865482527789256e-02 5.265232449738191378e-02 4.262271092064834344e-02 6.108440801633253925e-02 3.642053011909492793e-02 2.735166859531418942e-02 6.270243097431128787e-02 2.341608894858373396e-02 1.945903773679719811e-02 3.361193121540156925e-02 1.854184806688005394e-01 4.851410824083509515e-02 1.573510213408979008e-01 2.168963129403409656e-02 1.977540083922088923e-02 1.560699537990015845e-02 1.436577097274973625e-01 2.255666639272156312e-02 1.161093408420321542e-02 1.080272115205650404e-02 6.748801809192473897e-03 4.661810064120500315e-03 6.166820565663309536e-03 1.109409354756942835e-02
3.828225579788619576e-02 5.936985061078159376e-02 5.864849708097736453e-02 1.471143328539010336e-02 1.307712993979978644e-01 8.659960745117361441e-03 2.017807408279729403e-02 1.922307085260915593e-01 2.175154429657921717e-01 2.260582798675123822e-02 1.738958586565219344e-01 7.615806533572844206e-02 3.490957337581578751e-02 1.602199597778336884e-02 9.306440230456444751e-03 1.695326049681638442e-02 9.771641837296364541e-02 4.539995655443610639e-02 2.205830234947502855e-01 1.507684165052955438e-02 1.586743045248670270e-01 4.492611034675956377e-02 2.114029244086483572e-02 2.030136341662515387e-02 7.833185625649547248e-03 8.015687878753669296e-03 7.112237260576607586e-03 6.191206121743206107e-03 7.199204079401872944e-03 1.700534279595451032e-02
8.116359418310158114e-02 1.527480650770588755e-01 8.223304497853674289e-02 1.613676864574174474e-01 1.116768304234812791e-02 9.538782931409561447e-03 1.504963379419523538e-02 2.628593346100974518e-02 2.023649894645103420e-01 1.155692335054147313e-01 4.647329079335461854e-02 1.412426532704589288e-01 3.058606342643524489e-02 1.068704175628880718e-02 1.213865111058516459e-02 2.286034933596642338e-02 1.763018839734079024e-01 1.616064240580772707e-02 1.048555538279853996e-02 1.907905150447380682e-01 6.389523712418729295e-02 3.737124578119981055e-02 1.505310741980805944e-02 1.260696364762843059e-02 5.995846666833764410e-03 6.305484725524630914e-03 1.023713801510220053e-02 1.320859363918470974e-02 1.297749192976843310e-02 3.721562892484689411e-02
1.908414223643304930e-01 1.241806259327595530e-01 7.033454576715121587e-02 2.087423850943703404e-02 1.121861267859857424e-02 9.767972630929322442e-02 2.182240352000601805e-02 1.657440603895200815e-01 1.583615016706088896e-01 1.616829736769362091e-01 1.436783480739679542e-01 1.788340195472551686e-01 2.558605373108837830e-02 2.508320481947852176e-01 3.949069464490930631e-02 3.372875638088231737e-02 1.357378940156719616e-01 1.710080057301789636e-02 1.522055980960624819e-02 8.352684150220221482e-02 1.683358890314574571e-02 1.736601024198908966e-02 1.903345675327296205e-02 1.244805333516339936e-02 7.286735255454535043e-03 1.116915873647281870e-02 4.443725318948180125e-02 8.883931020380547716e-02 2.507695297058848971e-01 1.210067664895257550e-01
3.311483005221734638e-02 1.800999053698961461e-01 2.464998536501105883e-02 1.001055781384185134e-02 9.523770693642732640e-03 4.599771226159656001e-02 1.847778297677734813e-02 1.093869717944742637e-01 5.330184491459225016e-02 1.920147932369687185e-02 2.065928128217104504e-02 1.193806974167703483e-02 2.222913720178340546e-02 1.993244302356138309e-02 1.017032573376607830e-02 8.647494449109836487e-03 4.259699524259997344e-02 4.669036287170424959e-02 2.054675147090550061e-02 1.186114627134354782e-02 2.115048038646830803e-02 1.346665841623644055e-02 1.556856071719825603e-02 1.714208368512112890e-02 9.572976526850001527e-03 1.229432116601544139e-02 1.190802196188028295e-01 2.016949483073988414e-01 2.463007753817933188e-01 6.337633913624113324e-02
1.859602038806031782e-02 1.221587548964788023e-01 4.019469154569679792e-02 3.427927012816456287e-02 3.759027977361517614e-02 3.064659537000443551e-02 2.842652556267889763e-02 2.589031001542453983e-02 1.786807119070732072e-02 1.405562777823965159e-01 5.182283215956151601e-02 7.278794034101622457e-02 1.519709271232509706e-01 7.683136976017072850e-02 1.447820448677386573e-02 2.910192238619007873e-02 5.452779932615367531e-02 2.119050017378150061e-02 1.458371466608729683e-01 3.548788247757141828e-02 1.469809230592015493e-02 1.318542078220557093e-02 1.713387985945946657e-02 2.402220897849782419e-02 2.568266429020395550e-02 1.401130596620926184e-02 2.264212604664835038e-02 1.785355803653002060e-02 1.584501849101502616e-02 1.124284190131470858e-02
4.958722312741383614e-02 2.897869030384714328e-02 2.652060988622429449e-01 2.591328942440749850e-01 2.102941093075297585e-01 5.062851531402908639e-02 2.206098487286486942e-02 1.505370654104655308e-02 1.834028284154804941e-02 1.138281525237612966e-02 2.157536072425732601e-02 9.007323427410506012e-02 1.598283472204488354e-01 8.446467944749130874e-02 3.097595685801289925e-02 3.559920515199033186e-02 3.960074365324141310e-02 3.356297520422245328e-02 2.481677470203237090e-01 8.237561678073224147e-02 1.430145262740008943e-02 1.456319105552609898e-02 1.731877098563823839e-02 3.102876002945306397e-02 2.947984847700201028e-02 2.101972404860139379e-02 1.619144932258033062e-02 1.470948905285947468e-02 1.602099969831033074e-02 1.728280493277733684e-02
1.164275189353720062e-02 2.923434632513228354e-02 7.004464581342997875e-02 1.966120631600642432e-01 1.311567189912599130e-01 4.251090659204014716e-02 2.226473722934932745e-02 1.900231839816390184e-02 2.492780374666067611e-02 1.709263862718650162e-01 4.790553787851808965e-02 3.015656646056733697e-02 1.206175123575514846e-01 5.250684026612024990e-02 1.673748017688809347e-02 1.963771258240249243e-02 7.322773915629354757e-03 1.399361531401000468e-02 2.007103422723149899e-02 1.760565921915918375e-01 1.387333197064397061e-02 1.522603049833858371e-02 1.938059367251767154e-02 3.223818693277205605e-02 4.083125176037594173e-02 3.567306487917226709e-02 2.631679687447173108e-02 2.472463650544381997e-02 2.170506308960987174e-02 1.798205617066904460e-02
9.978385675744367786e-03 2.854740755120838136e-02 5.162137339388119667e-02 3.761432335099851310e-02 2.250858173563424075e-02 8.747977482431758267e-02 1.907715656539078417e-02 8.980859780162027753e-03 3.472829146728646788e-02 1.143687060730350265e-02 4.082051160533566037e-02 5.547319334443930224e-03 5.575294248146771964e-02 7.624818207108242929e-02 8.205619321201734762e-02 1.117329825144846578e-01 1.019376774896909310e-01 6.712432406781008998e-02 1.969397133153306667e-01 9.378533801211533238e-02 1.063584439462092295e-02 9.203908595060927844e-02 6.962321365655843586e-02 1.659141223797156173e-01 1.608581342400002695e-02 1.135861837083382633e-02 2.877066096835024719e-02 1.143391810439703740e-02 2.957990513946129330e-02 3.410481862426801430e-02
9.527751607433784797e-03 9.612289428334650290e-03 2.632226800198544589e-02 1.976477981605365142e-01 7.235093250212834559e-02 1.624499015208017219e-02 1.894761071157115007e-01 1.667089848525910370e-02 9.355334351591729561e-03 4.303585947499018877e-02 8.915838835290629261e-02 2.937523605279846253e-02 5.381732083257938226e-02 6.421908289577733797e-02 5.859151347009031868e-02 7.144260217456041562e-02 1.238549603275218430e-01 2.176314687796250258e-01 2.249811427632284755e-01 1.791190913106874005e-01 9.690123966491947377e-03 1.227694301716497106e-02 2.313543054612445526e-01 3.326199380617376328e-02 4.037814321199770934e-02 1.707044469634159678e-01 1.700727906041966941e-01 3.876852031747995975e-02 3.020891309269245484e-02 2.305959383802456616e-02
8.934424166619530511e-03 9.791732276670801760e-03 2.196948011729690439e-02 2.428975903037238621e-02 1.624726250635382535e-02 1.714802237388050876e-02 9.543256922924432673e-02 8.251526623764805779e-03 1.380370303450309012e-02 2.212718693330655018e-01 6.194898473317161404e-03 1.906573805767257934e-01 3.057124323075240471e-02 5.806843985106047157e-02 5.475415641065367600e-02 8.477591736937950539e-02 1.493154736017807682e-01 1.845970307177092207e-01 1.083983728736533231e-01 2.398812131174717088e-02 1.465535812794972054e-02 1.080076587743565991e-01 1.598203990627627691e-01 2.668884621541436353e-01 2.369645513085891220e-01 3.066973152113602330e-01 2.435945303685699559e-01 7.502848790301960835e-02 4.343928668838929058e-02 2.541409274336885529e-02
1.166865892208262222e-02 1.357527380420169710e-02 1.310051656171286674e-02 1.219618314042930293e-02 1.740036358809632713e-02 2.929618558408551496e-02 3.463208327410439991e-02 1.110851677410063659e-01 5.984071545768542000e-02 1.027704151215793303e-02 8.306764209257798057e-03 1.114612651720292037e-02 2.198278132530522011e-02 3.019767759194442319e-02 4.041278402066213193e-02 7.336568540985607956e-02 1.611262136297060554e-01 1.650598157561842527e-01 7.942346601507231652e-02 2.772464262357005396e-02 1.221015283312495425e-01 2.261174487058280336e-01 2.959916086029287241e-01 3.011028804223759292e-01 2.606522234230732038e-01 2.219372841971967436e-01 3.237994006207974840e-01 5.897987214750340795e-02 5.882026692731850970e-02 3.176519410725908016e-02
2.954478218826849314e-02 2.341159886201255036e-02 1.125594742045956699e-02 1.559458261526530665e-02 1.824133854010682732e-01 1.916149295560105534e-02 8.752583281576790941e-02 7.208958721233375833e-02 7.211505944216405062e-02 3.558634642508941986e-02 1.392215315790930504e-02 4.487341441932257875e-03 5.305394093955160227e-03 1.265784862518604462e-02 2.432335777949807751e-02 9.247781950862411782e-02 1.054995072026185948e-01 1.281013165702741818e-01 2.267940269383561525e-02 3.836053297343404445e-02 1.356890083653849721e-01 3.000139691833533240e-01 3.776702570634523082e-01 3.854561946640859271e-01 3.100526754258346451e-01 2.925794979323944611e-01 2.672932028829033135e-01 2.153683767442235719e-01 2.633220876530879481e-02 2.431465000694591760e-01
1.193311755371658130e-02 3.327516191370847448e-02 5.694267209901136134e-02 1.077088828376645407e-02 1.571747719572617191e-02 2.104441850593382485e-02 5.616105195903214192e-02 7.077454498548792217e-02 4.882437793262866393e-02 4.229895734088631731e-02 1.058862114078233663e-02 5.966683422735867548e-02 9.245371573368539597e-02 2.198005115333610537e-01 1.165882772025645872e-02 4.301435779976495871e-02 2.011224233503546704e-02 2.176568020058193553e-01 6.965795799692081625e-02 1.386446634375127981e-02 5.207941489609338448e-02 2.808785335104614922e-01 3.596952895558447327e-01 3.741249480903931501e-01 2.701907730797793450e-01 1.241200730278194247e-01 2.000320672145737555e-01 1.363218984667284028e-01 3.748696745638196298e-02 1.779947890797943799e-01
2.514612282951074196e-01 1.219189864441416402e-02 2.274410766498907166e-01 6.717076768444330513e-03 1.030227463286029210e-02 5.864451468076609282e-03 2.991018466217841912e-02 3.837100705948804508e-02 3.955320658171745246e-02 1.193160304012788261e-02 1.633067642523033658e-01 4.177918102665829220e-02 7.313805152365354667e-02 1.768905880768237293e-01 1.684688559917451797e-02 6.657882621407659220e-03 1.472021989810570232e-02 1.661942127170695782e-01 8.091305180582314752e-03 3.171114857758383643e-02 1.671782759325657897e-01 3.174739461450621358e-01 3.418275286967196180e-01 3.257677442938054502e-01 2.511173645599913407e-01 1.847586432670819956e-01 1.797667319100592909e-01 1.274162591686175683e-01 3.046976521614774489e-02 1.381916633398327654e-01
1.769913488618726424e-02 2.101148846472335532e-02 9.318025716251317550e-03 7.704249471766339355e-03 8.311055647424955145e-03 4.211530657844204245e-03 2.104081636113014353e-02 1.729979318244125736e-02 4.793038652934300710e-03 1.785380792232737490e-01 7.227273358231504907e-02 6.391876041925409480e-02 3.583461044184219069e-02 1.650187005942971991e-02 3.479207671810759933e-02 9.879219390723502359e-02 7.541378284834058740e-03 1.659196855007231616e-02 1.597406031084661060e-02 6.298575464078653985e-02 1.710529452444579379e-01 2.528736340588891851e-01 1.021234936831390272e-01 1.553912870997642415e-01 1.994809209433800468e-01 1.151296872269410437e-01 9.534543732948055905e-02 8.506087097596264079e-02 7.825804497712009200e-02 8.509221212303327841e-02
9.681508790108461424e-03 1.440108096937981960e-02 1.156052739632009996e-01 1.000308552775980991e-01 9.389076863685667795e-02 1.366919511194598646e-01 1.894422512627091659e-01 4.718857131265462301e-02 6.503527627688315826e-02 1.133407461766584162e-02 1.685468097860892689e-02 2.667858917215699607e-02 2.545768449745174772e-02 7.972373570753252259e-02 1.749047889994440330e-01 4.463580193935888507e-02 6.417387262821297456e-02 9.005069717609308355e-02 6.217035294617265923e-02 4.681687631409975348e-02 3.705414132910742064e-02 1.344031455615415406e-02 1.400072664601539063e-01 1.009521654820282402e-02 3.651046260525520754e-02 1.545814012506636047e-02 1.819690919059298306e-02 1.135888173334290152e-01 1.468884155655581815e-02 1.370600916229703335e-02
2.282370731678316084e-02 2.393350038656373580e-02 1.317750598745098256e-01 7.761677422974845586e-02 1.316018790859775356e-01 1.032759177653547467e-01 1.605179162375427182e-01 1.753727324832083170e-02 1.542784666880055340e-02 6.704672580438696301e-03 1.666795842278369355e-02 3.094324662731362183e-02 3.372849336813730364e-02 1.555572111171083793e-01 1.996395190252612806e-01 2.436726465153255319e-02 6.946173902008871692e-02 1.312151808165509248e-01 1.505880338153975928e-01 1.307747650993938970e-01 3.405175025485434465e-02 2.328489800805582099e-01 1.392760025963940725e-02 2.827849784180173215e-02 5.245006598057647129e-02 1.561699968902358071e-02 1.304499435351371694e-01 5.333941041701969338e-02 1.993456606082053342e-02 1.910858896529121775e-02
2.847597300057592637e-02 2.094034720026164698e-01 7.444978856835442194e-02 3.224912785632865625e-02 4.197528377674331762e-02 9.563239151593910803e-02 1.279496282322267198e-01 1.439381177336160160e-02 7.659939424193254465e-03 8.752953338084425855e-03 1.595723202581309993e-02 2.739459936422924610e-02 2.548697452824898527e-02 1.212530803120237533e-01 1.401976851940215686e-02 3.641509421800644131e-02 5.267768018572211580e-02 1.232471494532778877e-01 1.578010993947484286e-01 1.344961464014758634e-01 9.446469396517409578e-02 1.466017266235237759e-01 1.002225912135555203e-01 1.811040495688027441e-01 7.185739199733495730e-02 3.774926273613254252e-02 2.967008066264670979e-02 9.075700637234611345e-02 1.586386189476086256e-02 1.430872188049318872e-02
1.795604135064632345e-02 8.136126668849044327e-03 1.615149580690966868e-01 1.734958427692547267e-01 8.572682769391342175e-03 3.054059647551018442e-01 1.319226983319878865e-01 5.419644670264743558e-02 7.849245476760617624e-02 1.005518430949706582e-01 9.455307297803810726e-03 1.148138779862746886e-02 1.519096195097513306e-02 2.961441431103392988e-02 1.521999935072397836e-01 2.767090050479032934e-02 1.857410056002101184e-02 4.921413423107694196e-02 5.883148793859268449e-02 6.157644499032137453e-02 6.646750075314658557e-02 1.883466821808132685e-01 3.007366331205620774e-02 5.236470659815176121e-02 2.139490777768988106e-01 7.379058417466534403e-02 6.653679924413680169e-02 5.182578615930234084e-02 1.829285462993497646e-02 1.594004962919663357e-02
5.745330543549004298e-03 1.597625139512200698e-01 2.072198479409323446e-01 1.040127347891598407e-02 2.366788155355190881e-01 1.115847081212213154e-01 5.337532858767676802e-02 3.769931757982401821e-02 1.174864543048692034e-01 6.446846920394092538e-03 3.139285089829063624e-02 1.206537448670521977e-02 1.837560026582555489e-02 3.484480060706821036e-02 1.470901143311805215e-01 2.416889814182144047e-01 1.450543552482961851e-01 6.393949040765019298e-02 9.185586446965712804e-02 1.567726272300730694e-01 2.716066733919379472e-01 6.342245137597848914e-02 3.278665696365862248e-02 1.582789696787547384e-01 3.610510906783331864e-01 1.114593183347948741e-01 4.293401623255435617e-02 5.993514728298467847e-02 1.485906649692779746e-01 2.525149295460285201e-02
5.937574336131955753e-03 7.400858292638087983e-03 2.005888449127440076e-01 1.662035817394089121e-01 1.666294713908653691e-01 6.503509527114692546e-02 4.263517764080298339e-02 4.429933899192172592e-02 4.921076767201323920e-02 1.957352894070341354e-01 5.853981964797714405e-02 6.285698296955212483e-02 5.239253037733616197e-02 5.797504907328807772e-02 1.539455688427869007e-01 1.004089590758035083e-01 6.443308920565506137e-02 3.651993105682914409e-02 3.126073277782181331e-02 2.348499758114061878e-02 1.868585789123599836e-02 2.721240615086563050e-02 4.176705043526728750e-02 9.951665919089228152e-02 1.691093859783905085e-01 7.551525810173484454e-02 1.100239295353180324e-01 7.543745567300667865e-02 7.774537944316411986e-02 5.117335809983029199e-02
6.765730770289149487e-03 5.254443983526103576e-03 2.011370613459565471e-01 3.120849117055031208e-01 2.860482957228237533e-01 1.567669018872404063e-01 5.555000795973928304e-03 4.381315736972733049e-03 6.778683991860472158e-02 4.930702469756755718e-02 1.890697513520411821e-02 4.708110542834939571e-02 1.234178413845462702e-01 1.226446287509515148e-01 3.515770045013387746e-01 2.456635028444431323e-01 7.236230854338428220e-02 7.902954871258736913e-02 3.532212699071932832e-02 1.558610320844555294e-02 1.511249887585597480e-02 2.361902295112593142e-02 3.604603059829989548e-02 1.093560867946542087e-01 1.092041738025610054e-01 2.542639596761650175e-02 2.773760061497070051e-02 3.551355790161096759e-02 1.154340557627081681e-01 2.357725094974125538e-02
9.107961728192903034e-03 9.925468208051282590e-03 2.286746315621111525e-01 1.363130056942862302e-02 1.341187877644270735e-02 2.129771160416070105e-02 1.392763181206030723e-02 1.714120985403338460e-01 6.739470140836489875e-02 3.923562951930185949e-02 1.209016126225093482e-02 1.662655721594235789e-02 1.858207337621917490e-02 6.730536428952596517e-02 7.874208613328316508e-02 3.212756491667950048e-02 2.508546659782628918e-02 2.512023115872143858e-02 3.356904737972569996e-02 1.942519184800162516e-02 1.381369527915010838e-02 2.063485612982104631e-02 2.360854526618974200e-02 3.899216599841547060e-02 1.195918626366752752e-01 1.851659295472010691e-02 2.650108807900603686e-02 4.328761560457419083e-02 5.212490875838379778e-02 1.033700156978303308e-01
5.020083410260453051e-03 1.403724682376989927e-02 4.278368841652835375e-03 4.700336848068809026e-03 1.995324163651917074e-02 2.100684696615578995e-02 1.521278078213536729e-02 1.199171622240494950e-01 9.216120457999089910e-02 8.591419132379417289e-02 3.536313188257172307e-02 1.828036313626566975e-02 1.169466120300738203e-02 1.843914806193183709e-02 8.311937052786076696e-02 2.116499996523595398e-02 5.532074458101945286e-02 1.586910035226144974e-02 2.847536921124574003e-02 7.505104372140880553e-02 1.942481190931346149e-02 2.723224232841951406e-02 2.376475273509762870e-02 2.588382877261537554e-02 3.384019677258005843e-02 2.553988158239556272e-02 2.969500380052479335e-02 3.647084948507814395e-02 4.898424307443435127e-02 1.199598006677696505e-01
