27.8101213168022 27.8118182832476 27.8135134491476 27.8152068144884 27.8168983792568 27.8185881434388 27.8202761070215 27.8219622699908 27.8236466323338 27.8971130192239 27.9747785508509 28.0515074080853 28.1013316125765 28.1013316125765 28.1013316125765 28.1013316125765 28.1013316125765 28.1013316125765 28.1013316125765 28.1013316125765 28.1013316125765 28.1013316125765 28.1013316125765 28.1418331331343 28.2114886096498 28.2802230461548 28.3480379454205 28.2797768801397 28.2104998529462 28.1421414563551
27.6358485064412 27.6375452023519 27.6392400980044 27.6409331933844 27.6426244884791 27.6443139832745 27.6460016777573 27.6476875719142 27.6493716657312 27.7693743223541 27.8955843953766 28.0208580373867 28.1013316125765 28.1013316125765 28.1013316125765 28.1013316125765 28.1013316125765 28.1013316125765 28.1013316125765 28.1013316125765 28.1013316125765 28.1013316125765 28.1013316125765 28.1709031594564 28.2891057619377 28.4063875638878 28.5227500677376 28.4050769425499 28.2872523590846 28.1703461675295
27.4615756593996 27.4632720847811 27.464966710191 27.466659535616 27.4683505610422 27.4700397864563 27.4717272118448 27.4734128371942 27.4750966624912 27.6425722043388 27.8173258283825 27.9911432647759 28.1013316125765 28.1013316125765 28.1013316125765 28.1013316125765 28.1013316125765 28.1013316125765 28.1013316125765 28.1013316125765 28.1013316125765 28.1013316125765 28.1013316125765 28.2008957881026 28.3676445259438 28.5334727027154 28.6967492426792 28.5294584382401 28.3630872891697 28.1976342933333
27.5885335579637 27.6277239243767 27.6260295692038 27.6243370137288 27.6226462579653 27.6209573019272 27.6192701456278 27.6175847890802 27.6159012322984 27.7448369218687 27.8797733848594 28.0156463789876 28.1013316125765 28.1013316125765 28.1013316125765 28.1013316125765 28.1013316125765 28.1013316125765 28.1013316125765 28.1013316125765 28.1013316125765 28.1013316125765 28.1013316125765 28.187221697647 28.3301686211666 28.4740364443405 28.6146928146752 28.4722864167409 28.3289600262944 28.1847151457565
27.7220883861318 27.8019971152826 27.8003030303412 27.798610744811 27.796920258705 27.7952315720377 27.7935446848216 27.7918595970707 27.7901763087987 27.8732213967367 27.9596125897747 28.046940070595 28.1013316125765 28.1013316125765 28.1013316125765 28.1013316125765 28.1013316125765 28.1013316125765 28.1013316125765 28.1013316125765 28.1013316125765 28.1013316125765 28.1013316125765 28.1587875807429 28.2531866500357 28.3485063795283 28.4402114910928 28.3463531386165 28.2515750326363 28.1558786752333
27.8565884264746 27.9762703428487 27.9745765281334 27.9728845125422 27.9711942960886 27.9695058787862 27.9678192606487 27.9661344416892 27.9644514219214 28.0006694209244 28.0385163342526 28.0772992920256 28.1013316125765 28.1013316125765 28.1013316125765 28.1013316125765 28.1013316125765 28.1013316125765 28.1013316125765 28.1013316125765 28.1013316125765 28.1013316125765 28.1013316125765 28.1294309877997 28.1752831933405 28.2220558196436 28.2666495990182 28.2213383014833 28.1751074894354 28.1279586646154
27.9646335230982 28.1013316125765 28.1013316125765 28.1013316125765 28.1013316125765 28.1013316125765 28.1013316125765 28.1013316125765 28.1013316125765 28.1013316125765 28.1013316125765 28.1013316125765 28.0978980060862 28.0900045298138 28.0830423513652 28.0770099695937 28.0827619195999 28.0902723325955 28.0968538544148 28.1013316125765 28.1013316125765 28.1013316125765 28.1013316125765 28.1013316125765 28.1013316125765 28.1013316125765 28.1012432566929 28.0996570590905 28.0989883378565 28.0992355915773
28.0060031199371 28.1013316125765 28.1013316125765 28.1013316125765 28.1013316125765 28.1013316125765 28.1013316125765 28.1013316125765 28.1013316125765 28.1013316125765 28.1013316125765 28.1013316125765 28.0778462149787 28.0214097098359 27.9659042602349 27.9113283653694 27.9484326305823 28.0044865077141 28.0596117351656 28.1013316125765 28.1013316125765 28.1013316125765 28.1013316125765 28.1013316125765 28.1013316125765 28.1013316125765 28.0986870181711 28.0485554828599 27.9993411852483 27.9510426242622
28.0464276706609 28.1013316125765 28.1013316125765 28.1013316125765 28.1013316125765 28.1013316125765 28.1013316125765 28.1013316125765 28.1013316125765 28.1013316125765 28.1013316125765 28.1013316125765 28.0568616572461 27.9518831127687 27.847835381569 27.7447169631805 27.8150320768116 27.9196284284836 28.023296371953 28.1013316125765 28.1013316125765 28.1013316125765 28.1013316125765 28.1013316125765 28.1013316125765 28.1013316125765 28.0952120141809 27.9965361309225 27.8987772467122 27.8019338608162
28.0859074160673 28.1013316125765 28.1013316125765 28.1013316125765 28.1013316125765 28.1013316125765 28.1013316125765 28.1013316125765 28.1013316125765 28.1013316125765 28.1013316125765 28.1013316125765 28.0349445706152 27.8814249760857 27.7288359525875 27.5771759999942 27.6825600215841 27.8356978584537 27.9879075285806 28.1013316125765 28.1013316125765 28.1013316125765 28.1013316125765 28.1013316125765 28.1013316125765 28.1013316125765 28.0908184788811 27.9435992371834 27.7972967558999 27.6519095346371
28.1013316125765 28.1013316125765 28.1013316125765 28.1013316125765 28.1013316125765 28.1013316125765 28.1013316125765 28.1013316125765 28.1013316125765 28.1013316125765 28.1013316125765 28.1013316125765 28.022494889528 27.8433906261741 27.6642860704478 27.4851812226627 27.5921402741192 27.7503382999727 27.9094630354669 28.0281856683935 28.029845771594 28.0315040768637 28.03316058419 28.0348152935593 28.0364682049584 28.0381193183741 28.0267092778428 27.8659017501875 27.7041753267666 27.5415315082488
28.1013316125765 28.1013316125765 28.1013316125765 28.1013316125765 28.1013316125765 28.1013316125765 28.1013316125765 28.1013316125765 28.1013316125765 28.1013316125765 28.1013316125765 28.1013316125765 28.0207750875993 27.8416726715483 27.6625699631389 27.483466962685 27.5519033973772 27.6615579553498 27.7721389817966 27.8539074013906 27.8555672395623 27.8572252800905 27.8588815229622 27.8605359681635 27.8621886156819 27.8638394655038 27.8552711803761 27.7430084648871 27.6298270925461 27.5157285636825
28.1013316125765 28.1013316125765 28.1013316125765 28.1013316125765 28.1013316125765 28.1013316125765 28.1013316125765 28.1013316125765 28.1013316125765 28.1013316125765 28.1013316125765 28.1013316125765 28.0190555783436 27.8399550092811 27.6608541478739 27.4817529944373 27.5107381127341 27.5718501920427 27.6338884986764 27.6796290978604 27.6812886710087 27.6829464468005 27.6846024252225 27.6862566062617 27.6879089899045 27.6895595761381 27.6847514518896 27.6210325591947 27.5563952485449 27.490841019929
28.1013316125765 28.1013316125765 28.1013316125765 28.1013316125765 28.1013316125765 28.1013316125765 28.1013316125765 28.1013316125765 28.1013316125765 28.1013316125765 28.1013316125765 28.1013316125765 28.0173363617464 27.838237639358 27.6591386246393 27.480039317905 27.4686446568653 27.481215246473 27.4947118222746 27.5053507578074 27.5070100659375 27.508667576998 27.5103232909761 27.5119772078578 27.5136293276306 27.5152796502806 27.5151498582603 27.4999737992423 27.4838795611482 27.4668686436275
28.1013316125765 28.1013316125765 28.1013316125765 28.1013316125765 28.1013316125765 28.0736774675941 28.0324780140965 27.9922154048446 27.9584608755235 28.0002119067621 28.0410269973136 28.0809076461414 28.0156174377932 27.8365205617649 27.6574233934206 27.4783259330746 27.4583614274583 27.4583614274583 27.4583614274583 27.4583614274583 27.4583614274583 27.4583614274583 27.4583614274583 27.4583614274583 27.4583614274583 27.4583614274583 27.4583614274583 27.4583614274583 27.4583614274583 27.4583614274583
28.1013316125765 28.1013316125765 28.1013316125765 28.1013316125765 28.1013316125765 28.0408229890377 27.9510858904197 27.8622853920735 27.7883780629034 27.8786669338366 27.968020107611 28.0564390828498 28.0138988064704 27.8348037764876 27.6557084542031 27.4766128399312 27.4583614274583 27.4583614274583 27.4583614274583 27.4583614274583 27.4583614274583 27.4583614274583 27.4583614274583 27.4583614274583 27.4583614274583 27.4583614274583 27.4583614274583 27.4583614274583 27.4583614274583 27.4583614274583
28.1013316125765 28.1013316125765 28.1013316125765 28.1013316125765 28.1013316125765 28.007030070382 27.8687563146674 27.7314189152687 27.6192306531276 27.7580563756889 27.8959466446011 28.0329029581486 28.0121804677633 27.8330872835117 27.6539938069729 27.4749000384615 27.4583614274583 27.4583614274583 27.4583614274583 27.4583614274583 27.4583614274583 27.4583614274583 27.4583614274583 27.4583614274583 27.4583614274583 27.4583614274583 27.4583614274583 27.4583614274583 27.4583614274583 27.4583614274583
28.1013316125765 28.1013316125765 28.1013316125765 28.1013316125765 28.1013316125765 27.9840074754185 27.8126383322037 27.6403324876673 27.500658346792 27.6714770936186 27.8432316376605 28.0159204803453 28.0131211020744 27.8385681579108 27.6630854109573 27.4866743598783 27.4705011570518 27.468837521256 27.4671756813423 27.4648638917493 27.4618258602164 27.459712238035 27.4585215267346 27.4582522278218 27.4583614274583 27.4583614274583 27.4583614274583 27.4583614274583 27.4583614274583 27.4583614274583
28.1013316125765 28.1013316125765 28.1013316125765 28.1013316125765 28.1013316125765 28.016215218362 27.8933844469606 27.7696172181878 27.671385934378 27.7936661148589 27.9168818490513 28.0410316387233 28.0365492395331 27.9105358336898 27.7835928672009 27.6557218383907 27.6447788829417 27.6431155129986 27.6414539386507 27.622784643182 27.5712080256364 27.5205555768307 27.4708257986345 27.4220171928943 27.374128261434 27.3271575060543 27.2884968680407 27.2901422814382 27.2917858991083 27.2934277210383
28.1013316125765 28.1013316125765 28.1013316125765 28.1013316125765 28.1013316125765 28.0493612727469 27.9750678852673 27.8998382843471 27.8411782473529 27.9149208494231 27.9895987617193 28.0652104863491 28.0609086997555 27.9834338442266 27.9050296701785 27.825697675595 27.8190566453394 27.8173935412437 27.8157322324564 27.7797813881148 27.6796671723559 27.5804768847437 27.4822090274865 27.3848621027713 27.2884346127616 27.1929250595987 27.1142164600811 27.1158616105004 27.1175049654797 27.1191465250056
28.1013316125765 28.1013316125765 28.1013316125765 28.1013316125765 28.1013316125765 28.0834453991752 28.057688407978 28.0309954472536 28.0100355243446 28.0352415356864 28.0613826137859 28.0884572610911 28.0861992451264 28.0572619521589 28.0273955827806 27.9966016346357 27.9933344442392 27.9916716059858 27.9900105627535 27.9358543623599 27.7872035359347 27.6394763970796 27.4926714483435 27.3467871922527 27.2018221313107 27.0577747679984 26.9399360156718 26.9415809031185 26.943223995412 26.9448652925389
28.1013316125765 28.1013316125765 28.1013316125765 28.1013316125765 28.1013316125765 28.1013316125765 28.1013316125765 28.1013316125765 28.1013316125765 28.1013316125765 28.1013316125765 28.1013316125765 28.1013316125765 28.1013316125765 28.1013316125765 28.1013316125765 28.0836931424689 28.0661376413184 28.0495067798657 27.9808755693101 27.8198900206664 27.657980444978 27.4951483399838 27.3313952034457 27.1667225331491 27.0011318269015 26.8651269498618 26.863482325383 26.86183949577 26.8601984610369
28.1013316125765 28.1013316125765 28.1013316125765 28.1013316125765 28.1013316125765 28.1013316125765 28.1013316125765 28.1013316125765 28.1013316125765 28.1013316125765 28.1013316125765 28.1013316125765 28.1013316125765 28.1013316125765 28.1013316125765 28.1013316125765 28.0366752091349 27.970583419747 27.9054160290565 27.8232420768859 27.7107948524674 27.5974238415732 27.4831305416026 27.3679164499785 27.2517830641452 27.1347318815711 27.0394074671541 27.0377631056374 27.0361205387002 27.0344797663553
28.1013316125765 28.1013316125765 28.1013316125765 28.1013316125765 28.1013316125765 28.1013316125765 28.1013316125765 28.1013316125765 28.1013316125765 28.1013316125765 28.1013316125765 28.1013316125765 28.1013316125765 28.1013316125765 28.1013316125765 28.1013316125765 27.9887308879724 27.8741037974062 27.7604008645537 27.6665322284362 27.6026223408273 27.5377889072948 27.4720334248981 27.4053573907197 27.3377623018649 27.2692496554617 27.2136880208809 27.2120439223214 27.2104016180544 27.2087611080925
28.1013316125765 28.1013316125765 28.1013316125765 28.1013316125765 28.1013316125765 28.1013316125765 28.1013316125765 28.1013316125765 28.1013316125765 28.1013316125765 28.1013316125765 28.1013316125765 28.1013316125765 28.1013316125765 28.1013316125765 28.1013316125765 27.9398604155174 27.7766990105785 27.6144615223875 27.5107457881809 27.4953722502198 27.4790754068693 27.4618567548492 27.4437177909022 27.4246600117936 27.4046849143117 27.3879686110363 27.3863247754288 27.3846827338266 27.3830424862431
28.1013316125765 28.1013316125765 28.1013316125765 28.1013316125765 28.1013316125765 28.1013316125765 28.1013316125765 28.1013316125765 28.1013316125765 28.1013316125765 28.1013316125765 28.1013316125765 28.1013316125765 28.1013316125765 28.1013316125765 28.1013316125765 27.9233906709444 27.7443129173886 27.5652348729305 27.4583614274583 27.4583614274583 27.4583614274583 27.4583614274583 27.4583614274583 27.4583614274583 27.4583614274583 27.4583614274583 27.4583614274583 27.4583614274583 27.4583614274583
28.1013316125765 28.1013316125765 28.1013316125765 28.1013316125765 28.1013316125765 28.1013316125765 28.1013316125765 28.1013316125765 28.1013316125765 28.1013316125765 28.1013316125765 28.1013316125765 28.1013316125765 28.1013316125765 28.1013316125765 28.10075824776 27.921682628054 27.7426067171458 27.5635305153491 27.4583614274583 27.4583614274583 27.4583614274583 27.4583614274583 27.4583614274583 27.4583614274583 27.4583614274583 27.4583614274583 27.4583614274583 27.4583614274583 27.4583614274583
28.1013316125765 28.1013316125765 28.1013316125765 28.1013316125765 28.1013316125765 28.1013316125765 28.1013316125765 28.1013316125765 28.1013316125765 28.1013316125765 28.1013316125765 28.1013316125765 28.1013316125765 28.1013316125765 28.1013316125765 28.0990486537532 27.9199748763662 27.7409008077907 27.5618264483415 27.4583614274583 27.4583614274583 27.4583614274583 27.4583614274583 27.4583614274583 27.4583614274583 27.4583614274583 27.4583614274583 27.4583614274583 27.4583614274583 27.4583614274583
28.1013316125765 28.1013316125765 28.1013316125765 28.1013316125765 28.1013316125765 28.1013316125765 28.1013316125765 28.1013316125765 28.1013316125765 28.1013316125765 28.1013316125765 28.1013316125765 28.1013316125765 28.1013316125765 28.1013316125765 28.0973393512485 27.9182674158663 27.7391951893102 27.5601226718941 27.4583614274583 27.4583614274583 27.4583614274583 27.4583614274583 27.4583614274583 27.4583614274583 27.4583614274583 27.4583614274583 27.4583614274583 27.4583614274583 27.4583614274583
28.1013316125765 28.1013316125765 28.1013316125765 28.1013316125765 28.1013316125765 28.1013316125765 28.1013316125765 28.1013316125765 28.1013316125765 28.1013316125765 28.1013316125765 28.1013316125765 28.1013316125765 28.1013316125765 28.1013316125765 28.0956303402319 27.9165602465407 27.7374898616898 27.5584191859929 27.4583614274583 27.4583614274583 27.4583614274583 27.4583614274583 27.4583614274583 27.4583614274583 27.4583614274583 27.4583614274583 27.4583614274583 27.4583614274583 27.4583614274583
