27.3495294388572 27.338423746727 27.2394317473705 27.1394961602492 27.0386184880208 26.9893027228767 26.987614759294 26.9859285963247 26.9842442339817 26.9825616722791 26.9808809112299 26.9792019508477 27.0131779139135 27.1157652926341 27.2192869314335 27.3237413274533 27.3495294388572 27.3495294388572 27.3495294388572 27.3495294388572 27.3495294388572 27.3495294388572 27.3495294388572 27.3900309594149 27.4596864359304 27.5284208724355 27.5962357717012 27.7045884456729 27.8144385268693 27.9252075264678
27.3495294388572 27.3434136804799 27.2929669242639 27.2415768255377 27.1892448866187 27.163576883041 27.1618891885582 27.1602032944013 27.1585192005843 27.1568369071202 27.1551564140227 27.1534777213051 27.171281024076 27.2253215489253 27.2802960911926 27.336203148359 27.3495294388572 27.3495294388572 27.3495294388572 27.3495294388572 27.3495294388572 27.3495294388572 27.3495294388572 27.419100985737 27.5373035882183 27.6545853901684 27.7709478940182 27.8315834793393 27.892884153605 27.9551035075656
27.3495294388572 27.349348521737 27.3474460181003 27.3446004171896 27.3408132209829 27.3378510798592 27.3361636544707 27.3344780291213 27.3327942038243 27.3311121785936 27.3294319534423 27.3277535283843 27.3284502703608 27.3339449320757 27.3403733685654 27.3477340776508 27.3495294388572 27.3495294388572 27.3495294388572 27.3495294388572 27.3495294388572 27.3495294388572 27.3495294388572 27.4490936143832 27.6158423522245 27.7816705289961 27.9458273433249 27.9576596581867 27.9704119165018 27.9840826158226
27.3495294388572 27.3495294388572 27.3495294388572 27.3495294388572 27.3495294388572 27.3495294388572 27.3495294388572 27.3495294388572 27.3495294388572 27.3077366386408 27.2652367348743 27.2236712690237 27.2143729871465 27.2574231980825 27.2995398768695 27.3407245253464 27.3495294388572 27.3495294388572 27.3495294388572 27.3495294388572 27.3495294388572 27.3495294388572 27.3495294388572 27.4577140671475 27.6368344703314 27.8159551625298 27.9919885295798 27.9569230169237 27.9227754086768 27.8895442027186
27.3495294388572 27.3495294388572 27.3495294388572 27.3495294388572 27.3495294388572 27.3495294388572 27.3495294388572 27.3495294388572 27.3495294388572 27.2601183693239 27.1690747771291 27.0789653797961 27.0590707552328 27.1506648485902 27.241325652406 27.3310546681796 27.3495294388572 27.3495294388572 27.3495294388572 27.3495294388572 27.3495294388572 27.3495294388572 27.3495294388572 27.4594155728703 27.6385341263947 27.8176529689193 27.9904940358648 27.9068820643962 27.8241877586294 27.7424096167846
27.3495294388572 27.3495294388572 27.3495294388572 27.3495294388572 27.3495294388572 27.3495294388572 27.3495294388572 27.3495294388572 27.3495294388572 27.2115639064264 27.071977615737 26.9333252768729 26.9047016738435 27.0448386596455 27.1840425984961 27.3223149915545 27.3495294388572 27.3495294388572 27.3495294388572 27.3495294388572 27.3495294388572 27.3495294388572 27.3495294388572 27.4611167892782 27.6402334934575 27.8193504866231 27.988080362486 27.8559229224125 27.724682909351 27.5943588218616
27.3495294388572 27.3495294388572 27.3495294388572 27.3495294388572 27.3495294388572 27.3495294388572 27.3495294388572 27.3495294388572 27.3495294388572 27.1719378748163 26.9928270982857 26.8137160283818 26.7785138420589 26.957625497766 27.1367374459029 27.3158496861557 27.3441014207222 27.3382575682498 27.3333408079154 27.3317023858799 27.3380917923733 27.3435550123165 27.3480935469774 27.4606382575967 27.637059444755 27.8144011022283 27.977511391194 27.8016304372154 27.6248299196677 27.4471113402672
27.3495294388572 27.3495294388572 27.3495294388572 27.3495294388572 27.3495294388572 27.3495294388572 27.3495294388572 27.3495294388572 27.3493199908006 27.1702113564598 26.991102428446 26.8119932070732 26.7802348148219 26.9593446219689 27.1384547215319 27.3175651131964 27.3041533857707 27.2497658032513 27.196305071661 27.1687260925779 27.2236594216248 27.2776668048843 27.3307497432836 27.4311380552902 27.5590125101692 27.6878071959465 27.8040925679251 27.6767585373732 27.5485051822228 27.4193340038489
27.3495294388572 27.3495294388572 27.3495294388572 27.3495294388572 27.3495294388572 27.3495294388572 27.3495294388572 27.3495294388572 27.3475919179291 27.1684851317761 26.9893780519649 26.810270678809 26.7819554948548 26.9610634537565 27.1401717050596 27.3192802484497 27.2632765790083 27.1603462560433 27.0583425428165 27.0066755291329 27.1101517910895 27.2127023480032 27.314328700462 27.4007157925362 27.4800445051642 27.5602932092918 27.631592761942 27.5528046647464 27.4730974819047 27.3924727144519
27.3495294388572 27.3495294388572 27.3495294388572 27.3495294388572 27.3495294388572 27.3495294388572 27.3495294388572 27.3495294388572 27.3458641390306 27.1667592007515 26.9876539688281 26.8085484435749 26.7836758821719 26.9627819931424 27.1418883965 27.3209950919307 27.221471237143 27.0699991630805 26.9194534575829 26.8455504596065 26.9975686650822 27.1486614062425 27.2988301833349 27.3693717042724 27.4001556644247 27.4318593766953 27.4600117390777 27.4297685854208 27.3986065850529 27.3665272386692
27.3495294388572 27.3495294388572 27.3495294388572 27.3495294388572 27.3495294388572 27.3495294388572 27.3495294388572 27.3495294388572 27.3449043080538 27.1908142152254 27.0357890052028 26.8798301783221 26.8598132875792 27.0142894703932 27.1696983645926 27.3260384697759 27.2157505921963 27.0575525663428 26.8984278308486 26.8210325096361 26.9786859565057 27.1372652073271 27.2967687615633 27.3495294388572 27.3495294388572 27.3495294388572 27.3481466337517 27.3314933508429 27.3157568777045 27.3009357139684
27.3495294388572 27.3495294388572 27.3495294388572 27.3495294388572 27.3495294388572 27.3495294388572 27.3495294388572 27.3495294388572 27.3453528300381 27.2398047998892 27.1333218958587 27.0259056179425 27.0137478638953 27.1196815468943 27.2265476987524 27.334344819408 27.2559874689383 27.1463329109657 27.0357518845189 26.9837210400978 27.0928308266646 27.2028661764624 27.3138255892949 27.3495294388572 27.3495294388572 27.3495294388572 27.3436106766446 27.2784141660515 27.2141342266157 27.1507693583091
27.3495294388572 27.3495294388572 27.3495294388572 27.3495294388572 27.3495294388572 27.3495294388572 27.3495294388572 27.3495294388572 27.3467377461897 27.2897307896351 27.2317892024934 27.172914484421 27.1667500756203 27.2241422479505 27.2824666466311 27.34172177194 27.2971527535814 27.2360406742728 27.1740023676391 27.1454842034161 27.2060513189391 27.26754375699 27.3299600177131 27.3495294388572 27.3495294388572 27.3495294388572 27.3381566023402 27.2244178531251 27.1115954364718 26.9996878526918
27.3495294388572 27.3495294388572 27.3495294388572 27.3495294388572 27.3495294388572 27.3495294388572 27.3495294388572 27.3495294388572 27.349058817796 27.340591946004 27.3311906869017 27.3208565398057 27.3188201604443 27.3276718109978 27.3374554454108 27.3481695643012 27.3392462094502 27.3266756198425 27.3131790440409 27.3063222354967 27.3183476689814 27.3312981843088 27.3451722819629 27.3495294388572 27.3495294388572 27.3495294388572 27.3317846449504 27.1695046459223 27.0081407408774 26.8476914304683
27.3495294388572 27.3495294388572 27.3495294388572 27.3495294388572 27.3495294388572 27.3495294388572 27.3495294388572 27.3495294388572 27.3495294388572 27.3495294388572 27.3495294388572 27.3495294388572 27.3495294388572 27.3495294388572 27.3495294388572 27.3495294388572 27.3495294388572 27.3495294388572 27.3495294388572 27.3389463260082 27.304090109324 27.2701569370325 27.2371453099442 27.2288657843569 27.2305176402645 27.2321676993365 27.2164179917207 27.0706828376612 26.9240294554711 26.7764593447738
27.3495294388572 27.3495294388572 27.3495294388572 27.3495294388572 27.3495294388572 27.3495294388572 27.3495294388572 27.3495294388572 27.3495294388572 27.3495294388572 27.3495294388572 27.3495294388572 27.3495294388572 27.3495294388572 27.3495294388572 27.3495294388572 27.3495294388572 27.3495294388572 27.3495294388572 27.323656390185 27.2402602037061 27.1577868212566 27.0762347439873 27.0545863129657 27.0562379050135 27.0578877005129 27.0469591801157 26.9497667285009 26.8516562876143 26.7526293567387
27.3495294388572 27.3495294388572 27.3495294388572 27.3495294388572 27.3495294388572 27.3495294388572 27.3495294388572 27.3495294388572 27.3495294388572 27.3495294388572 27.3495294388572 27.3495294388572 27.3495294388572 27.3495294388572 27.3495294388572 27.3495294388572 27.3495294388572 27.3495294388572 27.3495294388572 27.3074419942412 27.1755068262183 27.0444942218796 26.9144026827152 26.8803068050888 26.8819581332822 26.8836076652138 26.8784180893126 26.8297673514708 26.7801988631977 26.7297141234369
27.3416865892138 27.3495294388572 27.3495294388572 27.3495294388572 27.3495294388572 27.3553837010454 27.3631038419581 27.3698875760215 27.3743494084783 27.3660779887039 27.3587420726148 27.3523401619537 27.3495294388572 27.3495294388572 27.3495294388572 27.3495294388572 27.3495294388572 27.3495294388572 27.3495294388572 27.2916068651748 27.1138932704508 26.9352567722238 26.7556988692911 26.7069820471105 26.7076783250749 26.7093275934444 26.7107944852365 26.7106844727488 26.7096569486533 26.7077134115536
27.3072194710831 27.3495294388572 27.3495294388572 27.3495294388572 27.3495294388572 27.3893221128284 27.4455787805522 27.5008992853615 27.5433518622759 27.4865437212016 27.4306708403235 27.3757317217239 27.3495294388572 27.3495294388572 27.3495294388572 27.3495294388572 27.3495294388572 27.3495294388572 27.3495294388572 27.3062597988312 27.1770869003148 27.0469913386336 26.9159746122457 26.845026593016 26.7954868610557 26.746867100864 26.706559253739 26.706559253739 26.706559253739 26.706559253739
27.2736953438377 27.3495294388572 27.3495294388572 27.3495294388572 27.3495294388572 27.4241985412813 27.5289907482382 27.6328470361975 27.7114193352916 27.6060754605386 27.5016666025103 27.3981912636288 27.3495294388572 27.3495294388572 27.3495294388572 27.3495294388572 27.3495294388572 27.3495294388572 27.3495294388572 27.3218370658531 27.2412038754246 27.159648262153 27.0771717241554 26.9821511201969 26.8840730935263 26.7869147991029 26.706559253739 26.706559253739 26.706559253739 26.706559253739
27.2411139668225 27.3495294388572 27.3495294388572 27.3495294388572 27.3495294388572 27.4600127470199 27.6133395058847 27.7657305896509 27.8785520661397 27.7246734450752 27.5717295972823 27.4197190255225 27.3495294388572 27.3495294388572 27.3495294388572 27.3495294388572 27.3495294388572 27.3495294388572 27.3495294388572 27.3383384304085 27.3062439602022 27.2732273074558 27.2392899699478 27.1183558634475 26.9717405296781 26.8260446886522 26.706559253739 26.706559253739 26.706559253739 26.706559253739
27.1517866565398 27.2661643148499 27.2927006063084 27.3182951836884 27.3429495440671 27.479628744989 27.6587106509904 27.8377928514064 27.9681239020283 27.7890411137254 27.609958031951 27.4308746570181 27.3384404133879 27.3188411312941 27.30017068352 27.2824275727613 27.2832487717979 27.2849113442144 27.2865721218967 27.2882311048317 27.2898882930058 27.2915436864062 27.2931972850194 27.1678828648194 27.0048602035219 26.8409177114463 26.706559253739 26.706559253739 26.706559253739 26.706559253739
27.0116870921422 27.1079886257511 27.1830583600641 27.2571866255354 27.3303749189024 27.481358234828 27.6604382970832 27.8395186537383 27.9663999434712 27.7873189989579 27.6082377609868 27.429156229872 27.3112884105048 27.2431535405964 27.1759472629345 27.1096680805542 27.10897089991 27.1106332064949 27.1122937186327 27.1139524363098 27.1156093595134 27.1172644882298 27.1189178224457 27.0301243846685 26.9156407440112 26.8002375120731 26.706559253739 26.706559253739 26.706559253739 26.706559253739
26.8706448702458 26.9507542379323 27.0743564282918 27.1970173950286 27.3187386345403 27.483087429953 27.662165648776 27.8412441619844 27.964676278686 27.7855971776483 27.6065177831666 27.4274380955555 27.2832060352273 27.1665365644973 27.0507954439581 26.9359811769855 26.9346929915352 26.9363550322939 26.9380152788922 26.939673731317 26.9413303895548 26.9429852535925 26.9446383234168 26.8932855622759 26.8273399547789 26.7604749954809 26.706559253739 26.706559253739 26.706559253739 26.706559253739
26.7286602314782 26.794460911045 26.9665945708959 27.1377872523254 27.3080404513911 27.4848163303778 27.6638927060827 27.8429693761586 27.9629529076584 27.7838756497819 27.6047980984762 27.4257202540549 27.2541935251092 27.088990440298 26.92471546364 26.7613670988501 26.760415046679 26.7620768216167 26.7637368026809 26.7653949898585 26.767051383136 26.7687059825003 26.7703587879382 26.75736616288 26.7399576013167 26.7216299274141 26.706559253739 26.706559253739 26.706559253739 26.706559253739
26.706559253739 26.7702497543659 26.9493231066981 27.1283967546434 27.3074706978878 27.4865449361172 27.665619469018 27.8446942962758 27.9612298303745 27.7821544153447 27.6030787069006 27.4240027053551 27.244926411023 27.0658498242179 26.886772945254 26.707695774446 26.706559253739 26.706559253739 26.706559253739 26.706559253739 26.706559253739 26.706559253739 26.706559253739 26.706559253739 26.706559253739 26.706559253739 26.706559253739 26.706559253739 26.706559253739 26.706559253739
26.706559253739 26.7719854352511 26.9510569451507 27.1301287506491 27.3092008514322 27.4882732471859 27.6673459375964 27.8464189223495 27.9595070468192 27.7804334743228 27.6013596084258 27.4222854494423 27.2432109976861 27.0641362534714 26.8850612171121 26.706559253739 26.706559253739 26.706559253739 26.706559253739 26.706559253739 26.706559253739 26.706559253739 26.706559253739 26.706559253739 26.706559253739 26.706559253739 26.706559253739 26.706559253739 26.706559253739 26.706559253739
26.706559253739 26.7737208202231 26.9527904880044 27.1318604513699 27.3109307100054 27.4900012635977 27.669072111832 27.848143254395 27.9577845569787 27.7787128267015 27.5996408030376 27.4205684863019 27.2414958768076 27.0624229748694 26.8833497808006 26.706559253739 26.706559253739 26.706559253739 26.706559253739 26.706559253739 26.706559253739 26.706559253739 26.706559253739 26.706559253739 26.706559253739 26.706559253739 26.706559253739 26.706559253739 26.706559253739 26.706559253739
26.706559253739 26.77273292295 26.9453743245443 27.118954818119 27.2934729080201 27.4689270985694 27.6453158940665 27.8226377987876 27.9295623459177 27.7570789221523 27.5836597059973 27.4093061932156 27.2340198795929 27.0578022609384 26.8806548330844 26.7065471542637 26.7064777775462 26.706559253739 26.706559253739 26.706559253739 26.706559253739 26.706559253739 26.706559253739 26.706559253739 26.706559253739 26.706559253739 26.706559253739 26.706559253739 26.706559253739 26.706559253739
26.706559253739 26.7552548236055 26.8793638901172 27.0044118037418 27.1303970691639 27.2573181910462 27.3851736740269 27.5139620227217 27.5896679591779 27.4657175050798 27.3408315022297 27.2150114460506 27.088258831989 26.9605751555147 26.8319619121201 26.7049966378133 26.6563944347887 26.6087170209099 26.5619629009061 26.5369709208827 26.5386259894372 26.540279265513 26.5419307490969 26.5435804401755 26.545228338736 26.5468744447646 26.5599674450923 26.6050492948487 26.6492156344018 26.6924679592193
