8.837508389565349592e-03 1.307102512714872385e-02 1.144256368954224383e-02 1.451284776774926233e-02 1.107020548148903057e-02 2.434531101643820986e-02 2.420795505516241952e-02 6.568069758789216173e-02 1.194175846803617325e-01 5.353234267046352163e-02 2.463938830174363520e-02 5.578046709640568229e-03 3.257289126341730064e-03 1.216823588014559823e-02 1.415115853127558478e-02 3.099197841003284090e-03 1.079070657585035412e-02 1.864415574818701835e-02 1.663535376806428087e-02 5.777797522408940206e-03 5.172428455799009395e-03 6.393029452050709438e-02 5.010201166571979364e-02 2.158060656089429152e-03 3.699973158661184081e-03 2.893042401064274422e-03 1.357285020526092937e-03 1.270614241462158546e-02 1.237168795191838193e-02 1.558425852878752779e-02
7.060208268910434827e-03 1.565661472110125435e-02 2.817593566100871569e-02 2.308912994775681737e-02 1.611374828169712808e-02 7.221293517527406502e-02 3.433796675151438299e-02 4.346180446328574282e-02 2.840901279713220831e-02 2.418073974089825218e-02 1.689062515757689190e-02 3.253951024919948202e-03 4.285936798557319835e-03 9.821416866952497118e-03 1.374886342712752438e-02 8.812215980401582813e-03 1.076628811064932884e-02 3.472476789762003746e-02 2.578867682103570119e-02 7.642327397602883751e-03 3.069410636352572046e-03 6.078067207188396492e-02 1.773485998730413900e-03 1.304866007000084335e-03 9.370444321372745815e-04 1.230810456425864919e-03 4.828868042347124467e-02 1.284585572712202209e-02 1.868719261730176703e-02 1.870804169835267247e-02
8.609288138131374057e-02 8.704352768331266588e-02 1.840608190172431380e-01 1.498327334848568171e-01 3.177856095214693921e-01 3.236852555605380932e-02 6.016076563152989928e-03 6.469816074970238112e-03 1.042074806161343570e-01 3.181453261162472956e-02 8.452191481118404015e-02 5.519044350183685554e-02 2.004668047832737846e-02 2.944816904518559458e-02 5.662781603127924751e-03 2.383423665771011377e-02 1.580321015258333989e-02 3.183214225011649773e-02 1.041202865878525230e-01 1.704016226741019574e-02 1.739205275046196283e-03 4.971420718336849731e-02 7.917750785035221339e-02 2.779809407690331247e-02 1.655088521616076419e-02 1.107758784837079707e-02 1.007277708194175350e-02 8.084359091187477003e-03 1.381410772148712260e-02 1.550099379988358755e-02
3.999585722455281656e-02 1.140217508029818805e-01 2.503093553809776495e-01 2.022752995525322062e-01 8.242757923163981926e-02 1.273028720427925656e-02 1.006424258602425618e-02 6.791666281678872957e-03 4.175449046909220779e-03 3.928094365042855002e-02 2.511362259619637216e-02 4.911053947686446625e-02 2.200661247484882177e-02 1.465964974955359310e-02 4.316413157827744644e-03 3.275245443811328813e-03 6.766656401240377962e-03 1.249101000830845666e-02 8.719937928663466092e-03 7.335281220848323055e-03 3.358860607431557281e-03 1.253162265466232486e-03 3.544098828616495250e-02 7.080774603045222881e-02 1.363448168360542959e-02 1.010727405306692181e-02 8.727724731352292167e-03 8.291652558622431349e-03 1.685409673142303569e-02 1.832697868546518533e-02
2.299033174642557339e-02 7.106217048731905406e-02 1.984631010550773622e-01 7.692124486180096365e-02 4.360375470305099393e-02 6.354065185428131070e-03 9.747147590453607291e-03 5.435842816041450316e-03 2.537227065014807312e-03 8.911043876621711768e-02 1.120271669318551877e-01 9.380089236144850684e-02 1.370920161925799109e-02 1.333362464346084242e-02 6.306946244244218507e-03 2.369284812367099952e-03 2.049212746187204642e-02 1.167517809345911851e-02 1.858090291372126168e-02 1.056755425197266306e-02 7.190864138090486898e-03 2.009729566801965635e-03 4.901125243935622669e-03 1.483530300379123316e-03 2.470271327398310124e-02 1.351400078212999442e-02 9.406841505296373307e-03 1.089529795035043373e-02 1.706715468713201206e-02 6.284596716087388624e-02
2.281724149238306687e-02 2.381046934486220554e-02 1.067847361917630550e-01 8.556110913599906942e-02 3.372671803026818654e-02 3.625744105205973896e-03 4.437031451205065632e-03 4.767064723647985829e-03 4.506039233630468148e-03 1.371374664148363176e-01 1.079432637406032708e-01 5.605603666900463300e-02 7.808622471936404325e-03 3.143027990591917148e-03 6.065325748189964727e-02 3.523437647290601250e-03 1.293198926301348216e-02 3.023446647967495578e-03 9.738136206075682227e-03 3.342099751150661574e-02 4.008773062458104164e-02 2.476163464580229123e-02 7.201050365644184707e-03 6.700209441963619894e-02 3.701296569287613331e-02 3.535942277080284663e-02 2.203345360383259996e-02 1.521123997454601993e-02 2.007700166453858792e-02 3.617318523922755796e-02
3.166980241948685274e-03 5.011408459476206396e-03 5.298704471640927269e-03 2.686186940105111595e-02 1.286072282728765136e-02 2.140439259858856885e-02 3.258528258684647433e-02 1.863278379780653610e-02 2.226739057892893753e-02 2.603036279147332918e-02 2.011527559934392015e-02 8.224739920752604377e-03 4.354667041453340326e-03 5.233598011847306886e-02 3.087935761006479346e-02 5.354420202636153703e-02 7.371757866151783592e-03 3.167789542072195139e-03 1.615786633180401125e-02 2.205124421414438388e-02 1.001597054282912444e-02 2.861030568198867814e-03 6.581622873421172359e-02 6.338419312465796984e-02 2.562644960651498660e-02 2.625039305629220041e-02 2.296445060981149380e-02 1.984663644924361536e-02 2.217773103261203027e-02 5.292208696570434301e-02
6.838690363416478901e-03 1.257123640493406497e-02 7.354451496784339924e-03 1.585184209900218980e-02 2.437373410620282191e-02 2.746802314605209516e-02 2.435880671653721866e-02 2.298854865672058170e-02 1.833876341685156466e-02 1.031183472346704211e-02 4.162188526473150491e-03 1.287120304561218537e-02 3.590886917585539399e-03 3.449112111876423414e-02 3.948560420622902745e-02 2.374198470455549624e-03 1.478947522365217995e-02 2.171663289350125176e-02 1.908412610060188433e-02 1.440479459097244314e-02 4.855111457340838439e-03 3.540987573783445884e-03 4.723688666754483761e-02 4.083322629417526078e-02 1.950102897972627244e-02 1.958523867135406743e-02 2.903630079096715041e-02 3.370197258331097262e-02 3.272503911302623858e-02 1.552885424492529394e-03
1.800623649993732603e-02 1.191735458025073788e-02 6.980862240442670119e-03 4.057177300470830861e-02 2.630203968991720598e-02 1.113965311559978084e-02 3.574222347220034485e-02 1.602528095639317238e-02 1.351757076880726396e-02 1.340966370781302396e-02 1.201219253754110504e-02 1.560495021387308182e-02 3.569169692863579518e-02 2.545282629940844726e-02 3.792632311729438477e-03 3.283360851968906806e-03 1.312341712924065470e-02 4.012282654296343148e-02 3.954660472105675506e-02 7.741110602228210708e-03 5.256593297265563930e-02 5.479650488366236138e-02 6.014043787176270861e-02 3.992021475736189096e-02 2.336213015883760111e-02 3.209811370419133475e-02 1.650722814372083524e-03 2.870430443410179437e-03 8.443218989965419266e-03 4.257583064935501968e-03
2.973539534660669947e-02 1.954942927935093833e-02 3.104692659672312824e-02 2.920484298295043801e-02 2.553246782704262502e-02 5.046087201671025681e-03 2.322597397002640340e-02 1.051606084648687260e-02 4.462297256299567125e-03 5.484247656988396058e-02 2.310345555875221307e-02 2.230712556909393920e-02 4.729367344801053280e-02 5.123720059305171548e-02 2.436235350881449033e-02 2.679905914722798335e-02 1.442901324654692341e-01 1.497628686117573604e-01 5.980691943385270382e-02 3.382503955231807441e-02 6.840420586007781023e-02 4.328784857820911630e-02 4.912571605671247482e-02 5.331350482374266203e-02 2.953620721558584267e-02 3.535823890771979533e-02 5.950591225638030696e-03 8.529140518424332268e-03 1.081671203541904012e-02 2.801005904785717343e-03
2.469096497149739222e-02 1.306368201742317756e-02 2.899542438470566891e-02 2.483436503681232116e-02 3.132367580075245267e-02 3.604836003296311292e-03 3.659100169919634118e-03 3.518899041162582703e-03 5.425454680639388988e-02 1.342265159804419128e-02 1.842742290970961205e-01 3.054202412895106189e-01 6.333116465242172310e-01 3.126726087143542054e-01 5.766148906247613171e-02 1.136738490915978200e-01 2.120206041317901913e-01 5.847744204723738515e-02 1.384160240417026469e-02 3.681950151463446626e-03 4.668435169989058886e-02 4.180136810264761804e-02 5.209714607839103367e-02 7.032828273511554373e-02 7.383065073856701077e-02 3.997599437890920343e-02 6.272930329251372172e-02 4.767155006202147827e-02 4.359696750038603852e-02 3.212766729807211424e-02
5.667811386812724242e-03 3.298536751855701311e-03 2.375238001738702587e-02 2.346942134746925895e-02 1.815869064925297593e-02 5.243295699279406329e-03 6.600938523052797546e-02 4.667141113823938814e-02 5.672778605117452522e-02 2.613852955694414074e-02 5.532297679589281980e-02 3.666401864367596630e-01 6.597287933125879356e-01 3.402742873133270951e-01 1.219793207447769784e-01 1.372456995334528917e-01 1.515234676825082949e-01 8.910891491832829969e-02 2.180182580684055307e-02 7.651967808118137482e-03 4.441287505278730674e-02 4.529911946387702587e-02 5.135754347396039032e-02 4.919098118923562191e-03 3.558412361105044684e-03 6.111783876085209732e-02 4.936435214828148454e-02 4.551717681280630090e-02 4.983192219592569305e-02 5.435571190666706187e-02
3.376182582925967707e-02 3.780216910026993303e-03 5.510432359491414939e-03 1.696356179096288747e-02 1.106978258629475950e-02 4.396518910634641779e-03 2.680958887680016944e-03 5.990307636832868654e-02 2.450569349088794428e-03 1.267482027727816554e-02 3.913119389206274473e-03 1.168503579089095190e-01 4.927614116431399127e-01 2.092904113959316303e-01 6.517762062837564874e-02 7.481062155477544162e-02 2.759964182306813563e-02 4.046216736503749356e-02 4.599814243998122387e-02 1.917527464123862380e-02 4.206268288667041472e-02 4.586547935594424696e-02 5.538335533943046507e-02 3.214249523967081280e-03 3.347818679787571087e-03 3.637796973620064343e-03 3.292255326739607600e-03 7.676711429981000756e-02 6.491916616090326331e-02 5.418466193968340949e-02
2.966147095245459664e-02 5.473655409102998887e-03 4.714751587292743615e-03 2.927889243135907600e-03 5.097480402677274924e-02 7.057479701620104212e-03 2.369766753405044141e-02 1.893560835535505402e-02 2.500413802226574174e-03 3.516091454971677355e-02 2.890276490428727793e-03 1.909681903565391831e-02 2.255933966354350673e-01 3.008527112027118422e-01 3.162917911475142674e-01 4.212241109080899770e-01 3.790355921744210654e-01 2.465828488016943154e-01 6.750880164298925790e-01 3.171520316734980360e-01 2.836410671143957396e-02 9.425296211051158862e-03 6.952980443334786514e-03 1.596845222569962322e-02 3.290990823381063218e-02 3.097587934295472148e-02 8.954277593068699082e-02 3.325676930365664696e-02 4.662650811635093290e-03 4.744919140726483638e-03
2.858231573369241635e-02 2.714467085229748181e-02 4.134634646730807675e-03 2.310851129313461205e-02 7.199839384591791985e-03 4.269804494908402415e-02 1.482119707136454051e-02 3.918939671079425813e-02 2.710650113374262968e-02 2.817213232260010539e-03 6.053645331197780866e-03 9.411443215453904609e-02 2.003892285011293073e-01 2.518192668795121714e-01 2.251683182358540369e-01 2.693628633678863959e-01 4.600278025289725736e-01 7.972141173871973852e-01 8.137317054789712234e-01 6.406423940402111716e-01 2.741238000345728662e-02 2.867482522393961786e-02 2.566411322960085103e-02 8.096334565976111286e-02 1.172948361286401675e-01 6.039661025373047609e-01 6.055534925455526851e-01 1.208680850678553603e-01 4.761088347481420499e-03 6.977474755667129047e-02
2.743786586477655470e-02 2.869998501364986326e-02 5.607398101174851379e-02 5.789912527375162127e-02 3.797312694629854934e-02 4.582852134824193235e-02 8.064751319450740377e-03 2.101790093853777089e-02 4.349424145446748047e-02 1.563348826107703246e-02 1.625949086188795481e-02 1.437843405206683245e-02 1.123695863558014651e-01 2.265030288409800030e-01 2.102316059454082953e-01 3.206716000086165530e-01 5.560925167423437232e-01 6.774443571820858434e-01 3.923752625463986510e-01 8.577743845131206857e-02 5.187605088772512252e-02 3.590057098840296890e-01 5.277570449443103051e-01 8.903518899939575348e-01 8.432196041821212740e-01 1.109371725058126534e+00 8.936991562193251637e-01 2.535851480213736076e-01 7.592757071571627422e-03 8.109334805048233619e-02
3.584717395019067221e-02 4.040173471087086382e-02 3.788367848342362454e-02 3.437473218036750378e-02 5.019373438655455599e-02 2.535648026396446382e-03 1.237810385752113329e-01 4.076853890843485928e-01 1.989637992505572384e-01 3.414937078899543677e-02 2.541312662509934150e-02 3.990746906515656167e-02 7.931644277784968833e-02 1.171536206043099770e-01 1.550498446230860750e-01 2.786491121710869545e-01 6.015519248184801882e-01 6.063285388309608281e-01 2.874380121142776634e-01 9.904447706354356507e-02 4.315810702145314037e-01 7.910980757246502959e-01 1.025265437372091748e+00 1.058997308771894019e+00 9.401799853379094740e-01 8.216568048008741076e-01 1.228954980614244574e+00 2.127814112137373925e-01 9.083038859036648982e-03 4.069666649096483589e-03
9.023386343483121019e-02 6.985229545822409236e-02 3.362557552600571598e-02 4.732155377770702609e-02 1.453948622962038945e-02 6.164073514356180339e-02 3.319147086554065096e-01 2.719059366973906600e-01 2.672272629452492332e-01 1.335149170846021138e-01 4.882267159589243066e-02 1.319274198091124721e-02 1.297919678028724988e-02 3.357874990178580377e-02 7.633703664727907456e-02 3.535962411821402251e-01 3.715127892145929089e-01 4.324728190676642159e-01 7.534550323322650178e-02 1.335552457639954116e-01 4.792839063215248441e-01 1.048482858493170244e+00 1.306474671022705536e+00 1.362335866263921558e+00 1.134492217613348952e+00 1.113054513345596686e+00 1.053901260168973231e+00 8.272357660970622861e-01 3.645060446123764980e-02 2.378463798031670018e-02
3.607258277414495534e-02 5.846934917089119735e-03 5.883590420571906468e-03 2.421225074735916527e-02 4.940512927734885817e-02 6.763211819999100094e-02 2.132192957932991517e-01 2.662597560549342379e-01 1.821192315969980546e-01 1.415254009323391737e-01 2.966701383819844370e-02 2.914798897717032784e-03 4.468653773464476009e-03 1.276534895712786929e-02 2.809667882684024551e-02 1.671876550205764755e-01 6.356625726398669463e-02 2.021247271180208124e-02 6.762674786908059316e-03 4.918858051526302927e-02 1.887721962520373664e-01 1.012908595013234825e+00 1.290550783853323225e+00 1.360048765026884654e+00 1.003216615358887065e+00 4.727101825753236009e-01 7.790454161606755745e-01 5.292723506816128243e-01 4.747666455438550454e-02 1.847534778286801654e-02
1.670981216569366809e-02 2.121642013090390549e-02 1.322451591830203083e-02 1.636958528022806891e-02 3.824011427912082928e-02 2.186951280607511011e-02 1.120180587876619671e-01 1.440398175418173554e-01 1.319380933798905142e-01 3.111671260350729051e-02 7.826807830016525858e-03 1.661978011755939691e-03 3.081274985880974246e-03 9.200750677855923029e-03 3.685164930739492223e-02 2.431198284922017963e-02 4.410850453497137252e-02 1.294603507847821161e-02 2.419913169093007230e-02 1.148122740948507026e-01 6.216458845478084472e-01 1.180105043689585020e+00 1.269806482676551829e+00 1.216815207831918988e+00 9.467794330201984021e-01 7.038338276625626388e-01 6.907614420718612980e-01 4.613319243574126038e-01 4.133519243635599971e-02 1.454111501324347258e-02
4.435362435045840657e-02 4.009649940551511527e-02 2.054418639446480357e-02 1.472118985383352729e-02 1.898288749945404100e-02 1.009953186344415832e-02 5.693515805247899991e-02 5.042370386106347774e-02 1.401774832882154466e-02 8.019077051284717247e-03 2.815263816235528092e-03 2.211680916293463570e-03 1.350583636175860074e-03 4.815838930947345664e-02 2.080455255548445404e-03 7.030812754603949638e-03 2.498785174556257538e-02 5.649965083324083592e-02 5.396015559815649232e-02 2.399915704252934545e-01 6.549022650698880232e-01 9.456681744772446052e-01 3.834239391322726842e-01 5.819249389102221226e-01 7.631878798583109358e-01 4.384669203702022955e-01 3.304699262319256148e-01 2.763444461765699467e-01 1.282272415306952816e-02 1.210577435510239858e-02
3.601848652966159470e-02 4.094354617941168423e-02 6.005205371008792703e-03 4.140041499437846668e-03 3.385737034500437437e-03 5.002632875168195638e-03 7.239073133872316393e-03 1.860166261972711656e-03 2.524703934348060397e-03 3.430453312489591122e-02 4.740514160470220978e-02 8.650994961813394295e-04 9.090373654001586076e-04 3.394164977217605308e-03 9.963604783830633249e-03 1.304160870438303699e-01 2.486396135218432446e-01 3.566316912209311352e-01 2.415126083303170135e-01 1.803256601363117384e-01 1.269878394113205244e-01 4.508100809664983277e-02 1.738312498880308088e-02 3.816028774662234141e-02 1.402461329700809278e-01 4.795919788892667734e-02 4.430417662653416550e-02 1.987601493101063405e-02 4.657015400407070460e-02 4.382054910782966911e-02
7.558527172706872022e-02 5.758405284955158548e-02 6.152756853296512118e-03 2.654317790818847261e-03 3.903614785379079175e-03 3.018181223217699955e-03 4.861598872548848239e-03 5.040604078367554725e-02 4.722705977652622011e-02 2.062173149464526650e-02 4.810458732931117976e-02 1.029019135952650770e-03 1.160296166361973573e-03 6.631038117353884112e-03 1.154042359158394780e-02 7.604936618701983730e-02 2.766809725831073097e-01 5.116917738909702029e-01 5.747386050521471335e-01 4.945704347185169159e-01 1.046134647248791738e-01 2.322406185774371357e-02 2.880031635796655859e-02 7.186917793988009673e-02 1.615378580732368952e-01 4.805904885347919014e-02 1.831170418206126693e-02 9.839786896959905327e-03 6.418564701282107599e-02 6.232011921207831345e-02
9.394827755338233666e-02 1.186766878697932508e-02 3.238615283941966537e-03 1.067472953633450718e-03 1.222182282090303633e-03 2.654731233913935114e-03 3.603422928594395610e-03 4.099054529599469726e-02 2.341805534500672817e-02 2.692578559622287732e-02 4.676691261091310559e-02 1.063940338051789451e-03 1.018823352138154871e-03 5.601696197949796070e-03 2.107467230673436276e-02 1.074125966964571133e-01 2.070719565169016341e-01 4.735191638048355522e-01 5.928463252360510749e-01 5.007696699578976229e-01 2.502869597637648047e-01 1.443802696391464219e-02 1.030532265892580499e-02 2.264828647385402211e-02 1.313402730818763464e-01 7.982825629259598932e-02 7.178525676503924591e-02 1.874903593126003160e-02 5.119413059814047207e-02 4.670361947522167628e-02
5.158426669497262473e-02 1.586278084212298586e-02 6.120611602017012390e-03 5.767514296514708247e-03 1.299081366551261760e-02 8.798396808531963598e-03 3.654447299779961609e-03 1.498348672479447386e-03 2.267623727618192989e-03 3.145409243309761713e-03 2.834185491498149301e-02 3.280593637161002829e-02 4.207839388359798510e-02 1.427225150783943556e-03 7.551058496950597242e-03 3.266687630039630252e-02 3.282976424571069224e-02 1.396483561817419006e-01 1.786841114506033112e-01 1.546449088952226159e-01 1.314466862921619128e-01 1.714350116170277466e-02 2.672712964223425327e-03 5.297601842693558036e-03 2.354900666677942414e-02 5.961550427134847119e-02 1.601922821314850642e-01 1.023938482074184808e-01 5.702798408929138363e-02 5.011825350594517614e-02
1.843140256975068017e-02 7.269492435369827657e-03 7.740730290437500792e-03 1.319828294883397014e-02 7.311032613348551062e-03 3.239832944468826279e-03 1.457428363474349555e-03 1.001472000752919424e-03 3.130046670954372834e-03 1.240521854853102179e-02 9.976339786860867562e-04 3.141321456762991710e-02 4.638766379851706756e-02 1.476931316669928031e-03 6.108851971560199691e-03 1.160907008732602053e-02 7.985035347350545598e-03 3.962823887464038755e-03 7.162978257526079855e-03 1.478214164269132762e-02 3.147650009935065024e-02 6.664884781935873082e-03 3.129562036691170730e-03 1.354447752439058919e-02 3.319538933450873197e-02 1.193509211569518565e-02 4.136904587569029124e-02 4.914106065697829845e-02 2.705312096549226594e-02 7.121535742885971854e-02
1.868099451087293361e-02 1.489909482621034655e-02 7.245115747801690251e-03 5.358381880654601928e-03 5.049392101413826758e-03 1.872797477798156121e-03 1.214141778671441957e-03 1.219184314930316527e-03 1.329741023767393388e-03 5.580804468264108018e-03 1.695699946711917358e-03 1.859104536556526735e-03 1.700430755303167837e-03 2.138345754869594613e-03 6.004488312657995513e-03 4.482794224061987728e-03 3.141447185653054464e-03 1.949136154212666693e-03 2.764712960621879684e-03 6.739559378543012735e-02 5.495243557165423176e-02 7.447167010877757398e-02 5.524784126895047887e-03 7.693162396710175044e-03 1.582321304651270605e-02 7.745681984597091278e-03 1.253280053242476072e-02 7.419716013061108430e-03 1.101951902614674468e-02 7.208316100764463816e-03
2.537657366156650246e-02 1.314387562528242237e-02 7.450359975382160604e-03 1.025804166585929725e-02 9.140351695190510745e-03 4.912053133704895672e-03 1.646395044448759407e-02 1.221908450045335222e-02 1.781282373533078518e-03 1.430542416139143035e-03 5.095222168691330988e-02 1.446087948891407703e-03 4.048804661369616656e-03 4.448742379671861980e-03 1.353222908900197224e-02 1.089885821383195473e-02 3.583791477614161562e-03 4.429411284385343685e-03 3.232492649962533018e-03 4.478402411093174856e-02 4.418433801124420357e-02 6.526127048772915884e-02 7.791195790860354527e-03 1.147588931058382729e-02 1.135952711653227462e-02 5.989866135520678647e-02 4.670176380022146405e-03 4.779037208458292163e-03 1.224668288394516885e-02 5.255114275167928339e-02
3.413975183863406093e-02 2.935654799442102489e-02 8.891519291788704815e-03 3.062373566613863299e-02 3.611209731473701001e-02 6.758229963665199347e-02 4.460880684986733014e-02 4.970651067925211872e-03 1.768546873390349373e-03 1.133578439606819583e-03 3.416307582163516376e-02 4.011588600340069977e-02 4.281786876389487295e-02 3.232082572954129290e-03 4.409633317181724937e-03 1.843409613603358508e-03 1.823378891267383745e-03 1.957239045997895537e-03 3.550544575752645308e-03 4.291662607187659434e-03 3.972982783725467065e-02 5.765371662043326795e-02 6.046695263929105502e-02 7.771356360466698254e-03 2.064238947002252841e-02 4.489968892787241095e-02 6.583869849455159518e-02 8.950640351810094236e-03 5.456664903574491229e-03 1.092465052342148947e-02
1.867090886248867765e-02 4.611697814931742245e-02 1.382482884726109890e-02 1.493122026446225097e-02 7.327467467494254427e-02 7.747554963126632166e-02 5.134187451387395296e-02 3.508894647998326687e-03 2.469243226368240431e-03 2.473113876375766969e-03 1.439434230784885412e-03 5.377901475813291060e-02 3.071390875270245055e-02 4.462209990254611958e-02 5.004797630133891312e-03 5.452742348144686696e-02 4.798538545987262975e-03 2.603165308840563880e-02 4.857287840174588645e-02 1.373175129992066507e-02 5.617975954872750366e-02 7.794372078543156113e-02 6.484575673833316289e-02 6.313602568484935618e-02 6.013997671197830047e-03 6.441276446731902805e-02 7.574452815118101756e-02 8.166334438609977250e-03 4.687069811530200983e-03 1.149740232640091703e-02
