6.434648900741156696e-01 9.506613366415574973e-01 8.212143730664744901e-01 1.031985424349020519e+00 7.774170034566856291e-01 1.712374508783513605e+00 1.712312092173573053e+00 4.680986417732261984e+00 8.634739663569959589e+00 3.964174029383028319e+00 1.901615330059430509e+00 4.482628017086678907e-01 2.729702599128896456e-01 1.067970236823208907e+00 1.315756026003169765e+00 3.085378444254762709e-01 1.187382850315009009e+00 2.292511739717910668e+00 2.312777863052163152e+00 8.956114300206956536e-01 7.221677484783886047e-01 1.053804973312627707e-01 8.238576047788374879e-02 3.303676937904623800e-01 6.370023263092197130e-01 4.967486675360109905e-01 2.337738617748021108e-01 2.108165164164151062e-02 2.065126834386441998e-02 2.688979598178680569e-02
4.656222115721549426e-01 1.032497249837146747e+00 1.853259060010401083e+00 1.501151365620396527e+00 1.039552344053855215e+00 4.687581162179341732e+00 2.270802560808943493e+00 2.890693867533787209e+00 1.935503301997103520e+00 1.722805435211032021e+00 1.302994410609324749e+00 2.733671442042309163e-01 3.863147887875819642e-01 9.161817234037491486e-01 1.330744918915639285e+00 8.995411457979926029e-01 1.217228571407996229e+00 4.428234587254886279e+00 3.760503925963357474e+00 1.260608409350812531e+00 4.562562211898865128e-01 1.041523922489804299e-01 2.228117066677664238e-01 2.013605158080055135e-01 1.789441798688855001e-01 2.416785695257572253e-01 9.033526110423595323e-02 2.307142127068703696e-02 3.261225846885346807e-02 3.260853076592917787e-02
5.315896933408992275e+00 5.392265958294170325e+00 1.142115377619407468e+01 9.213929459012668133e+00 1.970435974391096678e+01 2.030936279607313821e+00 3.897938205699815195e-01 4.282619651406860406e-01 7.193636004334228673e+00 2.325995883396636987e+00 6.782477188692855208e+00 4.992446767392554108e+00 1.999169580771062549e+00 3.000864692151820723e+00 5.882941604875709940e-01 2.566918765298412897e+00 1.881932883411977731e+00 4.326545453614629722e+00 1.637743579252595083e+01 3.068917655670340139e+00 3.010289069899811376e-01 8.982679822918393509e-02 1.414525904561431680e-01 5.140827418250439040e-02 3.157752365786035964e-02 2.165073729441133188e-02 2.121352413338118206e-02 1.580996547355857651e-02 2.548185230403655910e-02 2.753039151015975600e-02
2.545107402819183573e+00 7.264328428437277552e+00 1.595350376209971088e+01 1.277867075612582681e+01 5.298409222939967300e+00 8.235087035573456227e-01 6.652533056189127159e-01 4.505095195719387435e-01 2.816866367063498577e-01 2.757808894287266277e+00 1.875332305703647950e+00 4.027187863319613648e+00 1.953944972789137147e+00 1.360801280666250168e+00 4.175909114473878581e-01 3.342970678743014123e-01 7.551560463964560599e-01 1.548899373146550573e+00 1.223599490888054309e+00 1.154115565992686721e+00 5.483151070451843800e-01 1.954838132305201648e-01 6.366122847684467512e-02 1.283098594538508719e-01 2.484354290536092483e-02 1.916530194741842413e-02 1.799937361672208566e-02 1.588275356590296283e-02 2.972886002186514443e-02 3.087164208546177777e-02
1.529622760757599398e+00 4.767858164774997576e+00 1.326739159697968873e+01 5.136027511386401123e+00 2.964059217690194092e+00 4.305787261940977606e-01 6.589077953374585794e-01 3.667582173053716699e-01 1.694070667211822201e-01 6.075666991578021481e+00 7.816728378645511732e+00 6.949443321229546555e+00 1.077214338917001246e+00 9.455855233437704399e-01 4.684802660610581926e-01 1.836630884201277125e-01 2.101944266880321877e+00 1.292758123653274804e+00 2.251495543386403231e+00 1.387276929421341620e+00 1.012546030753634474e+00 2.987470075823169813e-01 6.947511223037479144e-01 1.989534845493785564e-01 4.163288762612774724e-02 2.398093582014592870e-02 1.795013904979743391e-02 1.944588418879393196e-02 2.810276516638278432e-02 9.905317263954566132e-02
1.600321722980009742e+00 1.705462826146683764e+00 7.630663313011532445e+00 6.095485827154764280e+00 2.419009270215917606e+00 2.558239376722697411e-01 3.057515768242843324e-01 3.225858947312863489e-01 2.971469984522353558e-01 9.059731080400290182e+00 7.119588844646130177e+00 3.782911278526880139e+00 4.437152892029037621e-01 1.426386464266952703e-01 1.145273190243618067e-01 1.970285202134454683e-01 1.079991209870800883e+00 2.949053946121638625e-01 1.010036074510052506e+00 3.677340366965788032e+00 4.786372480699646381e+00 3.045827992672288875e+00 8.139309787409085839e-01 1.106833756545839015e-01 5.833127172492764967e-02 5.941354333544800886e-02 3.966358866927278959e-02 2.566294919869124141e-02 3.127358751289033290e-02 5.415995966807160555e-02
2.296976519603549927e-01 3.749618225386068260e-01 3.961550384667906211e-01 2.007493429225616577e+00 9.612631391990911212e-01 1.566505899035663063e+00 2.309646282825424723e+00 1.285211762691588211e+00 1.493850295501069292e+00 1.720788992024011144e+00 1.304737898040544186e+00 5.275887141690718263e-01 2.199464395450404508e-01 9.068296726593301493e-02 5.012554744242433968e-02 9.317886018750103083e-02 5.664236546618399704e-01 2.764818342037184129e-01 1.462781162537128310e+00 2.085448349357780451e+00 1.030236255956374247e+00 2.654132029662631398e-01 1.121082081825014454e-01 9.350506439576512785e-02 3.750600386177883883e-02 4.208792433648871067e-02 3.977936094493467190e-02 3.244897934639017628e-02 3.493678675611495282e-02 8.015692833029705588e-02
4.941120763628089607e-01 9.331330942718827348e-01 5.468661343637247763e-01 1.181651493464691116e+00 1.814383719309162091e+00 2.019271133637155824e+00 1.764261658580089431e+00 1.648433158621930961e+00 1.315756316412384663e+00 7.260481596258380188e-01 2.879690061850178617e-01 8.792936953844527892e-01 1.885056762743066994e-01 6.443893295995081760e-02 6.797403228840981360e-02 1.293231266525339263e-01 1.109789993313892609e+00 1.847204099235672414e+00 1.696183933771261199e+00 1.269053175083546758e+00 3.715855648403931788e-01 1.870559626944381937e-01 6.743555368411381645e-02 5.566018700305715161e-02 2.794017765774484824e-02 3.149449525877829476e-02 5.188844813843795922e-02 6.159609678713329206e-02 5.832304655113797198e-02 1.643918119944612344e-01
1.327601913345306972e+00 8.832612242541895142e-01 5.189755296949940533e-01 3.031079089021622597e+00 1.986158035956794077e+00 8.372695462057778704e-01 2.681283444676038297e+00 1.201945744073322331e+00 1.015690612033401719e+00 9.885592755372525353e-01 8.745338944679212911e-01 1.150828325045511358e+00 2.512398587860237509e+00 1.646660050784134910e+00 2.470565106550905998e-01 2.281600221649918436e-01 1.026893871483610443e+00 3.262666899847114887e+00 3.386216380941783122e+00 5.994696119044292670e-01 1.010217171310068413e-01 8.309989476810268616e-02 8.354437728891454806e-02 5.388132030053804922e-02 3.279820273177659617e-02 5.350446835608640983e-02 2.125635072419442273e-01 4.055630572491491503e-01 1.113025371646413797e+00 5.245317331247536519e-01
2.209363345557391334e+00 1.454682434233030230e+00 2.373526162477507029e+00 2.243699578038360176e+00 1.996724134558717889e+00 3.932790908002676278e-01 1.814819864224443080e+00 7.746929208259285549e-01 3.300204524834271513e-01 1.234373967092223245e-01 1.813541617595862299e+00 1.783036706392786996e+00 3.747588682668444804e+00 3.924737971401535130e+00 1.821452670738036961e+00 1.945456653652580137e+00 1.074258292298878814e+01 1.167258677822353974e+01 4.970491064791725755e+00 2.369717106245819771e+00 1.241671752409161666e-01 6.253807940994732251e-02 6.794127562137033949e-02 7.423337512743595490e-02 4.212948963536276847e-02 5.702702921240992984e-02 5.634644561629892356e-01 9.216776856167318011e-01 1.091517848525180412e+00 2.723062842782503767e-01
1.842609353238049863e+00 9.687629141276665745e-01 2.235402483264528062e+00 1.955046216434177309e+00 2.530964426584678684e+00 2.330347039436142520e-01 1.962183998472367130e-01 1.722635650177130329e-01 1.100050268753499372e-01 9.870445444968849458e-01 1.548125814848791038e+01 2.594557097425503400e+01 5.262881355893157576e+01 2.469610949537879918e+01 4.347293981517197814e+00 8.099072091790688432e+00 1.529547158035991927e+01 4.392536945016376038e+00 1.102432109332308618e+00 2.334463190033637670e-01 8.329230232305416537e-02 6.065286714929193218e-02 7.552652138627283240e-02 1.057644789361277121e-01 1.143900035645502300e-01 6.414342504610906492e-02 1.055378199959192687e-01 8.121024896898618173e-02 6.957799121071520099e-02 4.747450099424280895e-02
3.514914926035459519e-01 2.077781023643337777e-01 1.866019475133075645e+00 1.870172729741115702e+00 1.482001371717990068e+00 3.448604328640328953e-01 1.364562286604570907e-01 8.960647521007429617e-02 1.139201665060459723e-01 2.093132161275705450e+00 4.973037653024608318e+00 3.197866874770046763e+01 5.555266107573149270e+01 2.744450658991675596e+01 9.482228428832833345e+00 1.019588660132381008e+01 1.122228947850176795e+01 6.704461397032414283e+00 1.685393403189182626e+00 4.898802725252714430e-01 7.434499846249442712e-02 6.771376269186164809e-02 7.873210759041618378e-02 1.415370808291486759e-01 1.364287361941718402e-01 9.902966417899482232e-02 7.736757965515128621e-02 6.774510401677609484e-02 6.987150257066035430e-02 7.186600454704220042e-02
6.952516019250440382e-02 1.800078866007059908e-01 4.420573754558590474e-01 1.267983095945554473e+00 8.381816243316544401e-01 2.716065564747643379e-01 1.435884592698195017e-01 1.247371474437236061e-01 1.641302393230264778e-01 1.141916771021599164e+00 3.649114245305982163e-01 1.066748198976085860e+01 4.291588243336187247e+01 1.740165508119881821e+01 5.217769368739198832e+00 5.753081849896218181e+00 2.073911834106356267e+00 2.998203376212352111e+00 3.383085153508092802e+00 1.270405622986003014e+00 8.642800807907202731e-02 7.863946209017988465e-02 9.610123258397640367e-02 1.651665219593743961e-01 2.168141990065922398e-01 2.056496075598637785e-01 1.538174763124242894e-01 1.351999186049621937e-01 1.002538868769713293e-01 7.569991752341244384e-02
5.671412535656085441e-02 1.636102721779642832e-01 2.973146763586999586e-01 2.173877335039065550e-01 1.292674204875201571e-01 5.261656880125671343e-01 1.922250778029201967e+00 1.783255706789207640e+00 2.514292879728912133e-01 7.476743718542952499e-02 2.860944114507738556e-01 1.814496921419237907e+00 2.027357415342060420e+01 2.584349180654415790e+01 2.620086216835909454e+01 3.375245476336606032e+01 2.900917364342787863e+01 1.801982615284823197e+01 4.740108805422371319e+01 2.161469318369141490e+01 1.798644774114670053e+00 5.268196018165501870e-01 3.987434778748150110e-01 9.951596701261676836e-01 2.277088730029467545e+00 2.128232787821188410e+00 5.878624626658917052e+00 1.899092518296932708e+00 1.505555622921037340e-01 1.454910062295333706e-01
5.206682601976411751e-02 5.270783976545284633e-02 1.453637645309113768e-01 1.091987044393359252e+00 3.991780163622988264e-01 9.610252253076043139e-02 1.311284212744345812e+00 4.037332663833280044e+00 2.918033594312902324e+00 2.990257757065067912e-01 6.259636152269772991e-01 9.658469377280539447e+00 1.958975262755011926e+01 2.314109002859821373e+01 1.961193699679888880e+01 2.234504073920924938e+01 3.572414966965661876e+01 5.810908091463785752e+01 5.624811451877278756e+01 4.305415529228537252e+01 1.839437468887133553e+00 1.928839854615540528e+00 1.712899574089626231e+00 5.232966181962038554e+00 7.281638320930126973e+00 3.667046416065426939e+01 3.667829476230414798e+01 7.401947070283593888e+00 1.652789494500750689e-01 9.963945631515139234e-02
4.519375787591156657e-02 5.007441153499381931e-02 1.169197220034976781e-01 1.313590159940980495e-01 8.875327770916174863e-02 1.028097321971250533e-01 7.414281175444354943e-01 2.156437678806567337e+00 4.658190958425256767e+00 1.727389539747075542e+00 1.827312460546491435e+00 1.620550237558560980e+00 1.220203438752642811e+01 2.273406454758463369e+01 1.964861567746865845e+01 2.798199064262141533e+01 4.447065478675961714e+01 5.013775825236445627e+01 2.731219335183591568e+01 5.744039272317509770e+00 3.419296443896054694e+00 2.331989991135574414e+01 3.372040885197679927e+01 5.425484464937430573e+01 4.865600832730919478e+01 6.196740472469184624e+01 4.949501474519976085e+01 1.432652730375734684e+01 2.475751026816297995e-01 1.121126057989624558e-01
5.382646100731570266e-02 6.382411938301045529e-02 6.538707082709248330e-02 6.490400194920389887e-02 1.028827797850303954e-01 2.169152171457181533e-01 1.265459221501355458e+01 4.282476528196291099e+01 2.148455935125880245e+01 3.879027561628115350e+00 3.055931119325257406e+00 5.049246557219616349e+00 9.774094124572133779e+00 1.301345656797474426e+01 1.562022978064199563e+01 2.563940788578917562e+01 4.971615148864665912e+01 4.593350686036868069e+01 2.029399603842496447e+01 6.635049806701736941e+00 2.798080653087951930e+01 4.968867082287127346e+01 6.269441060716395953e+01 6.082616244983580600e+01 5.094002433731682089e+01 4.296204123614411685e+01 6.337116072369168052e+01 1.116134815127788826e+01 3.573454439144038708e-01 1.505770596204697442e-01
1.289235742546370189e-01 1.040676428199975023e-01 5.680680867694286318e-02 9.495060253164855357e-02 1.322547099492974665e+00 6.731386319967297638e+00 3.707582831047469796e+01 3.038239757778999461e+01 3.074383726133510919e+01 1.624704023017542198e+01 6.374220527322842500e+00 1.873398219601800418e+00 1.807343739653016090e+00 4.130601841302551591e+00 8.317534872212270614e+00 3.468744880894563209e+01 3.217264999394676295e+01 3.386913411198989365e+01 5.412051616042168334e+00 8.982831518672464099e+00 3.074193424572963806e+01 6.442143306716376117e+01 7.758321147270281415e+01 7.515944067793671479e+01 5.881840532088206430e+01 5.539962713654328752e+01 5.147898939922284001e+01 4.081245614091186980e+01 1.810619732563200079e+00 1.196795865609799669e+00
5.808023079951252221e-02 1.661500654650792941e-01 3.253956005548875319e-01 2.440539499615676622e+00 5.968287785696732684e+00 8.667388342488958841e+00 2.741765726307131956e+01 3.470245924984993735e+01 2.459450709441600225e+01 1.951679631701217943e+01 4.239207298981420458e+00 4.340639045890098968e-01 6.356715385820753683e-01 1.602130368656706327e+00 3.129669177614332831e+00 1.683706073565672057e+01 5.704760871190091009e+00 1.643942890043163629e+00 5.009234266752865539e-01 3.375235592798568440e+00 1.218683882139951180e+01 6.174574676785767480e+01 7.504349125666715281e+01 7.351723009530515185e+01 5.073397811559755866e+01 2.264137180586488896e+01 3.601282060396508200e+01 2.471311609858552316e+01 2.227241081550290325e+00 8.806143912466342094e-01
1.492803898241006344e+00 2.035178243897896699e+00 1.474675508358592513e+00 2.012861014979747676e+00 5.302948535672027397e+00 3.197255748480261950e+00 1.693604116556500117e+01 2.255430135920575907e+01 2.156476253680590105e+01 4.999395652464043494e+00 1.243955099209547388e+00 2.619595945203178067e-01 4.338433185719784979e-01 1.153829023521997676e+00 4.149184324580096117e+00 2.549835661212727089e+00 4.172101746512772991e+00 1.114258814244691642e+00 1.893876766715524740e+00 8.203744399054359704e+00 4.117408309543466771e+01 7.330409763388239242e+01 7.456339519826020990e+01 6.588801249674797589e+01 4.723977291987785065e+01 3.276293631713271282e+01 3.069148419341229683e+01 2.067801355000040431e+01 1.862361339958989115e+00 6.638030596387103355e-01
4.404540348547293149e+00 4.370217308693780112e+00 2.493310578223380425e+00 2.019289240199424906e+00 2.998912305895508723e+00 1.726300451594816820e+00 1.034336676335787786e+01 9.745902571070894638e+00 2.804540891528663593e+00 1.431758974477137736e+00 4.670115743387526774e-01 3.539592821122165556e-01 1.990877045552127966e-01 1.020249489637939933e-01 2.449086916487711318e-01 7.612096042217644243e-01 2.457050044677402845e+00 5.102865562522525877e+00 4.491932273542125209e+00 1.838977971066808692e+01 4.608005261798206220e+01 6.192990013515709791e+01 2.359080448230513838e+01 3.225183779763273861e+01 3.806398361402367669e+01 2.000827998656012596e+01 1.426506908690121556e+01 1.172054969017793447e+01 4.299661872850698008e-01 3.890872128796096230e-01
3.768147702181508851e+00 4.721549297393391242e+00 7.764136517271587046e-01 6.079873140547390475e-01 5.727597163962907523e-01 9.241533759460642816e-01 1.399550269393923241e+00 3.727594106516305406e-01 5.075173960460155342e-01 7.440370439743432263e-02 9.170109975415888237e-02 1.320557841019682765e-01 1.379712297221525885e-01 4.604568407202939695e-01 1.206251594098055380e+00 1.439295045771524073e+01 2.503355573202208717e+01 3.330361014090933480e+01 2.102986568038032544e+01 1.459369948822951457e+01 9.371462772818413001e+00 3.067067735702413422e+00 1.093601724549969845e+00 2.126122663548402958e+00 6.971981994493462231e+00 2.167066261283250306e+00 1.890317187532511323e+00 6.375308187109063329e-01 7.236690204191431608e-02 5.915560620106596196e-02
8.639494713175857044e+00 7.203521557126729036e+00 8.396753043711927544e-01 3.997203323694897281e-01 6.586997432682935028e-01 5.485101764738732344e-01 8.904264296401153134e-01 1.005536387902524198e-01 8.827832095783642863e-02 3.617741910038366204e-02 8.144293111554377906e-02 1.465458976737396002e-01 1.844044392389612430e-01 9.306760880049063100e-01 1.425280776739996424e+00 8.290058195154973220e+00 2.769901132857946280e+01 4.767482216010242269e+01 5.011206375084759657e+01 4.004147222656266791e+01 7.679189193788033663e+00 1.554905635635983607e+00 1.755209993505732147e+00 3.954271545548511124e+00 8.179975777589955754e+00 2.257996893839829156e+00 8.257348341287342741e-01 3.072997825778491232e-01 9.531122789911183890e-02 8.509338913684119654e-02
1.207028275029576747e+01 1.638749171152112272e+00 4.705443091387493393e-01 1.642514581803652396e-01 2.055803493022906048e-01 4.742342942436389985e-01 6.365202020382950687e-01 7.448235120510431073e-02 4.244268591760943371e-02 4.674863755768363799e-02 7.911580720666533395e-02 1.292813339448454224e-01 1.384717778447199232e-01 7.175234669989029035e-01 2.613995395135494171e+00 1.178740398300683978e+01 2.104638117693247068e+01 4.511486889513871290e+01 5.316926714288586453e+01 4.151050219180545042e+01 1.854141464792056482e+01 9.645187799670899009e-01 6.215977758077718685e-01 1.269542003967203403e+00 6.993001522433206496e+00 4.016751302348339436e+00 3.494078223231849023e+00 6.427301601020426469e-01 9.106463791768103222e-02 6.794898038209323810e-02
7.494411656103546093e+00 2.427092248545448250e+00 9.616207397543027335e-01 9.157291164418103202e-01 2.209241969941452943e+00 1.579294330587836859e+00 6.752475746029573678e-01 2.869959635190344471e-01 4.411327874080818723e-01 5.490677335427229799e-01 4.909657409406895101e-02 5.330395911748452009e-02 7.865938417299844776e-02 1.664779493197227622e-01 9.431694049570122917e-01 3.615387115495380499e+00 3.422441014938240933e+00 1.388199431906676651e+01 1.701087486117697978e+01 1.357847559617656330e+01 1.013609825161225331e+01 1.179598727869962893e+00 1.657854441286811809e-01 3.142005810405629207e-01 1.371218770950516808e+00 3.380986961084349929e+00 8.922581866753901636e+00 4.854407566940860619e+00 1.173712388148969443e-01 8.529021145240540946e-02
2.727291748251974290e+00 1.130216385382846411e+00 1.229489492729357591e+00 2.105257980018342412e+00 1.246020313874191654e+00 5.827783951219852598e-01 2.764288156251210604e-01 2.013573325465410346e-01 6.529191921713701774e-01 2.416383735271571354e+00 1.579420315445893563e-01 5.254860328749888509e-02 8.411447373837950547e-02 1.723820373555963181e-01 7.670381745315041355e-01 1.295093980212448370e+00 8.480612692749723847e-01 4.039314387235307668e-01 6.168314262140798254e-01 1.062354669268800844e+00 1.719697936284679152e+00 3.611992020723167607e-01 1.733519689751723825e-01 8.650905879593316916e-01 2.081866133770311933e+00 7.301694945314847196e-01 2.475530554620837709e+00 2.672937426288219065e+00 9.219186132637162689e-01 1.364749631361943383e-01
2.766122481520458365e+00 2.319837687480859056e+00 1.150335555567837620e+00 8.578888420151234984e-01 8.656043940033382178e-01 3.389249927610817892e-01 2.309449273066513930e-01 2.453106818191000960e-01 2.772179081994112781e-01 1.057522951540978751e+00 2.864862405572651260e-01 2.622821642940693643e-01 2.342949818234606463e-01 2.728750295389539282e-01 7.432131273101514335e-01 4.933089676783989908e-01 3.302978470697384705e-01 1.970986400254711168e-01 1.738200495245957045e-01 1.311884517636222602e-01 9.982669316592918118e-02 1.399398543273485118e-01 2.143928002885486239e-01 5.235727568982113667e-01 9.023919112768641337e-01 4.256352358036654682e-01 6.664228549163727644e-01 4.280829367764515947e-01 4.197756483469060051e-01 2.635280730822766593e-01
3.749375973964526043e+00 2.043669630626931077e+00 1.182113429102205293e+00 1.646386935122596373e+00 1.568395836522874065e+00 8.875857241732739711e-01 3.127315792720015697e+00 2.459552636804279491e+00 3.729561166222868929e-01 2.585218877855754438e-01 8.844577778281254021e-02 1.955503036050165178e-01 5.494018051744891107e-01 5.713134318354227137e-01 1.673662688402944854e+00 1.200059951552756576e+00 3.769666475075219014e-01 4.474348584206882529e-01 2.077106117964140075e-01 8.981222822261264449e-02 7.967567348742900235e-02 1.188427790399007034e-01 1.807374505532176323e-01 5.508172331533282007e-01 5.538968846861660467e-01 1.302908746601935952e-01 1.426434851201775489e-01 1.794085083562394767e-01 5.729433273965450768e-01 1.163656241294105526e-01
5.032332122115487749e+00 4.554703435672603717e+00 1.397806521047017414e+00 4.899577555830822995e+00 6.160593970634680616e+00 1.208585343877974871e+01 8.395033607521398267e+00 9.914585295504974027e-01 3.667647589597121671e-01 2.026439885530503804e-01 5.745184762135342738e-02 6.916376569959514775e-02 8.213429549550467501e-02 3.122259964592897230e-01 3.745275647881343706e-01 1.627931584392464937e-01 1.585077211973826006e-01 1.928418403615789756e-01 2.647472083582306790e-01 1.423621463761851058e-01 7.696421639903607004e-02 1.040805007388021786e-01 1.164173442822791227e-01 1.917685792742558903e-01 5.892456292114256478e-01 9.100871830619636227e-02 1.295943416240249724e-01 2.116087264687680491e-01 2.536914129840568966e-01 5.023036799902003136e-01
2.689838860109017737e+00 7.073896433472658174e+00 2.120325943962602988e+00 2.386969855034469123e+00 1.248237955010169209e+01 1.364325535945328838e+01 9.362969506449189794e+00 6.657557775412732415e-01 4.785810150121482254e-01 4.331356351051709463e-01 1.708830174928134271e-01 8.165065120326985004e-02 5.013477088890484767e-02 8.422723423862669978e-02 3.898753209739073133e-01 1.104035211782182085e-01 3.869277181940121713e-01 2.310129652333844152e+00 4.043781763415569941e+00 5.496774926849959941e-01 1.065984170513233215e-01 1.346076235796330178e-01 1.142539277371562162e-01 1.240615082990702694e-01 1.625720945245319737e-01 1.228966029337036359e-01 1.427276852373514648e-01 1.753059527173919663e-01 2.356450715435801924e-01 5.768970642121039605e-01
