8.726917040591067667e-03 1.273347155499576604e-02 1.111916794561943443e-02 1.406853680636135917e-02 1.070404313040037268e-02 2.349585006222057113e-02 2.333247353942864005e-02 6.322512228229885956e-02 1.148286764297000995e-01 5.204822539173625112e-02 2.440513405977853822e-02 5.659223236123476358e-03 3.358238528308910009e-03 1.246854893944638297e-02 1.440907819809056009e-02 3.135922842153728018e-03 1.095005753587007316e-02 1.903321403653002522e-02 1.709224031404700528e-02 5.966238743815476669e-03 5.458776808622501676e-03 8.563242737471120358e-02 6.757434268267878408e-02 2.993826201351836459e-03 4.804258229807041938e-03 4.072312690226313411e-03 1.775521329072845822e-01 1.583017344036520904e-02 1.476623055276440021e-02 1.803554100837711366e-02
6.859022646987844585e-03 1.518699666262090381e-02 2.728941875851991286e-02 2.232398036573792280e-02 1.555474385640220891e-02 6.956228717937573691e-02 3.299711955766693183e-02 4.164773264579239159e-02 2.716046276546611390e-02 2.315426530415874012e-02 1.649888894646488885e-02 3.297600569372470970e-03 4.465600268432672049e-03 1.014104720224022482e-02 1.405806170316883236e-02 8.919573790245674538e-03 1.092177050453059517e-02 3.543676159610625181e-02 2.648090122316088327e-02 7.881340061647819362e-03 3.255192026459955822e-03 8.130222681556256714e-02 1.756108307829827575e-01 1.459117034388552059e-01 1.242997684309914697e-01 1.722415572138034368e-01 6.005664266405236901e-02 1.557722671617621513e-02 2.185019537283468608e-02 2.147079755645073945e-02
8.390884626423730785e-02 8.602708175622401920e-02 1.818491699856722432e-01 1.479613047274468685e-01 3.137787785960325371e-01 3.189389598316647034e-02 5.907907450094907094e-03 6.330242227254081686e-03 1.016456549490311473e-01 3.059960198659711708e-02 8.209954028498954448e-02 5.597970084369102706e-02 2.112508987202093083e-02 3.064158841480739068e-02 5.817088097211995171e-03 2.413564631387270232e-02 1.602697948693414254e-02 3.247480806809321247e-02 1.068391189419503756e-01 1.754574440263612090e-02 2.053314060304530127e-03 6.729460644567268612e-02 1.083034299994506955e-01 3.591128807551483004e-02 2.126335081487811321e-02 1.438643944953637253e-02 1.184208460302074370e-02 9.294586108382721715e-03 1.580408433972258636e-02 1.764229866515127504e-02
3.910942860198371451e-02 1.130626662673683974e-01 2.481743339102352175e-01 2.005141134098790412e-01 8.173992064244189892e-02 1.259968222292305942e-02 9.929130967438571514e-03 6.903585750444667622e-03 4.224320104392824404e-03 3.915581503451687900e-02 2.451039055581102910e-02 4.988690172020268654e-02 2.305007223941068703e-02 1.500536507999153737e-02 4.774200143782722852e-03 3.603380797606050429e-03 7.493689864710502413e-03 1.220459234630180689e-02 8.535135188858025690e-03 7.191595130204194060e-03 3.683756870421837741e-03 1.328019992208521460e-01 4.589118670669882494e-02 8.896240099183833072e-02 1.746240463359199566e-02 1.278904933104294851e-02 1.034679572902072811e-02 9.807409072206821690e-03 1.989653177865162784e-02 2.158391207910777612e-02
2.256756574283296651e-02 7.071137212424685736e-02 1.973758643763867671e-01 7.648808293295114580e-02 4.337677737688130225e-02 6.307659091375123796e-03 9.643082752692737000e-03 5.571517425721535938e-03 9.502254605505915108e-02 8.939883828726738479e-02 1.099940606498914508e-01 9.545790641413866295e-02 1.668546183746598410e-02 1.637633741917965749e-02 9.053187710146952394e-03 1.147400686477226955e-01 2.602238014830290588e-02 1.108630558628758214e-02 1.761409574480692075e-02 1.002010329109164453e-02 7.393590071252813777e-03 2.099526743639216174e-03 5.869344411086043108e-03 1.416628071355271468e-01 3.171895890518296179e-02 1.714227521569261850e-02 1.168125747481584854e-02 1.348940900389754456e-02 2.107635669478971283e-02 7.736730088254221982e-02
2.627711985344302614e-02 2.726665373079741397e-02 1.065611888283703734e-01 8.535742711403336569e-02 3.365233382101200793e-02 3.609064925887083952e-03 4.401046581234399624e-03 4.883301164540001897e-03 4.590356324226204342e-03 1.382629281677169308e-01 1.065515893446372514e-01 6.533287641280585700e-02 1.077005360813637971e-02 9.404972103813458162e-02 7.805225493224077216e-02 1.320060145001768492e-01 1.609400044813353442e-02 2.860289997079076656e-03 9.181827754347823833e-03 3.151225703019268354e-02 3.800305263162961911e-02 2.397027591406861169e-02 7.923223542809094619e-03 8.488924240386776232e-02 4.764938487620630492e-02 4.507449927046592447e-02 2.810722705036944324e-02 1.935011819224775192e-02 2.550605094562773123e-02 4.577557211276395838e-02
1.378530918574800701e-01 5.765783265265157082e-03 5.252560009159940903e-03 2.665159846050754039e-02 1.277986545736787584e-02 2.124283632116037365e-02 3.225520768359210755e-02 1.840764380981867523e-02 2.196674156752049731e-02 2.556580817233831959e-02 1.996276561766789290e-02 1.051628802803750845e-02 1.474587545562950908e-01 6.850591690101262565e-02 3.978931700646112790e-02 6.818694598164748433e-02 9.509709422760017836e-03 3.017977273228045470e-03 1.534185916848393449e-02 2.093693868324276314e-02 1.236924782626693323e-02 3.671448768467892084e-03 8.432316684948340524e-02 8.019259048672403023e-02 3.264998862350577957e-02 3.372297591414196577e-02 2.974910878010546961e-02 2.560967802660098908e-02 2.925532053482533118e-02 6.943881921380019862e-02
8.154566013543420103e-03 1.454654476751904811e-02 7.246355074588308950e-03 1.553823860226147442e-02 2.386242998370560059e-02 2.688811181842509432e-02 2.383023072384858609e-02 2.247918273031744227e-02 1.792655965245280175e-02 1.014223251030269002e-02 4.162049297915939444e-03 1.702687863311830307e-02 1.260006912985938421e-01 4.534120754315111579e-02 5.062482879910225331e-02 9.153891991740530087e-02 1.744583151016516551e-02 2.064341136127600951e-02 1.809062734576716985e-02 1.384019300002065772e-02 6.035214377371092391e-03 1.479465099547894458e-01 6.094194257530297781e-02 5.190808628418586146e-02 2.481439029276340941e-02 2.563047544662036895e-02 3.818706402317868093e-02 4.388046141192093741e-02 4.252009001533147564e-02 1.260749238293440433e-01
2.074391223933475664e-02 1.326525774865414467e-02 7.425196672223954679e-03 4.155977921587757085e-02 2.624507147794471335e-02 1.104653908589865903e-02 3.543177452198870148e-02 1.586241284372983534e-02 1.337204162753299203e-02 1.341625867568976317e-02 1.221650906006078313e-02 1.801886567132698902e-02 4.160373930385512231e-02 3.191309763389348075e-02 1.645912910022033215e-01 1.366773183245597045e-01 1.510844378892338587e-02 3.867257768077859287e-02 3.803703140240710656e-02 7.668094063361937524e-03 6.659258947158602782e-02 7.015704551391907517e-02 7.767445203500404627e-02 5.116160275266519453e-02 2.996913991728851479e-02 4.167805284552008466e-02 1.443509642125238024e-01 3.447451180452490872e-03 1.028410134751187033e-02 5.158783812297796853e-03
3.557288683900541870e-02 2.341630200825038990e-02 3.679791244675024303e-02 3.300645934828565220e-02 2.969293539806358573e-02 6.771166372505657734e-03 3.641251779869801586e-02 1.525150033233443718e-02 5.628300243068760575e-03 7.320058942131660307e-02 2.397404792199154741e-02 2.329088431311500743e-02 4.942973312051642670e-02 5.794698901545451697e-02 2.869980213923585197e-02 3.087490101998278252e-02 1.516902520027820778e-01 1.500528521054354247e-01 6.441629125993411642e-02 3.756420950219566124e-02 8.851158750410929865e-02 5.632387160321275510e-02 6.467970229565607465e-02 7.123509612268079383e-02 3.968876730057990798e-02 4.739152734057743011e-02 7.643745795434481703e-03 1.007472662038117611e-02 1.112471040901856847e-02 2.849727422546893991e-03
3.236292321071197742e-02 1.704300719101617401e-02 3.822613843859539590e-02 2.967282054541396652e-02 3.914249051931063123e-02 1.294782166484851060e-01 1.250595998397595054e-01 1.144199567860542804e-01 7.782394139667539457e-02 1.489444035286716789e-02 1.959448923719718794e-01 3.210446563741009007e-01 6.626596297092179899e-01 3.269828241050725115e-01 6.025322206831351668e-02 1.184720983457714372e-01 2.209117312580970438e-01 6.096302634357998740e-02 1.549897680408715908e-02 1.481666848523275071e-01 6.236441214070748834e-02 5.615581271936614938e-02 7.234441158503586433e-02 1.012392115409036786e-01 1.081346006007820187e-01 5.664638431973435806e-02 8.384811445992537693e-02 6.113471582381067165e-02 5.542683679081517739e-02 4.085643993724200757e-02
9.665707476159595204e-03 1.246877313008925570e-01 3.857375610121605014e-02 2.845253921856179258e-02 2.757347561715257564e-02 9.891798286796862558e-03 1.036456071001966295e-01 7.268337841473621053e-02 8.658960521893027673e-02 3.295381163714068695e-02 6.009908392321189341e-02 3.867274115973950432e-01 6.869294025733598819e-01 3.563297453406576443e-01 1.283986865429377899e-01 1.450979665804993934e-01 1.603956583582282491e-01 9.441763991596216488e-02 2.494497777615953954e-02 8.994536417157080604e-03 5.985912177405563334e-02 6.143746442565770072e-02 7.250320305153326594e-02 1.297236854140757789e-01 1.233930272418299057e-01 8.775225476834834504e-02 6.695753629272280238e-02 5.881533374953561155e-02 6.380663540138790946e-02 6.956176292692857477e-02
5.460311368678227861e-02 1.256399025734979136e-01 1.521563937002233351e-02 2.428874596066039893e-02 1.819111314508034191e-02 1.786426892538158784e-01 1.030430870188476511e-01 9.413375112238248077e-02 1.210506900728295088e-01 1.779439395243130953e-02 4.377582394600195922e-03 1.236604499094611509e-01 5.108699051448484241e-01 2.194758543488583569e-01 6.909769275548477419e-02 8.012045340381721004e-02 2.962798766636213360e-02 4.348897084537317603e-02 4.949410625560996674e-02 2.101541533764940406e-02 5.684715772254433919e-02 6.235940067926917102e-02 7.838356066741121453e-02 1.317300754117557982e-01 1.682702609293284246e-01 1.488775321266332663e-01 1.093685637935039590e-01 9.923598919798520823e-02 8.647031995931354909e-02 7.243576630018340456e-02
4.759110037958058648e-02 1.281014666578221273e-01 1.322546670939649636e-02 1.333899469303678198e-01 7.967753942784520926e-02 1.104027632085149632e-02 3.772085331771488775e-02 2.960787414031167825e-02 1.657587509669935510e-01 5.396800742745497259e-02 3.298941250345948078e-03 2.024289699689454936e-02 2.326550724809630377e-01 3.159126768412269248e-01 3.376521336568391041e-01 4.569486100560510300e-01 4.125361526386012723e-01 2.687371025817393844e-01 7.366278995805211061e-01 3.466036536442337335e-01 3.134688071067767701e-02 1.087959352092466962e-02 9.282034395035710511e-03 2.408920053971516304e-02 5.065478216277920220e-02 4.274735803113993704e-02 1.079695813250876324e-01 4.166892003520083348e-02 1.169596027109496145e-01 1.367724072617978459e-01
4.564303299519686247e-02 4.375444314840516713e-02 1.047168216241421285e-01 3.998553720361154584e-02 1.033059514957892014e-02 6.518865259454664773e-02 1.775426772995745278e-02 4.979698019408150544e-02 3.477442190147488066e-02 3.639928434719386964e-03 6.974878480085075320e-03 1.006256886513129806e-01 2.078490453908822810e-01 2.649141105931378526e-01 2.400723871438452672e-01 2.909354708793172595e-01 4.992673152190170160e-01 8.683844871914898622e-01 8.895278844427416676e-01 7.014883531542041029e-01 2.992485451308801031e-02 3.120406941634753378e-02 2.782854435060777218e-02 8.677690471989704668e-02 1.238929409720651853e-01 6.291457897795631471e-01 6.209938247207408279e-01 1.396688211770736876e-01 1.199741739881966252e-01 9.292793001731240732e-02
4.238215877801679993e-02 4.500386076155615811e-02 8.937323195271826282e-02 9.187692574515585187e-02 5.852715521935178411e-02 7.004992136418103366e-02 9.795399419656583562e-03 2.490768969677935665e-02 5.160449242484498739e-02 1.860954505020044614e-02 1.875943566137314861e-02 1.551415104209216689e-02 1.174379844840994225e-01 2.386904434818384879e-01 2.232859230355194735e-01 3.430491054166444065e-01 5.988217013772993980e-01 7.342097642027201054e-01 4.279706398241190923e-01 9.386283403426290417e-02 5.653299107012284275e-02 3.895557939215250065e-01 5.700993153575828476e-01 9.405012284704787895e-01 8.680826446459353196e-01 1.118670888933973373e+00 8.878895432752758055e-01 2.675353131619493396e-01 1.744844918490383867e-01 1.032236076031011474e-01
5.245062414041369581e-02 6.019770482488753099e-02 5.861492959938600228e-02 5.369045931956728523e-02 7.758770444062983163e-02 1.362859072660980164e-01 1.495708089147575470e-01 4.846920123559264604e-01 2.371214875768287156e-01 4.093327152794927482e-02 2.957777980815901736e-02 4.347332720005576273e-02 8.350909971192900516e-02 1.236141608204081310e-01 1.639179497909466765e-01 2.949084337023518687e-01 6.426593720115768571e-01 6.539332468514469365e-01 3.128717107526670649e-01 1.083095490965546998e-01 4.694950517771847576e-01 8.560633116365283790e-01 1.103693847199132438e+00 1.103725377339594527e+00 9.488894384567059248e-01 8.136726698676923775e-01 1.207410653322382732e+00 2.158584994292068460e-01 1.117429263885626363e-02 1.243285217854826763e-01
1.251595820406992687e-01 9.910031688553801177e-02 5.065322617182357878e-02 7.315072945395206805e-02 1.831572716274559517e-02 7.524580130910862863e-02 4.023772722598984442e-01 3.254177314973276669e-01 3.205811723880268582e-01 1.607089229204103353e-01 5.708808068323471818e-02 1.447308309403127005e-02 1.373760177442129478e-02 3.534874044140076665e-02 7.994126272204607475e-02 3.680205041233263197e-01 3.918736690750769802e-01 4.623810226281664937e-01 8.155487301632821651e-02 1.455062607434596533e-01 5.193589542564288619e-01 1.130062145566054221e+00 1.400873174586232173e+00 1.402270779057475103e+00 1.129289102263955069e+00 1.094681416153757469e+00 1.033722505963220240e+00 8.116727309219601283e-01 4.162648614911847872e-02 2.819866061056905404e-02
4.936696837720806058e-02 1.383382414331188193e-01 8.029798725180729152e-03 2.919687529006691207e-02 5.966000442253964475e-02 8.142318834077888479e-02 2.567485333817712267e-01 3.206701922588126585e-01 2.191225750812000328e-01 1.668466262806404532e-01 3.366170581431214559e-02 3.155432005083896527e-03 4.677864050082280664e-03 1.307525840830895195e-02 2.820405323709686274e-02 1.648793451741027427e-01 6.341001406078906888e-02 2.042501131908204190e-02 6.911481343773675026e-03 5.056502760304294047e-02 1.932372140191546406e-01 1.032579255837823284e+00 1.310346660765404847e+00 1.358669694291375185e+00 9.915845939992622426e-01 4.654481950941545820e-01 7.658366987096849599e-01 5.204472572445338896e-01 4.671053169145318595e-02 1.818399590253537076e-02
2.030087476158263030e-02 2.677547462125282746e-02 1.715886673601067433e-02 1.859734720933882771e-02 4.457669806059526979e-02 2.562250659066621708e-02 1.312263259721074549e-01 1.687456419550057429e-01 1.542028653505252422e-01 3.531828974141054678e-02 8.618471294808605423e-03 2.129472590231932215e-03 3.814714938934862451e-03 1.074862502166392883e-02 3.619471913097087323e-02 2.329856157384638596e-02 4.275523707639886789e-02 1.270781306693144833e-02 2.403566658395008340e-02 1.147099043385925304e-01 6.193431369607980130e-01 1.172575567634029037e+00 1.258468771556358501e+00 1.202975332719261825e+00 9.347068530996932578e-01 6.943486746866326387e-01 6.806482065400341064e-01 4.546668258785571126e-01 4.074595484704883475e-02 1.433655611165594347e-02
4.549584099323163155e-02 4.291412315248913090e-02 2.213023025573854219e-02 1.598367791397070636e-02 2.081168901774564650e-02 1.111434387258477402e-02 6.264552416414469194e-02 5.547313441695591457e-02 1.545945181002454302e-02 8.846131890052667118e-03 3.573320763044862160e-03 3.771244697390044569e-03 1.332822157607814750e-01 6.224294958424066160e-02 2.015757861941313428e-03 6.688149592203073909e-03 2.406753160756392243e-02 5.512470943213367003e-02 5.329520345896893163e-02 2.387132213174722184e-01 6.506199045960636695e-01 9.386906146143096930e-01 3.803289570861234647e-01 5.767866131259373752e-01 7.556549189929658850e-01 4.335437352220889440e-01 3.262947212635276539e-01 2.739525457278317866e-01 1.311464192269828737e-02 1.244705475922422942e-02
3.781875692954431850e-02 4.497816426297474718e-02 6.456451125154794718e-03 4.365760927640771269e-03 3.510833324507621825e-03 5.196600871071089395e-03 7.620479838494018457e-03 1.991030697911371460e-03 2.750977563366391668e-03 4.660361071561576474e-02 6.625873945169506729e-02 1.046212377079377837e-01 9.588324482426199835e-02 5.169097252273904992e-03 9.635476979939661124e-03 1.238921245553016443e-01 2.391269568276479240e-01 3.473465252893186417e-01 2.380830098031264108e-01 1.790573960819944466e-01 1.260792086742106299e-01 4.477166059622166017e-02 1.727242088067870718e-02 3.783918792246064589e-02 1.387576167661395687e-01 4.737021851380358167e-02 4.372753571757986152e-02 2.032010448499996583e-02 5.765192511070486164e-02 5.424490970437715470e-02
8.603440211234217316e-02 6.788366710895607503e-02 7.065098023005292674e-03 3.042442383137766975e-03 4.383645044196652664e-03 3.199400945900946792e-03 5.021543031765512803e-03 6.709985199061768713e-02 6.407927167071809926e-02 2.803511264006923812e-02 7.031787434311662088e-02 1.272572480815655771e-01 1.274000149605864496e-01 9.954612614424694986e-03 1.118113278162178453e-02 7.242296308366474866e-02 2.659917496893044464e-01 4.967723239544563629e-01 5.632000675248731714e-01 4.869460215373803136e-01 1.028407677255521457e-01 2.280392191919942274e-02 2.824667811756378585e-02 7.045473701285648316e-02 1.584051489702040239e-01 4.715342663522516242e-02 1.798380038807384854e-02 1.007693780508198134e-02 7.929149687745623565e-02 7.693023290290781913e-02
1.132795639137930133e-01 1.442085386634250552e-02 3.832396390814507559e-03 1.164077893066787495e-01 1.441451526911355363e-01 2.798850298930336943e-03 3.977677128338701421e-03 5.426289468084388029e-02 3.189525476478820287e-02 3.652059543900578603e-02 6.692846852013745185e-02 1.131688525352537722e-01 9.846331543658344565e-02 8.375284793911835779e-03 2.283624726033642652e-02 1.040329487763143324e-01 2.023204858642347337e-01 4.667964463890691418e-01 5.887161347607793305e-01 4.987185092391519525e-01 2.484404608893543975e-01 1.606428204240342023e-02 1.138568899561315760e-02 2.452820445647680217e-02 1.296771114018659965e-01 7.889344824748857621e-02 7.101611605958477180e-02 1.931542763743582941e-02 6.402675229990939521e-02 5.832147217357673552e-02
6.169351374163334345e-02 1.904866099954574676e-02 7.508004115127083627e-03 6.499963149569697000e-03 1.461232554105447445e-02 9.975927387939084387e-03 4.558892766295289528e-03 2.105450638533267194e-01 2.839412537183468206e-03 3.627771627284215143e-03 3.943959917922394698e-02 4.708826043860678962e-02 5.961990550302379011e-02 1.121426853998245265e-01 9.785982158506666487e-03 3.263459243136228316e-02 3.320668556787884085e-02 1.428986109248181480e-01 1.847786085470879969e-01 1.605688110057999496e-01 1.357933630769533606e-01 2.390126974170271243e-02 1.102375324328887518e-01 6.957217957056118299e-03 2.405447966819153349e-02 6.079760668468218998e-02 1.633373975209562179e-01 1.062265320468660373e-01 7.401263019233994545e-02 6.489802654084644851e-02
2.191922761035502987e-02 8.699452795153208781e-03 9.046508708989011577e-03 1.328785293622007299e-02 7.265345531463436070e-03 3.569031420909377951e-03 2.013413219671397747e-01 1.489528972446611532e-01 4.168124354744296919e-03 1.445644780900403811e-02 1.215483868353895852e-01 4.480511874136236528e-02 6.610111101420444724e-02 1.185638472982788461e-01 8.106607117913182739e-03 1.173269329529326097e-02 1.055433082759225233e-02 6.543957316501257046e-03 1.160488703267800389e-02 2.030366230099569028e-02 3.818719796491018559e-02 1.233380390327342563e-02 1.178338788521052782e-01 2.397699080468992244e-02 3.471419651265074402e-02 1.244075473373706421e-02 4.309928102090308799e-02 5.166385053519386567e-02 3.972945647790684237e-02 9.654262421609084710e-02
2.220766598006694917e-02 1.784211205483637180e-02 8.451438613717001183e-03 5.389376932132197359e-03 5.018419215413310978e-03 2.080631991957933649e-03 1.673036618015829868e-01 1.787233070562377624e-01 2.015661580646583573e-01 7.116271205914463834e-03 2.703252902257032714e-03 3.454451223471464300e-03 1.654617355851150107e-01 3.263625556986410586e-03 7.198184839540260060e-03 4.538889193927204968e-03 4.152239816352197924e-03 1.315170287440098895e-01 1.202794805622156016e-01 9.538435774876732887e-02 7.570570341348768773e-02 1.062680101590324222e-01 1.445428926232604494e-01 1.802908495760400728e-02 1.766686807788341029e-02 1.192227768485649118e-02 2.476513030651697478e-02 1.489274327772740006e-02 2.097954657882200244e-02 1.736437356509140106e-01
3.015633886259422997e-02 1.575139716950988214e-02 8.675245643580336424e-03 1.030922413009702221e-02 9.087709641187977083e-03 5.040609868684329045e-03 1.756448406860744091e-02 1.404876600323186515e-02 2.477586129731506725e-03 2.002955638286327833e-01 7.152780553819115816e-02 1.530518151059147014e-01 6.511635760854566843e-03 5.865466569210344393e-03 1.591908799616328918e-02 1.415932501146889566e-02 6.196867357379147977e-03 1.286699285070605839e-02 1.369022014264061338e-01 6.378166170043740590e-02 6.135061760940077602e-02 9.238555468398271242e-02 1.280355081308405807e-01 2.748077409166294754e-02 1.928935903288529416e-02 8.435127619599327997e-02 1.020020664924480569e-01 1.213477031821028340e-01 4.575330642732201858e-02 7.408573211244731671e-02
4.086137214969874643e-02 3.539288465173128645e-02 1.025212811322836343e-02 3.069544657634078882e-02 3.591106405408680396e-02 6.729259867810161166e-02 4.453947754088777300e-02 5.056286899507283876e-03 2.255743858348232059e-03 1.588686019236134894e-01 4.836446010327816181e-02 5.577675032481843598e-02 5.836915243123033670e-02 3.536838680556708258e-03 5.273286317889119834e-03 9.583668599801464794e-02 8.228766184216290691e-02 9.145174946024836604e-02 1.284142342549214888e-01 7.815580062184697419e-02 5.514049469959148020e-02 8.090169277578923568e-02 8.598719972995835792e-02 1.280836643094284133e-01 4.392540116950660600e-02 6.557550018905559941e-02 1.000331451749664341e-01 1.532817080050275782e-01 1.642701768663243078e-01 2.985999764855765126e-02
2.267291678718104386e-02 5.639755569450225631e-02 1.505273641613433591e-02 1.477984653759858123e-02 7.278579595962447746e-02 7.705851431436012977e-02 5.084913286224112400e-02 3.469820479312794512e-03 2.710642687949628774e-03 3.339016915205335334e-03 1.388541976600826955e-01 6.970396073544379845e-02 3.971696606661800910e-02 5.812933917298986758e-02 6.034937250392394086e-03 7.296852130281206161e-02 6.584802904956498469e-03 3.625236271746180156e-02 7.029753201931107642e-02 1.881798213130876987e-02 7.738314899418111126e-02 1.076396184489466223e-01 9.074790069139111737e-02 9.052170531881911786e-02 1.180136556634642508e-01 9.297872632052087138e-02 1.132010062345591567e-01 1.342007875336015121e-01 1.582568562167322446e-01 3.390400900087006675e-02
