9.686204990028406819e-03 1.424348992911280733e-02 1.248901415392385944e-02 1.589165930061292933e-02 1.207582454985327985e-02 2.647992027456537792e-02 2.608329723142515863e-02 7.015477798488303773e-02 1.271346296979509183e-01 5.726159586256428236e-02 2.677555035638132241e-02 6.125528606944657603e-03 3.576270873297554380e-03 1.315029639882678986e-02 1.515101480888472046e-02 3.302969670940786653e-03 1.149672654243975162e-02 1.980081555557055076e-02 1.768128487865571960e-02 6.140574051881937320e-03 4.902731548652027038e-03 6.465855811677134746e-02 5.020936489272992409e-02 2.090856666618881934e-03 3.879135031951789440e-03 2.917896310152337525e-03 1.389648364381778634e-01 1.236215147984476986e-02 1.181607975991520385e-02 1.487448809013049676e-02
7.657748249349782821e-03 1.688171674743548997e-02 3.053837047664919105e-02 2.486665260062781435e-02 1.734346907910443852e-02 7.774936112921666809e-02 3.696930250681111640e-02 4.584710524075363142e-02 2.977992140997251860e-02 2.514009792349448241e-02 1.789947141627781096e-02 3.493675435736294174e-03 4.617580085595134748e-03 1.047433094705138047e-02 1.448552149288667192e-02 9.282720725486122079e-03 1.134301169826937988e-02 3.646616822574354905e-02 2.714334442392507540e-02 8.071785350747623378e-03 2.845203406599400991e-03 6.067646960901520309e-02 1.275574239287292078e-01 1.124144772184808849e-01 9.852259002363103479e-02 1.319825726411009426e-01 4.714549130434396440e-02 1.228756109930947277e-02 1.761056988942584153e-02 1.775381513407870912e-02
9.421353261947396085e-02 9.494905816211345051e-02 2.010302554815187048e-01 1.621728799692306877e-01 3.468629316542549690e-01 3.541659245287666347e-02 6.640619702644858478e-03 7.050453763281584567e-03 1.132342593204196668e-01 3.385438994112432987e-02 9.000713207155808249e-02 5.921057146924832426e-02 2.157990702466614646e-02 3.157284034517446325e-02 6.001943861139506092e-03 2.524253288643640153e-02 1.670665369088752614e-02 3.366681799085840393e-02 1.105213297737860090e-01 1.816249703288161030e-02 1.708991092092527163e-03 4.943405366696410064e-02 7.564890939440116480e-02 2.640974420343731449e-02 1.576235947056158979e-02 1.054016305556291708e-02 9.520046374847058665e-03 7.577719162668890632e-03 1.293487884542773338e-02 1.471009702609852275e-02
4.366767252716802911e-02 1.229641828776472795e-01 2.702676032489401692e-01 2.166031624611848838e-01 8.981974909475599900e-02 1.394869754782841059e-02 1.117092818955136777e-02 7.447820936764568654e-03 4.555072355130017694e-03 4.183530111705116572e-02 2.647503862730403446e-02 5.222982017845485825e-02 2.347257408832544023e-02 1.568269902367105950e-02 4.581195420919647807e-03 3.468553830020930113e-03 7.139605048003368898e-03 1.310646458935487042e-02 9.192646478728501783e-03 7.743951919226669395e-03 3.459805779983012031e-03 1.134603520089015882e-01 3.561506610923380334e-02 6.864675200071557182e-02 1.280747863156195786e-02 9.475902977000643171e-03 8.170926312019389723e-03 7.776396997404286422e-03 1.559508097705459076e-02 1.726546036914147070e-02
2.526926989450265643e-02 7.677079617039578308e-02 2.137649546392159650e-01 8.279167955131559731e-02 4.783706322462324273e-02 7.010435749980228719e-03 1.082078496042308477e-02 6.055473363250653100e-03 1.766514524573128408e-01 9.635152886441687714e-02 1.186415775709913911e-01 1.006329253458999873e-01 1.476030120253432609e-02 1.218360757661699975e-02 5.640607459797416026e-03 1.501983469481825706e-01 2.176869033077845697e-02 1.231846094167475189e-02 1.964243948403253393e-02 1.108128756134372887e-02 7.503732609602501227e-03 2.041055475994644260e-03 4.350894427517442570e-03 1.157436405693617193e-01 2.309634985104757829e-02 1.257434540347169422e-02 8.715550858294484823e-03 1.017529744567269127e-02 1.576880560053031330e-02 5.932279840274422983e-02
2.523770746651460978e-02 2.590046007543563011e-02 1.158954644844338855e-01 9.263291628490930019e-02 3.682600359401751178e-02 3.969220896287765227e-03 4.887215398954495617e-03 5.290079244769460391e-03 4.983227198388730586e-03 1.490064479065715264e-01 1.152207984524058204e-01 6.044373448579316854e-02 6.832189509523313095e-03 1.325492879792881662e-01 1.026749264423595098e-01 1.706409690192236539e-01 1.234972793414688269e-02 3.184664159710439129e-03 1.025795215063905579e-02 3.489769848998184459e-02 4.177266598072881809e-02 2.425122602094410829e-02 5.861789472146175517e-03 7.018492291492739454e-02 3.465898998073881077e-02 3.281900996892729572e-02 2.026391057676881977e-02 1.414162699168940163e-02 1.848630617778207821e-02 3.420600526702072958e-02
2.220642528284595962e-01 5.413894465603337827e-03 5.717388527356911943e-03 2.895761199803038172e-02 1.387158769710244294e-02 2.321586100117440862e-02 3.571294914786590780e-02 2.065207837726174347e-02 2.482513645790561732e-02 2.865546754482641706e-02 2.187219799304056939e-02 8.968784032434687359e-03 2.214889824343493352e-01 8.796326388382719186e-02 4.705420675023159333e-02 8.509691884010298080e-02 7.112866630305313825e-03 3.351208427916648781e-03 1.704157180583021000e-02 2.309006975184341864e-02 1.044333278929527285e-02 2.434049655242234798e-03 8.224167059363483856e-02 6.412056444233713015e-02 2.371245398219609668e-02 2.434039972428935286e-02 2.102465449753600918e-02 1.854381599986808932e-02 2.143009041610097198e-02 5.249141912061101173e-02
7.448070841841971344e-03 1.350386079097075365e-02 7.879292071975860581e-03 1.695473552481656029e-02 2.590751561286850496e-02 2.929459354455989442e-02 2.630521347254693651e-02 2.513510606921148111e-02 2.046042863230145004e-02 1.141510662754736775e-02 4.573676313326548344e-03 1.407043422408743930e-02 1.818684002026807467e-01 6.113787699119013763e-02 6.325592872610502626e-02 1.181109197236290265e-01 1.440299808832560570e-02 2.294784667162361527e-02 2.009974484127215189e-02 1.420527612240311127e-02 3.802712798901662465e-03 1.427668468913255717e-01 4.899151271736744417e-02 3.817777509858476942e-02 1.792738457265665580e-02 1.877631131949093757e-02 2.878881414010341783e-02 3.693979741142447426e-02 3.763174678956431041e-02 1.136788962335164022e-01
1.956925012357546567e-02 1.275701020677335457e-02 7.464682881058989916e-03 4.314831210335313971e-02 2.791117008131697649e-02 1.185764589716728837e-02 3.866260136731577979e-02 1.752808238290157888e-02 1.487893398670889905e-02 1.463959338437927082e-02 1.301166146368074560e-02 1.709980720276474409e-02 3.711027774204154334e-02 2.405752569019946677e-02 2.274061920296435724e-01 2.092715582256582385e-01 1.384774522749617626e-02 4.186034838505967026e-02 4.117387066978591553e-02 6.840557889482520339e-03 8.024155360117518621e-02 6.313162783653260279e-02 6.045105361697199198e-02 3.713707423428272425e-02 2.143194993657746017e-02 3.286426234310150379e-02 1.229182855045377887e-01 2.552963659568384391e-03 7.938381610835801641e-03 4.221016137909222414e-03
3.262092371197910373e-02 2.115293304552418735e-02 3.365580647717745372e-02 3.125501116394113765e-02 2.733534507719474066e-02 5.411542120313717411e-03 2.535349816912900456e-02 1.086169397326684077e-02 4.585768535966344706e-03 1.101088209054698064e-01 2.495556907920237766e-02 2.417328474142933087e-02 5.093818285187158568e-02 5.493727106159041612e-02 2.611762452264704965e-02 2.838331810410414657e-02 1.511064933251525244e-01 1.559742425369282093e-01 6.254039120998407253e-02 2.777556014159894560e-02 9.942305197688675045e-02 4.786929067080388650e-02 4.949770334430642071e-02 5.194607107074619007e-02 2.826940497629731180e-02 3.630762304680897057e-02 3.444824762387755333e-03 6.349219349092247860e-03 8.467220526651416182e-03 2.375571635576853233e-03
2.734543553111821318e-02 1.422855254639739803e-02 3.164616289494044665e-02 2.672914355762135569e-02 3.383724603087596983e-02 1.951754432060441025e-01 1.669858291996876576e-01 1.479325689381401632e-01 9.444119092780119129e-02 1.269876624914659073e-02 1.981678200640842880e-01 3.280419853356411064e-01 6.747432925354835964e-01 3.321373349780609718e-01 6.116488545927513398e-02 1.187170683337659960e-01 2.192965264115870616e-01 6.055252835283315982e-02 1.446451264545044885e-02 1.984528220050112979e-01 6.847352115005501949e-02 4.801298888949735028e-02 5.729328968807414352e-02 7.795291791175038010e-02 8.180172076638525525e-02 4.402673274576635043e-02 6.942949423451705293e-02 5.656283045560763639e-02 5.153796919198407739e-02 3.762186785290441704e-02
5.060974573981536981e-03 1.769148198990959653e-01 2.604217642307814912e-02 2.537413501356614032e-02 1.967604932724568295e-02 4.494397606853646129e-03 1.117965832609565668e-01 7.273796986731320691e-02 9.109069163179496498e-02 2.479734738229626839e-02 5.986423296750205403e-02 3.882332203558817585e-01 6.920841769539016752e-01 3.577158143855548311e-01 1.290884402082047577e-01 1.444708172612363950e-01 1.589948860931594266e-01 9.394274214657291622e-02 2.318803687588827725e-02 6.535351259679369161e-03 6.358615101594682073e-02 5.666806034928131841e-02 6.425945050408490844e-02 1.138946192143549252e-01 1.082560968341527985e-01 7.674617478371509316e-02 5.853893019736144954e-02 5.329604142938768746e-02 5.722639602528603597e-02 6.155349036662650236e-02
5.825874488390270223e-02 1.502927835423447656e-01 6.059884115715960008e-03 1.712137122621149032e-02 1.113441487422062171e-02 2.206694165339630476e-01 1.140364850907575889e-01 9.617887826729251688e-02 1.222389578853264325e-01 1.240822692066557466e-02 4.120064705846835512e-03 1.242024921543604388e-01 5.172960654945715220e-01 2.192401748830103692e-01 6.852773331241646115e-02 7.857414541309422351e-02 2.898555489826101089e-02 4.257916927103909399e-02 4.859389920592142170e-02 1.822294458188563476e-02 7.657631164055048179e-02 6.891868383658239505e-02 8.324039431838900494e-02 1.429768622701201031e-01 1.875961315600110368e-01 1.765591976566315835e-01 1.308173674490328287e-01 1.184624915464392997e-01 8.988132462763355479e-02 6.922312119701790056e-02
4.631658966065303751e-02 1.333103628692944298e-01 3.989991369384283601e-03 1.799802235068286294e-01 1.071048577114621092e-01 6.672170782154674198e-03 2.240927142825514459e-02 1.882949633039010529e-02 1.763561349534444600e-01 5.417325611302291344e-02 3.022113327776709737e-03 2.019193936492751085e-02 2.357133709768173269e-01 3.143524799479142096e-01 3.322918428696089999e-01 4.441743653925438462e-01 3.995537576399752488e-01 2.589297101825464020e-01 7.065253015028185590e-01 3.305546887515639076e-01 2.747404959134637503e-02 7.977146182653226808e-03 5.962409235586573798e-03 1.505165414972765500e-02 3.502207842802255305e-02 3.275506424923176063e-02 8.955950251893016190e-02 2.887205869213102169e-02 1.455941960973803351e-01 1.402954276040135895e-01
4.161283251977491993e-02 4.191550355902556868e-02 1.170653154250214378e-01 1.385781880896165379e-02 5.018807131697183670e-03 7.648049751432946242e-02 1.493575443779543259e-02 4.291057623806966703e-02 2.882868470485346751e-02 2.976530145392148642e-03 6.350317381234284880e-03 1.002046778669527655e-01 2.104299839003115902e-01 2.632160763164250739e-01 2.351899673072161689e-01 2.813679018634006601e-01 4.794066038285768605e-01 8.281810797845821082e-01 8.459637612960475561e-01 6.735403050765073063e-01 2.908801465385211019e-02 3.063934101196710488e-02 2.715454135748850140e-02 8.546524778876546380e-02 1.228413466039824931e-01 6.283423236396756817e-01 6.297347688309721248e-01 1.259962854180894931e-01 1.697275568976480686e-01 1.016906796362608001e-01
3.642005256277022762e-02 3.985648786975832386e-02 9.286835335588342066e-02 1.040377126066904245e-01 6.963990718220199050e-02 7.977252058332177931e-02 8.180092658713538495e-03 2.293074809379265153e-02 4.750856549369586457e-02 1.707192016991812555e-02 1.764198376148016015e-02 1.534510236080319917e-02 1.184827470542689776e-01 2.380638853881646422e-01 2.207462207698683287e-01 3.354818084885181628e-01 5.779481796064556143e-01 7.027291344380363070e-01 4.091271824142011515e-01 9.046358116427662133e-02 5.482220936388114418e-02 3.788401827776547992e-01 5.519594367914857358e-01 9.293711031436826531e-01 8.732112630283749288e-01 1.138064518966193761e+00 9.168707074078668029e-01 2.621204230283130654e-01 2.669486635128484608e-01 1.206331797175392156e-01
4.432351357503540312e-02 5.154167354054503547e-02 5.186912164537905989e-02 5.029050956267259315e-02 7.780735520122718241e-02 1.630655167478309298e-01 1.332096542646061255e-01 4.442150322230982717e-01 2.169814855928974273e-01 3.720483547400318947e-02 2.763555834386147506e-02 4.303312927269822841e-02 8.475277520814857024e-02 1.242036539068357287e-01 1.627902248375154570e-01 2.900061772320056130e-01 6.216452449633138588e-01 6.307220516810406741e-01 3.022324852371027770e-01 1.050249250898453168e-01 4.540580140587611169e-01 8.230235064787119192e-01 1.056505222947532463e+00 1.089749620394323548e+00 9.632156906687185938e-01 8.351994070504907830e-01 1.243866510075855025e+00 2.175831144032044917e-01 6.906401626860201280e-03 1.694346184051763182e-01
1.068863392421042779e-01 8.440547919240999619e-02 4.491290600275714417e-02 7.201593104585299332e-02 1.285497228379118423e-02 6.498545049069992530e-02 3.612326158724467051e-01 2.933435345085433354e-01 2.887387086511228884e-01 1.449017456162617346e-01 5.312065818577174636e-02 1.432183118561249080e-02 1.400300390141825599e-02 3.593773922839801904e-02 8.043299371212797588e-02 3.687497732119663918e-01 3.856154999704644593e-01 4.538444925055961643e-01 7.973233816806007956e-02 1.419560769847008075e-01 5.033756436866948514e-01 1.087999142799910279e+00 1.345895230790168373e+00 1.403294729937371921e+00 1.165936599038468025e+00 1.129985345559971321e+00 1.057621362595512871e+00 8.385292378348543352e-01 3.721380471278119828e-02 2.453601035058373264e-02
4.840833208665916432e-02 1.346564896179484605e-01 3.399159487252916955e-03 2.346302239526074779e-02 5.210029097670202530e-02 7.346408094050602133e-02 2.309751045434041139e-01 2.864433227385447256e-01 1.964597419104605613e-01 1.530207384318053587e-01 3.225387820001847372e-02 3.169600878576297933e-03 4.826495813749919969e-03 1.364370144068205795e-02 2.960713162595246875e-02 1.748528228911652715e-01 6.647634736217679363e-02 2.136501783051941022e-02 7.183791511135714618e-03 5.216408408163938221e-02 1.974228989327570238e-01 1.047447996612391963e+00 1.325663746504039953e+00 1.397235661443693155e+00 1.029565968415018240e+00 4.814323072494711697e-01 7.846515615067166660e-01 5.385392443816449104e-01 4.855906089114085666e-02 1.916800032672833984e-02
1.713064022015507379e-02 2.167999273681014277e-02 1.439197885011293809e-02 1.769638302310152025e-02 4.136538851534204281e-02 2.359021928695968079e-02 1.209869348256669974e-01 1.549532928308842705e-01 1.425721880093938632e-01 3.374589666979406488e-02 8.509592342073199478e-03 1.801983859517058929e-03 3.179689819299064656e-03 9.477384176240465086e-03 3.789645566553249967e-02 2.568817302927330071e-02 4.672913915627324721e-02 1.378813972133436511e-02 2.574555601646515840e-02 1.209945086593283148e-01 6.460313610847052690e-01 1.218741026191521026e+00 1.307641306665900061e+00 1.254479349363717411e+00 9.752117302025868906e-01 7.225082186172617771e-01 7.060116382668304436e-01 4.756630659486419388e-01 4.282343041027060482e-02 1.524309772560833269e-02
4.879482566466265825e-02 4.399506980594700134e-02 2.244247778852786340e-02 1.597404614456779393e-02 2.052237165719824480e-02 1.089508272714223916e-02 6.165842872530123697e-02 5.451135954573108067e-02 1.489493410925235226e-02 8.139728241837583533e-03 2.822405403540214318e-03 2.256639454682290904e-03 1.278904677915095878e-01 6.983405984882884443e-02 2.133153632438100199e-03 7.408809293170769486e-03 2.624926991582495275e-02 5.943114616900751351e-02 5.676292815552535370e-02 2.514230135867990268e-01 6.816435018964536185e-01 9.852816336018098697e-01 4.007359937907979397e-01 6.078228276379874506e-01 7.948998035807228746e-01 4.557255342861135650e-01 3.436740324970210536e-01 2.822504585966406077e-01 1.034504380826209609e-02 9.350739238820701335e-03
3.948567512117936301e-02 4.475472841067918567e-02 6.555396840334295865e-03 4.491718916277799740e-03 3.640797371912680644e-03 5.375136822033231392e-03 7.608002306216769817e-03 1.879862914220343031e-03 2.415326337051787713e-03 4.056628573412988242e-02 5.276440752486151464e-02 7.981598337366446749e-02 8.803806766204502754e-02 3.477482404414272091e-03 1.024256301569265865e-02 1.376950069706466273e-01 2.596137597725338697e-01 3.716416852887053923e-01 2.512956511383426239e-01 1.882783426869156507e-01 1.330198292376066072e-01 4.756794528902974495e-02 1.837462970937920465e-02 3.997319322075873482e-02 1.467072842659595533e-01 5.031305852811683577e-02 4.697942458900148527e-02 1.587902367747160218e-02 9.395571378240646920e-02 7.687211960016143708e-02
8.258993780543032182e-02 6.274966705185661131e-02 6.742070729712652463e-03 2.882556498701525916e-03 4.179465694533218527e-03 3.227864623635972284e-03 4.940419291930344195e-03 5.512752347195603447e-02 4.683100555552285882e-02 2.015304976013966576e-02 4.753468257730539270e-02 8.947632446779196780e-02 1.188475632430681661e-01 7.081750126138630294e-03 1.219276735682964415e-02 7.957818017554575685e-02 2.861640367400242191e-01 5.278917104935869631e-01 5.927703441989795596e-01 5.149289630538856910e-01 1.104759561908778137e-01 2.479685240949971309e-02 3.078218006947634755e-02 7.567364174745694338e-02 1.699179025696239687e-01 5.056358628517181042e-02 1.959350508293568327e-02 7.394929377829027352e-03 1.207123924619338262e-01 1.084209734366896605e-01
1.023017600466882560e-01 1.288991228309651141e-02 3.540037571491095984e-03 1.048260932142864033e-01 1.251929994417799175e-01 2.801344958957598975e-03 3.571553620172527362e-03 4.142839806904578814e-02 2.301403315252515888e-02 2.644137540299064393e-02 4.659140433008047977e-02 7.917749540823439125e-02 8.953329431216670853e-02 5.451407749158663184e-03 2.240024612952633970e-02 1.132775187562664460e-01 2.161053932985932680e-01 4.919835627260199518e-01 6.137873678451091219e-01 5.215833776801497290e-01 2.643987732325532858e-01 1.542415607322831714e-02 1.103846944487267036e-02 2.392144689039358424e-02 1.382704130161324096e-01 8.317461440149043206e-02 7.539920536537905726e-02 1.423367204595782538e-02 1.067707631066678181e-01 8.213793720924598973e-02
5.673210144527358889e-02 1.739797914604727935e-02 6.686281008344012629e-03 6.179052676109822624e-03 1.370264296012823832e-02 9.289067369164835664e-03 3.796502078387434774e-03 1.607004519922615171e-01 2.260738790695086212e-03 2.974011385244656417e-03 2.901164003495227545e-02 3.252184390694215499e-02 5.068373538673427714e-02 1.148920609020540606e-01 8.035111702618316989e-03 3.455772808940989205e-02 3.459665364191329140e-02 1.472569346283946756e-01 1.882484193086278457e-01 1.632669055022359372e-01 1.402530235941278070e-01 1.844766617725762323e-02 1.689984706392486935e-01 5.630555114704201627e-03 2.491635428236908117e-02 6.227601700503596072e-02 1.677768564310133381e-01 9.471656321942595325e-02 1.258791314688313956e-01 9.519223390419720432e-02
2.031387678865770319e-02 7.980569092510395035e-03 8.422162276251997370e-03 1.409313063201792816e-02 7.695022281893278832e-03 3.421234638616107472e-03 1.584382499211342277e-01 1.127900234560311188e-01 3.352698739974005991e-03 1.308955860677383717e-02 9.334941024195755888e-02 3.199968601140878305e-02 5.412076444663151131e-02 1.188829186642855612e-01 6.515649515878740861e-03 1.233094884748458901e-02 8.504947230299340910e-03 4.232965925058989470e-03 6.705133867365825270e-03 1.239146803294885468e-02 2.264749135197474672e-02 5.299873545856381013e-03 1.695726823331697997e-01 1.440127366354867523e-02 3.525801932017226525e-02 1.255964774982348819e-02 4.349113602090562414e-02 4.888389565800438374e-02 1.739853270910490454e-02 1.457032229266858880e-01
2.059525881982542453e-02 1.637008534208125518e-02 7.881045460566223765e-03 5.739253763906106490e-03 5.340926698338554698e-03 1.988838509746852085e-03 1.323409526380152634e-01 1.373778692910022636e-01 1.529091946560233728e-01 5.731360075915691715e-03 1.627490954225804809e-03 1.553925130377991010e-03 1.508575870388682849e-01 2.046371647079419948e-03 6.319368820901136684e-03 4.699226602379816958e-03 3.311253618185708465e-03 1.577458482175542742e-01 1.399852923330777432e-01 1.078413724452690903e-01 8.576540850572043906e-02 1.252122800757777821e-01 1.990782396176228319e-01 8.041026306324722261e-03 1.455814293025580602e-02 7.181128341428047457e-03 1.172309520159026293e-02 7.831757974522998711e-03 7.921664909189380169e-03 2.813913389489205996e-01
2.790190324816377992e-02 1.441073916728961499e-02 8.099964361560366144e-03 1.100672713873206837e-02 9.668243148361491471e-03 5.206349242817837758e-03 1.755127481779550358e-02 1.310773854354976148e-02 1.917196006692905262e-03 1.479671814843033228e-01 5.230907039702299699e-02 1.191614369455057387e-01 3.604942468186119950e-03 4.290006653233687482e-03 1.424773345878640150e-02 1.143856215344308397e-02 3.781660017352241662e-03 4.689040797862135089e-03 1.673245245816448179e-01 7.316312914382065713e-02 6.644017156891629527e-02 1.013978396073695887e-01 1.576545317576937555e-01 7.728542838419729180e-03 8.481515060109847889e-03 1.288901786170079944e-01 1.454070494073876896e-01 1.846464941530376880e-01 1.081201136801417974e-02 1.230219467489203355e-01
3.742870319176714450e-02 3.208679615358583925e-02 9.623817786766672433e-03 3.276757229067767119e-02 3.799860633850726810e-02 7.104737295634915017e-02 4.726718501786679461e-02 5.306122716997235811e-03 1.896807458143949781e-03 1.164339363659865345e-01 3.408666887889423569e-02 4.225385906338043063e-02 5.304997262100453331e-02 2.352210239572572695e-03 3.196109605877653966e-03 1.269242931640925387e-01 1.255485560314811844e-01 1.521676072951681780e-01 2.088654938025686358e-01 1.145158898532360331e-01 6.213633952911108704e-02 8.415488138843421617e-02 9.430416514117717641e-02 1.661287051552243210e-01 8.532462857698914702e-03 8.918599547696762220e-02 1.320995256634688864e-01 2.157695056668643974e-01 2.533814012208012167e-01 9.715090545292820456e-03
2.042818221804006823e-02 5.039852097132957454e-02 1.494982381941507149e-02 1.599583229428840070e-02 7.738618267183887400e-02 8.163229153912832103e-02 5.441664976385987562e-02 3.735677048551998107e-03 2.632792987888019770e-03 2.519242536405504312e-03 1.059853499115388786e-01 5.206201076267437389e-02 3.367427404380957112e-02 6.033582625052483217e-02 3.530110237061141916e-03 8.878304082339934233e-02 4.235469770642629091e-03 2.711512255948444333e-02 5.061189730406786408e-02 7.100859160075656887e-03 9.320781544046335965e-02 1.176179180524529466e-01 9.976825415875537062e-02 1.146878448273591922e-01 1.594794060578032524e-01 1.268732347600769472e-01 1.529346555817398534e-01 1.891788835667684021e-01 2.472196370275360489e-01 1.221636447509581030e-02
