6.700119427451789456e-01 1.199930028402910326e-03 8.656522215758799543e-01 1.335313517168676455e-03 8.271139015377269033e-01 2.210428762339396863e-03 2.164806148214805902e-03 5.786817153121653901e-03 1.041779985339131437e-02 4.718042620544386258e-03 2.215753642880748196e-03 4.382183499915470182e-01 2.604860966449649706e-01 1.072281071983407531e-03 1.216169702070824888e-03 2.675351642734987712e-01 8.812800781357306521e-04 1.467222675808151858e-03 1.263273345751061982e-03 4.246274401012694591e-04 4.827661132499375674e-01 7.014211885173472771e-02 5.447893125470980313e-02 2.153333256338557655e-01 4.117050618814567242e-01 3.187437078858879058e-01 1.455975942167535842e-01 1.282981851692675292e-02 1.214032221021300179e-02 1.512084535671326044e-02
5.127669347684873369e-01 1.407021045439352420e-03 2.544324675675523062e-03 2.070740401411978911e-03 1.443177262734488160e-03 6.438586507789587771e-03 3.034494465048538734e-03 3.725582410592354673e-03 2.392035041509477100e-03 2.039292873515153280e-03 1.462091985612380771e-03 2.579142913459510078e-01 3.497061374894020469e-01 8.461932097478611905e-04 1.153441259884460581e-03 7.270023030796150375e-04 8.595196793520067189e-04 2.653264628882797630e-03 1.889636840249828142e-03 5.397462226481174099e-04 2.906939717237116971e-01 6.541502726528117262e-02 1.375312394848992315e-01 1.209314211726906507e-01 1.050922295208050056e-01 1.389478924631027124e-01 4.879186553162187523e-02 1.263335103337154958e-02 1.798349305345494503e-02 1.800140936756555038e-02
7.962776608631712272e-03 7.785136396440046382e-03 1.648612998364711035e-02 1.330132400701648440e-02 2.845313319814574138e-02 2.888798858588747555e-03 4.390750716805259524e-01 4.665076472053106826e-01 8.845805279987826314e-03 2.689399451561853317e-03 7.240551809272605110e-03 4.790175107573780428e-03 1.742611888949453141e-03 2.521299055626481569e-03 4.947222324838937979e-01 1.957338267128561331e-03 1.248373847054938882e-03 2.399651490228069985e-03 7.475364439563354432e-03 1.170449535990290835e-03 1.817158758719073508e-01 5.293541706874642372e-02 8.098399266504249794e-02 2.820223365814544109e-02 1.668101294374094504e-02 1.098687276550563974e-02 9.724957979062608115e-03 7.716146366680884557e-03 1.312753768494752567e-02 1.487727386504082011e-02
3.644981182602628593e-03 9.966595655133150822e-03 2.190842659393012204e-02 1.755945075516616646e-02 7.282629260593833503e-03 1.126436111616224700e-03 7.450383990256305156e-01 4.988550609168415084e-01 3.019413958767345751e-01 3.340029677266711898e-03 2.147278625794796052e-03 4.277468368375685406e-03 1.919273012962238473e-03 1.261313749756767322e-03 3.657859943047152562e-01 2.848458820303348960e-01 6.104804457893251435e-01 9.454150530663653351e-04 6.358372215132886054e-04 5.146101058192941715e-04 3.519290833611956604e-01 1.212601294862436646e-01 3.800515863514092318e-02 7.300029169658822648e-02 1.350246648591436199e-02 9.874341220571677263e-03 8.392583383643861805e-03 7.974885114347737142e-03 1.596721702437520554e-02 1.764740663262246226e-02
2.080536362576774611e-03 6.139494605760632308e-03 1.709754059150692812e-02 6.622868698333471416e-03 3.827055262390272050e-03 4.734903141151082240e-01 7.261223083525223387e-01 4.044260790081831702e-01 1.854189738939805432e-01 7.746777489665853701e-03 9.716941011720959046e-03 8.366142180873923501e-03 1.225551053514577389e-03 9.888027437902082405e-04 4.320707941504292604e-01 1.629547878179636033e-01 1.638276867044828437e-03 9.031755860702101422e-04 1.400552109333578869e-03 7.679961586487219372e-04 5.065124875871104219e-04 2.023941353178503877e-01 4.497218969342420269e-01 1.224432527585980757e-01 2.429701420257435532e-02 1.314395304217627972e-02 9.048061175202017428e-03 1.056083975580620650e-02 1.636119680586808900e-02 6.152804750371328180e-02
2.045788644468843516e-03 2.038753536884399704e-03 9.124518199234940910e-03 7.294192180365328265e-03 2.899969829317732180e-03 2.728574008540119999e-01 3.306549135620779900e-01 3.529465296363714089e-01 3.249596538403219936e-01 1.204771575315361290e-02 9.516671743046985904e-03 5.082449508151489805e-03 4.673291091863088775e-01 1.440616061340956877e-01 1.109178918889254239e-01 1.830415551797601736e-01 9.285496008460175556e-04 2.572494921921388844e-01 7.481248404688099676e-04 2.495953715086502572e-03 2.893355518265701854e-03 1.621501469058403682e-03 5.751887845497659635e-01 7.376942118920017111e-02 3.638655543083323812e-02 3.441019099140023296e-02 2.122004014698644289e-02 1.482430820366989303e-02 1.939793472042852102e-02 3.592558522912973201e-02
2.379884920319049191e-01 3.811625500970181601e-01 4.024355137753936051e-01 2.274659216987652294e-03 1.087289095357450632e-03 1.823181455935048503e-03 2.815375727701255326e-03 1.632427361278542769e-03 1.965266598558405766e-03 2.327371466337079583e-03 1.816648752004019519e-03 5.837140041087365283e-01 2.412415779954478479e-01 9.512422814403498350e-02 5.048595194487705967e-02 9.047898711153122553e-02 5.395241858607484620e-01 2.585771767597369597e-01 1.264119281835792297e-03 1.689675336059574774e-03 7.374407199315219635e-04 2.158640288531306350e-01 8.591290314203101075e-02 6.698348085337225977e-02 2.486606109484479354e-02 2.560711996326472603e-02 2.218011799433794451e-02 1.960226501153416317e-02 2.269989553497071821e-02 5.571569442933485550e-02
5.018847786898947838e-01 1.117896406941393510e-03 5.441295042354925560e-01 1.384116122928716807e-03 2.097977875429664091e-03 2.361708537655868301e-03 2.116107188683227780e-03 2.015224168592574718e-03 1.633283218262211820e-03 7.603304480616458472e-01 3.034613511457150414e-01 1.186732876664658640e-03 1.985046357592053223e-01 6.638228879181105879e-02 6.830794066241135942e-02 1.267596512722991287e-01 1.117388848161439928e-03 1.763115312589897971e-03 1.528162511666359465e-03 1.062656791359981165e-03 3.165160020569448562e-01 1.515789503161884266e-01 5.166130188921038563e-02 4.026926805569903955e-02 1.898545455223191528e-02 1.995310340570261715e-02 3.067838470262272688e-02 3.930588963594117136e-02 3.998508147224519305e-02 1.206200823449347370e-01
1.699665876726322343e-03 8.473431782699718529e-01 4.993996975736752497e-01 3.623726900866011853e-03 2.313078248111507564e-03 8.010251610920551268e-01 3.157461377713540428e-03 1.418841140634794287e-03 1.191964975643671322e-03 1.191289012939955854e-03 1.074208608222046619e-03 1.429677900436167760e-03 3.110808048880155195e-03 1.994570547607515520e-03 2.470046474800016156e-01 2.265598827757294431e-01 1.104196920404161520e-03 3.293860404083269033e-03 3.194393727669973555e-03 5.357015467271757370e-01 8.630787657409721980e-02 6.750470792484791760e-02 6.421009516848588672e-02 3.947670872940513970e-02 2.288427089311152046e-02 3.522641651488685188e-02 1.321369272945702722e-01 2.710339785518524613e-01 5.174541721270792824e-04 4.026023765792600129e-01
2.884627340913046775e-03 1.865192303649945357e-03 2.944038552692069145e-03 2.693096571575618291e-03 2.309620600720162925e-03 3.676819985441680538e-01 2.092984981265216642e-03 7.492042472899747008e-01 3.195421856634395041e-01 1.187756804568043945e-01 2.043022054773710981e-03 1.995850751456758766e-03 4.224836704995183802e-03 4.557479684279455712e-03 2.165525147996237403e-03 2.348488596597400092e-03 1.233457900524061526e-02 1.252243172241761585e-02 4.929581837406354916e-03 2.139627319678679643e-03 1.074312065477117939e-01 5.144030889080174196e-02 5.284980598209881864e-02 5.554059293252183727e-02 3.037617820905362184e-02 3.917894334487895258e-02 3.689560007236849515e-01 6.437067512674494729e-01 5.665117728141850530e-04 2.175331622391058206e-01
2.422293732780476765e-03 1.259284406611124816e-03 2.777619860096411462e-03 2.319291700248310092e-03 2.879539027130281932e-03 2.135214068680176824e-01 1.819969429417408191e-01 1.605478107178903713e-01 1.019863698858096690e-01 1.022957527609788227e-03 1.608219969212989348e-02 2.677947747374053583e-02 5.545524007343573258e-02 2.754274895287672081e-02 5.116621902478627436e-03 1.000417278193122678e-02 1.827558426180771189e-02 4.968131276184025065e-03 1.165856153902422110e-03 2.163484015673725613e-01 7.432135815557960878e-02 5.186909823926000307e-02 6.154425571893561153e-02 8.384660129046797583e-02 8.837387802795605707e-02 4.774224753592021947e-02 7.547451036387461953e-02 6.110285722574428091e-02 5.525451023463896771e-02 3.995106421522324341e-02
3.363247216612013091e-01 1.974548824455745200e-01 2.272546892883668766e-03 2.189464929165388200e-03 1.671189591682098073e-03 3.107629724010823047e-01 1.223530869943208338e-01 7.940490621437444607e-02 9.918056045748296912e-02 1.981357414558237561e-03 4.815071737996655735e-03 3.139090926050069896e-02 5.647399023448347599e-02 2.962938550309715535e-02 1.084981110707481863e-02 1.231919206273348125e-02 1.349310762306897733e-02 7.901859649284298862e-03 1.930272668336206927e-03 4.685167870924234479e-01 6.945741541207138547e-02 6.164529462745103883e-02 6.960203135364166627e-02 1.234042950414100948e-01 1.175777511746144144e-01 8.352523651908838609e-02 6.378397047809557241e-02 5.773472334165595521e-02 6.156485645456706568e-02 6.564841589913647524e-02
6.502641631684953627e-02 1.677458711139649949e-01 4.088466996598443814e-01 1.468113905771925402e-03 7.577218650314058168e-01 2.420679743037356113e-01 1.250274932364465463e-01 1.053680179721538657e-01 1.338075228853339016e-01 9.799125568956462348e-04 3.131834297385269750e-01 9.930203213091889913e-03 4.185652258302873657e-02 1.811914411585711232e-02 5.780976399790574080e-03 6.761662003233512297e-03 2.497322358205952483e-03 3.660186227648309226e-03 4.163303767304569851e-03 1.549261155401491933e-03 8.407866667379920722e-02 7.539663588915193615e-02 9.072143524427675465e-02 1.556906755462145187e-01 2.043705007247868521e-01 1.924063869722333342e-01 1.425331816071966906e-01 1.285062303111022264e-01 9.692177051587407000e-02 7.406051887554149227e-02
5.167609355997786896e-02 1.487740840029961042e-01 2.725467211498018849e-01 1.989094559394957162e-01 1.176645635497960835e-01 4.677503993202798416e-01 1.808419715901361108e-03 1.483204240732825720e-03 1.938638835897539270e-01 5.949164459441631803e-02 2.375611255410032263e-01 1.591562059317650976e-03 1.886504698230865099e-02 2.589593569769757520e-02 2.810539148599227460e-02 3.852167014574261333e-02 3.489811335286185229e-02 2.270858889357794952e-02 6.215957610994288229e-02 2.906161685976284617e-02 2.391384825391323302e-03 5.276917427387026738e-01 3.970109016815500658e-01 1.275747290606607173e-03 2.971635163021639839e-03 2.772775964932496211e-03 7.524213532482717723e-03 2.361882585086742987e-03 1.571860527031510579e-01 1.503970132292016260e-01
4.628471097754184582e-02 4.661470723556255386e-02 1.296873566214117035e-01 1.156200203453846675e-03 3.550289813889739299e-01 8.391589473476114558e-02 1.194480376305938167e-03 3.375820142348037733e-03 2.229624184298514313e-03 2.382997445913282997e-01 5.084797794898416878e-01 7.738719981459691102e-03 1.644399603806166732e-02 2.121081119950180699e-02 1.951251709088091049e-02 2.400351082868484864e-02 4.145667549142807717e-02 7.241552586132667113e-02 7.470429164758246587e-02 5.974616472579998006e-02 2.561971358097596841e-03 2.676253324056756221e-03 2.347925603156975159e-03 7.399342069436707844e-03 1.067839799717592436e-02 5.462426850889848251e-02 5.444334352709688518e-02 1.062827009461507141e-02 1.838618361690868563e-01 1.095260140978568109e-01
4.035009357234925487e-02 4.413262200919478018e-02 1.025654519171252804e-01 1.145628726896083249e-01 7.645873156779225965e-02 8.756794581272744904e-02 6.236186643805037289e-01 1.801633531237047375e-03 3.699128873508891833e-03 1.317345936567471728e-03 1.348354455554446338e-03 1.154607919176071180e-03 8.980597273809485387e-03 1.863273896507410335e-02 1.781796714736523859e-02 2.789163596751746688e-02 4.905865831747510675e-02 6.076240822278035358e-02 3.596768896213031058e-02 8.025353155062458360e-03 4.833995440625459515e-03 3.316004782047764915e-02 4.788677070958985427e-02 8.100396460095070361e-02 7.666747154112679707e-02 1.001334575300056179e-01 8.045702824614962834e-02 2.258241268634226043e-02 2.905413173984903730e-01 1.307706722712613234e-01
4.876127785612426047e-02 5.668900544936321395e-02 5.707423630248258106e-02 5.528044611094902472e-02 8.543605337493200003e-02 1.791179676673861354e-01 1.041556958076397636e-02 3.470083717446005578e-02 1.688021206964188115e-02 2.849743105625242127e-03 2.075531690237444708e-03 3.144715169408211167e-03 6.210029605888554328e-03 9.417178108688920718e-03 1.275320556677083002e-02 2.342402680887155364e-02 5.171364356185335909e-02 5.388859413099073015e-02 2.643611473145018528e-02 9.311564417030529506e-03 4.005133225425122623e-02 7.214297148225107259e-02 9.191774933880161869e-02 9.557355753677834742e-02 8.526677735854669427e-02 7.419275189328360109e-02 1.100850592495429825e-01 1.905046945275672837e-02 4.346390594747168157e-01 1.848785284562337872e-01
1.165150295409425329e-01 9.202137791538461675e-02 4.916876616470494676e-02 7.896716129746633728e-02 9.785177590565384727e-04 4.949532252178804291e-03 2.769416664109016282e-02 2.254746978143493466e-02 2.213831749232939364e-02 1.091679497393204315e-02 3.907215553520121572e-03 1.016161722401918901e-03 9.926430934170476193e-04 2.639871344401050878e-03 6.108209936892480124e-03 2.883997939286512754e-02 3.135346033497451307e-02 3.823315422194584201e-02 6.924729921254603980e-03 1.255280323406252237e-02 4.437167653278235868e-02 9.547098288493668927e-02 1.173889837290096327e-01 1.237415238091165437e-01 1.039606252675117637e-01 1.008450920799002504e-01 9.384352470440397720e-02 7.437242302283485207e-02 3.298421305468425026e-03 2.172833028746208855e-03
5.221272486053135653e-02 1.455154428463889538e-01 2.757603432379374109e-01 1.740854212695616774e-03 3.793619918020210442e-03 5.352913545111016164e-03 1.696739324285922307e-02 2.115217841843735486e-02 1.451778280385031261e-02 1.117226130194831808e-02 2.312203238758737695e-03 3.007552617215042412e-01 4.524952534379633184e-01 9.881499287919756364e-04 2.202316490706931855e-03 1.332756509472266329e-02 5.253500163022371133e-03 1.747836414145210538e-03 4.983977173352631684e-01 4.497496390127857235e-03 1.713819312267857164e-02 9.144867602914621973e-02 1.162370454671300957e-01 1.238429674743052322e-01 9.199747206376684971e-02 4.301399930126604404e-02 6.978560722612192624e-02 4.789430435957477833e-02 4.318232054713237386e-03 1.704408259149168409e-03
1.266572865550851792e-03 1.579969834237142986e-03 1.034022132236967362e-03 1.250223219675619018e-03 2.865983371352758338e-03 1.634336976755631794e-03 8.448162911222053054e-03 1.089203146380916115e-02 1.006299940350176628e-02 2.367184444384889605e-03 5.923334669527456848e-04 1.792642108464547746e-01 3.080890833215547131e-01 6.739664038089923388e-04 2.749567926193696027e-03 1.897662673450760482e-03 3.571036173895631056e-03 1.089433919728077446e-03 2.099553141756230114e-03 1.012362623859908856e-02 5.500702423275856401e-02 1.054259068709786085e-01 1.147595824045069268e-01 1.112925139628449939e-01 8.697429458838584759e-02 6.449496936947518577e-02 6.283293098963775580e-02 4.233159724386680034e-02 3.810917144108225390e-03 8.864859186585469786e-01
3.469711373935204304e-03 3.074321816272800739e-03 1.536940485573550213e-03 1.068681094575001187e-03 1.337249081562808146e-03 7.094105560630777985e-04 4.045863469862028862e-03 3.599606665118455090e-03 9.890275721784987702e-04 5.444803220891229149e-04 3.014055668399186483e-01 2.365158912771109234e-01 1.390869752755246602e-01 7.544120284505086149e-02 1.916859220152030696e-01 6.314380331178937045e-01 1.925555483081323876e-03 4.503780743974175431e-03 4.435904412697597513e-03 2.022903342998924256e-02 5.641433854944952198e-02 8.374097380834777393e-02 3.490895504189402837e-02 5.365027090076701644e-02 7.060907228998436480e-02 4.057590827973038550e-02 3.053779038806284443e-02 2.507962570642031930e-02 5.787555902068134417e-01 5.280656151227982598e-01
2.772975072167408340e-03 3.090955863927714355e-03 5.950136219992608888e-01 4.374758607283507073e-01 3.829969989040087341e-01 3.391418133890836237e-04 4.829993771082217264e-04 2.178260835830066466e-01 2.862518918095179887e-01 4.440984374832500359e-02 5.772933683825656748e-02 8.716873580980250003e-02 9.566036931477248095e-02 3.371157612338367415e-01 7.073493424377911426e-04 9.575716769614779633e-03 1.862361426925560406e-02 2.747883510389170086e-02 1.911355460028878184e-02 1.475392185734124284e-02 1.079421236463869865e-02 3.990321131572956322e-03 1.590559661593072497e-03 3.512759923497234694e-03 1.299254625719209466e-02 4.475812883515126531e-03 4.183840525657593276e-03 8.683493081373219180e-01 9.965151792226994987e-02 8.151889293428465910e-02
5.861703900034036241e-03 4.395028453213373557e-03 6.208952333937227674e-01 2.816936989879512687e-01 4.356813929188129153e-01 3.494698416008586439e-01 3.146187969243051537e-04 5.995159219393308980e-02 5.117077829234174813e-02 2.200524948582595341e-02 5.185536607222153427e-02 9.750252633297745719e-02 1.290981683250057299e-01 4.832066894511208906e-04 8.470232166901832914e-04 5.613908777135316955e-03 2.074832648654453132e-02 3.929800304392961491e-02 4.523433203767922989e-02 4.041354609577636758e-02 8.976929571145975811e-03 2.082158023669967647e-03 2.666891642825268503e-03 6.641125181130845025e-03 1.501236026296069725e-02 4.490983134214344974e-03 1.057575354481113283e+00 4.101580139932495261e-01 1.294641352780326327e-01 1.162456683171785299e-01
7.277884581947209261e-03 9.065445637198279918e-04 3.315163724031325310e-01 1.129466408967509522e-01 1.339496776120321642e-01 3.003203017036325528e-01 3.944933923538714859e-01 4.493124154400643389e-02 2.507801750401095209e-02 2.878536869727638114e-02 5.067045055164942635e-02 8.602783297065103030e-02 9.717013046653480424e-02 5.365531181946952000e-01 1.561214441860617544e-03 8.071758666725513398e-03 1.576847811608237532e-02 3.670628584585135246e-02 4.667031030736090019e-02 4.065021943742230109e-02 2.132787635764523543e-02 1.284993111334515508e-03 7.099768327609179419e-01 2.074888279163503938e-03 1.204548638695592672e-02 7.274390856592073684e-03 6.620323698130107549e-03 7.524265766035063141e-01 1.154061992065324171e-01 8.873244411588572522e-02
4.019474655410058134e-03 1.223623784759505714e-03 4.626895245235334545e-04 6.119316390037734532e-01 8.846667569615996197e-04 5.926094226393406432e-04 4.164917978019903044e-01 1.736481535560671641e-01 2.632862832564568656e-01 3.401561556505077188e-01 3.145029567793503067e-02 3.522591213338548133e-02 5.494312716043314032e-02 1.247631346631876137e-01 5.606626479915083989e-04 2.477976502382925848e-03 2.530293336638022444e-03 1.094870840302966317e-02 1.418780356721060371e-02 1.257585265404676488e-02 1.117808894611529644e-02 1.516842404535597745e-03 1.847032055745974621e-01 3.505649638282556935e-01 2.124579146679388391e-03 5.317801121176506801e-03 1.436993839296618614e-02 8.175506124850179593e-03 1.368684266712328901e-01 1.034364339995233056e-01
1.437750851423281063e-03 5.610494152127475272e-04 5.831758516348021885e-04 9.496297182315959536e-04 4.968173947042879004e-04 3.631581540042525535e-01 1.701866040110955325e-01 1.217819513576603174e-01 3.903065491075032312e-01 8.304452967498460181e-04 1.011112062994128924e-01 3.463085453567082278e-02 5.865062900979715194e-02 1.291696978123954009e-01 6.141410842143337767e-01 8.852941860136864533e-04 7.333840795598154383e-01 3.531372797227788074e-01 5.416996771094909624e-01 9.472620787303473672e-04 1.781267564482608666e-03 3.672528692081014068e-01 1.848081491367212226e-01 9.357189728013002306e-01 2.954050190559513213e-03 7.556238698076646054e-01 3.679403515558879803e-03 4.171388583039276413e-03 1.034268455661928598e+00 1.586535881673754589e-01
1.457606650864932442e-03 1.150726678275640867e-03 5.455837308548409318e-04 5.696846925340270928e-01 5.495036186279377288e-01 2.111802327898437415e-01 1.421613796595121437e-01 1.483372773352092666e-01 1.657795722129886129e-01 6.558846248684281344e-01 1.834615384330764709e-01 1.729176274970220528e-01 1.634885736900371644e-01 2.046134729549233811e-01 5.952273382116268774e-01 4.187223840844593314e-01 2.853994610154303446e-01 1.721255105272994912e-01 1.524751786497655082e-01 1.173113960714696064e-01 9.332591080465338362e-02 1.362941686760719695e-01 2.167900166842258447e-01 5.428316639925582221e-01 9.554187354852785585e-01 4.587771825174805640e-01 7.348050261371881220e-01 4.721009534784031958e-01 4.748715561823423359e-01 3.064005937960470050e-01
1.974654446283394954e-03 1.012898679938001876e-03 5.606130066862973025e-04 7.411496519239505615e-04 6.236131556745398491e-04 5.529854540802640051e-01 1.117385614697885728e-03 8.304490290339308894e-04 2.231149464258876947e-01 1.603901239181405591e-01 5.665747915004037960e-02 1.289574611245646873e-01 3.836524405706034924e-01 4.286977101747135865e-01 9.950076442538937325e-04 8.216242951109601570e-04 3.258342628809580699e-01 3.908720006403682001e-01 1.822499117677754965e-01 7.958347944512784988e-02 7.228160018060365843e-02 1.103305953610739382e-01 1.715714979216838298e-01 5.471775252180298699e-01 5.751158070076006767e-01 1.405047409964978455e-01 1.585784589132584466e-01 2.012655506586774612e-01 6.421460584072499200e-01 1.339735860969641368e-01
2.648386946015842021e-03 2.254337795175907679e-03 6.652769760180578425e-04 2.202997144077720616e-03 2.447601960407235280e-03 4.526112729581626554e-03 3.003687294696623985e-03 6.008581058851871770e-01 2.201445145166823769e-01 1.260937064342063374e-01 3.690084486806292918e-02 4.571566106252121509e-02 5.748990743898343969e-02 2.346988994798326345e-01 3.005411080290419368e-01 1.383305706966188597e-01 1.370518743225905278e-01 1.660331620919084095e-01 2.274763078162824192e-01 1.245649297620737700e-01 6.758527362319959042e-02 9.153551672993946731e-02 1.025761336897429432e-01 1.807846702777326509e-01 5.948827698433811761e-01 9.720274686125982000e-02 1.440647522270045167e-01 2.351935243777320550e-01 2.761331541808323964e-01 5.633315733133907877e-01
1.441582443036327739e-03 3.526697961021823396e-03 1.024678737587177537e-03 1.062985992124369219e-03 4.938593473458495302e-03 5.128207328955728186e-03 3.386523407753698652e-03 4.138029857140921863e-01 2.965697916089128916e-01 2.784906013360335941e-01 1.137300643597356220e-01 5.604484053825762452e-02 3.641492222512571209e-02 6.557939058597392346e-02 3.237355458497802596e-01 9.719397194912778037e-02 3.516133517999759373e-01 2.076947432255651406e-03 3.943716774259850566e-03 5.195215908343475686e-01 1.015209337425199143e-01 1.281064487050446177e-01 1.086636064795029055e-01 1.250242617863558114e-01 1.740624632679315942e-01 1.386688442752340988e-01 1.673775520794732463e-01 2.071520762344954414e-01 2.709285028461480005e-01 6.823882524543533057e-01
