3.505120707659378221e-01 5.071314245820452982e-01 4.301519020483490219e-01 5.340925133051127593e-01 3.753059519529161614e-01 7.828098757815562525e-01 7.133421681337990261e-01 3.248862422901829805e-02 4.674144282186443178e-02 6.053478697390064778e-02 8.763413969076517818e-01 2.290570700202571031e-01 1.504999631184354147e-01 5.941025692568255856e-01 7.343914448345731927e-01 1.739410392229163438e-01 6.560348015604745564e-01 1.580868022439620157e-02 7.860133511936765599e-03 4.827923300528953465e-01 4.470998677208916083e-01 6.612362785236287899e-02 5.006943512251073314e-02 1.997820945116825508e-01 3.899505387337607876e-01 3.081884234805115086e-01 1.426732703409652747e-01 1.257961850183401085e-02 1.202349512973596886e-02 1.513600620675597391e-02
2.297151716318364678e-01 4.882061880649148367e-01 8.604371567483571903e-01 6.486819363681448625e-01 4.471077965743771032e-01 8.611664310140576539e-02 3.436206299147630261e-02 2.641405571308774736e-02 1.258266925114096858e-02 6.594055355899226534e-01 5.350194547433912984e-01 1.174858713544393862e-01 1.765282842584485201e-01 4.554361295327111758e-01 6.659562665720153429e-01 4.778395945276114887e-01 6.092264644853626621e-01 3.798281235563858577e-02 1.153229714661289235e-02 5.777991072399767392e-01 2.567535898450576948e-01 6.362851984802644911e-02 1.304630074098984960e-01 1.165233182464476824e-01 1.041363080454162093e-01 1.412263529504815263e-01 5.013913143025258007e-02 1.275865381811441650e-02 1.816774468096718845e-02 1.817101047751517109e-02
4.846070454424108997e-02 6.356606013201684946e-02 1.301077782389227777e-01 9.432017139417893381e-02 1.667538800967997004e-01 2.994068056332330197e-02 1.861227074316204044e-01 1.954099170802768015e-01 6.811674190204024260e-02 2.039878443695743171e-02 5.675802281083978246e-02 6.944713494645128604e-02 7.966346644260622334e-01 9.167834037695658800e-02 2.726049708054578136e-01 6.094695645228939695e-02 9.341786833798378931e-01 3.640803239305159117e-02 6.585015439836924833e-02 1.368337993277984888e-02 1.621620462106260208e-01 5.285848932252085186e-02 7.947650987508556031e-02 2.763247801860358940e-02 1.659150942953295169e-02 1.109115213808901414e-02 1.002592783747520248e-02 7.876789885175440251e-03 1.343376794648166138e-02 1.505786630307381392e-02
2.073460348052493657e-02 5.567920651249631814e-02 7.293409783012572145e-02 5.877185544041103882e-02 3.794603883961430307e-02 3.782105839123223179e-01 3.768827447713116174e-01 2.344134924659221353e-01 1.271692159245056408e-01 1.619761226086331024e-02 6.662024902720844466e-01 5.098959837157154146e-02 7.823378892147923036e-01 6.357439721368476349e-01 2.001873680310264358e-01 1.713768464221351873e-01 3.775448056845057687e-01 7.433153678571915446e-01 5.832940649913451736e-01 5.408299974044447067e-01 2.950679841979846341e-01 1.129287133924304076e-01 3.742899581778287577e-02 7.369289146895453835e-02 1.357605460126033378e-02 9.774096569138262039e-03 8.450389612102976802e-03 8.031782737322322452e-03 1.633034251761861580e-02 1.776629303265313264e-02
7.290309151691922729e-01 8.078908522696365280e-02 8.730259627474434847e-02 2.214650085399863175e-02 2.387835383843897943e-02 2.215093129961607787e-01 3.879989956246955307e-01 2.190408729598397330e-01 8.071231690167199324e-02 4.270386530666935021e-02 4.030935339426963693e-02 7.990928262542085214e-02 4.725931113014302243e-01 4.911578628984070161e-01 2.577124478772337413e-01 1.049506426728220448e-01 4.648735192223749785e-02 7.137954449007081204e-01 2.821821526855785786e-02 6.768571023057037284e-01 4.762508887321524886e-01 1.467603551007243268e-01 3.700143709712859774e-01 1.217011584699150689e-01 2.450072033807288580e-02 1.298690840251935825e-02 9.028760005374517061e-03 1.047979972147755449e-02 1.644750040487471046e-02 6.068400814531518805e-02
8.394653005622374486e-01 7.826673929261953599e-01 7.513747546114210585e-02 4.607857101924342502e-02 3.794036108497560872e-02 1.292988340746418496e-01 1.682087663541275147e-01 1.804563699013746469e-01 1.514524869783095140e-01 1.814728434900445553e-01 9.282148692946344537e-02 5.392246597085288001e-02 2.118365708870135478e-01 8.031683581945996131e-02 6.779985451250410133e-02 1.193320430044420843e-01 6.588705865333401857e-01 1.722473384629640836e-01 5.529130708248627402e-01 4.667442724089521100e-02 3.303838826850026555e-02 2.766446398991394620e-02 4.591654664768322625e-01 7.130596575422935846e-02 3.652193777531263785e-02 3.378876808671842091e-02 2.099739319743181357e-02 1.456062831933304345e-02 1.932893964862991698e-02 3.490899039165584056e-02
1.365066983262501754e-01 2.069203575718684962e-01 1.994395440752260995e-01 4.917991754511405467e-02 4.496360793972933867e-01 7.611178591845706443e-01 1.093190238079251031e-01 7.028363231963562496e-01 8.067194833983817315e-01 8.540426032205523654e-01 6.064373441048351854e-01 2.572263724518472072e-01 1.176506264362550958e-01 5.466691536332168172e-02 3.225697465623617033e-02 6.029528913160104447e-02 3.582657214513725874e-01 1.697878558086624579e-01 8.392867116579578735e-01 4.530998525378961833e-02 5.443787280193864708e-01 1.490668117811364823e-01 6.832305422837947617e-02 6.462535258458064480e-02 2.470477585058259914e-02 2.506884951622884855e-02 2.209830268762147040e-02 1.932940111954785378e-02 2.258341735238200698e-02 5.362172411703513414e-02
2.967458622549385971e-01 5.502860682781982593e-01 2.883852904647039028e-01 5.661059998776003521e-01 8.364307420774067525e-01 7.696219303037342419e-02 8.532756824185133704e-01 8.535346388145743646e-01 7.491357229063615453e-01 4.130590810624453768e-01 1.622550157835250251e-01 4.794469386644747422e-01 1.030004043271280090e-01 3.614064739010951904e-02 4.146786905310199250e-02 7.989273454502954230e-02 6.364413895626614970e-01 1.004315029015478311e+00 8.866481339372200843e-01 6.777203592844579516e-01 2.144461966599570668e-01 1.219442108972806638e-01 4.806657624457092576e-02 3.977823488732960128e-02 1.878756801576030033e-02 1.963337418992207317e-02 3.170948650755566617e-02 4.111267779546304985e-02 4.060210432666003233e-02 1.172287115231169241e-01
7.512807347803731606e-01 4.849466464961668111e-01 2.581624551343751350e-01 1.283797455400857990e-01 8.757237242856812376e-01 3.887786614544196384e-01 1.556320646024708654e-01 6.296162306903119177e-01 5.804934803729120407e-01 5.738772859369197787e-01 4.994207483813764004e-01 6.134628291154020641e-01 5.831258304270212078e-02 8.475120736762677964e-01 1.349050939986243536e-01 1.164804785861932590e-01 4.809486338962316587e-01 6.494898917498746760e-02 5.873670696414298731e-02 2.865081610999548056e-01 5.511483541763154137e-02 5.563044885816230412e-02 5.998216004071293267e-02 3.890687870567526019e-02 2.267128160607966014e-02 3.457615853401848488e-02 1.368874722275983391e-01 2.751240645798324058e-01 7.824964036599605377e-01 3.809834718576233792e-01
1.214646181927732105e+00 7.695313908405663206e-01 2.172099479933270738e-01 1.367810745604065292e-01 8.597951922615472142e-01 1.769270085290604866e-01 8.946230733961364479e-01 4.043165969994187980e-01 1.913138553979133738e-01 6.769141388319661889e-02 9.059641341712107998e-01 7.604956294086179236e-01 4.554506299919340584e-02 3.898536417888004424e-02 8.415503813777552855e-01 8.492793086677481451e-01 7.197791797028905980e-02 6.433724849846809979e-02 2.932048661211431387e-02 1.910547423304823772e-02 6.733492982586224140e-02 4.236692940544643793e-02 4.845886056500484096e-02 5.308270832094225122e-02 2.956915407183563146e-02 3.784422302093248813e-02 3.652823314510554864e-01 6.230750811327688821e-01 7.679501863481938972e-01 1.997304623827526882e-01
1.028464529459967025e+00 5.183528609458605274e-01 1.101789519428733710e+00 9.090371870961990730e-01 1.791951967207955909e-01 1.118039372491467232e-01 1.026258688599861330e-01 9.425632176774592641e-02 6.245138291439016054e-02 4.843113566821017901e-01 1.143100700705378392e-01 1.436738258616472030e-01 2.071898214363589452e-01 1.168907689538474654e-01 2.734621912246264219e-02 5.212352750121459349e-02 7.705304646999183715e-02 2.909060852977175815e-02 4.588406664430306758e-01 1.111503730899147668e-01 4.570214126691996004e-02 4.071255339077755470e-02 5.253375271200910746e-02 7.348431815491299202e-02 7.853462798459837080e-02 4.279948954053532095e-02 6.908573840962711765e-02 5.487904158793389942e-02 4.916189527549855165e-02 3.527857966277172380e-02
1.997823801305103897e-01 1.145471768794718154e-01 9.821907955062844087e-01 9.400771425500347167e-01 7.403659426702651203e-01 1.737446522491981060e-01 7.518543895257397136e-02 5.128273075294721012e-02 6.202756352683930913e-02 2.219579186929849374e-02 3.631297791441717021e-02 1.073423566050812211e-01 1.835095331898660143e-01 9.444433317805414618e-02 3.382954395705570216e-02 4.217061046495045040e-02 4.623957570566372688e-02 4.826020369031833179e-02 7.635257362478149457e-01 2.522945405852337619e-01 4.356488615475986870e-02 4.410091362761483363e-02 5.211138206661466987e-02 9.334664605014544869e-02 8.891453897815007612e-02 6.356164406515224519e-02 4.905526428554736473e-02 4.489067652681602572e-02 4.916291421129825867e-02 5.347611088669248364e-02
4.126284274316283085e-02 1.035994248619973024e-01 2.445678828344985400e-01 6.810387957636876433e-01 4.483732095683561347e-01 1.465614903800484536e-01 7.847339953048537708e-02 6.857819874277930328e-02 8.563785218576686065e-02 5.592375141343892686e-01 1.572459673835009397e-01 4.004163655541164574e-02 1.490591040767429154e-01 5.725456677146628648e-02 1.782644741534561428e-02 2.268336544025651227e-02 7.529302656023852958e-01 1.869171154774569577e-02 2.823799189621198011e-02 5.304621543266150319e-01 4.170136623224014738e-02 4.554781220671570707e-02 5.737748013919459489e-02 9.548708281940238018e-02 1.219396342758450880e-01 1.072084288656521278e-01 8.015482883204849696e-02 7.524924561732762585e-02 6.604193718236989197e-02 5.476233084799773249e-02
3.441327775835655023e-02 9.813342996411325569e-02 1.742320870049883230e-01 1.254059784037006853e-01 7.435765656996237705e-02 2.948732174623843738e-01 1.003151470667277279e+00 8.803385635475224902e-01 1.172894114666547111e-01 3.680636274289945248e-02 1.322810869574937431e-01 7.183335186840936748e-01 6.771523482123684157e-02 8.116245554386421202e-02 8.546437642089504960e-02 1.266929691993697871e-01 1.139276059247177342e-01 7.394438279173698447e-02 2.075593084056671644e-01 1.283809559290350899e-01 7.496122114473438014e-01 2.730308539056985340e-01 2.037048272267831250e-01 4.835295201712297986e-01 2.421820571470858358e-02 8.390297039402352386e-01 4.443768074803952639e-02 8.511547748090778631e-01 8.892641169453474603e-02 1.023912893641575617e-01
3.178637375023337514e-02 3.187742605432782039e-02 8.655147345087722821e-02 6.461754422644301332e-01 2.358412961191304058e-01 5.429068359554682643e-02 6.676992749278023442e-01 1.027306135298389766e-01 3.182368697930535589e-02 1.385454444739555591e-01 2.899031706839299005e-01 5.541866661690850876e-02 6.825669987076025957e-02 6.699306686391690024e-02 6.002232963972463364e-02 7.205113224788071979e-02 1.239471162872975291e-01 2.163305620405867880e-01 2.226986310358635701e-01 2.329406263831821644e-01 7.257962722896516006e-01 8.130952197422756100e-01 6.746812988718078330e-01 4.238363657072438673e-02 5.116366644423595011e-02 1.922147556573874927e-01 2.362512312190338526e-01 5.306948599814458739e-02 9.114682092990528117e-02 6.938211638264693559e-02
2.887664779420416258e-02 3.138528995020867240e-02 7.064977069868980109e-02 7.838084917734305934e-02 5.262221729619215305e-02 5.559806198524738785e-02 3.088865796822698462e-01 8.248641301293934136e-01 1.993019058196137533e-02 7.027821435432580754e-01 7.698436783069670941e-01 6.176372636448189679e-01 3.448542044386484345e-02 5.946936697554933149e-02 5.533961846429467923e-02 8.468361443290699231e-02 1.483191803355301541e-01 1.827125840169322724e-01 1.071794494672809878e-01 2.674830724083655104e-02 1.955906774378741303e-02 1.452673858038763255e-01 1.918721496584658293e-01 2.715356900089185288e-01 2.338899307233294200e-01 3.071711987569542557e-01 2.467536934353880551e-01 8.256607487526738953e-02 1.322125124876012969e-01 7.749604286707909018e-02
3.672392039699234889e-02 4.223917046927729013e-02 4.121018498672857078e-02 3.878320930383273579e-02 5.576707711185485694e-02 9.304596423693728413e-02 4.789444808413027138e-02 1.406034167833323523e-01 7.869378865245275911e-02 1.641002787210556896e-02 1.687953731962425763e-02 2.651015240078520227e-02 3.954852615752731809e-02 4.008900269685647388e-02 4.022624363814729376e-02 7.252602599050103627e-02 1.588067603080734747e-01 1.628345435720560674e-01 7.848611081381372256e-02 2.738031881712164536e-02 1.195642330363925476e-01 2.192646929143513557e-01 2.841890861448184702e-01 2.945706845509523664e-01 2.613407172595165751e-01 2.269765504286257451e-01 3.368721505759244561e-01 7.805144074472206150e-02 1.827555048638212221e-01 9.879838513886772533e-02
9.140384354942364398e-02 7.140768562959345922e-02 3.473134882882808472e-02 4.867287994166473453e-02 5.753177824060635714e-01 2.516824082865821294e-02 9.149987279471621937e-02 7.223976307096328930e-02 7.063401922492432150e-02 3.510199914790911035e-02 2.029894057144494487e-02 7.076050741972026437e-01 6.852241561272168768e-01 2.073881331747279982e-02 2.920442682464605838e-02 9.083504802067378370e-02 1.105793840614303636e-01 1.373707779959088826e-01 2.430822827842730322e-02 3.886746886470633655e-02 1.329706901370198979e-01 2.916590070220522191e-01 3.646324357658298765e-01 3.817473691901985822e-01 3.167778418118090134e-01 3.067507144029175681e-01 2.861812954551808952e-01 2.882947477628311495e-01 9.297481258111977009e-01 7.667676449551210638e-01
3.696941052562961738e-02 1.017939795035400496e-01 1.747688182867951356e-01 1.681925431453496281e-02 1.957781045419491536e-02 2.479923633985720716e-02 5.519344409022398229e-02 6.865386227467387692e-02 4.679377861122602233e-02 4.555784451732959595e-02 1.678458022589031720e-02 1.901301379551786075e-01 2.944521295009308592e-01 6.922372726568781776e-01 1.666441798731740920e-02 4.295970457144347027e-02 2.405667267495764303e-02 6.669853193203423292e-01 2.105666309196748687e-01 1.804090267956121735e-02 5.209893124670928605e-02 2.813736474887231775e-01 3.610886393039829945e-01 3.812666025083849553e-01 2.800079048889420053e-01 1.306301958915135342e-01 2.128528132158511721e-01 2.216837199177809081e-01 8.300066570012874789e-02 5.618632832114812681e-01
7.804375736433908362e-01 2.026394306604323986e-02 6.961148511151725726e-01 9.133935092532807082e-03 1.242497527978652858e-02 6.937798205583683986e-03 3.506900783009962719e-02 3.589156503391643938e-02 4.160907970631840674e-02 1.517106811076305781e-02 5.035688778314617586e-01 1.294395328592332084e-01 2.277716620418877569e-01 5.549879743090482265e-01 2.571816366242087037e-02 7.345738114543837183e-03 1.883486274639411054e-02 5.206473675459684092e-01 8.426669393294723420e-01 4.185764458451167458e-02 1.703636856926377674e-01 3.268159556003887301e-01 3.555821345811507328e-01 3.411985555151048066e-01 2.644401971559614539e-01 1.952618934037814724e-01 1.904855483936146732e-01 1.834886044889137979e-01 9.913565711328520269e-01 4.327075969612444450e-01
2.489645499389403493e-02 3.249056570295604657e-02 1.306200623195689914e-02 1.129990936127043058e-02 1.258046185045913305e-02 6.685609566810606363e-01 3.000197279894149457e-02 2.012785637374325809e-02 5.683669504296056871e-03 5.491802965448738805e-01 2.220279222970075184e-01 1.963027282564727416e-01 1.109521891332551219e-01 5.194669631463810777e-02 1.115507995218873588e-01 3.233867245916688948e-01 9.309686295474199971e-03 2.510726492591963677e-02 2.341026796573029978e-02 8.347609557352561604e-02 1.781609703959981805e-01 2.772540229154206726e-01 1.139226434251525422e-01 1.729164013892740270e-01 2.135628162262900864e-01 1.567721984974160265e-01 1.365883520058027711e-01 1.535271995882909191e-01 2.431515505376552200e-01 2.645311177843920891e-01
9.716244139669458907e-03 1.777231789359151604e-02 3.524066246694897431e-01 3.015506349224422178e-01 2.823336395117637676e-01 4.127313191231991585e-01 5.784671776469647586e-01 1.443071871007229334e-01 2.006632671850020477e-01 3.482629824928100415e-02 5.159654613848269067e-02 8.147856436836614646e-02 7.845893657957893341e-02 2.509300828896390834e-01 5.634858620415231778e-01 6.164020302539333779e-02 6.925890034487215685e-02 9.233659354910619954e-02 6.317940127432228326e-02 4.783808397680664598e-02 4.510954986086489205e-02 3.088449914363295204e-02 4.599271269540345930e-01 2.183566074235111440e-02 3.945800119766161573e-02 2.358339333703089735e-02 9.598037200700366700e-01 3.508433220843690803e-01 4.517738888563296862e-02 4.217969329074468254e-02
2.540659731612883443e-02 3.265270868689904710e-02 4.000276827734404739e-01 2.342028463218104040e-01 3.943776345314572440e-01 3.105242299039991938e-01 4.862077309621354870e-01 5.351669640327683108e-02 4.738013395992973081e-02 2.050688031675844403e-02 5.080866779273284645e-02 9.401904579716885424e-02 1.032889620040042672e-01 4.857312820356453620e-01 6.364405881408961019e-01 3.163028727036554938e-02 7.051085260835214530e-02 1.312411343062250546e-01 1.486478279712635520e-01 1.300529629392130071e-01 4.438111073132081086e-02 7.545525363656183648e-01 8.903763304148062385e-01 6.365093610930164236e-02 6.877653455436798235e-02 2.355840467431501162e-02 4.042676719084901671e-01 1.657674066703274385e-01 6.174142654110160999e-02 5.939603788462680112e-02
3.153904284364246469e-02 6.363668546605311116e-01 2.259623549533883724e-01 9.993892051260573617e-02 1.304699292160826640e-01 2.972640585181958173e-01 3.878979906472725947e-01 4.375195711048372738e-02 2.341197075070706318e-02 2.665916199436495215e-02 4.840148987611728182e-02 8.275978012093820890e-02 7.756157777904766626e-02 3.756481806233291643e-01 2.396823643908544549e-02 4.866608861720655294e-02 5.267760398083670692e-02 1.208280648165959148e-01 1.521876951355892738e-01 1.307271289194481823e-01 1.313607635879658342e-01 4.699059849309167314e-01 3.229278829545326746e-01 5.796585432344545374e-01 1.183535989993910464e-01 5.760627089036966103e-02 4.268817742063420184e-02 2.829814058772199270e-01 4.973469366862980079e-02 4.516305863589924890e-02
2.216423442249970677e-02 1.290149281448413517e-02 5.021130803805031739e-01 5.592372930548430432e-01 1.377355126058998458e+00 9.645552403556278964e-01 4.001186629168616560e-01 1.641999692918812426e-01 2.485767480345685843e-01 3.166339567707986968e-01 2.953980077536729268e-02 3.446441202132447673e-02 4.593198787194512772e-02 9.107590116073593922e-02 4.763616195596613867e-01 5.247449450643030394e-02 3.068453873472571161e-02 6.160706127896775630e-02 6.693792584600614937e-02 7.944688299170776791e-02 1.015388973670535155e-01 5.841046425692778543e-01 9.425817106107593768e-02 1.639718843428962236e-01 6.686106792943244947e-01 1.484786124006678143e-01 9.370448815094856165e-02 8.665682963200124767e-02 5.813191844049783036e-02 5.117566525322518600e-02
6.530290246577846042e-03 4.830767548452528093e-01 6.465732687152510039e-01 1.294514058178390714e+00 7.744771874383097332e-01 3.532503082703882802e-01 1.617233518911287971e-01 1.141684304744503275e-01 3.708883535819150201e-01 1.403440465611089927e+00 9.756576574152001080e-02 3.618721554980007526e-02 5.551047053947424925e-02 1.069936407112757892e-01 4.594229098576666503e-01 7.681779461824324029e-01 4.520799288499488533e-01 1.956954469049907996e-01 2.765606905143194738e-01 4.700985184530099836e-01 8.245351993113034794e-01 1.947432716591016022e-01 1.016934785354730170e-01 4.920909684778276838e-01 1.124821020161057783e+00 3.479827589276686672e-01 8.324789531358806061e-02 1.235457075499655638e-01 4.753573918555611399e-01 8.171149706294318638e-02
9.515478615326544015e-03 1.405817570794677326e-02 6.348327991863096376e-01 5.237835304989799656e-01 5.290831300493977762e-01 1.973702712646925594e-01 1.305683375323672124e-01 1.360721259507572944e-01 1.572025551196457316e-01 6.142919838770880547e-01 1.813987999892587855e-01 1.884324555906322085e-01 1.581843438673735669e-01 1.777958305235223802e-01 4.800860841516318978e-01 3.186559739887356857e-01 2.005733713718805267e-01 1.116674777887584902e-01 9.405673413117354720e-02 7.028473861123291089e-02 5.639554341947351779e-02 8.276810162348288702e-02 1.278365937795201690e-01 3.061150599612657563e-01 5.234635749002924943e-01 2.351886236906570171e-01 3.449446959002516744e-01 2.386832506554605882e-01 2.486117476180497443e-01 1.655118918400264594e-01
1.016826746621276450e-02 9.586794674939049798e-01 6.184735947292787639e-01 9.466719286036135994e-01 8.635138809409965699e-01 4.723484421814295731e-01 8.032821538505900347e-03 1.322122068179422349e+00 2.087807819357865302e-01 1.490398386428957722e-01 5.692855554812564778e-02 1.411191311229874346e-01 3.726283022820001123e-01 3.761331432077629766e-01 1.096686393832752682e+00 7.796321538586554745e-01 2.252423945612037071e-01 2.415892702763726141e-01 1.062484297450680404e-01 4.656257802895762826e-02 4.533773662131601601e-02 7.112626818796587147e-02 1.088162789140391384e-01 3.327556967483993322e-01 3.359310277145030055e-01 7.898810129585355500e-02 8.692050878491358601e-02 1.123014750863229050e-01 3.688537379962187890e-01 7.617216929291391325e-02
1.361159197103135529e-02 2.003478645576919903e-02 7.093251493392345175e-01 2.384067553405114920e-02 1.612664321015665897e-02 2.193085335502920757e-02 1.874969678140827462e-02 5.239704441834438509e-01 2.071628964901272851e-01 1.183155892959054101e-01 3.634713005030075494e-02 4.986468700729950604e-02 5.614451566926451781e-02 2.063632417518957984e-01 2.455188255252392926e-01 1.018633988963397602e-01 7.805721163671716645e-02 7.675289804753786249e-02 1.008913979866117860e-01 5.787179989917153045e-02 4.111564442677104886e-02 6.137792134739548933e-02 7.010645800473028211e-02 1.172389291839985442e-01 3.653202255346192917e-01 5.734720282843012995e-02 8.301563836072288483e-02 1.368662261059286345e-01 1.666045152560032827e-01 3.338257944188288695e-01
4.808637633052299971e-03 2.149024957708357483e-02 1.099566022177122404e+00 7.512124001572959009e-03 1.751790141543426577e-02 1.832909751410809543e-02 1.500270007472163589e-02 3.636759945265357619e-01 2.804752460826799854e-01 2.615893166431272898e-01 1.076928947482518606e-01 5.572449916822973248e-02 3.581142727102359924e-02 5.680382421502200296e-02 2.581849380041315589e-01 6.624220517251193374e-02 1.698736996594464310e-01 2.439631212741968577e-02 4.160184388203908012e-02 2.217729027902456407e-01 5.739763746257483396e-02 8.045283112518353263e-02 7.017424521414976357e-02 7.744742821842098834e-02 1.029367574086970938e-01 7.886344681011993318e-02 9.280987667511349237e-02 1.146180141663876162e-01 1.549403165049873521e-01 3.819959279609620451e-01
