4.314853428438137906e-01 5.865438342932101368e-02 4.922965812524128237e-01 4.695984508854691986e-02 4.460687175138801086e-01 6.054655569549047267e-02 5.064429314929713710e-02 1.372765549841284682e-01 2.496760062534559566e-01 1.127847540373433655e-01 6.953473449318871291e-02 2.747167507992000490e-01 1.744670021589602715e-01 4.307025850673863038e-02 4.753159356078127951e-02 1.843843484796049426e-01 3.220842896696989727e-02 4.013021266494862932e-02 4.203357345484676905e-02 6.227757613153820371e-01 5.752963451001132933e-01 8.693375790334090247e-02 6.640503503453129563e-02 2.651538474200504925e-01 5.148145079598360763e-01 3.995247995423394372e-01 1.779637009484232868e-01 1.543389754496104528e-02 1.454910085501244683e-02 1.813635133217087955e-02
2.759766092220785061e-01 6.052608541348336590e-02 7.314060523492124655e-02 6.592807461484601061e-02 3.801795295321635376e-02 1.829475576884087018e-01 8.184783012219216947e-02 1.026165792948426497e-01 6.227674877297059708e-02 5.045360193014744588e-02 4.637364753266066952e-02 1.417870201105633776e-01 2.071789361206383406e-01 4.916458101101012224e-01 4.974550411155802959e-02 5.074329151945646821e-01 3.149736470693106916e-02 7.529503356082264953e-02 6.461243047111124571e-02 2.556626882117708777e-02 3.311553978230973305e-01 8.358595078025823910e-02 1.733156302558299389e-01 1.548955226670821472e-01 1.374487766751968376e-01 1.814769495229726637e-01 6.095309442143610063e-02 1.540558490732423305e-02 2.182084984584500148e-02 2.173222078409131272e-02
1.909076540462850968e-01 1.883800405065665651e-01 3.671505029998712866e-01 2.994243553306061290e-01 6.910171576508521429e-01 1.073906377226321596e-01 2.303387435847267517e-01 2.419548227941059892e-01 2.753612420297118502e-01 6.832626439426404963e-02 1.870190955954582346e-01 1.383703526308948939e-01 6.201964303252394117e-02 1.075054873856598481e-01 3.176534451850094309e-01 9.208576154932132662e-02 5.094626646539385240e-02 7.899605548976570968e-02 2.303462698627520289e-01 4.833519075432324286e-02 2.045763275603375564e-01 6.899251666718880793e-02 1.054834520232010436e-01 3.676877169731406630e-02 2.188149042577007888e-02 1.409996026400734716e-02 1.198168159018449946e-02 9.409686005422350508e-03 1.604622231306416028e-02 1.797886841173409328e-02
8.174579765685172084e-02 2.312217773648139185e-01 5.072951902490101528e-01 4.115735129268670023e-01 2.011938826418301074e-01 4.729161876234699302e-01 4.697128103437160362e-01 2.916552766729187396e-01 1.582261970216364000e-01 8.689081845877884291e-02 5.346092639510556521e-02 1.087089568232515041e-01 7.401089721272403887e-02 7.450619944509927206e-02 2.460433536382487518e-01 2.103375472559332326e-01 4.505899582327206332e-01 3.053603960823599028e-02 1.904089111331292578e-02 1.869495037255128680e-02 3.595763971327528008e-01 1.435403047659327413e-01 4.955026787075812039e-02 9.805367231257863803e-02 1.790234398542241145e-02 1.249316076605302105e-02 1.025991480325038480e-02 9.732487030728043109e-03 1.975957062089792049e-02 2.145446058333419156e-02
4.767259804910845000e-02 1.470710511394566211e-01 4.106840862926901536e-01 1.594876389788656423e-01 1.165402878924860497e-01 2.796755904209549670e-01 4.866637011535262514e-01 2.734939196795581617e-01 1.005155961216424726e-01 2.058485359479456100e-01 2.378172254182968348e-01 2.252488101652326546e-01 5.356849689617793064e-02 6.072766037922617821e-01 3.187888581615688222e-01 1.271259996832081185e-01 7.146707964024606730e-02 3.033188450450211363e-02 4.344525454512508655e-02 2.509349463881291320e-02 1.920742900522001348e-02 1.890312498140215569e-01 4.888814518330868442e-01 1.614745699886942776e-01 3.226802078013248781e-02 1.678828246839548025e-02 1.132221122480329967e-02 1.308443924997788714e-02 2.045809331658555649e-02 7.515897059078219256e-02
6.314443862765023452e-02 6.687296363083003459e-02 2.622925544258386532e-01 1.917599994259603646e-01 8.641630445993328524e-02 1.594230077134539680e-01 2.027793612328218642e-01 2.154130114957282516e-01 1.742304533370483133e-01 3.078623197518972066e-01 2.530134349651492198e-01 1.606991687208003672e-01 2.723742196995847520e-01 1.023037287377990268e-01 8.593346503324231223e-02 1.446098623020860841e-01 4.698214112798165115e-02 1.921038569180101296e-01 2.416587908683286157e-02 7.144080608820534140e-02 9.686100702084710079e-02 8.748913776192936143e-02 6.007251567991314101e-01 9.377488642077697056e-02 4.796758704766125592e-02 4.415505392403153151e-02 2.720843448857932986e-02 1.874848448259711434e-02 2.473727612306915458e-02 4.442967951187385550e-02
1.580770887502690736e-01 2.395935791640105006e-01 2.348859196152093265e-01 7.479879538242369119e-02 2.984268786538108939e-02 5.738583933609680415e-02 9.947021685610599184e-02 5.558150148594562245e-02 6.735076797642225443e-02 7.463864888389110108e-02 7.433635247036421423e-02 3.262884542337353699e-01 1.519512801155906701e-01 7.073287937405627057e-02 4.133730861208459451e-02 7.132314559165972567e-02 4.031186386278437506e-01 1.806814550443864853e-01 3.889333857693930141e-02 5.398252406272639747e-02 3.076335619346648800e-02 1.860026660232088347e-01 8.732370243679375699e-02 8.374521020693284634e-02 3.236660809629505337e-02 3.308885249299548664e-02 2.908860840102104120e-02 2.509516375780925651e-02 2.872894866387406404e-02 6.816451394163766664e-02
3.295035941700755755e-01 6.162154244773586642e-01 3.411359887728111495e-01 5.055685608696877664e-02 6.101701988615822886e-02 6.835713963767563184e-02 6.015637201016324487e-02 4.977293355483566883e-02 4.793050265759060680e-02 4.409343907847929622e-01 1.889977980063950735e-01 5.995951734165816394e-01 1.304101900514396117e-01 4.637979334370002926e-02 5.236893403608604280e-02 9.664059860202178776e-02 4.656325980356849220e-02 6.244038483537723422e-02 4.782810046917301827e-02 3.843255714214299790e-02 2.634175946617374753e-01 1.550600888692620916e-01 6.270622631956586368e-02 5.257000325753406061e-02 2.503324234460648293e-02 2.607893952017995703e-02 4.040232591466237644e-02 4.540091013258668734e-02 4.479177370247119233e-02 1.290111461215780186e-01
1.016308551768951574e-01 4.917525352042633191e-01 2.908906119835558690e-01 1.228024234239657175e-01 7.170551774175493165e-02 4.356765485670317517e-01 1.169869102364036462e-01 4.987707758165318972e-02 4.903674561557230804e-02 5.522536688845109537e-02 5.891800810546130585e-01 6.962144980259010740e-02 1.167992041221632554e-01 6.180364743531205352e-02 1.682344013551065609e-01 1.402306831392972353e-01 3.136011753130121815e-02 8.483173946909858265e-02 9.183550869967194163e-02 3.505502365910274643e-01 6.982761050631197675e-02 7.282141810756713463e-02 7.928028218719444797e-02 5.187440140417123868e-02 3.038451137729119428e-02 4.558873340455368156e-02 1.695212168386980300e-01 2.992744547951999845e-01 4.654278723408083324e-02 3.968489992497634677e-01
9.582067965242883900e-02 6.736577674912683222e-02 1.094818207932695131e-01 7.345403879963058325e-02 7.451759547449816889e-02 2.076539940026031206e-01 9.990940096145639604e-02 4.455241677012582446e-01 2.060979957767346549e-01 7.630009569074489018e-02 7.365845500208466345e-02 6.585965649291168622e-02 1.043873848215726846e-01 1.179626772918579564e-01 5.710823118570959589e-02 6.138155697759908880e-02 3.117431001065215090e-01 3.153518842570853797e-01 1.451645450914182678e-01 7.895114223470013626e-02 8.903601795978854927e-02 5.629952574275686600e-02 6.462981602376582924e-02 7.105933667785305219e-02 3.968920679443969923e-02 5.009694798296421975e-02 4.560097941550689260e-01 6.885747932069008481e-01 4.832644622953477520e-02 2.092273440293437314e-01
8.454859351567291237e-02 4.547412061080259305e-01 7.851123663110341766e-02 5.410116639310229292e-02 9.560961590254551945e-02 1.279376776413142236e-01 1.239475685739390293e-01 1.115103638729977448e-01 7.590584382364434779e-02 6.083594632650595191e-01 4.394138371183009539e-01 6.718357692053189556e-01 1.394911678872681859e+00 6.790661569563711808e-01 1.234407020024080176e-01 2.402694597973192847e-01 4.489480593036832556e-01 1.243879453210463004e-01 3.567258072417717196e-02 1.460163328313646147e-01 6.154483422795468950e-02 5.500097741615066899e-02 7.107287180315804975e-02 9.949013153769820095e-02 1.063294890904836199e-01 5.741157541592094293e-02 8.918438589375105030e-02 6.603161064544385561e-02 5.821763226588862195e-02 4.103322397352818229e-02
2.020055876596753563e-01 1.105589619684454461e-01 9.489001713184169740e-02 9.072798907074069996e-02 7.934093246785914322e-02 2.026984786772293434e-01 9.421320906844124488e-02 6.482061346746349761e-02 7.713773182651841032e-02 6.602318694452229131e-02 1.337948713631985365e-01 8.092464983523597333e-01 1.439094927873792340e+00 7.405736547806544001e-01 2.646010146971938815e-01 2.970743492588958645e-01 3.283626372293818041e-01 1.934213159894083989e-01 5.802635524498636621e-02 3.381452068749516426e-01 5.983425288566086853e-02 6.100600214330657856e-02 7.219628193166761909e-02 1.291543144215415162e-01 1.226640973959399750e-01 8.726400652718878381e-02 6.688176835456118019e-02 6.033629730923519008e-02 6.517417339611628058e-02 6.952602095230922541e-02
4.783021570543170842e-02 1.149784444411962453e-01 2.587994295792249710e-01 1.157358014830893456e-01 4.840959698686060353e-01 1.673708530597559641e-01 9.274806360076726097e-02 8.061112164337461139e-02 1.031363817759196611e-01 3.153012971300118983e-02 2.017939438690509735e-01 2.612324494704004740e-01 1.063328925800175240e+00 4.563097053143236881e-01 1.433988088208394129e-01 1.660947790106832578e-01 6.131193511405123864e-02 8.986969914923248481e-02 1.165540513695900449e-01 4.758859329132847371e-02 5.825151774855062692e-02 6.396281211416160462e-02 8.108500315598730912e-02 1.347330204884704397e-01 1.706114023262288448e-01 1.489718280779251391e-01 1.098246700179286578e-01 1.028509126238185689e-01 8.935262385485304160e-02 7.300145528869814160e-02
4.136287716113337676e-02 1.169109450811073037e-01 2.058201617475321488e-01 1.486828659007938258e-01 8.978453938983985139e-02 3.505541605758498713e-01 9.302368099053082151e-02 4.886843493879722278e-02 1.408125765891318215e-01 4.689509190983725401e-02 1.693433499324560332e-01 4.545734018918250186e-02 4.821717841776713698e-01 6.571575414421806371e-01 7.053595947358139995e-01 9.587310006982858734e-01 8.629672603429852096e-01 5.604509312538477062e-01 1.531576283340047029e+00 7.162455065844168800e-01 7.407253835507889017e-02 3.864112207356132922e-01 2.911886207074886324e-01 6.931906107412277862e-01 1.103805651161882673e-01 8.298470118437661913e-02 2.140571550213968277e-01 8.082728334564920347e-02 1.225676556786652882e-01 1.391630502676945713e-01
3.974781865941068998e-02 3.969269302716781772e-02 1.074023753471524678e-01 8.035780582809599615e-01 2.962056332977975881e-01 6.591488811022469529e-02 5.167444685604212495e-02 9.102440019201260557e-02 6.420203450222784769e-02 1.788252633617550824e-01 3.738146454786342998e-01 2.259456181939369090e-01 4.357799075269602751e-01 5.552931967435146277e-01 5.033012800939751230e-01 6.102311802794966322e-01 1.044781030292717183e+00 1.812736480227084446e+00 1.851385286800495189e+00 1.455010727798339287e+00 7.257899203749085260e-02 8.400899836324651759e-02 8.308481889423305344e-02 2.291688876010495313e-01 3.004445515324520866e-01 1.346287311428792322e+00 1.342824592146358187e+00 2.924185703703880979e-01 1.256510115228664515e-01 9.459667668674866248e-02
3.771092701874293601e-02 4.083342671154559234e-02 9.030044454961344558e-02 9.962887987545337998e-02 6.670070034402884873e-02 6.962270123840968994e-02 3.850570919295857597e-01 4.639798750108863057e-02 9.807739616954913586e-02 3.869385167895082744e-02 4.097540734275933322e-02 3.451584639967982676e-02 2.504695288301586054e-01 5.049310142725249584e-01 4.686977793616298738e-01 7.153311095804658626e-01 1.247371174004110461e+00 1.527771146744212327e+00 8.888200610750047748e-01 1.944414082058013027e-01 1.170857201321362090e-01 8.077501821725000530e-01 1.185406603840564399e+00 1.993631728363751243e+00 1.874146543240273521e+00 2.439428946509708318e+00 1.939366073008615299e+00 5.755955425426282357e-01 1.806288307496989320e-01 1.046179233799811176e-01
4.929577081329527405e-02 5.665674911202595726e-02 5.448967621182064514e-02 5.035815080994444914e-02 7.164161987456144076e-02 1.204290654427853380e-01 2.787018309004899441e-01 9.018685132766193213e-01 4.291380241908484550e-01 7.472837481748736965e-02 5.670165943646962581e-02 9.098433836459177138e-02 1.811208177673967468e-01 2.639830484056580606e-01 3.449393147890795763e-01 6.122895831194988814e-01 1.333095910472144041e+00 1.355454179121402314e+00 6.479672632826408707e-01 2.240792261626299853e-01 9.721162727568108952e-01 1.775698646508287570e+00 2.293369489540965755e+00 2.359237789391035456e+00 2.064625052246613635e+00 1.767032694596610165e+00 2.585404761875019108e+00 4.592340848133275033e-01 2.340857641167697345e-01 1.253469113242050292e-01
1.225256212068232264e-01 9.631514649163468167e-02 4.683348844911309344e-02 6.469329811028609600e-02 3.267194353920376687e-02 1.355071422689948513e-01 7.286236068702727220e-01 5.916849986061407662e-01 5.825296035856835086e-01 2.960718874873219386e-01 1.169099998450818523e-01 3.650832981985208808e-02 3.576541917779092750e-02 8.492133036746657426e-02 1.693813061811102194e-01 7.651496060634362939e-01 8.132173756981823098e-01 9.761681069695943291e-01 1.723379860516689732e-01 3.072780495876458740e-01 1.077495003002121088e+00 2.345519227691279962e+00 2.907443274293835866e+00 3.013277372384280284e+00 2.450319871630956214e+00 2.328397506520690552e+00 2.136176542439203185e+00 1.698761212963634248e+00 1.077750780444212825e-01 7.654781336676907966e-02
4.847623711530257146e-02 1.334540482438623388e-01 2.328970541228317648e-01 5.867004446272351681e-02 1.096912075903657413e-01 1.510966661083910090e-01 4.761842139939604368e-01 5.951091785031603631e-01 4.078930600677206364e-01 3.219585314334799664e-01 7.759488765076863470e-02 2.552102522910676963e-01 3.836124317795481242e-01 3.806617120125682652e-02 6.210733494455466380e-02 3.600853758831980000e-01 1.384179777375098841e-01 4.549706338095956676e-02 2.933743397241018180e-01 1.126201476082243219e-01 4.222474873814787699e-01 2.253985181848444874e+00 2.855893405166634036e+00 2.964366256610892147e+00 2.135116568648956381e+00 9.788279514677314941e-01 1.573275595197460186e+00 1.069529771762416148e+00 1.628519031574967024e-01 7.068308405065270028e-01
3.981731933556061781e-02 5.607042339719934404e-02 3.640226656197441402e-02 4.131506336469956131e-02 8.729833990294386115e-02 5.012644023515683278e-02 2.574827343470337260e-01 3.323659435365947656e-01 3.056249751251816638e-01 7.942290319485580119e-02 2.713449001627542961e-02 1.749461315543591744e-01 2.969651264936644663e-01 3.123081781177231703e-02 8.534970982218320623e-02 5.499287218355714685e-02 9.822367044914454004e-02 2.889890845094891456e-02 5.444079870599469184e-02 2.587046434812274032e-01 1.368212451362822879e+00 2.582352665207775733e+00 2.762049877129111763e+00 2.604215869173528208e+00 1.984765194773349783e+00 1.443941608062885518e+00 1.391036167015211378e+00 9.678534245052496932e-01 1.809790036735624552e-01 5.672457897884031208e-01
9.729233382683684372e-02 9.674647316663249896e-02 5.615213194413170433e-02 4.515577211950129455e-02 5.566933852068464694e-02 2.634189941462817403e-02 1.377552804240567141e-01 1.296275149045867936e-01 3.627650238132211491e-02 2.223916630461615640e-02 2.996281120166049972e-01 2.621173517498363026e-01 1.445275127413634675e-01 6.663375962854439782e-02 1.420836468492264193e-01 4.160556659782785327e-01 5.507857450288440593e-02 1.215919640065924040e-01 1.169199753242703005e-01 5.214162301024216628e-01 1.414087199439588494e+00 2.028141644604334992e+00 8.168165834177083529e-01 1.221582572607701200e+00 1.576155088963901107e+00 8.916454622043532563e-01 7.079443404714554910e-01 6.160306457770149402e-01 3.204266414281211617e-01 3.483524515766140972e-01
7.966802254346197487e-02 1.101369836143724218e-01 4.721958633435641151e-01 4.054484982069588295e-01 3.736243949463898262e-01 1.792143824580309103e-02 1.982333389831961168e-02 1.961543879838795745e-01 2.798888197456537719e-01 4.776724785169453313e-02 6.942450928431184720e-02 1.095389804095399378e-01 1.040363774180887713e-01 3.243175308428676851e-01 3.542874307213805113e-02 2.920662739869177571e-01 5.458229567929102632e-01 7.662528762822879980e-01 5.224408832499846111e-01 3.903708436965518946e-01 2.725293053849826008e-01 9.595708977558167763e-02 3.674506329151570883e-02 7.974157563113039304e-02 2.894100355578089201e-01 1.134326782483925239e-01 1.244793482537712853e-01 4.669693936774924614e-01 6.038796194617213065e-02 5.632512226928123450e-02
1.680183985690553161e-01 1.644058901575473075e-01 5.386112108945273480e-01 3.168407695983135874e-01 5.221529472412864692e-01 3.973456916045410292e-01 1.587063304509032588e-02 6.990456570951927850e-02 6.603957737542434647e-02 2.836077838115425021e-02 6.963445467146457679e-02 1.273361655550373506e-01 1.377364505799959504e-01 6.330541394171788072e-01 4.619945584155271678e-02 1.629508873663712276e-01 5.986801656551350437e-01 1.119291436779652038e+00 1.270553353757474024e+00 1.094606798213749954e+00 2.430122940584767410e-01 6.230831540612953579e-02 7.614653785873112812e-02 1.739535701517114230e-01 3.423828174625729859e-01 1.170895053076828618e-01 5.526417194121256982e-01 2.259970686341198354e-01 8.449743554379342270e-02 8.099658579141758019e-02
2.094241455073155844e-01 3.536958751655191330e-02 3.047902971675620076e-01 1.322673002818091359e-01 1.665722771042460471e-01 3.682714884419868717e-01 4.915678834671263764e-01 5.687781440377613629e-02 3.219392902078207358e-02 3.653353217749977927e-02 6.603722730870732749e-02 1.120949707828181874e-01 1.038253248991991562e-01 4.951246810385573349e-01 8.581351509672173472e-02 2.583933430128779185e-01 4.527915020718498162e-01 1.051780132648058030e+00 1.337145453832450759e+00 1.133007177241685426e+00 5.932278786707365636e-01 6.277009117021199458e-01 4.245836863163056085e-01 6.561759638621351975e-02 3.092526535644354868e-01 1.996571611552287462e-01 2.146197361327585318e-01 3.958202244861122043e-01 6.920368549687933024e-02 6.244124877901724435e-02
1.190441833096631957e-01 4.531243283346068906e-02 6.427344590921937328e-01 6.961234844930317411e-01 4.330120490087781271e-02 3.057490300356874996e-02 5.223472311093899645e-01 2.216235574848512413e-01 3.234154789517399986e-01 4.126150209969432492e-01 3.862978030202908475e-02 4.637452611902177085e-02 6.098137062104346667e-02 1.181628452648277594e-01 5.924809684396947773e-01 1.105053367509206408e-01 8.343815863732131910e-02 3.694834484134152386e-01 4.650191108893295677e-01 3.906342674281214067e-01 3.667354853021376759e-01 6.915913357582412213e-02 1.262385076983731369e-01 2.050479703432395162e-01 1.164252640660516647e-01 1.684239673095206946e-01 4.632694755726933789e-01 3.675046483609343273e-01 8.142632076996933477e-02 7.098689447114572837e-02
4.292159844025253412e-02 1.983481539687730402e-02 2.503148692983399315e-02 4.763487494702476482e-02 2.491657157178739021e-02 4.362138756113640436e-01 2.112527019807508011e-01 1.540221762520287141e-01 4.816490534316306693e-01 4.476767394652646226e-02 1.266889493688786172e-01 4.693577862958470820e-02 6.947691235771030760e-02 1.276772644523911648e-01 5.274863476909561477e-01 6.591556608091556080e-02 5.577774143942656471e-01 2.649198144106451047e-01 3.912507292214876253e-01 6.638220121727785861e-01 8.679106696623205275e-02 2.685393137960959131e-01 1.378567977028817282e-01 6.389863361940751885e-01 3.709008341069255366e-01 4.493235227835147283e-01 2.478089837579596499e-01 3.708549717764798581e-01 6.623109049627661227e-01 1.126830479455859652e-01
4.352232844353014218e-02 3.526827904072613734e-02 1.818271003642576295e-02 6.369137195929602813e-01 6.542857892900366679e-01 2.572395025801383350e-01 1.738781481375434312e-01 1.812288823363025214e-01 2.017625268826683804e-01 7.995490653709647066e-01 2.345956105273552528e-01 2.349358306204715197e-01 1.888893193261786396e-01 1.912586734240953601e-01 4.804825011116274913e-01 3.245027666820856638e-01 2.332107847591836092e-01 1.487217053532249311e-01 1.318676434520188734e-01 9.969930222332756831e-02 7.964551602867048219e-02 1.159813672171297605e-01 1.767378271667111589e-01 4.115319181198938692e-01 7.010114257407691341e-01 3.150802240074275229e-01 4.827103961412557709e-01 3.351434667848238735e-01 3.462574745499021889e-01 2.281687409307990300e-01
5.916917509028525590e-02 3.108960546449379345e-02 1.868756662115907130e-02 2.840039468257952657e-02 2.653908591564213201e-02 6.347322516757414324e-01 4.354163433974822528e-02 3.397922783449447426e-02 2.778382449531764387e-01 2.013456305282407821e-01 7.551591065785163981e-02 1.752442419844454091e-01 4.399783089119656543e-01 4.021155047757006828e-01 1.017631408205830479e-01 7.675139057932268971e-02 2.644288507938450383e-01 3.215410329633383579e-01 1.490365433118608363e-01 6.671334344172459574e-02 6.474441364453994985e-02 1.009549704899570799e-01 1.530633833708619496e-01 4.655019540822306068e-01 4.679303604286965124e-01 1.103243499094238300e-01 1.224030036868709870e-01 1.578119355853470074e-01 5.144961058990940028e-01 1.051416674061856210e-01
7.908920497270194305e-02 6.898521153079298363e-02 2.057174534260657398e-02 7.133476382726168519e-02 8.538453171797272256e-02 1.599297822942076508e-01 1.124093575980847776e-01 7.007556655026540016e-01 2.758477043746388468e-01 1.601508894382763504e-01 4.864781402352405526e-02 6.227738959538859503e-02 6.669227383102047102e-02 2.276921719701873181e-01 2.601765162184673796e-01 1.096723224649030909e-01 9.299372259149307762e-02 1.030250877459011061e-01 1.422077695122772878e-01 8.324556421863002487e-02 5.908894833017449416e-02 8.800078046231957218e-02 1.001470897885222422e-01 1.664330930467158021e-01 5.159356719515130196e-01 8.099720184265007950e-02 1.174282330841855126e-01 1.926338416843676460e-01 2.328100820392705605e-01 4.615990529381797658e-01
4.218632578964634505e-02 1.054732485086685712e-01 3.203833255542616609e-02 3.450461278895421841e-02 1.681409658675562246e-01 1.769471879860117225e-01 1.238874134350066714e-01 4.837133344595263562e-01 3.710229897415049383e-01 3.479446365698042332e-01 1.435251637071136843e-01 7.273869065871660378e-02 4.370604528536616018e-02 6.844350081487596271e-02 3.116619002028542806e-01 8.154402030545281066e-02 2.241047006826730192e-01 1.017450000581679864e-01 1.966462493981976090e-01 3.195271559879521717e-01 8.245683730751729446e-02 1.153959827632414642e-01 1.004736356003568531e-01 1.100892288066637748e-01 1.454562593540501547e-01 1.112089567734276807e-01 1.309191986735792346e-01 1.615705302937978649e-01 2.182074156970348622e-01 5.356538728485933376e-01
