20.3566099781169 20.4435511949444 20.4435511949444 20.4435511949444 20.4435511949444 20.4435511949444 20.4435511949444 20.4435511949444 20.4435511949444 20.4435511949444 20.4435511949444 20.4435511949444 20.4435511949444 20.4435511949444 20.4435511949444 20.4435511949444 20.4435511949444 20.4435511949444 20.4435511949444 20.4435511949444 20.4435511949444 20.4435511949444 20.4435511949444 20.4435511949444 20.4435511949444 20.4435511949444 20.4435511949444 20.620164934197 20.7992920425868 20.9784194387765
20.4001650419101 20.4435511949444 20.4435511949444 20.4435511949444 20.4435511949444 20.4435511949444 20.4435511949444 20.4435511949444 20.4435511949444 20.4435511949444 20.4435511949444 20.4435511949444 20.4435511949444 20.4435511949444 20.4435511949444 20.4435511949444 20.4435511949444 20.4435511949444 20.4435511949444 20.4435511949444 20.4435511949444 20.4435511949444 20.4435511949444 20.4435511949444 20.4435511949444 20.4435511949444 20.4435511949444 20.6218599054532 20.8009851631841 20.9801107086998
20.4427742076556 20.4435511949444 20.4435511949444 20.4435511949444 20.4435511949444 20.4435511949444 20.4435511949444 20.4435511949444 20.4435511949444 20.4435511949444 20.4435511949444 20.4435511949444 20.4435511949444 20.4435511949444 20.4435511949444 20.4435511949444 20.4435511949444 20.4435511949444 20.4435511949444 20.4435511949444 20.4435511949444 20.4435511949444 20.4435511949444 20.4435511949444 20.4435511949444 20.4435511949444 20.4444314693094 20.6235545886103 20.8026779959959 20.981801691153
20.4435511949444 20.4435511949444 20.4435511949444 20.4435511949444 20.4435511949444 20.4435511949444 20.4435511949444 20.4435511949444 20.4435511949444 20.4435511949444 20.4435511949444 20.4435511949444 20.4435511949444 20.4435511949444 20.4435511949444 20.4435511949444 20.4435511949444 20.4435511949444 20.4435511949444 20.4510551412185 20.4892641250861 20.5265482902222 20.5629091386134 20.5760536290493 20.5743988703381 20.5727459116196 20.5731601779639 20.7155665758982 20.8588929663447 21.0031378468827
20.4435511949444 20.4435511949444 20.4435511949444 20.4435511949444 20.4435511949444 20.4435511949444 20.4435511949444 20.4435511949444 20.4435511949444 20.4435511949444 20.4435511949444 20.4435511949444 20.4435511949444 20.4435511949444 20.4435511949444 20.4435511949444 20.4435511949444 20.4435511949444 20.4435511949444 20.4612871579505 20.5480414502868 20.6338711644056 20.7187778019536 20.7503326987534 20.7486782039598 20.7470255088715 20.7476415015463 20.8414998540226 20.9362779600028 21.0319743174058
20.4435511949444 20.4435511949444 20.4435511949444 20.4435511949444 20.4435511949444 20.4435511949444 20.4435511949444 20.4435511949444 20.4435511949444 20.4435511949444 20.4435511949444 20.4435511949444 20.4435511949444 20.4435511949444 20.4435511949444 20.4435511949444 20.4435511949444 20.4435511949444 20.4435511949444 20.4724453584357 20.6077439691454 20.7421182421346 20.875569678709 20.9246118050008 20.9229575741193 20.9213051426563 20.9212033936209 20.9665146911559 21.0127455032037 21.0598943280237
20.3926438571338 20.3943392004519 20.3960327449465 20.3977244906039 20.3994144374104 20.4011025853529 20.4027889344175 20.4044734845913 20.4061562358602 20.4177015745555 20.4283979509477 20.438158526215 20.4435511949444 20.4435511949444 20.4435511949444 20.4435511949444 20.4435511949444 20.4435511949444 20.4435511949444 20.483353133006 20.6624668291224 20.8415808154681 21.020695091729 21.0865213800626 21.0865213800626 21.0865213800626 21.0865213800626 21.0865213800626 21.0865213800626 21.0865213800626
20.2183708267665 20.2200658995821 20.2217591738613 20.2234506495903 20.2251403267552 20.2268282053433 20.2285142853403 20.2301985667334 20.2319500012293 20.2921257361431 20.35136441252 20.4096675310739 20.4435511949444 20.4435511949444 20.4435511949444 20.4435511949444 20.4435511949444 20.4435511949444 20.4435511949444 20.4850611655503 20.6641730130071 20.8432851506791 21.0223975782519 21.0865213800626 21.0865213800626 21.0865213800626 21.0865213800626 21.0865213800626 21.0865213800626 21.0865213800626
20.0440977597498 20.0457925620685 20.0474855661375 20.049176771943 20.0508661794722 20.0525537887108 20.0542395996459 20.0559236122636 20.0587688310656 20.1674856328574 20.2752656197361 20.3821102920763 20.4435511949444 20.4435511949444 20.4435511949444 20.4435511949444 20.4435511949444 20.4435511949444 20.4435511949444 20.4867689075651 20.6658789066766 20.8449891959888 21.0240997751883 21.0865213800626 21.0865213800626 21.0865213800626 21.0865213800626 21.0865213800626 21.0865213800626 21.0865213800626
19.8698246560883 19.8715191879154 19.8732119217797 19.8749028576678 19.8765919955659 19.8782793354607 19.879964877339 19.8816486211868 19.8865241467525 20.0437810262106 20.2001013343624 20.3554865712417 20.4435511949444 20.4435511949444 20.4435511949444 20.4435511949444 20.4435511949444 20.4435511949444 20.4435511949444 20.4884763590641 20.6675845101446 20.8466929514119 21.0258016825519 21.0865213800626 21.0865213800626 21.0865213800626 21.0865213800626 21.0865213800626 21.0865213800626 21.0865213800626
19.8005810098262 19.8005810098262 19.8005810098262 19.8005810098262 19.8005810098262 19.8172618930886 19.8434030887447 19.8686067586535 19.8967318796207 20.0491420928929 20.202489221143 20.3567717640482 20.4435511949444 20.4435511949444 20.4435511949444 20.4435511949444 20.4435511949444 20.4435511949444 20.4435511949444 20.4848785066585 20.6441920567285 20.8044296128197 20.9655896743822 21.0200050610454 21.0216579724445 21.0233090858601 21.0249584012794 21.0266059186885 21.0282516380749 21.0298955594251
19.8005810098262 19.8005810098262 19.8005810098262 19.8005810098262 19.8005810098262 19.8480929494231 19.9227738976257 19.9965175641121 20.0705586903837 20.1744271091617 20.2792321993181 20.38497246087 20.4435511949444 20.4435511949444 20.4435511949444 20.4435511949444 20.4435511949444 20.4435511949444 20.4435511949444 20.4732887701173 20.5840583948558 20.6957517851818 20.8083674408859 20.8457257356495 20.847378383168 20.8490292329899 20.8506782851021 20.8523255394919 20.8539709961454 20.8556146550498
19.8005810098262 19.8005810098262 19.8005810098262 19.8005810098262 19.8005810098262 19.879863108803 20.003082820829 20.1253654951523 20.2434491435646 20.2987767569283 20.3550407980889 20.4122397674034 20.4435511949444 20.4435511949444 20.4435511949444 20.4435511949444 20.4435511949444 20.4435511949444 20.4435511949444 20.4607736299053 20.5230003185767 20.5861505324194 20.6502227715645 20.6714463737477 20.6730987573905 20.6747493436242 20.676398132435 20.6780451238098 20.6796903177359 20.6813337141998
19.8005810098262 19.8005810098262 19.8005810098262 19.8005810098262 19.8005810098262 19.9125721317649 20.0843296191452 20.2551503128179 20.4154034778724 20.4221912746482 20.429915255657 20.4385739215959 20.4435511949444 20.4435511949444 20.4435511949444 20.4435511949444 20.4435511949444 20.4435511949444 20.4435511949444 20.447333321933 20.4610180635478 20.4756260899357 20.4911559015679 20.4971669753439 20.4988190951166 20.5004694177667 20.5021179432812 20.503764671647 20.5054096028504 20.5070527368791
19.9264372358721 19.9580400667852 19.9563486838639 19.9546590974842 19.9529713076594 20.0416157934737 20.1778269643231 20.3149770705286 20.4435511949444 20.4435511949444 20.4435511949444 20.4435511949444 20.4435511949444 20.4435511949444 20.4435511949444 20.4435511949444 20.4435511949444 20.4435511949444 20.4435511949444 20.4435511949444 20.4435511949444 20.4435511949444 20.4435511949444 20.4435511949444 20.4435511949444 20.4435511949444 20.4435511949444 20.4435511949444 20.4435511949444 20.4435511949444
20.065153807168 20.1323136606625 20.130622547914 20.1289332314198 20.1272457111939 20.1847675410048 20.2724394898134 20.3610501297029 20.4435511949444 20.4435511949444 20.4435511949444 20.4435511949444 20.4435511949444 20.4435511949444 20.4435511949444 20.4435511949444 20.4435511949444 20.4435511949444 20.4435511949444 20.4435511949444 20.4435511949444 20.4435511949444 20.4435511949444 20.4435511949444 20.4435511949444 20.4435511949444 20.4435511949444 20.4435511949444 20.4435511949444 20.4435511949444
20.2048138316301 20.3065872911427 20.304896448561 20.3032074019472 20.3015201513146 20.3269805902021 20.3661143053029 20.4061864672269 20.4435511949444 20.4435511949444 20.4435511949444 20.4435511949444 20.4435511949444 20.4435511949444 20.4435511949444 20.4435511949444 20.4435511949444 20.4435511949444 20.4435511949444 20.4435511949444 20.4435511949444 20.4435511949444 20.4435511949444 20.4435511949444 20.4435511949444 20.4435511949444 20.4435511949444 20.4435511949444 20.4435511949444 20.4435511949444
20.3221006364895 20.4435511949444 20.4435511949444 20.4435511949444 20.4435511949444 20.4435511949444 20.4435511949444 20.4435511949444 20.4442446914307 20.4508381088342 20.4564978183276 20.4612253181818 20.4597047458553 20.4534955319948 20.4482176244797 20.4438695249735 20.4435511949444 20.4435511949444 20.4435511949444 20.4435511949444 20.4435511949444 20.4435511949444 20.4435511949444 20.4435511949444 20.4435511949444 20.4435511949444 20.4435511949444 20.4435511949444 20.4435511949444 20.4435511949444
20.3583076482573 20.4435511949444 20.4435511949444 20.4435511949444 20.4435511949444 20.4435511949444 20.4435511949444 20.4435511949444 20.4495178263723 20.5046482332239 20.5588451753674 20.6121101507341 20.6088355144878 20.5540888744103 20.5002732982614 20.4473872880448 20.4435511949444 20.4435511949444 20.4435511949444 20.4435511949444 20.4435511949444 20.4435511949444 20.4435511949444 20.4435511949444 20.4435511949444 20.4435511949444 20.4435511949444 20.4435511949444 20.4435511949444 20.4435511949444
20.3935713727975 20.4435511949444 20.4435511949444 20.4435511949444 20.4435511949444 20.4435511949444 20.4435511949444 20.4435511949444 20.4557259786459 20.5593923873189 20.6621255744687 20.7639270376861 20.757035289458 20.6537522108502 20.5513999537722 20.449977020567 20.4435511949444 20.4435511949444 20.4435511949444 20.4435511949444 20.4435511949444 20.4435511949444 20.4435511949444 20.4435511949444 20.4435511949444 20.4435511949444 20.4435511949444 20.4435511949444 20.4435511949444 20.4435511949444
20.4278920507795 20.4435511949444 20.4435511949444 20.4435511949444 20.4435511949444 20.4435511949444 20.4435511949444 20.4435511949444 20.4628689096318 20.6150703327539 20.7663387775186 20.916675741178 20.9043043083616 20.7524857786571 20.6015978281011 20.4516389593764 20.4435511949444 20.4435511949444 20.4435511949444 20.4435511949444 20.4435511949444 20.4435511949444 20.4435511949444 20.4435511949444 20.4435511949444 20.4435511949444 20.4435511949444 20.4435511949444 20.4435511949444 20.4435511949444
20.3504252962601 20.3601860709371 20.3867223623956 20.4123169397756 20.4369713001542 20.4435511949444 20.4435511949444 20.4435511949444 20.4679269168915 20.6470097051943 20.8260927869688 21.0051761619017 20.9887829304464 20.80969897014 20.6306147176171 20.4515301731931 20.4435511949444 20.4435511949444 20.4435511949444 20.4435511949444 20.4435511949444 20.4435511949444 20.4435511949444 20.4435511949444 20.4435511949444 20.4435511949444 20.4435511949444 20.4435511949444 20.4435511949444 20.4435511949444
20.1761517166957 20.2020103818383 20.2770801161513 20.3512083816226 20.4243966749896 20.4435511949444 20.4435511949444 20.4435511949444 20.4696508754486 20.6487318199619 20.827813057933 21.0068945890478 20.9870663471327 20.8079842306729 20.6289018220112 20.4498191214617 20.4435511949444 20.4435511949444 20.4435511949444 20.4435511949444 20.4435511949444 20.4435511949444 20.4435511949444 20.4435511949444 20.4435511949444 20.4435511949444 20.4435511949444 20.4435511949444 20.4435511949444 20.4435511949444
20.0018781005592 20.0447759940195 20.168378184379 20.2910391511159 20.4127603906276 20.4435511949444 20.4435511949444 20.4435511949444 20.4713745402337 20.6504536412715 20.8295330357532 21.0086127233643 20.9853500563348 20.8062697834071 20.6271892182919 20.448108361304 20.4435511949444 20.4435511949444 20.4435511949444 20.4435511949444 20.4435511949444 20.4435511949444 20.4435511949444 20.4435511949444 20.4435511949444 20.4435511949444 20.4435511949444 20.4435511949444 20.4435511949444 20.4435511949444
19.8276044478565 19.8884826671322 20.0606163269831 20.2318090084126 20.4020622074783 20.4435511949444 20.4435511949444 20.4435511949444 20.4730979112614 20.6521751691378 20.8312527204436 21.0103305648649 20.983634058038 20.8045556283287 20.6254769064463 20.446397892705 20.4435511949444 20.4435511949444 20.4435511949444 20.4435511949444 20.4435511949444 20.4435511949444 20.4435511949444 20.4435511949444 20.4435511949444 20.4435511949444 20.4435511949444 20.4435511949444 20.4435511949444 20.4435511949444
19.8005810098262 19.8642715104532 20.0433448627853 20.2224185107306 20.401492453975 20.4435511949444 20.4435511949444 20.4435511949444 20.4748209885453 20.6538964035751 20.8329721120191 21.0120481135647 20.9819183522284 20.8028417654233 20.6237648864594 20.4446877156514 20.4435511949444 20.4435511949444 20.4435511949444 20.4435511949444 20.4435511949444 20.4435511949444 20.4435511949444 20.4435511949444 20.4435511949444 20.4435511949444 20.4435511949444 20.4435511949444 20.4435511949444 20.4435511949444
19.8005810098262 19.8660071913383 20.0450787012379 20.2241505067363 20.4032226075194 20.4435511949444 20.4435511949444 20.4435511949444 20.4765437721005 20.655617344597 20.834691210494 21.0137653694774 20.9802029388915 20.8011281946768 20.6220531583175 20.4435511949444 20.4435511949444 20.4435511949444 20.4435511949444 20.4435511949444 20.4435511949444 20.4435511949444 20.4435511949444 20.4435511949444 20.4435511949444 20.4435511949444 20.4435511949444 20.4435511949444 20.4435511949444 20.4435511949444
19.8005810098262 19.8677425763103 20.0468122440916 20.2258822074571 20.4049524660926 20.4435511949444 20.4435511949444 20.4435511949444 20.4782662619411 20.6573379922183 20.8364100158821 21.0154823326179 20.978487818013 20.7994149160748 20.620341722006 20.4435511949444 20.4435511949444 20.4435511949444 20.4435511949444 20.4435511949444 20.4435511949444 20.4435511949444 20.4435511949444 20.4435511949444 20.4435511949444 20.4435511949444 20.4435511949444 20.4435511949444 20.4435511949444 20.4435511949444
19.8276823630492 19.8921666387546 20.0631204393549 20.235015124461 20.4078491984323 20.4435511949444 20.4435511949444 20.4435511949444 20.4799884580812 20.6590583464536 20.8381285281978 21.017199003 20.9779587606922 20.8000732595606 20.6212597419026 20.4454877659637 20.4437558848272 20.4435511949444 20.4435511949444 20.4435511949444 20.4435511949444 20.4435511949444 20.4435511949444 20.4435511949444 20.4435511949444 20.4435511949444 20.4435511949444 20.4435511949444 20.4435511949444 20.4435511949444
20.0019561985062 20.0489626452513 20.1713843808667 20.2947467558331 20.4190482748494 20.4435511949444 20.4435511949444 20.4435511949444 20.4817103605356 20.6607784073166 20.8398467474553 21.018915380638 21.0064747742258 20.8771234822168 20.7468444156731 20.6182151106167 20.5679506692549 20.5186128094643 20.4702000359882 20.4435511949444 20.4435511949444 20.4435511949444 20.4435511949444 20.4435511949444 20.4435511949444 20.4435511949444 20.4435511949444 20.4435511949444 20.4435511949444 20.4435511949444
