3.354050297968625927e+01 5.028037125180736666e+01 4.372368135943890621e+01 5.524666710206871301e+01 4.175633189554523028e+01 9.176776898789697157e+01 9.026797738676852134e+01 2.408364887707062962e+02 4.384447271304570677e+02 2.007991683376061474e+02 9.527127525498424632e+01 2.186717826117050834e+01 1.297402420262951495e+01 4.964507778725713649e+01 5.968712676104068748e+01 1.362060126776347246e+01 5.090355105405063796e+01 9.519868304427504313e+01 9.272264091113363804e+01 3.478222566562066476e+01 2.802408691193999246e+01 4.081691250486816358e+00 3.183000210066975200e+00 1.276541912370495346e+01 2.498419916192522550e+01 1.986646693192538038e+01 9.343781427896212577e+00 8.348095128127559494e-01 8.019767312444348040e-01 1.015782289375569247e+00
2.559927159807227071e+01 5.593377873199125361e+01 1.001738714246475865e+02 7.885200206383160548e+01 5.526382096513253828e+01 2.513724770719966273e+02 1.238089197189732289e+02 1.499985879897559471e+02 9.827523160639299249e+01 8.441625433598403561e+01 6.438625228723532246e+01 1.301591567593380105e+01 1.764338146367072113e+01 4.137074186435603451e+01 5.929797388843128658e+01 3.949276344073580702e+01 5.194715898113837227e+01 1.823812245710896605e+02 1.489677312261445934e+02 4.816504085666557700e+01 1.733383497656689798e+01 3.927742476851879161e+00 8.332248662911940329e+00 7.466069829756013299e+00 6.677678096761979987e+00 9.119812806077723266e+00 3.317711364021803888e+00 8.573184373390485558e-01 1.219609605959692145e+00 1.221927037926726189e+00
3.025859485819865426e+02 2.951949328028046580e+02 6.131959893985126655e+02 4.842209736398499444e+02 1.067353454025181463e+03 1.128018631968012642e+02 2.255702729476384150e+01 2.413983979153990589e+01 3.957520638344528265e+02 1.204311057615350364e+02 3.355771421960783982e+02 2.314660214477171394e+02 8.733107054402918834e+01 1.310925417919727352e+02 2.565090338846035678e+01 1.114803316116299925e+02 7.954851105870555728e+01 1.759459160730829694e+02 6.378380074591295852e+02 1.147638516937007438e+02 1.114587762929635595e+01 3.285226255634689174e+00 5.099605545227860581e+00 1.819507128294805209e+00 1.113102233102822636e+00 7.618169325199453112e-01 7.028779509613376497e-01 5.469019229202394250e-01 9.143215713360453023e-01 1.020226796029787941e+00
1.431459710403779866e+02 3.885302049509149356e+02 8.368870172568083490e+02 6.592506530733564887e+02 2.877274420790978411e+02 4.639796985057786571e+01 3.875320614890563320e+01 2.595668004892828407e+01 1.577187525233128973e+01 1.429488098767252779e+02 9.223118030879032858e+01 1.915370337511695027e+02 9.147663725227133114e+01 6.334038301935785853e+01 1.916580770716759119e+01 1.507564621343343170e+01 3.309481823389069177e+01 6.553994003450378614e+01 4.982770416520953205e+01 4.531907482987740110e+01 2.120217306151091563e+01 7.430576415006200364e+00 2.374670848066833262e+00 4.686123308800438814e+00 8.972189823025522593e-01 6.809643130584176474e-01 6.016060694734959302e-01 5.580274743763165013e-01 1.092435034185660125e+00 1.182387817829565257e+00
8.723629901100416362e+01 2.605562060962519126e+02 7.074978607330285740e+02 2.747981711729729568e+02 1.682880974748121332e+02 2.515641358302266894e+01 3.831868224174636595e+01 2.122070970604947604e+01 9.691899433072405756e+00 3.261463993951135762e+02 3.955309035771791741e+02 3.540223059194175903e+02 5.509714861828083343e+01 4.735645973909170436e+01 2.286838812942369259e+01 8.717275535279108922e+00 9.700539406437351886e+01 5.791240213362853240e+01 9.770405528828077024e+01 5.841172475934627073e+01 4.188455211773344899e+01 1.211331327345586928e+01 2.756386940089083737e+01 7.718001707755201224e+00 1.580057874183235622e+00 8.831023218854689993e-01 6.281103729968531280e-01 7.150263571919247552e-01 1.081970746822878304e+00 3.979423870975167254e+00
9.056562762970492031e+01 9.726912028235157948e+01 4.278062996778867841e+02 3.414419064974715639e+02 1.398425476159251843e+02 1.481644986686475107e+01 1.771916662642272300e+01 1.869053372170165517e+01 1.705134001130778287e+01 4.950500386672448485e+02 3.757674074371004735e+02 2.056705335971014392e+02 2.449334760194268057e+01 7.625490199685339476e+00 5.935193707286428477e+00 9.916586732604667276e+00 5.304536220537312374e+01 1.412052319147903567e+01 4.706619166966896728e+01 1.669744923026673860e+02 2.135181327914714871e+02 1.330647874301430420e+02 3.470042851573430909e+01 4.574130290600754378e+00 2.318115004435070237e+00 2.255419732600820737e+00 1.430301062600410233e+00 9.733127715401919122e-01 1.242482612102889350e+00 2.248031226087218837e+00
1.274823219791582218e+01 2.115593050329256641e+01 2.237936099612720398e+01 1.134452796042904765e+02 5.457304206976586158e+01 8.923551365108352229e+01 1.318958397840583530e+02 7.359382482540540593e+01 8.517765442700599010e+01 9.666119080395364449e+01 7.298552138364679820e+01 3.065092716812315388e+01 1.272389565620219898e+01 5.065845840711626025e+00 2.718782769729694238e+00 4.936167189405692213e+00 2.944522545260187485e+01 1.407846415874036694e+01 7.281399345427722380e+01 1.015932479814306930e+02 4.937788657614353838e+01 1.245160441635336568e+01 5.117633621615034656e+00 4.093842538973115452e+00 1.554061424004431924e+00 1.639880329002975534e+00 1.455196228088786681e+00 1.251049351701634338e+00 1.411601114644008614e+00 3.381170331951336205e+00
2.663567910780868431e+01 5.051330716563280276e+01 2.978018501127685980e+01 6.478398146497914922e+01 9.966129187909592702e+01 1.100148685341895884e+02 9.571978327698008115e+01 8.926912566377994551e+01 7.146003650983138300e+01 3.971310960349384800e+01 1.587662765983428237e+01 4.883208698590483721e+01 1.041966978442777325e+01 3.485563931925768522e+00 3.590505218309204771e+00 6.677391867364416811e+00 5.636248745964542195e+01 9.221743389478885433e+01 8.308830908491296441e+01 6.104592278905735725e+01 1.761091898608137996e+01 8.700400684734216128e+00 3.066729239151333886e+00 2.444145894296320787e+00 1.171176450856540541e+00 1.253168449123302608e+00 1.960636013614906803e+00 2.456036007359679196e+00 2.445163013061533608e+00 7.225740983326469191e+00
6.852833414799911793e+01 4.543444160780286722e+01 2.707933841198112646e+01 1.588583741254823281e+02 1.050755129696763532e+02 4.415469730799838999e+01 1.417852941794550361e+02 6.314539951977523913e+01 5.276979621766154338e+01 5.176552117089424598e+01 4.597000677484118825e+01 6.048388054060357888e+01 1.315410064025459178e+02 8.556350924372551958e+01 1.269344203798180537e+01 1.155609846477112868e+01 5.144052372207571722e+01 1.613502304338964279e+02 1.650093262550005591e+02 2.876868519097101284e+01 4.776279529373438137e+00 3.859449273875638298e+00 3.801540165018474582e+00 2.380822067630015137e+00 1.394352253447098233e+00 2.172205709298593579e+00 8.242589589206781753e+00 1.659647025067814496e+01 4.801837963090861194e+01 2.382983607215082600e+01
1.122159191545954542e+02 7.201191600939500859e+01 1.175268929601754166e+02 1.108824062636225563e+02 1.017616557381075495e+02 2.028610167030672784e+01 9.361255569448636038e+01 3.952183182683123164e+01 1.655858304023712435e+01 6.175184321804209731e+00 9.015258681974324872e+01 8.763473102183860419e+01 1.835541347752859451e+02 1.942054298273542372e+02 9.079689754434598115e+01 9.728895679646102224e+01 5.354893241775855586e+02 5.783129480022666939e+02 2.437050636363368596e+02 1.146733602038307538e+02 5.923427747351281525e+00 2.932540057447559079e+00 3.123401697487047102e+00 3.330562760657590715e+00 1.829603701172185959e+00 2.375004130658506352e+00 2.251150810424714166e+01 3.867943170212142689e+01 4.829892661897280703e+01 1.273280266726767707e+01
9.449781141959932995e+01 4.849879762409248229e+01 1.104174029665902026e+02 9.455918115839108395e+01 1.272242461769502739e+02 1.182122918018465185e+01 9.865519577919979355e+00 8.535212884558184498e+00 5.332477984653803738e+00 4.757505658577302654e+01 7.410129245056364198e+02 1.227270384563568768e+03 2.488212919190875255e+03 1.185448237549661144e+03 2.116580386825854703e+02 3.981411931139103899e+02 7.459809418319455290e+02 2.162007443546171146e+02 5.440578960009035825e+01 1.143597820512850305e+01 4.043149155089906799e+00 2.909969759812953249e+00 3.570707707484233051e+00 4.919141833063889635e+00 5.189301349253156559e+00 2.811146902524050972e+00 4.458988961872911716e+00 3.575291599694828903e+00 3.205962876228774849e+00 2.303003620155706255e+00
1.768358342224375335e+01 1.039542468015563870e+01 9.310609676567696624e+01 9.195911305355946297e+01 7.459146871062623063e+01 1.730918741462371102e+01 6.714157353227281355e+00 4.296449465899700115e+00 5.297859541186601184e+00 9.804492913032544266e+01 2.343174558103215759e+02 1.506996191802977364e+03 2.608598317389466501e+03 1.302139232370204354e+03 4.560457997395764664e+02 4.929296844941283098e+02 5.467822204390602110e+02 3.298319807334104325e+02 8.328888053991981621e+01 2.422483116085136601e+01 3.674059069198764682e+00 3.340474411035076585e+00 3.869286361096028415e+00 6.914126273110033694e+00 6.586675970877291064e+00 4.683896863125778687e+00 3.583141519668647135e+00 3.241434340815784410e+00 3.457124667036254095e+00 3.692352624846391151e+00
3.415520865919319249e+00 8.811780626119926296e+00 2.192124292357216575e+01 6.339083079661254772e+01 4.245485698013009568e+01 1.360244324036514385e+01 6.967146867770623864e+00 5.824703974524208405e+00 7.339500700219309337e+00 5.194230628111448311e+01 1.692521280650326432e+01 5.019917707890606380e+02 2.032746950247348195e+03 8.232511813113410426e+02 2.473508193588483266e+02 2.720991120535145456e+02 9.932307938357283206e+01 1.454939868716808462e+02 1.670698321152675874e+02 6.331863289497481162e+01 4.334334623262224184e+00 3.957051628038109392e+00 4.852383003000454664e+00 8.368256144422801412e+00 1.097175580852620058e+01 1.032575334699251535e+01 7.655503550461910223e+00 6.943995195765276129e+00 5.277605138624052117e+00 4.071071710862231186e+00
2.714992188656780492e+00 7.806044846529535342e+00 1.461932796574299331e+01 1.091855965996080258e+01 6.621342421060910866e+00 2.653065759595635598e+01 9.300900741185731135e+01 8.208436931412585125e+01 1.094492723839773340e+01 3.312684104824221265e+00 1.306017385152969368e+01 8.526371884533820378e+01 9.605237743972272710e+02 1.217959263034106016e+03 1.228403921827790327e+03 1.568398338728971794e+03 1.353438264474274320e+03 8.389495720253612490e+02 2.224961285023479832e+03 1.052944657516815141e+03 9.106553300616224078e+01 2.687611134964778614e+01 2.048546482612830744e+01 5.162910532796233554e+01 1.191530932538827585e+02 1.101168408727222072e+02 3.039587466048439524e+02 1.031937500575471631e+02 8.318115531091457626e+00 8.094118170570357762e+00
2.484124759925236958e+00 2.505326024039750799e+00 7.079374536366811022e+00 5.412479920820564416e+01 2.006548770875291510e+01 4.766771101126835219e+00 6.319534200529450629e+01 1.879844819798784386e+02 1.308492232242349758e+02 1.337869458627973884e+01 2.833882013956467461e+01 4.450748660386292954e+02 9.071493531122703189e+02 1.071211240810011304e+03 9.042109239560461447e+02 1.012136053865566168e+03 1.617174066810837758e+03 2.626088742881232974e+03 2.588131135288491350e+03 2.076524038301441124e+03 9.323642597602599835e+01 9.926888644682276208e+01 8.723095610943653355e+01 2.660866338341708115e+02 3.616307688479156468e+02 1.799537717624363722e+03 1.837727342516395311e+03 4.053056707672237735e+02 9.455271541454131068e+00 5.723550492697359715e+00
2.219505473488765812e+00 2.438979278819590757e+00 5.712526524841042175e+00 6.437627533239492550e+00 4.338425160316954354e+00 4.974504789126255488e+00 3.533252212549421500e+01 1.007507696467242368e+02 2.127989964207565663e+02 7.753264621008437985e+01 8.147396652631221059e+01 7.226660498571672520e+01 5.457704028791139308e+02 1.027026803963271504e+03 8.952820307486670117e+02 1.273555461295951318e+03 2.009310649542355804e+03 2.274876361301964153e+03 1.271315069809975512e+03 2.796798922105570000e+02 1.693055724256090571e+02 1.147752246185124932e+03 1.616873681990792647e+03 2.624869290092902247e+03 2.356303504641603922e+03 2.998314654030880774e+03 2.480807675775612552e+03 7.757921153143105357e+02 1.453017933638370707e+01 6.609574352634909999e+00
2.760120060193983704e+00 3.231931463183576714e+00 3.246183325700867872e+00 3.144391815620958042e+00 4.864997079569858940e+00 1.017413454833398490e+01 5.908976430415305003e+02 1.977810141982131654e+03 9.758395799893557978e+02 1.723126475755168201e+02 1.329701692274473146e+02 2.163060984253593801e+02 4.195904065470164142e+02 5.704698501564273556e+02 6.970157639067639366e+02 1.160265100529187066e+03 2.256016292038288157e+03 2.137256415730974368e+03 9.843565117181317419e+02 3.321537256913248370e+02 1.363496879552154724e+03 2.323989241515484991e+03 2.854693757351667045e+03 2.832655040456940696e+03 2.436580728544605790e+03 2.099491667845925349e+03 3.217534959781218731e+03 6.020183202688459687e+02 2.119959990741749678e+01 9.052567302189439502e+00
6.780443237330935347e+00 5.406464071820232142e+00 2.856949367763682801e+00 4.554690330751982152e+00 6.047257062008569051e+01 3.047387813104259067e+02 1.675519519384557952e+03 1.357215939607915061e+03 1.346296513120633335e+03 6.997006320720947770e+02 2.689032618428547607e+02 7.706176516612413252e+01 7.449044695779141989e+01 1.757401948529056313e+02 3.639098478414110787e+02 1.554199859525218244e+03 1.494184754602340035e+03 1.633147287066376293e+03 2.705769985398478639e+02 4.547421724559907830e+02 1.483030245694557379e+03 2.964401851347014144e+03 3.487965083369427703e+03 3.507881553111739777e+03 2.893024789547555883e+03 2.821971668180626693e+03 2.732142174746828914e+03 2.244308889224829272e+03 1.071416231954362104e+02 7.255179458720168384e+01
3.082445991231921756e+00 8.681808294898971212e+00 1.635460156025814982e+01 1.164598437007421978e+02 2.686931751201288989e+02 3.809568791862552644e+02 1.189584707282579984e+03 1.474186545109851522e+03 1.018383221858273828e+03 8.102410800348959583e+02 1.757897715103052292e+02 1.788642343579988037e+01 2.653963508180899566e+01 6.911476935721000814e+01 1.388483790597829000e+02 7.633095600456003922e+02 2.698366226012201992e+02 8.095771119407629612e+01 2.552562983064630231e+01 1.750402556127205571e+02 5.925311033730092731e+02 2.874628291961886134e+03 3.425240786429812488e+03 3.463637718273822429e+03 2.505640088464361270e+03 1.164306411255645344e+03 1.917823740148612615e+03 1.360665871993349811e+03 1.298659628223090863e+02 5.376643797187804807e+01
7.955632690082924796e+01 1.061057570710939757e+02 7.362351864635431298e+01 9.524688857620407134e+01 2.356980696992041260e+02 1.366768299646686273e+02 7.018349836096024319e+02 9.024682052179016409e+02 8.357881965217220568e+02 1.983061067502463004e+02 5.027767377802946669e+01 1.072885360137246025e+01 1.819509945433785703e+01 5.004421027157651736e+01 1.854862517173927472e+02 1.170767414433543934e+02 1.989216903332053903e+02 5.499180796642642832e+01 9.648851517495424446e+01 4.244420368967504373e+02 2.000657679863459180e+03 3.467041988634910467e+03 3.493882754534755350e+03 3.182833890241890003e+03 2.384588546379564832e+03 1.724710767071484497e+03 1.681346587759698195e+03 1.168312749333220381e+03 1.106674750390406814e+02 4.071766998680086402e+01
2.343823166379143004e+02 2.256807885196932659e+02 1.227857055077488155e+02 9.389666109114561721e+01 1.304714955136410595e+02 7.126366500701763584e+01 4.071144289141433319e+02 3.643498902387989915e+02 1.005478423000876944e+02 5.364956145839113333e+01 1.820018627405197975e+01 1.427073811363207945e+01 8.295424747918364261e+00 4.406532648294407828e+00 1.097947675296433800e+01 3.553368987689126612e+01 1.178672055006792050e+02 2.506727215059939908e+02 2.255395230447595623e+02 9.312023806941429029e+02 2.259867368550780611e+03 3.017481436630323515e+03 1.156198322362746921e+03 1.631075280206521029e+03 1.996757717545302057e+03 1.091037964110941630e+03 8.101657086270520267e+02 6.869573028720980119e+02 2.620286966626561664e+01 2.389168961306582872e+01
1.941370044441774212e+02 2.354767383736549391e+02 3.711717333753546910e+01 2.755973813741894674e+01 2.436926266372673311e+01 3.729470889878338369e+01 5.370856634260237428e+01 1.353648308099411324e+01 1.763801585287495044e+01 2.722891235023380041e+00 3.522498309761544988e+00 5.300486612392751873e+00 5.752613686083540401e+00 1.993672185101566185e+01 5.452435561712782430e+01 6.830306006152706004e+02 1.207973403814562971e+03 1.627423105617961710e+03 1.033943015962116533e+03 7.223208746536599847e+02 4.686053259207057522e+02 1.577477426309997099e+02 5.694826820912564358e+01 1.115879122259773055e+02 3.757450167316977740e+02 1.213935262595587119e+02 1.123517042465478539e+02 3.898598735087131217e+01 4.467122751377712753e+00 3.652094573926635945e+00
4.128116750699974773e+02 3.328648080612368858e+02 3.827560711435805985e+01 1.761368000285123969e+01 2.763583549165962694e+01 2.212557259023494538e+01 3.457966819034389516e+01 3.738914055535052849e+00 3.169547855868482422e+00 1.356814437969513953e+00 3.183805258394879267e+00 5.962677638092559462e+00 7.798843599407307536e+00 4.095737771287122087e+01 6.531731897548515064e+01 3.963177922182767361e+02 1.337276043981225257e+03 2.304428297027266126e+03 2.400712874753404776e+03 1.967170012858319751e+03 3.968672787862232667e+02 8.282431777820512764e+01 9.601969159918155583e+01 2.134542167498722165e+02 4.427617994640775123e+02 1.235598707063678035e+02 4.816826536179878815e+01 1.858409307857228754e+01 5.841153984530416565e+00 5.230181494755128391e+00
5.235106922311141489e+02 6.940585266585073043e+01 2.023088651286654027e+01 7.010207195872972363e+00 8.471271324140580816e+00 1.901101925392242364e+01 2.483914482790139289e+01 2.814140974392581818e+00 1.562767935425546817e+00 1.786918763464882653e+00 3.133691639086282343e+00 5.300214780213272192e+00 5.905421756187717364e+00 3.195483628999616599e+01 1.213413001853347737e+02 5.693924197740252566e+02 1.018141720724681818e+03 2.178808792624993657e+03 2.528630976503297916e+03 2.008513541250825256e+03 9.462157205813086875e+02 5.103152241307739700e+01 3.394062472361456173e+01 6.816658399518451006e+01 3.684347688096935372e+02 2.045879208508139868e+02 1.818866567429680288e+02 3.463718982277838165e+01 5.274215475371896389e+00 4.025566918084299672e+00
2.986677008654285146e+02 9.552700830354528705e+01 3.860299341070373202e+01 3.770268992675232766e+01 8.902983256975215909e+01 6.256185034052433025e+01 2.629945098782693691e+01 1.093655683106217325e+01 1.653925044845471604e+01 2.128516433697631527e+01 1.961328791375076097e+00 2.189485972706686212e+00 3.363686280866958089e+00 7.467525885844472633e+00 4.422543604848728194e+01 1.763968699044804112e+02 1.651275323320229518e+02 6.594378771110191337e+02 7.935805553455394374e+02 6.398016023210631147e+02 5.018170550566586599e+02 6.077261096147543640e+01 8.809900582941891045e+00 1.665845680214535562e+01 7.079313026500206263e+01 1.659374935594645990e+02 4.381882794927118994e+02 2.447975647393616327e+02 6.340116427175869873e+00 4.742388878176207356e+00
1.074847958762607050e+02 4.399660604396420638e+01 4.874853341246944183e+01 8.606239878534493926e+01 4.996332032584524541e+01 2.301634146773756484e+01 1.075294057696723016e+01 7.679750280770049287e+00 2.456617314606888769e+01 9.394183020045835519e+01 6.319882373539676301e+00 2.157956951745607643e+00 3.597996905938910750e+00 7.742217135688687080e+00 3.603773828640346721e+01 6.329885489216964345e+01 4.079405511285842323e+01 1.904096625494789663e+01 2.839023720395954342e+01 4.905204986676452705e+01 8.290987639272987053e+01 1.805252554198684223e+01 8.919070582213185716e+00 4.487704860236321736e+01 1.073683329143854337e+02 3.616670311863551746e+01 1.211793647866690549e+02 1.327787267361757415e+02 4.818864815695384607e+01 7.311153933493230284e+00
1.090136177200890586e+02 9.028975127744766382e+01 4.563852883119781012e+01 3.506792794673873459e+01 3.470096053347089082e+01 1.338379293273951731e+01 8.982030435051113315e+00 9.354214375466604281e+00 1.043391189698906629e+01 4.112553766696703406e+01 1.146679533034466658e+01 1.077472040178221668e+01 1.002710352930024129e+01 1.226156589123035801e+01 3.492123380775290542e+01 2.410299735211101080e+01 1.587012049527455204e+01 9.278307518140454846e+00 7.989074845719482454e+00 6.015628979510365681e+00 4.719812265241976945e+00 6.800646677408013652e+00 1.067651199881352753e+01 2.646546610941640409e+01 4.616222631703726620e+01 2.197974026590826213e+01 3.485969273050784523e+01 2.220463023969739425e+01 2.210828688664292230e+01 1.411869885660815527e+01
1.477414810337029962e+02 7.951821702410691728e+01 4.692876488410094282e+01 6.729144531031788290e+01 6.285605616938813966e+01 3.504492356216955784e+01 1.216104754676180448e+02 9.376992087125847775e+01 1.404201072122289062e+01 1.005647852196939063e+01 3.541127857663829204e+00 8.035268297217967870e+00 2.352481060407249913e+01 2.568443342650195049e+01 7.867535572988150250e+01 5.863081179705104518e+01 1.811280110571533086e+01 2.106377800241321552e+01 9.546663937191445015e+00 4.092456971468090288e+00 3.690318424153252508e+00 5.592635593944628170e+00 8.634826891041120334e+00 2.711741708002405105e+01 2.804401296782763353e+01 6.747547049603230818e+00 7.511724285584868710e+00 9.449940845998401784e+00 2.991506471986932070e+01 6.180826061173143593e+00
1.983762591136602680e+02 1.772348345422234104e+02 5.580555081819295538e+01 2.004894712778101393e+02 2.471486997828016001e+02 4.781413241798552463e+02 3.273819070966379172e+02 3.793502506679631381e+01 1.387232347095148022e+01 7.911003175979995028e+00 2.306569896133584763e+00 2.847873795520869500e+00 3.523332294660578512e+00 1.405436713981721653e+01 1.762114329700531101e+01 7.955853340834396548e+00 7.615914680407874116e+00 8.954391245462437254e+00 1.193048318898514282e+01 6.426243741914966279e+00 3.484797746603723656e+00 4.717728877568302615e+00 5.283842092961895887e+00 9.118341171898450170e+00 2.931352519127731071e+01 4.687153214467532969e+00 6.823503559527119400e+00 1.105297339652544863e+01 1.287749389642558384e+01 2.603576499272207201e+01
1.088165561733646030e+02 2.800721246835511238e+02 8.717226646189536154e+01 9.833981591926863075e+01 5.043439873711560040e+02 5.486158101434552918e+02 3.751452480096387490e+02 2.647947062259918738e+01 1.898149981286410437e+01 1.763098432871797172e+01 7.125142266519018719e+00 3.478153796938107778e+00 2.215517008883563399e+00 3.889752165757409230e+00 1.875276561374224826e+01 5.502432840334551933e+00 1.917566837007829150e+01 1.115922521358043866e+02 1.905955252838777483e+02 2.610524690352643518e+01 5.097584986732210943e+00 6.434149435801532313e+00 5.459030291911259880e+00 6.157883476587988625e+00 8.383298619125200801e+00 6.537008508661303452e+00 7.750032253965347451e+00 9.506960968325952166e+00 1.234693635063517547e+01 3.080439209974442605e+01
