3.435119160448084630e-01 4.987205536769697134e-01 4.239048630441370480e-01 5.274887534403751577e-01 3.715051649456161398e-01 7.756958234535360486e-01 7.067640679865052622e-01 3.264974165540512896e-02 4.701027700864602449e-02 6.050079527305203542e-02 8.612631175937841554e-01 2.241435082026537184e-01 1.467226633837692140e-01 5.778980284685899527e-01 7.129860836293510085e-01 1.685978770800532489e-01 6.356605810612337981e-01 1.547838055459187408e-02 7.698952963293191967e-03 4.677275355686664748e-01 4.344237858833870369e-01 6.445190919682339259e-02 4.896833052054420238e-02 1.954740664312892284e-01 3.805440044090738771e-01 3.001202135264001702e-01 1.389786309396238151e-01 1.225786309390407801e-02 1.172500343558381328e-02 1.477774584943441008e-02
2.265935553513995226e-01 4.846872278377986065e-01 8.547280918143209671e-01 6.447678525024601592e-01 4.446884520461800161e-01 8.674903394327621031e-02 3.460677619210048711e-02 2.661594104828064397e-02 1.268660222822536564e-02 6.523181699287596835e-01 5.274702187355588823e-01 1.155212107863567428e-01 1.729685855010588691e-01 4.443967048583280510e-01 6.475488301528757873e-01 4.632989947805547515e-01 5.903059005919691904e-01 3.716527177867109955e-02 1.128980495812236494e-02 5.594814876150243643e-01 2.493770200204402099e-01 6.199808325344868809e-02 1.275480332330495847e-01 1.139622614109322835e-01 1.015441869499103811e-01 1.374325771316153022e-01 4.888951828246520387e-02 1.244681355955681162e-02 1.773331105035686611e-02 1.774785184935686461e-02
4.887448023677493092e-02 6.468869271319924175e-02 1.324061542686388593e-01 9.599445064214100209e-02 1.697652552000351589e-01 3.043854820026656305e-02 1.866430827908135970e-01 1.958462916170646273e-01 6.914008384919727301e-02 2.054818655278807527e-02 5.694948066849207097e-02 6.957137706821120426e-02 7.850348197966413588e-01 9.088539661576081063e-02 2.655328527971058672e-01 5.980766428463763634e-02 9.052172869438936953e-01 3.561695585914437939e-02 6.437685532861482651e-02 1.335028381459265126e-02 1.574416727341315103e-01 5.148512361018022648e-02 7.766669354638604250e-02 2.701153581440330492e-02 1.616406081723748694e-02 1.078676948304999397e-02 9.797755006287342180e-03 7.697109627452802978e-03 1.312661155409711698e-02 1.471310258815843562e-02
2.091002819992027889e-02 5.664194602626183850e-02 7.435230811880672031e-02 5.991534543043555011e-02 3.861836460363035628e-02 3.793487924704956327e-01 3.780053944334671456e-01 2.351085023197033441e-01 1.275506499639895985e-01 1.636999958019819817e-02 6.608552521650611355e-01 5.119489654755867564e-02 7.726313427469979622e-01 6.248433022859085639e-01 1.958741612634773421e-01 1.669662451937555525e-01 3.671088551680843359e-01 7.217166454263098663e-01 5.654470005399607757e-01 5.238235652517154728e-01 2.865610554172206004e-01 1.099886029009644051e-01 3.656548435844567124e-02 7.197989059084403118e-02 1.322986508863675803e-02 9.523118588234433940e-03 8.266414264312241938e-03 7.847902915564780590e-03 1.593847377893539349e-02 1.732149762456503678e-02
7.246355387014624672e-01 8.193455105787632309e-02 8.873743844740004938e-02 2.254603235904576938e-02 2.425504515213706275e-02 2.219319797828716023e-01 3.889294323122583497e-01 2.196806800575382412e-01 8.099387969405423549e-02 4.321399647047487191e-02 4.069598433762264267e-02 8.035018676583713382e-02 4.675115954056083822e-01 4.847632260385170699e-01 2.538051519137739520e-01 1.031502451892634120e-01 4.602389189034938183e-02 6.970497129633808076e-01 2.771991903020799841e-02 6.572033174296716407e-01 4.631807311385391923e-01 1.429819596231008960e-01 3.611686320128084104e-01 1.187807284513248962e-01 2.390090620871068716e-02 1.268235343149144885e-02 8.841300352513752417e-03 1.024234884811178400e-02 1.604528709059029404e-02 5.909922331657729150e-02
8.342318447153094230e-01 7.827911466710725241e-01 7.618699014098459510e-02 4.674941013922669086e-02 3.844448621435009317e-02 1.294071498790933250e-01 1.685247691026831030e-01 1.809902656744075689e-01 1.520635286483885407e-01 1.836469534481978694e-01 9.367604963002702789e-02 5.426373657963432656e-02 2.099233680100328625e-01 7.961134778239487009e-02 6.722796609471924645e-02 1.183978187661758608e-01 6.513762568404094511e-01 1.694449408192449935e-01 5.411489144269957530e-01 4.591737519170516202e-02 3.253335968179216914e-02 2.721881495589949587e-02 4.478533341750511321e-01 6.958302091117915533e-02 3.567855468515218620e-02 3.305804606223655684e-02 2.058005445706811640e-02 1.424174434640489845e-02 1.887090853573975685e-02 3.402794932058615662e-02
1.351161725853836371e-01 2.058302759338317411e-01 1.985085403633596035e-01 4.960285186970340987e-02 4.479884201222018025e-01 7.594162857814239498e-01 1.106752361016396652e-01 7.040733452422744953e-01 8.096542263113302162e-01 8.540006863391271796e-01 6.047436756251464152e-01 2.557066450561817916e-01 1.167295303039762311e-01 5.433892266677180921e-02 3.212209174344621970e-02 6.016299673444486240e-02 3.562900794429720852e-01 1.679608532356413331e-01 8.254111793239224948e-01 4.474667650880954917e-02 5.324207670119140978e-01 1.456418459260275244e-01 6.665317686215620208e-02 6.310455406693182834e-02 2.417016342014161739e-02 2.455449796355765879e-02 2.164860170612775345e-02 1.891001802336513340e-02 2.206873728195971746e-02 5.235348613334980805e-02
2.903658456160604917e-01 5.400097821228510009e-01 2.834739969302827456e-01 5.573668254159731550e-01 8.248695879873733094e-01 7.713112103649837070e-02 8.476174965484846169e-01 8.509631708679057382e-01 7.493198640916605147e-01 4.122884276212833710e-01 1.616265721838074931e-01 4.762392692622867685e-01 1.020255173244135893e-01 3.577684778541771748e-02 4.103205716892256022e-02 7.904448576668549054e-02 6.275349698323047232e-01 9.860612404321289493e-01 8.668645434830728469e-01 6.605689498413066518e-01 2.091389253332618936e-01 1.189574021807759396e-01 4.688676699923186031e-02 3.882969473878598865e-02 1.835555614102764646e-02 1.918889356223628384e-02 3.098549613529259436e-02 4.015659422207507739e-02 3.963266496983259418e-02 1.143378710808133913e-01
7.305072566344421592e-01 4.717998515736598897e-01 2.515290370823964339e-01 1.270836445024404182e-01 8.564196529252020573e-01 3.819459017886439600e-01 1.557884612965337867e-01 6.254892793141284546e-01 5.793832275251039610e-01 5.720696809755326795e-01 4.970206705475868625e-01 6.088800012496197178e-01 5.835209488451161691e-02 8.353782190940178820e-01 1.325699246609456927e-01 1.141385914874503416e-01 4.704949209405308030e-01 6.415133899570163445e-02 5.794719357499995838e-02 2.793582527546755734e-01 5.377314730196129655e-02 5.430362430312391658e-02 5.857294155763431015e-02 3.800784290644157459e-02 2.215422781686071305e-02 3.379153299485108258e-02 1.337562976002369397e-01 2.684870477327129801e-01 7.628384007712266657e-01 3.711367778075230217e-01
1.187018384466270504e+00 7.511609501563649705e-01 2.148113988304725108e-01 1.351123757830107741e-01 8.367764054001348706e-01 1.729703784541123390e-01 8.806029303682781917e-01 4.006243484234123242e-01 1.906914143916806914e-01 6.741111499761576198e-02 9.007987250722441219e-01 7.541991009019274328e-01 4.551141247736371909e-02 3.873375864511967304e-02 8.218939750418279289e-01 8.256809139304521761e-01 7.091754920735970913e-02 6.354031543037237661e-02 2.900328027636974587e-02 1.890696061361986022e-02 6.584608410140130319e-02 4.142680415872944388e-02 4.737999917772230118e-02 5.190347659583918749e-02 2.891585478161270290e-02 3.701275590785248898e-02 3.572231028058677760e-01 6.077812638236007592e-01 7.476714289289412285e-01 1.943107732870767990e-01
1.009498800205859359e+00 5.083110146585795297e-01 1.076443558810317391e+00 8.853875674013589325e-01 1.769266455724654852e-01 1.090405765391980475e-01 1.006458059939295407e-01 9.299515662964570606e-02 6.197980657432961005e-02 4.801403113879665896e-01 1.146396776921083105e-01 1.438420183426329380e-01 2.068223231476959967e-01 1.160040141746714326e-01 2.699859842690566919e-02 5.129411279765150322e-02 7.599901268898615059e-02 2.873030052796842967e-02 4.485484379904434160e-01 1.088780163675699408e-01 4.474436569089790261e-02 3.983857557513008352e-02 5.138011047321090763e-02 7.184322709755486258e-02 7.676093378946131918e-02 4.182685744505523079e-02 6.749937928042017143e-02 5.350580510057702938e-02 4.783197541444291628e-02 3.429349633310124074e-02
1.961162112976062022e-01 1.123464797648813657e-01 9.601372387407602904e-01 9.162542923734007250e-01 7.201454604099164492e-01 1.692054495387357582e-01 7.346006134123658771e-02 5.029293696496930921e-02 6.106525387805716854e-02 2.209846983366915360e-02 3.611061759407065835e-02 1.068291968839986811e-01 1.822467688929650664e-01 9.363488672674086244e-02 3.349752348409158059e-02 4.170024688902736199e-02 4.576866717175107763e-02 4.773069758330084067e-02 7.466001982269848680e-01 2.469787022032412516e-01 4.262962058837757584e-02 4.313606053421848580e-02 5.094921998628110238e-02 9.118067851847383443e-02 8.676648590350381773e-02 6.197979939085051376e-02 4.781189232180281523e-02 4.375164241680931654e-02 4.789567576884476430e-02 5.207796151861364409e-02
4.050610585739413544e-02 1.016239292198945349e-01 2.392367484668403987e-01 6.644262369427564874e-01 4.365221220081983988e-01 1.426959833946749301e-01 7.650354890825786236e-02 6.695849378572563126e-02 8.374629843763739534e-02 5.461439564435188743e-01 1.533401427061052702e-01 3.955569878313313498e-02 1.472323814585899948e-01 5.665326282649733175e-02 1.766154505903594699e-02 2.248730192155336954e-02 7.353567899833467481e-01 1.851810207097726035e-02 2.797097753527293118e-02 5.189607439306216374e-01 4.078455124981855001e-02 4.453202392922764319e-02 5.607759474057923826e-02 9.320842508647499136e-02 1.188626784213948767e-01 1.043867130962979062e-01 7.799726009894847323e-02 7.335058842366808107e-02 6.446577471152775685e-02 5.351336510429363647e-02
3.377930103374010562e-02 9.626894682067346776e-02 1.705366277967064470e-01 1.224788170182710967e-01 7.248490607205507197e-02 2.873153581788688848e-01 9.776385317187468171e-01 8.581038450541080831e-01 1.143325871664317428e-01 3.580221328875244496e-02 1.283971976269615289e-01 6.959850772972145938e-01 6.661365032594915303e-02 8.019384037971398482e-02 8.472040523303979442e-02 1.258252941672086955e-01 1.131622049960190890e-01 7.344166211620044293e-02 2.061052905581865768e-01 1.273167746319551763e-01 7.327813046873586922e-01 2.668393969970904722e-01 1.990362440629757923e-01 4.718738068663582697e-01 2.387446488609659689e-02 8.166415954481048844e-01 4.373721298124048917e-02 8.304867425267443704e-01 8.703684338192504977e-02 1.005173908521882487e-01
3.107938091730361174e-02 3.115806471068934685e-02 8.451193478130787640e-02 6.303518042247361342e-01 2.298894856515859286e-01 5.290876120186228243e-02 6.507403690568556165e-01 1.016142575443689661e-01 3.147245572068679137e-02 1.347143217466663656e-01 2.812837661698948111e-01 5.437192008456839809e-02 6.713571496351508627e-02 6.622619492389515694e-02 5.952933495985460177e-02 7.162928765482323712e-02 1.232126528841319402e-01 2.149873823842639586e-01 2.212571047445480721e-01 2.310557797638058131e-01 7.091376862217584343e-01 7.940614792182061343e-01 6.585829301055993179e-01 4.187948673700768454e-02 5.056015846278523462e-02 1.900704968117395421e-01 2.334017902768283359e-01 5.253978392226234251e-02 8.941782704763481804e-02 6.827154025673817794e-02
2.814229262051522532e-02 3.057926840156276888e-02 6.882361742927681214e-02 7.636626369688545579e-02 5.128074097426267575e-02 5.418414104443484980e-02 3.010229658029498490e-01 8.038494609537867319e-01 1.973433775836999637e-02 6.832752747895823875e-01 7.470815458171730095e-01 5.986647169968046800e-01 3.398055792839028977e-02 5.884880161948462252e-02 5.491911877110152579e-02 8.421346678891494797e-02 1.474636900244059301e-01 1.815905943971337644e-01 1.064850577362717043e-01 2.654327751256970250e-02 1.937132663165357094e-02 1.436756791900238306e-01 1.896291459955334324e-01 2.687418426329933330e-01 2.318671393545555515e-01 3.048346419295999699e-01 2.451200186471551301e-01 8.209386903885423914e-02 1.299599092215684426e-01 7.631962057491761819e-02
3.573188142036352183e-02 4.107887569897650248e-02 4.008731196745794756e-02 3.775136517941653225e-02 5.433391079310057048e-02 9.067799542073362584e-02 4.746248415424796779e-02 1.393540338421171421e-01 7.791337273695930765e-02 1.619616587476837427e-02 1.661293420504769344e-02 2.606066807041028388e-02 3.896461085842297528e-02 3.967123568968723007e-02 3.994988491370207728e-02 7.215024922173343680e-02 1.579211344350716639e-01 1.618478605192302244e-01 7.797769816594410375e-02 2.718045148112799292e-02 1.184989358123372805e-01 2.169815093293142594e-01 2.808327303604380432e-01 2.915968344162754855e-01 2.594292585366127502e-01 2.259102675207129429e-01 3.360354674252007401e-01 7.781593190010911709e-02 1.799931640828556223e-01 9.739266548193385720e-02
8.894035345143969096e-02 6.942629086842201647e-02 3.375266470509645511e-02 4.732975105283345613e-02 5.601896549223003285e-01 2.491938331070355991e-02 9.073446958549305497e-02 7.162366304062832423e-02 6.999655308386783237e-02 3.471574940329115455e-02 2.001152878417697747e-02 6.867491089566835072e-01 6.664164421771339164e-01 2.051193993867556770e-02 2.897926408078087962e-02 9.039376819811485719e-02 1.099145927336585837e-01 1.364459192870944304e-01 2.413381574980043992e-02 3.856756409216542669e-02 1.317075019028489946e-01 2.883602641529245947e-01 3.599232032732233022e-01 3.778138982001873480e-01 3.148518696409420836e-01 3.061704324823521506e-01 2.866280584849423274e-01 2.884067628699341634e-01 9.175117797267411390e-01 7.566996539672413702e-01
3.597584254786170832e-02 9.893861954757504629e-02 1.697417594089815629e-01 1.655498699396521639e-02 1.932241499284887559e-02 2.449718385880335358e-02 5.462328275474755135e-02 6.794652101348487572e-02 4.630554540783933526e-02 4.498376018888738948e-02 1.653100859555840449e-02 1.846074681267762529e-01 2.864647026310881972e-01 6.752691733856257539e-01 1.650324391842926397e-02 4.270275956692999586e-02 2.387354353541761703e-02 6.528039048665091881e-01 2.060663246410054661e-01 1.789315229880114252e-02 5.161087403820986685e-02 2.781099602505561763e-01 3.561492525868147907e-01 3.768183892326831819e-01 2.776262157433760369e-01 1.299076882738905148e-01 2.121892422628661734e-01 2.205839371865512821e-01 8.237474571221092834e-02 5.521857051492329305e-01
7.599914572642273436e-01 1.992995818538709218e-02 6.760126204693570617e-01 8.984541652887669677e-03 1.225188683761657682e-02 6.845035332194212424e-03 3.461384656810464339e-02 3.547655580138997511e-02 4.109106816367706638e-02 1.495053976100292614e-02 4.890121275916922139e-01 1.257363391908250805e-01 2.216739419744845341e-01 5.413485321895626923e-01 2.543001166116938550e-02 7.282426111921809324e-03 1.865609946161864846e-02 5.092304974567514186e-01 8.244778740954961105e-01 4.151773500287073149e-02 1.688690577157346828e-01 3.233465085651362481e-01 3.511722851974224402e-01 3.371078393240362070e-01 2.616175951052626680e-01 1.934645492068732542e-01 1.889837521631706485e-01 1.817392130259756489e-01 9.699507468476427086e-01 4.233837522794599018e-01
2.457204950052787468e-02 3.195433669894208462e-02 1.284448289245909876e-02 1.110045193061904960e-02 1.236178132313900911e-02 6.490732924197278875e-01 2.952389719051654732e-02 1.983202664147046268e-02 5.601209620690361310e-03 5.333845476872186575e-01 2.156895939138772089e-01 1.907682375534796304e-01 1.080239485459333487e-01 5.067158834282727009e-02 1.088670788358087893e-01 3.153903260904207251e-01 9.207073618880729296e-03 2.484036281957020462e-02 2.318746319439496037e-02 8.277161867862742328e-02 1.766927780549280014e-01 2.746189241770408129e-01 1.127341848203410879e-01 1.708696125203648941e-01 2.108800608424737100e-01 1.545546686004322656e-01 1.346281961401238902e-01 1.511840132154854133e-01 2.368683615561057443e-01 2.577081597752862163e-01
9.593665874944467056e-03 1.748050527426348033e-02 3.421502048149662745e-01 2.928671744278478206e-01 2.742550166534037381e-01 4.008958163507477246e-01 5.618294028932121487e-01 1.401468088789158961e-01 1.948776189621535815e-01 3.383009951836717100e-02 5.013380669013067781e-02 7.919442392218120630e-02 7.639703168618783291e-02 2.447692042205893981e-01 5.498094814381644380e-01 6.082934499707207815e-02 6.854202022669543537e-02 9.151371614798176068e-02 6.267650173600397556e-02 4.747762856585191482e-02 4.469152829218230732e-02 3.052851405673998389e-02 4.493537017026617564e-01 2.154704538410668127e-02 3.893579561249059517e-02 2.318026946521283341e-02 9.326211155800949726e-01 3.408724025142175207e-01 4.388743632702776093e-02 4.097292360512982956e-02
2.499357571383841251e-02 3.208546935705293424e-02 3.880351542979106894e-01 2.274483094149263307e-01 3.836007554416065446e-01 3.020085845815835279e-01 4.725918131362581986e-01 5.199499946600442263e-02 4.602259719894181977e-02 1.992214439469007503e-02 4.936671483237724950e-02 9.136820704391918069e-02 1.005447588499955303e-01 4.737261396371701405e-01 6.212104936284253975e-01 3.127154352232262152e-02 6.990138881810255278e-02 1.302131519264256576e-01 1.475792874673590993e-01 1.291453453693570119e-01 4.396427755460398379e-02 7.376565957064591394e-01 8.703198443920110439e-01 6.282569023940812181e-02 6.787876242000416560e-02 2.320897077086388205e-02 3.934973178187403664e-01 1.612964557703558399e-01 6.005448871929079668e-02 5.775853646657137797e-02
3.110827791546954060e-02 6.191211210743090554e-01 2.192200144174215881e-01 9.705043261717605230e-02 1.271257993363000272e-01 2.896375831485937802e-01 3.774617390984345011e-01 4.253299471068961585e-02 2.274683442276502141e-02 2.590203501804924646e-02 4.702655187365644557e-02 8.041039077558094494e-02 7.548212097335826876e-02 3.663432494763692593e-01 2.367291564235015841e-02 4.815961719917004336e-02 5.227260513748399617e-02 1.199503669811301104e-01 1.511183893253278121e-01 1.298059131595540316e-01 1.300244497204861016e-01 4.593512388690041415e-01 3.156657200424106136e-01 5.661058963421833345e-01 1.168415351103837263e-01 5.684882774353643836e-02 4.210957947827276976e-02 2.757173288447924420e-01 4.843041967102207357e-02 4.396084706688425242e-02
2.199773875690446898e-02 1.280995727124225117e-02 4.877142789605299344e-01 5.430398584223233849e-01 1.344995418962065648e+00 9.419991612450057117e-01 3.899346507090690750e-01 1.597532474678043934e-01 2.415880017068700036e-01 3.076787682976397931e-01 2.869896380875951863e-02 3.347770834310016819e-02 4.469032244122931458e-02 8.881941709450746902e-02 4.652943291479766930e-01 5.187894026562322319e-02 3.035452694850900024e-02 6.101144823622384195e-02 6.630837766477518103e-02 7.859826349857780559e-02 1.003667354431239944e-01 5.706692104338355609e-01 9.210475582479574208e-02 1.601965816393640940e-01 6.530936512821978734e-01 1.466930627977932611e-01 9.265991642040372067e-02 8.546728997192667987e-02 5.667081283020491966e-02 4.986521922460013245e-02
6.494958688379090170e-03 4.736050205441644234e-01 6.282046436796948630e-01 1.257023356173065487e+00 7.566853081646802703e-01 3.451644325915154132e-01 1.576617290523950887e-01 1.110981627333451488e-01 3.604867098576118312e-01 1.363778078537948302e+00 9.478550199738433601e-02 3.514848324123726053e-02 5.400763069629115065e-02 1.043443311465941936e-01 4.487793871858309913e-01 7.510964882363693196e-01 4.419282710639609313e-01 1.912339161036503699e-01 2.701555293583084438e-01 4.591147035346095917e-01 8.052388280781171970e-01 1.901979903709906106e-01 9.933430297952323962e-02 4.806718673926945740e-01 1.098784207611659625e+00 3.399582836943413344e-01 8.225462787818321742e-02 1.218494006488649306e-01 4.636093335972734097e-01 7.965632902514699354e-02
9.448518685922847535e-03 1.396209098830145795e-02 6.167659127889553172e-01 5.086365398552736838e-01 5.169824998228350621e-01 1.928541347135793171e-01 1.272893926048960789e-01 1.324125319217534513e-01 1.527935902030762294e-01 5.969308778015320893e-01 1.762281005559507563e-01 1.830224883309275463e-01 1.539003145732400768e-01 1.733805156730842123e-01 4.689188146355691700e-01 3.115429222503819373e-01 1.960541498524747683e-01 1.091142174063808590e-01 9.187305512941845720e-02 6.864042597029172688e-02 5.507490847858480254e-02 8.082891611488075834e-02 1.248393476893526199e-01 2.989336815603377828e-01 5.112500628298221050e-01 2.297417256583916823e-01 3.369436396084014573e-01 2.329292140250523446e-01 2.424522949323169030e-01 1.613423109414802437e-01
1.010626191950623858e-02 9.396857776319249567e-01 6.008578210807234976e-01 9.193506569944334128e-01 8.438723525966880246e-01 4.615453292075825109e-01 7.906870390833306561e-03 1.286564989337917853e+00 2.029283638371659204e-01 1.448293041978598039e-01 5.530604981452116181e-02 1.370674322418119484e-01 3.625432782988524671e-01 3.667965666465844987e-01 1.071196300601270579e+00 7.622376655149752933e-01 2.201690030370784534e-01 2.360639116371005264e-01 1.037809680527404521e-01 4.547360973129357942e-02 4.427582659082898719e-02 6.945703448229545440e-02 1.062514809704262209e-01 3.248977428425660618e-01 3.280572288652423563e-01 7.715208628770088561e-02 8.489858327661875537e-02 1.095856488825349279e-01 3.596746716834427482e-01 7.424684087348117079e-02
1.351469509258480112e-02 1.988412163891350309e-02 6.889873162759090341e-01 2.338524043598771626e-02 1.592881500558906982e-02 2.170045673627842356e-02 1.847758360551586890e-02 5.100419497664369084e-01 2.014052222517817015e-01 1.149900368497914493e-01 3.531442213481022357e-02 4.843556748675603707e-02 5.462700271142674480e-02 2.012345425394669873e-01 2.398041302131847796e-01 9.958622712217939099e-02 7.629881445944222684e-02 7.499801436571497393e-02 9.854778211762488249e-02 5.651657898914489581e-02 4.014880443534719900e-02 5.993044239181935517e-02 6.844386177330119558e-02 1.144537658274763225e-01 3.567137943522439292e-01 5.600913915697960932e-02 8.107891922516521910e-02 1.335473310314029827e-01 1.624413355318932439e-01 3.253579811415189815e-01
4.758053814019468086e-03 2.124124200777278287e-02 1.067523391956215040e+00 7.388271912160496516e-03 1.739121444805784289e-02 1.821768188847554606e-02 1.487703497402104863e-02 3.558559144496646898e-01 2.742213424788937370e-01 2.552864296313925863e-01 1.049299638164185589e-01 5.422326225675994787e-02 3.486244565870262602e-02 5.537761598740459368e-02 2.520492910761440442e-01 6.473200379949649308e-02 1.661276704838485774e-01 2.417461957124589222e-02 4.124357527447040234e-02 2.173503725189799840e-01 5.624894323227229431e-02 7.883801244017180077e-02 6.876023798523833719e-02 7.580384970211490048e-02 1.006441120497555824e-01 7.702790277761381588e-02 9.061037686183257001e-02 1.120187865964418494e-01 1.516282219782526530e-01 3.745251929076875430e-01
