3.206701405658601844e-01 5.234876604667450944e-02 3.731059787391608484e-01 4.244274330714993548e-02 3.395047457221167519e-01 5.528050287863949669e-02 4.648422825320951829e-02 1.258378606903877428e-01 2.285578291632044401e-01 1.033383271251855362e-01 6.317274135073416841e-02 2.102499801164153803e-01 1.340971239913708313e-01 3.924716706692438217e-02 4.348078808339157081e-02 1.439015772961368123e-01 2.940632068979068606e-02 3.676710724718863094e-02 3.780359306226362126e-02 4.768823022786824462e-01 4.382287271734016665e-01 6.587125169459186191e-02 5.006415036641119476e-02 1.997810943247343984e-01 3.899503665203273295e-01 3.081884173549782613e-01 1.426732702768997996e-01 1.257961850176195738e-02 1.202349512972929711e-02 1.513600620674747377e-02
2.114975319960595013e-01 5.630064278559962498e-02 6.885991871714802759e-02 6.192100178643602376e-02 3.595356522454129511e-02 1.726080604535298879e-01 7.731177342643423545e-02 9.678613108649740393e-02 5.876738775024183820e-02 4.688930338323980818e-02 4.190133135850602347e-02 1.062361801370100556e-01 1.552676473309525795e-01 3.732797643399423659e-01 4.497677425470923696e-02 3.952998230515968325e-01 2.879979784518460484e-02 6.905992731477020308e-02 5.823551046089700534e-02 2.242144299495321333e-02 2.525400329069393823e-01 6.329999525061680288e-02 1.304320391871502394e-01 1.165197405582819451e-01 1.041362488061172153e-01 1.412263532878987871e-01 5.013913141785900779e-02 1.275865381766699835e-02 1.816774467960385192e-02 1.817101047621407645e-02
1.807350307771592168e-01 1.833619723343629382e-01 3.584013489033777144e-01 2.922176211380396738e-01 6.725751075467457651e-01 1.034214345731835488e-01 1.861156540304778895e-01 1.954892885507917843e-01 2.651243608379567629e-01 6.424530568943609410e-02 1.692541472047768003e-01 1.208903266430327583e-01 5.374970519259298501e-02 9.451111366439941819e-02 2.419285929276123182e-01 8.391466229948389699e-02 4.650463143779769853e-02 7.212659062415555100e-02 2.096222887941630031e-01 4.294803923960942293e-02 1.562322579670450129e-01 5.224820507233444988e-02 7.926793641036503080e-02 2.763108444898511318e-02 1.659176877146446849e-02 1.109115621294210277e-02 1.002592787357074397e-02 7.876789830987492719e-03 1.343376776484345517e-02 1.505786611867904537e-02
7.690771086606958129e-02 2.218767505384695582e-01 4.869041993202887220e-01 3.950594993579770176e-01 1.921149557875876102e-01 3.773039661727976002e-01 3.753938657199697437e-01 2.335398416600176774e-01 1.269998531761480087e-01 8.150169341031306136e-02 4.865633036393872402e-02 9.612783868204499704e-02 6.435218468695440286e-02 6.522992707417044067e-02 1.873895871449713924e-01 1.637522961731541216e-01 3.522366251602283560e-01 2.810888477448254125e-02 1.750349776800747340e-02 1.690626854684025918e-02 2.763570906712264907e-01 1.092521850396903915e-01 3.735284387574225318e-02 7.372846818678502334e-02 1.357742259286345843e-02 9.774113240280673034e-03 8.450388900332056821e-03 8.031779377075385848e-03 1.633031754638558306e-02 1.776626878980615970e-02
4.439463424652680817e-02 1.385713211700543845e-01 3.870240780243893175e-01 1.503212318829323380e-01 1.090401088400224233e-01 2.199468785730300247e-01 3.840566488829031400e-01 2.166814727663869122e-01 7.999487051065123921e-02 1.923893612375527917e-01 2.177661031878654341e-01 2.011439149836597995e-01 4.699821261250756305e-02 4.570077874713268651e-01 2.432838518329304422e-01 9.862820331909585847e-02 6.549278192059902748e-02 2.797385499694862374e-02 4.012085932311830472e-02 2.302797316945156755e-02 1.730461323469548174e-02 1.445857444766535382e-01 3.700827494839120102e-01 1.217852723387819192e-01 2.450383220580878985e-02 1.298693018829394710e-02 9.028695570393407629e-03 1.047953424050190006e-02 1.644662465356552111e-02 6.068117624842837149e-02
5.775094109445143981e-02 6.135383052029706741e-02 2.416374612808847022e-01 1.771408566995282263e-01 7.950751723914606384e-02 1.236764293799748476e-01 1.581751604711137682e-01 1.690470675459332106e-01 1.376153099685433756e-01 2.875686839597604294e-01 2.322696016728734436e-01 1.446381779425528757e-01 2.055600047446714818e-01 7.762516590989346210e-02 6.568079650604520536e-02 1.116260664480899084e-01 4.284910468728454769e-02 1.501700870656994258e-01 2.245202645238840791e-02 6.670122153369825724e-02 8.875593985499739824e-02 7.777103925916425964e-02 4.592412592540749405e-01 7.134382774057160259e-02 3.652564243557085422e-02 3.378628393027804239e-02 2.099118908425604696e-02 1.454726612946768277e-02 1.929129721765609345e-02 3.484898308425163349e-02
1.196204062268157453e-01 1.810719218782421425e-01 1.778148875283327435e-01 6.721398833350319957e-02 2.696795137417232549e-02 5.203928140351531118e-02 9.103177296717435141e-02 5.153258742056592706e-02 6.314413100993623851e-02 6.902494022880271973e-02 6.758594771904216647e-02 2.494429858108361264e-01 1.158261644012782143e-01 5.399619769449508222e-02 3.163895283355763061e-02 5.501269140161583332e-02 3.138491442893163730e-01 1.419248262245552950e-01 3.656389026729066349e-02 5.079742100970045804e-02 2.833607895226895185e-02 1.459972274464146624e-01 6.807544775087834288e-02 6.461392785208852629e-02 2.470191270250422788e-02 2.503717070291673966e-02 2.186947981796577914e-02 1.899174199744015773e-02 2.187579910942960906e-02 5.225470268996718071e-02
2.446609720891879391e-01 4.542149237264365702e-01 2.513811893788195362e-01 4.411262970928438859e-02 5.358980462138011880e-02 6.075803472165332286e-02 5.449453056041239640e-02 4.610725079469180088e-02 4.492129061086777564e-02 3.395958872675097773e-01 1.438265310603914771e-01 4.516720675699289478e-01 9.794949107503497787e-02 3.506690411870494462e-02 3.991895085358228984e-02 7.437809166746393863e-02 4.223366887301795158e-02 5.701212125723617574e-02 4.391193004599493882e-02 3.505214462800256697e-02 2.035465470072209404e-01 1.189550150554070373e-01 4.776479900754542623e-02 3.972666929525215523e-02 1.877348066609505275e-02 1.943658759173012146e-02 2.997246667789004587e-02 3.404804718968477278e-02 3.397824741172959795e-02 9.924005608177151327e-02
9.093610081416481083e-02 3.667902168213612035e-01 2.131549280747624397e-01 1.057344588868388141e-01 6.154296361775649093e-02 3.189902671763342745e-01 1.039596240935748844e-01 4.547981524194459613e-02 4.564745918674664032e-02 5.015024828739203522e-02 4.444832974615836596e-01 6.092490897276109374e-02 1.021910164501534379e-01 5.472091121910101219e-02 1.277538017980029417e-01 1.081209148048826868e-01 2.853745441793059320e-02 7.734713700438961004e-02 8.316110081373118135e-02 2.684079571667628561e-01 5.317342567013197407e-02 5.514607169060876252e-02 5.971255077518999865e-02 3.885762780198697558e-02 2.264081026361121698e-02 3.380898829405347417e-02 1.252325180931797843e-01 2.236520067409237256e-01 3.955596750685783786e-02 3.066319706219023389e-01
8.962326268843576194e-02 6.265321407419631450e-02 9.884681881882939614e-02 6.440135598142653073e-02 6.328622891024322794e-02 1.501675583920434043e-01 8.772678936899161450e-02 3.399223301045070089e-01 1.613395547419398945e-01 5.840343473529424623e-02 6.561877366899901420e-02 5.766066240296285894e-02 9.167112899227664036e-02 1.042200724487591795e-01 5.095582105791450489e-02 5.554022477599276919e-02 2.818944140170732693e-01 2.837258293512339158e-01 1.291300733473816909e-01 6.933029554103743719e-02 6.700233675363123642e-02 4.225963540809596353e-02 4.838310395150853538e-02 5.302792485511814008e-02 2.952063613686710733e-02 3.713392630538739358e-02 3.371801203895803400e-01 5.152763658040449002e-01 4.126830081458200683e-02 1.625348443620517613e-01
7.895091170443116479e-02 3.564200395213261707e-01 7.256616087673833926e-02 4.895409701306545347e-02 8.238114769102927726e-02 9.298042584834456670e-02 9.202737069569487394e-02 8.459570122605386544e-02 5.877142680899789806e-02 4.640683218576361346e-01 3.947926121377455244e-01 5.949778451196388041e-01 1.223598525826915084e+00 5.977256081103138330e-01 1.091038942637349851e-01 2.134075250290582426e-01 3.968788117741830490e-01 1.092802215546235800e-01 3.090327462823082294e-02 1.080220390344193704e-01 4.549356693212404379e-02 4.063703707401195020e-02 5.247406391233461198e-02 7.341124398575807342e-02 7.840847200276887530e-02 4.229907175401256825e-02 6.570121645639552532e-02 4.922643180273914010e-02 4.407287418516600552e-02 3.180344593420903615e-02
1.588499251455195438e-01 8.687147420549556909e-02 8.771051135291699219e-02 8.231215829470511780e-02 6.949220357269271509e-02 1.497759607102046031e-01 7.048109807273436611e-02 4.908972327879314312e-02 5.908234414832558984e-02 5.956990018467563097e-02 1.202209457252221558e-01 7.220488730859246918e-01 1.271203701348287307e+00 6.479210283469903908e-01 2.293942258417968616e-01 2.553007773998532959e-01 2.806732775562058579e-01 1.645606652206832443e-01 4.873969870497035090e-02 2.441295079600221407e-01 4.316453368093194076e-02 4.398955594139496161e-02 5.202573068003765733e-02 9.321737782573709385e-02 8.875677884417000618e-02 6.329913144915504108e-02 4.863165415025949567e-02 4.427537095650331544e-02 4.852587247626709288e-02 5.289837824589538329e-02
3.770812733039274889e-02 9.053874088964175559e-02 2.026364469220001963e-01 1.057958016232485587e-01 3.652444807988554643e-01 1.255241963626684554e-01 6.997333314835518792e-02 6.118512756144923320e-02 7.869372302244048711e-02 2.834285689337333325e-02 1.523528566419259933e-01 2.344076308827035271e-01 9.457259948575340580e-01 3.966110530861645667e-01 1.219339893807069169e-01 1.383096279717137833e-01 5.076102728370893158e-02 7.414702673543675793e-02 9.530747825432527021e-02 3.868369365198699034e-02 4.106045295176776605e-02 4.507286840026217267e-02 5.711326403547295483e-02 9.528059207061174984e-02 1.213241712544749495e-01 1.065364138311243880e-01 7.888685430721163738e-02 7.428623285500554618e-02 6.539406315828971694e-02 5.451046273174097595e-02
3.268496068380253444e-02 9.221323799997185877e-02 1.613042908951659582e-01 1.155628781364575891e-01 6.841533656138318320e-02 2.657011844682416468e-01 8.327585281904406611e-02 4.412371800915573100e-02 1.072131274216375912e-01 3.542674020582881750e-02 1.277391838972790072e-01 4.087055605273554049e-02 4.316862159430913670e-01 5.671652991641790154e-01 5.883851929257143398e-01 7.748700483077559653e-01 6.932548789376096199e-01 4.490667469453890615e-01 1.224278753627537464e+00 5.714950279502771791e-01 5.854835287231786867e-02 2.666361812640292150e-01 2.009594117074622877e-01 4.811578165139473451e-01 8.804032087597314649e-02 6.717971543758567698e-02 1.745922545945730875e-01 6.548142636874403066e-02 8.824159083533726633e-02 1.021041353655342959e-01
3.076883643725969453e-02 3.067421779421114839e-02 8.288311412936849587e-02 6.178070652520745165e-01 2.250381738939112031e-01 4.997282843688503201e-02 4.630202615241228725e-02 8.244991941967580451e-02 5.793516339495356077e-02 1.344815853128475958e-01 2.795347553358659143e-01 2.001390824681036629e-01 3.846445210912278201e-01 4.764750477866822598e-01 4.205480506568248789e-01 4.974059089215665530e-01 8.436606951041873970e-01 1.453266605025324898e+00 1.474250152529242408e+00 1.154018135232367070e+00 5.726471724836215693e-02 6.612995538399078777e-02 6.526628231922347589e-02 1.815339643029045824e-01 2.402501674066609694e-01 1.089947163823077991e+00 1.095003725814769791e+00 2.388719592580049733e-01 9.054185853360909031e-02 6.925310445254259650e-02
2.835714897698812451e-02 3.066978130618734644e-02 6.825024214101975406e-02 7.540448845633312969e-02 5.047712071705590109e-02 5.273595711636709649e-02 2.917298385279032402e-01 4.190334686196399427e-02 8.826094998731889851e-02 3.427270052895586838e-02 3.583998689256971681e-02 3.001976046978308693e-02 2.170087371432315171e-01 4.310987200144824616e-01 3.948367765798176388e-01 5.953156515519668623e-01 1.023991654390545847e+00 1.237541109435376763e+00 7.108974116032870105e-01 1.543851664377806077e-01 9.327237345708369598e-02 6.454825055523001343e-01 9.500110128540308896e-01 1.600958806893682196e+00 1.514693348546901408e+00 1.992082525520629588e+00 1.602803983227784279e+00 4.782612269869381816e-01 1.315892215109637498e-01 7.706748558660744819e-02
3.633595133710294106e-02 4.161725346563886763e-02 4.033970955235016698e-02 3.764658956987605026e-02 5.407944759308970506e-02 9.112598664619370181e-02 2.508447393624950728e-01 8.103940927267668792e-01 3.845987040012689429e-01 6.612138937842022834e-02 4.937173509652009740e-02 7.794781393356843557e-02 1.541941450178626605e-01 2.243453611718343177e-01 2.930531099269106932e-01 5.207832981478406342e-01 1.112943178068435124e+00 1.109510285231103177e+00 5.205413357369300664e-01 1.781225236547754054e-01 7.767748771647425832e-01 1.426144565913935569e+00 1.851110712090607402e+00 1.906621929832817086e+00 1.684989302889883467e+00 1.465151872717407322e+00 2.179021847316127580e+00 3.883697136770605240e-01 1.723644425197615182e-01 9.284632045140001066e-02
9.071335815252967727e-02 7.073435788296583704e-02 3.433281762560969758e-02 4.783421328668813893e-02 2.901521811894370792e-02 1.216662283055449101e-01 6.532530765269681794e-01 5.287904911323602075e-01 5.184273044470906200e-01 2.599074574155567086e-01 1.005312568577517301e-01 3.058345579191163593e-02 2.982798946853101180e-02 7.164545310675490830e-02 1.451365557340582035e-01 6.651337585142168551e-01 6.902402420364174285e-01 8.066155182248231359e-01 1.389265311660807523e-01 2.443846598379887380e-01 8.636534459718223644e-01 1.893593666629311389e+00 2.364309458096359506e+00 2.453828126595454684e+00 2.025092957338614053e+00 1.965893212230072074e+00 1.841098559180295524e+00 1.463270616098542476e+00 9.129300868525075385e-02 6.467449140324223189e-02
3.624169520851721477e-02 9.903580001938100397e-02 1.717264252290167381e-01 5.088901065883980057e-02 9.638366295309597209e-02 1.331606155937451463e-01 4.191349876057030022e-01 5.230337092087617989e-01 3.574487415407932578e-01 2.782241095505150197e-01 6.587584757354202070e-02 1.822741611227922387e-01 2.745133221935831536e-01 3.217581571781285427e-02 5.368304336606859878e-02 3.163448829671533513e-01 1.187941907380286322e-01 3.802720514357305764e-02 2.063002814339013891e-01 9.069505915582162792e-02 3.427717457548417057e-01 1.843085428981999785e+00 2.352037687695285317e+00 2.455999872633626069e+00 1.787900978658452544e+00 8.311642325800582265e-01 1.354673816979809597e+00 9.209830043968336710e-01 1.370094386793251906e-01 5.271862485056000303e-01
3.545186943649509398e-02 4.933537951954150569e-02 3.173779817331227882e-02 3.586974820405570974e-02 7.578095549530386443e-02 4.337586322083018808e-02 2.222558773969249002e-01 2.861683456748825294e-01 2.622750553878775981e-01 6.733770797675694975e-02 2.268155703244930516e-02 1.259227822169702027e-01 2.151720320825601940e-01 2.657548517873829785e-02 7.453337624340877765e-02 4.887110002863467167e-02 8.567512300213456222e-02 2.466487955212535305e-02 4.549873816566377127e-02 2.138522895547318448e-01 1.139173076431396980e+00 2.163994899932452753e+00 2.329310100307171894e+00 2.202413201488173211e+00 1.684915579486621962e+00 1.233129889182761341e+00 1.196217690584718607e+00 8.305024457885654687e-01 1.508842679557649835e-01 4.240235091763637221e-01
8.818329152663167969e-02 8.679381270330477349e-02 4.945942188231226139e-02 3.907215243706786689e-02 4.759620523155395910e-02 2.242307334295409044e-02 1.168872781873384059e-01 1.089194653808546187e-01 3.026277171080713618e-02 1.852317015662562072e-02 2.155305761924175556e-01 1.906879645448833482e-01 1.062851608925105273e-01 4.958814434904965790e-02 1.073454425222278297e-01 3.202130138272354376e-01 4.909122762257697725e-02 1.065722681113955156e-01 1.006983319273376948e-01 4.448705389354664641e-01 1.212245433093323443e+00 1.747074351740568687e+00 7.069893391948978145e-01 1.054728144978284821e+00 1.356308844125135860e+00 7.659618085324467751e-01 6.060082199958057858e-01 5.256278258943014592e-01 2.401788642225587134e-01 2.611248959367766798e-01
7.182091092832473822e-02 9.787869524148287703e-02 3.527593077155679602e-01 3.008081523246520783e-01 2.754981740972111126e-01 1.498875667027022539e-02 1.660730098787203957e-02 1.395444701199284598e-01 1.976528320402851646e-01 3.411495224777642138e-02 5.019411695151798636e-02 8.032096448966706548e-02 7.717657431079071040e-02 2.432286052347089611e-01 3.123051762978919579e-02 2.667730351869437300e-01 4.909512598678965611e-01 6.779132031842107775e-01 4.544799791454445792e-01 3.366668637978832423e-01 2.360735687239648439e-01 8.347474295316220649e-02 3.209709250096651201e-02 6.929760144366343966e-02 2.497139780397258924e-01 9.654913516186869327e-02 1.046738214986574350e-01 3.483554321562218892e-01 4.503645292650503701e-02 4.205445344975990846e-02
1.496381305465868949e-01 1.441404321642515141e-01 3.969484556855676916e-01 2.329513039944634545e-01 3.845557261491511225e-01 2.904509523846056096e-01 1.317167283024160696e-02 5.017745041421999008e-02 4.719944912462686187e-02 2.044349910506799636e-02 5.063562040343860121e-02 9.353343581593849543e-02 1.020283700919369374e-01 4.732029230956704136e-01 4.040387082312315442e-02 1.472376989012055548e-01 5.297568792759349554e-01 9.694453716239010976e-01 1.078038685961023369e+00 9.195477689877136207e-01 2.047704749715753558e-01 5.243176533834434383e-02 6.445827539421164487e-02 1.471528598457149117e-01 2.894281066800650226e-01 9.768926277233604127e-02 4.014417457554927404e-01 1.646963335092752612e-01 6.171134188480855570e-02 5.938679978172783924e-02
1.851429157356101751e-01 3.048759077105027415e-02 2.223785931316963893e-01 9.638568655254367568e-02 1.225082783880328541e-01 2.703049643670950575e-01 3.587236030348948113e-01 4.129252631983537647e-02 2.332345810911762296e-02 2.660236745953543577e-02 4.831886373181142752e-02 8.247175124351738273e-02 7.681926756724126448e-02 3.689647505673488981e-01 7.463721090221871191e-02 2.304430144409305437e-01 3.950115890831020771e-01 8.938919503514832776e-01 1.108890097286470589e+00 9.290160342347194566e-01 4.886526325959013040e-01 4.463798037601592883e-01 3.031837111590690581e-01 5.413880213037863820e-02 2.561807648155784434e-01 1.641200068437505821e-01 1.747238683724594566e-01 2.833086055010277660e-01 4.975119437937399608e-02 4.517494482502510539e-02
1.014806431708138446e-01 3.766131807140336851e-02 4.660369124549031961e-01 5.030943019088027768e-01 3.626572978904137046e-02 2.553446704480627494e-02 3.847791990926007766e-01 1.630968507895531605e-01 2.379513786169245027e-01 3.037342489154218339e-01 2.844529314456521740e-02 3.416361335108956954e-02 4.506594110395944347e-02 8.778553719986000037e-02 4.431058357492145827e-01 9.681137489071824087e-02 7.156621859141940045e-02 3.078314458304215462e-01 3.778855873665600829e-01 3.145138408486420345e-01 2.963555256200566257e-01 5.563504119675176385e-02 8.905376077979447469e-02 1.447539928403450971e-01 9.418569648893880542e-02 1.381556145485805520e-01 3.786585882761900335e-01 2.988317243913068966e-01 5.828985832265369538e-02 5.124294792853079789e-02
3.625284760941605011e-02 1.639318114438384141e-02 2.105309383613048618e-02 3.936943435730941299e-02 2.079182851939520571e-02 3.217015124886419830e-01 1.559470474094925008e-01 1.137245488906037105e-01 3.556167035243806840e-01 3.745522927777182598e-02 9.340611659810793554e-02 3.458610580305521154e-02 5.132166921935283482e-02 9.476264439500753367e-02 3.938987655326504078e-01 5.708722837715886345e-02 4.088688007869000773e-01 1.896913301895196136e-01 2.743491494388892726e-01 4.611533483844894032e-01 6.922420155239603079e-02 1.882106824521838362e-01 9.698119692360503141e-02 4.502147707405472210e-01 2.967392501164692886e-01 3.172358701834500083e-01 2.000911435640977398e-01 2.997000453995192215e-01 4.762854774713841666e-01 8.181696837845917059e-02
3.674015253780488210e-02 2.941049276260214798e-02 1.549920333561640926e-02 4.598186426192420462e-01 4.804428896394242754e-01 1.897132462973508682e-01 1.283895942089091913e-01 1.338735790958335836e-01 1.489956925797167042e-01 5.899838301937109231e-01 1.729455844682527277e-01 1.731013590188047735e-01 1.394657950891149134e-01 1.419075616368699888e-01 3.587945501302464146e-01 2.439380002303404849e-01 1.707481268279303910e-01 1.063426314417019458e-01 9.235773035438903100e-02 6.916483455217743714e-02 5.542953618909634422e-02 8.094685794612710428e-02 1.235819336280412628e-01 2.883806987679409795e-01 4.926160675460293792e-01 2.220644137693765230e-01 3.413134867320652965e-01 2.385879489838010903e-01 2.487021010189541803e-01 1.655628792752753542e-01
4.991722349387615887e-02 2.594389001124053698e-02 1.592473055007283256e-02 2.379003411735450615e-02 2.235524798884653414e-02 4.683152238015008129e-01 3.719955254231858965e-02 2.896217592997734833e-02 2.051337350010082605e-01 1.485315246584624216e-01 5.565549064486850772e-02 1.291225068241752261e-01 3.248501852332270623e-01 2.983650542301153341e-01 8.733712500379031685e-02 6.633374273161403434e-02 1.935410081849012476e-01 2.298474690298521750e-01 1.043524698060614847e-01 4.623737629569442398e-02 4.493375213394011636e-02 7.014089139463139388e-02 1.063787396898399629e-01 3.242477017933729222e-01 3.275191997014805789e-01 7.753015839438356926e-02 8.641649173987014931e-02 1.121817573370023358e-01 3.687637374696908221e-01 7.616446753856825902e-02
6.721149150817809503e-02 5.799157079583629193e-02 1.761567090564176985e-02 6.059215159406582812e-02 7.309998302732573228e-02 1.375855573914101515e-01 9.658471612087886349e-02 5.186794575140267760e-01 2.039928055677782404e-01 1.182472438078546600e-01 3.587254916892087392e-02 4.589905809773819206e-02 4.925023661902076799e-02 1.688388403915961622e-01 1.941253257193554516e-01 8.232179088775515297e-02 6.804110802588053675e-02 7.364077954140209326e-02 9.954342251862588475e-02 5.761735987179766871e-02 4.083932682014394105e-02 6.077192095618916268e-02 6.907050259670738379e-02 1.152882932156689966e-01 3.598004432795530727e-01 5.677790404884030390e-02 8.275433373008889149e-02 1.367256822992553300e-01 1.665453910450723773e-01 3.337530405363587915e-01
3.684775936911980493e-02 9.132235261407994908e-02 2.739504838091053399e-02 2.955240465758611490e-02 1.449294947255026222e-01 1.537051577192397045e-01 1.079843495240633139e-01 3.642080997513686413e-01 2.804051612484110834e-01 2.615193639800196257e-01 1.072385195236782163e-01 5.402713352993143009e-02 3.241393539619734365e-02 5.078459617005628979e-02 2.316558166278261388e-01 6.070389791499224141e-02 1.630872914007069630e-01 8.339783429636422885e-02 1.573063297149006612e-01 2.214841708119300034e-01 5.710763355935518509e-02 7.988334864974117044e-02 6.951429376556216011e-02 7.654393128186441631e-02 1.018354910540943958e-01 7.828272642694025785e-02 9.257072998554875809e-02 1.144963295252943991e-01 1.548841156544124853e-01 3.819099187449965793e-01
