2.429955553523274470e-01 3.469412141860965804e-01 2.885980314416027315e-01 3.542399684933818516e-01 2.448515050185282593e-01 1.765017586286299692e-03 1.957893286337761220e-04 5.177275322101222710e-04 9.232948792951199647e-04 4.104011137861939711e-04 1.801481413522442376e-03 1.361609561532554635e-01 8.972268822126373833e-02 3.292989488808373832e-01 3.938209147960080626e-03 9.122816163462879602e-02 8.814067632380110382e-04 1.092432084221086301e-04 7.164351058567185399e-04 3.030738276830494127e-01 2.807196033612830433e-01 4.255103467869086886e-02 3.262495481651254275e-02 1.303151186056248634e-01 2.526000034720894960e-01 1.976392264371392982e-01 9.057678615557339386e-02 7.917419140084024434e-03 7.500138598638093901e-03 9.354842695798816499e-03
1.597883486105198259e-01 3.357853264742723942e-01 1.081427693704156354e-02 5.707690838779178565e-03 2.970029154324919651e-01 5.798376681243410692e-03 1.446269203213687224e-03 1.703000927437425122e-03 6.249984101643311918e-04 1.841523259530041250e-04 1.113149891416481555e-03 7.028104945252568181e-02 1.060643335248668551e-01 2.541163769938389883e-01 3.920781191663746425e-03 2.507442018698597952e-01 8.027501784039217051e-04 1.972294795142006632e-04 1.002300370421283730e-03 1.063698221759849924e-03 1.608963923369439997e-01 4.067291836104539732e-02 8.447225165767452415e-02 7.551376344099335058e-02 6.678702023918575703e-02 8.934751588778534759e-02 3.130364434511005017e-02 7.931716257742377901e-03 1.124506286014899208e-02 1.119629442269298551e-02
6.105753892376265986e-03 5.515608222436736534e-03 6.820433768448127057e-03 3.178362327872077259e-03 1.250175555858100071e-02 5.131773677531125018e-03 1.295594433100974163e-01 1.347600974342628155e-01 7.063066768642160993e-03 5.071538012179362771e-04 1.237635826951366926e-03 1.875903043964087091e-03 1.797582428695403871e-03 4.165169001555448294e-03 1.567504603198159041e-01 3.728514842660273203e-03 1.590779973621907553e-03 1.063640609169733348e-03 5.302733029679913487e-04 1.239128954442342365e-03 9.921841826962586597e-02 3.347846248681871778e-02 5.106292243806586501e-02 1.774739644863500970e-02 1.052289635756642472e-02 6.915031826207093495e-03 6.155538031767012093e-03 4.836699750350672948e-03 8.250678094102667504e-03 9.250469369931669378e-03
3.589290342635162510e-04 9.839970490055521303e-04 2.153331142266627814e-03 1.739230034138676290e-03 4.128646850671841700e-03 2.643394709481047267e-01 2.602614785672699993e-01 1.601090868425227576e-01 8.606595442578256205e-02 8.183035283804295131e-04 1.928720587200797622e-04 1.865068954513082397e-03 3.258532209703125706e-03 4.560917167198574700e-03 1.209314799845998128e-01 1.035617521430089727e-01 2.205772012770969570e-01 3.794616042640156601e-04 4.566452292299795512e-05 5.301784780959669686e-04 1.764663214296152971e-01 7.072591205316518248e-02 2.379234654665863397e-02 4.687833048396210234e-02 8.552559058369837985e-03 6.090323617344121920e-03 5.215629957157552274e-03 4.948605766689199992e-03 1.004550363120615755e-02 1.091303906599610900e-02
2.031392443360135471e-04 5.998739736478263251e-04 1.670714143038363499e-03 6.496111469089265638e-04 3.004979624648621960e-03 1.534217203927877027e-01 2.646224245826938604e-01 1.474282497539793346e-01 5.371086629289122116e-02 2.604852067870459635e-03 8.824839568356256927e-04 5.626733730308193342e-03 2.942834085874753702e-01 3.018533282775524018e-01 1.567897321568464120e-01 6.228119390004023537e-02 2.615344867740058109e-03 9.535110454606016313e-04 1.158416939756841142e-03 9.637712179112630211e-04 2.847963758111916044e-01 9.089322923670181686e-02 2.319217938066217566e-01 7.648508022183958532e-02 1.536496810123078212e-02 8.126267542340854036e-03 5.640662089342844167e-03 6.513022583773748347e-03 1.016930062976123712e-02 3.733088389230236614e-02
1.683724465468753543e-03 1.822652383501641377e-03 4.370574220222102173e-03 3.788246520787734873e-03 2.659450787625187562e-03 8.636942597381605524e-02 1.082544082361601850e-01 1.140673257706144722e-01 9.146862833533217496e-02 2.911337344341181823e-03 3.250896176666590726e-03 6.093169937470014653e-03 1.369279807722164899e-01 5.100354349301523121e-02 4.227100691595827436e-02 7.050213495472915093e-02 2.108440054270901629e-03 9.319627517904646719e-02 3.042947276634909715e-01 2.932935018649552618e-03 3.276512183246508766e-03 4.884870343027824385e-03 2.830439619375744731e-01 4.426693969444948917e-02 2.281061575382749979e-02 2.122071112786995742e-02 1.325382901923651165e-02 9.115807756022557135e-03 1.200361290190602934e-02 2.150736443035431225e-02
8.351217253499555737e-02 1.261387382157706516e-01 1.237292105196558939e-01 2.469066319213301854e-03 2.800559003778102518e-01 1.817995981354753954e-03 3.088696577811754322e-03 1.637850381639210408e-03 2.443832447420743199e-03 2.583011871058915609e-03 3.709484515638222964e-03 1.647634974711922051e-01 7.609624031378468823e-02 3.508468418230099861e-02 2.031059485557946617e-02 3.477321087018215434e-02 1.949958922034019104e-01 8.758738532476639804e-02 9.960746303295101630e-04 2.039610231493808792e-03 3.135051397058020717e-01 8.937565357016338807e-02 4.147188416042720677e-02 3.971849318461641298e-02 1.538627223313901102e-02 1.579583112460498234e-02 1.405730081331552257e-02 1.216523161393390229e-02 1.406527297003138527e-02 3.305724521284251344e-02
1.710956973859774355e-01 3.172671559955248521e-01 1.749806368880713059e-01 1.990763939978271429e-03 1.447718793752169209e-03 1.586288301129045028e-03 8.040429870528285070e-04 2.420657530105544634e-03 5.375373849606702829e-03 2.426208093024964652e-01 9.928448998942607240e-02 3.007877480979996299e-01 6.438535327479349979e-02 2.275560372946928284e-02 2.558548364769620831e-02 4.723008223009121653e-02 2.007913184568287795e-03 1.986587841339402822e-03 7.514863608609365043e-04 1.307500723739958223e-03 1.268438809030244807e-01 7.462304790101460805e-02 2.968398065940619154e-02 2.477883350034273957e-02 1.181230402763084469e-02 1.244695137710609238e-02 2.023206756452439886e-02 2.581881968417508444e-02 2.509384304687144879e-02 7.131334675784681276e-02
6.659128585943409513e-03 2.573370565214367911e-01 1.484429849059294981e-01 3.270856380007233517e-03 1.282019113484996918e-03 2.171864214257403225e-01 4.052806676338638683e-03 3.601138137710938394e-03 3.391499598848372043e-01 3.468244091755500191e-01 3.094194375327371516e-01 4.036632473561441864e-03 4.500868901500891181e-03 1.590565870530786293e-03 8.181279738238721178e-02 6.866230531822985206e-02 2.750480487443467403e-01 8.408778382396408591e-04 9.187377881578024600e-04 1.693078688108577423e-01 3.363554942987560109e-02 3.488606587463748826e-02 3.769372743264971792e-02 2.455330815290927837e-02 1.439048810169616353e-02 2.206125536918301933e-02 8.761151627055588365e-02 1.724008488112049042e-01 4.798653394993028787e-01 2.286773610662870826e-01
3.759062072155318259e-03 2.888038523346360496e-03 4.621884978707550481e-03 1.081167220761815361e-03 1.614434397667535931e-03 1.019164097681816289e-01 4.925394029097244185e-03 2.398142658295397411e-01 1.179094648933601552e-01 4.250030006175293390e-02 6.170570265637849612e-03 2.190955231993871669e-03 3.719701292990696111e-04 1.085507414039704526e-03 7.023369289472451010e-04 1.095847510128697584e-03 3.883783197647174262e-03 5.203136547624847945e-03 3.011444340998245539e-03 2.812008293965000735e-03 4.335456235235651823e-02 2.721215327462697675e-02 3.095327449940555795e-02 3.389715316852379146e-02 1.892740381862494450e-02 2.427674431051385362e-02 2.343348960846102780e-01 3.895588678386230352e-01 4.675357729275115837e-01 1.183193243684041857e-01
3.999237248228167292e-03 2.510002537396853750e-01 2.090571402534030683e-03 2.347916247567141180e-04 2.532527656128911748e-03 6.338366000922873722e-02 6.301069518764498834e-02 5.830455389066042243e-02 4.069844866036810560e-02 3.170729776381608356e-01 6.628976006527759202e-03 2.342757766016737887e-03 4.777597116737210790e-03 2.355959874770244006e-03 4.347732094384427234e-04 8.500947223518384157e-04 1.558017367285538654e-03 1.217666146667956270e-03 2.954111577387605880e-01 7.196903653295556869e-02 2.994712087714324414e-02 2.656313337972576738e-02 3.401512932364800929e-02 4.740688367361501482e-02 5.059036566145602015e-02 2.752857880834553433e-02 4.427280558848610548e-02 3.419433652707638827e-02 2.973944916793771695e-02 2.068698420806612190e-02
1.121830487143584132e-01 6.128287343859797204e-02 5.239619140785693047e-03 4.388989238577965801e-03 3.897701982860207661e-03 1.030471151464068674e-01 4.852293913189308777e-02 3.384681576667943753e-02 4.166705912056312133e-02 4.038938204839456758e-03 5.692026309791185096e-03 3.895284393852125118e-03 4.832335294944024168e-03 2.530532798498028382e-03 9.230122273505395091e-04 1.050823737230618775e-03 1.156144480469147116e-03 1.968860042953543294e-03 1.590688436614211623e-03 1.636749300358463499e-01 2.861197053691574496e-02 2.897925257143087879e-02 3.407091769715621388e-02 6.068495951929983590e-02 5.746932198379823414e-02 4.082227638689112786e-02 3.125600767259123502e-02 2.778809284599851812e-02 2.960527427327264843e-02 3.125362768412182773e-02
2.663577498441227834e-02 6.395724514418660300e-02 1.422008193596723258e-01 9.218819094141990703e-03 2.531213839883639793e-01 8.680358708645309618e-02 4.837714122202483452e-02 4.234933171351090708e-02 5.590550021678022258e-02 3.787793853270882694e-01 1.047216294314801538e-01 1.911338956686112114e-03 3.533139165163211044e-03 1.541002500192419902e-03 4.942058907565049630e-04 5.826279251573701504e-04 2.168690829362675948e-04 3.200925327670444136e-04 1.814683944917686509e-03 1.087645665354368320e-03 2.733028748104982322e-02 2.986413624614754972e-02 3.766661112948018614e-02 6.232067319191728766e-02 7.860563606817957960e-02 6.837949625980828394e-02 5.011306919786245873e-02 4.609246148504327067e-02 3.952119502466146239e-02 3.199212339765791085e-02
2.310192805401747873e-02 6.525988396330272001e-02 1.136589347269106598e-01 8.109720539815339080e-02 4.775445800036737937e-02 1.849547694334905679e-01 5.337436010445580255e-03 1.528170620524271208e-03 7.691183566737458399e-02 2.500396000746349379e-02 8.818521999121348154e-02 6.176319409213801943e-04 1.576073677685762642e-03 2.194165372915548359e-03 2.408300090458177778e-03 3.344095707755207793e-03 3.066851570684970846e-03 2.022230048972261003e-03 5.602942582047915586e-03 3.242947715738673988e-03 1.750638987386985649e-03 1.775473822119173206e-01 1.333402314477943607e-01 3.159478132406513540e-01 3.525063892014933427e-03 1.461806169521886502e-03 2.815177020364781346e-03 1.920645197432437707e-03 5.314086216626274367e-02 5.977441306143137234e-02
2.174564486099998112e-02 2.170431618814771396e-02 5.840299326132979835e-02 4.334867384469159868e-01 1.571683532562223595e-01 3.484109183994361231e-02 2.478111389442275592e-03 1.077405556343303704e-03 1.137886583090599521e-03 9.248969580893336151e-02 1.888481217352041552e-01 2.863000454012481783e-03 1.355532294572108247e-03 1.776474991929896836e-03 1.658363657727686489e-03 2.070193835442167389e-03 3.641339947703430002e-03 6.477756409673221874e-03 6.784551730584879696e-03 5.444867194176032828e-03 1.241169492718813315e-03 2.041225061321211374e-03 2.516338589039142457e-03 4.821993145119277818e-03 4.208304304094746297e-03 4.691594530757341175e-03 4.565572475900764489e-03 3.218356037264218528e-03 5.418016513560051928e-02 4.049565257186467371e-02
2.005230628379968752e-02 2.170212419986441640e-02 4.805858756885385968e-02 5.284922252482456007e-02 3.523674131211074895e-02 3.680184125737666345e-02 2.037244829305552007e-01 2.888028898485298806e-04 8.234376129488461902e-04 6.049865848453504910e-04 6.462965250320461394e-04 3.464535379986122786e-04 7.297710713028013807e-04 1.533137340856558428e-03 1.484070231888845459e-03 2.355298625025687483e-03 4.252959638160222315e-03 5.394202955969903783e-03 3.252183975248305794e-03 7.299095533856886668e-04 4.356874094125117911e-04 2.962017541961625700e-03 4.249152783391160065e-03 7.076510255422522808e-03 6.579385878747410002e-03 8.397289879039997532e-03 6.544264339965944442e-03 4.573680494524693871e-03 7.808044919358175795e-02 4.504703856369018239e-02
2.558611314580672494e-02 2.934170860371122097e-02 2.837958634097138139e-02 2.637556935617579867e-02 3.777297493560443503e-02 6.365745595797286938e-02 2.832712379938298955e-03 5.422756389626629502e-03 1.484102456246959864e-03 2.445457763688361737e-04 1.731667401187103931e-04 2.532886637387285890e-04 4.941985837857086313e-04 7.592811706196420009e-04 1.042531579463771207e-03 1.938803505404443567e-03 4.428809461113803955e-03 4.736803240026188529e-03 2.372419850363263489e-03 8.435557557844937555e-04 3.604317640150094069e-03 6.454206568650216851e-03 8.161412262685324714e-03 8.305507785970346266e-03 7.194701067420514878e-03 6.047996928413648839e-03 8.622840011145304837e-03 2.791513544648483239e-03 1.014306594122219018e-01 5.424726501364799530e-02
6.344493601915149328e-02 4.954614880714965780e-02 2.409000208756571781e-02 3.348024804416329520e-02 9.514208878253240225e-04 1.257928422152264922e-03 3.148733955337168662e-03 1.973817970047023283e-03 1.930415317699713321e-03 9.303709545866367583e-04 8.529378410641086676e-04 5.728835983929311771e-04 5.454239241680453260e-04 9.398399437996180330e-04 4.884722406355789491e-04 2.322389142532823875e-03 2.630299159702185943e-03 4.896063497874459519e-03 8.848148362453562080e-04 1.578859505091218798e-03 3.978295204710015180e-03 8.507983871610377835e-03 1.036687499409722456e-02 1.061550061481454470e-02 8.558048349666480190e-03 7.905305970619228711e-03 7.015532259367322429e-03 7.446184364645155873e-03 3.337091404292962318e-03 2.708692760695281029e-03
2.519943465661543536e-02 6.905126945169981489e-02 1.197683340531054824e-01 1.412180944977869902e-03 6.860650186068800596e-04 4.446178102717522162e-04 1.418661327547869350e-03 1.781508039154598624e-03 1.220654023400731276e-03 9.262899496362297404e-04 1.019917497928577235e-03 1.261669038168510282e-01 1.880484116275412676e-01 8.900192916955806987e-04 1.730462572031660152e-04 1.044566277439328266e-03 1.574107881931839344e-03 5.887963537557814415e-04 1.373226577706080920e-01 5.590425353639943929e-04 1.498760254430573638e-03 8.017827355548364995e-03 1.018458963045238558e-02 1.057667344872158938e-02 7.558802543211014247e-03 3.376295042000427519e-03 5.262334089531486847e-03 3.604992198834596363e-03 6.542806594849197646e-03 3.070790986287359470e-01
8.067310357210226955e-04 1.576090087298161581e-03 8.906979912429437108e-04 5.997570991779399736e-04 2.315893189707287985e-04 1.306592187565358456e-04 6.756198381967227747e-04 8.760527598127976342e-04 8.091848879827871375e-04 8.702364512385925331e-04 9.277991682873306702e-04 8.822582035873431650e-02 1.486384804825330030e-01 1.072729666375707349e-03 7.781544928657205436e-04 3.671660657874064346e-04 1.446042150644671030e-03 3.326536341597445823e-01 7.154741582085747276e-04 1.239925492805883569e-03 4.688036029136452391e-03 9.075179146790467860e-03 9.950793261308776144e-03 9.424704110982879898e-03 7.097924583240454444e-03 5.059936781771681366e-03 4.761460510061786555e-03 6.688577275760116368e-03 9.539659045412195518e-03 2.461378174445056910e-01
3.079232484389979297e-04 9.680552437023147308e-04 1.108146569449997313e-03 1.274756865157747245e-03 1.798961912542564913e-03 5.870281889355719041e-04 1.933414463255828932e-03 1.159086256252007171e-03 4.092154117091380727e-04 5.086176891780414032e-04 1.534875628918100365e-01 1.352137021303699005e-01 7.387376575847283411e-02 3.337662814761780533e-02 6.992896409525499457e-02 2.015586141328930547e-01 7.625747398347162975e-04 1.392728593964659336e-03 1.263235218190045597e-03 1.619235648479587421e-03 4.621114181192540957e-03 1.021925110939538028e-02 4.232497737846137482e-03 6.268441701240709193e-03 5.703744469796434569e-03 3.174384054188297225e-03 6.283903380932297396e-03 8.695822662716854237e-03 1.389130522506377696e-01 1.510892064128390722e-01
2.445353061273577186e-04 2.104704500891552837e-03 2.437882775808040414e-01 2.075683268476276877e-01 1.915609929384761434e-01 2.789774628908325282e-01 1.113546926141039273e-03 1.007842651671850276e-01 1.416212936320830895e-01 2.441158210967799697e-02 3.587300869221933530e-02 5.718067260465413415e-02 5.379864820821087662e-02 1.637531540988486078e-01 1.332211769732972702e-03 1.840523892844973027e-03 2.455762534092226831e-03 2.045701728846633684e-03 1.453445837401998479e-03 1.145807738474143153e-03 8.609936370481683417e-04 5.019210988633568534e-04 2.860567172432890715e-01 4.190214709455959414e-04 1.054439832819100255e-03 1.713916627945513953e-03 3.320784845996419422e-03 2.028915238816747235e-01 2.620099469418420146e-02 2.443278368836638084e-02
5.167270831261053113e-04 4.094822695876586954e-03 2.776764118894587963e-01 1.616413365474813346e-01 2.683452125609102623e-01 2.086992457522991173e-01 3.293188375548500857e-01 3.659494051428595351e-02 3.364406571189371836e-02 1.453543617348301148e-02 3.593657324794979208e-02 6.618429718855980970e-02 7.098631132251506659e-02 3.202044292613265841e-01 1.974155301798100406e-03 4.144369741664744988e-04 1.551469076413476440e-03 2.982648753300697064e-03 3.486335461152618824e-03 3.169005686017563415e-03 2.104222227241571690e-03 1.470356499392110267e-03 1.766120697828655467e-03 2.844114813740923186e-03 1.246113771930954569e-03 1.763937793217054250e-03 2.431649303568368947e-01 9.913126216462524176e-02 3.691896049766213439e-02 3.530293415614019215e-02
6.367446589121669763e-04 1.097958596293714716e-03 1.574391574515721370e-01 6.731315667937035063e-02 8.416051709343433385e-02 1.917377123831265073e-01 2.592471043991134150e-01 3.037438630233518441e-02 1.650164888182297993e-02 1.877200385180539249e-02 3.402903462909566412e-02 5.794715990548813395e-02 5.332847516897253060e-02 2.511507375590964486e-01 3.793521434943352387e-03 3.061942232986731693e-03 1.197074546858146018e-03 2.810321428017209522e-03 3.605319536855171487e-03 3.191930365173953951e-03 1.103562364528872485e-02 2.939382644560046276e-01 2.004009883126578184e-01 1.749085831553334920e-03 3.033336724977063383e-03 2.908327785958020936e-03 5.802516740782308509e-03 1.750419484521608948e-01 3.042791825660648430e-02 2.732593615190229142e-02
1.706974346252087974e-03 2.248684721278676468e-03 3.421005519380909132e-01 3.632546894413336558e-01 2.493292149218805098e-03 1.983555390793958952e-03 2.649413189664522328e-01 1.134198472646656131e-01 1.661854046142662578e-01 2.120843156930316276e-01 1.984442219541110788e-02 2.383900382329250806e-02 3.121203044407735300e-02 6.007737182060880060e-02 2.992864086220515807e-01 3.940941714588570496e-03 1.226264029972543457e-03 5.989825674061503499e-03 6.249478326153358812e-03 4.196846032450316476e-03 1.104223297235807678e-02 3.724979638676839677e-01 5.868949903653476047e-02 9.412223487808391020e-02 5.519171833065336132e-03 2.284458723015307408e-03 9.377408667961427760e-03 1.630413113965403435e-02 3.629885215125883829e-02 3.143759043855549884e-02
6.686826772695391493e-04 3.483643585665986975e-01 4.440015750796663663e-01 4.624114310550043495e-03 4.717305191364998818e-01 2.217732697439796785e-01 1.069340522046320491e-01 7.877832618913475915e-02 2.477558025112489015e-01 2.521533175503995732e-03 6.504092689550683426e-02 2.407421615233179893e-02 3.549918517609752799e-02 6.491884637894726473e-02 2.670366393327764376e-01 3.859443110271336061e-03 2.728567666773758504e-01 1.256881769376504698e-01 1.802157097580066591e-01 3.014638905298398508e-01 4.449869151952895105e-03 1.240466369469876984e-01 6.365144080288215322e-02 2.939428944254617315e-01 2.984422487189123882e-02 2.068089236874070536e-01 1.546189351458334207e-02 2.845107718588041346e-02 2.991758059646607570e-01 5.049494722410155512e-02
7.564776774418393614e-04 2.454663239501232806e-03 4.258976246931251430e-01 3.423426289457199845e-01 3.312638275064068161e-01 1.312663700401295597e-01 8.800752953268488332e-02 9.257805571843040482e-02 1.037256373948299698e-01 4.111594552517125467e-01 1.204272583805305885e-01 1.204055431682033717e-01 9.641352370384309589e-02 9.712989708712581327e-02 2.428380144714716304e-01 1.634858555150530413e-01 1.139664410856017357e-01 7.047889557446397613e-02 6.068254042172416263e-02 4.523185604844414537e-02 3.628035466897594485e-02 5.300044020045233117e-02 8.083611039866300807e-02 1.884959737549674885e-01 3.221493191897550901e-01 1.453975434795097554e-01 2.230770961848625722e-01 1.530400516183305915e-01 1.564726633074456086e-01 1.022946460488465409e-01
1.691648176909037247e-04 9.967358525512298121e-04 4.230809572427490783e-01 1.661333540809834496e-03 8.516728405501231437e-04 3.169872475011677460e-01 8.658347150480030178e-04 9.062781413889079048e-04 1.430778265630134327e-01 1.037211327664677718e-01 3.880936477005959839e-02 8.980811404624630678e-02 2.245286714659922855e-01 2.041873300095737032e-01 6.748823600861378162e-03 4.905891333538591609e-03 1.291764969249179218e-01 1.523030825425535917e-01 6.854912257687188759e-02 3.023291695869045198e-02 2.939239459817528238e-02 4.587780371148240249e-02 6.955122036833333299e-02 2.121092370438713015e-01 2.145749954925569858e-01 5.090485717779762165e-02 5.661149907620719596e-02 7.202857933548738323e-02 2.322152198954139379e-01 4.710839823127076220e-02
2.255225108530981590e-04 9.527353898173715431e-04 3.095270215632893820e-04 1.158456183501979870e-03 4.630248025300747611e-04 8.820444569900235277e-04 1.502773401981284196e-03 3.571071477282764528e-01 1.419272231545858354e-01 8.243997314427678469e-02 2.499546221622115164e-02 3.190970390045062138e-02 3.402977669560282997e-02 1.155852446171453524e-01 1.315319440343697133e-01 5.522270373932580689e-02 4.538147021605772741e-02 4.871227661307355600e-02 6.528816246973589976e-02 3.764664729730931442e-02 2.671540973394482751e-02 3.975415328869220249e-02 4.515892659070182280e-02 7.541303871593135755e-02 2.358466488856426069e-01 3.731503443656263019e-02 5.428628256585861511e-02 8.785456877093504591e-02 1.048705068724610223e-01 2.065262227514345905e-01
1.209719922841204627e-04 2.900030035084349652e-04 8.227230779427087957e-05 8.200654283629196285e-05 3.631809468348468030e-04 3.703866552205569568e-04 1.205232228241581108e-03 2.442660090606164625e-01 1.891164294069694329e-01 1.777287092778921940e-01 7.341651774325314017e-02 3.719335139100156395e-02 2.226374388317804015e-02 3.470626135203442458e-02 1.573407534208349223e-01 4.099453054629700888e-02 1.093044255024980954e-01 3.562907490339104095e-03 7.226216758016683860e-03 1.451502610423978101e-01 3.746939384020715746e-02 5.240755844620634957e-02 4.559271101343598254e-02 5.008898701051833768e-02 6.652445219803834742e-02 5.106328935159022697e-02 6.010930470779473483e-02 7.322598170092874115e-02 9.752481481492322746e-02 2.375328768406574642e-01
