3.545028731774994557e-01 5.063677893744026326e-01 4.246551425164978855e-01 5.251621445134682098e-01 3.655708997753999157e-01 4.833045983313854349e-02 3.541719125892969777e-02 9.576344567447239720e-02 1.741090694050127230e-01 7.819429238928106429e-02 4.945847311265341717e-02 2.118931745723552640e-01 1.404301952895797012e-01 5.192752528250790256e-01 5.546277550749077745e-02 1.493206245291360257e-01 6.289203894785846405e-01 3.858112007652057807e-02 2.916812733467411684e-02 4.862139680803858055e-01 4.508015872557851189e-01 6.834611243424913718e-02 5.236828926637962511e-02 2.089925445872460319e-01 4.053734396227340886e-01 3.184462652213739808e-01 1.467727688681304543e-01 1.294160865242503268e-02 1.237377198963530989e-02 1.558430302490945198e-02
2.323757221385606142e-01 4.860147842711197708e-01 1.219256795696960910e-01 7.679979288743450649e-02 4.354390974096487565e-01 1.479116206939520284e-01 5.984718568886751577e-02 7.479311853967168799e-02 4.508124503223297219e-02 3.559896580723381082e-02 3.290978974798387802e-02 1.078772243670293451e-01 1.634231442071625295e-01 3.962460846194074127e-01 5.435532631890450245e-02 4.091045192586461599e-01 2.828483431821468552e-02 7.004527433751807364e-02 4.464341365680482565e-02 1.790621453814205538e-02 2.594955461862908930e-01 6.577424142449748989e-02 1.368337922681734375e-01 1.222112009877271699e-01 1.083268024583306788e-01 1.457731319861907127e-01 5.150163731677234041e-02 1.311471868815245433e-02 1.869042828908006396e-02 1.870809911605796419e-02
1.674528967893894882e-01 1.654881488773605469e-01 3.130124666054298621e-01 2.364918559557836197e-01 5.449580454085310999e-01 8.535159730137999168e-02 1.879348698405787776e-01 1.977462618714427856e-01 2.061072781650314656e-01 4.905009029001490550e-02 1.295148782649598873e-01 9.423751764788468321e-02 4.425605371950328687e-02 7.921429196661551597e-02 2.459489876610281289e-01 6.826452017659201399e-02 3.716117095243055141e-02 5.504396779323908473e-02 1.726737458627550792e-01 3.692251097405262195e-02 1.633002734256182864e-01 5.459993881913606517e-02 8.356059272905883017e-02 2.904472395394637474e-02 1.725808546761306572e-02 1.142613892350119800e-02 1.028772986564832626e-02 8.091132751539605733e-03 1.381525323695316845e-02 1.550102165579747213e-02
5.821115105953422741e-02 1.668043155648517295e-01 3.655077958176168318e-01 2.965480373595709707e-01 1.473232818389030030e-01 3.803298373834070878e-01 3.785307634807658639e-01 2.354852990079967512e-01 1.280031538981085959e-01 6.205041033884999002e-02 3.692947860074887595e-02 8.476282763969331113e-02 5.780529960683442742e-02 5.888097421178520308e-02 1.901951544701633301e-01 1.655539378580072607e-01 3.555820663772988888e-01 2.147547892906120914e-02 1.434242634187017987e-02 5.299418943157523376e-01 2.926215045912949897e-01 1.165246189448434916e-01 3.924582318213200999e-02 7.732440296017183134e-02 1.413709646971504814e-02 1.011581191169706392e-02 8.729089468911066865e-03 8.292029812877250994e-03 1.685423095673418969e-02 1.832708694670078658e-02
3.340590814998995600e-02 1.038647412348396581e-01 2.902574461257492744e-01 1.127906402991196849e-01 8.455295278106025880e-02 2.219023141412029554e-01 3.867457533202807163e-01 2.176785834713727552e-01 8.013430040556285272e-02 1.463005601460214411e-01 1.647231219456278262e-01 1.782681977016460084e-01 4.497456402543586473e-01 4.690630028573488097e-01 2.482196334746399891e-01 1.034789922981087101e-01 7.979208570281451363e-02 4.025009460137802392e-02 4.031504340696497046e-02 2.539496753404843141e-02 4.760445587194098715e-01 1.511967869963719291e-01 3.861026811232208811e-01 1.272815110853768306e-01 2.555724647130875118e-02 1.352820297459805463e-02 9.407171501269330494e-03 1.089619474472834637e-02 1.707026765475625277e-02 6.285612659647332734e-02
4.645638055942381828e-02 4.967955336179231962e-02 1.900102089013409323e-01 1.553034601166507489e-01 6.984609730510699110e-02 1.257717601851146838e-01 1.589520329002593879e-01 1.690201414378715572e-01 1.368369358445143402e-01 2.163180401076907899e-01 1.779238103658847825e-01 1.281687239209758633e-01 2.108199042404807766e-01 7.987087605087631048e-02 6.751146452616639537e-02 1.187349676133234028e-01 6.421350610736008546e-01 1.628994631378742064e-01 5.089896497335912873e-01 7.604730223984226822e-02 8.925044496178041742e-02 7.712939456335228539e-02 4.761747130202544365e-01 7.434654705131789332e-02 3.817003782469103462e-02 3.539706127764488675e-02 2.204473423126424025e-02 1.524396508147153606e-02 2.018435939912881921e-02 3.634870325137274510e-02
1.247035981351845291e-01 1.899480813678967039e-01 1.878312565126372402e-01 7.545528800507841916e-02 4.204189916150387618e-01 4.575427619595941880e-02 7.114010326384020977e-02 4.005913650931738207e-02 5.239168983634823890e-02 5.927851043055913649e-02 6.004680649790149205e-02 2.543274473426528903e-01 1.183228863227936550e-01 5.530798901678808666e-02 3.271396812993754288e-02 6.053566940302335109e-02 3.481404577138916823e-01 1.580852949956413345e-01 3.413632440210098706e-02 5.081270957432267726e-02 5.306349931526777031e-01 1.515512942773993288e-01 7.045914354917805211e-02 6.723613324723223816e-02 2.586991337339674193e-02 2.638186800180912159e-02 2.333259048360150981e-02 2.035108425247383196e-02 2.370879333631010361e-02 5.610152505810163392e-02
2.657822599672537422e-01 4.963028614635910385e-01 2.681768578776821954e-01 5.287138681297686160e-01 5.996469546166046521e-02 5.354929624050018544e-02 5.493387560240456380e-02 6.780886402704774940e-02 8.224107874821773301e-02 3.657213939900674227e-01 1.533717857435467624e-01 4.704077049639456831e-01 1.016134282716675413e-01 3.573997401385250322e-02 4.097086513125590412e-02 7.965752358542152467e-02 6.144337372682093790e-01 7.311073670082218756e-02 3.524035915944662145e-02 3.104270443901165077e-02 2.107442319475132941e-01 1.244999584295119338e-01 4.974330540059748729e-02 4.148857018941395913e-02 1.970063267179938959e-02 2.067238084862340827e-02 3.348803088183833349e-02 4.325176444716589963e-02 4.253329633378011287e-02 1.221612794670610957e-01
6.151969748649021019e-01 3.994949677531522414e-01 2.267879977591241158e-01 1.086370012219342873e-01 6.125230302597379356e-02 3.252426191973196712e-01 1.074796168274175928e-01 5.293629966813611087e-01 5.064898312714711803e-01 5.192065382114485761e-01 4.756555519675152999e-01 5.995841088461111301e-01 1.059738479640885134e-01 4.354723731886113447e-02 1.302346626001774088e-01 1.146688764708279351e-01 4.625023235036302416e-01 9.317843329322306190e-02 6.469639009432570642e-02 2.754083317970080214e-01 5.499442449678211553e-02 5.739935450538252715e-02 6.245702532461311351e-02 4.073679070089290810e-02 2.383314254054007958e-02 3.647730076449862135e-02 1.448238489199245305e-01 2.893876177174481423e-01 8.176351174457128224e-01 3.951831443960385770e-01
1.243033532467433117e-01 8.299813889391075006e-02 8.748466140884332554e-02 5.127331575115230688e-02 4.973541705692837572e-02 1.527585724010647183e-01 8.844898387144829732e-02 3.597829503859889533e-01 1.743790761485451701e-01 6.312041689030117864e-02 9.451483081168815525e-02 6.142844312173396243e-02 9.359714814502227698e-02 7.996966185353543421e-02 3.972138965259035259e-02 4.736566262667463167e-02 2.402317370000291996e-01 2.598302125479549085e-01 1.108605079057485288e-01 6.075506980564170795e-02 6.991360511182118098e-02 4.423655326378976571e-02 5.079930632427866188e-02 5.581589063810356993e-02 3.117331948291952176e-02 4.000815489916470513e-02 3.869630245903195043e-01 6.546399945448585500e-01 7.995425659058843504e-01 2.060158021466210465e-01
6.437569244941576674e-02 3.624538566598306533e-01 5.795583056626835150e-02 3.802834847942883345e-02 6.602421071403853647e-02 9.462861396532241953e-02 9.342863629435836648e-02 8.568138025573827921e-02 5.917821224625391396e-02 4.682495610320995816e-01 3.036142139280693097e-01 4.470297606145276492e-01 9.235986078226711138e-01 4.550054117187568026e-01 8.376540596567688679e-02 1.652284356793082831e-01 3.093916032563865937e-01 9.260512422398688159e-02 4.696797801739900358e-01 1.143256191608375272e-01 4.791051656149767496e-02 4.280726014399060392e-02 5.533246657769572141e-02 7.748558418966747241e-02 8.288226687625209477e-02 4.522253737904761983e-02 7.303634222019587952e-02 5.759848503976917194e-02 5.117019570732377065e-02 3.641740688206807075e-02
1.614552083458371257e-01 8.880667369799599697e-02 1.086832717028337614e-01 1.061794958689906976e-01 8.663323793610616663e-02 1.540903265755299012e-01 7.157849990644685190e-02 4.959788850587462661e-02 6.065994490832332664e-02 6.001887956543863062e-02 1.186229379162556524e-01 5.459825856798539157e-01 9.639230469441530946e-01 4.959254537480980995e-01 1.773128076545587573e-01 1.992167588013658563e-01 2.201898112301157173e-01 1.410538742787819932e-01 4.530067659725851154e-02 2.602170140220871897e-01 4.574471321992399503e-02 4.645885462442786440e-02 5.498916693289013918e-02 9.846752463109453846e-02 9.366560108230329029e-02 6.684358681132490654e-02 5.151952472032104990e-02 4.700406757374180067e-02 5.148911466508487161e-02 5.601627031234274884e-02
3.843910813513291835e-02 9.296238600015432896e-02 2.142568401716183901e-01 5.819806911128823090e-01 3.909805923103545355e-01 1.298812829743545283e-01 7.162488702233429927e-02 6.222420786474638921e-02 8.194743815196672831e-02 5.647958504999120999e-01 1.592128010297634844e-01 1.795573771288456466e-01 7.211212663403615553e-01 3.055196073096652087e-01 9.489176183497319284e-02 1.086809551326115841e-01 4.007580432267665582e-02 5.878843069896746987e-02 8.151526681692379539e-02 5.468027686912657614e-01 4.358599036497513846e-02 4.771673229393356974e-02 6.051126516880175193e-02 1.007422986899988160e-01 1.278763663218991375e-01 1.119600085269179118e-01 8.274861157097052056e-02 7.828915854902142313e-02 6.940331065631337448e-02 5.829737867148251929e-02
3.332957663567655271e-02 9.455586714504699009e-02 1.677459723439840289e-01 1.206003090371516595e-01 7.159036401073731737e-02 2.773662790231439246e-01 8.402861109678755325e-02 4.584520997181934510e-02 1.129808199637912236e-01 3.752425897869993143e-02 1.349592291274553379e-01 3.181870040577073483e-02 3.309157983581384466e-01 4.398979686855660765e-01 4.610761677776510359e-01 6.123823079565003935e-01 5.499666631625848012e-01 3.574556935648331435e-01 1.019836337687191730e+00 4.790094895772396555e-01 5.029938752507424893e-02 2.826335723439508674e-01 2.132882571685393025e-01 5.092134244410287947e-01 7.361540577519598560e-02 5.477995210639940993e-02 1.410389711229898535e-01 5.427375612560769724e-02 9.411317820311798643e-02 1.105300926007880269e-01
3.142300149939927789e-02 3.145620147996897042e-02 8.535305252976599366e-02 6.375592147397229903e-01 2.325476603017417876e-01 5.206646289455127419e-02 6.081244412440705016e-01 8.717195404918523516e-02 4.535210540447303512e-02 1.383847060173498122e-01 2.876857600308551088e-01 1.555568686099216280e-01 2.949596183067130228e-01 3.694637634135108373e-01 3.293757871182397268e-01 3.929205995258845396e-01 6.691990912832643801e-01 1.157089583845126501e+00 1.178027535968697803e+00 9.250272233329319693e-01 4.687302810861672386e-02 5.478260569113793665e-02 5.463806768419225690e-02 1.498286236094128754e-01 1.958073247378885051e-01 8.713009730442450307e-01 8.739315613844091946e-01 1.948102318017597701e-01 9.700811667068690025e-02 7.528019390676188305e-02
2.900161997985361770e-02 3.145725053278074917e-02 7.029705192147196746e-02 7.778283652924969371e-02 5.211613162773844066e-02 5.493720024710983807e-02 3.066982242504022738e-01 4.306948713234500653e-02 6.764630568134852306e-02 2.659208384438732642e-02 2.786390416733364531e-02 2.313317596484699284e-02 1.661169097919094340e-01 3.335922416603108176e-01 3.085818092294391191e-01 4.693404613128550062e-01 8.110986621151021758e-01 9.843925791754437604e-01 5.678206461766275304e-01 1.236920488131576928e-01 7.476134191555691699e-02 5.174116713584933080e-01 7.612952760893915150e-01 1.283180238467826584e+00 1.214559613560107110e+00 1.598314226132264704e+00 1.288405192105667618e+00 3.917499315524430870e-01 1.419607934977255848e-01 8.401254706041980103e-02
3.728224993711509727e-02 4.281013238287568329e-02 4.148284161836152117e-02 3.872152232620153234e-02 5.554516039898432789e-02 9.338362697420429792e-02 1.933053696833999802e-01 6.199676415696911969e-01 2.929317630322138544e-01 5.036687078048256855e-02 3.758760134728805768e-02 5.924710274805472521e-02 1.177651354811794088e-01 1.732714110668640006e-01 2.285490477711720481e-01 4.095244870556740691e-01 8.800462498610017725e-01 8.821089523937537535e-01 4.159080586931401813e-01 1.427268297733129687e-01 6.217960989480235678e-01 1.140082494117699241e+00 1.477948396912881712e+00 1.524636051063723796e+00 1.352690681032573616e+00 1.182591603463299501e+00 1.770500094372585265e+00 3.199155749495086187e-01 1.957046370951444070e-01 1.062998482431363745e-01
9.324645127800024191e-02 7.282838056170380658e-02 3.527232940327348909e-02 4.902043750717748755e-02 2.278308609401394347e-02 9.271608899302583029e-02 4.953474787659463141e-01 4.015320298602111926e-01 3.948046106011032230e-01 1.976445621254698248e-01 7.711065958371253470e-02 2.407550671292728317e-02 2.361271411886797789e-02 5.681320921512378330e-02 1.130437367296160123e-01 5.217657696088005004e-01 5.448959876187058349e-01 6.429103561264049027e-01 1.113313219786231656e-01 1.963209826691557636e-01 6.904194358609989646e-01 1.510207584793149760e+00 1.881209307856186896e+00 1.958521746577643885e+00 1.629592430312593265e+00 1.600000769128353095e+00 1.517083376392719396e+00 1.214536918517754804e+00 1.256750476210511669e-01 8.237403698799563578e-01
3.698887774116754040e-02 1.010486357138677821e-01 1.755151960447068893e-01 3.953488329835941339e-02 7.308263982006032999e-02 1.005543951582181794e-01 3.169823998562208978e-01 3.960664803542712775e-01 2.711175700565093827e-01 2.302421133242016082e-01 5.596206017376643971e-02 1.906181826444372784e-01 2.926194206748750637e-01 3.255163216753775152e-02 5.251495827597877503e-02 2.472415829608941018e-01 1.028978477664498070e-01 3.326753589008959316e-02 2.190883963405146073e-01 7.257225057241845079e-02 2.726526529726917558e-01 1.461780075628526410e+00 1.860475900726205278e+00 1.956403621530926173e+00 1.440637068769724083e+00 6.783791228525219985e-01 1.118867753859825731e+00 7.622110955658003562e-01 1.750531941810775927e-01 5.989915280504921613e-01
2.717137687617575403e-02 3.809698293904135308e-02 2.452940674572291063e-02 2.747734231271720118e-02 5.727466074442830180e-02 3.279843982169031863e-02 1.680033487599856823e-01 2.162228595156911737e-01 1.982177960550019491e-01 5.701774978378385678e-02 5.150036972799671986e-01 1.326591800730097248e-01 2.307907481746682699e-01 5.654166671866641680e-01 7.462024406014468314e-02 3.831638248313531947e-02 7.527533372363791331e-02 5.364670446270229931e-01 4.003681206419660438e-02 1.700960753684190307e-01 9.010219437268326415e-01 1.707444216681440086e+00 1.833810751254107307e+00 1.751636525394655752e+00 1.359194429463634446e+00 1.008716455650394028e+00 9.899651367202115804e-01 6.920434627612070955e-01 1.412510522180501493e-01 4.615024323155096919e-01
6.551656048598640536e-02 6.486405576868881084e-02 3.787600139879479522e-02 3.069089187924255863e-02 4.086778860088963877e-02 1.909254200564730261e-02 9.825916146113281013e-02 8.308946625602704750e-02 2.312873789238753530e-02 1.611704643177499022e-02 2.268170908608173886e-01 2.019484372564484542e-01 1.141073364205314189e-01 5.310209062742913405e-02 1.141468737416140855e-01 3.310278641759668017e-01 4.254115749077291841e-02 9.240473162039564148e-02 8.721285959660797504e-02 3.500428966816946375e-01 9.526120205431826138e-01 1.399890482802550240e+00 5.656835736876622001e-01 8.547309234785869236e-01 1.095082052262333239e+00 6.277984824607776293e-01 5.068596170759270825e-01 4.434461211853761853e-01 2.594511272936029789e-01 2.821052273508276031e-01
5.334528621050795005e-02 7.422529182088313804e-02 3.578181531924320424e-01 3.089880127109048136e-01 2.892095264768980711e-01 4.186416745404011319e-01 1.735603963367369357e-02 1.472466883563623152e-01 2.044393985108259593e-01 3.536333279231208826e-02 5.234249221598165358e-02 8.409862370555559741e-02 8.076475013781468648e-02 2.541874817638297701e-01 2.559643739608306531e-02 2.064874717759004052e-01 3.801343478057194192e-01 5.263546149717459599e-01 3.549697521166194636e-01 2.639158178957237699e-01 1.851178537950285141e-01 6.712117664472760925e-02 4.601974081174782238e-01 5.647220326254261819e-02 2.021572015014920787e-01 8.064554874378603022e-02 8.992276532428078450e-02 3.741528193927178836e-01 4.838377606991905999e-02 4.515793255354913494e-02
1.121103709586964980e-01 1.114241363879779900e-01 4.053252571350183242e-01 2.403217637240761817e-01 4.071489773910910159e-01 3.153409212904831338e-01 4.908470572158359913e-01 5.382446511913649423e-02 4.891093967601762432e-02 2.118253034957783693e-02 5.255619368581519735e-02 9.715192221666113515e-02 1.062394786234406446e-01 4.933254536002756319e-01 3.323963239580039752e-02 1.133338075156297142e-01 4.103577853331772940e-01 7.558913641953506346e-01 8.458483384273604022e-01 7.248996808624348365e-01 1.635066477836318866e-01 4.453810949823668736e-02 6.366301968371387843e-02 1.426983326091308124e-01 2.738688552982425084e-01 8.144792241588222348e-02 4.278504520765232799e-01 1.751150766266085512e-01 6.549479349525716421e-02 6.285787016627626678e-02
1.396867252924815506e-01 2.415866145255172320e-02 2.287508704950047544e-01 1.000434292324939994e-01 1.285409197839119666e-01 2.921560604927118665e-01 3.896785512306435439e-01 4.501947424161887451e-02 2.418352464391023554e-02 2.757485440012765604e-02 5.011934105133809131e-02 8.557879182070507462e-02 7.991157023724124175e-02 3.846271457082701684e-01 6.149441127686577913e-02 1.808147743093506676e-01 3.072780040074125085e-01 7.000924195875113387e-01 8.739466167555387521e-01 7.358744777493388955e-01 4.370773673387339242e-01 4.742673269116125523e-01 3.254584153740600061e-01 5.850842890256403583e-01 2.940801623208174065e-01 1.637301062641634553e-01 1.468893322231720200e-01 2.986224263919495803e-01 5.225681183416888004e-02 4.722952445938299881e-02
8.531158906224725613e-02 3.635574579294061082e-02 4.946162919753431808e-01 5.399739956923826911e-01 3.355893438565980824e-02 2.383341030352050666e-02 4.019739681311377266e-01 1.698018588048527955e-01 2.467005555067389722e-01 3.148973778637353393e-01 2.950011884043874863e-02 3.545123922036236969e-02 4.690939114356165035e-02 9.176772228912304097e-02 4.635392559758798603e-01 8.070109139331341219e-02 5.739625596922033612e-02 2.491178017291990898e-01 3.047428621007365890e-01 2.535179944013807862e-01 2.698033857285863091e-01 6.012730639675678557e-01 9.564429855899451993e-02 1.564842393979156143e-01 6.342830607596509074e-01 1.375706844656771344e-01 3.135932344733968202e-01 2.526372882876031234e-01 6.072357852556609092e-02 5.304561465921916324e-02
3.085714218993126923e-02 4.941905859666902989e-01 6.415713654340640115e-01 4.538016997442954198e-02 7.288189461099764399e-01 3.420063788896948731e-01 1.625424627653050125e-01 1.181930045743855434e-01 3.687224474343822611e-01 3.034274822802492111e-02 9.691162553333985963e-02 3.593512583081093226e-02 5.353821360760084580e-02 1.001514149407181642e-01 4.191739486314018936e-01 5.688543061734089440e-02 4.357715891373118433e-01 2.015406343662181909e-01 2.904520324065091308e-01 4.878784377941408623e-01 6.374841682361126471e-02 2.003894878344536223e-01 1.031747339311855638e-01 4.799916417148237802e-01 2.844581754553833219e-01 3.379116454257440338e-01 1.755585847462536042e-01 2.655907054980563564e-01 4.950862747611486370e-01 8.441205189772892081e-02
3.175854888957129613e-02 3.566691828615442539e-02 6.159115324987738394e-01 5.092880358619298331e-01 5.115759073945806978e-01 2.021649238829849593e-01 1.337863444121146772e-01 1.390698913997928388e-01 1.544613308714302968e-01 6.118075293935485437e-01 1.794874030667922837e-01 1.801127212733611704e-01 1.458929444119522467e-01 1.500513901726491794e-01 4.034682040327411956e-01 2.752669906745653927e-01 1.902543475344765922e-01 1.138260719400413234e-01 9.818472922007118187e-02 7.327302858204869096e-02 5.863963764012925656e-02 8.567484990077033069e-02 1.309359567011298964e-01 3.053550073040959267e-01 5.212546162082438705e-01 2.346153379261115002e-01 3.598424393553137923e-01 2.499762603055072918e-01 2.587179567716549888e-01 1.708723497380965628e-01
3.781251261684979992e-02 2.626725862074474199e-02 6.171615651512738498e-01 2.586438458584278816e-02 1.825376245145804779e-02 4.890358350281623356e-01 2.899226800667636939e-02 2.261864292005028726e-02 2.127133759285648740e-01 1.540717383049738376e-01 5.778119947256749045e-02 1.343760285336700055e-01 3.399875955265260208e-01 3.167081961531501566e-01 1.193761744255061458e-01 6.788967266247437626e-01 2.156223726170179433e-01 2.462287022163006656e-01 1.109426831683402170e-01 4.899298728858818286e-02 4.755652383061284572e-02 7.424591293875192066e-02 1.126608185563144904e-01 3.433980913845832150e-01 3.464472996769333291e-01 8.194686679281738828e-02 9.116038208418458799e-02 1.176185760689212323e-01 3.839716132610476729e-01 7.865906378474904481e-02
5.084961450754722778e-02 5.172388669247755810e-02 7.025825157569380863e-01 5.637456882486920756e-02 5.618272771180541497e-02 1.054851454437779890e-01 7.452401864422983357e-02 5.388156772734346012e-01 2.116437365294978057e-01 1.227121343685812216e-01 3.724385149764938840e-02 4.776062868448373300e-02 5.156865048936628421e-02 1.785009398878164011e-01 2.141154308216353108e-01 9.100674241559833511e-02 7.542919665253555728e-02 7.866982447772938314e-02 1.056931673406118627e-01 6.103616254656595019e-02 4.326986326349847867e-02 6.441699145379817248e-02 7.327150538436369431e-02 1.222204303621994004e-01 3.808116359889854863e-01 6.004203606140756655e-02 8.734977304398615361e-02 1.434237967547408732e-01 1.735181087227716246e-01 3.448631615273413109e-01
2.781924494588813163e-02 7.496335001537975107e-02 2.270841160724674374e-02 2.488428902832878070e-02 1.107319036744845026e-01 1.173513760211560564e-01 8.318787766586645260e-02 3.800176370428531292e-01 2.925044102987689465e-01 2.724582834354393190e-01 1.115882193361140834e-01 5.619081072086291873e-02 3.387533599516033556e-02 5.366843755373713193e-02 2.457549356115402150e-01 6.455357270299334760e-02 1.729714006004759441e-01 7.171612429861656812e-02 1.327250013933016781e-01 2.344612486042334520e-01 6.049359122271852351e-02 8.464367694417877785e-02 7.368180930943854512e-02 8.096231637290740579e-02 1.073848649594257298e-01 8.236413880374535146e-02 9.719912380096698556e-02 1.199566780829330326e-01 1.619254869921051831e-01 3.977397360356137446e-01
