6.495502658198256674e-01 6.548988022270390771e-03 5.711240154898059897e-03 7.225902468793318593e-03 5.457394632822866118e-03 1.188192008789712602e-02 1.161489213989557422e-02 3.099990567601750360e-02 5.573945802901442148e-02 2.455817180832132671e-02 1.120716536876509989e-02 4.004671783250334793e-01 2.342978741554168631e-01 5.203351387170295980e-03 5.932057806113934413e-03 2.380196478438169894e-01 4.376637304962313277e-03 7.385597988838107572e-03 6.452219079947980884e-03 2.200812462587088767e-03 4.308145824753490394e-01 6.302700081503979923e-02 4.931103266469476221e-02 2.000911414830405244e-01 3.987483497149306721e-01 3.221858101834043087e-01 1.538235937867420688e-01 1.379936969431239634e-02 1.328907671135409578e-02 1.684667914168317196e-02
5.122742037302533413e-01 8.034631721209955016e-03 1.450101893975576720e-02 1.177978107457102429e-02 8.195100135017913817e-03 3.647868665648167780e-02 1.715326460524359969e-02 2.102788474692333931e-02 1.349310819228605879e-02 1.110165799580563849e-02 7.663340437916292894e-03 2.388543916254987076e-01 3.164545581632777216e-01 4.164756558633447153e-03 5.679618183525261821e-03 3.588280576174696611e-03 4.295182568451664032e-03 1.347656895623688782e-02 9.769625987084687088e-03 2.840516310288409077e-03 2.596968381950803817e-01 5.879883759929616094e-02 1.244339060140046138e-01 1.127707759376839619e-01 1.029486630214127008e-01 1.431871103715502691e-01 5.295562127869907210e-02 1.385242199480033083e-02 1.992062780133923086e-02 2.014737942367341578e-02
4.531567638274471010e-02 4.646122897734120821e-02 9.834212878947622138e-02 7.930702228791386421e-02 1.695637469858416735e-01 1.719016276293549444e-02 4.635709221629060184e-01 4.918257656144370271e-01 5.262423074171609927e-02 1.530398497300621691e-02 3.933426206847118189e-02 2.486735450602076125e-02 8.771095888897474310e-03 1.260655580965883496e-02 4.440910376148231031e-01 9.722690525866930708e-03 6.283859762667848292e-03 1.231233977317224178e-02 3.917723482479145564e-02 6.264323939387547377e-03 1.625404332413050712e-01 4.760382517867455671e-02 7.325350406434849582e-02 2.642075804818237381e-02 1.653556824341795295e-02 1.154781674131627467e-02 1.084222635975753100e-02 8.625005048528661816e-03 1.471432440787813142e-02 1.672456921449628348e-02
2.085934086094287654e-02 5.973794842532074989e-02 1.313108270361981467e-01 1.052436736001703538e-01 4.364640798849959979e-02 6.735275327974021842e-03 7.879587014744140472e-01 5.272555105780115658e-01 3.189053491313337818e-01 1.894487002145630108e-02 1.161561539261446105e-02 2.208098748328919669e-02 9.650007808667374759e-03 6.379514540401565702e-03 3.364463522345088053e-01 2.626682478516270680e-01 2.780382918468763797e-03 4.973769352201708183e-03 3.392643690964837738e-03 2.788809383154396832e-03 3.229265558660814328e-01 1.118267944720347656e-01 3.523914738813470338e-02 6.971620544800262442e-02 1.351030409102022163e-02 1.036661431882802964e-02 9.247555292061799409e-03 8.781728011179216337e-03 1.757256130278275069e-02 1.941208519680740971e-02
1.197440448361212356e-02 3.695322197085686849e-02 1.029044235765712301e-01 3.985899796757345209e-02 2.303220482865189767e-02 5.003249370060807166e-01 7.671894308055465794e-01 4.272533919640185140e-01 1.958432192619273815e-01 4.359130300735004904e-02 5.213959297647849378e-02 4.277120988903764659e-02 6.140077015624400940e-03 5.062161522970266836e-03 4.090768971526654862e-01 1.563530986885944274e-01 8.847874161114937727e-03 4.898333876480995795e-03 7.636131971483314795e-03 4.223885789828754622e-03 2.840632743751589015e-03 1.929783959139970417e-01 4.311724243762587450e-01 1.198279368047679705e-01 2.451403784153713405e-02 1.368705914541966731e-02 9.725240370677722471e-03 1.131750057399807767e-02 1.748362601565300878e-02 6.557259991667076238e-02
1.185303846360402820e-02 1.233537500111225350e-02 5.520347680895182352e-02 4.412771035465013619e-02 1.754388446482131603e-02 2.878657482207974683e-01 3.489545100136381417e-01 3.726626736185385536e-01 3.432689647501430130e-01 6.731044893743183544e-02 5.069915786974703992e-02 2.581571619767189518e-02 4.338661650235103862e-01 1.371219965545797670e-01 1.082170529830803613e-01 1.829358947548090086e-01 5.226898068079229541e-03 2.544777560229741220e-01 4.182543849278492522e-03 1.399845553750317557e-02 1.659740807406814150e-02 9.527732197264391148e-03 2.273449244167374556e-03 7.395561381410536983e-02 3.701560705305723120e-02 3.555719454155477355e-02 2.227839812279872045e-02 1.548236482846570075e-02 2.015939931463735582e-02 3.716453861706278672e-02
2.402020149991382914e-01 3.945159020744878342e-01 4.177144554375147867e-01 1.357822003133157818e-02 6.512441891083658140e-03 1.085773413289095948e-02 1.658487771047875703e-02 9.525164627144141333e-03 1.136987870088154197e-02 1.286624661965649757e-02 9.597067667103628338e-03 5.497234014463762142e-01 2.251864713373419313e-01 9.172997141233665830e-02 5.029801843094607733e-02 9.310346479652295559e-02 5.544846212810649044e-01 2.634656854585872843e-01 7.210971823343965970e-03 9.638720043513205119e-03 4.311766554579348452e-03 2.193483707138493277e-01 8.773830726918677159e-02 6.851067384945852545e-02 2.544015654795857284e-02 2.623325631395166668e-02 2.276617510400152922e-02 1.998288829775414846e-02 2.299063670794381301e-02 5.608439217210398758e-02
4.768125589610934800e-01 6.049101675534689256e-03 5.335257753265182368e-01 7.710990332122662737e-03 1.185628846940549493e-02 1.337092193869584417e-02 1.191008170647294903e-02 1.129024169665928876e-02 9.117289305726162044e-03 5.008555950162974814e-03 2.914554804909691432e-01 5.960472377242023723e-03 1.840487111156987599e-01 6.282258248990262028e-02 6.600324113587426045e-02 1.250613809835532109e-01 6.114975293068697706e-03 9.640367763541815224e-03 8.354628634052131339e-03 5.841939413559915466e-03 3.103326436142045952e-01 1.493339221561313934e-01 5.114336564064903695e-02 3.989527916353121512e-02 1.878993782631415907e-02 1.974267979208540330e-02 3.037317104583455232e-02 3.901436014116708983e-02 3.979028860466821138e-02 1.203434365649399818e-01
8.256250096934081989e-03 5.435608845540865382e-03 4.625243861032743431e-01 1.890860627189917473e-02 1.238790395696616649e-02 5.260141247348372115e-03 1.700177871440364599e-02 7.640977751328140513e-03 6.428571844901260178e-03 6.261631275067875736e-03 5.508150058748545810e-03 7.165398726609384546e-03 1.545084955959770585e-02 1.000288813524511516e-02 2.315918927569124153e-01 2.144070054977481044e-01 5.717080626202698454e-03 1.717472013484355048e-02 1.678211594458888303e-02 5.076337006271217644e-01 8.209884737790536235e-02 6.448546247366346296e-02 6.160606072141763812e-02 3.786838220236395797e-02 2.190188340067987516e-02 3.365689370554608012e-02 1.262083278998347713e-01 2.619507136431614702e-01 3.038155100789667693e-03 3.981537301710006416e-01
1.312754479659749944e-02 8.572598751757446942e-03 1.393758749274749166e-02 1.319959744900790939e-02 1.175457789892016790e-02 3.457370660124796102e-01 1.080167337246220813e-02 4.582154875418934133e-03 3.029059325100081357e-01 1.115137286753961066e-01 1.036165665167976604e-02 1.000714662579263621e-02 2.096581648735963005e-02 2.241578237758777223e-02 1.057390398582929228e-02 1.141151824995384999e-02 6.058655606595576143e-02 6.239573018287582901e-02 2.494382977676000077e-02 1.100688233043045465e-02 9.921138162760644030e-02 4.765087277697573065e-02 4.912908329462162271e-02 5.156220689797472168e-02 2.810104666938880585e-02 3.613486302259700383e-02 3.399855672583405042e-01 2.361780549276674447e-03 3.214659712434421706e-03 2.132480561173804301e-01
1.078478482409194264e-02 5.637141723610309720e-03 1.278198451953060054e-02 1.098690207548980516e-02 1.412953480117416782e-02 1.944559186497923087e-01 1.658839653806335190e-01 1.465825148901696573e-01 9.339453815969474271e-02 5.141210336970375439e-03 8.046294931351970214e-02 1.335161807497883824e-01 2.739339515525371915e-01 1.337805821721017308e-01 2.445939515344397464e-02 4.716749718257943341e-02 8.703022292261614057e-02 2.402117823307558034e-02 5.732616089448230347e-03 1.956781429020464091e-01 6.732142245585090445e-02 4.705967919050155907e-02 5.596777090591178311e-02 7.606500406171556872e-02 7.980365041949237515e-02 4.293006962277338967e-02 6.777060688489638940e-02 5.634337264406905771e-02 5.233640045372728311e-02 3.885519641477841457e-02
2.791971636261340040e-01 1.644692389097300589e-01 1.040596427821271694e-02 1.022796138124479857e-02 7.990601012084933702e-03 2.745057692245556624e-01 1.080995955219382215e-01 7.019922822868993051e-02 8.778648084626623771e-02 9.756869111273923714e-03 2.371508961643851651e-02 1.547476297122118705e-01 2.768354667438536199e-01 1.432492559896799966e-01 5.177025562996698943e-02 5.804777957725842930e-02 6.392682638577340537e-02 3.778064659127409325e-02 9.323754314836320278e-03 4.213610959451056792e-01 6.255514236136258677e-02 5.560102046979821522e-02 6.287338889463733871e-02 1.111593947051727344e-01 1.053921894044026197e-01 7.451379918632862476e-02 5.680470405894894742e-02 5.285787772797727324e-02 5.794116774245310769e-02 6.347014968739617125e-02
5.409296748717172532e-02 1.397274253595848781e-01 3.432480166378768516e-01 6.761712813275854231e-03 4.392136307401742559e-03 2.077197079351720543e-01 1.072778177432745506e-01 9.041462060043101157e-02 1.148949651006335310e-01 4.744562508453151889e-03 2.745881846710546137e-01 4.849881852118120840e-02 2.039877870147553118e-01 8.730770457219855230e-02 2.756643745834138140e-02 3.193632280537116869e-02 1.180604091655391118e-02 1.735451761505773030e-02 1.981244733030153651e-02 7.412350454074747262e-03 7.536999507178379631e-02 6.767526699791827360e-02 8.153846418474669511e-02 1.394651682739319332e-01 1.820767874269696718e-01 1.704959739383723749e-01 1.260418395203738440e-01 1.168277693952988056e-01 9.064015105349979007e-02 7.120848135917552668e-02
4.307880425604597441e-02 1.239120840257371403e-01 2.267547883768907535e-01 1.654232817024095248e-01 9.795963566468973704e-02 3.896434686611319198e-01 8.407245938719012934e-03 6.979894219982862164e-03 1.616342752192741483e-01 5.037693576008651225e-02 2.043360154159366282e-01 7.725221547273639598e-03 9.167812042268437545e-02 1.245197250034013464e-01 1.341030958487205993e-01 1.827041093046884446e-01 1.648641176105902217e-01 1.069224505324067043e-01 2.918901421835822796e-01 1.364231859073310182e-01 1.128029776430198618e-02 4.715855056851895877e-01 3.551930242951367167e-01 6.040696435969179941e-03 1.389830360313407641e-02 1.283747077888982430e-02 3.472854628244325531e-02 1.133201232814350437e-02 1.460974308609226391e-01 1.438638241342496404e-01
3.957624863353989553e-02 3.970199657399054588e-02 1.095416619985456336e-01 5.342651448586345497e-03 2.953010648338686983e-01 6.960909153595751242e-02 5.557168904473401908e-03 1.583873394922935551e-02 1.055972688473690198e-02 2.014879206047708038e-01 4.381328579486604147e-01 3.822457081640712184e-02 8.151687549419768530e-02 1.037957224509844095e-01 9.445772887963155284e-02 1.151536996320750156e-01 1.972433220970590539e-01 3.418749770388764264e-01 3.502187578719063166e-01 2.788686146840841928e-01 1.196858716904051351e-02 1.251956413071435466e-02 1.100729083723588075e-02 3.452381886664736277e-02 4.950224875010487968e-02 2.521546743490867271e-01 2.517511652492591678e-01 5.081412574071717675e-02 1.718261887527638421e-01 1.048555421696299728e-01
3.545160808469728642e-02 3.850974045487925990e-02 8.818397408516519265e-02 9.703100813871826102e-02 6.376437784726150804e-02 7.262369205941254791e-02 5.169022379904929521e-01 8.458641805741061795e-03 1.746879376501285844e-02 6.358354011238889249e-03 6.653358789959340838e-03 5.855906415400921258e-03 4.579433395100834109e-02 9.338693539461767612e-02 8.793486026332934802e-02 1.357811078587827791e-01 2.358014578343618217e-01 2.886151737931740291e-01 1.690277166606925785e-01 3.741643347315624923e-02 2.246681486360401284e-02 1.537265376040320985e-01 2.215952561754352679e-01 3.753868483549534507e-01 3.567264964723484977e-01 4.690291216638270977e-01 3.805915872892806640e-01 1.092953454231222060e-01 2.747216829465429777e-01 1.256671555449222766e-01
4.414801069707684905e-02 5.078667855994428021e-02 4.995967060985213870e-02 4.731187949246701274e-02 7.142234688938732534e-02 1.485081950350997382e-01 4.901703210123382198e-02 1.633718633283692545e-01 7.977120167186119160e-02 1.387979951498361647e-02 1.043522819706347443e-02 1.641588216385603954e-02 3.265320289673058485e-02 4.841006821541261884e-02 6.424222030380455362e-02 1.159553842042725796e-01 2.513708676963244404e-01 2.576595013930614297e-01 1.245767969206293818e-01 4.337609421410737465e-02 1.852564397169536858e-01 3.315947274833495051e-01 4.201696426777538629e-01 4.403390452830930890e-01 3.987748432757686756e-01 3.531759054547227161e-01 5.339299829833694666e-01 9.354763261578383227e-02 4.156804624354464295e-01 1.782671007846095279e-01
1.084456107144417814e-01 8.447426954714781777e-02 4.380742533311728082e-02 6.840779800688896739e-02 4.740555168127995496e-03 2.372786282677424863e-02 1.323136421146232922e-01 1.075276417671531398e-01 1.058885876964061057e-01 5.403517807530452272e-02 2.007107143779718675e-02 5.460744531012660941e-03 5.379452411479727740e-03 1.392741932167827421e-02 3.147517281641605547e-02 1.458170687310429148e-01 1.547009997723504116e-01 1.845365182634480516e-01 3.280146440013079201e-02 5.855307204552301359e-02 2.046166850810736682e-01 4.356951263772970151e-01 5.307508566155437757e-01 5.675055592914034497e-01 4.891943262652211910e-01 4.888812375753281425e-01 4.681156004239369617e-01 3.710537458924075271e-01 1.646341894336291953e-02 1.085251986220698087e-02
4.916409923817081223e-02 1.346723779150408029e-01 2.493844093116826532e-01 8.999450964528143970e-03 1.932502193292878756e-02 2.705720847011893609e-02 8.542172270350294194e-02 1.062102708961014524e-01 7.300072644836916314e-02 5.751168867086704772e-02 1.223568934253254671e-02 2.736192951712224652e-01 4.163394335720827510e-01 5.332302913697418642e-03 1.172690190610262834e-02 7.023477495063523701e-02 2.706493449446820826e-02 8.807977826220139000e-03 4.590374816488179133e-01 2.188468928389972548e-02 8.246686350770780771e-02 4.353980820694177134e-01 5.480019712796649900e-01 5.858552978513754672e-01 4.398549540818080250e-01 2.088994551381825326e-01 3.443859477795205293e-01 2.363835818810951228e-01 2.131559163556901587e-02 8.414474245154957011e-03
7.086040176367455409e-03 8.720227937692661899e-03 5.648739976384842612e-03 6.767090049713892635e-03 1.538466445602105354e-02 8.729854643347478155e-03 4.496754847194087829e-02 5.781239291922955076e-02 5.339466404957675383e-02 1.273721816855222060e-02 3.235288590787592251e-03 1.637268906290120229e-01 2.848157464885368029e-01 3.728883902715789383e-03 1.516139358226288245e-02 1.045306756211961292e-02 1.925306739838515691e-02 5.747332805888999592e-03 1.085228947088916727e-02 5.148238689240768745e-02 2.765658419102147159e-01 5.244099746049960542e-01 5.650518974355815960e-01 5.434976414002383738e-01 4.232298723021806208e-01 3.139105251336369862e-01 3.068173147100120013e-01 2.067300147602353089e-01 1.861307313693755933e-02 8.538138985744163634e-01
1.996493103890387491e-02 1.743655875115473000e-02 8.721954322224129835e-03 6.076789779293467406e-03 7.628505177894485435e-03 4.037531332460188305e-03 2.295988125270680830e-02 2.038478159914306961e-02 5.592976117868908581e-03 3.077165711517205159e-03 2.751458207900356889e-01 2.170997517988937364e-01 1.294439811543163232e-01 7.171205174819568484e-02 1.862953684007453148e-01 3.037344068005171354e-03 1.088956563212688418e-02 2.492648481076988748e-02 2.405732279951589350e-02 1.078923038731957607e-01 2.973140014277367293e-01 4.363573249613799110e-01 1.799854976655518024e-01 2.711269840296026690e-01 3.498951858163986128e-01 1.980214283333721903e-01 1.477550551761237785e-01 1.213580249808052930e-01 5.562687389644243030e-01 5.075866541461167003e-01
1.565054934753500396e-02 1.720109050554848723e-02 2.507369424583907273e-03 4.074198427354489005e-01 3.588553875763441092e-01 2.017324666363711199e-03 2.856518190540204873e-03 2.012033015799389868e-01 2.632398658698857918e-01 4.084958027547270359e-02 5.311202529707415715e-02 8.031010607934158108e-02 8.927370030617996777e-02 3.220591465242227946e-01 4.124571765124110390e-03 5.644286144820281903e-02 1.074788552541890846e-01 1.552588881729674020e-01 1.058850394206746620e-01 8.042325494364389871e-02 5.813512573264501687e-02 2.124772129040915919e-02 8.379799806503116302e-03 1.802726324384601453e-02 6.480725096436930344e-02 2.177892766056814880e-02 2.001491947423832823e-02 8.284110557892399029e-01 9.507574681817082540e-02 7.777774493709525838e-02
3.110756015936902083e-02 2.304802035318685369e-02 2.524866052298873308e-03 2.612413392369927756e-01 1.614267656559227734e-03 3.339886454677524208e-01 1.885001540658567259e-03 5.579846697086535134e-02 4.710644199792039799e-02 2.025884057257280532e-02 4.775663533947818035e-02 8.984633532690680657e-02 1.200053779948937610e-01 2.770131286278545036e-03 4.859159028306111842e-03 3.229452687838993419e-02 1.166659014055432958e-01 2.160970679964788477e-01 2.436298785757406160e-01 2.139880457337219877e-01 4.692723956496405724e-02 1.075270202436126241e-02 1.361211146566154717e-02 3.322702753417351024e-02 7.354153452601734642e-02 2.157585633076232814e-02 8.266928886922632336e-03 3.830005607460695294e-01 1.207808633844724422e-01 1.083596241233711066e-01
3.654990676886162720e-02 4.515126460348095096e-03 2.888457227583318132e-01 1.043665334143008966e-01 1.310574801134797018e-01 2.935652691900799693e-01 3.777570988882997804e-01 4.214342666500453527e-02 2.311232112389051407e-02 2.653164725374036401e-02 4.671447839862186147e-02 7.933098380147074469e-02 9.000771329177499613e-02 2.110716210360818069e-03 8.820864673237444400e-03 4.536641773639631114e-02 8.642082805948932134e-02 1.964609609200813067e-01 2.449026497000970914e-01 2.098339605613391834e-01 1.086033840789875360e-01 6.458821834119998773e-03 6.623816906756950784e-01 1.016828302130633362e-02 5.828794179045833357e-02 3.477243221114975635e-02 3.129225323846189510e-02 6.886402424763564678e-01 1.054034504273983486e-01 8.090095749862219465e-02
1.915912873744258713e-02 5.793172221546256245e-03 2.395459910971231132e-03 2.366919745114888941e-03 5.559115334240774704e-03 3.746101404879172234e-03 4.051221674621565683e-01 1.642559080902245838e-01 2.432234200254199397e-01 3.139874268384791334e-01 2.902566498114111937e-02 3.250879632607440312e-02 5.071928184293154895e-02 1.153296363759064302e-01 3.124234103960570660e-03 1.363436530662054218e-02 1.353276636371517939e-02 5.716657009584429072e-02 7.264111950705394449e-02 6.333950123920085995e-02 5.548721463088410188e-02 7.427416435202523377e-03 1.675660665029294061e-01 3.177730946036949611e-01 1.018167149000219138e-02 2.539188339134101913e-02 6.819588296219673829e-02 3.827597283475644985e-02 1.223856252586517646e-01 9.221863914221359315e-02
6.794268081735377156e-03 2.636161373595805914e-03 3.007073250589744999e-03 5.404209172242875441e-03 3.137112355845484216e-03 3.645339962456719540e-01 1.660509283213722764e-01 1.153828390513579744e-01 3.607580076290665128e-01 4.880680529795646677e-03 9.334119966405858559e-02 3.196628397799573112e-02 5.408997839003851921e-02 1.190454908621799979e-01 2.524112334830336431e-03 4.842072227589965319e-03 3.302055390098817753e-03 3.192603959093402999e-01 4.866069341490498745e-01 4.738134384765770209e-03 8.797859963338235459e-03 3.296148804764992835e-01 1.659148673869423884e-01 5.772750868947663060e-03 1.416629782468274874e-02 6.782560450087395942e-01 1.751253545992075694e-02 1.954288392534607455e-02 6.909657314119125281e-03 1.400733635077518746e-01
6.884104179342157709e-03 5.411651134725814667e-03 2.815892002940571792e-03 2.202243395993674479e-03 2.178520134985519486e-03 2.119229391064993973e-01 1.386677621679059391e-01 1.405027375999333417e-01 1.532276389955332663e-01 2.137047571277520507e-03 1.693630717636616378e-01 1.596128021234289318e-01 1.507741817923965999e-01 1.885755629170717818e-01 2.448491707689131377e-03 3.866739687216083077e-01 2.603592197107479356e-01 1.556022100139537179e-01 1.369610468107494983e-01 1.051193958762492026e-01 8.368082657261895208e-02 1.222730576390392288e-01 1.945636598707154163e-01 4.872826173477737277e-01 5.811025493929226557e-03 4.118860904405187151e-01 6.586669358553616238e-01 4.205314031867250502e-01 4.208394315642303152e-01 2.705090725150844366e-01
9.320630825538604378e-03 4.767689020157860058e-03 2.896191162828539063e-03 4.226233551795363988e-03 3.945655127895142562e-03 5.547801112344575847e-01 6.914646656338888607e-03 5.009222218513075496e-03 2.062199701554444375e-01 1.481048367213154693e-01 5.230347534094337975e-02 1.190349037886442585e-01 3.538123811025840615e-01 3.950947751796766716e-01 5.521147290189137163e-03 4.491523720314315876e-03 2.972145228752623991e-01 3.533248346201950385e-01 1.636980362623261243e-01 7.130213829363496458e-02 6.478342291794107755e-02 9.891814060346987292e-02 1.538712577620313660e-01 4.909950093492416179e-01 5.162567420685653108e-01 1.261452214559831975e-01 1.421404180696596298e-01 1.792888388639306274e-01 5.690298158307860454e-01 1.182643953171042678e-01
1.260693300565882309e-02 1.070295692928953206e-02 3.458117054189228760e-03 1.261279249479322143e-02 1.551461041028402710e-02 2.876433012133933903e-02 1.865250677979766319e-02 2.033214930877144232e-03 2.044901665274200253e-01 1.168689337618527835e-01 3.415368876019099498e-02 4.227011776867958120e-02 5.307216148743671563e-02 2.164152887334991060e-01 2.771688589452901974e-01 1.277134183117806521e-01 1.250003415316296995e-01 1.500772308611472428e-01 2.043216623004378840e-01 1.115853501254586155e-01 6.054365574482414164e-02 8.200046384676092093e-02 9.189380611227417062e-02 1.621194300234307939e-01 5.338851065557304043e-01 8.726611210453708023e-02 1.291230860038407036e-01 2.094864987494558517e-01 2.446467753884920271e-01 4.971753145835746124e-01
7.263922788870422025e-03 1.765900846239106675e-02 5.538170600935329521e-03 6.244251973107406428e-03 3.157330851391747240e-02 3.321175386493349646e-02 2.183509519265169896e-02 4.133944347454199253e-01 2.931992169797080217e-01 2.722419023921738290e-01 1.099434700814055088e-01 5.361707713008550397e-02 3.448152643686384911e-02 6.151906000595844248e-02 3.013344600605506463e-01 8.981541003893987740e-02 3.204048497774460436e-01 1.056477216123693011e-02 1.954914704005291173e-02 4.620129625520797978e-01 9.028756812662759590e-02 1.139393512326935809e-01 9.665341921781499257e-02 1.112843646384363561e-01 1.550074990896997407e-01 1.235138421595040198e-01 1.488737014797206493e-01 1.833118650499028501e-01 2.387091030227826982e-01 5.995404804638038154e-01
