3.096178754494912644e-01 1.047167175306028958e-02 3.587445493992888479e-01 6.518920102944025796e-03 3.261326419122886344e-01 6.052242682769484391e-03 3.366015575086178310e-03 9.051043164617982376e-03 1.635203865840828552e-02 7.415546257085263090e-03 8.252418252541348156e-03 2.049410148168773205e-01 1.316241297929248988e-01 6.419886823337576584e-03 6.709994483919285227e-03 1.428331287255899251e-01 3.988033244101094575e-03 2.379037596086725197e-03 3.849004704981867642e-03 4.763536974616444652e-01 4.405755737842685926e-01 6.662399196498500209e-02 5.091304784406258666e-02 2.018507991092819698e-01 3.875584912433006624e-01 3.012325811834983269e-01 1.374116634286074723e-01 1.208251637764041000e-02 1.152542279241886881e-02 1.448662139999636403e-02
2.032602643517207874e-01 1.060487491789928807e-02 8.346336547032691053e-03 8.710392584184616441e-03 3.741138410757622983e-03 2.049867566022860188e-02 8.230720417152209006e-03 1.002706715869647151e-02 5.102096145118381262e-03 3.285354260364125104e-03 5.163687370061299450e-03 1.029629275745541500e-01 1.515727422220601861e-01 3.658253347242597098e-01 7.219021949056053308e-03 3.915910365905632684e-01 3.724633082106515360e-03 4.374969523808727549e-03 5.618105666276502694e-03 3.698165805195218446e-03 2.540028232376327355e-01 6.417384502284034786e-02 1.331268686852731808e-01 1.180075257681684475e-01 1.034207582839180850e-01 1.375331193882627923e-01 4.805084346651962435e-02 1.221788074790601704e-02 1.738809849509897337e-02 1.738348750250589755e-02
1.722003696879505219e-02 1.687969950832261118e-02 2.638496122104582592e-02 2.142439434922815619e-02 6.183231669203932690e-02 1.764084240985792917e-02 1.801199001044698211e-01 1.891763208899704951e-01 3.375958132165525483e-02 5.101014210890494373e-03 1.305172304915388527e-02 1.112378536783399305e-02 6.744034448013693298e-03 1.460050144104503046e-02 2.376613155958362533e-01 1.452757859777033256e-02 6.757676732492111024e-03 6.696856839767433706e-03 1.252213901917960913e-02 5.166219377668217552e-03 1.572194908042898742e-01 5.307490535609252907e-02 8.118546902709336544e-02 2.804700060159122030e-02 1.646055176058152866e-02 1.075776726859320812e-02 9.570388502370307665e-03 7.523149820531519275e-03 1.283844763947082634e-02 1.439902097165042527e-02
5.704952126159308808e-03 1.611628846796387890e-02 3.535496732643554629e-02 2.855407639273361067e-02 2.160261630548978781e-02 3.651110283714308347e-01 3.636050983870086073e-01 2.261965042071973908e-01 1.229230151713563146e-01 6.964859839473508396e-03 3.401624735131838009e-03 6.686808271849954688e-03 9.569021108354013733e-03 1.343513613866195722e-02 1.822733710238764737e-01 1.595076311997737639e-01 3.434759650363310435e-01 2.536564404983051267e-03 1.060640886243798681e-03 1.641947313805118330e-03 2.746360448075559346e-01 1.096030025891141790e-01 3.781912018284903920e-02 7.411728771963291273e-02 1.341789665143730895e-02 9.507883855994145317e-03 8.131443134499481348e-03 7.726743554732154635e-03 1.570742340752167079e-02 1.708462766809556999e-02
3.265342169671452306e-03 9.937030319801075720e-03 2.769675144934653083e-02 1.074877870310543722e-02 1.366819996937069029e-02 2.127931377481878106e-01 3.717241623197358180e-01 2.097284726418210121e-01 7.736504863791297815e-02 1.835631663119913215e-02 1.550982000364222943e-02 1.903693465761346904e-02 8.364584951264840765e-03 4.419951841094463263e-01 2.349005137386134812e-01 9.496595869854503047e-02 1.051759775613740622e-02 2.938317062929381943e-03 3.284120122886097313e-03 1.932889320774782956e-03 1.893452765902311520e-03 1.426808599647265974e-01 3.685310534199414123e-01 1.209432422484737202e-01 2.411775955383827982e-02 1.268276437498691220e-02 8.770259906062177410e-03 1.017852425699227251e-02 1.597359675154990874e-02 5.892953911397549871e-02
7.435626947989232988e-03 7.962860866537189650e-03 2.493507617978239083e-02 1.481530281700210380e-02 8.910380817339330628e-03 1.195166630209123781e-01 1.528854441411469645e-01 1.633544907846394278e-01 1.328357913784266875e-01 2.521561044009328068e-02 2.234007115900993670e-02 1.976002930270825964e-02 1.987244392315366814e-01 7.487416676612478061e-02 6.319075359266750069e-02 1.070718479059769301e-01 7.962341045122877173e-03 1.434588090962712059e-01 2.211074302498961582e-03 4.155109967362699205e-03 7.787452430732127312e-03 1.353747117953458395e-02 4.503732874133181685e-01 7.009900378525768527e-02 3.582836631408926192e-02 3.306769815779739968e-02 2.050297327006841974e-02 1.423275719616167410e-02 1.890750417076069237e-02 3.421537351970808244e-02
1.150111398620722591e-01 1.743657556371287776e-01 1.712288610885111251e-01 8.164459309177732674e-03 2.324198835339351919e-03 6.086083004917336448e-03 1.302379043085163945e-02 7.273237316283431841e-03 9.205202012782595297e-03 9.397119646080443270e-03 1.222337475086855522e-02 2.403357973797115854e-01 1.118964958223654105e-01 5.203356566212702372e-02 3.043756876559695207e-02 5.286651733265766012e-02 3.003338424494910730e-01 1.351495161954286151e-01 3.523808529896990671e-03 5.080862535184467281e-03 4.126844973327698993e-03 1.404490265041724029e-01 6.596618193756009774e-02 6.301304314623616676e-02 2.418023857045142888e-02 2.452674696628341644e-02 2.139350053603745333e-02 1.865934868265563262e-02 2.158879146534193466e-02 5.182380433963201111e-02
2.360112579124973853e-01 4.372992428346043625e-01 2.419160120578303652e-01 6.277595477415911021e-03 5.186392313737393442e-03 5.846788646028229508e-03 5.278060159387797448e-03 3.290010597315070132e-03 5.165319663054806186e-03 3.257079315385227880e-01 1.382112539398683282e-01 4.357363644973974992e-01 9.475126917650524005e-02 3.386362415102243950e-02 3.847114386255959251e-02 7.147106535459164800e-02 7.090654851896822236e-03 7.665078351714368216e-03 4.571224980834752427e-03 4.552908197873559160e-03 1.978356167814675493e-01 1.163095109897899493e-01 4.697209939402779977e-02 3.921697024347080979e-02 1.856441738756797744e-02 1.922398314344112014e-02 2.960479488732409292e-02 3.358682251647455985e-02 3.351958462331097038e-02 9.784307815701655253e-02
2.084723065408917997e-02 3.578382486924464589e-01 2.071890378831845736e-01 1.407367723384116490e-02 6.815586717601538301e-03 3.069844868542980221e-01 1.510909426167303567e-02 6.452055601893803838e-03 7.896706341956036268e-03 9.673223074849416486e-03 4.277440238964796970e-01 1.237452648134947097e-02 1.701396156254465081e-02 7.318353095874580508e-03 1.238032049470403906e-01 1.045716392714896859e-01 2.921533056877998868e-03 5.420534116202840175e-03 7.468101659407691204e-03 2.648883238565832299e-01 5.268781677504412453e-02 5.485687766801544685e-02 5.960604029533415199e-02 3.887784122899498596e-02 2.268181861519252135e-02 3.388520861063543110e-02 1.254179926051450511e-01 2.223920795713522636e-01 9.414807676829679839e-03 3.007455918750999158e-01
1.460551937939133342e-02 1.076891852353695743e-02 1.700011335642916815e-02 6.635267130261171889e-03 7.832456089267077898e-03 1.458344696800921159e-01 1.633351013843882538e-02 3.268675238331459898e-01 1.548159234904407100e-01 5.614543148232166436e-02 1.016720372126168545e-02 7.888897786958132957e-03 6.728181623015877348e-03 9.300235819883175686e-03 5.006592022373373800e-03 5.390333235678317764e-03 2.293148263263068351e-02 2.062526776621527447e-02 1.337963558192259254e-02 1.019456434098839348e-02 6.771280993141240434e-02 4.276873481785925524e-02 4.901429821534189490e-02 5.380602416855886916e-02 3.000932505591674335e-02 3.780571039763934438e-02 3.432592033218450633e-01 5.173046220490735703e-01 9.799288637223050116e-03 1.586758105452304446e-01
1.452960618218037889e-02 3.634522105853985052e-01 9.624565223147111756e-03 3.743349846853990994e-03 1.132240620172682462e-02 9.129332119263343370e-02 8.970542014943985731e-02 8.191703123215055005e-02 5.665567967480470563e-02 4.483526745333253349e-01 3.891108383803522364e-02 4.277965707846220766e-02 8.882482816150404081e-02 4.414826345604853930e-02 8.201165594324549488e-03 1.621782003895131871e-02 2.995729570031412797e-02 8.185470918099152504e-03 3.741721984834737134e-03 1.105891545733621445e-01 4.660613938796850930e-02 4.163948653477249351e-02 5.375601807321039177e-02 7.527477327780682237e-02 8.052916562666576072e-02 4.351036432655865788e-02 6.758550369125199131e-02 4.984245433329052843e-02 4.388002826709846288e-02 3.112263763493844371e-02
1.626361846551367951e-01 8.875702595577251997e-02 1.783572787984159108e-02 1.566187010695599749e-02 1.373895398071157438e-02 1.485081583440412967e-01 6.945462513094917412e-02 4.807401400983260520e-02 5.753948980386711098e-02 8.372304182429408936e-03 1.177362631150612876e-02 5.390385543358310050e-02 9.158348655484647993e-02 4.777582163248386693e-02 1.733761066967960673e-02 1.967130664235627532e-02 2.165927814957822536e-02 1.270469344289919603e-02 6.164471101094926193e-03 2.514580896974833446e-01 4.448793611594919345e-02 4.534978948527614712e-02 5.363781517987572384e-02 9.604831618335409049e-02 9.138563978560361456e-02 6.513320567396790883e-02 4.997011814222528103e-02 4.499820272194594850e-02 4.876184557579263390e-02 5.252986810315192490e-02
3.862817462556623199e-02 9.262570598332908745e-02 2.060960983462747642e-01 2.915284993793842983e-02 3.675272608269680719e-01 1.258175878118965030e-01 6.985480466891090534e-02 6.081065955598174977e-02 7.789094174454644359e-02 3.746375731420224873e-03 1.506556537382273964e-01 1.888756977834666825e-02 6.799725254819399822e-02 2.925544564496389971e-02 9.239640693462934998e-03 1.073214523228232728e-02 3.972789541158941451e-03 5.838810049876338136e-03 1.078131252625673386e-02 5.227159825158068929e-03 4.253501980212966160e-02 4.672215995630600582e-02 5.922616608172917574e-02 9.862730862239063589e-02 1.252607535717688014e-01 1.097096270492675663e-01 8.101194615407750210e-02 7.577591237789869927e-02 6.629779769366289655e-02 5.491020170605465101e-02
3.348391712553733940e-02 9.442851616211381249e-02 1.648119874187101153e-01 1.177892148124327909e-01 6.952913822295195279e-02 2.695441659671231616e-01 1.794807220657130761e-02 6.071515692178083498e-03 1.083424985056764545e-01 3.569894647004801663e-02 1.282182422104301001e-01 3.984459199472959942e-03 3.089024342489682384e-02 4.185256667947235415e-02 4.473952237824889433e-02 6.048859056899174441e-02 5.490671321755990347e-02 3.594846082020910355e-02 9.898332927204905873e-02 4.811761837453591012e-02 8.354348302773022955e-03 2.776934493480869293e-01 2.094014073234382323e-01 5.000864228572424741e-01 1.523785080566947975e-02 8.519259598040547152e-03 1.956449216428775978e-02 9.701942360116509387e-03 9.023252899066755428e-02 1.042704213868179408e-01
3.119490008293906991e-02 3.112210926343472739e-02 8.416463242282887225e-02 6.277863977108802951e-01 2.287648390179187197e-01 5.078932676840440530e-02 8.816996402944018985e-03 7.498760534955760393e-03 5.978635196336355533e-03 1.358924195551503289e-01 2.810241376850841077e-01 1.884523095038486210e-02 2.682872710937031502e-02 3.430060170169643013e-02 3.121206406890758567e-02 3.795725315368717739e-02 6.574264469866980543e-02 1.154116184192915534e-01 1.193590155038915246e-01 9.511659339593160623e-02 7.086325598947959895e-03 9.726022329949833914e-03 1.090564644332285907e-02 2.522517790037102914e-02 2.806837014399955060e-02 8.956958676214051007e-02 8.933909728159829255e-02 2.552666234003467954e-02 9.284555208035244478e-02 7.105677062804059696e-02
2.841725899233338293e-02 3.079129004293820401e-02 6.877642571898698320e-02 7.627439511107267367e-02 5.124913938917352585e-02 5.360718870888545040e-02 2.963377122017335497e-01 3.283069675146884150e-03 7.322376537785346001e-03 3.475975421699237233e-03 3.643096615573986063e-03 2.586166802114000639e-03 1.461873273386848915e-02 3.006052515028422023e-02 2.845848847460790559e-02 4.418692789054107228e-02 7.813934441870240555e-02 9.711689150284524841e-02 5.742395823603328731e-02 1.276518709112112529e-02 7.736894035737740261e-03 5.353262686065415887e-02 7.841502925236336352e-02 1.326717291739455129e-01 1.256294431834077407e-01 1.643542467054017187e-01 1.315529415496910493e-01 4.657447454020608585e-02 1.349047625436148035e-01 7.907136587943436323e-02
3.602292959842457593e-02 4.136683170618132149e-02 4.034322102219885242e-02 3.790360745875377690e-02 5.483836051485101171e-02 9.260676316572226396e-02 2.216914749337603116e-02 6.265505442869402641e-02 2.707055503070050079e-02 4.556177000973367884e-03 3.312914253314485843e-03 5.065056058594462687e-03 1.003297551444110036e-02 1.513410482575336044e-02 2.042639315654235996e-02 3.740153592992014053e-02 8.296737682584835738e-02 8.616471874056580438e-02 4.202612918970784900e-02 1.477486717965734511e-02 6.443761951621646000e-02 1.179760064073820114e-01 1.526528333768245316e-01 1.582000545953448634e-01 1.402023184928452570e-01 1.214695398998002496e-01 1.797460557750570898e-01 3.575040798056989405e-02 1.765805874704783063e-01 9.520637992328834232e-02
8.919379250538402026e-02 6.977327876161759646e-02 3.410481065492829839e-02 4.791013223436292601e-02 3.897555079558455773e-03 1.022014573848182770e-02 4.677262940158512239e-02 3.645474935799364324e-02 3.560274331473974735e-02 1.746325450889609984e-02 7.777764281061132212e-03 3.050554319093110034e-03 2.968339782614129278e-03 6.434668599549945439e-03 9.792039090945536470e-03 4.627068780331321241e-02 5.036855564507896482e-02 6.562587818572698795e-02 1.179274786712389278e-02 2.129910348602109815e-02 7.163551302023674072e-02 1.568737677444464185e-01 1.957593365887747572e-01 2.048154853772610196e-01 1.698423497731877951e-01 1.641636652911734884e-01 1.527435814754621313e-01 1.274073713239080863e-01 1.615514732759356503e-02 1.242098684056281398e-02
3.544938406733426361e-02 9.726966450353666249e-02 1.695556031365920979e-01 6.008576417626584204e-03 7.073164335872097336e-03 8.644352012879647981e-03 2.725196763454797166e-02 3.391555965083453000e-02 2.309214491836990638e-02 1.770769047365423898e-02 5.991014602628768303e-03 1.802502573172683475e-01 2.719214073901516926e-01 3.992928226708517166e-03 3.549251555892572220e-03 2.157865836141007257e-02 8.484718277763057814e-03 3.042728840414861153e-03 2.120755368789775108e-01 7.692555956764114342e-03 2.769362087373535009e-02 1.494921525127808626e-01 1.916955164195620898e-01 2.030010593850807565e-01 1.495405576607981568e-01 6.987859070014196261e-02 1.137496527901958321e-01 7.764152675691628203e-02 2.864686845729071812e-02 5.385946139666091259e-01
3.837918228773938220e-03 6.255644839230994902e-03 3.727498485925912017e-03 3.299714856200895371e-03 4.661269235178551115e-03 2.641320783949997319e-03 1.350367712117857971e-02 1.730239999599818973e-02 1.580663349452239227e-02 5.518059846925249187e-03 3.266003439169063924e-03 1.242927026909132204e-01 2.126605032708828169e-01 4.080954693794845711e-03 6.246384290136844895e-03 3.848458221806649784e-03 6.556539326216976292e-03 1.939083648030414352e-03 3.676889602395447786e-03 1.751073431680048517e-02 8.923834470741212610e-02 1.714894659745882510e-01 1.868159674554736860e-01 1.803535818374032429e-01 1.406434373358760315e-01 1.043571604488247179e-01 1.019399132060622992e-01 8.050121322702943893e-02 3.827541074462839643e-02 4.322697212709272208e-01
5.800571027130078591e-03 7.127442915024526961e-03 5.254378882420718613e-03 4.936536307420837100e-03 5.451335037396044456e-03 1.903041414730391803e-03 7.292907330988365570e-03 7.998886814400599232e-03 2.385145282384878475e-03 2.019597631273274251e-03 2.128522440160327545e-01 1.878840548639134911e-01 1.048186141849564018e-01 4.902886821225670155e-02 1.061887590140684345e-01 3.161129590654928045e-01 3.605620956621238306e-03 7.412505118403115226e-03 7.265963208796853354e-03 3.304893364509638165e-02 9.188939950099697662e-02 1.353229084547273586e-01 5.591949718483417431e-02 8.579309674026311394e-02 1.131707901483598316e-01 6.526920407981033623e-02 6.322602033313526326e-02 6.411570203162619830e-02 2.443694000880625716e-01 2.657696094768462469e-01
4.662776114361191944e-03 1.025190182354156383e-02 3.452058763148352361e-01 2.948451830945840735e-01 2.703524678052285912e-01 2.351941155067959529e-03 1.647311597194117336e-03 1.376841883252869214e-01 1.954349812309021661e-01 3.369283229325829854e-02 4.950211994718640984e-02 7.909794895191649133e-02 7.608803257703669609e-02 2.402853305130683848e-01 5.183620554387249543e-03 2.009847612701263705e-02 3.517908657788688248e-02 4.592264447251610815e-02 3.182688296417501145e-02 2.435978150209101856e-02 1.761292990225814606e-02 6.421333318293696510e-03 2.534095227791033095e-03 5.620745728377906508e-03 2.084150909514714128e-02 1.188717132436268101e-02 1.736979471760738761e-02 3.547262067546724240e-01 4.586670053156827187e-02 4.281375487746177932e-02
9.745226988773201399e-03 1.723697693764243352e-02 3.914036971470332138e-01 2.287034395221241301e-01 3.759901902287974829e-01 2.841294335624743317e-01 1.985352131279278804e-03 4.937651449250568536e-02 4.663092716611111355e-02 2.018447150230910994e-02 4.996279020953200284e-02 9.218277567475280376e-02 1.007666007870172964e-01 4.690918500979492922e-01 7.288150511896043966e-03 9.438317099300574595e-03 3.494189928471456291e-02 6.596383216227152957e-02 7.566720522118587644e-02 6.690174058123112000e-02 1.871957190190342429e-02 6.842440567962139106e-03 8.451545418271928789e-03 1.687393380593657510e-02 2.428140107418450683e-02 1.192987089512717071e-02 4.118307573964218316e-01 1.686970728817560050e-01 6.312436538373147887e-02 6.062084275520096543e-02
1.213869932621334385e-02 4.025428686336289183e-03 2.211683207324096900e-01 9.468293572540469050e-02 1.192711441018604324e-01 2.631498334686503959e-01 3.505333788465370137e-01 4.053101357597098386e-02 2.300747466267284366e-02 2.624307943602625232e-02 4.766602939456481003e-02 8.132932076052300230e-02 7.600927847018990047e-02 3.671452035311592033e-01 1.367338629521866987e-02 2.112758764143884971e-02 2.635671220719137259e-02 6.131915598266904355e-02 7.815399696265673546e-02 6.778063400395296922e-02 4.506955752109365748e-02 4.597824342946360554e-01 3.121753886981518122e-01 8.169327018970735238e-03 2.628500232195697325e-02 1.949042344098261825e-02 2.817399175274216960e-02 2.913889253424356007e-01 5.108003273895771190e-02 4.622897572581559367e-02
6.714209860402189228e-03 4.426755205919495964e-03 4.678363914640790711e-01 4.939278811672938030e-01 5.480345278060586890e-03 4.188636622749528082e-03 3.752149430084426029e-01 1.598773596470537683e-01 2.338993083765839032e-01 2.988288621778164567e-01 2.801393570115246617e-02 3.370908536144006512e-02 4.467941358753645120e-02 8.769670309420526944e-02 4.457216863100994519e-01 1.549842620338834354e-02 7.308383167393633570e-03 3.393712690650589614e-02 3.950813609679756228e-02 3.106315568573814884e-02 3.885550895616383948e-02 1.160062847664253965e-02 9.237801554139576932e-02 1.492520794386826277e-01 2.078394274521754015e-02 1.523276102670611740e-02 5.079131896064868062e-02 6.365280560677177846e-02 5.997593886395913287e-02 5.253512612665432735e-02
2.401122649237921562e-03 1.721776000069425317e-03 3.140190883589079242e-03 6.550440637894514376e-03 3.273138634930544862e-03 3.120169687880484655e-01 1.519970147988553288e-01 1.114306050472305132e-01 3.494376371350874644e-01 6.716927073359434119e-03 9.198429146948206014e-02 3.411415851630768964e-02 5.088949079424201494e-02 9.474783206857047280e-02 3.969290793187519317e-01 1.300834367826761949e-02 4.188058477829987858e-01 1.958773284960662886e-01 2.852553828152604720e-01 4.812543739166190715e-01 1.438465643923276388e-02 1.963293605451124357e-01 1.009078609415043903e-01 4.671944944615700201e-01 1.002002619493818913e-01 3.286312256314276592e-01 5.407391607107576992e-02 9.623829596966379518e-02 4.912159982325078333e-01 8.397537561657369976e-02
2.432853701536955709e-03 1.918266617677107013e-03 1.339491588436209860e-03 4.511129273657367711e-01 4.657061292934341901e-01 1.841679370625523560e-01 1.251096296345479975e-01 1.310193265137808705e-01 1.463300614284347434e-01 5.803595294395942350e-01 1.703177725429884937e-01 1.706493980845002478e-01 1.382512328213869601e-01 1.417984531107487345e-01 3.610925430092256638e-01 2.475385366511402563e-01 1.749222223273307897e-01 1.098483941764518690e-01 9.606880919782642692e-02 7.221184154368627539e-02 5.787068992918587701e-02 8.445238432997470568e-02 1.287514543242559983e-01 3.001067265869181711e-01 5.125664416448731942e-01 2.310720765955631972e-01 3.554592833978510447e-01 2.476757828517334170e-01 2.568788920972817080e-01 1.700681483160276786e-01
3.302669644857785490e-03 1.689855901251495398e-03 1.374902935891018875e-03 2.563558375038081823e-03 2.702759204131557035e-03 4.540943322376101987e-01 3.541649417765879628e-03 3.171783504860678938e-03 2.017398566368230339e-01 1.463223121080117761e-01 5.486679664588829664e-02 1.272880278888911532e-01 3.220207732202209905e-01 2.981390608394605124e-01 2.155678759616187073e-02 1.626167012787290561e-02 1.982924027938355038e-01 2.374135268181798430e-01 1.085378405124327039e-01 4.826959735064036139e-02 4.690716447712917070e-02 7.318736946935613941e-02 1.109230688544964316e-01 3.381519171714676419e-01 3.415858347712148468e-01 8.091549655326962798e-02 9.018694127360679658e-02 1.165552924538871549e-01 3.811823918427643676e-01 7.827727935916815871e-02
4.428603002049536462e-03 3.762561355601552315e-03 1.084891807364515891e-03 3.547457434485153105e-03 4.659882967315632715e-03 8.671417881416339929e-03 7.797909425735426517e-03 5.064483863573480127e-01 2.004200570705040041e-01 1.164117243227061893e-01 3.535211837546667346e-02 4.523428585518894651e-02 4.881227468370659406e-02 1.687650622104244769e-01 1.955846925869968167e-01 8.361143112322963478e-02 6.967491406555988143e-02 7.595606979674535131e-02 1.033879743128025275e-01 6.010303509730932636e-02 4.263611281505604728e-02 6.343737944459745814e-02 7.207782936708487243e-02 1.203342090565036882e-01 3.756307441951746151e-01 5.932059358269429344e-02 8.642138015936955131e-02 1.420990392021252713e-01 1.721978564551363555e-01 3.430892430503632018e-01
2.369863170666729277e-03 5.806057527377875629e-03 1.660996987213814689e-03 1.715427383132300029e-03 8.069867295078516842e-03 8.412768421401308969e-03 7.823762296116028997e-03 3.533214488703778633e-01 2.728460181911998017e-01 2.549280703319082297e-01 1.047593324398190390e-01 5.289475037642635963e-02 3.189631316787470278e-02 5.038702290640284520e-02 2.317862551659817805e-01 6.125323234496441588e-02 1.660923016761519377e-01 1.435966154669173628e-02 2.871726815067835240e-02 2.309301980285103639e-01 5.961479834285056401e-02 8.338640393722915323e-02 7.255037549047504974e-02 7.980125337579380140e-02 1.060486671948584481e-01 8.146207409055118698e-02 9.626145442451697343e-02 1.189662454915283163e-01 1.608284647628220598e-01 3.961383583580432299e-01
