3.262903134152676521e-01 4.668942772192661295e-01 3.914601675808446202e-01 4.839012419494687078e-01 3.366544304068542770e-01 5.279691913083535415e-02 3.895981422336750738e-02 1.051477677443559688e-01 1.908288884779369421e-01 8.526178674994827622e-02 5.324876240511394049e-02 1.943376846266542946e-01 1.284161299260070666e-01 4.681161810115810340e-01 5.692338085846468387e-02 1.309744528177216316e-01 5.482611823454890398e-01 3.891452107477741396e-02 2.940691702699192722e-02 4.199247317567184612e-01 3.902925107862175724e-01 5.931570158174709340e-02 4.557059731533510266e-02 1.820152550147245418e-01 3.539690821656714670e-01 2.795504760659629495e-01 1.295917794971183645e-01 1.142108448741448005e-02 1.090977640452268395e-02 1.372411006060562759e-02
2.150234471932160885e-01 4.552838082068608183e-01 1.351537783803740400e-01 8.524931689607685714e-02 4.082560905542019780e-01 1.649735786289927564e-01 6.676876456522309877e-02 8.310133525702045887e-02 4.999658913077748706e-02 3.915633188686741539e-02 3.567602733449150298e-02 9.905504849011731450e-02 1.494975431875945338e-01 3.572284586962908293e-01 5.586755521650667300e-02 3.588831978368077769e-01 2.856144178589160171e-02 7.077936213580662828e-02 4.506447228904501834e-02 1.767477761293625993e-02 2.245586280432811110e-01 5.690728945806989431e-02 1.184296523939569745e-01 1.058605986100697588e-01 9.429254526559746608e-02 1.278850523888509227e-01 4.551499212037230652e-02 1.157836984432927471e-02 1.647865306901215993e-02 1.647339513639490410e-02
1.885059124955578425e-01 1.913580837511021093e-01 3.629685486716016651e-01 2.746408789645489734e-01 6.311810431860587212e-01 9.761867115850914045e-02 1.795704574838097589e-01 1.881853834160610861e-01 2.326812570265569258e-01 5.469589896190513167e-02 1.428989578162479790e-01 1.034136173018995047e-01 4.793885186734794801e-02 8.379327423077227721e-02 2.187568599226817345e-01 6.953276628331966913e-02 3.770560107747624595e-02 5.604487431201694153e-02 1.750122440861121842e-01 3.668696010994551560e-02 1.412723275888536079e-01 4.711182884519938413e-02 7.193929792920164545e-02 2.502951343763332864e-02 1.498109625263195285e-02 1.002185903275945415e-02 9.093299377246278486e-03 7.142885632078711279e-03 1.217908941075946175e-02 1.364993251908893854e-02
6.614271939491950247e-02 1.935704325376677859e-01 4.242084406651275841e-01 3.441527852356121020e-01 1.700336110466820760e-01 3.646322063742278297e-01 3.624274515935586582e-01 2.253171960916401373e-01 1.224937636634319815e-01 6.966431458957207667e-02 4.099203160826697667e-02 9.304527138719285995e-02 6.241854708048542866e-02 6.221970442871565393e-02 1.706823760304842785e-01 1.471798812625340069e-01 3.141192523678642545e-01 2.207040403664489378e-02 1.462131220088096380e-02 4.600069157380610729e-01 2.535746128586447989e-01 1.007682208791828987e-01 3.386881777923408943e-02 6.684491415824468652e-02 1.230699960977725375e-02 8.886374257253590661e-03 7.721468075501074571e-03 7.315869973970257761e-03 1.482648034318877206e-02 1.608250030775794023e-02
3.800389994831678692e-02 1.199539169183055504e-01 3.352401717847743323e-01 1.302715975072901433e-01 9.690904696500922400e-02 2.122303704193941876e-01 3.707219265421647370e-01 2.093463220033572603e-01 7.740073884175106833e-02 1.651740184288175983e-01 1.835712043861940090e-01 1.951941309902595623e-01 4.135133039043092928e-01 4.281259347849663000e-01 2.252812605448906713e-01 9.349310761170934181e-02 8.259808301088630844e-02 4.114601911916341420e-02 4.110907054547488504e-02 2.552955798661804207e-02 4.147379480828126685e-01 1.314206980864077445e-01 3.348196844237338321e-01 1.105907842176818701e-01 2.234480374375501580e-02 1.191319539130822856e-02 8.336505910807819053e-03 9.612054321970481610e-03 1.498297903506695498e-02 5.491882906865587499e-02
5.244625594826900911e-02 5.654449574697673758e-02 2.172042010462892636e-01 1.774199894802786504e-01 7.952074005809232904e-02 1.200384779583057726e-01 1.526832539728021076e-01 1.635846235681356065e-01 1.335758833073851515e-01 2.462714843623545480e-01 1.983216728766440395e-01 1.397278183884069769e-01 1.940943968556519961e-01 7.338388470911157146e-02 6.201787765010231129e-02 1.091902425358790424e-01 5.848062356512031545e-01 1.465073970980771134e-01 4.525337983595770774e-01 7.747676862562179190e-02 9.076027988636900523e-02 7.729577051839060797e-02 4.148075197681312942e-01 6.486660486469579545e-02 3.349813667200268741e-02 3.126513373114607475e-02 1.958587369969076730e-02 1.345477060694449251e-02 1.769049718734697074e-02 3.165631089287042343e-02
1.166803899905537040e-01 1.781445502933153846e-01 1.763890739111531603e-01 8.436348027764198343e-02 3.957247296066228603e-01 5.167577116116499336e-02 8.097539723088667540e-02 4.605462854203964951e-02 6.071407016731778655e-02 6.716159831094038746e-02 6.620479497361997367e-02 2.358779086621617949e-01 1.090474512970262266e-01 5.107724788470459354e-02 3.032651981868756189e-02 5.638995733545132394e-02 3.209772308469770463e-01 1.437486600614037990e-01 3.571282204450786091e-02 5.227113556008478046e-02 4.692423173290118377e-01 1.332545660394565679e-01 6.156315038666360095e-02 5.880283351099436367e-02 2.276247833806368387e-02 2.336982182831659483e-02 2.079627668485564684e-02 1.799422924505780438e-02 2.079168531847506302e-02 4.883160233242352793e-02
2.436409924999977661e-01 4.524270042913536849e-01 2.450520014048306328e-01 4.842900881670278435e-01 6.548949096962983218e-02 5.925922521983117974e-02 6.138252770414483889e-02 7.641758024993453025e-02 9.341436318129958671e-02 3.491348011918951055e-01 1.438218757728366715e-01 4.352968576297036596e-01 9.335152685647647719e-02 3.271758195994026175e-02 3.741369979168439330e-02 7.263781161789766017e-02 5.556332306787838959e-01 7.561356821738983436e-02 3.650374675281380099e-02 3.164780079438719862e-02 1.849435752093703256e-01 1.088296771514788014e-01 4.328711795575146404e-02 3.612625393566155918e-02 1.722486114152236431e-02 1.815891177213495994e-02 2.953673667162259875e-02 3.792227770053219899e-02 3.706392065579020012e-02 1.058926878457991522e-01
5.641409426977713748e-01 3.637824285125084156e-01 2.061859796301723780e-01 1.172628921908861477e-01 6.616388692344007949e-02 2.981283076807491050e-01 1.179607872131864521e-01 5.016579272841680259e-01 4.883707346892049994e-01 4.922997968724158180e-01 4.443449733812292468e-01 5.540865315751414277e-01 1.131463020311961193e-01 4.631791422423845589e-02 1.172343121593576731e-01 1.024549969416472806e-01 4.108400725916515062e-01 9.540795766808846112e-02 6.650787502057460554e-02 2.408335348820144495e-01 4.796594826199138822e-02 4.990717787491776025e-02 5.412043902116971117e-02 3.530829046688322564e-02 2.070907701000391371e-02 3.178273963239140742e-02 1.264264189587735454e-01 2.513249026222209026e-01 7.073424236860775816e-01 3.409146223838428469e-01
1.366202213686727729e-01 9.091638850039868158e-02 9.574398482039528369e-02 5.625329690778441138e-02 5.409504191716095478e-02 1.398622353181183109e-01 9.610523388777705844e-02 3.382742664349945860e-01 1.666710826519182120e-01 5.949201002849315023e-02 1.023127924248417586e-01 6.632576997980323130e-02 1.004923011027831353e-01 8.471497443876582767e-02 4.122105376706309415e-02 4.819266793094303947e-02 2.444211005723561092e-01 2.641677767244280384e-01 1.125339279652174396e-01 6.125827052976960674e-02 6.070532589522463496e-02 3.829977202382559009e-02 4.384477758547120074e-02 4.815392927582035076e-02 2.692816263638205670e-02 3.460346718528369697e-02 3.349603216416694451e-01 5.641106855308593016e-01 6.872177176295538592e-01 1.769133965858941671e-01
7.161844638809961028e-02 3.401095284818287379e-01 6.439502570532773529e-02 4.226048798755759062e-02 7.222143400408247149e-02 8.688027109655592495e-02 8.623940845790192822e-02 7.980100493231485903e-02 5.574100187341205631e-02 4.363036035011489955e-01 3.311478499133280184e-01 4.857052450809317135e-01 9.903346857919832491e-01 4.783134311995594912e-01 8.640317856673915276e-02 1.673700044059850955e-01 3.133949425930478982e-01 9.386259133021081225e-02 4.080203831673958614e-01 9.934144916073839315e-02 4.151249645630845919e-02 3.697990823445800740e-02 4.764080268649370509e-02 6.663848592096122125e-02 7.128498275083250402e-02 3.889742116584105763e-02 6.279892071952594690e-02 4.928084392590791063e-02 4.363943983140442656e-02 3.102643643837832421e-02
1.520239924980517632e-01 8.354521050150312544e-02 1.197642270889670152e-01 1.162823743444367230e-01 9.404406539086906935e-02 1.416790817854421403e-01 6.590373667675909763e-02 4.580517969128362898e-02 5.623497123617068882e-02 6.433235094562143874e-02 1.262595773479245065e-01 5.812398246043570804e-01 1.015073847652103067e+00 5.167634575570350108e-01 1.828534299364331928e-01 2.033223130753059604e-01 2.246068132324047506e-01 1.436631281041129693e-01 4.581664039665121063e-02 2.261339698637980788e-01 3.964343657237311136e-02 4.015035471682777690e-02 4.737180929688340758e-02 8.466697160196232086e-02 8.043826967840354836e-02 5.733352521555561132e-02 4.411136630621072946e-02 4.000619354747127210e-02 4.354859624143777447e-02 4.713845442338034097e-02
3.627966277623877189e-02 8.767595881820232362e-02 2.008879130251575718e-01 5.422020111711356449e-01 3.616620322204512350e-01 1.197795361128125985e-01 6.600881308688680282e-02 5.733976218069572472e-02 7.545548395493564819e-02 5.127313376134324807e-01 1.425916274232190695e-01 1.875455961070959798e-01 7.473339439736099710e-01 3.158858370915859082e-01 9.789140036943985712e-02 1.118675120560225777e-01 4.119554862532494310e-02 6.036815438830368807e-02 8.306374286469196677e-02 4.754791600461042433e-01 3.779314116866370338e-02 4.126367568000010450e-02 5.217178785842145616e-02 8.663744750002400075e-02 1.096808921546646720e-01 9.577972852591523645e-02 7.056478786829251115e-02 6.631730115834208461e-02 5.826792976929584533e-02 4.853769147399385891e-02
3.153304546061674180e-02 8.939642189273651340e-02 1.574925675959678029e-01 1.125301026419666672e-01 6.638598312830479298e-02 2.567595523829355741e-01 9.143123151816251459e-02 5.000081220424026918e-02 1.042054564632684255e-01 3.384307726222173657e-02 1.194016237127387414e-01 3.259454110107393859e-02 3.380994395542837316e-01 4.517252874291826092e-01 4.762069233016773540e-01 6.365364971526286109e-01 5.702634697639999972e-01 3.693234351636304202e-01 1.048642615908942144e+00 4.907804712712292572e-01 5.091878146239396663e-02 2.447193437915033964e-01 1.841656503053210325e-01 4.380150959637464370e-01 7.263336305033615825e-02 5.397332977978357149e-02 1.381808873185128572e-01 5.238678443839674820e-02 7.859936624377383829e-02 9.131193680251292744e-02
2.930264773249316446e-02 2.930636283798174896e-02 7.932052548018381222e-02 5.915444074131227525e-01 2.154187470775125179e-01 4.821073521914001625e-02 5.625600797086305338e-01 9.541687203234748560e-02 4.979595233461577009e-02 1.251069035041690869e-01 2.556805001133192201e-01 1.606727734443982869e-01 3.038213030132898562e-01 3.815396956754728564e-01 3.411952246280904322e-01 4.085001077999892427e-01 6.938550631547688585e-01 1.195644269005168292e+00 1.213378887942611062e+00 9.492320703847980656e-01 4.753091072339140494e-02 5.505128497617364086e-02 5.442737955848837850e-02 1.489490950062781205e-01 1.940905292856432152e-01 8.626866013294943736e-01 8.601576821532648243e-01 1.893743458119285239e-01 8.109726680462356341e-02 6.231248200168473805e-02
2.665820960628518047e-02 2.887192691318410387e-02 6.460610945904181335e-02 7.166791717324619282e-02 4.818551531907873386e-02 5.084008967678876889e-02 2.834112055839310695e-01 4.710883021320828867e-02 7.432427347911263471e-02 2.864752591159636444e-02 2.955633539129830234e-02 2.426485937362959228e-02 1.735049919593908418e-01 3.474895628482965182e-01 3.206693797628051290e-01 4.866696451660628142e-01 8.387248907596860370e-01 1.015282522608957017e+00 5.842815164425252394e-01 1.267771545015783929e-01 7.598085413798622012e-02 5.214033523775297718e-01 7.605975313256422288e-01 1.277303720169875589e+00 1.206081671185865511e+00 1.582280234023608401e+00 1.270540512306676195e+00 3.828363643871527389e-01 1.191196000387237802e-01 7.000361855886304274e-02
3.384769251531223599e-02 3.877449792935984407e-02 3.779203885100949900e-02 3.551109648279152098e-02 5.132845153961004825e-02 8.639699287042455766e-02 2.131773537074584945e-01 6.825075752301017484e-01 3.215623170040033951e-01 5.478264820836442617e-02 4.051865857233832163e-02 6.333020766784451527e-02 1.248142921659146920e-01 1.820403516391010390e-01 2.381694243494907048e-01 4.235822278517223372e-01 9.077629746178479397e-01 9.082105626075618332e-01 4.275847338271635545e-01 1.461140322642067446e-01 6.295058184133509593e-01 1.141670636944440709e+00 1.464149961001278477e+00 1.508420907388843490e+00 1.338858138910409945e+00 1.168865051532292254e+00 1.744696085326477464e+00 3.136035540606686989e-01 1.645509768529032357e-01 8.905247847888082824e-02
8.418875776512736719e-02 6.553406491948687851e-02 3.189728051520011876e-02 4.466275036998501591e-02 2.491099868748174184e-02 1.022413082506843651e-01 5.456091190851657391e-01 4.409085146619849960e-01 4.319525602326335090e-01 2.156138334182965410e-01 8.368345577038802108e-02 2.592573619475032828e-02 2.519436688170405628e-02 5.987690135353589821e-02 1.180590143903630096e-01 5.385764988807577591e-01 5.609027009358180660e-01 6.604172546935946908e-01 1.142738415968170967e-01 2.006137283570052776e-01 6.965310222349236913e-01 1.503794035660761974e+00 1.849763083659164087e+00 1.926945599865358849e+00 1.607175604004281277e+00 1.576636975254050110e+00 1.490074689939266506e+00 1.192017962324334324e+00 1.202719657253897151e-01 6.934223987752268226e-01
3.357080297147326670e-02 9.150491755437237251e-02 1.587041202421849428e-01 4.251419420162429186e-02 7.943209428791056514e-02 1.096102249421638114e-01 3.455368235017960421e-01 4.317169312810568704e-01 2.954259745564267181e-01 2.495056365812496346e-01 6.020761175720740210e-02 1.720092234939481768e-01 2.621582136741337221e-01 3.386606182423922834e-02 5.438620517645896546e-02 2.552694794191099348e-01 1.055249846814215742e-01 3.403231760317661225e-02 1.906359414365345062e-01 7.416707981180341303e-02 2.768369641178419771e-01 1.473823383496209338e+00 1.862768884690252591e+00 1.948549385598695949e+00 1.425738426420528615e+00 6.658228213946001395e-01 1.088768347009221538e+00 7.417794422692672862e-01 1.657985108752617620e-01 5.015865259904740414e-01
2.951392225423364254e-02 4.115080124606293466e-02 2.632695469138299216e-02 2.944678583197493649e-02 6.153178033796687096e-02 3.531213394172789954e-02 1.815274453043936309e-01 2.344605230295238318e-01 2.155597591418848824e-01 6.141899628300247216e-02 4.638103817385261785e-01 1.192493537659218839e-01 2.060474547052318639e-01 5.002389137294236399e-01 7.701279077568912168e-02 3.953890720804374009e-02 7.714151748835099132e-02 4.678753618565758554e-01 4.088891580571489548e-02 1.740837992932323386e-01 9.214532680477738324e-01 1.743706933394884473e+00 1.870021118995330411e+00 1.765899308127218958e+00 1.349836599070229681e+00 9.864060320861469666e-01 9.552391962057522612e-01 6.665262381542887971e-01 1.326994203119938875e-01 3.845664302058170447e-01
7.202338588224467542e-02 7.095863037509032856e-02 4.073425526992609236e-02 3.252126501347823995e-02 4.288003871107060050e-02 2.017808775588969192e-02 1.050124493828892835e-01 8.963434409989289031e-02 2.507082066376501578e-02 1.725933894607135227e-02 2.038204519925770342e-01 1.811422241618108886e-01 1.016551391655455688e-01 4.694106428788039770e-02 1.004765435082600883e-01 2.910064730356311524e-01 4.367411878503316136e-02 9.468585767350104487e-02 8.920479069685861850e-02 3.593601149269631811e-01 9.814177880697481093e-01 1.446170122879073983e+00 5.863643340542050719e-01 8.709266756101959883e-01 1.091190095612580624e+00 6.118313008524896013e-01 4.839317724160915879e-01 4.222133834013940268e-01 2.152671000067583884e-01 2.340821897198053225e-01
5.842164482706316275e-02 8.055737704219229078e-02 3.242779052518225957e-01 2.770188283648665206e-01 2.565620483336537583e-01 3.717134666585676372e-01 1.819367550440920828e-02 1.321775791997089333e-01 1.843651088593792065e-01 3.182365327504356467e-02 4.700154859820664804e-02 7.538211428107738366e-02 7.188312598654106322e-02 2.245519972048800883e-01 2.627555539056915940e-02 2.136485396183857854e-01 3.918124819281741944e-01 5.410991216495418810e-01 3.639987709119199000e-01 2.709827412422044501e-01 1.913003331057437084e-01 6.973625273865512175e-02 4.068562797561494637e-01 5.795517252110447132e-02 2.024679716298548593e-01 7.835304437676011979e-02 8.523587910225209618e-02 3.113989781400476886e-01 4.020960869702636109e-02 3.752113470547104729e-02
1.216054277063811639e-01 1.195430417939580825e-01 3.650846072977391166e-01 2.148437486574378830e-01 3.609495840687642620e-01 2.798100224008425174e-01 4.376504824210822875e-01 4.822767508334759035e-02 4.400442448057932665e-02 1.902650492397352233e-02 4.712274519681483587e-02 8.701434138879363123e-02 9.447249537288582300e-02 4.349281769524878660e-01 3.398486065703135162e-02 1.169270970979605501e-01 4.212407002913209908e-01 7.731419591957492399e-01 8.630708079369155961e-01 7.407793304279067792e-01 1.676742828151746578e-01 4.561638804820643961e-02 6.534627484405657050e-02 1.451958042709346752e-01 2.754429971557641466e-01 8.052542658554293076e-02 3.629918313751654413e-01 1.483210367985421940e-01 5.533277271207077269e-02 5.305400676810852201e-02
1.510106142395710727e-01 2.581283926047721333e-02 2.052907998503839537e-01 8.920606262145049092e-02 1.139595979155712258e-01 2.592861155631524528e-01 3.471015819506573230e-01 4.025745164961516687e-02 2.170684249675783328e-02 2.472434490844108157e-02 4.488159563960271436e-02 7.658092177637526587e-02 7.101508293662268934e-02 3.385583060570896419e-01 6.274427259254959643e-02 1.851091977128450361e-01 3.141414160518636312e-01 7.129193415018821867e-01 8.877938793087257752e-01 7.487974851988200564e-01 4.443378049744870495e-01 4.157428742081445416e-01 2.864074940078621956e-01 5.128719286124558963e-01 2.959128317270187658e-01 1.635347636713055663e-01 1.454024809292027709e-01 2.567699350550136650e-01 4.476477764051216279e-02 4.037336196045065301e-02
9.212184046757143641e-02 3.881274916973365824e-02 4.434488082913739526e-01 4.803973620412761436e-01 3.451162982202544971e-02 2.442391875057365117e-02 3.579605485350372263e-01 1.516393461802752474e-01 2.210144046367464032e-01 2.819317420011822062e-01 2.639057272226023182e-02 3.169302279135734202e-02 4.166732574474191209e-02 8.066431179758970504e-02 4.037530011792457296e-01 8.157288177352366165e-02 5.813645258997596210e-02 2.510708775516188318e-01 3.067586641154627647e-01 2.560656812146677730e-01 2.719803473291129148e-01 5.263362680704584129e-01 8.404261853291868090e-02 1.374828777639865995e-01 5.565467538798547498e-01 1.394593950881540256e-01 3.173695318142347732e-01 2.507877622314115262e-01 5.260078136838160917e-02 4.578694264705261696e-02
3.333405777950305959e-02 4.475893545035664056e-01 5.751360378691473541e-01 4.658420172691846856e-02 6.467752343331715226e-01 3.039742660703200205e-01 1.447596887306273894e-01 1.055301240987539246e-01 3.301171058584827511e-01 3.150748541185315055e-02 8.665234436221616598e-02 3.211583314864105421e-02 4.754431315330828051e-02 8.799679681586186630e-02 3.647937757767940048e-01 5.700418194571794245e-02 3.751184345001764564e-01 1.735321283608918519e-01 2.507200910327025412e-01 4.229058151375224561e-01 6.361249243721614488e-02 1.750334241642218513e-01 9.041615875232586474e-02 4.211401573428044109e-01 2.842345629850657196e-01 2.970166194993146269e-01 1.761299793790994106e-01 2.623850516544560252e-01 4.303705770714026935e-01 7.309292217463041197e-02
3.428840560763675438e-02 3.799016999037667375e-02 5.521343575708441698e-01 4.528418700111359607e-01 4.540150542860051375e-01 1.796870532030126200e-01 1.191753704257752372e-01 1.242185060872994101e-01 1.383101297775292671e-01 5.474442254779302575e-01 1.604720006280834499e-01 1.609555888912463095e-01 1.294902411185195890e-01 1.317882535659473109e-01 3.508790767057576865e-01 2.372319565284286558e-01 1.635869994787359505e-01 9.791878317358504447e-02 8.468896079587541481e-02 6.344382806296000599e-02 5.091396429341703278e-02 7.457685327342382375e-02 1.141626191363752096e-01 2.667318742336673987e-01 4.564309164766955917e-01 2.059571619009762933e-01 3.158998560109694265e-01 2.180699273598596388e-01 2.246628836989122413e-01 1.478876279847871622e-01
4.107014602011836713e-02 2.814222095759241413e-02 5.532882281188264972e-01 2.678324706391584792e-02 1.897388893945442176e-02 4.348662251812664969e-01 3.056637599499240077e-02 2.385581628745830213e-02 1.904402816922858566e-01 1.378327281433068818e-01 5.164804436689651723e-02 1.200851611971117255e-01 3.017146129405497978e-01 2.781269370637209914e-01 1.205315840038709285e-01 5.850282791717584807e-01 1.853811745932303634e-01 2.118046412331257844e-01 9.568794937426799985e-02 4.238779538846065842e-02 4.119608941082195802e-02 6.438277217211867132e-02 9.773850864014044237e-02 2.984728336274252158e-01 3.023705092363667690e-01 7.176875821852109205e-02 7.992533008817225004e-02 1.024802959216153386e-01 3.328406044279181852e-01 6.799208314970542344e-02
5.519254044067016529e-02 5.571076582011979389e-02 6.297356647928092910e-01 5.927592816891104344e-02 5.936687965355512409e-02 1.117619270029308609e-01 7.890028579794837460e-02 4.812921863374460263e-01 1.893706357042307664e-01 1.097153547958735764e-01 3.327856825810459468e-02 4.267385548192721700e-02 4.575962011095881937e-02 1.566604483904926737e-01 1.860577373592352257e-01 7.837232964178761363e-02 6.484462006644164944e-02 6.767767222395223992e-02 9.115863359154682821e-02 5.275313176182909458e-02 3.736263176700031774e-02 5.559238915343871212e-02 6.317063358182631316e-02 1.057494856383611459e-01 3.314040319884853925e-01 5.248726389139876658e-02 7.648936718322028872e-02 1.248355015449854610e-01 1.501977681200792336e-01 2.977353751555810724e-01
3.003100948806474921e-02 8.066494739978791184e-02 2.419222813177891729e-02 2.630381099649490087e-02 1.173806180412696326e-01 1.246153464139314881e-01 8.810661165838515330e-02 3.391572940602881059e-01 2.611857929846914117e-01 2.431828832193871359e-01 9.958903668153451516e-02 5.017272627906224636e-02 3.010873342906095901e-02 4.727106927070026665e-02 2.145734590768692274e-01 5.586319638576402180e-02 1.490851588198915390e-01 7.155675753160155306e-02 1.316646767157669817e-01 2.020348181539931287e-01 5.209447518811984035e-02 7.286943621698420415e-02 6.341026508186096977e-02 6.991206229293102370e-02 9.319228073025317971e-02 7.174445933452304469e-02 8.479741115406910779e-02 1.042101093329313166e-01 1.399756335502474469e-01 3.433743546394073531e-01
