8.780121034310046230e-03 1.297956211805970442e-02 1.135632820853230140e-02 1.439557567679326626e-02 1.097459998079930096e-02 2.411614062121121213e-02 2.395636470785930672e-02 6.493286011847537731e-02 1.179374983000121280e-01 5.296240332835674969e-02 2.446363433637394752e-02 5.564290448533720963e-03 3.251331218222275853e-03 1.204864328789556453e-02 1.390453234524899155e-02 3.022904057811429991e-03 1.051724564845912466e-02 1.819828924984085231e-02 1.626573397331598086e-02 5.655056662877932551e-03 5.034546622965277440e-03 5.999121330695256216e-02 4.690394803259868156e-02 2.090476361971509590e-03 3.604829304629533770e-03 2.831635256035162571e-03 1.334739863896464715e-03 1.215410090041431357e-02 1.186448021016339206e-02 1.498290520550563804e-02
7.011125485629007489e-03 1.564196029242442484e-02 2.813758960713049276e-02 2.304735939613487133e-02 1.607736333239338788e-02 7.197943366341090499e-02 3.417599869212219199e-02 4.318798385648581206e-02 2.818409219466092713e-02 2.388530852288704015e-02 1.671337885363125345e-02 3.241705870549993745e-03 4.281767297490718382e-03 9.727833941965632197e-03 1.350858390976338898e-02 8.594167144359517174e-03 1.050523791379117181e-02 3.398395668773616235e-02 2.532303937914432562e-02 7.519105538491312191e-03 2.995787962243172918e-03 5.712585897021402181e-02 1.706660621605962918e-03 1.258550304073035404e-03 9.111718446492247025e-04 1.204288814394003813e-03 4.625356643418944425e-02 1.232138724596371429e-02 1.794947191610604328e-02 1.799705336762085633e-02
8.605384727351650387e-02 8.830666244687539190e-02 1.866992885797689461e-01 1.519501689356126395e-01 3.222175155276892911e-01 3.279004951354765052e-02 6.084548259543034153e-03 6.531845861348059383e-03 1.050099256564189926e-01 3.158591457196741059e-02 8.351215147229582025e-02 5.492275373246167242e-02 2.004531611088965909e-02 2.917689845113814739e-02 5.563719846588056558e-03 2.324083634450552910e-02 1.543797109346154578e-02 3.123955635306636253e-02 1.026987148121622229e-01 1.685626325762235034e-02 1.704950259650328363e-03 4.681194218094207604e-02 7.409000546146370103e-02 2.602638348564272758e-02 1.560620316955607483e-02 1.054401216513060555e-02 9.677823665874480882e-03 7.771495000153147252e-03 1.328755417001390750e-02 1.492098770605219601e-02
4.008324664206348170e-02 1.154781803588698780e-01 2.535141642746906454e-01 2.048672636801079916e-01 8.348766428697472486e-02 1.289673007485170678e-02 1.019899285581640606e-02 6.883984734042614996e-03 4.232756895531429239e-03 3.926277672362085691e-02 2.493285168295739790e-02 4.891996893179186706e-02 2.198528092652818344e-02 1.453438713427892236e-02 4.252703501826517012e-03 3.210923711681053574e-03 6.630394130936955246e-03 1.224815391527192023e-02 8.559529655082409941e-03 7.201638481134570342e-03 3.279892223378343564e-03 1.215335938345508612e-03 3.318039705815306606e-02 6.639652655417510596e-02 1.286557777531749901e-02 9.608528526657991384e-03 8.356356016235917672e-03 7.941368252862516380e-03 1.614628777532194082e-02 1.756350123681804654e-02
2.309234171830525095e-02 7.179060904273813770e-02 2.005025338217061581e-01 7.771351859406869234e-02 4.405513407342150772e-02 6.428835199768177626e-03 9.886627152306126307e-03 5.527823802859517001e-03 2.586891039069188873e-03 8.968752267578820880e-02 1.118198365341231126e-01 9.355704872221567991e-02 1.368019398699401104e-02 1.320534529075593697e-02 6.216914041261094835e-03 2.328242152511191508e-03 2.012987113762472122e-02 1.144362137839925568e-02 1.817587411554603266e-02 1.031607258634773330e-02 7.002277603215518662e-03 1.951617877826218725e-03 4.738917833355440687e-03 1.432471141304397051e-03 2.332299665992709423e-02 1.281650940193280151e-02 8.957324936583872105e-03 1.037436253178425534e-02 1.624863076419638327e-02 5.982619073497400658e-02
2.296418685228693995e-02 2.398955283386310089e-02 1.075907859906481134e-01 8.620891302457633909e-02 3.398338996270362095e-02 3.663546432810371473e-03 4.506083613919570699e-03 4.867070821495342488e-03 4.626149605322682143e-03 1.390226589345882613e-01 1.083135545846761194e-01 5.597977842116213382e-02 7.769034379596830714e-03 3.104934597669668263e-03 5.763805839358208949e-02 3.463104288134078064e-03 1.271360544255512905e-02 2.967119122766091396e-03 9.531147299205764561e-03 3.263252606606925621e-02 3.908329521083957203e-02 2.409462214617606735e-02 6.983095586602637052e-03 6.316788293286823563e-02 3.495776549524685223e-02 3.345512730046678457e-02 2.087628812970472245e-02 1.440514140251847146e-02 1.900017088283940600e-02 3.421199227486455829e-02
3.176594077909814049e-03 5.010540478572911294e-03 5.300305636776603616e-03 2.688216893058941945e-02 1.287603574285946760e-02 2.153909969126887453e-02 3.307352881019778867e-02 1.907948108299080056e-02 2.300846355565963966e-02 2.654639827885378611e-02 2.027124284964802736e-02 8.223222588266755270e-03 4.327272316609748898e-03 4.987043276348557957e-02 2.933460242770265930e-02 5.078626788658353874e-02 7.252930165505047481e-03 3.114540698443305639e-03 1.586404779304520160e-02 2.162320848625315720e-02 9.807754772661244139e-03 2.791565791276081308e-03 6.225660682575052951e-02 5.990634505617680600e-02 2.419799207643994962e-02 2.477581851833491125e-02 2.166837470887574002e-02 1.870832426590817929e-02 2.088235655366454252e-02 4.977554214886033973e-02
6.813669898192299679e-03 1.242905726011558909e-02 7.270415373171756207e-03 1.567302774175480945e-02 2.410712404414925430e-02 2.737267922895679495e-02 2.457447565966144887e-02 2.347599058404750347e-02 1.895431143224518208e-02 1.051878953573744460e-02 4.198482699634431894e-03 1.288772594566021425e-02 3.570656966289347325e-03 3.287056924110439565e-02 3.749621749555648309e-02 2.329484172407454787e-03 1.450916283285898917e-02 2.126926084933673453e-02 1.864591281900161365e-02 1.403687325489649459e-02 4.715894491391059776e-03 3.424378375273348912e-03 4.444349799685876762e-02 3.839697543184913964e-02 1.832827701249761798e-02 1.840516716551144835e-02 2.728743540527011485e-02 3.166078629273433309e-02 3.073258157786992392e-02 1.498703949793045095e-03
1.809889478280722608e-02 1.189999799539536059e-02 6.942013884389364176e-03 4.020751716445633561e-02 2.599632911698094781e-02 1.107875933654107505e-02 3.598876704600359466e-02 1.634521620872931777e-02 1.396577485404226077e-02 1.368213782653243324e-02 1.213040103517524886e-02 1.565138726030286184e-02 3.557733848981883135e-02 2.516469534328094615e-02 3.727370885033989920e-03 3.213950174450350139e-03 1.282480741379358156e-02 3.912005828365974075e-02 3.846908772264838461e-02 7.504258661893586577e-03 4.928245873824618761e-02 5.135266766673172306e-02 5.634966136667510228e-02 3.738952207634690245e-02 2.187351716121742340e-02 3.005062655099922236e-02 1.589335662354583604e-03 2.770288028187401289e-03 8.151988910445960579e-03 4.112416480177913738e-03
3.031087414680717559e-02 1.988571380619019377e-02 3.139757684823372974e-02 2.933846097976142153e-02 2.548108294575676669e-02 5.046005325954354762e-03 2.343716882935533569e-02 1.072394038066983198e-02 4.605870595090742932e-03 5.381136331531257561e-02 2.336818033822857590e-02 2.241566751263609006e-02 4.719431480883078123e-02 5.064271452185449551e-02 2.387525344015594200e-02 2.606834756008087964e-02 1.400993781675046734e-01 1.452705502220917599e-01 5.794956216453298059e-02 3.267206957563477399e-02 6.393293569038496771e-02 4.044639907963247516e-02 4.589363788928844251e-02 4.978875565349746846e-02 2.757358678240159899e-02 3.300156205339823540e-02 5.708752418065739243e-03 8.195420895003149853e-03 1.039639649756468609e-02 2.695417467529104705e-03
2.528894408998998838e-02 1.337005284622825793e-02 2.954039034005058115e-02 2.515885413758462558e-02 3.152282832263664236e-02 3.618052432559127479e-03 3.685063041619916421e-03 3.566323253317472616e-03 5.347184926526206417e-02 1.362616955234937158e-02 1.858134413819248765e-01 3.058914740646870856e-01 6.295549470418904114e-01 3.079832985272722423e-01 5.629001949011388367e-02 1.100093442527725618e-01 2.049458617056434950e-01 5.652922221666072111e-02 1.338044031112569504e-02 3.549734743818472663e-03 4.355763792841550047e-02 3.899016997399817885e-02 4.858461060779867974e-02 6.556943038722899686e-02 6.881412056580639425e-02 3.725022677498001505e-02 5.843568330713628384e-02 4.436868476765057356e-02 4.056437760804569581e-02 2.990739091355850560e-02
5.796425862195610929e-03 3.372215736518556668e-03 2.423728286320754599e-02 2.384149051738735509e-02 1.834959398691983490e-02 5.278994652393457360e-03 6.403314582722138826e-02 4.540412409947672950e-02 5.538176221256012333e-02 2.632054430041467358e-02 5.535680500803691340e-02 3.639796610187476800e-01 6.504116064124093599e-01 3.335092553457555398e-01 1.188313731056550027e-01 1.328704382963868946e-01 1.465327055719634619e-01 8.615271872901753003e-02 2.107296802375692446e-02 7.379580689389850928e-03 4.141299418551971923e-02 4.222513097990276271e-02 4.785971864153200361e-02 4.711209900459048527e-03 3.410057738243966585e-03 5.695025252434370022e-02 4.598306288193117208e-02 4.224681263447321866e-02 4.606212736169634087e-02 5.003178798863806842e-02
3.320193456148490263e-02 3.859234886834525969e-03 5.631567051347769436e-03 1.726729891657654767e-02 1.122161780858270917e-02 4.439780929312935574e-03 2.702546867313544883e-03 5.821608175136569474e-02 2.470708978543187731e-03 1.268742520260484133e-02 3.884011055212231635e-03 1.149918621366112781e-01 4.820553008206941437e-01 2.041208973528637616e-01 6.336384117973636876e-02 7.248607736998821660e-02 2.671537031354435238e-02 3.914217661222593736e-02 4.447183745337868893e-02 1.851023605066968308e-02 3.921234487668678881e-02 4.274271208882690631e-02 5.159906624556556687e-02 3.088635560947156078e-03 3.221304493327593107e-03 3.496144118572959252e-03 3.158094926411598655e-03 7.113969331157982134e-02 5.972025747796813611e-02 4.942248703560990497e-02
2.918056473997295702e-02 5.580931185885502216e-03 4.816382300765783067e-03 2.987284772910890444e-03 4.978295621495223977e-02 7.163026550921531774e-03 2.402790837796450057e-02 1.919194824851174971e-02 2.529022866712801916e-03 3.371510208075487874e-02 2.847048244217312632e-03 1.863121640446006866e-02 2.191013909504287427e-01 2.920079019883788929e-01 3.068837600940589883e-01 4.086895380740430128e-01 3.674440771875758238e-01 2.388040215723383763e-01 6.531683560653765985e-01 3.065760453517970552e-01 2.737898400675588609e-02 9.081876186170354318e-03 6.695388434660767482e-03 1.538521310552201996e-02 3.174084697230485780e-02 2.987313213064132084e-02 8.625102910894785757e-02 3.175936855609318155e-02 4.390103026097270413e-03 4.409076648512960835e-03
2.797723989936107616e-02 2.656782597918286304e-02 4.195488071480770777e-03 2.345477444044968135e-02 7.303601707555422082e-03 4.164678844678294106e-02 1.503801629844752838e-02 3.975482166901493641e-02 2.743921051239635311e-02 2.814671365066839966e-03 5.978562510981267480e-03 9.212813745259100517e-02 1.952703490845076606e-01 2.449619148990679618e-01 2.186631473641358903e-01 2.611733901274292946e-01 4.456872570410466694e-01 7.718290264882361473e-01 7.873155736771616509e-01 6.194625170240533052e-01 2.648527432344356669e-02 2.768323392482207462e-02 2.475682545949217661e-02 7.805066961391900204e-02 1.129937239011113703e-01 5.813191140440464588e-01 5.819113034226226500e-01 1.152737529535497601e-01 4.475288737508638370e-03 6.309505587640330815e-02
2.667976246075484670e-02 2.790444424332952367e-02 5.458581730850811664e-02 5.641649076297207410e-02 3.703667268784120031e-02 4.468844185250181456e-02 8.178477742098112097e-03 2.130441615324261267e-02 4.400618648051526222e-02 1.566416700496559358e-02 1.614519126094728432e-02 1.416781339055262628e-02 1.101597240841410419e-01 2.211827380814501420e-01 2.044600765071527548e-01 3.105739556626493925e-01 5.381357749989050809e-01 6.553388079582770365e-01 3.794911104361821108e-01 8.293823815484331619e-02 5.011567257568281392e-02 3.465284345102722097e-01 5.089843686824315760e-01 8.575007353108461405e-01 8.102747310714504270e-01 1.062907393475646334e+00 8.530474226631453716e-01 2.405306635200391840e-01 7.116119711528814777e-03 7.329557028033252541e-02
3.459131165333813318e-02 3.898716102417205953e-02 3.668202933283443157e-02 3.338968203817127556e-02 4.890588291145832323e-02 2.570739375348598393e-03 1.255176486769520594e-01 4.129223359922357672e-01 2.011506561412040872e-01 3.430712246276360067e-02 2.537064216507247533e-02 3.960371530449631472e-02 7.824287388655949693e-02 1.148159730768711084e-01 1.509790100288398718e-01 2.696366194140418227e-01 5.815885356344048240e-01 5.861324022671822176e-01 2.779021706915571488e-01 9.576353544166477105e-02 4.168909222930105019e-01 7.634749105072158315e-01 9.884965305104227440e-01 1.018776474110139274e+00 9.005606213099972557e-01 7.822749348264430580e-01 1.161914079597932359e+00 2.004244230077961153e-01 8.497165156613410708e-03 3.788173076307557643e-03
8.662832766781614069e-02 6.709203922057910274e-02 3.242667126440906128e-02 4.582613376249404513e-02 1.470343790575772552e-02 6.247738489772450970e-02 3.361702469752455569e-01 2.750377410536120060e-01 2.698874374160677991e-01 1.344031984211163377e-01 4.896343665561293107e-02 1.317526041503970513e-02 1.287237134900883449e-02 3.300060040163873415e-02 7.439630485392524639e-02 3.420036186345102314e-01 3.589753836571065171e-01 4.178379217056057970e-01 7.281945816867867183e-02 1.291176412716806832e-01 4.629067218343189127e-01 1.011630708812181645e+00 1.259270514876484670e+00 1.308918372009685305e+00 1.082427649551745530e+00 1.051166188234661458e+00 9.842637558690181532e-01 7.725703862980629610e-01 3.403860383115889926e-02 2.220713138503923809e-02
3.478807919785394109e-02 5.839158359349519434e-03 5.887597184729521232e-03 2.432166940015435125e-02 4.974337454242493128e-02 6.815083632766519295e-02 2.148058471943471992e-01 2.681777256567243750e-01 1.833290870524036109e-01 1.420095060031252576e-01 2.966685035806586324e-02 2.904688965721206884e-03 4.422779971941110007e-03 1.252401943425003432e-02 2.737267277024831719e-02 1.620164367686843521e-01 6.151002562542876029e-02 1.954041931524125308e-02 6.533769428881729645e-03 4.750949776250431439e-02 1.822719461926096685e-01 9.777840530328825164e-01 1.245409341279163806e+00 1.308550732262379057e+00 9.597681279806630217e-01 4.487746362192533423e-01 7.336284733053366480e-01 4.983803253878304473e-01 4.470184441669572406e-02 1.739448776380033562e-02
1.684721067080111045e-02 2.146588740112849447e-02 1.332090417882814647e-02 1.642721886149473356e-02 3.828600454973330597e-02 2.189806956193481036e-02 1.122572632886655319e-01 1.444720312746277102e-01 1.323902881701795042e-01 3.113053865667203546e-02 7.807051283472251496e-03 1.652978865224671466e-03 3.042609259030744709e-03 9.011726863879661667e-03 3.590402291445374261e-02 2.363218638246552747e-02 4.279173171494146666e-02 1.253885367404725809e-02 2.340671057143118086e-02 1.109796267459981500e-01 6.009699948621185506e-01 1.141064761592394561e+00 1.228058317486084849e+00 1.173323484503753900e+00 9.088702764749700957e-01 6.722709328854881150e-01 6.567103610254937385e-01 4.385557937119121119e-01 3.929087919549096447e-02 1.382103876677478679e-02
4.508767051179998070e-02 4.093027512720649741e-02 2.077020701780971437e-02 1.475942643642725455e-02 1.889962686756080368e-02 1.005271311239114805e-02 5.679133550149181170e-02 5.040299469114890851e-02 1.402914482007566049e-02 7.997965978159110242e-03 2.799919245617303945e-03 2.194410259561510677e-03 1.331366695751479926e-03 4.547379364130049728e-02 2.029397296368058625e-03 6.864510189182420480e-03 2.433161021547032218e-02 5.488328666819528023e-02 5.231289771374842551e-02 2.324555228380325300e-01 6.346446228633628728e-01 9.168366420017571849e-01 3.719050488688170342e-01 5.626860553825047129e-01 7.355449400487402700e-01 4.215985806136529623e-01 3.173555910104713940e-01 2.652786894716315791e-01 1.227831709162175051e-02 1.158591986509607819e-02
3.664934392369395555e-02 4.179459567644674273e-02 6.070878480076948719e-03 4.143781953825853397e-03 3.354453467410499056e-03 4.954086865191458314e-03 7.189359237324013073e-03 1.851827919512168564e-03 2.517122033693373288e-03 3.288474568980424145e-02 4.536160576417203744e-02 8.564715609309879983e-04 8.957597332471048390e-04 3.321920859145858530e-03 9.727219211474074853e-03 1.275788224656308478e-01 2.424828470569264094e-01 3.468207196215256083e-01 2.343465642619236289e-01 1.748272850944366241e-01 1.232208533142892248e-01 4.377805266989580335e-02 1.689275867622347382e-02 3.699213302016209765e-02 1.357241212682124554e-01 4.641302915910074794e-02 4.292918608712767425e-02 1.920764847407094647e-02 4.376600581610559648e-02 4.118171801373267382e-02
7.668419146686621113e-02 5.851487206335447000e-02 6.201035324999576437e-03 2.648118682910337307e-03 3.849637449734101026e-03 2.975521963704279640e-03 4.808005942282409829e-03 4.819341362409276797e-02 4.527467054015875403e-02 1.974563894599170102e-02 4.600872126557616071e-02 1.018167380802512297e-03 1.145288034425692714e-03 6.498559886609836869e-03 1.126335799334650563e-02 7.414837933858303698e-02 2.689713235939027447e-01 4.962092955141720885e-01 5.563276918428176065e-01 4.785246265133472066e-01 1.013381074449401648e-01 2.252178054477671498e-02 2.795778252845999845e-02 6.973999253225227068e-02 1.567691269200055526e-01 4.668323378235768317e-02 1.780856574950888394e-02 9.538544244262533306e-03 6.044755407288707888e-02 5.869820924108626325e-02
9.541457765540817260e-02 1.206415939288998929e-02 3.260615159830690044e-03 1.061572386631893378e-03 1.199928362039841745e-03 2.606629874491644527e-03 3.550570162216068991e-03 3.909568482459401667e-02 2.240955553294704181e-02 2.575296216255796092e-02 4.470788431131957064e-02 1.051049258806404122e-03 1.004587225429865241e-03 5.490435391042739963e-03 2.056996903509842461e-02 1.044928892282596944e-01 2.008902212357442929e-01 4.584061653732657282e-01 5.731084158348402902e-01 4.841233913009429513e-01 2.423317514451718557e-01 1.399828604631942960e-02 1.000311570803365246e-02 2.199775400987805454e-02 1.276695895233672939e-01 7.767878232791278204e-02 6.992345417198107815e-02 1.820697373150805334e-02 4.821519733983462008e-02 4.399466703566005943e-02
5.256728665444488496e-02 1.617286197650575144e-02 6.167400107082058464e-03 5.717462181246592799e-03 1.270187714394025065e-02 8.608837087487598155e-03 3.591646583527167980e-03 1.479647181227212440e-03 2.248481476183503310e-03 3.116266543373769939e-03 2.708124769173213264e-02 3.135336496336138534e-02 4.006311431533162576e-02 1.399341612921734543e-03 7.374988660427480788e-03 3.173961240364602671e-02 3.181850254515357357e-02 1.351132261994542616e-01 1.727342239087631404e-01 1.495960838453328223e-01 1.273888995206324537e-01 1.663968400496887781e-02 2.597304998954103397e-03 5.150596848247731077e-03 2.290506901787459429e-02 5.801077444534240291e-02 1.559425055286937090e-01 9.955135565116168817e-02 5.358953573253152219e-02 4.710699655996851420e-02
1.879306910884664950e-02 7.414735510175358979e-03 7.801271225775728221e-03 1.307433963000011364e-02 7.142397789285512798e-03 3.168098651570742941e-03 1.432203248325414000e-03 9.894580214133222047e-04 3.107368604580623521e-03 1.231625973868947024e-02 9.880165606614000999e-04 3.002498298600164012e-02 4.417648499799481376e-02 1.448662564192327489e-03 5.967940359005960080e-03 1.127690677082295555e-02 7.738163695816474910e-03 3.834305558827968800e-03 6.918083375834542526e-03 1.427679516075663554e-02 3.041748390815913680e-02 6.454202672257631536e-03 3.036870904487901784e-03 1.316782607802208585e-02 3.227815997676534987e-02 1.160695370036581367e-02 4.023601537252644023e-02 4.776682736079955471e-02 2.619314044524478566e-02 6.682045330879270162e-02
1.904839000559149439e-02 1.519578142915893951e-02 7.300582323549562047e-03 5.307279121462213367e-03 4.932471174852887282e-03 1.831450655975442026e-03 1.193198556825812804e-03 1.204624635213655173e-03 1.320113112197972413e-03 5.537635397329316103e-03 1.681371574304757694e-03 1.841483100919432628e-03 1.679398912478018190e-03 2.099478203316069384e-03 5.865496292866389551e-03 4.354243414240976419e-03 3.044213894678643711e-03 1.885873489776670325e-03 2.664650646783109887e-03 6.301374848306476317e-02 5.141078278556260317e-02 6.971987042813099222e-02 5.341827234344447006e-03 7.471873281651112558e-03 1.535894636911601038e-02 7.522539970616993858e-03 1.217598434753247409e-02 7.216313209431111583e-03 1.067853273868981170e-02 6.984605981419101869e-03
2.587646835942913892e-02 1.340457519541128281e-02 7.506146398323108870e-03 1.015866426346509997e-02 8.927735090148313304e-03 4.803785622265842672e-03 1.618061732614826248e-02 1.207378689937470100e-02 1.768427007664729461e-03 1.417996528618484849e-03 4.868138661607164519e-02 1.432000574885113151e-03 3.998926312884898415e-03 4.368795342776943952e-03 1.321822850141258013e-02 1.058606703267630719e-02 3.472811196496546592e-03 4.285598891521575152e-03 3.115922186866763519e-03 4.186541337699601489e-02 4.131494027624996179e-02 6.104449334621359080e-02 7.509620228575803955e-03 1.110577329325138779e-02 1.100315515768201732e-02 5.615451341010835318e-02 4.521806959976975258e-03 4.633727345720256054e-03 1.189007361214307334e-02 4.931152817263276256e-02
3.479019048055216612e-02 2.992122264907679657e-02 8.949395565411131723e-03 3.031107220645352929e-02 3.526798889640158502e-02 6.608116766804292275e-02 4.381935345991078840e-02 4.907527346223693882e-03 1.753966654538052696e-03 1.122785354485053566e-03 3.262445448506367390e-02 3.833261599703247785e-02 4.076317445148802676e-02 3.164494309604214128e-03 4.292228233119185776e-03 1.786850777396317876e-03 1.764057593949260299e-03 1.893581679242561152e-03 3.426498192842923965e-03 4.128527492634103541e-03 3.712733004863372210e-02 5.387375413842626637e-02 5.650762888062769301e-02 7.487022873195369604e-03 1.991761659342233121e-02 4.207970820599763601e-02 6.173112209171967291e-02 8.657323221245107059e-03 5.298098720054609037e-03 1.060667693850023824e-02
1.890037773258210901e-02 4.675359199084839351e-02 1.383010643175411856e-02 1.473598239154227767e-02 7.155558197576336599e-02 7.562611889565734602e-02 5.019538021108305159e-02 3.436118129397812068e-03 2.422290148697546150e-03 2.429278148676153413e-03 1.410038477777131403e-03 5.112725953631203080e-02 2.915998668676923061e-02 4.218669332551086559e-02 4.869136362281019023e-03 5.104142453157238524e-02 4.639738004184542491e-03 2.516658906938658985e-02 4.692836151384874310e-02 1.321759861710343487e-02 5.246015529522831539e-02 7.277635630871714945e-02 6.054895448813355646e-02 5.902914857921678915e-02 5.801179457588754272e-03 6.033788419894099697e-02 7.097559458695804069e-02 7.891112950582411870e-03 4.551366737396453192e-03 1.116512497181129659e-02
