3.652527937210678366e-01 5.224030043905777410e-01 4.259566694651592544e-01 7.107266843127505417e-03 3.651376595275965253e-01 5.716558115166294092e-03 3.075175420574323068e-03 8.274967180788891929e-03 1.496183223786117997e-02 6.691428156593798825e-03 7.639884778468778587e-03 2.173511846883901255e-01 1.372844398651166808e-01 5.788037046884643953e-03 6.047897709836257477e-03 1.481668697079540353e-01 3.618521291723798741e-03 2.057206758678692144e-03 3.518339148683699569e-03 5.000053295010267185e-01 4.643984765813085058e-01 7.052739849142675155e-02 5.412192512758493002e-02 2.201252470284747187e-01 4.385114426142756594e-01 3.507396910968739734e-01 1.631899372752754485e-01 1.440840673306896351e-02 1.378911105486194284e-02 1.737879961732571865e-02
2.417934673954550140e-01 1.888927732595242770e-02 1.956142762539272995e-02 9.427393305720026609e-03 3.547524439047723775e-03 1.958844276230510204e-02 7.809530026335442798e-03 9.523261566053965732e-03 4.801233251595136454e-03 3.024599016830280436e-03 4.883573033940773363e-03 1.110461668741145325e-01 1.597417694863235704e-01 3.837414101837212654e-01 6.550573805429553420e-03 4.065663348099809449e-01 3.375325229694486721e-03 3.783025400936651690e-03 5.130058843617154272e-03 3.546074058014357395e-03 2.671152429434404119e-01 6.768580968579102075e-02 1.407923805180158472e-01 1.285477430928753106e-01 1.175700305217465963e-01 1.612789646738177485e-01 5.743448152531738932e-02 1.462671031870031897e-02 2.084796343880186004e-02 2.086960987430376210e-02
1.766003139303707128e-02 1.706777968531390799e-02 2.419924654788377025e-02 1.961788461058736749e-02 5.752580894914758464e-02 1.689814093575413290e-02 2.014205755942282405e-01 2.116554080464103371e-01 3.233069519617014220e-02 4.792545375887065882e-03 1.215666659930847264e-02 1.022676707921795804e-02 6.145115108862377919e-03 1.334822295614069079e-02 2.491186816064030751e-01 1.319329903758162219e-02 6.150920398562201297e-03 6.010455144308741657e-03 1.092379012801867819e-02 4.859205787373534549e-03 1.649210131895065545e-01 5.576419698871080965e-02 8.541297378560812337e-02 3.051939770266429500e-02 1.880025369553970857e-02 1.269679192933606190e-02 1.149273649622756070e-02 9.035358470621285276e-03 1.542221371263946886e-02 1.729687321509802353e-02
5.269337074161071187e-03 1.482411443031021563e-02 3.251219858060316187e-02 2.625722940157330931e-02 2.045523091869216534e-02 4.088759181129679177e-01 4.066737868999824590e-01 2.526060459244127143e-01 1.370193679839741829e-01 6.544760969899702380e-03 3.134399937158899481e-03 6.016731309710404013e-03 8.824079225559529685e-03 1.255942715120284513e-02 1.961659702345161516e-01 1.715601196864922628e-01 3.692875123794915337e-01 2.331908467319933342e-03 9.473839800622754683e-04 1.548421524155470675e-03 2.955223094719311439e-01 1.181573011753453833e-01 4.084605238186968246e-02 8.228253336432286846e-02 1.545292797187957506e-02 1.123074132446531814e-02 9.748020951827059480e-03 9.254487812067384300e-03 1.879992988651073282e-02 2.042731781252809381e-02
3.024186805738598993e-03 9.202098635539508742e-03 2.564564667020738722e-02 9.952558932063898522e-03 1.311608956460402590e-02 2.390219319797344255e-01 4.161188358412911681e-01 2.338998603459052639e-01 8.592961581000622961e-02 1.725868926827250904e-02 1.424932202050998610e-02 1.755743708482548904e-02 7.821372939033986033e-03 4.847652503108113020e-01 2.598684346598003070e-01 1.058302814112567491e-01 1.021249485387476334e-02 2.808863676068668481e-03 3.096975135074282563e-03 1.838370622005721646e-03 1.849864447350605670e-03 1.587731234551208181e-01 4.112904018841648246e-01 1.373737369417488141e-01 2.800743672803807788e-02 1.497659243770929974e-02 1.048034620069693452e-02 1.212977535817223555e-02 1.898828625465177888e-02 6.985272408780579534e-02
7.158153667844742614e-03 7.711711101282667583e-03 2.385174486787153963e-02 1.399748010710026407e-02 8.575973557820189969e-03 1.346253890849323787e-01 1.712174240202014863e-01 1.818411038260566437e-01 1.469569284654753949e-01 2.342237499700089431e-02 2.099984658837502488e-02 1.867190371915212338e-02 2.180667204366055767e-01 8.356466498321117597e-02 7.154192380355717251e-02 1.225683298509012836e-01 7.986398141278827634e-03 1.635889128951407423e-01 2.156651328468523962e-03 3.908232798281455027e-03 7.623171783288265613e-03 1.387139737493084043e-02 5.163240009604612712e-01 8.108356020708949730e-02 4.190631236526486808e-02 3.906659265776081524e-02 2.443475125447348850e-02 1.687261583163620834e-02 2.230146501580957882e-02 4.013046027854415276e-02
1.303695299447637790e-01 1.980922359074593908e-01 1.945271791935738182e-01 7.929387421944345329e-03 2.220005693524351384e-03 5.868299756444709386e-03 1.249223663855547964e-02 6.881315848035647609e-03 9.166928538752712116e-03 9.815425474005641179e-03 1.256138127502958932e-02 2.666056662398869070e-01 1.236369744520134928e-01 5.867238319584240636e-02 3.491013562031806960e-02 6.133371994904809887e-02 3.484389223416982095e-01 1.563022714329447005e-01 3.466815953393067445e-03 5.026947460288727632e-03 4.219637630129871066e-03 1.631284008596920743e-01 7.694310391271698413e-02 7.375875872016551815e-02 2.842520079201441702e-02 2.899959860365386444e-02 2.545826579366245943e-02 2.203734574433229010e-02 2.529907501043655860e-02 6.017267071695390351e-02
2.628405337939430098e-01 4.919840463631864891e-01 2.732424675823267313e-01 6.092415228372546898e-03 4.968351897109066911e-03 5.560600442174800859e-03 4.945759494807617715e-03 2.986087678988145339e-03 1.046488756656434836e-02 3.739137751318325487e-01 1.578934085388759012e-01 4.806835892579757186e-01 1.037037535285343232e-01 3.762041657186925708e-02 4.337161369395338417e-02 8.201581089171207373e-02 7.921495696276526638e-03 8.761945237625010097e-03 4.437318844583908878e-03 4.482172067100323107e-03 2.244656562806524314e-01 1.326108938478404164e-01 5.380782410814544114e-02 4.510489941874915032e-02 2.145140538480912185e-02 2.239967109613772225e-02 3.516076466780815313e-02 3.960069549563155489e-02 3.974885827787100895e-02 1.148200905548968087e-01
1.898690374930933622e-02 3.856663336026707745e-01 2.264613938498154233e-01 1.323456297342641939e-02 6.447526127929105108e-03 3.434964890640128665e-01 1.437191315447973287e-02 6.361165407849348266e-03 1.205411697368846506e-02 5.250579970085924586e-01 4.843607122333216664e-01 1.263616024253386670e-02 1.612120401564237637e-02 6.869887845820724093e-03 1.364443514268967039e-01 1.169316577934333690e-01 4.707817623248358174e-01 6.822815274132840863e-03 6.991554685833193707e-03 2.915282871753978600e-01 5.829729604729397968e-02 6.101893919491581386e-02 6.664255052647967414e-02 4.367839810751596163e-02 2.562529172975029634e-02 3.878693141134242212e-02 1.476467136632400590e-01 2.766966182592512369e-01 1.849730332486206399e-02 3.773948759869804048e-01
1.267065564254109267e-02 9.392861182435090217e-03 1.502922718904094179e-02 5.840315681551598581e-03 7.155879286739376573e-03 1.588209467374846473e-01 1.532917022796425298e-02 3.549105956512485505e-01 1.724975671502464447e-01 6.308724422215136740e-02 1.750797547394543352e-02 8.081773643242260233e-03 5.891900725880369095e-03 8.355655310373034592e-03 4.574815636325002544e-03 6.121510910916254031e-03 2.682847068490768622e-02 2.474586732076308748e-02 1.226323113796846595e-02 9.548088813269208636e-03 7.270271651442393457e-02 4.617200220394546833e-02 5.320700500643110731e-02 5.876853949825233681e-02 3.300568492253188463e-02 4.212095569548117424e-02 3.936729523836069999e-01 6.296101102593503196e-01 7.684426340923302678e-01 1.985858282098627026e-01
1.266656461221458974e-02 3.697757093430285580e-01 8.305770808704445937e-03 3.138579157542249060e-03 1.006565911902616677e-02 9.684177071008351345e-02 9.552859122701727601e-02 8.756057161067193340e-02 6.062203205421340391e-02 4.801226066359147726e-01 3.533198898236322716e-02 3.719969579188831671e-02 7.731639435163689678e-02 3.858721270109702339e-02 7.192552183759897549e-03 1.426422587367215389e-02 2.635405726519561911e-02 7.195529270551809242e-03 3.417949937620761401e-03 1.161911269433480443e-01 4.918066927222974893e-02 4.412942615880871555e-02 5.723144823564228767e-02 8.063664419293789520e-02 8.688785647000210610e-02 4.744792022859763841e-02 7.530653487658468814e-02 5.890098824140782563e-02 5.276714112872894075e-02 3.816168932464189534e-02
1.652928647014033636e-01 9.018525750851355549e-02 1.556973688853754111e-02 1.368820633816130589e-02 1.219679816720550987e-02 1.549759506523098462e-01 7.273275978742235748e-02 5.049922378889348806e-02 6.060444734663797406e-02 7.618472966740103165e-03 1.051085317238557686e-02 4.687093592320465407e-02 7.964972649267133831e-02 4.180694122905980609e-02 1.525963016700447247e-02 1.740929211357130496e-02 1.919456957605653741e-02 1.126505549959605848e-02 5.688138059544142755e-03 2.658281081241101185e-01 4.716285005747419129e-02 4.820618298399825113e-02 5.718004989866774801e-02 1.028567835762538157e-01 9.839259848952604248e-02 7.054798856065835899e-02 5.460933790685374573e-02 5.025280918781547396e-02 5.565011171683669627e-02 6.116002440325406242e-02
3.920588049968315447e-02 9.400593514991764654e-02 2.092869645963962300e-01 2.537644395000048653e-02 3.771601077179642658e-01 1.297316852906578721e-01 7.215499735096116141e-02 6.292084492499901149e-02 8.074102245499323316e-02 3.344637855712953751e-03 1.570585018908125241e-01 1.647141376542081426e-02 5.904817819538916990e-02 2.562473118767619878e-02 8.165481712836823031e-03 9.573503685690477188e-03 3.554597460174150139e-03 5.233862349154574760e-03 9.976975073253553303e-03 4.896906484942164899e-03 4.539291334156470015e-02 4.993116736038420711e-02 6.338862519082855140e-02 1.057918540771767002e-01 1.347317399157743067e-01 1.183388029279577452e-01 8.779883899531006064e-02 8.387520143252522042e-02 7.521812954725058675e-02 6.391149032069604052e-02
3.394036449679489753e-02 9.573894149285225308e-02 1.673403523536194371e-01 1.197639618368066539e-01 7.099953971740993741e-02 2.757341573244223021e-01 1.585626448002736694e-02 5.345120937323095955e-03 1.110433709025494403e-01 3.662003841044265962e-02 1.320726314859856920e-01 3.515056129757142874e-03 2.677089189339760394e-02 3.668888289911855644e-02 3.972001215045242728e-02 5.446129215536946178e-02 4.967244450636872088e-02 3.262481913605304318e-02 9.009214791367950448e-02 4.402462322273064527e-02 7.954573779859799507e-03 2.990319031093646163e-01 2.255795986212867921e-01 5.384725761328126303e-01 1.465497505000364770e-02 8.075133136133869766e-03 1.849298773574986621e-02 9.555349656773303585e-03 1.019006739928545180e-01 1.213365051302512099e-01
3.182020585757967812e-02 3.176872719568520076e-02 8.593102239326352865e-02 6.408258378189403137e-01 2.338676973537326398e-01 5.194092538941677550e-02 7.767993559298413953e-03 6.445845971266815633e-03 5.216687799779171075e-03 1.395456809257783759e-01 2.901464093598676852e-01 1.669808910816741876e-02 2.335544976516266621e-02 3.013381195249569683e-02 2.769579037307132868e-02 3.405358956974330331e-02 5.935118735683244523e-02 1.047567851452278209e-01 1.089031318307195906e-01 8.714115066607550086e-02 6.713619814579407062e-03 9.313855916785454200e-03 1.052123189710644016e-02 2.412825174522120406e-02 2.661640389611188290e-02 8.295462824985738726e-02 8.306020012262096963e-02 2.480380234335084755e-02 1.053341153871632380e-01 8.278286320485798988e-02
2.948158538746266377e-02 3.194127113217089947e-02 7.095005742653349989e-02 7.838625028345393153e-02 5.248367673358940444e-02 5.485705866853674006e-02 3.036250905805554234e-01 2.797242657415167574e-03 6.308010973600417480e-03 3.057259472299875963e-03 3.231952428482171361e-03 2.297967034605643156e-03 1.280157770614695836e-02 2.647354660346182623e-02 2.520928250194244200e-02 3.938081036538887414e-02 7.013588559247395382e-02 8.780962755683827115e-02 5.230708246322075816e-02 1.169591562073696994e-02 7.103984250697976954e-03 4.925512712420765382e-02 7.229673605298429784e-02 1.228324384958332099e-01 1.170375097539826242e-01 1.542732194092429898e-01 1.246740995339875729e-01 4.558058768319667858e-02 1.546380784777288964e-01 9.232065946732760653e-02
3.845553641036266596e-02 4.405365549804123732e-02 4.227259661169943672e-02 3.922860419150547839e-02 5.622750654167135015e-02 9.483677253507517835e-02 1.906117638070688527e-02 5.361669764350610740e-02 2.308807623700939032e-02 3.897446764492402266e-03 2.854152768738132603e-03 4.419969271023905730e-03 8.832423391461657197e-03 1.335782442208876403e-02 1.807057234185420816e-02 3.315300062116059016e-02 7.410229201408055633e-02 7.763279335401038206e-02 3.822133868625020303e-02 1.353849751095012252e-02 5.917615541760850445e-02 1.085660695017253152e-01 1.407514404063009983e-01 1.469212232942386787e-01 1.317966507099288809e-01 1.159636050402289287e-01 1.745399214440002122e-01 3.539253306952142020e-02 2.046673231427563466e-01 1.114240435832527520e-01
9.788733896218587693e-02 7.618558721749993379e-02 3.635230448529001845e-02 5.006979277213041701e-02 3.442545141595249394e-03 8.779405736441727587e-03 3.981854085872119087e-02 3.110166836161306486e-02 3.054406193732403171e-02 1.503602297827721923e-02 6.849388244723928279e-03 2.783807364167911660e-03 2.725659958990296530e-03 5.843538936026435732e-03 8.670131348419646625e-03 4.092548984043468951e-02 4.487535061923442203e-02 5.932944633474324103e-02 1.077026665660320466e-02 1.961265221768936431e-02 6.581671113975119669e-02 1.444015182359005001e-01 1.804947165104360818e-01 1.908524775381063021e-01 1.613410713913828731e-01 1.599264525689662320e-01 1.526431421875115713e-01 1.278557983686452737e-01 1.706106213477039460e-02 1.317435914661647424e-02
3.923482488436438875e-02 1.064722363694852458e-01 1.824189825028134093e-01 5.481996011723484427e-03 6.158198299642866219e-03 7.416476814818909365e-03 2.341932865203914110e-02 2.920450936772306730e-02 1.993865202721352425e-02 1.540160345243869744e-02 5.428771749706972488e-03 1.938975831278774709e-01 2.946118369395679393e-01 3.761040856884501071e-03 3.207786473513470852e-03 1.955373231913110771e-02 7.726286558733955548e-03 2.805836088712834308e-03 2.314504756301094535e-01 7.176584013043487906e-03 2.573238754127166183e-02 1.389944286513773997e-01 1.783376345971532939e-01 1.912615597772621134e-01 1.437443313301408898e-01 6.878005046366091058e-02 1.145447688896524541e-01 7.818177741802218028e-02 3.067467938026310903e-02 6.335349607797347016e-01
3.661329174125866996e-03 5.938824748464193934e-03 3.499628543307915438e-03 3.033171074630060682e-03 4.105490039890026879e-03 2.316639849765826393e-03 1.180868056187548906e-02 1.509646980596672516e-02 1.378106782452074783e-02 4.998310332645822945e-03 3.089440558589326424e-03 1.350966302816609399e-01 2.330083547693627966e-01 3.952270274902646569e-03 5.880759714988345599e-03 3.615091706698527786e-03 6.143980078463333327e-03 1.825050113917084686e-03 3.472765394557243267e-03 1.657285611187283431e-02 8.397848632439418315e-02 1.613023869058093362e-01 1.756340586810771209e-01 1.719156727727501333e-01 1.367530804834847513e-01 1.036884212929699428e-01 1.032950637636704944e-01 8.262456616554947342e-02 4.149276425351645925e-02 5.094377961363958374e-01
5.371182219563497978e-03 6.599449832091708323e-03 4.974818583364952473e-03 4.788851082747192130e-03 6.503550517433872094e-03 2.433987784421915747e-03 1.002791122717397801e-02 7.336511844851409739e-03 2.194505322271156616e-03 1.908828499688626414e-03 2.315141259394905004e-01 2.062853959434417239e-01 1.161216954659552436e-01 5.475466223229460277e-02 1.194135253292331750e-01 3.575151297010501494e-01 3.441012916859293152e-03 7.036742626236824893e-03 6.921614225093244803e-03 3.154389051169562141e-02 8.756377783748642285e-02 1.287637641505652575e-01 5.313721907515635279e-02 8.271095962560395809e-02 1.112346125926423901e-01 6.541752346831268550e-02 6.561130641158408050e-02 6.734985089225140054e-02 2.883218996796175215e-01 3.135583800256057652e-01
4.251302835196072230e-03 9.506426522032897924e-03 3.770731079440001188e-01 3.253907389505779624e-01 3.040360033080997670e-01 4.382372724484643878e-01 3.386286109181728832e-03 1.526701700920949922e-01 2.113291074938269953e-01 3.667406562843343598e-02 5.426414837356140913e-02 8.730144558192227955e-02 8.465197816876407488e-02 2.694994961575911119e-01 5.172595819648829162e-03 1.931850423505916334e-02 3.367096218709945965e-02 4.372771005747901757e-02 3.041359635018828569e-02 2.331306152586235317e-02 1.681630826625955116e-02 6.117978864702544421e-03 2.410090234832585818e-03 5.417663626155525512e-03 2.043685351239166517e-02 1.222626735111144274e-02 1.837460452387341264e-02 4.144179597121381287e-01 5.363323944678415056e-02 5.007001366197896819e-02
8.546884502137223547e-03 1.560206501651075633e-02 4.205818814678051187e-01 2.525520935560861546e-01 4.321697999582712613e-01 3.338893731558623679e-01 5.163722028505270956e-01 5.626583846226797248e-02 5.089749403815276019e-02 2.208824995338752248e-02 5.489087731961605349e-02 1.016389980820289751e-01 1.115381114813136232e-01 5.210016785324316224e-01 7.172740988450661964e-03 8.768069393908997297e-03 3.256520883740558064e-02 6.170970332388980850e-02 7.111474174346034405e-02 6.299327088617197312e-02 1.790209566041708542e-02 6.682620119342623684e-03 8.200902450524828746e-03 1.632338864355590072e-02 2.309282610017852205e-02 1.183412457112280498e-02 4.649460857643337719e-01 1.904537367874176157e-01 7.130571316537934190e-02 6.844987883176203991e-02
1.031279334198413264e-02 3.651105708572739521e-03 2.339299755974060258e-01 1.046331046740104076e-01 1.373482890062748263e-01 3.124118942800508392e-01 4.136513938300809268e-01 4.744245190522539124e-02 2.531844562933131815e-02 2.887002369164038545e-02 5.247828703924956040e-02 8.959144038113905917e-02 8.368549120040416622e-02 4.034867772984497836e-01 1.324436125544746837e-02 1.976434282604518089e-02 2.405992730488733938e-02 5.625945689182342002e-02 7.217949820277752560e-02 6.277842817840231793e-02 4.233073489865979422e-02 5.006013897327015183e-01 3.392435516517628424e-01 7.841659454967883636e-03 2.473893174814198459e-02 1.870078637269973268e-02 2.762623665538317674e-02 3.192331653045290540e-01 5.597137203622293972e-02 5.061256817214208892e-02
8.726876963947440696e-03 4.985327972507726593e-03 4.929162600121455018e-01 5.450442236807437890e-01 5.935586479443324091e-03 4.710962102703495843e-03 4.302091421073063193e-01 1.802473593337727553e-01 2.593354007777715076e-01 3.304070998740652465e-01 3.090295795141688451e-02 3.710646188341954615e-02 4.892539121145102893e-02 9.531579103747685189e-02 4.807367922630016999e-01 1.457040684296342578e-02 6.761166489042887660e-03 3.167856630049657729e-02 3.709138215297401453e-02 2.907712618982723901e-02 3.675251331663158261e-02 1.111224959546765027e-02 9.857875668861144913e-02 1.592680541095599644e-01 1.976528921621677204e-02 1.412724571845944133e-02 4.770686236217968473e-02 6.101559033390113046e-02 6.404252108892800888e-02 5.602923639577524206e-02
3.258503287879393334e-03 5.024109074000904229e-01 4.371981785792877426e-03 8.278293876416986663e-03 3.567979925921166331e-03 3.629510729544307979e-01 1.742105632060676479e-01 1.256493435753427701e-01 3.881230456105447812e-01 6.928428577025022746e-03 1.015351971391532521e-01 3.754494391339361498e-02 5.564209359297715707e-02 1.026572796719199820e-01 4.260055134333134985e-01 1.225270674988408054e-02 4.446866380820320153e-01 2.082888631584506045e-01 3.046209615486139000e-01 5.152931771563293850e-01 1.376190336043284917e-02 2.090664262952233732e-01 1.072177939978468525e-01 4.960031042311374705e-01 9.483715276191657939e-02 3.484654027498372830e-01 5.123682851548520129e-02 9.151499114338720875e-02 5.196322850165537854e-01 8.868154613953854737e-02
3.479626583007068390e-03 4.991968209087685807e-03 6.111003750285506353e-01 5.122201397935415290e-01 5.427121814378115250e-01 2.141901453725587878e-01 1.433428301797266546e-01 1.476663417922137456e-01 1.625054514327355093e-01 6.425199472652068922e-01 1.880047404810768485e-01 1.878195591647722762e-01 1.511926145570735847e-01 1.536500054731623488e-01 3.875201000896052461e-01 2.631841392666096069e-01 1.858259581980712116e-01 1.168845378685602066e-01 1.026496329172195687e-01 7.737891877279581831e-02 6.188768442346546245e-02 9.015132631376908401e-02 1.372791756130447849e-01 3.195913602145408206e-01 5.449706914019601944e-01 2.452585070030322001e-01 3.768345535559312620e-01 2.625139532978331691e-01 2.719107035138649819e-01 1.796517173178691917e-01
2.798344748028700531e-03 3.424051924765698918e-03 6.196861680794876204e-01 4.692367918139101444e-03 2.935211485314144410e-03 5.279469618847730805e-01 3.637971961202221809e-03 3.250323268088339997e-03 2.240545291547693108e-01 1.620105273076727914e-01 6.057049004244798029e-02 1.400899460531840890e-01 3.521466916302007366e-01 3.230323059225627125e-01 2.047454517319267919e-02 1.531056684504071910e-02 2.106643658129118690e-01 2.526404282924245015e-01 1.159859797594205155e-01 5.175279362067190803e-02 5.024655574738310509e-02 7.833796079301379167e-02 1.186865821734620630e-01 3.612987293491418672e-01 3.639682264847279303e-01 8.601520794074074550e-02 9.568735846901302300e-02 1.236344796094068638e-01 4.039518546099581386e-01 8.275937364272777097e-02
3.744919422432958604e-03 4.927439122525243895e-03 1.515102735926384010e-03 5.631644534208583505e-03 4.652590939790215117e-03 8.646084831958436231e-03 7.888502639646657183e-03 5.724025500904235120e-01 2.234574170801283399e-01 1.292669171858804034e-01 3.910221128176178534e-02 4.983787545506022931e-02 5.341412923380988581e-02 1.830208947764248584e-01 2.100500394524094927e-01 8.895487029747939367e-02 7.402863323105013382e-02 8.082463549779794754e-02 1.104955875890079597e-01 6.449111034430449196e-02 4.578174241831631935e-02 6.814516060419884003e-02 7.747727850463156929e-02 1.289871952785620612e-01 4.010529188193340255e-01 6.314373671389085507e-02 9.178535838685052128e-02 1.508598364699205441e-01 1.826830232496357287e-01 3.630810862821589602e-01
2.023824673230945406e-03 4.941804388989212531e-03 1.471129855531682013e-03 1.603262004906351413e-03 7.915110301512153293e-03 8.290960390291510912e-03 7.986455185255406444e-03 4.124174761407897183e-01 3.172723234424412730e-01 2.934404817767372053e-01 1.192486022818927821e-01 5.948873526900441688e-02 3.552488992449636535e-02 5.568412662197551322e-02 2.540067385981786829e-01 6.655176996382003440e-02 1.793147938025031474e-01 1.367802736376182680e-02 2.754950704011007237e-02 2.478332533116426872e-01 6.400397737939921006e-02 8.954421969679167426e-02 7.792648584001429790e-02 8.548954289928335781e-02 1.132060358035017755e-01 8.671798764207971910e-02 1.022357745953554192e-01 1.261777824717741359e-01 1.703931936197226604e-01 4.184329311762772785e-01
