3.466725317832947439e+01 5.200019278561534009e+01 4.490871162125861815e+01 5.671375886213812123e+01 4.116327155466478871e+01 9.084490739661663383e+01 8.595239333941549376e+01 2.410940237120860843e+02 4.288587339148676278e+02 2.054335998001079702e+02 9.894903720517797296e+01 2.417591583502935393e+01 1.463546177990604491e+01 5.754963928670290585e+01 7.167591300519374897e+01 1.711538299683589770e+01 6.550938538699813307e+01 1.268139516045374933e+02 1.305731529517364038e+02 5.097943712752528711e+01 4.009822340165086985e+01 5.735533815707563932e+00 4.444410840843238120e+00 1.810074530822630479e+01 3.602119096128505760e+01 2.909809605755806672e+01 1.385349394112247978e+01 1.236121687366961153e+00 1.196137305382178884e+00 1.531139306908039455e+00
2.831139978267465551e+01 6.488707996138636247e+01 1.285509575884175035e+02 1.056953498769857731e+02 6.779880255544715340e+01 2.977745655668633731e+02 1.167238671886955501e+02 1.634330455398686581e+02 9.880857760242719223e+01 9.343869305824178184e+01 6.904627215190100742e+01 1.597762302164399273e+01 1.987133529087601147e+01 5.019595634086707037e+01 7.170520293411156842e+01 4.995644316226226778e+01 6.830086362201622308e+01 2.463341666327163466e+02 2.139490819650714570e+02 7.391272283898959472e+01 2.595333528447280713e+01 5.712199333003429302e+00 1.206996753890281582e+01 1.109123251775828578e+01 1.018636966339906103e+01 1.426329349721115847e+01 5.282563096894797638e+00 1.331180994930786454e+00 1.871502467240079515e+00 1.855460705560300072e+00
3.012837650634880902e+02 2.085618677900255875e+02 3.263801298888745350e+02 3.217291110439921340e+02 8.565084305184491313e+02 1.355362151334251735e+02 2.156675434465246965e+01 2.500281588952999101e+01 3.968490023547508940e+02 1.404812634119647896e+02 2.862681034670911799e+02 2.910104198491118268e+02 8.710165286303097787e+01 1.690886270702062859e+02 3.220518826110115640e+01 1.463426037787968141e+02 1.077834941798543298e+02 2.462895694334653740e+02 9.529902503433692118e+02 1.839022509073702736e+02 1.748530981485119540e+01 5.017836986888325690e+00 7.719850619342205178e+00 2.801978573328020694e+00 1.758565161218604178e+00 1.236171412471981812e+00 1.180244572685657412e+00 8.840915028639657613e-01 1.439324862720306797e+00 1.555081636377055876e+00
1.677997150211908775e+02 5.751164423800881877e+02 1.386102971413359910e+03 1.215157213866758866e+03 3.916684250049215734e+02 5.504486617383258817e+01 4.043179813533456013e+01 2.716784419825815178e+01 1.815706596987948984e+01 1.818004948814526074e+02 1.380161882668625992e+02 2.696930884238033173e+02 9.822510824210306168e+01 7.906693773354264465e+01 2.330088045448189860e+01 1.902038730112670706e+01 4.260487179908825794e+01 8.637135432108779298e+01 6.999086684111824752e+01 6.794434183085110135e+01 3.290798019355849391e+01 1.170600915726628344e+01 3.706653159592164570e+00 7.456922835643434055e+00 1.402552613866205444e+00 1.085940344792744927e+00 1.002130163690425402e+00 8.941227083914320417e-01 1.705690978711280614e+00 1.770209195251416290e+00
8.648612536318552202e+01 1.528656487706025189e+02 2.685533111670443986e+02 1.040623838753925838e+02 1.189245914532461654e+02 2.582664003614114989e+01 4.090174302944397056e+01 2.297479275125491682e+01 8.106350891698829386e+00 1.996967698551188732e+02 1.958570614843486055e+02 2.802586615996175965e+02 5.639198242333230837e+01 5.562692901459563188e+01 2.722101411437845897e+01 1.043817477394582127e+01 1.160548736441375297e+02 7.182977447603543908e+01 1.289341385620855647e+02 8.062135419493746724e+01 6.015012490145473123e+01 1.824056622555145424e+01 4.283102306872193310e+01 1.200342425407009728e+01 2.393159661336027089e+00 1.376047819773986713e+00 1.029455289108234028e+00 1.120345925521688768e+00 1.643847366169299828e+00 5.768842000750671772e+00
1.041025740225566665e+02 1.241959434134368507e+02 5.675850694988262148e+02 4.527049940698103683e+02 1.699506771935654967e+02 1.707285611049387342e+01 1.959382863610769121e+01 2.095053996264452323e+01 2.132657092693296974e+01 6.729121694130612923e+02 5.424827697690604964e+02 2.605059161168215951e+02 2.844983194451221920e+01 8.475039738610725237e+00 6.754112394899325800e+00 1.123401750215248995e+01 6.018948198416672568e+01 1.647086430527307144e+01 5.751528274191618095e+01 2.103721262314743115e+02 2.811421247403804387e+02 1.846102611723834457e+02 4.980106173902589717e+01 6.696540320436439764e+00 3.396630806714752815e+00 3.433156400830608135e+00 2.310101375877876784e+00 1.497159007515770801e+00 1.850304558882964745e+00 3.174081039196186005e+00
1.359849810775018497e+01 2.061668000630069031e+01 1.903890691068128405e+01 8.916371483106311757e+01 4.979444504170600538e+01 9.012932892051807698e+01 1.372652477170021257e+02 7.976386357209820233e+01 6.805880540924587763e+01 6.194903153355272707e+01 3.583577325849533679e+01 2.471555141549823276e+01 1.270701931007415553e+01 5.308608756727583255e+00 2.816907730992628700e+00 5.315002548482006262e+00 3.248052693250336631e+01 1.576791526504409724e+01 8.365720160390173987e+01 1.194570509328489436e+02 6.048317653372443203e+01 1.607461869399317678e+01 6.837378235203285470e+00 5.616190948244755177e+00 2.194142486489842891e+00 2.441347584461732279e+00 2.327321385517088892e+00 1.895948402582469328e+00 2.058669261116267357e+00 4.654361502173760101e+00
2.806068648680735578e+01 5.460142030457036810e+01 3.582084611360192383e+01 8.030791121957561529e+01 1.237558524389912691e+02 1.312034782209750574e+02 1.084821743271634489e+02 1.028700332328688347e+02 8.210364208971867583e+01 4.582834247759828372e+01 1.780426568807453691e+01 5.229578525478034123e+01 1.074077411012164163e+01 3.631778132588758368e+00 3.731635255228816117e+00 7.109268620957861273e+00 6.159829740889455962e+01 1.015470006737574380e+02 9.322095495383595676e+01 7.035775598931681429e+01 2.118432214554361792e+01 1.075690930426530301e+01 3.884330019831025105e+00 3.201376991844310016e+00 1.593481238706266900e+00 1.784364760444058007e+00 3.004651279560887289e+00 3.652366410749175785e+00 3.461649694802765964e+00 9.610905265250030638e+00
7.040226724219860444e+01 4.376716719392663180e+01 2.548394571075486681e+01 1.281609469890248363e+02 9.237199941160696426e+01 4.056385156939543890e+01 1.449217761178366004e+02 6.707983111280030641e+01 5.791474806954401799e+01 5.646505171657105393e+01 4.990601007663771327e+01 6.480910902106126059e+01 1.425609210229503674e+02 9.420453139214275495e+01 1.412782278725692642e+01 1.246460059956292454e+01 5.493296164535536263e+01 1.724732538679269567e+02 1.796516926238553538e+02 3.234027221679549768e+01 5.592047404110960684e+00 4.604173239265512585e+00 4.679817486909346513e+00 3.040686201774084108e+00 1.841608519026393331e+00 2.968730412581152223e+00 1.213139508871190841e+01 2.347622044304970856e+01 6.436672950499860235e+01 3.024895463002089713e+01
1.165949086146905103e+02 7.838051313633016548e+01 1.467124681278815501e+02 1.471547606912405399e+02 1.315284489432447685e+02 2.484464330719403691e+01 1.058268758410657995e+02 4.504947454467093593e+01 1.932025491895824842e+01 7.005823983601189298e+00 1.101703063762623742e+02 7.332709917842575464e+01 2.272342641338165663e+02 1.870433172027275930e+02 1.091643260006701439e+02 1.034068680201833388e+02 5.676419008165297555e+02 6.094752069760959330e+02 2.638679297859977169e+02 1.279728511918529534e+02 6.808275443513217340e+00 3.397446142520220924e+00 3.743308503240733387e+00 4.136925771442531818e+00 2.354516973559063864e+00 3.127323709595950074e+00 3.098136053090563280e+01 5.107024001585075013e+01 6.093764746196027460e+01 1.536343146358759881e+01
9.853166339863312828e+01 4.792769700227763963e+01 9.091770694304715050e+01 6.889437678795667352e+01 1.126291789045837106e+02 1.276568371971930205e+01 1.102273996004021583e+01 9.766142706384840722e+00 6.377187818200431124e+00 5.660564812057813810e+01 1.001762232962973258e+03 8.613798970139412177e+02 3.457347778270369417e+03 8.592566500563568752e+02 2.597394283909397927e+02 4.088509424158742149e+02 8.036406124370407724e+02 2.253787853730729012e+02 5.821805219592721414e+01 1.254538672899499652e+01 4.502291616466385982e+00 3.234348307784081555e+00 4.089473627086205099e+00 5.802351042585467411e+00 6.331155946267964296e+00 3.517374900930325232e+00 5.734557150581319540e+00 4.386554151925121658e+00 3.801772682449112928e+00 2.645070250755444441e+00
1.916154900558399277e+01 1.186479545738820818e+01 1.124324337786980692e+02 1.169601219005105293e+02 9.091707867516078068e+01 2.069046046091292013e+01 7.636855029373682768e+00 4.817947052928196250e+00 6.379458805003745070e+00 1.194505712492533576e+02 3.236601290365704244e+02 7.443063860344493605e+02 3.768359164142844293e+03 6.531346930613176482e+02 5.795637725108745144e+02 5.129271100924374878e+02 5.912298971908071508e+02 3.487468384123670830e+02 9.149164409260896491e+01 2.704305194301327475e+01 4.008522935369991380e+00 3.523349896739106590e+00 4.167616691211592617e+00 7.634494635501431148e+00 7.497227399535323578e+00 5.515395685063809950e+00 4.332179221946885761e+00 3.758610278272636940e+00 3.869566783836354773e+00 4.004897308521482735e+00
3.663347346234399726e+00 9.761142679094998442e+00 2.328471995032475661e+01 6.388208509221342268e+01 4.493270005486203900e+01 1.504424626058207970e+01 7.601761527248882544e+00 6.314710605854548575e+00 8.770550179141023861e+00 6.571780369562829094e+01 2.414006047509995057e+01 4.353165705621460120e+02 2.857153425382660316e+03 5.579659165076107001e+02 3.205630851966179762e+02 2.670578037365792738e+02 1.179681599686884965e+02 1.261820978848504211e+02 1.844813661321619804e+02 6.668566368677281275e+01 5.010229235481354237e+00 4.204480867026852309e+00 5.133407028089732371e+00 9.050784240008159287e+00 1.210037704616890508e+01 1.172568109820359794e+01 8.885989092825127500e+00 7.935215675183872719e+00 5.694171467973081491e+00 4.143548151814665736e+00
2.832210590213974033e+00 8.621935113494961556e+00 1.604134039601469297e+01 1.181439069291048050e+01 7.066424688674300292e+00 2.862180528871782315e+01 9.941540389992258042e+01 9.041739610718916254e+01 1.291033817425684127e+01 4.018823480203081999e+00 1.802923544864137284e+01 8.566599331952875218e+01 1.296919937532786207e+03 1.084875691510619163e+03 1.586266748415983557e+03 1.384474958351290297e+03 1.799531000262118141e+03 5.157769971134634943e+02 2.970557774943456934e+03 8.480666677304799350e+02 1.059945839417612206e+02 2.783510548237130422e+01 2.107748311639874927e+01 5.305335028614606330e+01 1.157611793834748823e+02 9.840864365366505240e+01 2.740433078320252775e+02 1.016976124821820662e+02 8.504374212205910055e+00 7.804516045862901485e+00
2.467245488938914377e+00 2.614855773265030603e+00 7.353642122523073255e+00 5.558604378710712268e+01 2.057381074285425271e+01 5.012893574237384797e+00 6.801669337174595853e+01 2.094406233143947702e+02 1.533269470488864670e+02 1.658672500983987419e+01 3.827666604071593781e+01 5.596275015612911830e+02 1.226764485598807369e+03 1.078557949355974415e+03 1.215170688521969851e+03 6.824587032306624224e+02 2.429018905464814452e+03 1.096286988096450386e+03 3.808696924248921732e+03 1.520521196028251779e+03 1.056507135381168183e+02 1.093856296090119287e+02 9.799805744880939073e+01 3.106317711388571752e+02 4.264152680579997536e+02 2.250950111794256827e+03 2.146821797087697632e+03 4.343857727365862047e+02 9.530262044430958923e+00 5.302114502810551855e+00
2.141286962832624319e+00 2.444030043512985362e+00 5.897805133518691179e+00 6.650338309614593157e+00 4.535184888231475142e+00 5.553047868381039365e+00 4.133902625874462444e+01 1.192245139714647451e+02 2.591511030450040494e+02 9.762328650464695556e+01 1.092239878378161819e+02 9.363861302584581381e+01 7.427895456213253738e+02 1.134488731299888968e+03 1.232459296321748070e+03 7.932743081175910902e+02 3.299579189555879566e+03 1.109476952306370094e+03 1.878703550310051241e+03 1.458898027399424961e+02 1.906012122536215543e+02 9.374720255071938482e+02 9.930667069549618873e+02 1.863754500267155208e+03 1.529024019777094964e+03 1.535959940543742960e+03 1.514031917525387826e+03 6.105477137487480377e+02 1.424181136372623513e+01 5.982411833490433040e+00
2.689706208992074910e+00 3.222219696756744689e+00 3.282505788555162951e+00 3.268526804944780650e+00 5.427387099937057258e+00 1.230380127543178759e+01 7.157173263093573041e+02 2.403879722778202449e+03 1.214265423339692916e+03 2.206517366442834600e+02 1.789554211233853209e+02 2.970940449716223384e+02 5.859122719469692129e+02 7.022365849164214069e+02 1.018105910250216539e+03 8.030482065726895371e+02 3.627080311952481679e+03 1.320533791025249457e+03 1.328007010865006805e+03 2.983844417984901156e+02 1.626637798217160025e+03 3.201132523270119236e+03 4.426822378311127977e+03 4.565272811793289293e+03 3.949017677935902611e+03 3.314714630560597470e+03 4.576361938388356975e+03 7.375921776189729826e+02 2.156533943466306624e+01 8.323614914105025520e+00
6.717964296207915353e+00 5.460039576915123760e+00 2.927678338094843014e+00 4.946951337142307281e+00 7.183006898743781221e+01 3.784835733066945522e+02 2.075562133011787409e+03 1.689780557743326881e+03 1.723078037102618282e+03 9.204234491598333534e+02 3.699140757863404474e+02 1.120293906844694050e+02 1.091813357770655699e+02 2.388793064766935004e+02 5.411022157653982276e+02 1.483820578102134959e+03 2.191619538669858230e+03 1.444553842985561687e+03 3.342927216758318991e+02 4.391148259764756858e+02 1.135046553244373854e+03 1.349529485416679108e+03 1.397676115014321567e+03 1.371200220551994335e+03 1.239706849110983057e+03 1.238268709041161856e+03 1.534613966962792801e+03 1.577656944195717188e+03 1.033178742735568107e+02 6.640973646592256330e+01
3.058435437348789421e+00 8.879908484147113867e+00 1.734048594519997266e+01 1.322956866876046433e+02 3.311867729057423162e+02 4.930092411051290924e+02 1.563444954633616589e+03 1.957587514731878628e+03 1.397176057744590707e+03 1.135621882395728790e+03 2.561972113239483519e+02 2.772672660675389267e+01 4.174984893538999131e+01 1.007733631624561212e+02 2.055626565849054828e+02 9.946117038199010949e+02 3.715910141728280678e+02 9.555154872927769816e+01 3.056982068199699043e+01 2.060883516670706399e+02 8.095182978575071502e+02 4.875644814886988570e+03 6.638394803894352663e+03 6.268891787623433629e+03 3.980669337109429762e+03 1.636583526728303696e+03 2.531404059011810205e+03 1.532207261421457133e+03 1.312718017143457701e+02 4.808507326576076224e+01
8.023378042500608842e+01 1.104919371676333242e+02 8.025579004394664651e+01 1.115577686482334769e+02 3.010987753083961707e+02 1.880656654320143275e+02 1.004739607138963379e+03 1.318708767438665291e+03 1.267546876357731207e+03 3.066437665300207414e+02 7.926371455739092653e+01 1.713496874334462916e+01 2.989639884779055734e+01 7.817764117830880366e+01 2.730610478320416519e+02 1.644462633121210047e+02 2.633359186756244981e+02 6.840733953370829568e+01 1.101986310104604172e+02 4.222634012572818847e+02 1.296589941537698905e+03 1.807825620417092296e+03 1.616456034318674483e+03 1.511969676953327735e+03 1.249989797550686035e+03 1.030912746552281760e+03 1.232460428066102850e+03 9.446827604596212495e+02 9.867166706151681410e+01 3.549032456613599606e+01
2.386510161194447619e+02 2.386127805664851280e+02 1.380721701288030658e+02 1.150005789401733836e+02 1.764233489990030534e+02 1.070898090763862456e+02 6.517326783166870428e+02 6.056211267058031353e+02 1.766826200477573821e+02 9.427198334231741228e+01 3.083459662524739286e+01 2.292945950427017010e+01 1.362725449144421930e+01 7.270625727542638472e+00 1.736721619235519398e+01 5.638064676537160835e+01 1.867417779369424125e+02 3.794914086962107831e+02 3.116821221589308379e+02 1.200332565129261184e+03 3.053431758777016967e+03 4.146028410434129910e+03 1.595031283291181353e+03 2.095766658212770835e+03 2.414550516536046416e+03 1.206765024850057671e+03 8.508047056562355692e+02 6.675054449380650112e+02 2.355680147853615836e+01 2.011901471567749411e+01
2.009210394433396516e+02 2.524695623835009997e+02 4.282166149518145914e+01 3.472127846481763669e+01 3.380116538156601536e+01 5.846048954206055726e+01 9.166899783845599359e+01 2.456586738014418358e+01 3.388234915687885973e+01 4.789648309854929842e+00 5.894822932487040035e+00 8.483857491382815752e+00 8.951336746729470661e+00 3.242403283686836346e+01 8.714744902282816952e+01 9.969247563274150252e+02 1.246640984157661023e+03 1.217296991993751817e+03 5.835821079424365507e+02 4.464841692371995805e+02 3.149948718375860608e+02 1.012312265456475444e+02 4.975214275245382112e+01 9.014265082000262908e+01 2.933984707944816819e+02 9.823812966037706929e+01 9.445047980791655107e+01 3.285146438979496253e+01 3.710041979603004414e+00 2.850418294261447993e+00
4.407472325147831498e+02 3.656850234198253133e+02 4.566098228712339591e+01 2.259879892388350342e+01 3.845866796771386475e+01 3.258545264749309922e+01 5.323754163691121732e+01 6.046583155656403363e+00 5.202408494512129167e+00 2.126067302801943892e+00 4.831692251176102459e+00 9.025932356078701702e+00 1.173384679844956224e+01 6.530610454060780512e+01 1.009887910331668905e+02 6.292831789940197496e+02 2.211251981112792237e+03 4.152100176319419916e+03 4.292018239419784550e+03 2.945231071626385074e+03 5.173339892429468136e+02 9.297260189150594556e+01 9.151971536410572128e+01 1.923648860677176060e+02 3.930860399687303470e+02 1.073330781628855419e+02 3.901865724890625131e+01 1.452622108096976561e+01 4.448491383608745409e+00 3.894019225469309120e+00
5.811223070428663959e+02 7.869367069368433931e+01 2.487959888872152092e+01 9.085650464651116920e+00 1.161348215804343731e+01 2.714960450138420711e+01 3.620386274462150311e+01 4.192148921265604677e+00 2.309197143816493991e+00 2.575015563564718946e+00 4.509056205500115766e+00 7.704967134180892963e+00 8.520075574896839754e+00 4.954251471286660546e+01 1.803275308359065434e+02 7.557307685516477704e+02 9.378075773536154429e+02 1.439336144106898018e+03 1.492542850143183841e+03 1.499713371704360270e+03 9.455325755488404411e+02 5.438680452194168424e+01 3.080629703200825276e+01 5.882696758906797641e+01 3.169768361439976161e+02 1.777262112428958858e+02 1.535339869772491568e+02 2.830217854272752476e+01 4.038955921982421593e+00 2.986917964008793724e+00
3.501565752384672692e+02 1.139593583298185138e+02 4.882716395046067959e+01 4.922631287070097983e+01 1.217904613152425384e+02 8.722616429857232845e+01 3.697992680847503522e+01 1.556851047702868129e+01 2.391582347165833866e+01 2.988812829484320588e+01 2.713423440328283753e+00 3.081218017634368422e+00 4.568607983200930533e+00 1.107645483358698968e+01 6.471905049374127827e+01 2.559280562430812438e+02 2.487548434001835460e+02 1.014956499971068752e+03 1.200329667821328258e+03 8.831637337611607563e+02 6.228278321084117124e+02 6.506364943137855050e+01 7.744851894851840335e+00 1.393827970630264623e+01 5.988621424050514008e+01 1.444198494961822803e+02 3.781800605449676596e+02 2.056299781078443232e+02 5.006491808422555145e+00 3.613645948448506395e+00
1.263084966680146692e+02 5.293513088076054629e+01 6.164356259526891790e+01 1.123508367056378177e+02 6.862879404647289050e+01 3.202979890403694441e+01 1.500951689042696735e+01 1.084385478792670732e+01 3.545856332014699319e+01 1.315225104292853757e+02 8.773440917798653871e+00 3.087416315223808105e+00 4.915901633797655101e+00 1.050839854619604274e+01 4.906741838857266913e+01 8.260991680434725026e+01 5.234986774708433188e+01 2.344325249374816167e+01 3.309177053634348198e+01 5.571682252833413429e+01 9.169239793763716762e+01 1.851741783857060497e+01 7.861200336132019295e+00 3.767500811721688336e+01 8.970729472791732917e+01 3.081614708351371235e+01 1.035715812061878864e+02 1.113836856766536130e+02 3.846642841758072251e+01 5.652243485617109542e+00
1.269363565978723756e+02 1.083123942568703910e+02 5.692438813928539787e+01 4.540962726373123104e+01 4.729210415111661803e+01 1.840262915752942874e+01 1.245821236743329230e+01 1.321004332647751767e+01 1.505525929132455687e+01 5.754415485032096456e+01 1.608287322535191777e+01 1.592792929025214299e+01 1.395591717000177390e+01 1.608143330540045568e+01 4.335736607828057743e+01 2.858805980917764344e+01 1.854263586018499410e+01 1.068996157797373669e+01 9.063632842017259605e+00 6.729602744578338402e+00 5.006383772533145482e+00 6.734269525653519217e+00 9.685397332835105288e+00 2.283406576085198481e+01 3.908324885562211648e+01 1.825380635418524733e+01 2.834053060272815117e+01 1.779303123434220169e+01 1.727473417196857497e+01 1.079602764526617520e+01
1.705370957923938136e+02 9.466336117414270745e+01 5.815768127450080982e+01 8.612191465482322883e+01 8.514113579486451044e+01 4.835304577600499698e+01 1.698586472593976566e+02 1.328733676425635224e+02 2.010128034727929958e+01 1.399201404940533422e+01 4.993238817673176122e+00 1.190822072673521959e+01 3.292300426745813979e+01 3.335093565448065078e+01 9.575342294613393790e+01 6.786275219071808351e+01 2.063595079954325229e+01 2.357221025593319297e+01 1.049223364324326724e+01 4.420913407140656837e+00 3.875682582312061975e+00 5.676337178717476561e+00 8.347265847145092010e+00 2.445846842896492745e+01 2.434154953709436597e+01 5.637366720232220629e+00 6.032685989517085901e+00 7.358233683401403269e+00 2.306258039716382058e+01 4.689638690569142732e+00
2.272222421699390793e+02 2.093562046510008088e+02 6.890187684110911448e+01 2.555111999623999850e+02 3.356470403368723510e+02 6.657601431264324674e+02 4.602914078617180849e+02 5.392570457629990699e+01 1.982676358455626087e+01 1.102996680241530569e+01 3.219273763752879436e+00 4.184372206259244109e+00 4.919974111281617546e+00 1.806347567795855014e+01 2.123562305887515222e+01 9.113812023124971518e+00 8.332650167646981743e+00 9.495092728822751127e+00 1.261566885735051713e+01 6.714578995103757109e+00 3.699511332061162783e+00 4.978429634571403639e+00 5.455094007290514746e+00 8.644437571373595475e+00 2.613452677557479831e+01 3.930861728871855032e+00 5.403805071686726968e+00 8.559439316106891127e+00 1.003421880385092635e+01 1.992562210316927107e+01
1.228025098745505375e+02 3.256984657200766833e+02 1.052705336251317760e+02 1.214969485175845705e+02 6.569749005591712603e+02 7.271796543644220492e+02 4.986382172780193969e+02 3.532379757161726275e+01 2.538021365398615004e+01 2.313419342311949478e+01 9.249885911072267319e+00 4.571928062965376682e+00 2.920283356920030826e+00 4.793950779484958069e+00 2.195953074623291457e+01 6.265813274309977032e+00 2.048518531452471692e+01 1.141140629998444638e+02 1.932538308431551286e+02 2.596878892312861353e+01 5.101434832740812553e+00 6.408138946414069892e+00 5.406375417069053668e+00 5.665105519021305547e+00 7.258017862381493046e+00 5.307263603975893140e+00 5.938551752781116910e+00 7.130083352305929267e+00 9.345277675430175179e+00 2.291587044678203000e+01
