4.005057454401166235e-03 5.870867274976900724e-03 5.093803490263486104e-03 6.414772690530843452e-03 4.825144041617214843e-03 1.053009924618596160e-02 1.037445564908045029e-02 2.791700973756040816e-02 5.062849400549404577e-02 2.261175158486967984e-02 1.047034515563119612e-02 2.369463184240297535e-03 1.377411418217510796e-03 5.115882156631760061e-03 5.952963749876332387e-03 1.310834837676261126e-03 4.672440937850763990e-03 8.281456394403342858e-03 7.615086344001964144e-03 2.706647673951261511e-03 2.136657397342284215e-03 2.607723005549961864e-02 2.012871075720238517e-02 9.018429633998548221e-04 1.700513926361256218e-03 1.295936062608930329e-03 5.818117512530248531e-04 4.948960520094579027e-03 4.680387377286685663e-03 5.829929173812557416e-03
3.179561986103557336e-03 6.954585204360009057e-03 1.251073977597911419e-02 1.013029363761673921e-02 7.025931334800877143e-03 3.139824695378317515e-02 1.492451806570620557e-02 1.851528076990778537e-02 1.204168333733173467e-02 1.019740168787918767e-02 7.257796360950670780e-03 1.411915300104510818e-03 1.858838719141189116e-03 4.212307382634531035e-03 5.811606402184545626e-03 3.710753990253385162e-03 4.616306683889933107e-03 1.521329781920474460e-02 1.161044822255464376e-02 3.521272573516392133e-03 1.233101086527831460e-03 2.427488594462136329e-02 5.576105991796365124e-04 4.793253130665829208e-04 4.065267380489599909e-04 5.235963316835772841e-04 1.884915839538517379e-02 4.877268727921569950e-03 6.939402474794447578e-03 6.944792428393388450e-03
3.910230150491290912e-02 3.887855656313463776e-02 8.230350716048479010e-02 6.637833061963813175e-02 1.419220238206892748e-01 1.446529554549834048e-02 2.707523170120381198e-03 2.874064190579075917e-03 4.623230872397962599e-02 1.406533628228255443e-02 3.785144793523680801e-02 2.502589993755839626e-02 9.091067394542804228e-03 1.313086315926343707e-02 2.459716148286539110e-03 1.015995806102565346e-02 6.806292391358066858e-03 1.400701979385571283e-02 4.694316200490941671e-02 7.841188644557909454e-03 7.363517494008899739e-04 1.962075096098645985e-02 3.000724588129854986e-02 1.051581499729268079e-02 6.289814986274426187e-03 4.195643302620923748e-03 3.765769039240709180e-03 2.984266511732999033e-03 5.072057537359509795e-03 5.743288972045850968e-03
1.836282070236420344e-02 5.151052360864604579e-02 1.131909558822334766e-01 9.069519647285878561e-02 3.760021800741374098e-02 5.791121321315218992e-03 4.576574172815880449e-03 3.016368370306637525e-03 1.827075655019024534e-03 1.712172850342711522e-02 1.101952676224998706e-02 2.197050520197061860e-02 9.863468520219555169e-03 6.486174018828064040e-03 1.860933277224513255e-03 1.380250303339943408e-03 2.869075912607496961e-03 5.364170380590543158e-03 3.832161577851206716e-03 3.279762732171139124e-03 1.473870439999844240e-03 4.945180470204682457e-04 1.417032535317162487e-02 2.740731743211974325e-02 5.116973643843359190e-03 3.781626314266600328e-03 3.251293060189521487e-03 3.076609844990732014e-03 6.135929042831594210e-03 6.756637962959942054e-03
1.076966910684508741e-02 3.292271419671475435e-02 9.165098029723478534e-02 3.548854991335036180e-02 2.050068703434027723e-02 2.958949556374049043e-03 4.451371521937414269e-03 2.431357856100008902e-03 1.098645672036296060e-03 3.865453711383120411e-02 4.853729602127718201e-02 4.182323401519053019e-02 6.139084321076796608e-03 4.975024690655406763e-03 2.256984824968139881e-03 8.050421461694153924e-04 8.592155586987492225e-03 4.942850681355070823e-03 8.013391893032999896e-03 4.594791933506917579e-03 3.154713117968168182e-03 8.698757643230197942e-04 1.881232369845848868e-03 4.921028150998570886e-04 9.259397482505461741e-03 5.047328361579587683e-03 3.502742525645509853e-03 4.057198214663592165e-03 6.239297185215141386e-03 2.329607192617182479e-02
1.090262611270645041e-02 1.137329996838253032e-02 5.087961699006844640e-02 4.065765928282923797e-02 1.615972775623566657e-02 1.703028798817992099e-03 2.017899729443911605e-03 2.103847653168913756e-03 1.910451315561546588e-03 5.856401031939265783e-02 4.631604454981146091e-02 2.476540126110041151e-02 2.807023144999532850e-03 8.176459989829363943e-04 4.052128751803192597e-02 9.180185113742956021e-04 4.775790093771272241e-03 1.249742459631599141e-03 4.085985184224028705e-03 1.412966014905281051e-02 1.726820910284951327e-02 1.022877422441829595e-02 2.522568442468522965e-03 2.815093804508313896e-02 1.394374512227181465e-02 1.324805336249471402e-02 8.208357007807243894e-03 5.672274821618129154e-03 7.344416692982851970e-03 1.346331380741168718e-02
1.522048120452930853e-03 2.424777227114858526e-03 2.559726355146120860e-03 1.295970919270048038e-02 6.205824624093419714e-03 1.009949497343840680e-02 1.481086250225636253e-02 8.165664461184754877e-03 9.357511134556495067e-03 1.109782213824053732e-02 8.678574865515053388e-03 3.634918879635494655e-03 1.486039720062637751e-03 3.512658530413854951e-02 1.844893676920122613e-02 3.271915577894553284e-02 2.715892349885389023e-03 1.294869707287229577e-03 6.664206396452364636e-03 9.167647157343037159e-03 4.254355221192527431e-03 1.016451464942306690e-03 3.283331094804401579e-02 2.575414194478242019e-02 9.574278075240937047e-03 9.876406303137394427e-03 8.566688777453741396e-03 7.469151670088838846e-03 8.535772302781814008e-03 2.067955138556628117e-02
3.275806834720772134e-03 6.056492259283487167e-03 3.535737577936694329e-03 7.610806234960038746e-03 1.162637915062331509e-02 1.279612051249678917e-02 1.098436288797129470e-02 1.003201563532608864e-02 7.804347606383592317e-03 4.459711835224448515e-03 1.824942097553140883e-03 5.723285585065992012e-03 1.217211778249413425e-03 2.469127730672084076e-02 2.524447427701960109e-02 6.930486644897396360e-04 5.728496478168059423e-03 9.217082966599418267e-03 8.153370949045481153e-03 5.830414464138396896e-03 1.589240734275520388e-03 7.374359081123418782e-04 1.978181845216893386e-02 1.544539353885935468e-02 7.261116608805136263e-03 7.613358094210606955e-03 1.167949023436036689e-02 1.479824636502398254e-02 1.488704988458115080e-02 5.145958195375610394e-04
8.590083439333253898e-03 5.668906035625491738e-03 3.323315308421363832e-03 1.923906821385405058e-02 1.245916019181987286e-02 5.169521429534319409e-03 1.619038434104318191e-02 7.039099424640496427e-03 5.730172107650398534e-03 5.756240396274321658e-03 5.214296340500598412e-03 6.966460013536254423e-03 1.526628529702674618e-02 9.910295490726453785e-03 1.460593532862195388e-03 1.316609311162644531e-03 5.717664433619928065e-03 1.740674086876448090e-02 1.724226800635684717e-02 2.888189885819933238e-03 3.275816690572412593e-02 2.573950470764838766e-02 2.462232981878371973e-02 1.509803851334674124e-02 8.691631287913646059e-03 1.329651731588037816e-02 5.219790516680742221e-04 1.114176074182000745e-03 3.400803848453072542e-03 1.774356826971637806e-03
1.412425950253491311e-02 9.215692966381094225e-03 1.479552277795626730e-02 1.380298067800216771e-02 1.209698302618819957e-02 2.346486017909588800e-03 1.061110001853279167e-02 4.379523895516098525e-03 1.779570013610533557e-03 4.371949970976723304e-02 1.003168977867580428e-02 9.856124672663345992e-03 2.104374346428900325e-02 2.297358762690711320e-02 1.103166212099076018e-02 1.207615850453379672e-02 6.456722179126642147e-02 6.690008511598445617e-02 2.692454190277172865e-02 1.200576971101211844e-02 4.112503395067027001e-02 1.971024513516595605e-02 2.028615187826218400e-02 2.117258209996610019e-02 1.145444126278617053e-02 1.462869510438999029e-02 1.506220059511063783e-03 2.733553013576130782e-03 3.583315219953615328e-03 9.862130128297855181e-04
1.161798096666016335e-02 6.060707689983341542e-03 1.364649863547276985e-02 1.165591596346361725e-02 1.484586168733411510e-02 1.344429087955562388e-03 1.101373682344271472e-03 9.282469794386769479e-04 3.736715520220434267e-02 5.089473635411557312e-03 8.035346242610287570e-02 1.344002627184114340e-01 2.805878264293314439e-01 1.409797925518048167e-01 2.645183077965395507e-02 5.215855285124094964e-02 9.674914652639654555e-02 2.677098251803436413e-02 6.407250957885256976e-03 1.278359684101451881e-03 2.874911441844696380e-02 2.003267115696766645e-02 2.374307998331305625e-02 3.203147812047344584e-02 3.330563367503808214e-02 1.776545266824069991e-02 2.776494899215596612e-02 2.234084737260381981e-02 2.006893642939071298e-02 1.440724404071054912e-02
2.113140617088329551e-03 1.241259932283275951e-03 1.105858985290068298e-02 1.091985821065085197e-02 8.561422818705827914e-03 1.938533293444448741e-03 4.662087098021172604e-02 2.978864153361514971e-02 3.665648054645947312e-02 1.013351559553985273e-02 2.461248697545301289e-02 1.604631106907472571e-01 2.903791459874798253e-01 1.541155774007123003e-01 5.701883327110227745e-02 6.532532160210265115e-02 7.229699912233548964e-02 4.282948655426718071e-02 1.059690739687738428e-02 2.990575515950443918e-03 2.722229990528087645e-02 2.410919497685077781e-02 2.716750510196097243e-02 7.026671452215835917e-04 6.502061848760410864e-04 3.137883850092557103e-02 2.365912045402692246e-02 2.128884832932691207e-02 2.255705274243703998e-02 2.389005115481874358e-02
2.441057672781947463e-02 1.020474172214059149e-03 2.535988542682560652e-03 7.274803378360697632e-03 4.793820473842557925e-03 1.492459916037379430e-03 7.362190266702565858e-04 3.968710672254450317e-02 7.106993363531557972e-04 5.158162856517073402e-03 1.716697578195777382e-03 5.178097365524348544e-02 2.190505892941970734e-01 9.589207803309543476e-02 3.090555693995094416e-02 3.647944969910457691e-02 1.354584205810065861e-02 1.995894954355362585e-02 2.283960830952103810e-02 8.572812482978009116e-03 3.336528315429915237e-02 2.984180081652406183e-02 3.581800582186876053e-02 9.941210651056519264e-04 1.278125320053187693e-03 1.171873924243863442e-03 8.429155613566707448e-04 4.779215900328719069e-02 3.582479772470669593e-02 2.718875849337066414e-02
1.917491544537731213e-02 8.749842951696290647e-04 1.646850151739154711e-03 1.226698026333161587e-03 4.529409036627768392e-02 2.848177381168386264e-03 9.515718028109920040e-03 7.957734353648389380e-03 1.005170434991928003e-03 2.231936131019720410e-02 1.274943182971985172e-03 8.481590074697550885e-03 1.006598395042265642e-01 1.396095199490805239e-01 1.529672751228840777e-01 2.114980867609879689e-01 1.916454363478808098e-01 1.246125541535253733e-01 3.409976611941794578e-01 1.595969326728640114e-01 1.320846700876619935e-02 3.818846071293981442e-03 2.842328206296361806e-03 7.069744143657560875e-03 1.613554739592255871e-02 1.480325186424102241e-02 3.975603190095871459e-02 1.270367697478812230e-02 9.589563638095171920e-04 8.617322007279595722e-04
1.753836745913157913e-02 1.771245483732433040e-02 7.841353005404345933e-04 5.930648876745543523e-03 2.158863484826434222e-03 3.235886183315365983e-02 6.420633090161935452e-03 1.843263909202417020e-02 1.237998424070902055e-02 1.278996920506443331e-03 2.730772749409243229e-03 4.293271463312915009e-02 9.136797342851891990e-02 1.180018431898023079e-01 1.086377977459315469e-01 1.336877596337726348e-01 2.297252480835731137e-01 3.990972626434313719e-01 4.097388039252416458e-01 3.265808900184143937e-01 1.400350091627193538e-02 1.464760215597477738e-02 1.289376290000120162e-02 3.988518044281193914e-02 5.610040157967456642e-02 2.808430862217283219e-01 2.759420735747656894e-01 5.481075764777119941e-02 1.166347689451504004e-03 4.035451986516312706e-02
1.566062355720256732e-02 1.722386124733300827e-02 3.997756048938733847e-02 4.460221109122952665e-02 2.973710064317935248e-02 3.390192457716200564e-02 3.567467747570656801e-03 1.002367819992179034e-02 2.081936125181222536e-02 7.489091519228122107e-03 7.748729817893562979e-03 6.719921702758948484e-03 5.237752287701027964e-02 1.075672160910304542e-01 1.018035100525578052e-01 1.577007969205650728e-01 2.743847308750527736e-01 3.364394611976851968e-01 1.973960848019896130e-01 4.371692309495836537e-02 2.620506561869067469e-02 1.791656947633618047e-01 2.583490410747764088e-01 4.264495178520513186e-01 3.913340901519773984e-01 4.981916589481553137e-01 3.929774493047500372e-01 1.117035465512677128e-01 1.870983793483506439e-03 4.762197289070175393e-02
1.938564072539822672e-02 2.272262972036493897e-02 2.268734212081316773e-02 2.179642472853061258e-02 3.341442162218712097e-02 1.007496141186035605e-03 5.894321368189496535e-02 1.975742358882208727e-01 9.698133463076946681e-02 1.665838192191258088e-02 1.239768159486551516e-02 1.926447285807786347e-02 3.813383566255496016e-02 5.654756615111018042e-02 7.491632566201825161e-02 1.346900372732496021e-01 2.923266275289687632e-01 3.000022317510825376e-01 1.452813949416853212e-01 5.058577089306756647e-02 2.155024008043311956e-01 3.850483351619322647e-01 4.874566379518752157e-01 4.916654004856009785e-01 4.236694990690565987e-01 3.581879920365849679e-01 5.206528385028390549e-01 9.069568890158291596e-02 2.866135740712961143e-03 1.185197688291162810e-03
7.191832029315348325e-04 3.758164651755059593e-02 1.983463399272088895e-02 3.146526159466498523e-02 5.754805977375342108e-03 2.901723364955123216e-02 1.623361803102049139e-01 1.326768330064310164e-01 1.313890632417433479e-01 6.611116668318568756e-02 2.430428120137891751e-02 6.546733664144002707e-03 6.404430900048703121e-03 1.645985912822794939e-02 3.685125817275094334e-02 1.686375253111653816e-01 1.792245286352125988e-01 2.142249393051006701e-01 3.815428866159889520e-02 6.810379765168485255e-02 2.371317600911891366e-01 5.034766066265857765e-01 6.120811038030190554e-01 6.225738597135962449e-01 5.033944049366617657e-01 4.736868985444815383e-01 4.315470943799936676e-01 3.421766941506649840e-01 1.518568692613283394e-02 1.001140538487037789e-02
2.092521934401993244e-02 8.625470321982482659e-04 1.579523099096679858e-03 1.084753427283143522e-02 2.390338355274001375e-02 3.363355790573215737e-02 1.057939461134137227e-01 1.313545908687620556e-01 9.026549664134481121e-02 7.050064085769033873e-02 1.487691350845251823e-02 1.462166176849666842e-03 2.214618974950128237e-03 6.193426079530902836e-03 1.328170236031298371e-02 7.746368666465840158e-02 2.997483880180409899e-02 9.816081218252132451e-03 3.356416114422763886e-03 2.448997949517117342e-02 9.112406497812158834e-02 4.754419662696768856e-01 5.919612921911868719e-01 6.111076317220438536e-01 4.400799697089786688e-01 2.004710662178667557e-01 3.194593269325403107e-01 2.192635001107174908e-01 1.977106055010267871e-02 7.804548984699564637e-03
7.671282215335874753e-03 9.899819050967571116e-03 6.628720633108833860e-03 8.225453332698792752e-03 1.941146999136597259e-02 1.105888223106546962e-02 5.647117872148060130e-02 7.205782514004095696e-02 6.615726521635380275e-02 1.568415291685978583e-02 3.960933580960489600e-03 8.400411728454175875e-04 1.464680006455334853e-03 4.260041948520355143e-03 1.662156336420184816e-02 1.099276976628807585e-02 2.038507179779319722e-02 6.144246243347332645e-03 1.170686721453541475e-02 5.541263529047787961e-02 2.915586517900897734e-01 5.421248518259100813e-01 5.734495002666553098e-01 5.406155377670937012e-01 4.118133269514625550e-01 2.986801768162926085e-01 2.866155909836644033e-01 1.931088906717696452e-01 1.738599526724359315e-02 6.188796823696688862e-03
2.133197940572676213e-02 1.963051746019876115e-02 1.023750240656374003e-02 7.451004408492173034e-03 9.794092651991902210e-03 5.203018499774061771e-03 2.918817583983415731e-02 2.559704783570136699e-02 6.952237359944430165e-03 3.814257634575132609e-03 1.327274813608608686e-03 1.063359041078795145e-03 6.380911070672461551e-04 2.888399930913753549e-02 9.119050461893780241e-04 3.044360984004543073e-03 1.101675527658132689e-02 2.553662561551336974e-02 2.494255282275158539e-02 1.115686399746682878e-01 2.990674590552823142e-01 4.275290469439904095e-01 1.720086856578464107e-01 2.573555446079343056e-01 3.313834941320032978e-01 1.868685581686065356e-01 1.389554830926145457e-01 1.141257245872847881e-01 4.183125916043781839e-03 3.781225976549074715e-03
1.717073770454854986e-02 1.985649506826187710e-02 2.988740957208774196e-03 2.104802268606464563e-03 1.754847094761001480e-03 2.593555089473426924e-03 3.636136046133050387e-03 8.893884287217817793e-04 1.133418939244568808e-03 1.740048540427614754e-02 2.266676389008551867e-02 3.819148868993084596e-04 4.291945504210962180e-04 1.538568879782345640e-03 4.330990651307702055e-03 5.554868573962971900e-02 1.070737915939230095e-01 1.569931410717762821e-01 1.085817342088183923e-01 8.210580775515478880e-02 5.732655709123805898e-02 2.027287854633087749e-02 7.749106263886143368e-03 1.668485382191541022e-02 6.054489631509291092e-02 2.051043823832175705e-02 1.895261334033965239e-02 6.400408235791633406e-03 3.593852856724348566e-02 2.938564914131102518e-02
3.633038630747335851e-02 2.809082119766904279e-02 3.100508763691363270e-03 1.359281721644233464e-03 2.021975032587689132e-03 1.563015321816888089e-03 2.372527105211583512e-03 2.377831907237552139e-02 2.011047607962145739e-02 8.665786157966584233e-03 2.045626057593407515e-02 4.255349937091289616e-04 5.777390447244273603e-04 3.162486689421987324e-03 5.234374648099766533e-03 3.281593854427643231e-02 1.206086462816838706e-01 2.275281222179413032e-01 2.608621774637526203e-01 2.275839359580045240e-01 4.786476756215830852e-02 1.054503660608666418e-02 1.286425144422446987e-02 3.132824193251938782e-02 6.979497087171149250e-02 2.059948960950205160e-02 7.924303906595792091e-03 2.979250635467293497e-03 4.648744562289425231e-02 4.164747018136110562e-02
4.525643034178607887e-02 5.782858984354694205e-03 1.637875430212832814e-03 5.454640562171536068e-04 6.280624762987345889e-04 1.360534092527915500e-03 1.722313408182385083e-03 1.790377321239721570e-02 9.912637716262596294e-03 1.139665307577701799e-02 2.009045421084361752e-02 3.728041475237621038e-04 4.322420470296393512e-04 2.458649874659008666e-03 9.764924858241090522e-03 4.770636147389366311e-02 9.291185287442671470e-02 2.158057323207028533e-01 2.736981741114085098e-01 2.321074866549178717e-01 1.144103901464284812e-01 6.501488794177986974e-03 4.540520873702208818e-03 9.759631414295108151e-03 5.616719362248619174e-02 3.363638743646871904e-02 3.034311169265393321e-02 5.688475144020148366e-03 4.130465013493457571e-02 3.155548335152655315e-02
2.511288217078234963e-02 7.802746233643978457e-03 3.107003688369077993e-03 2.950653512383617002e-03 6.655549488465986596e-03 4.514472208201229103e-03 1.836763661449869640e-03 7.359399107112101282e-04 1.080159224508555216e-03 1.420251692055056903e-03 1.254390886846498514e-02 1.406487898369803563e-02 2.175019911229184727e-02 5.700641441748192277e-04 3.558602918146751889e-03 1.486144877477095505e-02 1.515752812941683660e-02 6.552069181139011378e-02 8.478071464104842969e-02 7.292105549679646359e-02 6.042007707786395398e-02 7.682071467305236559e-03 1.162620242987866650e-03 2.256367249963817014e-03 9.975438952150547309e-03 2.490766239506527618e-02 6.689320708370560808e-02 3.738546717325899604e-02 4.867071686551496801e-02 3.647542469733332932e-02
8.990834976098727518e-03 3.579389798596296392e-03 3.917559494630009839e-03 6.737886329508882208e-03 3.738124018966437583e-03 1.662796936802039827e-03 7.517647519291262032e-04 5.169616074675918802e-04 1.604321478802082750e-03 6.259860497959243188e-03 4.281734578686241543e-04 1.384994390985736477e-02 2.325470721095564131e-02 5.895737874568779445e-04 2.898578782970121209e-03 5.335998513532889606e-03 3.748352360528190569e-03 1.891689009981822878e-03 3.028817800416263705e-03 5.553625620336063301e-03 9.827414015299573702e-03 2.229413432267568062e-03 1.142213928894526831e-03 5.819874180691256282e-03 1.416553460227963634e-02 5.017902690689212720e-03 1.725566700219880595e-02 1.917270224053269426e-02 6.755046269399886741e-03 5.572486840336969560e-02
9.115347002178517122e-03 7.345052374108955104e-03 3.666911287824903797e-03 2.744512023299919019e-03 2.594835947930356802e-03 9.665909952011881960e-04 6.277316915727338374e-04 6.294359056222100565e-04 6.815424992690962682e-04 2.740910582929987314e-03 7.769956203493829164e-04 7.404023072928637116e-04 7.194451670899820218e-04 9.343402911400266672e-04 2.810511567195070771e-03 2.033274691110773490e-03 1.459589483242740814e-03 9.225519301142074118e-04 8.529593353366342508e-04 4.530060648157890196e-02 3.559178452566751777e-02 5.133669285196845733e-02 1.313824333030364682e-03 3.335402696526640516e-03 5.944849366237382748e-03 2.888812764163510398e-03 4.650777627084743543e-03 3.071380516077218143e-03 3.075341317950429539e-03 1.961104968883268726e-03
1.234918238307513606e-02 6.468425915420059936e-03 3.769850703498806889e-03 5.264537858676705817e-03 4.697749968584259000e-03 2.530247001554734865e-03 8.496157410508440450e-03 6.307265198793525311e-03 9.173996956663467428e-04 6.703487998871970324e-04 2.263533588286100601e-02 5.522237182922686699e-04 1.688935035900020719e-03 1.958264556955289972e-03 6.334956224066050530e-03 4.950216940309452168e-03 1.667215497661180164e-03 2.095964678602327616e-03 1.019949239438052314e-03 3.080832605254720663e-02 2.780307788049608472e-02 4.216487537980624645e-02 1.014392771959605859e-03 3.294057192734000175e-03 3.521609284112825478e-03 5.100260603554956224e-02 5.681525940352266657e-02 1.287230730503000206e-03 4.197043539059540189e-03 4.712684849308726442e-02
1.661508868622674218e-02 1.444666288686366311e-02 4.483955342962224998e-03 1.566818256118708216e-02 1.844216796879712128e-02 3.446990576285594021e-02 2.283980947001316292e-02 2.548601651288315111e-03 9.061287581225878959e-04 5.274730675708483134e-04 1.473738720413171090e-02 1.827533789557614016e-02 2.277866698357998432e-02 1.073347612825388195e-03 1.420999803504320201e-03 6.728079638559613914e-04 7.018132100523096634e-04 9.028328705514599177e-04 1.300360192068509505e-03 7.154645736305261829e-04 2.622535718886902928e-02 3.550579891430952206e-02 3.976907838499046943e-02 1.066130083780064035e-03 3.603375076929124336e-03 3.542705779720398823e-02 5.161149659847087678e-02 1.518119991312298807e-03 1.857318435848958433e-03 3.737952089410510360e-03
9.234731357769804597e-03 2.309781524381202683e-02 7.008023585504320752e-03 7.613726425138463844e-03 3.716035886991798931e-02 3.900127866285935802e-02 2.579549705232882240e-02 1.756839951933139143e-03 1.230043809753311604e-03 1.175094050581837121e-03 4.872289350739441964e-04 2.220553003153490773e-02 1.433876301454406824e-02 2.559862018632780636e-02 1.584464129798725425e-03 3.726428297361310954e-02 1.899081862435351813e-03 1.224983800757585214e-02 2.296769230688303076e-02 3.227685136061712347e-03 3.938445787554589045e-02 4.969842243284970651e-02 4.215587163321213304e-02 4.777428275510398059e-02 1.129345612687705823e-03 5.117024253329671701e-02 6.087113661589978186e-02 1.421449222744977604e-03 1.945294104010514800e-03 4.835723366939558704e-03
