7.134191226516156670e-02 1.867158478114051877e-03 8.260296494147227608e-02 1.148522288030514064e-03 7.615058779429442759e-02 1.032705988545135805e-03 5.227189576283978361e-04 1.415093652827120350e-03 2.574302355412992106e-03 1.180644513608350302e-03 1.514366284893997128e-03 4.908628447834078451e-02 3.147331122602823467e-02 1.213155605092659621e-03 1.257923370018543784e-03 3.371785813454808434e-02 7.587079851401455242e-04 3.959999223587853381e-04 7.625608380210701981e-04 1.206876025336351271e-01 1.102883610344659732e-01 1.647971476524014503e-02 1.243959548759814189e-02 4.885952931313117947e-02 9.305979130150018874e-02 7.157933970565270865e-02 3.223274006864743080e-02 2.848705702930957352e-03 2.733514016054375100e-03 3.456998730295294045e-03
4.643868206354739847e-02 1.826896849184777346e-03 1.358402679351672446e-03 1.462823687772847386e-03 6.012724784799222677e-04 3.382432880638665176e-03 1.329759222725740864e-03 1.634109805708586563e-03 8.151921737920953632e-04 5.102421817684712037e-04 9.338444769552503317e-04 2.462993693849326732e-02 3.624746681586476366e-02 8.712041676534496015e-02 1.361517538659566626e-03 9.235062388971421177e-02 7.083978688413013550e-04 7.344907901331299005e-04 1.122604526033695255e-03 8.479230264002493838e-04 6.458437979518630301e-02 1.617487817765884961e-02 3.326034079309548447e-02 2.921606491136552811e-02 2.528290436182897491e-02 3.308995360467614777e-02 1.133133123926487879e-02 2.892777008555592021e-03 4.135940824282997169e-03 4.154039288914803535e-03
2.643632287680081506e-03 2.485783785797459310e-03 3.641181151772972507e-03 2.959125880029403032e-03 9.030897941159153619e-03 2.834024270141094481e-03 4.030842048725608029e-02 4.272167161927577922e-02 5.537080929455038755e-03 7.942496011796523021e-04 2.076813857901747742e-03 1.885870986208998141e-03 1.226204930108677413e-03 2.729286383973371800e-03 5.632971732824345462e-02 2.761129269140562888e-03 1.306483855498256430e-03 1.262457836008829687e-03 2.218579715525493060e-03 1.150555346169956352e-03 4.061619487054311806e-02 1.363956375682664687e-02 2.076525908886549948e-02 7.106346976973747058e-03 4.101484859125687117e-03 2.622473464437062324e-03 2.268239846040343271e-03 1.788456691015952041e-03 3.062057253138214790e-03 3.444965674209364039e-03
8.259490272834333008e-04 2.250334867940515134e-03 4.935439269617983120e-03 3.986318296986330473e-03 3.316177487753846874e-03 8.168302589582607243e-02 8.198348067495561664e-02 5.138062223472871642e-02 2.811785898725501984e-02 1.109697604691797920e-03 5.295055082225204844e-04 1.056735492024921510e-03 1.775008630045840381e-03 2.576278631310117018e-03 4.352789331762164926e-02 3.792472607239483207e-02 8.279374342212414417e-02 4.711794378326381559e-04 1.849976803293226671e-04 3.402248678045317128e-04 7.007225505349447270e-02 2.793662873380649281e-02 9.634942256204939715e-03 1.879522533176129079e-02 3.361325627448086186e-03 2.342388147531692527e-03 1.960703561951305639e-03 1.864809605923540116e-03 3.796327034681737031e-03 4.133750525937861242e-03
4.766382420515076750e-04 1.407617728583887996e-03 3.922397984968684082e-03 1.522188079818131545e-03 2.173783448367722602e-03 4.814492709519915120e-02 8.462174826418021600e-02 4.800065306998411996e-02 1.779144015507279700e-02 3.014204873455523116e-03 2.452209635405350197e-03 3.298213646688203781e-03 1.591593557638030241e-03 1.066466384008911139e-01 5.643527584618157622e-02 2.271338425214680656e-02 2.033699451952883028e-03 5.526514991203389498e-04 6.029406792028943907e-04 3.696538050510607605e-04 3.870117354317618064e-04 3.578648801207803126e-02 9.274352637066403393e-02 3.043532346861721818e-02 6.041423674532352475e-03 3.154281652480316837e-03 2.160104079454720945e-03 2.502267895452897021e-03 3.922221241071507415e-03 1.444851903779466144e-02
1.226859835795857936e-03 1.299929553719041987e-03 3.904376202346900721e-03 2.225070876710744366e-03 1.419789049696850661e-03 2.733995083579928570e-02 3.511352785192344700e-02 3.763206466550531037e-02 3.067602680453490951e-02 4.105114837954939797e-03 3.843596034135204551e-03 3.670117272928959031e-03 4.838916349968457736e-02 1.813988102469190136e-02 1.521842396315382234e-02 2.560273639983940905e-02 1.545079778144812024e-03 3.460242880658431081e-02 4.078655378751059311e-04 6.979707663360937720e-04 1.444927774294962712e-03 2.821380085033623440e-03 1.117538968579999681e-01 1.749133104689874763e-02 8.969758677596910423e-03 8.301333791464351672e-03 5.156367291576961602e-03 3.561749098305908023e-03 4.711410661730064918e-03 8.485656433528424372e-03
2.691824656212839922e-02 4.059748384114682945e-02 3.981457553468701477e-02 1.354225535463601761e-03 3.618546810284261391e-04 1.004818350121750373e-03 2.214260974069715525e-03 1.236370555350171756e-03 1.591010496375767219e-03 1.671444898881224023e-03 2.309292708968562792e-03 5.851324596035645254e-02 2.733818894835921345e-02 1.263362873846983481e-02 7.330884703342710647e-03 1.260408989204522129e-02 7.154817760465570498e-02 3.221999474022646526e-02 6.295956511542115429e-04 9.241627137511610043e-04 8.073145814901136041e-04 3.404711397871357931e-02 1.616466111461715635e-02 1.560155698248398559e-02 6.051762966958307288e-03 6.213006909849615872e-03 5.486552487206337349e-03 4.748115047652418270e-03 5.452193688588619427e-03 1.298279831440561291e-02
5.661608593955769209e-02 1.047996211701671121e-01 5.790991468905525019e-02 1.109847537637326763e-03 8.690188824538898479e-04 9.772634831746443082e-04 8.804133818314215446e-04 5.114404303879123165e-04 8.914801003138510260e-04 7.782489190746279262e-02 3.342733074768901302e-02 1.063486380540439175e-01 2.319095807784719854e-02 8.261397012258702918e-03 9.350283176953962799e-03 1.729392982729651210e-02 1.377697217227970413e-03 1.454096314311766492e-03 8.445330883130002094e-04 8.762833821830426449e-04 4.804761242588143771e-02 2.851571403351286019e-02 1.164310366920217471e-02 9.808665142490105918e-03 4.680683183136606293e-03 4.889104878470203717e-03 7.596671300691196053e-03 8.573450040635983982e-03 8.515681004064693665e-03 2.472527503601552878e-02
3.912216534695716133e-03 8.734475465882295120e-02 5.059986842566715354e-02 2.539992613730691733e-03 1.209449322497100666e-03 7.470095870922782710e-02 2.771560968905398790e-03 1.176263493687026030e-03 1.458176328525665052e-03 1.845859633625716390e-03 1.038739295934220791e-01 2.440712750822136932e-03 3.319981128693736717e-03 1.404247787732969309e-03 3.024082111615679358e-02 2.549681407593140312e-02 5.407942353622825467e-04 9.241872584848537806e-04 1.358951479438345314e-03 6.437507086488196417e-02 1.291652759277743534e-02 1.358055679365645710e-02 1.492033003099206730e-02 9.798380943689250638e-03 5.742701390640043112e-03 8.626333831950388706e-03 3.213013997980758429e-02 5.688113405325305461e-02 2.159003637865874320e-03 7.661969666577987670e-02
2.708118408926847055e-03 2.013321059192103683e-03 3.222786602754783205e-03 1.180281647037131378e-03 1.451155235860616174e-03 3.611254820178048247e-02 3.137645109596124814e-03 7.944539473598689894e-02 3.721772169915633227e-02 1.359719501088154509e-02 1.945714024900361151e-03 1.496287901488974189e-03 1.137488887595068925e-03 1.672321302380743975e-03 9.228882859465665188e-04 9.930008983603511290e-04 4.072493156414533182e-03 3.570058290647885619e-03 2.523155755950019178e-03 2.044692277039710047e-03 1.672716147595533498e-02 1.067307931241156735e-02 1.236866785560251751e-02 1.363847042218277288e-02 7.612742227699505551e-03 9.606327130424851049e-03 8.744823909830611031e-02 1.322214091974448225e-01 2.235852376419748648e-03 4.074233311167382854e-02
2.735425483191368957e-03 8.854393752292250008e-02 1.775341235139919413e-03 6.273251413822450787e-04 2.146299956962841385e-03 2.280329952561343382e-02 2.224174124285000637e-02 2.013601709135382639e-02 1.379039987065967983e-02 1.094210629372623506e-01 7.018991778318478710e-03 7.175922729636788865e-03 1.503158223490741463e-02 7.538280811748117143e-03 1.409038848271549835e-03 2.792982678163996157e-03 5.177781729771176004e-03 1.420528842377468889e-03 7.290854836234577719e-04 2.715386570674331243e-02 1.155643509166029079e-02 1.043396977017778740e-02 1.361931224587697997e-02 1.913497563071680369e-02 2.046264770776556191e-02 1.105430379878239062e-02 1.718991255689789402e-02 1.276348303878394735e-02 1.131317175760083830e-02 8.060003937106756389e-03
3.916747728622983760e-02 2.139274204707543661e-02 3.391684473103043131e-03 3.000014529951882791e-03 2.694818921935112320e-03 3.721119396135165458e-02 1.731290781859661301e-02 1.191691607605746724e-02 1.418219470782211555e-02 1.616502484986431353e-03 2.147218226034028950e-03 9.212852313553376513e-03 1.549603658352903535e-02 8.096883751902289594e-03 2.937422116144991057e-03 3.326183647134805296e-03 3.686876109600862195e-03 2.180118705217198860e-03 1.196665419720552770e-03 6.169518840410868205e-02 1.101640498471719194e-02 1.134044964183695062e-02 1.355785843848542060e-02 2.439407259599146727e-02 2.325602964684009982e-02 1.660906428087129474e-02 1.277841889350239506e-02 1.159946539380976929e-02 1.266996962640250246e-02 1.371860441821641692e-02
9.208677834524253702e-03 2.209203115413986215e-02 4.988225562908812916e-02 5.561904239927769819e-03 9.174040250847083355e-02 3.151687846487902234e-02 1.744226011732004367e-02 1.513159764198721870e-02 1.932196518093043380e-02 7.262422869745211763e-04 3.716088379731709995e-02 3.312765964819012511e-03 1.148840994310817119e-02 4.917212760067448882e-03 1.542690393100502226e-03 1.777808066526522218e-03 6.648724400833451453e-04 9.895067300711313935e-04 2.028401686342409110e-03 1.025299067299961960e-03 1.051345163896299714e-02 1.165267540132060298e-02 1.491666219800454399e-02 2.498047989083276507e-02 3.185028098493210280e-02 2.800639905196707080e-02 2.078407980221171417e-02 1.964477425492327720e-02 1.735359444690001349e-02 1.445165167583348405e-02
7.903743029423522179e-03 2.229644524537141570e-02 3.967437541030661985e-02 2.885827136428469747e-02 1.731107498837773997e-02 6.746018795900597664e-02 3.558106171775468965e-03 1.180708351173260758e-03 2.700716693050076236e-02 8.872682799847325316e-03 3.173094443520589614e-02 7.336162103693274041e-04 5.200514355105446615e-03 6.971552723788378841e-03 7.355593425703126076e-03 9.805695936945007379e-03 9.031479041858404139e-03 6.017153834147226897e-03 1.684059579830659778e-02 8.384881125615089789e-03 1.657833965434951651e-03 6.905387958973555063e-02 5.253178097863235585e-02 1.262819487560653819e-01 3.211573847959761120e-03 1.735773885590648690e-03 3.963768726253525526e-03 2.121015212918736861e-03 2.374819963238148160e-02 2.761037382805640872e-02
7.468682320204696017e-03 7.473547201417684270e-03 2.050904021591572202e-02 1.548688906179223057e-01 5.707390738941182234e-02 1.271615680685425978e-02 1.731842023728637041e-03 1.355293951201123328e-03 1.123686137447755477e-03 3.397617954485607217e-02 7.011110801657029212e-02 3.506183377351621260e-03 4.562131730768440203e-03 5.740895819905210765e-03 5.133872076669124436e-03 6.130009408847654148e-03 1.078154097911819195e-02 1.928014607551596302e-02 2.028967120943387867e-02 1.643526783244662545e-02 1.372439383473954668e-03 1.962322486158739419e-03 2.269738646037204079e-03 5.143024401253155214e-03 5.583636580671547632e-03 1.664628405158160088e-02 1.674555728311860267e-02 5.250289462656965687e-03 2.415865417838524223e-02 1.858328022927093273e-02
6.920109225817755796e-03 7.542572126022425993e-03 1.699589754396104574e-02 1.897181681294122721e-02 1.281613881415501199e-02 1.342785845427255098e-02 7.426076979661673516e-02 5.711614831533075526e-04 1.307224646645113167e-03 6.603483341441975006e-04 6.989787986690343922e-04 4.816760205691566761e-04 2.517664357892161840e-03 5.074501268522150187e-03 4.703561942980801283e-03 7.144367429634310325e-03 1.283041288153575696e-02 1.624489362688500901e-02 9.775747169176774581e-03 2.212064205258427139e-03 1.368761044373826685e-03 9.673813200990900862e-03 1.448340840274865531e-02 2.461989298811964946e-02 2.327132339788790319e-02 3.040505068158847260e-02 2.436928816912989001e-02 9.166462810986689483e-03 3.435260858339105744e-02 2.020385059115167511e-02
8.902773223124677698e-03 1.031993207862260536e-02 1.008243258938426590e-02 9.477506177706465987e-03 1.371610223997495048e-02 2.319316959439111231e-02 3.979092073898994608e-03 1.091819256386297905e-02 4.604705900946147283e-03 7.842503700286909641e-04 5.773399350897642562e-04 8.895716186112616330e-04 1.748930186383526554e-03 2.576510722401842510e-03 3.391928832270765110e-03 6.048060170549156463e-03 1.363654095072544710e-02 1.442856079847956545e-02 7.163155802929823367e-03 2.567349519528279791e-03 1.147645634964857345e-02 2.153453014409973526e-02 2.855282486546513107e-02 2.960021303938300402e-02 2.600727725548302935e-02 2.234034780651147217e-02 3.277257500975516019e-02 6.747657526142972727e-03 4.400429481854713915e-02 2.376613896627972899e-02
2.228716624446841488e-02 1.763832283358254815e-02 8.622633727085901242e-03 1.207546750305522366e-02 7.597850898414743384e-04 1.835946821441831415e-03 8.030332704623192527e-03 6.190743820600335366e-03 6.064353954585512824e-03 3.016354054480846654e-03 1.428296207062464303e-03 6.017843467768624983e-04 5.792621620208530985e-04 1.190943705434840396e-03 1.632371595149365853e-03 7.477603953419270817e-03 8.286695481833418822e-03 1.120804633371470273e-02 2.045919432425724778e-03 3.763262884683855111e-03 1.283644256929085403e-02 2.888475303361464838e-02 3.702064358000500821e-02 3.859712281544402240e-02 3.152015849973003464e-02 2.988729071245834965e-02 2.728953390989223571e-02 2.303824677303414892e-02 3.341841630930145277e-03 2.595616272223756800e-03
8.938132739789429043e-03 2.477398069005782091e-02 4.325835123181857866e-02 1.204557240620893850e-03 1.281834597549025376e-03 1.495717452598145734e-03 4.659034714125407511e-03 5.730394383145982588e-03 3.866040699362392492e-03 3.006162552801807091e-03 1.134006327370051977e-03 4.583671695459520801e-02 6.869972567140295028e-02 7.776978298448246297e-04 5.927880556470186942e-04 3.532357835077530421e-03 1.415328283011832054e-03 5.283395414844264818e-04 5.194841933305355264e-02 1.370293469987479565e-03 4.912215940691463251e-03 2.679026246646928899e-02 3.471162942622980918e-02 3.690733309636092668e-02 2.720087762903574888e-02 1.266208652412679873e-02 2.052622188089312308e-02 1.401012570066759860e-02 6.065626477308835862e-03 1.316668152905142164e-01
7.529056477058666992e-04 1.280178980160225858e-03 7.613732705692001588e-04 6.535585924904289447e-04 8.378497678521835230e-04 4.663999726251575424e-04 2.325588511121507926e-03 2.904526885696338042e-03 2.595737696922195605e-03 1.005921310792385866e-03 6.635011830803578831e-04 3.135825843568685461e-02 5.342576841078092859e-02 8.163653786806895560e-04 1.118236041222446346e-03 6.665006944525626127e-04 1.135541705851264051e-03 3.423965409944932010e-04 6.577686363912214939e-04 3.142274785027064643e-03 1.565750351025768650e-02 2.987463134964253933e-02 3.233269069839655313e-02 3.159289981614982895e-02 2.501542185256823425e-02 1.881576735365285760e-02 1.857270344174085167e-02 1.517858384840896878e-02 8.294704434513175406e-03 1.059530183746740378e-01
1.045609969867409119e-03 1.379301694363104002e-03 1.081910627149192550e-03 1.058010926352421924e-03 1.170344549191792332e-03 3.831937777830450435e-04 1.297109818303378683e-03 1.441868161659233321e-03 4.285995039382105450e-04 3.942449871511013960e-04 5.297712120194998653e-02 4.698809480303555580e-02 2.616212951196416128e-02 1.213852132249979010e-02 2.606218221549363306e-02 7.687313753400733252e-02 6.301482218636284601e-04 1.288935409253931692e-03 1.285357541129893925e-03 5.853831003024501968e-03 1.587177462485209190e-02 2.280190054675008612e-02 9.196954738664300105e-03 1.442123771068163675e-02 1.967354035214283203e-02 1.170610230555980437e-02 1.219315349518161791e-02 1.276081947444454058e-02 5.999168042962017139e-02 6.523987422127361380e-02
8.486282161237551028e-04 2.095265995928203857e-03 9.008844097277303453e-02 7.725839064163386727e-02 7.104421377057981712e-02 5.362241661982727762e-04 3.415151818181472610e-04 3.434739647182698946e-02 4.791940692627520010e-02 8.311959941080008032e-03 1.228482851191529251e-02 1.971934550685845722e-02 1.896225808537823840e-02 5.948827383816248510e-02 1.032205916546631791e-03 3.546239601015104513e-03 6.200467503321581766e-03 8.067441347852980643e-03 5.692105347698398106e-03 4.348288721090513322e-03 3.037860043487701587e-03 1.070057427601400811e-03 4.079838575757937440e-04 9.291760938223298785e-04 3.593529938020614562e-03 2.323774854080210006e-03 3.623739359544239386e-03 8.722765807317446607e-02 1.129578922975228716e-02 1.054647252995961210e-02
1.765141686991282457e-03 3.568803772945700666e-03 1.016258062842794047e-01 5.959291278869444097e-02 9.817719914479854093e-02 7.347683817965272590e-02 4.492594598889655894e-04 1.238899920428410996e-02 1.154458915984384916e-02 5.021523834229668810e-03 1.248502656838934924e-02 2.312140756994648938e-02 2.524003310892693891e-02 1.165433058388514326e-01 1.464955293021292550e-03 1.604061057421593247e-03 6.083885665983521616e-03 1.175692894703582805e-02 1.378393214970275414e-02 1.221536780998661205e-02 3.503338421973406242e-03 1.332993863132390629e-03 1.594688569090422278e-03 3.130697803712819815e-03 4.287407080420655402e-03 2.360040384102589026e-03 1.013545378763941185e-01 4.163229431339240949e-02 1.563474001976579777e-02 1.504425606937086733e-02
2.162177828747366675e-03 8.385862933532011029e-04 5.700087198803757693e-02 2.452476303179097414e-02 3.090370560326484092e-02 6.772624941434009227e-02 8.937349956724331690e-02 1.022922790922162553e-02 5.755464113218486735e-03 6.586915439861299772e-03 1.200128592240027985e-02 2.052903107269394775e-02 1.912299351960820848e-02 9.148504211595352709e-02 2.767305349450625840e-03 3.892109954868476322e-03 4.621433284911890399e-03 1.105999764287873138e-02 1.444655374050878537e-02 1.260447217889136377e-02 8.623391323478991205e-03 1.118792343231717334e-01 7.482516778494906207e-02 1.623694507627201737e-03 4.965291828571373120e-03 3.877408493113664208e-03 5.931138578293152809e-03 7.192811944579292904e-02 1.268254346916250497e-02 1.152347911065308358e-02
1.170125415193186413e-03 8.957177128720952061e-04 1.194334520333941024e-01 1.270795295740263786e-01 1.246611509676627625e-03 9.812250199482883128e-04 9.559602064763252083e-02 4.053858023996367160e-02 5.902212758144992355e-02 7.563534302976293588e-02 7.107054171264880552e-03 8.568131363796546371e-03 1.129120201760772622e-02 2.190258630763207426e-02 1.098855492185489557e-01 3.079951756406308725e-03 1.419468053208576769e-03 6.820127305353687261e-03 8.083039004541112474e-03 6.295245988058561712e-03 8.078915337386726944e-03 2.482033599024574110e-03 2.245202488758280684e-02 3.622913081114799427e-02 4.362351440575147968e-03 3.000515980185340919e-03 1.036264102498552289e-02 1.385467888178054489e-02 1.489124257497065860e-02 1.312451070468601336e-02
4.170608659720828550e-04 3.417624153120855696e-04 6.894480872135021025e-04 1.497584100897779436e-03 7.540166960357484998e-04 7.959404172430059599e-02 3.871145154294548807e-02 2.827969781980247885e-02 8.837570105407428767e-02 1.606739824216972274e-03 2.338760933850008231e-02 8.688220467250765827e-03 1.287692549850000256e-02 2.367935676927149929e-02 9.785070701732966059e-02 2.648002615043274985e-03 1.032846593851222128e-01 4.896681216218506244e-02 7.221631095995947880e-02 1.222118661901313297e-01 3.141286157698514915e-03 4.881308385928940369e-02 2.483588589322155080e-02 1.145571802389423743e-01 2.135187532538426400e-02 8.019277564726706720e-02 1.159335844534426646e-02 2.113816201647641252e-02 1.219595291310658219e-01 2.099170290327577459e-02
4.224477578904407295e-04 3.309064880221263515e-04 2.659742757293651061e-04 1.158938625924492982e-01 1.191071653776949874e-01 4.697546056022409294e-02 3.185687150017086494e-02 3.323936662069119224e-02 3.700379549801065260e-02 1.472268997614559483e-01 4.330723543665253999e-02 4.347285461710385240e-02 3.499986602031603111e-02 3.544349268013392840e-02 8.900651735387730967e-02 6.015860255800432183e-02 4.317956254018390228e-02 2.749290464093524095e-02 2.434688344404413105e-02 1.837525489201194406e-02 1.461979451127641549e-02 2.118523060212433584e-02 3.210049233216036996e-02 7.440073349815146120e-02 1.262912447318901843e-01 5.658017608631528417e-02 8.684706683909118596e-02 6.113047725787763842e-02 6.386224071712293116e-02 4.253570543597778170e-02
5.733946468091647873e-04 2.915241122685364636e-04 2.730182047658948671e-04 5.534395298363450162e-04 6.008100242502153500e-04 1.158137162705214218e-01 7.561539337500870935e-04 7.046933627382807614e-04 5.102300628460689630e-02 3.712648405592074846e-02 1.395340221108650088e-02 3.242664008935160908e-02 8.152072304633331545e-02 7.451423961129649554e-02 4.430221354866536142e-03 3.312089132113543461e-03 4.895982703048333551e-02 5.943153439961719464e-02 2.751255481318836543e-02 1.230338721092149278e-02 1.191453194393506283e-02 1.852802427548364689e-02 2.800645049237821677e-02 8.477073272954005478e-02 8.476891375964125397e-02 1.989149335822016848e-02 2.207568909133957036e-02 2.880271412976437989e-02 9.490677035718222965e-02 1.960081544197883607e-02
7.709052326138314147e-04 6.508295185394560693e-04 1.910889322943483946e-04 6.304516859397662218e-04 8.688399131771437590e-04 1.609837007447714784e-03 1.584690898280732277e-03 1.285446768342135282e-01 5.074452768624024279e-02 2.956194380271708055e-02 8.995055541852294001e-03 1.152413743944721673e-02 1.235586078721131152e-02 4.220945943811620082e-02 4.824003268638495795e-02 2.034168539752048352e-02 1.720689872880905302e-02 1.901341289175143695e-02 2.620917977639127330e-02 1.534740611027232866e-02 1.089607187131051008e-02 1.621828492811633673e-02 1.844649246287779348e-02 3.048219555117350626e-02 9.382010771935971050e-02 1.462505450783931765e-02 2.116195370545830359e-02 3.509828248032821618e-02 4.281470752568195676e-02 8.582027459171145956e-02
4.207824630952292891e-04 1.023880575384654651e-03 2.967484861983322986e-04 3.071117217287481029e-04 1.432841378327079753e-03 1.484592033978027496e-03 1.545849640208749043e-03 8.998276524200936322e-02 6.945107797625105217e-02 6.490567522043189097e-02 2.666685766930515164e-02 1.344580184805792104e-02 8.060326370334028670e-03 1.262868611222471051e-02 5.748731569754485932e-02 1.503485012478867310e-02 4.126009852895753949e-02 3.009419678449557108e-03 6.214024543660471959e-03 5.879800191866484810e-02 1.519270830931534165e-02 2.126072796219311695e-02 1.850769098267764437e-02 2.017440524323172932e-02 2.648640429237426180e-02 2.012259465922847448e-02 2.362594079074499184e-02 2.936919674206566605e-02 3.994453435087342436e-02 9.864803854771392322e-02
