1.616763005687447963e-01 7.264619872725335513e-03 2.434032071399506569e-03 3.056881701948171038e-03 2.317595935170014762e-03 5.082392773767036367e-03 5.050002607268317713e-03 1.368450737404749810e-02 2.486605975369489407e-02 1.103670310560672142e-02 8.312357886867696721e-03 9.778006045490242326e-02 6.083041145153052220e-02 4.175663565281972738e-03 3.428656407682157542e-03 6.597329020916187226e-02 2.816973339039976175e-03 3.878763378764458081e-03 3.555557511196768931e-03 1.515275734882068131e-03 1.479629962057286583e-03 3.149118128563162256e-02 2.488171649108847708e-02 1.003836398236681582e-01 1.989177201590409672e-01 1.593893387204629586e-01 7.487714014728473477e-02 6.600933516049171078e-03 6.308817393087551642e-03 7.942500165049331748e-03
1.078041635674105159e-01 7.844652799052224262e-03 6.159652186296092971e-03 5.005854639603474036e-03 3.482426009519940663e-03 1.771259758278552823e-02 9.463863289404784301e-03 1.179275484778909491e-02 6.883872862533752836e-03 5.154873355592629047e-03 5.612887240559926577e-03 5.107747851220502400e-02 7.269612516108860112e-02 3.809830328882671258e-03 4.007179563548279692e-03 2.650024219428140110e-03 2.752334735597510365e-03 7.201088096127717351e-03 5.484626070142491032e-03 2.137857485110829063e-03 1.189980048300557230e-01 3.021873654023359348e-02 6.493012878322500236e-02 5.877524451359854990e-02 5.326958920849157730e-02 7.316329232740584332e-02 2.635397266650877160e-02 6.703644584697038972e-03 9.542242358320475112e-03 9.539799196430146302e-03
2.286755799340058071e-02 2.293817950884819573e-02 4.142868390152620872e-02 3.364650832849926804e-02 7.144167312082211341e-02 8.270674992709494897e-03 9.128356726784152275e-02 9.619812521713476394e-02 3.432714957102630388e-02 7.606117048248020943e-03 1.979780745982848839e-02 1.460833928351927546e-02 5.324898959032100046e-03 1.022104132827724235e-02 1.120291882930414401e-01 8.712721238086579625e-03 4.007266845450678863e-03 6.583589748113682916e-03 2.204586736736204033e-02 5.858114304730046955e-03 7.662898666558111416e-02 2.575837796179979849e-02 3.938581546918194787e-02 1.394828805051608923e-02 8.494099775725341347e-03 5.754776704682865521e-03 5.281740915308970157e-03 4.144874117545919827e-03 7.062459242579523407e-03 7.908440346101565030e-03
9.066719260614832659e-03 2.626612691709593467e-02 5.760065541760946151e-02 4.650249081669707851e-02 2.173526085725049559e-02 3.789737926583805396e-03 5.810944637915695273e-03 1.096178994242102550e-01 6.327594561849737842e-02 9.740033556168620210e-03 5.475455644135424418e-03 1.064897700408031118e-02 4.745357111367936968e-03 6.802230750444568722e-03 8.580250458851605699e-02 7.591436942161516876e-02 2.020082133686377374e-03 2.563205341474787940e-03 1.822382387458555035e-03 2.114494653369254715e-03 1.351914265444946750e-01 5.212033277743514936e-02 1.767076736366284331e-02 3.495221027856505042e-02 6.914340936868375136e-03 5.092798763477589252e-03 4.470173189935215154e-03 4.229430665567398238e-03 8.563832088199399561e-03 9.277863544005074403e-03
5.307520093772605599e-03 1.677549403672201622e-02 4.678596993962082229e-02 1.814010954486171626e-02 1.301029879773061247e-02 1.056272208974958632e-01 6.618846358780433592e-03 1.011717219345706353e-01 3.915474940521689734e-02 2.341971841936273460e-02 2.431404245935230718e-02 2.402640517397984857e-02 4.366958865685703454e-03 6.999139351299533442e-03 1.116881115434883998e-01 4.566385765931207930e-02 8.224394907853489756e-03 2.781956832983745274e-03 4.539232230156165643e-03 2.681248581808315726e-03 2.220969494817466236e-03 6.832733339749204327e-02 1.656939301146758640e-03 5.576769843171400926e-02 1.249020015242991409e-02 6.794173238732091960e-03 4.790033767985823338e-03 5.515015065684004958e-03 8.589236495464974697e-03 3.144599743631743688e-02
7.770847400479628624e-03 8.550954952183215454e-03 3.206400847600023030e-02 2.256384921933947754e-02 1.048608770205246808e-02 6.186253194700166991e-02 7.685246880987553486e-02 7.999832382181985835e-02 6.635952085869191441e-02 3.333333804310358028e-02 2.772219252945196458e-02 1.940725127210984197e-02 9.771244368877250730e-02 3.640730992021964929e-02 3.037592640770975239e-02 5.226112779145358767e-02 6.614676836576140716e-03 7.125004836578004153e-02 2.682416455640961993e-03 6.915683980702302079e-03 1.036200135116399808e-02 6.864613322711063045e-03 2.436149195725437026e-03 3.330561241313727966e-02 1.867949789491790344e-02 1.772407549284991946e-02 1.114067578967899499e-02 7.638759297458347190e-03 1.002615210933591530e-02 1.792257621825457670e-02
5.956227695036823977e-02 9.248038646059043855e-02 9.104498045019315811e-02 9.200049724732151102e-03 3.497019707473775392e-03 6.962324850197419181e-03 1.220939672382835225e-02 6.633067096363490407e-03 6.376349772825944638e-03 6.902321520748149787e-03 5.878046003740765996e-03 1.191759130730419003e-01 5.536336602424360431e-02 2.604068729422658393e-02 1.511645153148803884e-02 2.603110558842644875e-02 1.489321454541514822e-01 6.747078808695630703e-02 4.288344275142612176e-03 6.144857162861668692e-03 4.165672218282252988e-03 7.103016818762063200e-02 3.344101288149493173e-02 3.149233950172689728e-02 1.274903448605422228e-02 1.313679853595871652e-02 1.155811945284937643e-02 9.916371630174555113e-03 1.128756920174897420e-02 2.662887380218141933e-02
1.185089284067553234e-01 8.391998945547259753e-03 1.245484701332201655e-01 6.137879799121565526e-03 5.829563722975081991e-03 6.449628778046407468e-03 5.541647425816666889e-03 5.059851921139278327e-03 3.901899920158643630e-03 2.601264882682495505e-03 6.586961110195600766e-02 5.172771712246531338e-03 4.682996036566577230e-02 1.708729178608919125e-02 1.934692217539137060e-02 3.576275103290415397e-02 6.462563805438917112e-03 7.875410341063353997e-03 5.498083218995483169e-03 4.886738483760013664e-03 1.006539436793856684e-01 5.957683908247866922e-02 2.419416318228592711e-02 2.029824637261696055e-02 9.653056178345019445e-03 9.996458093919861204e-03 1.537405968063548616e-02 1.732464956383253027e-02 1.720449202349845497e-02 4.980259829408810457e-02
6.906840000262637162e-03 5.870488210812789195e-03 1.038965674659909771e-01 1.405978703303083568e-02 7.103715802011588247e-03 2.965757745254328590e-03 9.310982527710592871e-03 4.451698303514363408e-03 3.750808767917072819e-03 4.321640008810073187e-03 3.110450539921744313e-03 4.575894569475647683e-03 9.158685531195833590e-03 7.571691324455801821e-03 6.260112259312536342e-02 5.270042573920098727e-02 3.613288322246947532e-03 8.613280511109761353e-03 1.012339235503926550e-02 1.333590409358167417e-01 2.665061634510490496e-02 2.785754908844503483e-02 3.039415376148114911e-02 1.985362886349006928e-02 1.158062529930933664e-02 1.700605981448247844e-02 5.970818473588324071e-02 1.067973630999021484e-01 5.779282737663244893e-03 1.514254506295544533e-01
6.629795829916543433e-03 5.217577562791101201e-03 8.433194829877619508e-03 7.976726749236360409e-03 7.639346694532232057e-03 7.691866702562664970e-02 1.002544985463705955e-02 4.369341772756292659e-03 7.468549371479478449e-02 2.716139358356171873e-02 4.968173290069034971e-03 4.746441381617351116e-03 1.014536266148538535e-02 1.259901995525271323e-02 6.493007948779611592e-03 7.118476381108436793e-03 3.402653425973746482e-02 3.302424938177755953e-02 1.705659207741439670e-02 1.068436186003905372e-02 3.398195674456525039e-02 2.148563049246577164e-02 2.465301132792671254e-02 2.699387966397543900e-02 1.498092474935871880e-02 1.852968312292605294e-02 1.598136627823144862e-01 4.849413527455927360e-03 5.893031903270666561e-03 7.889515810042817268e-02
9.746849106796009674e-03 4.969614736545621171e-03 7.486990535965068125e-03 5.628030091379846410e-03 1.171126913793318382e-02 4.749305388643749321e-02 4.530357103528465101e-02 4.063492919355855132e-02 2.731073217268453063e-02 4.036365100840215610e-03 3.951021264585943826e-02 6.472737089911180519e-02 1.358152924278441531e-01 6.874377182084323579e-02 1.297175791452159950e-02 2.603785258758285065e-02 4.845776309626720346e-02 1.330467715834036946e-02 4.494292477976311734e-03 5.570520746437833404e-02 2.345599868972855773e-02 2.092903551502026116e-02 2.698238367156235648e-02 3.754534543961529636e-02 3.981538364834869004e-02 2.118337513353828541e-02 3.156549419128589634e-02 2.347831439096119410e-02 2.100208326498510802e-02 1.537346267656973693e-02
7.779500241371602176e-02 4.246614125808805679e-02 1.120341188077605098e-02 7.803867027447460893e-03 7.278473760908677793e-03 7.339902057572042504e-02 3.498566492455545962e-02 2.403070777515784948e-02 2.828456672754705789e-02 7.037236889179080725e-03 1.213911466064084704e-02 8.001854925610669966e-02 1.419756077500607117e-01 7.564984369896654570e-02 2.797867206145094113e-02 3.237148511398738743e-02 3.586455815217822612e-02 2.109764297155721294e-02 7.525932949254605410e-03 1.292204346275742932e-01 2.281578245457114781e-02 2.318084088988240851e-02 2.735272732505338381e-02 4.855759256334891277e-02 4.570462313103432900e-02 3.219807267613597479e-02 2.446701516757052511e-02 2.213529076383274896e-02 2.414711619941700693e-02 2.609772121860999550e-02
1.825825628932371131e-02 4.297419076574006402e-02 9.480505888500043166e-02 9.254462124647285307e-03 6.325217582708089412e-03 5.976788094677749907e-02 3.423720010939695912e-02 3.010363689745329183e-02 3.838289845057252930e-02 3.893538980290487447e-03 7.480301939683035861e-02 2.686528997891444309e-02 1.066321067564385411e-01 4.708812229661211296e-02 1.522887798319747313e-02 1.810799469887081417e-02 6.737183145160116453e-03 9.920085618342806139e-03 1.458264362535175405e-02 6.391224376198067526e-03 2.221148261865388274e-02 2.428690173486295831e-02 3.039535278600833182e-02 5.003436649545547205e-02 6.265526573393130627e-02 5.473475461056823144e-02 3.996883995608876972e-02 3.760561295838549950e-02 3.305597893148418814e-02 2.743949261608289933e-02
1.558677994373070669e-02 4.278365676385623151e-02 6.644255749267094502e-02 4.586610585592148376e-02 2.711540521854194710e-02 1.192068299675391879e-01 1.163327346290834487e-02 6.124572067368893452e-03 5.290177156258026037e-02 1.752806016525269156e-02 6.321297989402734074e-02 5.054524902993956861e-03 4.903008210233456010e-02 6.851326431992563193e-02 7.528601776034002380e-02 1.045452274233119039e-01 9.530031815397894956e-02 6.248198364711127911e-02 1.722184116994765757e-01 8.194541059209564660e-02 1.026746721767098254e-02 1.468408629111751518e-01 1.089361320245383485e-01 7.465733838421777756e-03 1.302092889424351710e-02 1.048343627840953203e-02 2.578190802247847663e-02 1.090366911238786068e-02 4.521543473117529965e-02 5.232841985875316682e-02
1.503496645339506485e-02 1.454085181591286899e-02 3.470874953791969197e-02 1.519606325556776237e-02 8.917697160546733670e-02 2.245435451373826649e-02 5.738842179193998257e-03 9.369874251875616109e-03 7.357688605292752801e-03 6.723722963852524215e-02 1.400578999556898463e-01 2.490151942632142651e-02 4.398670610152420613e-02 5.749705887713299490e-02 5.339099719581386766e-02 6.620604760138878997e-02 1.149535073711843575e-01 2.018428488227342887e-01 2.086081310922993093e-01 1.657057436115601246e-01 9.510462617665197543e-03 1.168645155479157254e-02 1.011673609381507147e-02 2.444075080854212628e-02 2.909432686342307284e-02 1.465859678437931302e-01 1.440722691570207881e-01 3.458683654777659766e-02 4.640303889174555302e-02 3.554226198056931879e-02
1.433861547287356569e-02 1.518054118420076280e-02 2.934288661854012395e-02 3.068694302585346645e-02 1.974583216987085832e-02 2.378097760618506917e-02 1.949378240307400372e-03 4.625144251365280457e-03 1.060898099859607438e-02 4.466083733004544247e-03 4.695277885795515367e-03 3.687403242381977024e-03 2.491207141623569959e-02 5.171434596469599160e-02 4.937170017131502914e-02 7.730745572992428483e-02 1.367586334256941649e-01 1.697512532764441362e-01 1.001310426113619506e-01 2.214378276091569578e-02 1.332904162018600999e-02 9.173072143439717219e-02 1.339427306058662281e-01 2.223159430551565063e-01 2.058915246588868264e-01 2.643156206848623624e-01 2.083003220648603493e-01 6.594206198320917700e-02 6.700345693703373129e-02 3.927670959573693887e-02
1.903808823210606863e-02 2.160751511863819377e-02 1.990514001760873217e-02 1.766448052508261604e-02 2.527978549895031415e-02 4.429356700702101468e-02 2.847119433164752716e-02 9.118586119671764911e-02 4.490914171037259373e-02 7.696586144787517098e-03 5.711471806946444643e-03 8.892084784421638508e-03 1.776350744877019591e-02 2.673436718206644719e-02 3.600062949398472045e-02 6.571656621111333918e-02 1.454931958860987973e-01 1.504559182201893053e-01 7.307784202159971210e-02 2.552305381220274644e-02 1.102378324280841732e-01 2.001671716567021697e-01 2.570133178715779954e-01 2.607715779038485282e-01 2.259088460958902922e-01 1.919975101562566566e-01 2.792229517034904296e-01 5.163449021041603693e-02 8.723488796004105761e-02 4.702848862444724415e-02
4.866244793978024424e-02 3.809281592164751040e-02 1.798897708982655219e-02 2.455807324170461090e-02 3.711680652743067684e-03 1.424535745327625176e-02 7.560895986932177071e-02 6.158359160711028568e-02 6.119285700664197497e-02 3.057133975403665549e-02 1.240811985016287457e-02 4.142008956606828447e-03 4.050415144447807800e-03 9.435950292384977581e-03 1.750150043165122835e-02 8.142271571883931414e-02 8.830488647245554601e-02 1.100962325404365727e-01 1.974276054369428560e-02 3.547899348355747218e-02 1.217000756570035397e-01 2.630671956204297945e-01 3.240443265446960042e-01 3.313351103748957693e-01 2.684997561894963969e-01 2.541848526294929189e-01 2.323673688640124912e-01 1.878218652478001738e-01 1.013719741048216792e-02 6.982209997181506277e-03
1.926833680067514473e-02 5.308769003608329595e-02 9.127362750823517223e-02 7.333831268428631610e-03 1.148209022485524762e-02 1.526889655530514964e-02 4.834332552043740100e-02 6.060438948724378161e-02 4.163846452056878256e-02 3.241919352838362051e-02 8.697044439357027451e-03 9.598009640331331416e-02 1.446577096632233050e-01 4.822125600203328033e-03 6.330458116152570813e-03 3.749807473891633713e-02 1.472638364880764911e-02 5.050275862084572034e-03 1.121949937133386727e-01 1.280567875988513141e-02 4.695579845578664452e-02 2.493071881398049305e-01 3.144590876591317752e-01 3.266121057858545340e-01 2.361599448323606076e-01 1.083233316070199570e-01 1.739897142622203741e-01 1.183926181743844841e-01 1.064301837070061839e-02 4.149145271975462033e-03
5.019773885182439443e-03 7.549844975002478059e-03 4.689673076185008060e-03 4.807419454221074223e-03 8.883004800024534367e-03 5.041860911076555783e-03 2.568763944911805000e-02 3.287047775090334856e-02 3.004366824315577236e-02 8.581384303738148409e-03 3.692456598507107800e-03 6.664610918316908605e-02 1.134240251841744096e-01 4.377384949565337607e-03 8.751361688385837084e-03 5.530183560832189864e-03 9.931551022246971894e-03 3.173126724486733698e-03 6.094166541752081383e-03 2.918054904984069761e-02 1.512332483069824263e-01 2.848771426174953048e-01 3.042587219130632459e-01 2.887070769246981028e-01 2.214851520192622492e-01 1.619062064911497567e-01 1.564582805778964858e-01 1.124127966482535018e-01 1.726962615805423609e-02 6.755976376727738757e-03
1.033352021504665118e-02 9.423535008985687439e-03 4.837902273426442773e-03 4.228665182103057835e-03 5.569526460651318296e-03 2.914193546436048571e-03 1.385866236540719311e-02 1.341795551216509383e-02 3.783156236651800779e-03 2.661085853716002505e-03 1.142465570883643977e-01 1.011746926504290406e-01 5.568949561546821664e-02 2.545069865745371376e-02 5.379141565543658215e-02 1.542450509807517930e-03 5.422576493038801758e-03 1.271161465608913570e-02 1.257047071431530334e-02 5.704474762215237804e-02 1.550424500584109688e-01 2.231023797516904494e-01 9.013848422559299356e-02 1.362237901843605936e-01 1.775482719574024426e-01 1.012363668816356754e-01 8.545052547404737020e-02 7.805391227138334942e-02 1.181778273347193486e-01 1.283527735631248279e-01
8.269062649849955732e-03 9.465334563180856711e-03 1.815046668604469596e-03 1.574215868426733205e-03 1.447295911611732877e-01 1.848210935937269397e-03 2.311799291321299781e-03 7.455153940488758180e-02 1.047096597488284264e-01 1.814199156986127937e-02 2.673948690560422337e-02 4.248819974130797761e-02 3.915173773772348542e-02 1.205718276581373705e-01 3.250409646213328185e-03 2.809501118209333306e-02 5.291461386397140754e-02 7.860137397146255145e-02 5.507462823595266760e-02 4.196432935275511145e-02 2.947888629531638868e-02 1.044754269777455925e-02 4.019170368285851329e-03 8.816094623474313857e-03 3.240272456509636634e-02 1.108423491401186629e-02 1.442114859297279929e-02 1.740173843549210064e-01 2.265972043606849506e-02 2.114936361739103501e-02
1.714711035767457412e-02 1.479442658432137715e-02 2.216897823260558040e-03 1.169972737110524796e-01 2.450350503467050179e-03 1.545722266896552843e-01 2.234713926270197413e-03 2.697652011594318597e-02 2.515685872579206950e-02 1.092678995258385306e-02 2.704255115389010353e-02 4.921418830880957412e-02 5.064615718363654068e-02 3.453351774359615829e-03 3.563139210593870357e-03 1.589601487331762306e-02 5.960211934937564848e-02 1.138132077158826444e-01 1.318928304431574439e-01 1.153288797401740284e-01 2.420393206256598456e-02 7.122597495621015191e-03 8.671879663667080018e-03 2.062276161251281811e-02 3.685848686111065087e-02 1.099716459592488087e-02 6.826744520899150244e-03 8.160079402503536694e-02 3.075643180171176716e-02 2.949463036037423130e-02
2.099000973823848815e-02 3.020538235687870391e-03 1.136313529078978868e-01 4.825619593403401159e-02 6.410083582303799377e-02 1.438832261242711519e-01 1.957038150529898102e-01 2.234253395562426497e-02 1.251355112519063166e-02 1.429699631849001146e-02 2.593550443184436047e-02 4.352735763708494299e-02 3.802352441805898625e-02 2.188672301662574274e-03 5.226977924847033864e-03 2.277169738350877382e-02 4.515166810909448936e-02 1.062508357007948961e-01 1.364953332125241892e-01 1.163835355100799746e-01 5.733940769315657576e-02 4.989199118008513269e-03 1.505800968665057249e-01 7.766811740892483849e-03 3.265721289710381281e-02 1.785190951400738094e-02 2.305990512487732930e-02 1.381832233227591467e-01 2.431242312365711200e-02 2.193460429341951429e-02
1.136101058022126985e-02 4.059625286506393128e-03 1.823179594201319517e-03 1.967843631561264593e-03 4.954203455632949678e-03 4.732034446941745312e-03 2.116356168281253447e-01 8.880002365660437380e-02 1.282110598475511565e-01 1.639222576819824861e-01 1.535163240424018173e-02 1.821147470605821370e-02 2.298485054407101158e-02 4.301994206347902611e-02 2.362770012181018061e-03 7.027753261455239701e-03 7.828415917212705119e-03 3.658318701458263683e-02 4.728440919646099277e-02 3.851117829765293016e-02 3.573885201697628994e-02 8.391022609946766422e-03 4.087131881193078325e-02 6.595637819054286921e-02 5.795323083114561034e-03 1.308118325428749007e-02 4.230737672182839637e-02 2.871112892419789078e-02 2.694870964926139936e-02 2.348285161798805559e-02
4.050171711538690794e-03 1.611248564984448569e-03 1.794475259325936612e-03 3.165269523082507499e-03 2.210547991155532421e-03 1.771671372461183502e-01 8.594460053853407444e-02 6.199104279903040055e-02 1.887613901068686817e-01 5.805169411141068020e-03 4.980573345427342230e-02 1.856217669406729290e-02 2.704109374880428115e-02 4.658654980154211533e-02 3.211322088330477442e-03 5.308727391106517028e-03 5.047904158151514213e-03 9.793268384263109638e-02 1.432198791912150659e-01 6.060735781712948099e-03 1.166052639903392835e-02 9.285423795005556813e-02 4.489575947628549751e-02 1.279913175737052225e-02 2.351589348078614305e-02 7.042162991633255792e-03 3.295568842049301922e-02 5.046749894149883675e-02 2.938886391290189762e-02 3.725409654037754176e-02
4.103925763960452645e-03 3.303427914835399548e-03 1.679560556154852070e-03 1.284923681245173435e-03 1.548120463803182544e-03 1.039625144499772558e-01 7.042896331897695317e-02 7.289329853703975515e-02 7.901233256200257404e-02 2.421264309220897814e-03 9.222702210411530543e-02 9.304073926804803940e-02 7.382408025194854562e-02 7.163610938093169234e-02 4.163936124262739881e-03 1.185724717627348740e-01 8.741585863234911657e-02 5.516508745627425603e-02 4.837953314089896845e-02 3.614707755668252614e-02 2.846346207482897128e-02 4.059374681444607308e-02 5.919777170208159051e-02 1.333416025741612776e-01 3.482158377288013806e-02 1.022740088127176844e-01 1.632392677063791153e-01 1.133870378827221553e-01 1.168738494311801351e-01 7.688714586679705476e-02
5.572868360882964923e-03 2.915189242248001928e-03 1.727683652418248589e-03 2.460777388010061944e-03 2.404238982965318031e-03 1.343327241144313348e-03 4.680898416774784132e-03 4.015129680474447717e-03 1.080889575040937522e-01 7.882087733863574197e-02 2.965837119504099312e-02 6.944160114217580448e-02 1.726665771366751034e-01 1.538691573565354742e-01 1.470649992682281429e-02 1.124225831592846545e-02 9.957783383660492871e-02 1.196956116592068492e-01 5.481331226509190968e-02 2.429076791108122566e-02 2.332787217409217767e-02 3.583140829901657748e-02 5.318612820047746714e-02 1.568307280792323177e-01 1.561589397268708101e-01 3.685686494817307784e-02 4.178862398051156474e-02 5.394409629875878548e-02 1.755258598724558639e-01 3.585858391125879702e-02
7.529908841854477709e-03 6.538927260443504370e-03 2.065033579737430344e-03 7.345493860202109877e-03 8.860115235398001443e-03 1.644914148009849267e-02 1.144485233277494143e-02 1.754043106823634625e-03 1.095952499939782526e-01 6.396042072639795961e-02 1.940210779319131301e-02 2.471955625002884849e-02 2.625624270247679803e-02 8.886495716314594950e-02 1.005365387799079246e-01 4.197210192688698854e-02 3.510614803491889785e-02 3.836017905272963435e-02 5.229407917219124763e-02 3.035678008054563254e-02 2.143768070680525731e-02 3.173362035072763154e-02 3.567342283185252760e-02 5.806189082892552339e-02 1.775344024908288576e-01 2.773941915480702611e-02 4.023108609062511082e-02 6.595907080455974680e-02 7.956861535461090540e-02 1.577738078505498687e-01
4.234585074826229326e-03 1.054411682530339948e-02 3.246267764492336352e-03 3.575035456723447535e-03 1.779296642350841617e-02 1.863560075488542717e-02 1.304268611694369730e-02 1.979737827082737878e-01 1.512031460636489577e-01 1.414517767064600029e-01 5.785523579076141260e-02 2.901842329373211307e-02 1.728890769808323971e-02 2.688819876958696564e-02 1.214856461281060285e-01 3.152655892822812944e-02 8.534291388918918697e-02 1.477366682910440793e-02 2.902075185533599389e-02 1.170144541256526449e-01 3.008283146642002498e-02 4.193883513722888867e-02 3.632835313775201885e-02 3.911453336222074639e-02 5.110115121316995135e-02 3.880252391481553431e-02 4.557579378559174776e-02 5.614704987690546933e-02 7.551706981289890708e-02 1.852052973351082099e-01
