7.071037074008465657e-03 9.566952507480783185e-03 8.358920306884664100e-03 1.058157271279519009e-02 8.059507731424624469e-03 1.771951523216980240e-02 1.763983485217133010e-02 4.791724213986407049e-02 8.721643597706629780e-02 4.271464940348580763e-02 2.142503238123181011e-02 5.246810154765687434e-03 3.209687280292970821e-03 1.193879183397348297e-02 1.382230993201847072e-02 3.014102878606259202e-03 1.057915523103550304e-02 1.851351948284046117e-02 1.674139717204795388e-02 5.873079550818104469e-03 4.659367915291928383e-03 6.680829890595416966e-04 5.096553384110049734e-04 1.723441375571306295e-03 2.362808022655241928e-03 1.110869851564961347e-03 1.872617132340292456e-04 4.196382965008488225e-06 0.000000000000000000e+00 0.000000000000000000e+00
4.748042851983665102e-03 8.850405890115129598e-03 1.593568302212828094e-02 1.307089352225585324e-02 9.128100133617391559e-03 4.092097423806035500e-02 1.946403393918360106e-02 2.466980352529980769e-02 1.614430219502918651e-02 1.649304065278081599e-02 1.355753092715283534e-02 3.008402771472323389e-03 4.288184422472150585e-03 9.748907765452254764e-03 1.353560949528998664e-02 8.598937260295537802e-03 1.058543975145239367e-02 3.458773271403231542e-02 2.603162253092041606e-02 7.786136381888741909e-03 2.703814519748339550e-03 5.977133747044597765e-04 1.225803483320125594e-03 8.862033261522675323e-04 4.980888847172204289e-04 3.066730274953046267e-04 0.000000000000000000e+00 0.000000000000000000e+00 0.000000000000000000e+00 0.000000000000000000e+00
4.689322010982725081e-02 3.465031526796465838e-02 7.356971581919630188e-02 6.014539914905947526e-02 1.280232899418965731e-01 1.306155947431424970e-02 2.427872197976738491e-03 2.615003163675057741e-03 4.219308345561773727e-02 1.800910266471106649e-02 6.218704381564985062e-02 5.015756319635579497e-02 2.037004699029143148e-02 2.955422626302372374e-02 5.616402500790033080e-03 2.332167300395187812e-02 1.557512735064552067e-02 3.178572638104879000e-02 1.053502300689620613e-01 1.738849357307337834e-02 1.615579105322677896e-03 4.600081307424169785e-04 6.832802836201316973e-04 1.866848576535296608e-04 6.300162211058106965e-05 1.158777225465945557e-05 0.000000000000000000e+00 0.000000000000000000e+00 0.000000000000000000e+00 0.000000000000000000e+00
2.174461205156443672e-02 4.510835579369355808e-02 9.902391956481967905e-02 8.003835570316426840e-02 3.259351450530690447e-02 5.017655423623589538e-03 3.946009853152759699e-03 2.653284267160096240e-03 1.625831571341719486e-03 2.184087645193439481e-02 1.832841042864000874e-02 4.448157265258397691e-02 2.198106937215759532e-02 1.391970888998281947e-02 3.896184427773822460e-03 2.807908564573382421e-03 5.781259989770758806e-03 1.077910234212489486e-02 7.600182815272599028e-03 6.441220795217706026e-03 2.846085640911629258e-03 9.516993862079592458e-04 2.892953689555220189e-04 4.379338813419279830e-04 4.787328688098325724e-05 1.212554743109982367e-05 0.000000000000000000e+00 0.000000000000000000e+00 0.000000000000000000e+00 0.000000000000000000e+00
1.252572887086270126e-02 2.826955975476731428e-02 7.896068876154885285e-02 3.060231064185722077e-02 1.733352449622072022e-02 2.516053675234556069e-03 3.836271166586049681e-03 2.128193605804595302e-03 9.893552008230221961e-04 4.975079928549389074e-02 8.185845713812971158e-02 8.476838099560599082e-02 1.336773950011785859e-02 9.957665086092137852e-03 4.154817557844339183e-03 1.360840589335441221e-03 1.415571145043650024e-02 8.117065539699238122e-03 1.300122766244991152e-02 7.437166166966243178e-03 5.064402862815134410e-03 1.380958363673354507e-03 2.940550880338423795e-03 6.489603144409609742e-04 8.573890430297710305e-05 2.465389805450347247e-05 3.540801199303856821e-06 4.202923109323844306e-06 6.644928381036924749e-06 2.517957072549064116e-05
1.245869789610886541e-02 9.524295296798492363e-03 4.271702334476917828e-02 3.422764013251652915e-02 1.348647380434258962e-02 1.443351334295035933e-03 1.753870053712137857e-03 1.872583537669672820e-03 1.761269755816579448e-03 7.691591986329979203e-02 7.893630272428610317e-02 5.042685696594884776e-02 5.994693607383338660e-03 1.525858250151763615e-03 9.501135283982627957e-04 1.228303048518518447e-03 6.083078312163869850e-03 1.590644698884203113e-03 5.146740951539130818e-03 1.774901838870442117e-02 2.137094008376732787e-02 1.244147511100943126e-02 3.010788850710518442e-03 3.318073126993751720e-04 1.273349994218131822e-04 8.824875249895850306e-05 3.682134280020321376e-05 2.687448294455118203e-05 3.694598796402750226e-05 7.100590656435867300e-05
2.005583819919102249e-03 2.485430956837573861e-03 2.542479840953361034e-03 1.247922123733142229e-02 5.789459375683564391e-03 9.450348089603559723e-03 1.423534869900410296e-02 8.060173553032989532e-03 9.547141496646621706e-03 1.531694642341608660e-02 1.501354897349999398e-02 7.416596784251432151e-03 3.112140354995301169e-03 9.759707495952379269e-04 3.934031821858223780e-04 4.938731835078544533e-04 2.678768305813380036e-03 1.267082315338364899e-03 6.436151899341489499e-03 8.752574834974071599e-03 3.968287794600761087e-03 9.208470449200442751e-04 3.458867389076467676e-04 2.545934353028958953e-04 8.879569546074634375e-05 8.537170595037417355e-05 6.912442552522883382e-05 6.395193368446467535e-05 7.786419589479146204e-05 1.995904468616398187e-04
6.302697279568952524e-03 1.029326832649684990e-02 5.578725934795240003e-03 1.107377158162186140e-02 1.556617943160755468e-02 1.680156284027486263e-02 1.480538900347271904e-02 1.388680366469513192e-02 1.101145756458058768e-02 7.341951491502230615e-03 3.422284290196936623e-03 1.200688622162318468e-02 2.598453476416897820e-03 7.443378016982840108e-04 6.400614307880458974e-04 9.656618134337047622e-04 7.686052177818844360e-03 1.234219655921152750e-02 1.081094704931189095e-02 7.617753379993361107e-03 2.031935298440065533e-03 9.256322917105901625e-04 3.009235168142469752e-04 2.231264064931869073e-04 9.964517261412341961e-05 9.863158449923519735e-05 1.427396101546689127e-04 1.761829840915162719e-04 1.711713838747956574e-04 4.833154549179826819e-04
2.175421035610988763e-02 1.354157024221410224e-02 7.209416089470023145e-03 3.768455597804486190e-02 2.168252037310390221e-02 8.689363091783995630e-03 2.773939439184741271e-02 1.237064690978315236e-02 1.020647827526798869e-02 1.095137119485260768e-02 1.056122607821193687e-02 1.500256475621112792e-02 3.304249070706023750e-02 1.987225093229689349e-02 2.697381671281408495e-03 2.245074498691425509e-03 9.655515641117950326e-03 2.946002261436986985e-02 2.894520152882450875e-02 4.764118662288767576e-03 7.287029934195381631e-04 5.424686049948731527e-04 4.926195788602148826e-04 2.892271291930836679e-04 1.599063474441396449e-04 2.338854287043607490e-04 8.319801572478320107e-04 1.573934100918009766e-03 4.128289193580349931e-03 1.781014839039901610e-03
4.389251516297566769e-02 2.809121641363885799e-02 4.048448044786671918e-02 3.391376252048515505e-02 2.584730461926650416e-02 4.786636290499856304e-03 2.185952630533919555e-02 9.221371846205131048e-03 3.786487657535472524e-03 1.460524586188330452e-03 2.195289957852636711e-02 2.206075015512882348e-02 4.680928186399857527e-02 4.923903204334891676e-02 2.269967500088828846e-02 2.417335766390438581e-02 1.293547106888313369e-01 1.340795071645849712e-01 5.340807944861647449e-02 2.348895746896523251e-02 1.119484990148657310e-03 5.120743656341381501e-04 5.025160117342237793e-04 5.075870621426681719e-04 2.665497633437668165e-04 3.286012043660255471e-04 2.937366664518385479e-03 4.583083762753464505e-03 4.935879356323748073e-03 1.048333594126880756e-03
3.877240375548211826e-02 2.022456901295011100e-02 4.151216852744673419e-02 3.250000181747503269e-02 3.670348111878692088e-02 3.196173783244759484e-03 2.629393989495612018e-03 2.248663389313688629e-03 1.368084651930480834e-03 1.209401734684548667e-02 1.874411674538511707e-01 3.094026284100551694e-01 6.328881105124410933e-01 3.116065238225676493e-01 5.729974192943314282e-02 1.125594300129419412e-01 2.099790340151054813e-01 5.793812615662404658e-02 1.370411044336966588e-02 2.701989365321998907e-03 8.908048481030099441e-04 5.976477635938404805e-04 6.815833824626062187e-04 9.008685674202729669e-04 9.207212720674514631e-04 4.794796858565498793e-04 7.216673916468010911e-04 5.086625926229290315e-04 3.791846483305386897e-04 2.075110368132867253e-04
7.073103092613034285e-03 4.163590021418528409e-03 3.491495564633859822e-02 3.263601206935590193e-02 2.365746471045520466e-02 5.200716925380150304e-03 1.961204141665978673e-03 1.226436078010733309e-03 1.472485501916184986e-03 2.629471172627295336e-02 6.090812610817565587e-02 3.788223595814190214e-01 6.579755858071035801e-01 3.404909810875583198e-01 1.223850032522490056e-01 1.380746861268113967e-01 1.525230725723263903e-01 8.968692785419944691e-02 2.192922683503374659e-02 6.145896878036597073e-03 8.894835246222045598e-04 7.717947748104801156e-04 8.493305701518571787e-04 1.478399314294954461e-03 1.382086508247439612e-03 9.557123883856537706e-04 6.998586364695860533e-04 5.353046365440306030e-04 4.606187063418623736e-04 3.633494026829896077e-04
1.332203940291038077e-03 3.449960229900021942e-03 8.293217060831860679e-03 2.299474031156238663e-02 1.450424606494731330e-02 4.458896311170331209e-03 2.210823544409683348e-03 1.779367623580828481e-03 2.147520725509704815e-03 1.434953377976984530e-02 4.417394314650796572e-03 1.229095955358907588e-01 4.905211043499385082e-01 2.102341906793765425e-01 6.601845437936758321e-02 7.638263311184519122e-02 2.819996410021870237e-02 4.132469127446453117e-02 4.694228104293627496e-02 1.748057389707034781e-02 1.151045066666699784e-03 1.017690896815628618e-03 1.209448669193838267e-03 2.054890165824418188e-03 2.671839147474361353e-03 2.476261782808685495e-03 1.773838390728982393e-03 1.323018147877631388e-03 7.901315749271755435e-04 4.345593452852307436e-04
1.035789924268362217e-03 2.996004683065205555e-03 5.620056680281557658e-03 4.136723034775564509e-03 2.438176120711503091e-03 9.337313011832288484e-03 3.140534286184996915e-02 2.642712799598710346e-02 3.320804843097270066e-03 9.373342328108866250e-04 3.421029274542248654e-03 2.041098933025384601e-02 2.240877674183027746e-01 3.033954310692994483e-01 3.232906865712130706e-01 4.362999537125223370e-01 3.929892829306181334e-01 2.554926366485994471e-01 6.989005183777062813e-01 3.240983179876149589e-01 2.654499966046455078e-02 7.626340235866850038e-03 5.707069118757697630e-03 1.433433596351618711e-02 3.334888280367820368e-02 3.124102988041935550e-02 8.367692859503100822e-02 2.245761376742251222e-02 1.369741712914200387e-03 9.204801394678807083e-04
8.510370484685957993e-04 8.645097252294153259e-04 2.494862207324311833e-03 1.919320093908757213e-02 7.081571915971161812e-03 1.640102525611972836e-03 2.121743965209707539e-02 6.126079399685212257e-02 4.073937066464899948e-02 3.803923437282356879e-03 7.273483031565519154e-03 1.018695090062493452e-01 2.008330518681520627e-01 2.551526079639675482e-01 2.304769821802542806e-01 2.784561367125428233e-01 4.764928651992423325e-01 8.264971429972146622e-01 8.441294875829091771e-01 6.637828227965015815e-01 2.827781828457852711e-02 2.945798932256682434e-02 2.627896117423621572e-02 8.070850382348189467e-02 1.127413175064270329e-01 5.596533243916017586e-01 5.333243594645300512e-01 8.960457987739058050e-02 1.558907993925684379e-03 6.793003258890379552e-04
6.643360285234244707e-04 7.369083243029139361e-04 1.814071333301372829e-03 2.112617664606838107e-03 1.447655446966032928e-03 1.644148219293732269e-03 1.164029854622536733e-02 3.300648895434678265e-02 6.785519694966417326e-02 2.204622270353693084e-02 2.043923308283498302e-02 1.574574504982264103e-02 1.138753461953068702e-01 2.305346475063326517e-01 2.148288099133675300e-01 3.289576393264797560e-01 5.723466480331911299e-01 6.992953853853801638e-01 4.060683755796848371e-01 8.875596113344039195e-02 5.339004075123694043e-02 3.676119345359787349e-01 5.378907296612324140e-01 8.544823616095862384e-01 7.413293755515337757e-01 8.865322351846615101e-01 6.413736845400068720e-01 1.578397393725782250e-01 2.233860049615506854e-03 8.012827514989601238e-04
7.054521483145831297e-04 8.392839944079806764e-04 9.118995741265473881e-04 9.377705691690772002e-04 1.515155390845062495e-03 3.238817620280979095e-03 1.908059821609149331e-01 6.430778828882860454e-01 3.115985559249958015e-01 4.852508064510020064e-02 3.228083370558625098e-02 4.423941301918828811e-02 8.125635968490516059e-02 1.197300022787699397e-01 1.581150347754988195e-01 2.834487072364891835e-01 6.152057828486164892e-01 6.230822014637411588e-01 2.967169149745660928e-01 1.023370823725030937e-01 4.430916358628022578e-01 8.073072780975987239e-01 1.039999527963526793e+00 9.761977823413418021e-01 7.479555952257335161e-01 5.492643814339451813e-01 6.770181675031029522e-01 1.068458506805517461e-01 3.041937190549689942e-03 1.119882543219185992e-03
1.469723771260030704e-03 1.204783464071965604e-03 7.156178445595431665e-04 1.244131093806388538e-03 1.758198855687823775e-02 9.199067850563827364e-02 5.181121634299329370e-01 4.253941976710436390e-01 4.153788380129831426e-01 1.893885503601511477e-01 6.225467664690569752e-02 1.476545132963622692e-02 1.340082023610004829e-02 3.420173633612261926e-02 7.683571981971355769e-02 3.517354436987057409e-01 3.730351438021120014e-01 4.381799686611504430e-01 7.697439237799288958e-02 1.369239287145982142e-01 4.884033377638631324e-01 1.062231766803401589e+00 1.315996528945511335e+00 1.202253941311611785e+00 8.057152936164779788e-01 5.943696672452504215e-01 4.042477389515941599e-01 3.170674534579052684e-01 1.392641812765545682e-02 9.036912744111738616e-03
6.246081537041703975e-04 1.830422072792018892e-03 3.690388612242216735e-03 2.779234972085458180e-02 6.642077226436171600e-02 9.648619431418972714e-02 3.049144764312836098e-01 3.818281612297188543e-01 2.598567173997107793e-01 1.874370595249444660e-01 3.604688305981703506e-02 3.208787578250581803e-03 4.516745207067743989e-03 1.210303427683296316e-02 2.496063494109578007e-02 1.389717266500719028e-01 5.316356647166117083e-02 1.708864096032573776e-02 5.773354141740686535e-03 4.219404249678988805e-02 1.611620881114680937e-01 8.607169836502976956e-01 1.091406533706813731e+00 1.020574136845686430e+00 6.235218971592128012e-01 2.314427134642849937e-01 2.948325662586342433e-01 2.002244784995946547e-01 1.795606517652746648e-02 6.983408011194564349e-03
1.501711666788875348e-02 2.108997170312831154e-02 1.492020905267742517e-02 1.958024763699459797e-02 4.839831091559198412e-02 2.817248729115762185e-02 1.446783703603858884e-01 1.866701251606528167e-01 1.705202091936653952e-01 3.810447344359536165e-02 9.039894456104808143e-03 1.801766037544194100e-03 2.920686797707877647e-03 7.773716995526447696e-03 2.745301199908817616e-02 1.616318522431933052e-02 2.939711523747488842e-02 8.737695288347955072e-03 1.653673455456442995e-02 7.897223183433509097e-02 4.262189915104651616e-01 8.064062219482512894e-01 8.647893204582016713e-01 7.510579432784473264e-01 5.041935132156558641e-01 3.152165283156816433e-01 2.607437407501917992e-01 1.740707203138804615e-01 1.558596580152375559e-02 5.479951431084965734e-03
4.114199928697762076e-02 4.201046741637698423e-02 2.199123784608334950e-02 1.613133178467183321e-02 2.133315327225808813e-02 1.147309355226322145e-02 6.490585811112205283e-02 5.772623430993659849e-02 1.569115150750742191e-02 8.372461215965791570e-03 2.842797717111881367e-03 2.230038410329276358e-03 1.242154981771480607e-03 5.980173932718809392e-04 1.300084993436979126e-03 3.480000307238715826e-03 1.234262271049452186e-02 2.831815441334023867e-02 2.743334977287299054e-02 1.230603822199546893e-01 3.353645463427343820e-01 4.835562652159299257e-01 1.957871405125247155e-01 2.803553494638887367e-01 3.391999935395765831e-01 1.785512897176462221e-01 1.244278011120957816e-01 1.013088339467796695e-01 3.699700610636876344e-03 3.320389218307876963e-03
3.602635709670619357e-02 4.538507247998722210e-02 6.396310027514152952e-03 4.234556979027580791e-03 3.323961574961714367e-03 4.956320757314487332e-03 7.150382389491382121e-03 1.804542382627740598e-03 2.347020538814480455e-03 3.768191120544381822e-04 5.093519263049780437e-04 7.934635792589734725e-04 8.298669505801016793e-04 2.555128068141873481e-03 5.956963769429480214e-03 5.933705328122056838e-02 1.122898964099515590e-01 1.623824327862991856e-01 1.108332159535725808e-01 8.287771583970152123e-02 5.787180549755450987e-02 2.037490956469044379e-02 7.795815673528553452e-03 1.687386798284475076e-02 6.106633226753058197e-02 2.058203815256550231e-02 1.877983752816279536e-02 6.285702111079462251e-03 7.153735365959379812e-04 5.829794361905690867e-04
8.785373283104089270e-02 7.113395161683226664e-02 6.829793054691456894e-03 2.592286877600367013e-03 3.276465254413855541e-03 2.588361533468460339e-03 4.271406650433851038e-03 4.842693657540549264e-04 4.264501137615911148e-04 1.889227217530332664e-04 4.593159404090790755e-04 8.833993275139958396e-04 1.141272949113702161e-03 5.689297382481399261e-03 8.505690304743874011e-03 4.709422476378969519e-02 1.717639203456960972e-01 3.204446945950413239e-01 3.629635170990079818e-01 3.125655393425418871e-01 6.543445349264369326e-02 1.438752601544605533e-02 1.768928819439131994e-02 4.374443906255082865e-02 9.739124435972514038e-02 2.871388926229848787e-02 1.084126489682321268e-02 4.054917501995811135e-03 1.278058296651500125e-03 1.150943381293233940e-03
1.236758713931186554e-01 1.609025392679026834e-02 3.733516052650235825e-03 9.909747461047649277e-04 8.449093601143053706e-04 1.918034668199470249e-03 2.834680954894063572e-03 3.548697638802264412e-04 2.111945499715444047e-04 2.477013539273390072e-04 4.464510869737156086e-04 7.715841309555509456e-04 8.698543026845607755e-04 4.735515348834898504e-03 1.801868110499153103e-02 8.393463992510527549e-02 1.628900723385927896e-01 3.757101493128180980e-01 4.734454108335937050e-01 3.994328429386466150e-01 1.972361782586193324e-01 1.125136646254936736e-02 7.950165136538202976e-03 1.737460906310278955e-02 1.002526867397592336e-01 6.064894735722418245e-02 5.419058127214586296e-02 1.009771208353465489e-02 1.442116502200401287e-03 1.086768228657276816e-03
7.565612397665698319e-02 2.341332702538943128e-02 7.309402672666872290e-03 5.060011509821169332e-03 6.962724617343130605e-03 5.136344460942159594e-03 2.698661941702995299e-03 1.319826698878459083e-03 2.231666963307695536e-03 2.929911862163711404e-03 2.753017310111785499e-04 3.115853143629952900e-04 4.967572566894788233e-04 1.170476580165728982e-03 7.348614083205284517e-03 3.077051574642863940e-02 3.116643917711006684e-02 1.333987501810961762e-01 1.715148765731542291e-01 1.479941403372293796e-01 1.240393783532369176e-01 1.596859722039050203e-02 2.461060572685382780e-03 4.862339093554724108e-03 2.157441693387097265e-02 5.452168841968146190e-02 1.458859029213606662e-01 8.153797341895788198e-02 1.993266671729642444e-03 1.459167196739514800e-03
2.747824259401993388e-02 1.085538962508784955e-02 9.282696282253508763e-03 1.141466397221369174e-02 3.673442643701479125e-03 1.804131916985160598e-03 1.077135587469704942e-03 9.176632766690538635e-04 3.316378491831478790e-03 1.292056668423032656e-02 8.850093529761989116e-04 3.054883156560044542e-04 5.335449734860803206e-04 1.233005436846981891e-03 6.153641555335528056e-03 1.148685208875731278e-02 7.975194338119055010e-03 3.983479839733210758e-03 6.335704986603187330e-03 1.167540872751317467e-02 2.100483326960648350e-02 4.860579480225075272e-03 2.548780454591850764e-03 1.322156935596023597e-02 3.237207870080482941e-02 1.161937177731998255e-02 4.016209565117750263e-02 4.495535043837831091e-02 1.576921905679955563e-02 2.351673890652588444e-03
2.787726742313259912e-02 2.220879398309239666e-02 8.665932865932647958e-03 4.615481860630445653e-03 2.518503589720154714e-03 1.045995454028761503e-03 8.993686686557689908e-04 1.119266523517563989e-03 1.408996245345255863e-03 5.654461889721902439e-03 1.607601959745032097e-03 1.530540864885611418e-03 1.496044749700719666e-03 1.980199340609520818e-03 6.050493821412482841e-03 4.437566214864135591e-03 3.139144107252053121e-03 1.958312844870633337e-03 1.793993287153969459e-03 1.422309343348392542e-03 1.167392446844815225e-03 1.761114057964034869e-03 2.901751519107389609e-03 7.526292826597965821e-03 1.351628479341162106e-02 6.599990917971582452e-03 1.062262460599474288e-02 7.140046382386675862e-03 7.194276723400558522e-03 4.577468703942952008e-03
3.791016923388086657e-02 1.955970470657025437e-02 8.888489675313887561e-03 8.800296385783411279e-03 4.526189169869744913e-03 2.752415273998711984e-03 1.222499052726616284e-02 1.123840258716967376e-02 1.887079537771430959e-03 1.376805649622509474e-03 4.950198897960320739e-04 1.141252559989416751e-03 3.514210839124792471e-03 4.152683116696417182e-03 1.362506502816469151e-02 1.078384627686831791e-02 3.580665785808762915e-03 4.449558565231150238e-03 2.144631414340888564e-03 9.587501911346450788e-04 8.884936669056941539e-04 1.384957893665861393e-03 2.200286005073051002e-03 7.318354632661993979e-03 7.923983229266004513e-03 1.988634338370281422e-03 2.275121296318091766e-03 2.991586358210172967e-03 9.880169108251138366e-03 2.035989571386379818e-03
5.023191012570869113e-02 4.310558291096310002e-02 1.046379420649383440e-02 2.593734818831314876e-02 1.770614124001650136e-02 3.740222372087798758e-02 3.241690365502956223e-02 4.459377508445158851e-03 1.826426126965509421e-03 1.069852688449784203e-03 3.195923901510586487e-04 4.021879552011427684e-04 5.248194410244912773e-04 2.280261952639814696e-03 3.067290732037175095e-03 1.474350871323081968e-03 1.522165885766576859e-03 1.968959708335514536e-03 2.812313070350425451e-03 1.525189180743553950e-03 8.192103382734245830e-04 1.118431738236391314e-03 1.260272131739275086e-03 2.335674443903573878e-03 8.037942748124107112e-03 1.370118152247794263e-03 2.085138380426811416e-03 3.557110458158531125e-03 4.439801459924491885e-03 8.896384831309204003e-03
2.445154482497839676e-02 6.187084874229889508e-02 1.486653062061086931e-02 1.169757009591809900e-02 3.483148382679123606e-02 3.654839165600850398e-02 2.796822075473198374e-02 2.170440587080523995e-03 1.701981675323985949e-03 1.758955121262154812e-03 7.828315297190990970e-04 4.160917553042926321e-04 2.961009670186910215e-04 5.920610054160348711e-04 3.212454525762191166e-03 1.052399963070981990e-03 4.024936528449147080e-03 2.629987167651008304e-02 4.908030165629195807e-02 6.823495651175605359e-03 1.307249577308392625e-03 1.658725938723699901e-03 1.408838680087781594e-03 1.695708632057286698e-03 2.464539151143883399e-03 2.051604850597779119e-03 2.547428773996235612e-03 3.235534428011069708e-03 4.515848644732423957e-03 1.118813293291112503e-02
