1.887506829672375847e-02 2.810365039753132121e-02 2.427501566004717712e-02 3.037449388544209011e-02 2.291670371179290941e-02 5.003305452215466714e-02 4.963469667615515168e-02 1.343718333672891396e-01 2.433565736058465045e-01 1.075149294976989606e-01 4.873728352282764159e-02 1.090057465284620559e-02 6.332872573397044062e-03 2.375937821942636016e-02 2.773245590644304523e-02 6.096109128581017091e-03 2.144394398874371888e-02 3.761968468369179808e-02 3.411513446897158214e-02 1.201624726316494890e-02 1.014404753073962565e-02 4.093577883968436276e-02 3.215020321963110023e-02 4.347184973008415623e-03 7.866634922008551925e-03 6.061720311849598704e-03 2.763562776797062661e-03 8.064897942414956528e-03 7.780022669392070572e-03 9.711232394672936891e-03
1.511108229178570808e-02 3.397180102570508675e-02 6.070056797152506567e-02 4.949801727483990610e-02 3.431117660616902348e-02 1.524702877882534724e-01 7.186348562095121184e-02 9.065165564349558780e-02 5.889203779162419800e-02 4.969171171449856400e-02 3.439849743138072291e-02 6.601390797872533182e-03 8.663767991126043386e-03 1.973556867976166210e-02 2.748805059894456754e-02 1.749497274316077003e-02 2.156768115560682778e-02 7.069183293553067682e-02 5.339346906409882937e-02 1.603053605539865936e-02 5.971779546467824960e-03 3.870212010805078318e-02 3.088324122666921689e-03 2.462553127966359869e-03 1.934866996441858425e-03 2.514516165782475915e-03 3.047816820007463040e-02 8.061767963079698521e-03 1.166510503690792316e-02 1.162313875087530278e-02
1.849676524753711693e-01 1.915616874087454902e-01 4.053556288203695179e-01 3.303552064046802461e-01 6.987947513707153391e-01 7.051162723056209058e-02 1.290978122362867499e-02 1.377727873700386636e-02 2.199669230274706178e-01 6.671637077148993844e-02 1.768203525097563344e-01 1.160032460879354271e-01 4.207488089880989657e-02 6.072042698093679802e-02 1.150954300427883652e-02 4.761971282177179104e-02 3.184829978842752818e-02 6.523121046520176380e-02 2.171285132373184101e-01 3.597494731250263506e-02 3.485083786851912117e-03 3.146529493485846624e-02 4.985016991076030024e-02 1.753454612337970731e-02 1.043714967688773310e-02 6.942918906773862774e-03 6.249414933682010190e-03 5.011034356197719038e-03 8.559670644375521817e-03 9.603423864915375252e-03
8.632613565040013481e-02 2.510306209948291456e-01 5.517199493813597089e-01 4.463911663278638531e-01 1.812358745699154117e-01 2.766658541980329331e-02 2.145704522501261716e-02 1.433237009964075277e-02 8.714945334852793046e-03 8.159594475534608093e-02 5.213367288257713533e-02 1.021061625036294718e-01 4.563067845644708936e-02 2.989340770574867509e-02 8.685703155289666022e-03 6.498651857969787483e-03 1.347620770190453669e-02 2.512448872513845313e-02 1.769890464683788328e-02 1.500835858129616861e-02 6.743078947658294291e-03 2.385452658015425713e-03 2.222610727460905267e-02 4.447470062591846879e-02 8.544369224591149073e-03 6.306266044067888703e-03 5.410043289650145679e-03 5.137013155706211982e-03 1.043505398759606712e-02 1.134355632876715009e-02
4.971786871332967150e-02 1.560606767886022761e-01 4.366024762387016867e-01 1.691888784245939581e-01 9.544022748280002466e-02 1.372544529148814890e-02 2.064712325442495319e-02 1.131666809469194027e-02 5.222655903384675752e-03 1.824058200120426965e-01 2.288516290399483233e-01 1.910941067180778608e-01 2.779030029363169924e-02 2.487183114440092574e-02 1.154766445692950727e-02 4.264236626813889229e-03 4.009887739248394617e-02 2.288814070772449832e-02 3.647757786081871206e-02 2.085035529284395145e-02 1.428278026468858021e-02 3.963291027651947435e-03 9.093011615910376322e-03 2.583538995754550236e-03 1.542215287424363208e-02 8.432003882465840400e-03 5.863417828665908570e-03 6.773350636821605895e-03 1.057996187942936671e-02 3.885884661728455924e-02
4.944113685239254902e-02 5.211187764590183985e-02 2.339975399560871860e-01 1.875494027980482425e-01 7.373797684227098581e-02 7.821148911716568550e-03 9.368216171289968711e-03 9.864935954370214824e-03 9.187951401972104665e-03 2.774345479808652537e-01 2.168441282344590881e-01 1.116123146747039913e-01 1.415197661328616505e-02 5.069238879862576243e-03 3.954877530563141730e-02 5.706148014650597004e-03 2.369148483905177821e-02 5.776328533455245100e-03 1.851593691215696127e-02 6.361632622337853871e-02 7.707796385103560244e-02 4.669366281674625085e-02 1.256962840899642463e-02 4.158118013795516349e-02 2.302380762222681551e-02 2.206965745718725280e-02 1.380252755619103787e-02 9.479833424469896741e-03 1.244575495629041996e-02 2.231332379852913120e-02
6.857916233170383534e-03 1.089736187935411854e-02 1.152769168384504966e-02 5.843361569309895448e-02 2.795828444806183061e-02 4.595752246555085546e-02 6.858584619125172865e-02 3.848207579256271438e-02 4.526641004311492134e-02 5.225014885649674479e-02 3.985917401246594216e-02 1.607717264838768451e-02 7.602411033993614238e-03 3.439330639431283088e-02 2.002663421962196794e-02 3.427938529580384919e-02 1.331331838689998187e-02 5.919386328054771287e-03 2.994176108040803516e-02 4.077428862135953902e-02 1.875272319173602181e-02 4.928590428163813486e-03 4.043616161284713240e-02 3.906393479021665754e-02 1.588971753902793452e-02 1.639876103550694242e-02 1.445190094176317455e-02 1.239020513204546446e-02 1.374250234936909981e-02 3.255355016404841428e-02
1.462025899702484172e-02 2.686495674112733892e-02 1.568868521460617393e-02 3.375117191764218094e-02 5.181483011073625966e-02 5.808877757592051383e-02 5.116057788292292796e-02 4.798658537099112498e-02 3.799899989704529080e-02 2.097054043036683524e-02 8.318290063332471965e-03 2.536849952054968937e-02 6.288436189103538063e-03 2.272705591463718838e-02 2.567191402615443679e-02 3.875799801057803074e-03 2.684244704556652469e-02 4.095364879588985624e-02 3.591145455177422591e-02 2.635020203070617337e-02 8.113452871031085964e-03 5.044981857130962158e-03 2.926026456372443629e-02 2.533173883489152345e-02 1.216211525406489524e-02 1.229201190098512704e-02 1.832884108306348167e-02 2.102844938727035581e-02 2.017608529127998956e-02 2.601872421387708880e-03
3.846184528864743379e-02 2.543948064767998299e-02 1.477902199046934699e-02 8.529850294125225496e-02 5.490668277297146294e-02 2.323720165397777371e-02 7.476916401353536634e-02 3.365254184759645245e-02 2.823700948250603901e-02 2.738644842456582768e-02 2.405876990513360070e-02 3.097820005603077118e-02 6.852488675686724262e-02 4.637666467220073752e-02 6.792215979225807096e-03 5.946064429777393398e-03 2.481529724530680964e-02 7.629955680276982732e-02 7.549595539502468311e-02 1.379191128578384148e-02 3.325599083731112238e-02 3.443214448181195625e-02 3.754003730865174832e-02 2.492020109282686371e-02 1.464271520717762808e-02 2.022084063392722356e-02 2.880291118288419959e-03 5.383094978285478394e-03 1.571112791308238929e-02 7.817649977873876790e-03
6.278220048186848590e-02 4.141970835202660184e-02 6.552649757479257764e-02 6.117010380166781197e-02 5.277000077643107662e-02 1.042642726536468188e-02 4.837587983420432031e-02 2.158443720124907442e-02 9.158404921205794136e-03 3.861036865123439188e-02 4.681573930138981793e-02 4.477943592055683847e-02 9.327519473072005962e-02 9.913864249088857883e-02 4.627321491142249305e-02 5.017204699365238052e-02 2.723142061719370233e-01 2.857276061473192352e-01 1.151686969980690728e-01 5.921122726252219665e-02 4.374192636181140764e-02 2.744439239988521670e-02 3.086316508880962775e-02 3.345177636968742207e-02 1.858406083143474344e-02 2.231320250014204309e-02 9.529527474131488721e-03 1.459366738330161728e-02 1.820593974390711731e-02 4.683141363316341461e-03
5.188529639380009412e-02 2.756826635519842375e-02 6.092951389466844808e-02 5.210399824724750578e-02 6.490843760838758969e-02 6.813949960932693360e-03 6.490241910430380283e-03 6.098582164369655001e-03 3.880136773180292015e-02 2.629180842243536431e-02 3.752970734606315140e-01 6.158093511488659244e-01 1.253112944756006542e+00 6.071549340948013684e-01 1.099775321770636305e-01 2.136705049866146067e-01 4.017359403323716993e-01 1.119750874653495237e-01 2.676442157344001427e-02 6.350575746773516952e-03 3.004647242029642035e-02 2.667897989626321145e-02 3.294022330240066465e-02 4.435563810924781497e-02 4.659931212454818811e-02 2.521822178643986015e-02 3.946354941145559236e-02 2.932696997521510446e-02 2.625348698826232910e-02 1.890949201035789853e-02
1.090313296670422129e-02 6.419750027674084487e-03 5.007681292659257877e-02 4.938562502362706802e-02 3.791365278144074452e-02 9.943246433339153825e-03 4.602335026522525602e-02 3.275464941280240017e-02 4.012407770152295883e-02 5.145779148053768876e-02 1.135036397782660661e-01 7.370895171618008224e-01 1.303096054189243791e+00 6.634195646418060699e-01 2.345576989688102354e-01 2.611271266460574170e-01 2.890749405463145516e-01 1.706271350189125235e-01 4.187112116360285768e-02 1.345526964089741040e-02 2.862725784596010722e-02 2.899974975530227733e-02 3.265946587198027135e-02 6.458335455625815666e-03 4.947893476233681913e-03 3.848837110178866122e-02 3.071269814867275127e-02 2.756947501624861657e-02 2.941974247738947043e-02 3.127707767788083515e-02
2.415387106447064100e-02 6.598716036275354378e-03 1.166399901878319503e-02 3.461333257971974803e-02 2.239508232520318054e-02 8.131562114851878173e-03 4.656315187678012300e-03 4.180580065573163973e-02 4.412239788842487083e-03 2.525926541001970865e-02 7.902719402064656631e-03 2.338165873647254644e-01 9.707973527722035811e-01 4.095921927714034072e-01 1.265638646456271887e-01 1.443179389141331648e-01 5.310911038772322956e-02 7.773206776429500420e-02 8.821293731986817876e-02 3.498559359223877424e-02 2.713419762393931567e-02 2.941422251066483709e-02 3.532990051443526264e-02 5.085561710827041053e-03 5.701925519914164721e-03 5.779357768439141035e-03 4.658774101737734631e-03 4.611888757808005335e-03 3.784374423741293514e-02 3.056044084978784894e-02
2.128200058521418844e-02 8.371503416652973165e-03 9.083975515461953712e-03 6.011750508294755845e-03 3.576739856308300963e-02 1.399956387806035665e-02 4.732389138626492270e-02 3.899385414114621418e-02 5.098548450024721970e-03 2.390447876990377252e-02 5.826199720654606090e-03 3.810387231830624638e-02 4.439663648828637288e-01 5.913840016036405745e-01 6.199537475851841783e-01 8.243440122622979205e-01 7.366089826952714192e-01 4.761286057571835206e-01 1.295242391988303154e+00 6.007197728855615537e-01 5.139856218825959028e-02 1.606791069019726514e-02 1.187590943149234406e-02 2.796516247589190748e-02 6.006281142645292226e-02 5.605677620443667158e-02 1.518886930306920513e-01 5.141306797129503725e-02 5.737038302240965622e-03 5.597854557734142054e-03
2.045247633714731769e-02 1.942179795710545498e-02 6.597003215446356657e-03 4.002400021325101115e-02 1.297949930304310648e-02 2.982315383408427889e-02 3.049103646203564152e-02 8.426436896431256651e-02 5.773679197259402873e-02 5.855083373610105169e-03 1.233947915265793706e-02 1.909846375745029579e-01 4.019015925853250404e-01 5.031708397966644375e-01 4.479685008766294274e-01 5.339981210578402804e-01 9.027493549574868714e-01 1.548132449415580147e+00 1.562798909806321968e+00 1.214768429552832263e+00 5.134601387234863368e-02 5.312349300084133474e-02 4.728658064006713985e-02 1.469984097945966073e-01 2.097325239733599245e-01 1.064872069588437054e+00 1.051206545065870079e+00 2.036730150885399382e-01 6.194144811285836640e-03 3.847318870115483402e-02
1.955589226202371009e-02 2.041867330147830589e-02 3.970733641839897105e-02 4.078538812802747632e-02 2.660858698375368273e-02 3.201703910210967202e-02 1.672144201737237046e-02 4.539137192405308385e-02 9.416985806513650248e-02 3.335449007656612203e-02 3.429247513388328922e-02 2.990769764682758847e-02 2.311875773226967079e-01 4.615338636423735874e-01 4.243259570329767638e-01 6.423065455315247751e-01 1.099540169796427991e+00 1.320653180669767890e+00 7.534544932097481107e-01 1.620540828124318045e-01 9.657720511406051034e-02 6.599708556341908894e-01 9.599330986848760849e-01 1.587976345310343262e+00 1.472777429524214865e+00 1.900321671612619889e+00 1.500165780759895151e+00 4.158566027488922456e-01 9.733136914809273343e-03 4.475790799389049723e-02
2.528824368945058187e-02 2.844106548856219913e-02 2.665637185698476255e-02 2.411338498503008687e-02 3.511376684933657788e-02 5.037956113743096223e-03 2.656963558320373231e-01 8.859244294701439371e-01 4.326082328058861171e-01 7.379864162906385472e-02 5.470626420491807307e-02 8.520754119876529364e-02 1.674312773231828588e-01 2.435863944446532703e-01 3.179921550134641173e-01 5.645190509399722334e-01 1.198880567787674822e+00 1.185041381973495511e+00 5.510840959407257156e-01 1.863854921242171503e-01 7.989931036906642303e-01 1.443021981418144195e+00 1.842004972562433673e+00 1.855517635301167312e+00 1.602929809806290740e+00 1.364004166177905875e+00 1.982082940607747590e+00 3.376402616978451121e-01 1.252475423559356454e-02 5.386942058418392985e-03
6.302855780092041227e-02 4.867683860530882395e-02 2.353059045925325055e-02 3.311042621832668148e-02 2.893595579648183466e-02 1.326870713009370428e-01 7.296463747780863596e-01 5.988285178107741746e-01 5.891680763468430948e-01 2.939817304804512865e-01 1.075740381505330273e-01 2.898429197371131527e-02 2.813571050572028984e-02 7.113647648763610221e-02 1.586985530708313608e-01 7.215162903329853661e-01 7.438556240518345852e-01 8.463951670757289270e-01 1.443286233005351693e-01 2.506442088213418629e-01 8.820583136895858711e-01 1.893656200887193775e+00 2.314037164169115091e+00 2.339749735850902734e+00 1.882616677764203272e+00 1.778167066281054254e+00 1.624480874204621950e+00 1.270624469930988765e+00 5.576930077662897028e-02 3.624909931303059440e-02
2.530433063877920302e-02 8.569263564007239056e-03 1.012331069890906945e-02 5.090785183237731687e-02 1.081378212357396867e-01 1.514341218006079459e-01 4.800889356957143139e-01 6.038471181321537484e-01 4.155073877403427929e-01 3.219413247562974978e-01 6.711267701806838959e-02 6.559025551912745118e-03 9.851380853046102365e-03 2.721539148513485440e-02 5.811620439337366467e-02 3.361218225061548548e-01 1.254524936421383408e-01 3.912633567679027480e-02 1.285298483113840075e-02 9.209855285781656797e-02 3.489367611180241302e-01 1.847506879423833848e+00 2.319938664034751685e+00 2.359121544441450613e+00 1.665784155442129988e+00 7.480083826709814643e-01 1.184972668096355264e+00 8.026829497223878507e-01 7.183306076477122271e-02 2.784206568228085946e-02
3.546620637314767954e-02 4.570473937917909207e-02 2.944852816780690538e-02 3.668679642526102846e-02 8.643415607800865319e-02 4.998695528525699122e-02 2.591431818025574652e-01 3.377723284666606651e-01 3.127383648427694562e-01 7.308237322001419345e-02 1.822208532896059732e-02 3.843976934850501081e-03 6.803796222247198051e-03 1.945087092594896538e-02 7.486407439535253117e-02 4.815513912567211813e-02 8.586310457005216779e-02 2.481146992872126575e-02 4.579504420090960842e-02 2.152509328733085425e-01 1.157068986752221029e+00 2.178390889783033746e+00 2.322832749891728277e+00 2.131384435889960294e+00 1.569039127774691122e+00 1.104982470037622511e+00 1.037911879965084827e+00 6.914853520885325677e-01 6.182439215632858781e-02 2.168107947884864023e-02
9.795387135281205526e-02 9.026462862990983216e-02 4.622823863287783136e-02 3.325942520674739222e-02 4.321164381445312397e-02 2.342081823353399372e-02 1.346864664376322684e-01 1.219021353050113582e-01 3.407379999992880826e-02 1.882951934761056476e-02 6.514020059282288853e-03 5.122171813046865092e-03 3.029670203647129474e-03 3.215112533560544883e-02 4.202166852752735847e-03 1.370636429590515321e-02 4.805498600010905952e-02 1.073980730509324910e-01 1.015024694782625664e-01 4.484892567772538197e-01 1.220883051129244556e+00 1.756915799312218640e+00 7.097707682799077045e-01 1.023902813964938430e+00 1.261959596823140961e+00 6.831432168005288075e-01 4.911530002641191217e-01 4.050568167318562285e-01 1.703589614823653245e-02 1.580144500095069168e-02
8.059226365530994252e-02 9.324463465680798979e-02 1.364124040770419224e-02 9.406040091299689224e-03 7.715024096125822593e-03 1.162866148151074815e-02 1.700659491877107646e-02 4.381532210858464851e-03 5.881580663241865042e-03 2.440557310310257147e-02 3.365257307664421688e-02 1.945340450172854552e-03 2.056422961074593631e-03 7.233138776531814612e-03 2.012569128270967275e-02 2.535440456696591571e-01 4.781226173685231839e-01 6.786351357884301549e-01 4.549841941853011162e-01 3.371437818133287134e-01 2.368373123383784584e-01 8.385972140302459799e-02 3.234708764178724494e-02 6.768714757358687550e-02 2.338919804043888551e-01 7.533839752673814061e-02 6.625035582437573123e-02 2.642210468877380716e-02 2.592917473930714603e-02 2.436271089735193504e-02
1.717865400098783080e-01 1.322774109169101708e-01 1.408619157141257142e-02 6.044498564585692145e-03 8.842741495221276629e-03 6.951860237316792764e-03 1.115173077062523756e-02 3.527236330885161197e-02 3.339232280982942086e-02 1.454138891770674971e-02 3.385287605265571015e-02 2.226818499011271740e-03 2.678419977721157100e-03 1.449152922741730673e-02 2.401340129395312939e-02 1.513186244504517997e-01 5.433689611404056707e-01 9.919982100625057697e-01 1.099891781260953882e+00 9.345305763052411674e-01 1.957755593075291567e-01 4.310525282003708353e-02 5.330483496353366490e-02 1.289181906325138627e-01 2.775842930239454942e-01 7.916728203655037932e-02 2.900883311936407541e-02 1.344731052331940742e-02 3.715267417010734846e-02 3.590584904786831011e-02
2.159219429115137867e-01 2.744216003405047441e-02 7.475963820141133358e-03 2.441226381036907655e-03 2.754182774029137210e-03 6.066942295919769239e-03 8.140155873310343793e-03 2.844586816086386305e-02 1.641368282209533513e-02 1.882186033271382453e-02 3.263147288552774306e-02 2.122600483626355203e-03 2.167168303211486867e-03 1.179213559456869856e-02 4.444830919589763674e-02 2.179595735170030135e-01 4.134909123472659265e-01 9.305175009406749798e-01 1.143815619662607252e+00 9.497823877602404874e-01 4.683012724089850032e-01 2.669144833104114198e-02 1.892229692635775257e-02 4.087885025471096889e-02 2.315166296350730513e-01 1.375972930263890670e-01 1.208556733393630206e-01 2.711124964858595623e-02 3.063307274844942821e-02 2.771290877751965420e-02
1.198060077438499460e-01 3.703053672397266932e-02 1.424972385447527065e-02 1.324530100053433052e-02 2.898350973040738840e-02 1.984053031340265311e-02 8.339901652635824114e-03 3.456409033649593659e-03 5.256610752473357163e-03 7.044331774234051900e-03 1.962197727357464436e-02 2.266815120329022590e-02 2.883636390491974011e-02 2.888863100460080120e-03 1.619588940637273558e-02 6.779091055534905430e-02 6.665948439649455048e-02 2.769785188470804682e-01 3.460650820534846850e-01 2.934906464274908422e-01 2.452960396091692363e-01 3.152061370780269434e-02 4.864615910430592979e-03 9.614518504549312769e-03 4.251828575639683000e-02 1.072067609853037812e-01 2.850687315092892971e-01 1.685498340421655306e-01 3.516376935379023072e-02 3.051540238422946472e-02
4.288043189517027481e-02 1.700111202225492932e-02 1.806569952430182868e-02 3.033457807647027896e-02 1.627848213877832600e-02 7.287932625550540625e-03 3.360026016599761394e-03 2.363164620555850692e-03 7.530296677550552681e-03 2.940110008008281137e-02 2.166850229120628833e-03 2.167724261486480078e-02 3.177617437117150057e-02 2.994469846500772293e-03 1.316681057179767793e-02 2.424599843686125328e-02 1.625925511838851797e-02 7.857426258527172580e-03 1.307541894600191754e-02 2.531951433633360463e-02 5.035038997712527192e-02 1.093544776706523169e-02 5.320466380282735247e-03 2.478962481713642418e-02 6.071295575964838487e-02 2.186578276961759215e-02 7.533938735073990312e-02 8.527672369061502222e-02 3.862576651386662174e-02 4.382079253525617696e-02
4.346968745853009575e-02 3.484601202028474870e-02 1.690814359556242277e-02 1.230681146500506480e-02 1.123138798395657487e-02 4.210903968536487338e-03 2.798900879380047512e-03 2.877471525469134719e-03 3.198967551527283956e-03 1.303404368785860724e-02 3.808391442309230854e-03 3.899961971075489083e-03 3.613672814141842982e-03 4.548457513608935437e-03 1.298089903576972286e-02 9.390880640725449147e-03 6.412375402166561877e-03 3.872335623037855869e-03 4.515720381781475334e-03 4.270345454227762044e-02 3.491685213959576373e-02 4.749115163214708696e-02 8.231784345304558187e-03 1.430076328606989626e-02 2.780406661912492028e-02 1.544908048027983025e-02 2.478365162692153234e-02 1.508295482623599713e-02 1.645409883896849224e-02 1.046312672720620986e-02
5.908134817533477329e-02 3.075370068494802031e-02 1.738602813183780585e-02 2.354536800206271513e-02 2.032040373588830592e-02 1.104884240799762322e-02 3.796805828633015994e-02 2.884580642728195796e-02 4.282896953620835521e-03 3.251253461153888469e-03 3.521648192346690798e-02 2.984010344079227831e-03 8.570932583232777902e-03 9.515568644977965423e-03 2.925102169492493562e-02 2.282906268258798332e-02 7.314939927625017935e-03 8.802268591358075600e-03 5.320684077648894263e-03 2.836346760109413959e-02 2.801905147377663913e-02 4.146386607684691972e-02 1.012231297058229819e-02 1.850236505027757702e-02 1.894187693640937351e-02 3.923678850641462712e-02 4.527407426945301294e-02 8.210686522910036478e-03 1.996445205378031412e-02 3.238207483067458148e-02
7.941714201554164743e-02 6.863273259371396873e-02 2.072292979225022133e-02 7.017589831245625576e-02 8.023984176983924022e-02 1.519316169636091007e-01 1.026621963558235900e-01 1.169506790037044310e-02 4.234541992286385524e-03 2.568652573379210692e-03 2.357385013543060459e-02 2.767411257351990936e-02 2.932000523153472163e-02 6.144240460971966793e-03 8.185636586386569116e-03 3.534238636851372729e-03 3.454542160535405398e-03 3.915418990111865262e-03 6.250676212631021446e-03 5.806709273266794785e-03 2.514784493412360392e-02 3.649620695102175072e-02 3.830137432133397246e-02 1.023881175635122862e-02 2.894756595301229557e-02 2.924623164603028583e-02 4.287650353530406827e-02 1.292908419685970776e-02 8.960744484636917057e-03 1.736369842633455132e-02
4.301338161077815359e-02 1.067426709484961544e-01 3.179623946972552628e-02 3.372485077273019299e-02 1.614464654836406110e-01 1.709941917544263446e-01 1.142953522736189775e-01 7.886005246394952803e-03 5.602395675655284790e-03 5.501103093497449609e-03 2.741097125821273170e-03 3.663825826291833287e-02 2.090806799962742490e-02 3.020598219370237633e-02 9.102971855313899199e-03 3.635919449025559747e-02 9.034288045815843868e-03 5.155749513273757273e-02 9.351274036998832861e-02 2.017253790955120252e-02 3.564257358568792555e-02 4.943268333681304777e-02 4.113816914135660224e-02 4.022382273979065170e-02 8.460929249535190100e-03 4.136732646156013327e-02 4.854859212911541433e-02 1.090965534784895177e-02 8.113193386277401872e-03 1.931653987611959417e-02
