2.469949905019420272e-02 3.630550586909665756e-02 2.934283690477906478e-02 3.705901324861825274e-02 2.826093380177211942e-02 6.230938468236278671e-02 6.230178834801132493e-02 1.697383019518995118e-01 3.092711147763638202e-01 1.394481052629460982e-01 8.175718800779170625e-02 2.051720306759707291e-01 1.282449990809552687e-01 4.101317747231840449e-02 3.989793958766508358e-02 1.351969296540394827e-01 3.104893480409712941e-02 4.855430945179074059e-02 4.363224559264122088e-02 1.626542574692317958e-02 1.412546906169383221e-02 6.154345408401937223e-02 4.892316767171482617e-02 1.893259244421851006e-01 1.426294792670949885e-02 2.795496236140834201e-01 1.304078750793598862e-01 1.147304925610300418e-02 1.092002768153664365e-02 1.369020036333625130e-02
1.957070247810560049e-01 4.255592138901900107e-02 7.184075604848987051e-02 5.879462241215061696e-02 4.100860351772159240e-02 1.941540909768998402e-01 9.782406441549121312e-02 1.237983769609600770e-01 7.746227694647206397e-02 6.327896435557683885e-02 5.480255803713830060e-02 1.045956854922887314e-01 1.501616345473279768e-01 3.296855365562337270e-02 3.905454675064910786e-02 2.497341822019987292e-02 3.094601604055925020e-02 9.128244722700723512e-02 6.830716372679343507e-02 2.223367970438546934e-02 2.312362708408069456e-01 5.901806619320670855e-02 1.272024817378246686e-01 1.099432871743597911e-01 9.598565156162569556e-02 1.266614170186304844e-01 4.547750072537146138e-02 1.157994572977351540e-02 1.645228058625869058e-02 1.641709901982948971e-02
2.321328899959517744e-01 2.359483437920826820e-01 4.718398306011923893e-01 3.845110093091504977e-01 8.148320300160170060e-01 8.783289810307431944e-02 1.690877134032472695e-01 1.796256961786154849e-01 2.972932188019313804e-01 8.582994014721764819e-02 2.293715531256055318e-01 1.624596988120788343e-01 6.023382138446158052e-02 9.231005808358433429e-02 1.763336413441287526e-02 7.488081519982391077e-02 4.541740911309765510e-02 8.430570717768867683e-02 2.779922763162912536e-01 5.024203986237023301e-02 1.467955602528495940e-01 4.898017669999334134e-02 7.693293667889739007e-02 2.677691956979747628e-02 1.570798215429926314e-02 1.023562848421391211e-02 9.050901164501362270e-03 7.116843603061905402e-03 1.213096684227599892e-02 1.359055236426581249e-02
1.015620038194281205e-01 2.929216442721214175e-01 6.430259170245915534e-01 5.204152413482219242e-01 2.241124129492795547e-01 3.687132346549087253e-02 3.936197826255784932e-02 2.573003966769242881e-02 1.205301507534889405e-01 1.081319968195209452e-01 6.619283181721047349e-02 1.314208531742450670e-01 5.988355042543359874e-02 5.450450236496201528e-02 1.724991798322475511e-01 1.531669046681278790e-01 2.111974103972745487e-02 3.312489182351086719e-02 2.312448013901301225e-02 2.017058241786369790e-02 1.015141294996523523e-02 9.947695195210573549e-02 3.419742066823671517e-02 6.653168552122895596e-02 1.275324968176694274e-02 9.086559579631250244e-03 7.721911412763912165e-03 7.332800672066348315e-03 1.489530294252333457e-02 1.619355428688169091e-02
5.856078015031696699e-02 1.827070061093358233e-01 5.106756766155879923e-01 1.981171391398768022e-01 1.241781574802558741e-01 1.915579234752300686e-01 4.273097647579762737e-02 1.914160568902578963e-01 7.608013909917868411e-02 2.533584148246716961e-01 2.949793021040592600e-01 2.656705131763993366e-01 4.355149580353835648e-02 5.313495638982233815e-02 2.273223228953036301e-01 9.357604764805781128e-02 7.386488595130780155e-02 3.261398596817659257e-02 5.180976209951142913e-02 2.774766724251136532e-02 2.044568437933637697e-02 1.303513417729716684e-01 1.399653413797498705e-02 1.049325964075120132e-01 2.294249217569657370e-02 1.218368926912481547e-02 8.388769464436892503e-03 9.724881031743818835e-03 1.524240705445315675e-02 5.617520190467574503e-02
6.788216872056995754e-02 7.192898483502044304e-02 2.991315836116468230e-01 2.282076619876513002e-01 9.710645835740511211e-02 1.110691871560075539e-01 1.427841918207650440e-01 1.542153963641084424e-01 1.328665118737964168e-01 3.807566469207197546e-01 2.840315203756336171e-01 1.695748193585677743e-01 1.959944159947484277e-01 7.395727297654529353e-02 6.208897054641251273e-02 1.058495484081391352e-01 4.288155433621082535e-02 1.399012376113440426e-01 2.847683953487296221e-02 8.691111642038107377e-02 1.132245347684546349e-01 6.901029251788186325e-02 1.958352884790829848e-02 6.191955554342029600e-02 3.419562979818146359e-02 3.197239137211163595e-02 1.981476350559233449e-02 1.371198919553575160e-02 1.814893076232980060e-02 3.273094228167794384e-02
1.044053350366701965e-01 1.556418073341867270e-01 1.570832112349241916e-01 7.164442656808245324e-02 3.455665474361254569e-02 6.371825727330789058e-02 1.076323637850863102e-01 6.193615990090393930e-02 6.855051477408251326e-02 7.549797679923848925e-02 5.597185737471187250e-02 2.761170872670914295e-02 1.112557355854373875e-01 5.297302962470002569e-02 3.090571484941577809e-02 5.259816286211345393e-02 2.421257973806361513e-02 1.328287889380956599e-01 4.637418545727763075e-02 6.401049904891362163e-02 3.475594482757864839e-02 1.342151694074794899e-01 6.217609369010118625e-02 5.795638789564668686e-02 2.329461123891969285e-02 2.386244269230179682e-02 2.090618247731504745e-02 1.810440825386797764e-02 2.074806385755705376e-02 4.943447681653631576e-02
2.034339015510436971e-02 3.840950355577874009e-02 2.065045784374263879e-02 4.197624744118177986e-02 6.211897527439824013e-02 7.088145412290809688e-02 6.389131501669939595e-02 6.126803354056362116e-02 4.954412693084822572e-02 2.932937444619167222e-02 1.322484107712717794e-01 4.174980048296239588e-02 9.390763148476911903e-02 3.451297113454379617e-02 3.905688391657162473e-02 7.087640353190627351e-02 4.336143382953375203e-02 5.893458211477078934e-02 5.167718878944045635e-02 4.044570937516175912e-02 1.913078792105037951e-01 1.127374325654721399e-01 4.525038407951827157e-02 3.771530368198941496e-02 1.783934424484513032e-02 1.833309053318367757e-02 2.804515876152035084e-02 3.199462701771105255e-02 3.088921294420497732e-02 9.024334249110357864e-02
4.654349859759165930e-02 3.073858466716847260e-02 1.794444627352889676e-02 1.041171678250311650e-01 7.185986234845943843e-02 3.078037127856830465e-02 1.004253106686955332e-01 4.758512822746684828e-02 4.083226977057069496e-02 4.280645088786171060e-02 3.406510334010347252e-02 4.690934898966864913e-02 9.764953953343172288e-02 7.023189476826439959e-02 1.247085874430602370e-01 1.045599256146749756e-01 3.672017417914679588e-02 1.021586557857349087e-01 1.007441062004703347e-01 2.052519627964738413e-02 5.068488166693280172e-02 5.290985475910303659e-02 5.732036170010495341e-02 3.729982202658315565e-02 2.164739808077723385e-02 2.997385858876256554e-02 1.054627914933491950e-01 1.926070860510331884e-01 2.924880984906066267e-02 1.353873280713958037e-02
7.736332002378430717e-02 5.099303486747865100e-02 8.052548828727221220e-02 7.594584387598041220e-02 7.456289544886884890e-02 1.459131933231704314e-01 8.531383437684157689e-02 3.761600756120542233e-02 1.547617719071282538e-01 5.586556478765375422e-02 6.121295899503058358e-02 5.923343894491941986e-02 1.243147055875275520e-01 1.385465134691842570e-01 6.663636430591787785e-02 7.181886049268307315e-02 3.690822435895392273e-01 3.754930675665944517e-01 1.572120023021191804e-01 8.243115430203779015e-02 6.470998418262520480e-02 4.104046853401008971e-02 4.693437848651946936e-02 5.126968162491865599e-02 2.831713111280483031e-02 3.358855307244959509e-02 1.536258713371623646e-02 2.328778960884193491e-02 3.085583301539603085e-02 1.482081034760871496e-01
8.569550368665060369e-02 4.444906255909050752e-02 8.082708959512319158e-02 6.523803655007236191e-02 1.037262319174450109e-01 9.112276845362485278e-02 8.900461047171330520e-02 8.187197148458563722e-02 5.644032205889057408e-02 3.871888023527818995e-02 4.873642629599026499e-01 8.098387659468491151e-01 1.658077585243696417e+00 7.993158814208273233e-01 1.440344548665402069e-01 2.785961301970652504e-01 5.207949805990681469e-01 1.445048893433700798e-01 4.016551262223548580e-02 1.056465322061966861e-01 4.441168484080432882e-02 3.959326860643595791e-02 5.103121035516086645e-02 7.103113179219133766e-02 7.525526833535522986e-02 3.912785142731270427e-02 5.776058550356132082e-02 4.360344438640758463e-02 4.042438307501501626e-02 2.988907680127245864e-02
1.546937830205612763e-01 8.432275239221420637e-02 9.201851297987349854e-02 7.458951182183691520e-02 6.254943019895138623e-02 1.419350409930982826e-01 6.884582336397596092e-02 4.822231140205957001e-02 5.785400283898363416e-02 7.081389080215848286e-02 1.478572860487017415e-01 9.698779552326447506e-01 1.702042649724131884e+00 8.606749718198178911e-01 3.023423151657599339e-01 3.342816314555753787e-01 3.685498812763402521e-01 2.170129035854181376e-01 6.289955778606268200e-02 2.373284209693272140e-01 4.188853520976333622e-02 4.256750622512188442e-02 5.022423399972947289e-02 8.958236979915680520e-02 8.485323061909848252e-02 6.013562913031640644e-02 4.597008299785778490e-02 4.192859016189535992e-02 4.609002707608200744e-02 5.023846947296426585e-02
3.666365978147381050e-02 8.617958965971408980e-02 1.885580483959675424e-01 6.994262092947234333e-02 3.968964055682941416e-02 1.146898831688584336e-01 6.647442804149605866e-02 6.030651206758462501e-02 7.781465212777022300e-02 3.686681915363038131e-02 1.486028652396770011e-01 3.097065185833854928e-01 1.249851511225651635e+00 5.232064493153778528e-01 1.605084388972298215e-01 1.817364037225344675e-01 6.673543704499998452e-02 9.759198135168530019e-02 1.233766266288959246e-01 4.955158554637101309e-02 3.961019152261562037e-02 4.333636398297625869e-02 5.428399411897481819e-02 9.025305720570218904e-02 1.146048546491017089e-01 1.015333546124994324e-01 7.511742993007090863e-02 7.091012422304379670e-02 6.255937458039623200e-02 5.227189921275181977e-02
3.159325263195294359e-02 8.660967859141902037e-02 1.338548562174616263e-01 9.139723527968215966e-02 5.264705028369220940e-02 2.834778682835288610e-02 7.178085639811142282e-02 5.733261416713959779e-02 1.062394118140772559e-01 3.440440161653804396e-02 1.225671074307101427e-01 4.991757162537845821e-02 5.631675326366678558e-01 7.430383555838928622e-01 7.733538428013418953e-01 1.021276165875173669e+00 9.123260978428074930e-01 5.900425428644823223e-01 1.606104446745211023e+00 7.471426294329401863e-01 7.399281386665421123e-02 2.549765282606138439e-01 1.894481510884220288e-01 4.758490989122043935e-02 9.565753668897583606e-02 8.431798315046529213e-02 2.222004485994412415e-01 8.207925156150461254e-02 8.494822327854123500e-02 9.879650356974950531e-02
2.961630349791914002e-02 2.855251483101022697e-02 6.840574593405041037e-02 9.263369776742474970e-02 1.725580786616280893e-01 4.326815742212155452e-02 3.836232762579820654e-02 1.084440963949686865e-01 7.787067526161020603e-02 1.308279524384417802e-01 1.653745255947455806e-02 2.453880758983973953e-01 5.066800757345271133e-01 6.299252064476679180e-01 5.574710584522124535e-01 6.607514670912484345e-01 1.116465078652778331e+00 1.914895644123898677e+00 1.933817570614520864e+00 1.506928564049841990e+00 7.291637193733194189e-02 8.246601057294541959e-02 7.254773041065622208e-02 2.030687187892359635e-01 2.737123815816728811e-01 1.414335524017224177e+00 1.423386019555548998e+00 3.074857977836240042e-01 8.769749484537595063e-02 6.739685651828429547e-02
2.728857116033922212e-02 2.873596162616921801e-02 5.633324604469030356e-02 5.941249855369629129e-02 3.858514178907659214e-02 4.651580806816155156e-02 2.100217190984443941e-02 5.567624635522692988e-02 1.198176454743793834e-01 4.285977300583213023e-02 4.433882918852172228e-02 3.737914996327625083e-02 2.901969904534643097e-01 5.773589636547109549e-01 5.291211353645058901e-01 7.980920802605343534e-01 1.364210322876830084e+00 1.637040898125477373e+00 9.334973257349130638e-01 2.014065311192095309e-01 1.212793611455926512e-01 8.371059788000665414e-01 1.229496245098526286e+00 2.074163869120896564e+00 1.969154477467042863e+00 2.600492895988740116e+00 2.100957169435916150e+00 6.232403803708559398e-01 1.283129486385458373e-01 7.536500674328386329e-02
3.493730645043002792e-02 3.937720732506630461e-02 3.713459225460730845e-02 3.368425101495225310e-02 4.916635040729126077e-02 8.667963982631993192e-02 3.284868080691469849e-01 1.079633205403593976e+00 5.258478856999367901e-01 9.016229183415541693e-02 6.714498112016373255e-02 1.058077173921123243e-01 2.091448804979109122e-01 3.042513723549797877e-01 3.971712429244558251e-01 7.051068703511834679e-01 1.492698013563652948e+00 1.472618455848675456e+00 6.837980765603012268e-01 2.321162276345963837e-01 1.009096671401118916e+00 1.847938709000034763e+00 2.392151616516168033e+00 2.471239383720876592e+00 2.197630490996570707e+00 1.924491241502118921e+00 2.881509742393341345e+00 5.112299115798895066e-01 1.692513187696802479e-01 9.127531549051007276e-02
8.695943991174440169e-02 6.755510352532211049e-02 3.284378884816611249e-02 4.612045077658789849e-02 3.620960219786879125e-02 1.636946076221446611e-01 8.927928308991923689e-01 7.243631905864859055e-01 7.101088014742654719e-01 3.560689320126818602e-01 1.365171046442922032e-01 3.736948844460704494e-02 3.653274304190590877e-02 8.869932946600647683e-02 1.987159243862116897e-01 9.086926566819539808e-01 9.315116993273919732e-01 1.055525489004713657e+00 1.794588314910668392e-01 3.129057279278247283e-01 1.121006987092876717e+00 2.449998750483243448e+00 3.048262192769076506e+00 3.178864341231807167e+00 2.647909331985679238e+00 2.598260173799753936e+00 2.457392401262969095e+00 1.945491936052834436e+00 9.304678819110134835e-02 6.217158875210253288e-02
3.478301219743300254e-02 9.534963156010743679e-02 1.667858207418706773e-01 6.704289897279254451e-02 1.313706585442644681e-01 1.830294282648434190e-01 5.767981575835620101e-01 7.208936689876861426e-01 4.931735264034448063e-01 3.834297436123638159e-01 8.845224587248565196e-02 1.766219820634435111e-01 1.547276955437205601e-02 3.870765804381377795e-02 7.332612449235575980e-02 4.307886331417029036e-01 1.600833392290159085e-01 4.965125092950606334e-02 1.623801960311379439e-02 1.164515702196600305e-01 4.465528219663413845e-01 2.394033998748537062e+00 3.045415497186819920e+00 3.187882933737926194e+00 2.332494125845445687e+00 1.090795098857684442e+00 1.788549661691543280e+00 1.212863105291621224e+00 1.087886796493198749e-01 4.220854598313517753e-02
4.603468535357634756e-02 6.376638687103142189e-02 4.150927413193530868e-02 4.793832494943197492e-02 1.037474708126794876e-01 5.969515122152645181e-02 3.070484334687199057e-01 3.967930169961271791e-01 3.645027127699597136e-01 8.559364892146795190e-02 2.741678686110575469e-02 1.203245001705667144e-01 2.072249274766406191e-01 3.128785624406960064e-02 9.740682320160051755e-02 6.391492651002415870e-02 1.115722327628694138e-01 3.204918236413865223e-02 5.875182611018110734e-02 2.754870485763697419e-01 1.489509144603405666e+00 2.821776566211045001e+00 3.028754203199826023e+00 2.862441109115949622e+00 2.191985828164304539e+00 1.606435399712524026e+00 1.560885522496045397e+00 1.070416404647525077e+00 1.227185545289680990e-01 4.588151891770240326e-02
1.166355595340331230e-01 1.074511719049600078e-01 5.518987878174706763e-02 3.976337379086120061e-02 5.167616643070140764e-02 2.775615544761258352e-02 1.611286957671323461e-01 1.440761480572422537e-01 3.993258724325711440e-02 2.182473857814246077e-02 1.037458195882381279e-02 1.824719034111895732e-01 1.024186980167950817e-01 4.788571539408602307e-02 1.035389076235137262e-01 1.858001197696702161e-02 6.379654597685958939e-02 1.417133991039688790e-01 1.330047643304637650e-01 5.845744142662059328e-01 1.589981697884035761e+00 2.286498391789141493e+00 9.231483840745493552e-01 1.371784446342027675e+00 1.758321265489414253e+00 9.902445630625736905e-01 7.359553553113075131e-01 6.279233716681947852e-01 2.241247675819257601e-01 2.443064118936127127e-01
9.543593019844184844e-02 1.104212111562447862e-01 1.771729405541267593e-02 1.245318779606625556e-02 1.034807772808450481e-02 1.373383867597535030e-02 2.033398261857530948e-02 1.354678575956550501e-01 6.916825647765145052e-03 3.248929280466889696e-02 4.782782247882678972e-02 7.591613385188283880e-02 7.178286883199655466e-02 2.264413574766123149e-01 3.075295630265885427e-02 3.444291172598189510e-01 6.371404824971940162e-01 9.006089676897974794e-01 6.007344745604275005e-01 4.429790781017722834e-01 3.100159204503542543e-01 1.093209349028664290e-01 4.194821305613229134e-02 9.011774038283509869e-02 3.229105038125930638e-01 1.079419176734085911e-01 1.077895442546653870e-01 4.463814185657932060e-02 4.276725879990575518e-02 4.006131581075403347e-02
2.019627107191323823e-01 1.631179540271918416e-01 1.963033573056044770e-02 2.062689726500555598e-01 1.331985756650684236e-02 8.799589622894555402e-03 1.410882876423713052e-02 4.768718890487167600e-02 4.508072245845343162e-02 1.950979772129165721e-02 4.900139995572368873e-02 8.906392393962929421e-02 9.252268486404421899e-02 2.624016624012993903e-02 3.503861092937914784e-02 1.961070567846075197e-01 7.056667214795239174e-01 1.288165853687942786e+00 1.426450750155177971e+00 1.210841657415453465e+00 2.536102211390375283e-01 5.580176121566131353e-02 6.884389035196578077e-02 1.697395847235224631e-01 3.749109069728167043e-01 1.098643434453145384e-01 4.530035329334329564e-02 1.544142425856617484e-01 5.861653567834605033e-02 5.678287310542477762e-02
2.541211964749476304e-01 3.398662684502976733e-02 2.089981380065954464e-01 8.590864974035904156e-02 1.087889686850062598e-01 2.404266168451325847e-01 1.044593962047950589e-02 3.883452000082729394e-02 2.264627733937420867e-02 2.585640791251622717e-02 4.685828089366468607e-02 7.859318009566990115e-02 6.916641364838931050e-02 1.794673868419914553e-02 5.768564887479678271e-02 2.748875065647845006e-01 5.246294976745117244e-01 1.185690188255777988e+00 1.465360672130542774e+00 1.221937856733164907e+00 6.042668831689608222e-01 3.698499996711403226e-02 2.767879963921545186e-02 5.911554252154274658e-02 3.212895176294090493e-01 1.857645888875271989e-01 1.794890800429432554e-01 4.129053195209806543e-02 4.727843039612316528e-02 4.309979968234705500e-02
1.411474410049520789e-01 4.610230454194687300e-02 1.839168456795588560e-02 1.775444857726428058e-02 3.857971931800831950e-02 2.636715109576166782e-02 1.143222750550443832e-02 1.511327277143165726e-01 2.286135308024251356e-01 2.924202877402123923e-01 2.758953752502026069e-02 3.266155527624570176e-02 4.149131509925232941e-02 7.857564091586845267e-02 2.257184781024222306e-02 8.329975424031560438e-02 8.519425210632167178e-02 3.570974833509940605e-01 4.502336535256145078e-01 3.755735004152690459e-01 3.389051384182419913e-01 5.358970353662696751e-02 7.886684906867533207e-02 1.280575371015056085e-01 5.915750042236421480e-02 1.425398969582352127e-01 3.838697852100072527e-01 2.399297999732940001e-01 5.372044366977041241e-02 4.742482789716270797e-02
5.050295592147013846e-02 2.006762302649086824e-02 2.121508171559232866e-02 3.558394530279319207e-02 1.981825796715113580e-02 9.252920339371046438e-03 1.461441036323017639e-01 1.069020067045004518e-01 1.077671657355504589e-02 4.164332252939290102e-02 8.815983254344622599e-02 3.218863123457063602e-02 4.748787341119175415e-02 8.361513046327614940e-02 2.022123218909301079e-02 3.652307120483859471e-02 3.052885787151898497e-02 1.782173027118835740e-01 2.476930267978175518e-02 4.009777827655303800e-02 7.700290240205291681e-02 1.747976477002834428e-01 8.546637234980190845e-02 6.667737290872985390e-02 1.294385021592077134e-01 3.412838189558196900e-02 1.531119685536021513e-01 2.377235530527390672e-01 1.396036715481336343e-01 7.599526786207864981e-02
5.119532278357455390e-02 4.112435178052066542e-02 1.984930872471747654e-02 1.443369990643975261e-02 1.369460052218330476e-02 1.767538338113262830e-01 1.214298434375387925e-01 1.278505102926870141e-01 1.409034229978155806e-01 1.778887864691100149e-02 1.615509134433165961e-01 1.470891742214000819e-01 1.184059821982378496e-01 1.189311681080592042e-01 1.895186360622473642e-02 1.916108681672940017e-02 1.594633829724688701e-01 1.002514380182684128e-01 8.722843398583300656e-02 6.516131690118984188e-02 5.195523458186065979e-02 7.466099974981649234e-02 1.087833978234862553e-01 2.389117951000428453e-01 1.016202065448206793e-01 1.821800651234696811e-01 8.530702655229054077e-02 2.232249139202929222e-01 2.346101984436053667e-01 1.562274562695364910e-01
6.957825067607040226e-02 3.629077943758486635e-02 2.040930886759262028e-02 2.761845493822823877e-02 2.474556596366445094e-02 1.359050703800978102e-02 4.698073835566109191e-02 3.730089161878150789e-02 1.941701359758020162e-01 1.413288092121635919e-01 5.159847618227347832e-02 1.092278938797272836e-01 1.901822551117462318e-02 2.066450937121680140e-02 6.253792252416785769e-02 6.135397597055017305e-02 1.817369260903715089e-01 2.177289550827418985e-01 9.885730714223944782e-02 4.354836191126335021e-02 4.194389496598791012e-02 6.452872877116740125e-02 9.502603958309466248e-02 2.763672028194994468e-01 1.043936349913897471e-01 6.745722670780028574e-02 8.065355407832344725e-02 1.062952301019303991e-01 3.515478301082582968e-01 7.265946433531819681e-02
9.360039939660247388e-02 8.106376412657376185e-02 2.434400149472989994e-02 8.242960945471233813e-02 9.589369433786532060e-02 1.809930713792785861e-01 1.211387003256606254e-01 1.517226049887010833e-02 1.956147012145107722e-01 1.144783065216760931e-01 3.414061039828886895e-02 3.902799387057320074e-02 4.255592871594904986e-02 1.524367360472653199e-01 1.803154067479037503e-01 7.766654222655303141e-02 6.458582734150927762e-02 6.994928109050953247e-02 9.282578546002479003e-02 5.321943789940435099e-02 3.760765020290433858e-02 5.591274875889732515e-02 6.215601759081763877e-02 1.006011010033001640e-01 3.162389602590500726e-01 5.145795610944018522e-02 7.831704708734711640e-02 1.303406521877032986e-01 1.590929299431101396e-01 3.189575556763766251e-01
5.082647289160641124e-02 1.267118741171688601e-01 3.758778886012367759e-02 4.008372382990679772e-02 1.948924639242503587e-01 2.068353179523491903e-01 1.379244052475503413e-01 1.030105707244717561e-02 2.651050512479547483e-01 2.504523628506984956e-01 1.024909958337120036e-01 5.114189081984164831e-02 3.054545410508976294e-02 4.816498152568973734e-02 2.200510149332282339e-01 5.777520946541067626e-02 1.564237369602335115e-01 1.021283743775295988e-01 1.510033476822889020e-01 3.181459290321265315e-02 5.279362284647996784e-02 7.414709598398847024e-02 6.386003353319549825e-02 6.920188804147223149e-02 9.245714062351080564e-02 7.245621159650256216e-02 8.781122224073173443e-02 1.094464880556413056e-01 1.485871007209619288e-01 3.672507923923278850e-01
