1.690940606656359327e-02 2.494668428895331636e-02 2.158893360086037647e-02 2.706389569668194925e-02 2.045677327136968815e-02 4.472764639755106436e-02 4.442308763475392996e-02 1.203980538514663051e-01 2.183359165467942120e-01 9.759730152418528981e-02 4.477704402770409792e-02 1.013107970362359632e-02 5.918952042561285119e-03 2.209728769427490511e-02 2.566191787145389799e-02 5.611588701566530384e-03 1.997389636593769821e-02 3.561482342259416484e-02 3.281261604378744173e-02 1.167634845240497418e-02 9.701388247036583923e-03 4.047796165257792206e-02 3.131610417107912742e-02 3.995373555617929250e-03 7.235803098439606146e-03 5.591063914543951269e-03 2.559133508806520248e-03 7.892854685613790930e-03 7.605646577330491334e-03 9.482972752728172430e-03
1.334500894042975859e-02 2.956717198890509296e-02 5.288728969722601703e-02 4.317421108265985519e-02 2.996196478610858513e-02 1.333004421778928028e-01 6.291232531287406504e-02 7.949541800070906994e-02 5.175300882234667305e-02 4.444227722459365842e-02 3.132244227849378948e-02 6.116168196422128514e-03 8.101884714693047967e-03 1.837247185093704785e-02 2.546666321719478002e-02 1.612525560608802505e-02 2.011063168634907861e-02 6.695489267014809176e-02 5.133852705944281364e-02 1.555684895114155947e-02 5.704710009845579202e-03 3.824523486885442192e-02 2.864772529112062129e-03 2.270365522398928686e-03 1.788416736792199872e-03 2.336124158923937131e-03 3.008176289167601922e-02 7.932057492743683699e-03 1.144138403462544896e-02 1.136383247010836102e-02
1.610043406871196625e-01 1.634678992647874418e-01 3.459810935251874664e-01 2.820378101485065403e-01 5.967396767196114782e-01 6.025423924084702398e-02 1.104659796376141617e-02 1.181372583631969467e-02 1.891624190955065177e-01 5.874172583621910942e-02 1.594776728562242452e-01 1.070963203393990593e-01 3.935940738881896217e-02 5.658808377695578179e-02 1.068030286515933396e-02 4.397374414369264323e-02 2.973815047793860328e-02 6.181148916930191695e-02 2.086790640001673358e-01 3.486442496786421735e-02 3.324543227372785213e-03 3.107960067321636002e-02 4.849587856420678467e-02 1.701327542907148452e-02 1.020078670951894695e-02 6.840893660559491454e-03 6.213150330500728097e-03 4.956138702708966226e-03 8.422124432892001342e-03 9.399766870258390028e-03
7.545302967009016870e-02 2.161069231022975934e-01 4.749144062699258151e-01 3.842173110581827977e-01 1.559753837967014500e-01 2.382449474871094208e-02 1.851011569965353362e-02 1.239631073473543808e-02 7.564035067093309410e-03 7.228015895456550710e-02 4.715561554247859472e-02 9.427286932908104933e-02 4.262466200309573267e-02 2.783947142194225302e-02 8.061061287362043457e-03 6.007620399254464533e-03 1.257460817328841414e-02 2.372982961464739984e-02 1.691877929589015103e-02 1.444394605426612896e-02 6.398633150623055620e-03 2.236111841108793987e-03 2.162330969838526656e-02 4.320651903254427162e-02 8.360868833021716309e-03 6.218563116081330180e-03 5.378691188847339356e-03 5.084808850981863658e-03 1.028450876311302713e-02 1.113030795584498897e-02
4.366011052757831634e-02 1.356862756084065147e-01 3.795633216455417958e-01 1.470713519107036127e-01 8.295332168804028794e-02 1.194005874902611883e-02 1.800278194886209202e-02 9.899019105467636581e-03 4.587843985067583362e-03 1.629262869219300358e-01 2.079012425518371732e-01 1.765327230194291552e-01 2.591601172705310097e-02 2.314762899202351884e-02 1.071775850855708964e-02 3.945504856108165113e-03 3.733835107978359519e-02 2.151809231491655025e-02 3.461346285734466510e-02 1.988364857363090002e-02 1.346094526147915277e-02 3.696258313745588546e-03 8.393901332781339431e-03 2.390209113064868142e-03 1.509539974935547244e-02 8.308446369520995980e-03 5.815993866815704488e-03 6.702699236824437995e-03 1.044695082935824700e-02 3.828564892699696381e-02
4.364267805129818517e-02 4.578146081239473780e-02 2.055506190256390087e-01 1.647329685776403596e-01 6.476000095293339698e-02 6.875451480972085382e-03 8.255804551351383219e-03 8.724327404743888181e-03 8.164422062080706199e-03 2.497834250904441555e-01 1.978218153884284403e-01 1.031652085821835735e-01 1.318477634030736610e-02 4.717254336479421301e-03 3.888326304553466756e-02 5.281159029708531322e-03 2.200548601120009412e-02 5.400471479980600842e-03 1.742928647343383944e-02 6.006917188315288869e-02 7.211174045952255252e-02 4.332575157441233976e-02 1.157749831233014469e-02 4.044635977678282673e-02 2.253504671184418731e-02 2.172919146032345830e-02 1.366530548965405253e-02 9.384917392476566436e-03 1.232452787615363581e-02 2.210300788488644627e-02
6.108039545431239239e-03 9.694526749903857946e-03 1.025755805235710819e-02 5.200556067218216338e-02 2.488692256475571324e-02 4.091141513460607587e-02 6.110693363126645794e-02 3.435777012997991153e-02 4.055930203534432316e-02 4.732045001291225461e-02 3.648180280398364422e-02 1.486865120312667182e-02 7.076448235887798817e-03 3.386004451482095556e-02 1.970061215161789114e-02 3.367809094490270549e-02 1.233670027287638027e-02 5.504145441873111236e-03 2.794214375953228344e-02 3.809357576810416812e-02 1.740147464622874424e-02 4.551431426634285071e-03 3.924607373109782749e-02 3.798968294035393045e-02 1.554574736301277821e-02 1.613162381056814851e-02 1.428720299912376521e-02 1.227873068742891226e-02 1.365789178794542258e-02 3.246184515776850965e-02
1.324040930760029405e-02 2.430850429818206399e-02 1.421786749868460438e-02 3.063336716420942199e-02 4.709945972040905510e-02 5.265183355546318444e-02 4.613201455811281188e-02 4.307366774722486136e-02 3.398801124981994104e-02 1.897263744181629935e-02 7.610634928884788333e-03 2.346781708363970820e-02 5.860070909663182663e-03 2.240554365618395438e-02 2.530790426116431152e-02 3.609870694066020201e-03 2.498979861693127399e-02 3.814971243546298046e-02 3.348086568116763473e-02 2.454942410052207355e-02 7.518846752907733591e-03 4.660830651340785481e-03 2.836017477475988660e-02 2.460463807929698030e-02 1.187915961983197592e-02 1.206756070631995713e-02 1.807925782574516804e-02 2.083532886220557448e-02 2.008293724078925521e-02 2.486743983473814566e-03
3.540516462131686193e-02 2.341049528532311574e-02 1.363876640253664820e-02 7.893587262474090205e-02 5.094759654944252397e-02 2.143232414747686318e-02 6.818068200944722712e-02 3.035593075834026877e-02 2.520453186559685338e-02 2.474803633172505818e-02 2.200357262830405017e-02 2.866474834643102307e-02 6.389113651502704994e-02 4.332211284728808981e-02 6.353381392946792251e-03 5.566879696241461457e-03 2.318927124354383529e-02 7.115694074089659593e-02 7.026924892521838051e-02 1.280727572318872409e-02 3.243763062768387218e-02 3.344485086314962635e-02 3.632031233744989485e-02 2.416415748694187779e-02 1.427359488603517461e-02 1.981056083834993944e-02 2.712689203662722003e-03 5.093523167108776444e-03 1.495111928155477138e-02 7.480887707733992371e-03
5.874194931846137696e-02 3.876987207516401079e-02 6.157725093016716555e-02 5.771210915695186572e-02 4.997586121781140422e-02 9.782390304251115803e-03 4.459485889464411684e-02 1.955703967842110577e-02 8.156219367564975994e-03 3.712199605146197096e-02 4.279434158735211102e-02 4.144619366822628603e-02 8.705778846676368032e-02 9.281231743564583025e-02 4.343693540231119421e-02 4.720880898868019815e-02 2.552923818759479935e-01 2.665879807918014044e-01 1.069404912784298056e-01 5.476309771100441870e-02 4.249984153843038709e-02 2.657728652106066888e-02 2.979403953841816208e-02 3.237056453153032420e-02 1.807636357242785666e-02 2.181411293986223673e-02 8.946398685381544424e-03 1.379877902442061544e-02 1.734906930105065484e-02 4.494859141663877164e-03
4.845715789869961543e-02 2.577566295277596356e-02 5.727598745653607326e-02 4.924897709102799004e-02 6.167913234770495273e-02 6.421177267858761348e-03 6.012272366655040459e-03 5.551915180334080283e-03 3.698828005632236876e-02 2.379378888159039418e-02 3.436473170108712005e-01 5.705063180445788529e-01 1.171148437445322488e+00 5.703824879710807094e-01 1.038172357001470314e-01 2.026116576869712582e-01 3.794811305101958854e-01 1.051942284980257603e-01 2.500157413032459697e-02 5.906380746984606252e-03 2.929725842870092509e-02 2.593891729369436280e-02 3.193460493636543496e-02 4.309310019850926682e-02 4.548960718783818385e-02 2.474072081951649016e-02 3.893913387566159956e-02 2.918958472534302628e-02 2.635051983124234512e-02 1.912958688072926086e-02
1.005207202495060972e-02 5.925832698062004703e-03 4.650119897939535007e-02 4.616704563402281719e-02 3.568061698304099416e-02 9.311635660094044059e-03 4.510662287867481246e-02 3.176314606478121416e-02 3.850073948625610393e-02 4.685977983916619904e-02 1.043195253381067750e-01 6.838209412825819733e-01 1.219532297247486907e+00 6.259910459780358982e-01 2.231086883756605022e-01 2.503406846741926817e-01 2.766522195236034154e-01 1.627297978674134560e-01 3.978821016033130126e-02 1.274562040170489595e-02 2.832149929281122316e-02 2.860718283506568857e-02 3.213153453125732611e-02 6.081583037385402714e-03 4.678373545711091326e-03 3.823721602331790759e-02 3.067038896872951656e-02 2.781895803851475168e-02 2.997928361548101231e-02 3.215990663090764756e-02
2.331472743412914619e-02 6.015927650576542197e-03 1.070193386198283261e-02 3.200963923821120716e-02 2.087703145706770388e-02 7.569380400216992044e-03 4.303449138988851667e-03 4.065250173403568007e-02 4.016222844251334488e-03 2.314021421390825839e-02 7.289153459085025676e-03 2.171157415274982960e-01 9.095101583155906777e-01 3.881300606364840866e-01 1.212743135094497687e-01 1.397990206668937585e-01 5.146095253563871819e-02 7.520925663224668767e-02 8.520887933793858116e-02 3.372322687656338636e-02 2.723096816519513311e-02 2.943265903033647629e-02 3.525974737342690846e-02 4.860995731968418936e-03 5.465728207392600915e-03 5.564505222016524928e-03 4.509827101790763425e-03 4.525653463318382065e-03 3.911354683590145820e-02 3.191263228795353929e-02
2.032319035844545527e-02 7.539427238121109223e-03 8.239517292605606433e-03 5.500416066413412255e-03 3.498655914088392299e-02 1.294601834518221452e-02 4.364123173435199843e-02 3.585974325319926659e-02 4.677328831936489878e-03 2.336710284371903631e-02 5.390795181087503808e-03 3.539721090371693996e-02 4.162590687503530673e-01 5.626871272647201438e-01 5.982447630027167840e-01 8.063403883403266192e-01 7.221593587092863809e-01 4.670162343460842469e-01 1.270753221799537869e+00 5.887561019213221059e-01 5.022155969723745422e-02 1.565857983293295064e-02 1.153910248607565789e-02 2.717723050424867073e-02 5.846277799151693849e-02 5.467854454498061179e-02 1.486685652545974290e-01 5.107914444370239421e-02 5.794633416099116523e-03 5.725679174814536990e-03
1.966301414012123355e-02 1.871548126643562959e-02 6.032998073284793518e-03 3.681876237299713112e-02 1.201264157801494419e-02 2.921404556212329334e-02 2.815843906914647712e-02 7.767074830211005698e-02 5.314750791149006753e-02 5.417725988288516967e-03 1.147638939251558951e-02 1.785088890696833741e-01 3.785526379803397234e-01 4.788990235174351850e-01 4.307371889792524500e-01 5.186496530798971882e-01 8.808105284467717677e-01 1.515896311824803222e+00 1.535215937841827971e+00 1.194946044662518858e+00 5.039635801242139251e-02 5.203430448899244026e-02 4.623129818722925694e-02 1.439447908550533228e-01 2.059860926478749577e-01 1.048898294510244078e+00 1.039448519250928848e+00 2.037084393567498708e-01 6.284517250242436896e-03 4.091482271921499658e-02
1.898268458061820943e-02 1.990559135752551639e-02 3.876573881994668791e-02 3.990247379351265222e-02 2.609932414780054971e-02 3.139738745326575015e-02 1.547782236919960190e-02 4.195090473300486233e-02 8.693359170159727090e-02 3.099135349427064798e-02 3.206261620781960392e-02 2.813889159849494379e-02 2.187117251131485418e-01 4.386744702654857275e-01 4.052031044175570806e-01 6.161132666792107360e-01 1.062107005961789197e+00 1.284530932981359896e+00 7.376394168572590893e-01 1.592665169247427515e-01 9.480434573269634624e-02 6.471786645202957100e-01 9.404734337656298626e-01 1.560773930172933976e+00 1.454415863525192698e+00 1.885094057178760441e+00 1.495025594985315731e+00 4.172960682318370695e-01 9.863104255545200594e-03 4.747112819601882056e-02
2.482329757208628571e-02 2.809011007137616339e-02 2.626492243594718071e-02 2.371720130083414604e-02 3.451792096748295541e-02 4.684198001353430049e-03 2.465489263294676214e-01 8.210271891874570960e-01 4.005865140596197027e-01 6.885958294513849776e-02 5.141246957703704545e-02 8.067315902579240416e-02 1.590072338059488055e-01 2.310632646084885278e-01 3.014206941182456800e-01 5.345422465178669702e-01 1.146324462473196082e+00 1.144914315941745642e+00 5.377242598992582057e-01 1.830279927632497139e-01 7.844710962646103125e-01 1.416665523593417353e+00 1.808303496252358755e+00 1.830420311333889938e+00 1.591379304489196400e+00 1.362126105549588573e+00 1.989331009772013381e+00 3.399012316432626912e-01 1.266542884493552720e-02 5.465208632398625699e-03
6.232099755992930035e-02 4.851687186758048276e-02 2.333879101901690026e-02 3.270522297750976665e-02 2.702359497168469599e-02 1.236005679389297340e-01 6.784830503802414814e-01 5.561082642271634180e-01 5.467293151530241424e-01 2.750709987524495581e-01 1.014629355596369242e-01 2.756356947797381635e-02 2.677878542789870545e-02 6.729589694888891971e-02 1.492738315422588724e-01 6.745903343527434037e-01 7.042487851869594362e-01 8.124113260394451030e-01 1.403773189328415827e-01 2.459110910719655430e-01 8.659908267102712776e-01 1.860584024569415407e+00 2.275572482691180731e+00 2.316266563344032914e+00 1.878616098505823562e+00 1.786745475248732618e+00 1.638327252237836928e+00 1.281488547407342304e+00 5.625102292314391322e-02 3.656626138035243972e-02
2.480202303490290638e-02 8.038470411466776266e-03 9.473876537738377263e-03 4.755348623165170374e-02 1.009507522568459659e-01 1.410345962611452286e-01 4.458929101175183041e-01 5.594033853686655178e-01 3.841451448196515073e-01 2.995494065009686735e-01 6.281670334682810941e-02 6.176147895266106795e-03 9.281978555935691336e-03 2.553618897310582989e-02 5.431946845956152348e-02 3.128357113670526823e-01 1.183019018335400713e-01 3.741158721915528729e-02 1.245435691315332875e-02 8.989834761500151150e-02 3.394198497759065569e-01 1.790799451771475148e+00 2.240752817861975998e+00 2.296811922759233404e+00 1.640207254501952150e+00 7.440413104417018531e-01 1.186717419282617092e+00 8.039031990790633797e-01 7.194708409693674478e-02 2.788698819268277743e-02
3.241864710506022623e-02 4.227455135705799477e-02 2.732396206009796852e-02 3.416149425872865714e-02 8.078781856576611187e-02 4.660555226644853832e-02 2.404022149179357304e-01 3.119880250715122982e-01 2.878688703837684049e-01 6.756893455168740126e-02 1.691884407677341981e-02 3.583721839354489340e-03 6.347121237465240887e-03 1.809997588071225044e-02 6.948809039741862814e-02 4.457813379228988543e-02 8.057894141682686584e-02 2.361370900979031448e-02 4.417118565556545778e-02 2.088357056953523694e-01 1.114321468701369611e+00 2.082284739040367594e+00 2.203682946370142837e+00 2.041198009337412689e+00 1.524369119691711072e+00 1.087384291215316212e+00 1.031531774536087021e+00 6.872716021681581910e-01 6.145192891170913468e-02 2.155110870264467446e-02
8.839357996648944393e-02 8.246454086627662272e-02 4.258937125557291092e-02 3.089427238675472934e-02 4.046216204404209926e-02 2.185651215677738429e-02 1.247408351695655504e-01 1.121179190092244649e-01 3.118108169492624787e-02 1.728533228237527641e-02 5.996999195587879479e-03 4.728254035508396014e-03 2.797798727731302081e-03 3.140181957232361654e-02 3.870678676651453844e-03 1.260901447837120201e-02 4.484319780579504311e-02 1.016565978152575711e-01 9.737208095987720524e-02 4.320882276911399145e-01 1.163298710629644406e+00 1.655579426108484187e+00 6.614225361918779633e-01 9.643678462542178975e-01 1.208854122657911923e+00 6.650354891633933896e-01 4.843361698286470229e-01 3.995251106566864996e-01 1.683132229156228399e-02 1.561723419915746029e-02
7.211881489231986020e-02 8.441938254035469269e-02 1.250898878428654756e-02 8.734162666489216423e-03 7.251100781014717216e-03 1.089013406326784679e-02 1.578241800677231826e-02 4.031510204596504970e-03 5.377930644411667641e-03 2.368401925229617067e-02 3.269037334022665414e-02 1.789049879823353516e-03 1.889305181063239249e-03 6.633711835491659832e-03 1.842455501647246099e-02 2.316829450678465907e-01 4.437844689876861981e-01 6.396177188599811991e-01 4.350009587465137884e-01 3.234137999533144847e-01 2.239870127720669235e-01 7.820080536962273343e-02 2.971818838714422942e-02 6.284772807001109962e-02 2.210844548785081409e-01 7.247074291563276871e-02 6.465140185817579155e-02 2.585466109692547559e-02 2.655834195521529495e-02 2.497159578280674919e-02
1.530150088652303397e-01 1.190480029524507571e-01 1.288636875951638255e-02 5.620617715678205562e-03 8.355779008393375215e-03 6.552329971522777990e-03 1.041895289050870713e-02 3.457816663610548125e-02 3.252001131013080443e-02 1.417575904197240430e-02 3.303094005090465718e-02 2.058328266770627617e-03 2.467033297985936693e-03 1.328639040982503537e-02 2.191533224605669850e-02 1.374337115273728538e-01 5.025015559347326688e-01 9.338357099163274722e-01 1.052897932798990022e+00 8.979338950571529310e-01 1.850429519147425428e-01 4.009556465428932431e-02 4.877112653267039882e-02 1.187700893210798525e-01 2.591873678094367972e-01 7.491741208630325888e-02 2.777312646619882475e-02 1.295568662889627111e-02 3.768432539912686813e-02 3.653906294322675774e-02
1.914687096700104507e-01 2.456153769618856647e-02 6.824377587502540934e-03 2.273318229639768005e-03 2.616281415096931035e-03 5.754755399573310490e-03 7.656534266723331351e-03 2.804310071959243214e-02 1.607507541026508349e-02 1.844882341475573631e-02 3.200806248676899002e-02 1.974861079485741838e-03 2.005062578394400680e-03 1.081794804044148260e-02 4.044079712833197754e-02 1.967328004254573492e-01 3.809023242595678260e-01 8.745493970765392255e-01 1.095749175520680740e+00 9.134823280770567600e-01 4.421107784073224911e-01 2.475347158575958925e-02 1.723555588536818811e-02 3.733846770968891199e-02 2.132277436664659354e-01 1.277977083027123928e-01 1.131889301896412403e-01 2.563925770335198639e-02 3.071025166836953077e-02 2.795107762204974977e-02
1.058532588945452629e-01 3.299513452299178418e-02 1.298237386498286329e-02 1.235190862616284899e-02 2.767387861362435170e-02 1.893639318975648064e-02 7.895018061477807395e-03 3.244776188673436246e-03 4.900821790018989980e-03 6.576237951433368256e-03 1.935569139625432575e-02 2.237006613488256787e-02 2.832914069908620477e-02 2.652647841702260572e-03 1.468649051999103977e-02 6.077981484045444360e-02 6.114909495482209745e-02 2.597811634683300230e-01 3.315765591781290045e-01 2.823611490591878548e-01 2.311651473318530881e-01 2.913047434825231929e-02 4.409829726064353264e-03 8.699572721605410008e-03 3.856984526513827782e-02 9.751159976683444752e-02 2.604925606401609084e-01 1.559144448418105788e-01 3.478149872939779313e-02 3.045817456276037061e-02
3.786590252860855266e-02 1.514104165221506412e-02 1.645710551182267417e-02 2.830153447638542388e-02 1.556122825331889177e-02 6.964053943944076112e-03 3.184522000503180357e-03 2.220967609998770152e-03 7.028359714038521534e-03 2.746811847976008206e-02 2.028393328931134797e-03 2.142346482666158958e-02 3.124552834855000988e-02 2.749745741874460789e-03 1.192767521438578560e-02 2.169016777054670955e-02 1.489751369793724210e-02 7.365264395579244547e-03 1.253701658291941912e-02 2.441978355887199428e-02 4.774571146245606967e-02 1.019084317575654278e-02 4.875877204890089953e-03 2.255910314725788346e-02 5.505661567364724535e-02 1.976241985570884388e-02 6.811836348650256168e-02 7.812759273860685194e-02 3.593271002580774448e-02 4.352575811022259267e-02
3.838637663692014146e-02 3.104001070287240593e-02 1.540610230628184502e-02 1.148449235191398646e-02 1.073878166070668660e-02 4.023335186490563722e-03 2.652455870171459805e-03 2.704105088382631559e-03 2.985765542616789208e-03 1.218002588518227874e-02 3.563202344935120086e-03 3.653249079734951620e-03 3.359384459400758301e-03 4.174333717194856144e-03 1.175828566726220409e-02 8.401275532209520960e-03 5.876786972503431246e-03 3.630642774962328581e-03 4.336037981124805582e-03 4.308558766587872180e-02 3.492819506468752139e-02 4.709679392637304562e-02 7.692051058968705883e-03 1.320703989545677498e-02 2.547886985206383043e-02 1.404791396359757194e-02 2.245281886789661854e-02 1.383064224839536914e-02 1.529693329608809715e-02 9.841116275370301661e-03
5.217361496821814465e-02 2.740082688433983366e-02 1.584514966883321038e-02 2.197711116569578058e-02 1.943382056200092939e-02 1.055599867780396793e-02 3.597910670720427112e-02 2.710572606107257421e-02 3.997369022406256286e-03 3.039543278364477321e-03 3.478937854730416307e-02 2.795564310430065282e-03 7.966216111515184162e-03 8.730589813883369091e-03 2.649274859849525682e-02 2.042805422820459862e-02 6.705422041849532465e-03 8.254644374781443944e-03 5.109560015188024419e-03 2.866856363114022796e-02 2.819905376376423065e-02 4.154248718935567297e-02 9.652988031603065150e-03 1.736801542926350375e-02 1.753255963030795131e-02 3.794600701654589348e-02 4.354209001049540173e-02 7.541735497967419835e-03 1.853596022582251063e-02 3.216762858595899333e-02
7.028461528541371517e-02 6.129161463958184702e-02 1.891745785827926227e-02 6.556329698480249657e-02 7.676013925398185445e-02 1.451668581530865532e-01 9.731575963453566180e-02 1.099536739871557166e-02 3.954852637088914630e-03 2.402151630089515658e-03 2.329168945966080678e-02 2.735086280426575478e-02 2.882485236650804417e-02 5.644324668551063511e-03 7.425498734099588403e-03 3.166793173830686169e-03 3.169571368781359550e-03 3.672927497825777439e-03 5.999833536720002199e-03 5.654084580579111889e-03 2.547134410756336440e-02 3.696208553597101626e-02 3.877277371285976076e-02 9.786546181462506613e-03 2.711764196799588619e-02 2.838305896815857682e-02 4.125485679036672987e-02 1.190152532549430299e-02 8.320372404101985739e-03 1.631183699514932375e-02
3.858860104614914716e-02 9.672389119300515981e-02 2.932938515184000880e-02 3.168189323174740862e-02 1.544984558487911275e-01 1.635477890435239334e-01 1.087316597103340499e-01 7.460310252546222161e-03 5.272111824625047398e-03 5.161229862185285656e-03 2.569471302677552114e-03 3.616894360004561243e-02 2.053585948647322287e-02 2.947071537909077069e-02 8.311695906397792780e-03 3.502113281334468670e-02 8.355049464457975361e-03 4.860099706720519275e-02 8.980782075824582378e-02 1.961124153209455045e-02 3.613574654308512879e-02 5.012470165113688120e-02 4.171178409890327621e-02 4.040481506400430550e-02 8.019002031422405377e-03 4.075560974925564184e-02 4.760980261584833728e-02 1.024762215652107004e-02 7.675901699818819812e-03 1.846312927530182474e-02
