1.264276306296804701e-03 1.850424442254752170e-03 1.634373244794532463e-03 2.094526344369303239e-03 1.602622882663657386e-03 3.535890100662188520e-03 3.503044871050515867e-03 9.477236570208141114e-03 1.727669277062266612e-02 7.744562498569905820e-03 3.598064683285966646e-03 1.196098446060530340e-01 7.080691883100467821e-02 1.764133806163066184e-03 2.047132457017378487e-03 7.394206272982165040e-02 1.601616835095693268e-03 2.845357203058569706e-03 2.622153212848285335e-03 9.330671794611824490e-04 7.339229738205755270e-04 2.094384575650456298e-02 1.615811360980423314e-02 6.411568041068520241e-02 5.661588510427927523e-04 9.735910248439355597e-02 4.513338414024474499e-02 4.028068063357312552e-03 3.861678721137191527e-03 4.874978392062993479e-03
1.412892762193046492e-01 2.213508545602572118e-03 4.017883022743661860e-03 3.282894432455266652e-03 2.297443433443640496e-03 1.036414703681752883e-02 4.973412877298870674e-03 6.226621577837793131e-03 4.083943459965037014e-03 3.445897482277941824e-03 2.442189908874362048e-03 7.153086650615793352e-02 9.635074024819501037e-02 1.413137060300173782e-03 1.952727718075044760e-03 1.248396264438390814e-03 1.568788762228871380e-03 5.235981814207016707e-03 4.045646329563027006e-03 1.238362558524445673e-03 8.852798830545210995e-02 1.981844143468103336e-02 4.150045675183075544e-02 3.664349289353337896e-02 3.217855715320162152e-02 4.305453578811164334e-02 1.532476108812610982e-02 4.006248278010064202e-03 5.757975960984686170e-03 5.819854923891985658e-03
1.255867916705990031e-02 1.250005467217432664e-02 2.646805128042380856e-02 2.135498015238355973e-02 4.568407633342198848e-02 4.694170932777873284e-03 1.251876635954590478e-01 1.344120105660579212e-01 1.559949935267358062e-02 4.691715846582612988e-03 1.247275816923127528e-02 8.150630188888849728e-03 2.946681372858841498e-03 4.282792974846123639e-03 8.072724001098839641e-04 3.355340888404709232e-03 2.292452415031902020e-03 4.827218580493080995e-03 1.654326137354892451e-02 2.810907311313477243e-03 5.603693284427177512e-02 1.628470965404555520e-02 2.489129770460513785e-02 8.708625073959365762e-03 5.196921956688288664e-03 3.458960199201195108e-03 3.098875686676101464e-03 2.473030151227174640e-03 4.231567793076539651e-03 4.822965948583082113e-03
5.910919712456766048e-03 1.659374935860942826e-02 3.646276547128152884e-02 2.921495449072329664e-02 1.211176667742830740e-02 1.883460348871942181e-03 1.513308124126908506e-03 1.439135317677910086e-01 8.753465992020177666e-02 5.766993609875097244e-03 3.668153665008718617e-03 7.230661154848657540e-03 3.228949611263253177e-03 2.132081149797305716e-03 1.013531691786748457e-01 7.840939381530986907e-02 9.673337977080255197e-04 1.843658533873991645e-03 1.342404683519118425e-03 1.165953149718895873e-03 5.218285619234488580e-04 3.712590068456782244e-02 1.169802402087863520e-02 2.261763032537244741e-02 4.214998693721187448e-03 3.108823475253276545e-03 2.667347945380990105e-03 2.542158109099305202e-03 5.105099761907510268e-03 5.659156860110082371e-03
3.476841100073795217e-03 1.063808879471836444e-02 2.961352880244008667e-02 1.146639951538103858e-02 6.623482386043946790e-03 1.384014684179150634e-01 1.480557897289198205e-03 1.168249285742855859e-01 5.330980608213712474e-02 1.316949004781371724e-02 1.637405209842896989e-02 1.397224314649947452e-02 2.040372424813152903e-03 1.656201100560306116e-03 1.198195153449980455e-01 4.486268012826244433e-02 2.901783698349176890e-03 1.690969356497244551e-03 2.777300860433790965e-03 1.608734580122032128e-03 1.102865728247668731e-03 6.141848626419997570e-02 6.561752055230443822e-04 3.789652811521925652e-02 7.559177766625780476e-03 4.112797508344546646e-03 2.848626561633147911e-03 3.327266559897183035e-03 5.158831783806138924e-03 1.941706348920574018e-02
3.531593099294490570e-03 3.688942359409040465e-03 1.650237067017101475e-02 1.318640640756393520e-02 5.240668714437259762e-03 8.121390303415317036e-02 9.697825285132626039e-02 1.020163010335996823e-01 9.269792006902141668e-02 2.016275719530059157e-02 1.581871070182235689e-02 8.387835283919425899e-03 1.315751770054379155e-01 4.026090186074599703e-02 3.076031281343717325e-02 5.035596528815933920e-02 1.612946253475567443e-03 7.250527932160441558e-02 1.399141945964721065e-03 4.866153454159746067e-03 5.960723818719852567e-03 3.539167243346934798e-03 8.742919977205211319e-04 2.282625522697066811e-02 1.128315146932839033e-02 1.069747437425528150e-02 6.615755083226796188e-03 4.616213957322598017e-03 6.033885712886686431e-03 1.116435751975196691e-02
7.020428322569571833e-02 1.155683244858601993e-01 1.221549553883953115e-01 4.204613802563698065e-03 2.014518709250751743e-03 3.317961444189272083e-03 4.963904255365391045e-03 2.791086837002403065e-03 3.261304288600031485e-03 3.847337622851415562e-03 2.989308338184950078e-03 1.242895914553540475e-03 6.796667467509218130e-02 2.662355312525929718e-02 1.402846192746035059e-02 2.494499612779164238e-02 9.184415512931997684e-04 7.225694421229464370e-02 2.258679451584998544e-03 3.111142668151717448e-03 1.453035983727672328e-03 6.470732894660002898e-02 2.638785301715704246e-02 2.073442690745554151e-02 7.686639701784648074e-03 7.908872421953299509e-03 6.848038748708245443e-03 6.036252385697353159e-03 6.971697170470355504e-03 1.706798667637198993e-02
1.052046801103846945e-03 1.941931559657974083e-03 1.135543806506771232e-03 2.448458358852400631e-03 3.746824172943179036e-03 4.179116236791148402e-03 3.663240007794662384e-03 3.414785111895484240e-03 2.710166703465575252e-03 1.539957843866525703e-03 8.576358958391908094e-02 1.950043764713040983e-03 5.603813416437645328e-02 1.874050020903813424e-02 1.927185444926722904e-02 3.572580349390250959e-02 1.969879956265057491e-03 3.161958667631214071e-03 2.789097973598485616e-03 1.992243877605510277e-03 9.329633854096230916e-02 4.563875496675762200e-02 1.588683363683510152e-02 1.245244236027485615e-02 5.855013392047676499e-03 6.141651007352510669e-03 9.434699913325688900e-03 1.210055279854682295e-02 1.232162963423118554e-02 3.720705706357594483e-02
2.745470531201972455e-03 1.807825575922234699e-03 1.061425056348067227e-03 6.155560608206421015e-03 3.994282778918366479e-03 1.680655267705451206e-03 5.377336891626633558e-03 2.386962893925659475e-03 1.981963346926881100e-03 1.979407640268042879e-03 1.781525572009134452e-03 2.363890624253385531e-03 5.182192712530970385e-03 3.399507517951042262e-03 7.073240034073949301e-02 6.519842795821804982e-02 1.995185250488650669e-03 6.040301262194154933e-03 5.947987372989458829e-03 9.929693716700313533e-04 2.564683957211184168e-02 2.041507231140309714e-02 1.976833501694638673e-02 1.219496153247126569e-02 7.042489678876855640e-03 1.081008761894892978e-02 4.049780711570617753e-02 8.345572078450522180e-02 1.248132095749221807e-03 6.689393130413260561e-04
4.504940275173318839e-03 2.936463068171662159e-03 4.717781850696418575e-03 4.405541327873109536e-03 3.866187368655286082e-03 1.054027066876084412e-01 3.513285095874910113e-03 1.480027236256377171e-03 8.975554216588271794e-02 3.343658907385813756e-02 3.411545666650081261e-03 3.328047075919205594e-03 7.126455710791387843e-03 7.907105649779682527e-03 3.856267413612294616e-03 4.284891437526883520e-03 2.281683003419093803e-02 2.345260286311587339e-02 9.357214615467061847e-03 4.149375327895922505e-03 3.217758177317683183e-02 1.562604276344185805e-02 1.628821160903575274e-02 1.714008668266454524e-02 9.330376870288767735e-03 1.199173754476112741e-02 5.363769189671679623e-04 1.002596145816250046e-03 1.352193901523153236e-03 6.806350019483117797e-02
3.710450853972323965e-03 1.934832745553670495e-03 4.365269388071100175e-03 3.736415275056897706e-03 4.768521709877575517e-03 6.082930578560388074e-02 5.169184949960588943e-02 4.545140006592965354e-02 2.877813693208531448e-02 1.737695337754184902e-03 2.731847980150152802e-02 4.546851077894096399e-02 9.528578610713872576e-02 4.859674536894805635e-02 9.249397771855950162e-03 1.849198427091967162e-02 3.420567895418825943e-02 9.403131489004771040e-03 2.233755359624507286e-03 6.466758824390429761e-02 2.246987169801119982e-02 1.586171516238431625e-02 1.903874936061111453e-02 2.593886309715058569e-02 2.720751816931919753e-02 1.464353330282763127e-02 2.311767020849583160e-02 1.889650757262221342e-02 1.724530161313790264e-02 1.257853875505016844e-02
9.157451903707745922e-02 5.384074389211632172e-02 3.554658642641581479e-03 3.527546966787819833e-03 2.777924615881603720e-03 8.875854296373640595e-02 3.490329143411193685e-02 2.262280435166865583e-02 2.822647245833286717e-02 3.453812667212282500e-03 8.392886435226398767e-03 5.472238312172286734e-02 9.932685357174370067e-02 5.307227698217542589e-02 1.976061760532119016e-02 2.277695275760611288e-02 2.522774645511676253e-02 1.493389910288236110e-02 3.688941783352978239e-03 1.418541641389386987e-01 2.123927894501084768e-02 1.903565678908194364e-02 2.170246232075544179e-02 3.848772175354528424e-02 3.653284622078371152e-02 2.587398893076436890e-02 1.973111507524265285e-02 1.799189560893977094e-02 1.932293867289834252e-02 2.074718118381868939e-02
1.754595244038063828e-02 4.531624941139177076e-02 1.124533969248272813e-01 2.367646108144378161e-03 1.570799256300109067e-03 6.930561204629978600e-02 3.580081152751848211e-02 3.018143449583482463e-02 3.835217706619385714e-02 1.752558564269135954e-03 9.024123939039935260e-02 1.777596514373157299e-02 7.534463749135747457e-02 3.294009508318583579e-02 1.060188553922021028e-02 1.249628311269029846e-02 4.664492595805824066e-03 6.910761702586790470e-03 7.945335317735637698e-03 3.000536585240903310e-03 2.600734666012855661e-02 2.351254927376815462e-02 2.852144436375451952e-02 4.897318882314605215e-02 6.411535191085111773e-02 6.022361518650697076e-02 4.455640166861571383e-02 4.036885583077650524e-02 3.059845330431584451e-02 2.349215125282733824e-02
1.383097360451343225e-02 3.985049189969479266e-02 7.456526237454633166e-02 5.554784637954215953e-02 3.351879731343967300e-02 1.342269410665279938e-01 3.172739015918204196e-03 2.658284777610236092e-03 5.587668274156715881e-02 1.722085506732153742e-02 6.901605280363005968e-02 2.926764569912647558e-03 3.476329940809557567e-02 4.777356143962793733e-02 5.188044132244536144e-02 7.109040737049757142e-02 6.509635175539052465e-02 4.284729629448882915e-02 1.185663712483351895e-01 5.612244755327859547e-02 4.707149864314499194e-03 1.662341882889047939e-01 1.258972338822922366e-01 2.632148260570358212e-03 6.130146539063381986e-03 5.733946531431824943e-03 1.567165064557092535e-02 5.049039524716808156e-03 4.991836317216589991e-02 4.787840427136838550e-02
1.274502807557404728e-02 1.288732924752381166e-02 3.628594708426262361e-02 1.936036847652992639e-03 1.016521577452553504e-01 2.416699387565117776e-02 2.137319048239399825e-03 6.169499082505830456e-03 4.165107183224305010e-03 6.958055633554575958e-02 9.261748012889853450e-04 1.461650276344452284e-02 3.111243252564037387e-02 4.001914484532516358e-02 3.668997761446599754e-02 4.494410765993261947e-02 7.813668542857482580e-02 1.375032369437654833e-01 1.428617547104805985e-01 1.153858585043461005e-01 5.035608287324916908e-03 5.358330675679680299e-03 4.795659062496683903e-03 1.509292222390159685e-02 2.159880087157195830e-02 1.099279944859194724e-01 1.096361092072386800e-01 2.190182581411963952e-02 5.780614798422786804e-02 3.449600719261088078e-02
1.147552909108848392e-02 1.264910956229217676e-02 2.944340055801051431e-02 3.293436399284396104e-02 2.200925597495728345e-02 2.531186036888756138e-02 1.184591147663116139e-03 3.364020851679159173e-03 7.053440921609334217e-03 2.526086244053014213e-03 2.602172749421506007e-03 2.246030277905877986e-03 1.750306304603004709e-02 3.609772434231031668e-02 3.430042758699106131e-02 5.332040386003486510e-02 9.387460930301899653e-02 1.164741017870430939e-01 6.907892640840486431e-02 1.551784992167532656e-02 9.518544249901643092e-03 6.654869186813094917e-02 9.805861485601879979e-02 1.642023985069537284e-01 1.524253513638950119e-01 1.961743825654475581e-01 1.563099275550065559e-01 4.460051515454419024e-02 8.971734275044651596e-02 4.042899751321687996e-02
1.432485778034529172e-02 1.684315292140536532e-02 1.680745806329000600e-02 1.613445946466674982e-02 2.471559755877303366e-02 5.196016407486493682e-02 1.950866810792948464e-02 6.639651908201692210e-02 3.300837783457337415e-02 5.604348373944269095e-03 4.118845594026303292e-03 6.314928835876590200e-03 1.249666369555041054e-02 1.876713479263367873e-02 2.516732819136595703e-02 4.576675976999618201e-02 1.005354958420532352e-01 1.043223959660984079e-01 5.101084876617564129e-02 1.803621311172853500e-02 7.905536915076420701e-02 1.451772997864533010e-01 1.887110075962531719e-01 1.925030165763691459e-01 1.668195269407166115e-01 1.418023302873969993e-01 2.071944626961246816e-01 3.616961428581844107e-02 1.320308378804115335e-01 5.613629686973728439e-02
3.518104398090668439e-02 2.815120352663080805e-02 1.480931186215300732e-02 2.341097180320447779e-02 1.841758063340357028e-03 9.389333289655927423e-03 5.347522038323827831e-02 4.446311990963465466e-02 4.463977216467439335e-02 2.210392430635104918e-02 7.983073680265271449e-03 2.107649613774208609e-03 2.062410502507426493e-03 5.408955342760285445e-03 1.234976397619394137e-02 5.758225941533096082e-02 6.194561369737126844e-02 7.480418862713669736e-02 1.343702619270097792e-02 2.438043325207209927e-02 8.779470186478668947e-02 1.925309103388932186e-01 2.414413624860419216e-01 2.476439428093926698e-01 2.002547026617280401e-01 1.884325683761262082e-01 1.717852446603157501e-01 1.362181476005891734e-01 6.045830810067517706e-03 3.986309359686962886e-03
1.591235762904519291e-02 4.473724847731355703e-02 8.404781616486153850e-02 3.525995122343132671e-03 7.705248722237031944e-03 1.088550451207790509e-02 3.457392590946798544e-02 4.332301734496217527e-02 2.997222656202207236e-02 2.317786530228386696e-02 4.837519871858620216e-03 9.005211764361056859e-02 7.160588728017240091e-04 2.048018227943803997e-03 4.489048322886763157e-03 2.675191372488489039e-02 1.045548659941182915e-02 3.450893533684185402e-03 1.537056885627726133e-01 8.777102367136541822e-03 3.351966382399592520e-02 1.793785434356891528e-01 2.289070039358651887e-01 2.395045004244041320e-01 1.741099556766455558e-01 8.005448217026500668e-02 1.285755584283360398e-01 8.823858185627098116e-02 7.955525821334463732e-03 3.140009347531612025e-03
2.600737643817419183e-03 3.316152534197550940e-03 2.200228638572531911e-03 2.701537709931617348e-03 6.300425467345382134e-03 3.575838045264814920e-03 1.825549432723379273e-02 2.329648969102755124e-02 2.138501549423266201e-02 5.056959449014812071e-03 1.273463417819271004e-03 5.389087087805378984e-02 9.262067904011692110e-02 1.416628815175209957e-03 5.663677759356435144e-03 3.835217806946470288e-03 7.168640996045456612e-03 2.173358472642660487e-03 4.161107506079291148e-03 1.987531160939340347e-02 1.065327292802580039e-01 2.017197741837037650e-01 2.172199059096293072e-01 2.087022885477103906e-01 1.620334526853777768e-01 1.197227142760171059e-01 1.166322642430069334e-01 7.857292256406148145e-02 7.073262532581478350e-03 2.517550089697148490e-03
7.397026329086914091e-03 6.687042944375798728e-03 3.442998791761395228e-03 2.470790416337013094e-03 3.197869097592818260e-03 1.678527085856669401e-03 9.318516816911169565e-03 8.086825733244897702e-03 2.178980866391578338e-03 1.203700369350168328e-03 4.215226859122191876e-04 7.141301941688915633e-02 4.195595754514762354e-02 2.263278828471056853e-02 5.717093000129873370e-02 1.072300808095908537e-03 3.904145472595070207e-03 9.088153503097122846e-03 8.906438889848013879e-03 4.005415933504159059e-02 1.085031675453713707e-01 1.568147814426457398e-01 6.377773182126066087e-02 9.787077408856181826e-02 1.296982591868961199e-01 7.519308426798645972e-02 5.714909967144711500e-02 4.693206924804050467e-02 1.771658200335334832e-01 1.614884760942377484e-01
5.980297996810117825e-03 6.783957463221563719e-03 1.007337797218105409e-03 6.993120833666765200e-04 5.741889751748719501e-04 8.358344778143604863e-04 1.153922982375406216e-03 6.606395045671012434e-02 3.497229033465268236e-04 1.334446112993520686e-02 1.744128062411853808e-02 2.646759512210085721e-02 2.898414185276845106e-02 1.013226099132223113e-01 1.489212755383952178e-03 1.961727738674342095e-02 3.803856060407106998e-02 5.601056269020786293e-02 3.887770658718570083e-02 2.952834222995953661e-02 2.076627495579931593e-02 7.397305941749204514e-03 2.848886234805223568e-03 6.306115315921385564e-03 2.364098445597187167e-02 8.265714541410600774e-03 7.832173368302781935e-03 2.647101185982465767e-03 3.055386273344958339e-02 2.499294248506592209e-02
1.251854593010072285e-02 9.511536986721382675e-03 1.036927036647414908e-03 8.844249962134931309e-02 6.601943614084001839e-04 5.038735475924147229e-04 7.545156960870335900e-04 1.832025202413757950e-02 1.543192904861166032e-02 6.670166324435279799e-03 1.579382963282824348e-02 2.983123736788352576e-02 3.935065660721128594e-02 1.051895612322252755e-03 1.785058212330049984e-03 1.147471307710946561e-02 4.253990681936763163e-02 8.085091985413006554e-02 9.333480882775443965e-02 8.212841261585188124e-02 1.748795643028527858e-02 3.900481638667904934e-03 4.818352537928363016e-03 1.198713169970776204e-02 2.733383408993363128e-02 8.252992249849959092e-03 3.234753761505613709e-03 1.243165131422340891e-01 3.915645574909754068e-02 3.513129744178563468e-02
1.543409400213712271e-02 1.940895261320157127e-03 1.022688617029992586e-01 3.532749318151333362e-02 4.253207177523089799e-02 9.489967210550430410e-02 5.488454200167148297e-04 1.384159843263707904e-02 7.642587923697777286e-03 8.811211494324389798e-03 1.557601204836166556e-02 2.655297319016187291e-02 2.982218706129209293e-02 8.128243274122966787e-04 3.297765688396069993e-03 1.647478007522112584e-02 3.248664507277668201e-02 7.632534103384275292e-02 9.786632797639312209e-02 8.409004497427034763e-02 4.218225629163443319e-02 2.438794563773405769e-03 1.732339342259169631e-03 3.777013392226295351e-03 2.203382971297004195e-02 1.337444398530706832e-02 1.221124907414256229e-02 2.304159977444922378e-03 3.451136928886425204e-02 2.643845917312317301e-02
8.481155339604203036e-03 2.596725105776429964e-03 1.023059586476895251e-03 9.632306483360920935e-04 2.160530553859791279e-03 1.454608764978111484e-03 5.863461939407926381e-04 5.395770186191529982e-02 8.115367174148546692e-02 1.052514431200095996e-01 9.767835573275943095e-03 1.098269947754051783e-02 1.699324288942120897e-02 3.797745964300668076e-02 1.188412661350973570e-03 5.055392816015876964e-03 5.245329799687908738e-03 2.304817826405396175e-02 3.029340776160631410e-02 2.653189093419956041e-02 2.248717932366546546e-02 2.922145425522270322e-03 5.445798675804133793e-02 1.034546171503910178e-01 3.915212278069708264e-03 9.814196688050121076e-03 2.649803796444572673e-02 1.495052496156621183e-02 4.039658290095259757e-02 3.038139157126609757e-02
3.031394472906775561e-03 1.189495129612082834e-03 1.288055071189272548e-03 2.196890255984428920e-03 1.212603564836359574e-03 1.150438890289794264e-01 5.346146718632031891e-02 3.791435200786220927e-02 5.035254991581859232e-04 1.977811980248136894e-03 3.149197652123211094e-02 1.082783287638020703e-02 1.817781493376741803e-02 3.936492949746436820e-02 9.647429077942800552e-04 1.806394350159930794e-03 1.292806436853410294e-03 1.073252583423000561e-01 1.082108945716760357e-03 2.020424431022148359e-03 3.648550383666122280e-03 1.104240401799931881e-01 5.493435465773674475e-02 2.261080961623055871e-03 5.524262386264534516e-03 1.963987787220194351e-03 6.789021772925002765e-03 7.623754737020409927e-03 2.711435997780357356e-03 4.630301281288540238e-02
3.072913353167718627e-03 2.440609204148885998e-03 1.205535576455396421e-03 8.947843855717505564e-04 8.417020171071692503e-04 6.689394543403261173e-02 4.465404441462823837e-02 4.617769017193935899e-02 5.124386274153736737e-02 8.660479815892333953e-04 5.714286792369409340e-02 5.406714000552734212e-02 5.066221341800582201e-02 6.234694745812441319e-02 9.355935903676583770e-04 6.884583919644685600e-04 8.561436331670511934e-02 5.231869716233089607e-02 4.692699948733398962e-02 3.622200041524637620e-02 2.856458357605189124e-02 4.136505609867784095e-02 6.526006528804996487e-02 1.624209154122258913e-01 2.294267388286309363e-03 1.358374056517367423e-01 1.829929101344346647e-03 1.388852248007187429e-01 1.392256818549013619e-01 8.942082005999268945e-02
4.162465408405799372e-03 2.149082989817055651e-03 1.239267222374202445e-03 1.716258272886587478e-03 1.523783418864255255e-03 8.149707327879175157e-04 2.712499498961396666e-03 1.994090440585247551e-03 6.896929862381052934e-02 4.977036637081869164e-02 1.764780199900602142e-02 4.032333350388327131e-02 5.461120272783374311e-04 6.422185402519798268e-04 2.109168763223344140e-03 1.676424990746148459e-03 9.775665605847934370e-02 1.188227065362244261e-01 5.609715178452037709e-02 2.461697044031408918e-02 2.225621815830538391e-02 3.381818321205264100e-02 5.235306197234360082e-02 1.237046468665768846e-03 1.344715532635693163e-03 4.163784448206774708e-02 4.663958232086651279e-02 5.912813047037912551e-02 1.684973818041138501e-03 3.914785354464275779e-02
5.595713763258959930e-03 4.795600409087212579e-03 1.473697312893568851e-03 5.108766788826999208e-03 5.984395996426237520e-03 1.111210213575314701e-02 7.302239109377294847e-03 8.072839945853527719e-04 6.813976345725676620e-02 3.914990373335142104e-02 1.149394155195786714e-02 1.428916135703151534e-02 1.780386956118132011e-02 7.148869139826569130e-02 9.014449746166686150e-02 4.093620059040412040e-02 4.112411795941345316e-02 5.053625328488339785e-02 7.013136680684720070e-02 3.861718957679184661e-02 2.094156532827350786e-02 2.835502309213957031e-02 3.176384710723133969e-02 5.523986415410700457e-02 1.361153826983117114e-03 2.887830379622294968e-02 4.236982329868934499e-02 6.915170206132133235e-02 8.107230478735687196e-02 1.648502935655823953e-01
3.100163354864203524e-03 7.640406409176922140e-03 2.302953481731719564e-03 2.488834383882219514e-03 1.210534098740371003e-02 1.268294759694121865e-02 8.371598915627503565e-03 5.687443259880886701e-04 9.319171077924751079e-02 8.707443494877054047e-02 3.539694079039128194e-02 1.737185810001937863e-02 1.119488745601603108e-02 1.994640870568578986e-02 9.745338749945939294e-02 2.899298036394833827e-02 1.064103177439833375e-01 4.363052361030972555e-03 8.381526513877794737e-03 1.193188760666635991e-03 3.171327364385515685e-02 4.001505558515459915e-02 3.393935023462132244e-02 3.852262677925705203e-02 5.280797059046350717e-02 4.144179577458819569e-02 4.943005719604993964e-02 6.099186031097435234e-02 7.958001925505395202e-02 1.928629346126375889e-03
