7.692701165595106971e+00 1.162537418385914734e+01 9.627442376475123353e+00 1.206314285018430255e+01 9.096997626066785969e+00 2.006424055236201909e+01 2.020372271596362879e+01 5.556305242722974924e+01 1.025942165508686656e+02 4.624430163312793240e+01 2.435973437419695387e+01 1.768646747739646941e+01 1.108192614722233316e+01 1.308536199665676669e+01 1.468938188945494794e+01 1.273035441501705023e+01 1.307618516012000853e+01 2.370918298329041107e+01 2.344359821573424085e+01 9.048284196851305694e+00 7.417313421330337775e+00 5.603426943340552135e+00 4.428370119901116730e+00 1.781575674507893581e+01 7.020764770653436848e+00 2.860577552515732336e+01 1.378591235062105369e+01 1.234328860117232862e+00 1.197577153363211799e+00 1.537183820669431267e+00
1.699233039725787719e+01 1.301530625082953563e+01 2.249465739892754357e+01 1.826059191055465902e+01 1.266096581719811276e+01 5.886873856450567644e+01 2.950821965819817194e+01 3.788677472702573112e+01 2.471516070399380638e+01 2.075582486877433297e+01 1.666349132175385606e+01 9.268113122858354203e+00 1.338534384446624870e+01 1.084826331699243696e+01 1.458563458903603305e+01 9.852578914139105137e+00 1.319748306944258509e+01 4.529241199449244704e+01 3.767053483406521508e+01 1.261624358017250813e+01 2.304770200933695179e+01 5.541263103797824385e+00 1.198086857754237045e+01 1.085290065836693785e+01 9.946786737039204240e+00 1.391131898214840312e+01 5.230878524445674138e+00 1.325980770795588404e+00 1.869388155014373609e+00 1.859372473448108076e+00
6.636142443397301349e+01 6.965752338848048453e+01 1.427084833083426929e+02 1.158704827307640812e+02 2.462898300276451948e+02 2.617773627696610461e+01 1.508381431006290896e+01 1.620687866459449822e+01 9.448121579928715619e+01 2.837482322188653683e+01 7.801271282003294516e+01 5.538379941728813094e+01 2.114396944950372159e+01 3.282702720790527451e+01 6.476949490304778401e+00 2.857970504055601424e+01 1.976791659403863477e+01 4.301315572237341911e+01 1.593927092718402037e+02 2.987326544412647067e+01 1.507672249551674426e+01 4.763041355518693010e+00 7.589857320083013725e+00 2.769560701335299857e+00 1.741920268038355646e+00 1.228926876199187390e+00 1.175001120305553703e+00 8.821719934905585259e-01 1.436765089204431245e+00 1.557591292414917339e+00
3.050438184181689039e+01 9.091160086601341561e+01 1.995276496977437546e+02 1.608433540715337813e+02 6.788852370813518178e+01 1.089332899319620296e+01 1.023135942938811205e+01 6.832026295048185816e+00 1.072155628302008878e+01 3.385068439729095502e+01 2.141127693133611132e+01 4.324553327764265021e+01 2.020798577967958920e+01 1.642559655696042142e+01 1.578407859148734360e+01 1.413346288698152264e+01 8.268396103399467734e+00 1.567491457518458020e+01 1.213681098927086133e+01 1.135225716633609139e+01 5.517105085426281974e+00 1.001231300408531055e+01 3.385773401125665938e+00 6.894847389155451367e+00 1.389974738057152770e+00 1.089659474889698609e+00 1.006179423093897407e+00 8.957791258048142247e-01 1.701871597072807329e+00 1.770250811537218638e+00
1.813289599056052381e+01 5.899592187373573893e+01 1.645488811990875035e+02 6.375741668394628192e+01 3.838443546642484705e+01 1.726781789207653262e+01 1.065582973515551046e+01 1.660609086467250606e+01 6.604745823479005296e+00 7.491459549596973488e+01 8.948494730827756882e+01 7.831139297713946235e+01 1.236062154981621575e+01 1.326476262125947159e+01 1.989613475167612577e+01 8.328706880111434785e+00 2.498099285633862365e+01 1.371535966199889245e+01 2.357142125657274789e+01 1.410189086863542940e+01 1.045058053856838853e+01 1.394528977215289345e+01 7.265745310191395134e+00 1.073663994414561174e+01 2.383560522819298200e+00 1.388464231117032766e+00 1.038846875590755836e+00 1.126490563980630855e+00 1.642811811291339241e+00 5.767468631125243661e+00
2.016649038089927615e+01 2.257167211890646641e+01 9.738764101033032716e+01 7.590216858508725295e+01 3.120568056865787199e+01 1.017891919849892091e+01 1.265022001878656610e+01 1.335758056332887378e+01 1.131947957321581200e+01 1.090168490442112557e+02 8.129878767803290884e+01 4.468692855730391500e+01 1.620316838524789560e+01 6.132668522399441713e+00 5.237410785872231855e+00 9.210382655765767979e+00 1.345918511604159917e+01 1.304681420243236545e+01 1.136321995531944395e+01 3.931453085150099724e+01 5.206053647966079723e+01 3.309475896788947580e+01 9.033629511123148603e+00 6.133210455144658901e+00 3.410669406807460113e+00 3.488565382071727505e+00 2.344374411060973884e+00 1.510027229261237114e+00 1.849392792059328716e+00 3.169403100067755830e+00
9.312604973395865571e+00 1.460093584583153969e+01 1.484691249442150962e+01 2.433493377688936121e+01 1.171992891383489521e+01 2.007755576145664733e+01 3.103899238490061663e+01 1.715311861319424125e+01 1.896667446773667365e+01 2.072469302087837661e+01 1.511871927171009844e+01 6.617859911350993940e+00 8.946369632978729669e+00 4.260376154871977405e+00 2.513418980640073297e+00 4.496362616904573173e+00 7.276474074774581524e+00 1.215079690508683186e+01 1.714310486156378133e+01 2.435815810227533618e+01 1.254613410228269643e+01 1.304249517556716853e+01 5.976062222023673876e+00 5.401625796057959228e+00 2.230982448850240996e+00 2.496724286600291443e+00 2.365819746794978862e+00 1.908701667624161491e+00 2.044184121772731011e+00 4.616642196937691622e+00
5.806772812309140441e+00 1.132516310190978714e+01 6.405889110580376133e+00 1.351732991667597261e+01 2.054570582741929741e+01 2.308618963914061695e+01 2.025477578786449584e+01 1.896359997229484406e+01 1.508228504874927367e+01 8.449172209562288316e+00 1.102169578851532350e+01 1.066501286831446649e+01 7.636784546173218224e+00 2.810425498546064382e+00 3.189178557333055331e+00 5.976634806247463239e+00 1.342827587450694793e+01 2.088485438818533169e+01 1.904133164682683699e+01 1.460217678998128399e+01 1.762305162703013295e+01 1.000602281441675423e+01 3.862627741790243263e+00 3.239035344375639447e+00 1.621529372917529077e+00 1.812792145979405412e+00 2.983324682319214105e+00 3.393842182404641861e+00 3.156679806794830512e+00 8.792678753228022615e+00
1.377737469908038470e+01 9.294656384635221258e+00 5.498992970889517551e+00 3.240216064909006377e+01 2.214294373276887029e+01 9.463273363712382036e+00 3.058210803196360672e+01 1.413502771823819160e+01 1.207274030090070127e+01 1.205782488050981627e+01 9.988828866174495502e+00 1.323311768180667336e+01 2.814981762440138624e+01 1.944921506041316661e+01 1.045243852466136580e+01 9.017503885089475091e+00 1.185294653702423240e+01 3.612896338373051464e+01 3.705584982137395400e+01 6.968459951173331390e+00 4.600288640629977444e+00 4.505420734554880013e+00 4.750766964272612469e+00 3.097264608286442567e+00 1.872484357141430023e+00 2.927336523882219321e+00 1.130363067655130216e+01 2.059747049287362231e+01 1.227425336399861244e+01 5.589886222680176431e+00
2.248217142323449735e+01 1.482887185309214928e+01 2.376606504239052953e+01 2.273272167140450506e+01 2.170879906277844995e+01 1.334506796970969944e+01 2.252582520876904582e+01 9.910943453013977944e+00 1.315185742058994478e+01 4.760764750630474218e+00 1.967524180166377690e+01 1.902994492350961053e+01 3.991283874893953509e+01 4.338941339617492332e+01 2.071213083815978706e+01 2.251857057261721451e+01 1.220774497129081340e+02 1.301028015747041877e+02 5.539237722920856299e+01 2.752217789617289156e+01 5.744613140048971722e+00 3.400192181879353903e+00 3.849555929812050081e+00 4.240322365709081609e+00 2.392461059572935866e+00 3.100936638225328945e+00 6.284457628609082747e+00 9.873795190657116194e+00 1.186419362937318844e+01 1.377978560284874732e+01
2.152117914067788718e+01 1.122482252324245877e+01 2.287277547551246215e+01 1.927933346990350572e+01 2.809668500067303398e+01 8.234568458343719755e+00 7.758268260248614823e+00 7.001172157182430134e+00 4.766568353778645850e+00 1.171303343741625369e+01 1.662286063108467715e+02 2.762949701462595158e+02 5.616409678196343975e+02 2.674465674038425504e+02 4.774740988077643067e+01 9.109934338269451359e+01 1.724537443971984771e+02 4.900187704209563577e+01 1.281247781894238180e+01 9.484702520941544535e+00 3.855810641161443009e+00 3.245890120006794888e+00 4.182700247361401225e+00 5.887969054777187239e+00 6.339174109142931002e+00 3.440979341857490326e+00 5.426574421097837053e+00 4.040645180953346127e+00 3.545998376047986511e+00 2.501214713712379023e+00
1.314699325740343383e+01 7.214859746934129348e+00 2.206384801258349171e+01 1.996912696564130130e+01 1.650520603766277361e+01 1.277037601554615165e+01 5.969240312627078104e+00 4.095622093206358727e+00 4.991388610113427049e+00 2.353511020999771830e+01 5.363642024490571458e+01 3.490023393218752403e+02 6.070998420255242536e+02 2.998979392425262631e+02 1.033405404272810273e+02 1.117007142236188599e+02 1.226489213491847465e+02 7.250580099288183078e+01 1.920427314062061086e+01 2.076645757964628203e+01 3.524228204483573990e+00 3.455868180291234548e+00 4.102001512200562416e+00 7.377250870910256886e+00 7.062303934753096257e+00 5.078657955411462588e+00 3.933908583677961701e+00 3.481135376620166255e+00 3.685558326788848316e+00 3.879578803260156583e+00
3.015935241273033363e+00 7.183905702573047058e+00 1.617326385248072285e+01 1.598158893756693288e+01 1.061777647063534502e+01 1.047725653636999077e+01 5.990194404895255786e+00 5.329369430665548357e+00 7.002791814152060645e+00 1.284235193636537531e+01 1.397514211686386787e+01 1.184648269530148923e+02 4.746193246936348942e+02 1.908544422955056916e+02 5.653491273712133136e+01 6.185611273100371932e+01 2.220842395758089438e+01 3.187457040803140274e+01 3.719714643039297641e+01 1.416617133645865323e+01 3.441780945308181572e+00 3.615176008921844097e+00 4.519466446704246465e+00 7.562997528345198894e+00 9.669572220429015985e+00 8.761888139227945516e+00 6.528530063474301315e+00 5.966102775969343242e+00 4.916516413946869335e+00 3.964623134045694997e+00
2.552691999726317551e+00 7.113238511171717349e+00 1.136934643791041388e+01 8.012039690189117991e+00 4.792181411450705752e+00 2.116521752122112332e+01 2.346730291939076807e+01 1.947123375246082588e+01 1.023379967263729640e+01 3.239939900394225525e+00 1.182704345962696557e+01 2.052023161495425896e+01 2.281357602716547035e+02 2.846971941711181557e+02 2.821002526493200548e+02 3.558471994303968700e+02 3.043704912747175513e+02 1.886995439759102169e+02 4.946505547279652433e+02 2.240657554384083028e+02 1.962531017178289972e+01 2.173303569276861680e+01 1.626197398608184841e+01 1.118218319180952136e+01 2.406725335419544365e+01 2.179135408044912481e+01 5.861186596775107915e+01 1.989510803436436248e+01 6.599415053870523629e+00 7.353255279140046952e+00
2.370383446541501016e+00 2.330852071986794893e+00 5.795016871590377150e+00 1.776601289629499547e+01 1.571583465415699266e+01 4.001721785391267439e+00 1.469250167456711509e+01 4.143407775909842883e+01 3.090827985531680966e+01 1.268823057583789549e+01 6.802177107619059804e+00 1.066919115035309318e+02 2.170348207242588785e+02 2.528578617462514160e+02 2.109591778479910431e+02 2.366313651991634401e+02 3.770170255541275992e+02 6.113051119237705961e+02 5.879073237372281255e+02 4.438707863940916241e+02 1.957574879574406523e+01 2.090024568833545260e+01 1.842257992816810486e+01 5.370254964004612219e+01 7.251064400527094733e+01 3.624005599539869991e+02 3.577033016780220578e+02 7.423707016745163401e+01 6.648866130228582527e+00 4.890799277096412823e+00
2.157313449755030366e+00 2.329544231078949590e+00 4.758899727198533824e+00 5.219929090153319962e+00 3.495203509365901517e+00 4.274809428800853794e+00 7.499158561112474253e+00 2.185310802398153740e+01 4.862880441241961194e+01 1.795895631031676842e+01 1.923795260262858875e+01 1.729226789823300692e+01 1.318856816141425554e+02 2.444360934352697541e+02 2.098424140542007592e+02 2.971131117426297692e+02 4.716224051599641598e+02 5.287540637768299803e+02 2.847208622587842228e+02 5.898551974007057197e+01 3.476398283851708015e+01 2.352569124955313669e+02 3.390879813328828618e+02 5.457288866918405574e+02 4.892785726109477764e+02 6.180759465707856180e+02 4.842866765480582671e+02 1.417585168661431112e+02 9.538995477584048643e+00 5.333070195170311223e+00
2.740469251139461271e+00 3.172808329302617913e+00 3.081807287304096921e+00 2.902027530227758945e+00 4.384147846727643127e+00 8.285653623166378878e+00 1.249102461312139098e+02 4.337649012581068177e+02 2.214395177108669657e+02 3.951054127614805367e+01 3.108698546943631413e+01 5.207378965784033653e+01 1.020245046218236382e+02 1.367636907383339064e+02 1.652863834100634506e+02 2.729414540961341800e+02 5.289448879104506887e+02 4.831902145512121933e+02 2.102361001421299704e+02 6.780116842801467669e+01 2.845529207105434466e+02 5.039035791557999460e+02 6.336779419474094084e+02 6.169935635812950068e+02 5.137761443151160847e+02 4.272915812525630486e+02 6.171077637033324663e+02 1.089817902386210449e+02 1.235770730881656831e+01 6.450714101476887841e+00
6.805544656214049581e+00 5.441800296137866866e+00 2.732981303630355185e+00 4.088615955695878768e+00 1.251204866309458907e+01 6.329973357126137046e+01 3.619530305462673709e+02 3.069135009482106966e+02 3.156735948113425252e+02 1.637994869411500076e+02 6.469946267381200755e+01 1.909940033198251541e+01 1.859344570731436974e+01 4.247160749636903887e+01 8.714933939404102148e+01 3.684977334533598423e+02 3.412270706474761255e+02 3.567927089589082925e+02 5.626270253341945704e+01 9.222539135515546604e+01 3.123193084444502006e+02 6.526211526285878790e+02 7.816439462448290669e+02 7.591718799649847824e+02 5.871855236951514598e+02 5.435845332810861237e+02 4.944703256723565801e+02 3.917416458641379222e+02 1.785197711082788175e+01 1.181028846950713707e+01
2.831038949243110281e+00 7.965390732837644094e+00 1.471535796269707674e+01 2.405861911200336323e+01 5.494736471455470195e+01 8.073483161015465726e+01 2.635160221485892862e+02 3.431409352862219180e+02 2.465584227564859248e+02 1.966418984484221539e+02 4.429609677924935340e+01 1.944335234070095808e+01 7.102136897256043468e+00 1.749662902518371865e+01 3.345048239919841393e+01 1.812620591556688510e+02 6.132304876243266278e+01 1.763626686466756510e+01 1.821245455276969238e+01 3.568882156358769464e+01 1.276033996289377654e+02 6.453207665328066014e+02 7.788917763929028979e+02 7.534128410751424099e+02 5.091371656976156146e+02 2.223490188039459383e+02 3.472152302518435931e+02 2.367079788109678020e+02 2.127628028669221649e+01 8.316833872718889964e+00
1.537480622888588400e+01 2.109378204334571194e+01 1.491879410116266769e+01 1.962694469874685410e+01 4.926339357071057634e+01 2.993610153145575481e+01 1.609689716272789610e+02 2.181005028304434177e+02 2.106586884759216787e+02 4.996952332936093200e+01 1.353588944428854468e+01 1.299345884250128336e+01 2.176289291649671398e+01 1.336611996248581136e+01 4.536338959073596300e+01 2.786379223972596009e+01 4.501308445226874966e+01 1.202523078039692095e+01 2.034460389092200217e+01 8.812473862086156373e+01 4.383706501618611355e+02 7.753495643339828121e+02 7.808069728808002310e+02 6.760973108948692243e+02 4.736063146503640837e+02 3.206871273799619644e+02 2.944715756410346330e+02 1.998106814400221367e+02 1.975962540901338116e+01 7.165946453768464508e+00
4.328371240958711041e+01 4.206166836685376609e+01 2.376710741939160343e+01 1.905911186483544384e+01 2.792017173752329740e+01 1.611160122266491612e+01 9.768923425792537785e+01 9.268874915769785616e+01 2.690004368872380880e+01 1.419572689477237049e+01 5.162156151267346615e+00 1.914558362424441640e+01 1.067528691957013365e+01 5.046980353067311853e+00 1.095563495294152112e+01 8.497303982754162988e+00 2.698925953663718502e+01 5.530962568910111088e+01 4.813128371546697792e+01 1.956851883020559910e+02 4.877406204065174506e+02 6.481027754935805660e+02 2.432826842484418535e+02 3.267877065106244459e+02 3.780279890610946723e+02 1.944972300997612820e+02 1.359523304324245601e+02 1.133741246336020083e+02 1.504490151578157509e+01 1.609935992475974942e+01
3.703257791328644544e+01 4.530949466086226352e+01 7.579128535348985451e+00 5.915155574063636124e+00 5.535953991701081378e+00 8.667568027638687056e+00 1.323633313739110129e+01 1.657577873340679986e+01 4.836026841598229709e+00 3.713991867553207094e+00 4.959584293397314880e+00 7.515936970035445697e+00 7.459728419335913685e+00 2.351397267977926475e+01 1.367646594065832488e+01 1.589794877536740216e+02 2.729124254057882126e+02 3.578864258818223334e+02 2.228296422811429807e+02 1.526746544389135352e+02 9.736870562060086343e+01 3.154676369423497206e+01 1.115401952882830727e+01 2.151605434914736037e+01 6.938835341549906843e+01 2.113055643086775248e+01 1.884676176793424318e+01 6.922140242916311692e+00 2.808599625851682990e+00 2.600694108959150874e+00
8.476869823857890651e+01 6.986503295101942967e+01 8.474308463023316307e+00 1.999158466882667895e+01 6.687779252480465786e+00 5.309309107751529311e+00 8.668840199090677601e+00 5.132487047793699020e+00 4.664535442362065076e+00 1.951268652622398569e+00 4.580204385949262935e+00 8.369295021111902599e+00 9.564931834826396084e+00 1.054347912139301258e+01 1.516754506986810824e+01 8.586651281185079654e+01 2.870334265532358131e+02 4.912316038085999708e+02 5.130566104554968661e+02 4.071633966985195343e+02 7.808396151153537801e+01 1.580330741432487507e+01 1.792921763282236469e+01 4.046743602489757308e+01 8.270712788884652866e+01 2.250927612252755594e+01 8.402329245473675101e+00 1.070014779789661397e+01 3.903802403569430979e+00 3.736015050046010089e+00
1.167882500565211217e+02 1.581918888113412791e+01 2.099761132197199487e+01 8.351738453442084875e+00 1.077827796046116937e+01 2.465510912704860402e+01 6.261504077906028698e+00 3.943865824258226738e+00 2.270413647114272848e+00 2.527648612287700658e+00 4.375813531783862231e+00 7.267300914031167736e+00 7.015299086801957351e+00 7.496002275242687141e+00 2.568885723702148383e+01 1.147050246256777370e+02 2.054975452935179874e+02 4.395446677073971387e+02 5.166267345959704471e+02 4.043051722573443385e+02 1.831262089819181824e+02 9.954368358441922027e+00 6.727698779848131139e+00 1.369616626840321416e+01 7.300905976129926955e+01 4.087581383706866944e+01 3.646371526472300673e+01 7.297150175751151657e+00 3.212186051497148309e+00 2.875739126251792399e+00
7.254978892945162272e+01 2.368642634457419405e+01 9.592981859758451080e+00 9.540001477920911910e+00 2.253057148768020213e+01 1.580667315977747123e+01 6.672831780009614633e+00 1.519678651004508119e+01 2.323204978473061288e+01 2.904886316360748211e+01 2.634954294836994393e+00 2.955507533729007097e+00 4.022563729543178646e+00 7.724798752939934232e+00 9.066328983087529991e+00 3.322865975902304569e+01 3.173532111781398868e+01 1.275654258210697947e+02 1.548790959499681321e+02 1.234939617844207476e+02 9.795250630017373794e+01 1.289647330072694054e+01 6.073716185186065708e+00 9.865714827876768567e+00 1.422196556179782156e+01 3.437803283052530645e+01 9.035204924016306904e+01 5.087958654333920094e+01 3.758797121055310164e+00 3.241755462699289048e+00
2.648010393048903666e+01 1.089367852930198666e+01 1.196554476821708590e+01 2.121464577409464169e+01 1.249889967355304066e+01 5.775213809001775722e+00 1.463353502216106250e+01 1.068541443750016740e+01 6.215018663343938599e+00 2.300376986280629765e+01 8.444759677335673231e+00 2.916655366800504190e+00 4.461734549871748001e+00 8.096486826902676626e+00 7.564949903641768003e+00 1.265067202524129186e+01 8.972172726463933046e+00 1.576879979476396088e+01 6.534088426010155715e+00 1.070171260361452248e+01 1.842812161483194799e+01 1.381486221633694456e+01 6.535828335792073673e+00 1.206020282692584544e+01 2.588236085298921552e+01 7.844450319093126289e+00 2.953700036714081278e+01 3.618423525818472086e+01 1.701472786939807236e+01 5.097192711908245855e+00
2.686008764803809257e+01 2.234166318179858735e+01 1.120252504679602445e+01 8.626523956617589306e+00 8.656522865292281210e+00 1.782829108837189835e+01 1.219353792148099558e+01 1.292298400138021464e+01 1.447225907518886245e+01 1.000528909290547119e+01 1.539009595565450006e+01 1.403225071412540004e+01 1.168094079462419543e+01 1.189975328395713028e+01 7.254405443567113920e+00 5.590964493200651475e+00 1.419007757111645773e+01 8.717726424646858874e+00 7.470643974858184322e+00 5.461020458297990210e+00 4.213913600332657161e+00 5.903978799492621832e+00 8.288429353995670823e+00 1.785085830174584487e+01 1.400521886372684222e+01 1.347949565908862724e+01 1.126462005893327500e+01 1.484650761737428937e+01 1.519299905858738953e+01 9.994674038814601147e+00
3.647248189648297512e+01 1.970154697860670012e+01 1.152222677700607179e+01 1.653266590124634661e+01 1.567495402942137162e+01 8.719836303723287330e+00 3.010968128845783909e+01 2.331868167540185510e+01 1.963919537552051509e+01 1.378186912075309323e+01 4.814577721329198923e+00 1.045321050943027075e+01 6.411118330149073508e+00 6.685030684069189988e+00 1.926161941253863219e+01 1.580885453248793304e+01 1.618992590236570450e+01 1.899459829448591108e+01 8.499208800159591348e+00 3.673824545457716972e+00 3.441294541573549193e+00 5.188035587647561009e+00 7.379347497169298720e+00 1.978210668690041985e+01 1.016362030112109416e+01 4.580898246746423652e+00 5.539683953917716508e+00 6.866680322678890391e+00 2.160855087049128542e+01 4.405481365692224038e+00
4.879488819557014523e+01 4.374998977729336502e+01 1.367294864669803367e+01 4.912133128338653876e+01 6.135176432744589192e+01 1.183166055831434136e+02 8.022979796300882072e+01 9.408545497128645962e+00 1.948841481564356570e+01 1.094223747542560687e+01 3.146333817627983365e+00 3.692557068086444794e+00 4.133143084415038082e+00 1.449769779224619981e+01 1.658565152978152923e+01 6.968154745529178129e+00 5.780238845295758487e+00 6.147618706928491328e+00 8.058916801222574477e+00 4.520904375549548604e+00 3.100165604253177776e+00 4.536066381619617616e+00 4.904108606996802955e+00 7.270624629172395714e+00 1.305447116580721811e+01 3.481935445183407030e+00 5.245284278447936543e+00 8.232329982553567405e+00 9.225795522812301641e+00 1.803961184963831244e+01
2.582966421573637206e+01 6.647962231606794603e+01 2.059377929616773173e+01 2.322839747065525628e+01 1.204021597340353793e+02 1.298761260769765897e+02 8.739085924149514994e+01 6.176170223309886964e+00 2.541993385849453446e+01 2.314338831532353780e+01 9.165521274235910454e+00 4.416061489591510458e+00 2.666217803860250868e+00 4.287526324969283209e+00 1.920550303950855309e+01 5.012414301641083370e+00 1.376972618981155527e+01 2.704706449753875930e+01 4.158921382143977752e+01 6.755691368091808258e+00 4.212298114786293901e+00 5.852411036222902041e+00 4.953088571558271980e+00 4.882360883300672860e+00 6.243002862410484077e+00 4.834146866894397654e+00 5.835816573423728393e+00 6.929244889744799352e+00 8.529317764531000989e+00 1.593870665697635047e+01
