1.100974983101605034e-02 1.605742600425539429e-02 1.401709266801162874e-02 1.772864745996323779e-02 1.348905381768087351e-02 2.962097121509796316e-02 2.944399507297056073e-02 7.986501714348372138e-02 1.451555851905697025e-01 6.580473285632384983e-02 3.055866525186032301e-02 6.952651423844185240e-03 4.059142602166450342e-03 1.510993625037533768e-02 1.750461953588395431e-02 3.818788019781451694e-03 1.336584136436533635e-02 2.329055808692914384e-02 2.096647325720498584e-02 7.326769032542557528e-03 5.813056381703881649e-03 9.040710212820358103e-04 6.329873755505245614e-02 2.683466088046352997e-03 4.464716212193480319e-03 3.372579328198716149e-03 1.593364509952397909e-03 1.527896494480806590e-02 1.509323569591339113e-02 1.930581533622072882e-02
8.574096541984509157e-03 1.856427095704165850e-02 3.336093090393408428e-02 2.730535749750226393e-02 1.903064511065118147e-02 8.516059745695200855e-02 4.043984912460543008e-02 5.114515293348381036e-02 3.340491511897963894e-02 2.917377504392246884e-02 2.089332237053139960e-02 4.092997575195508539e-03 5.402553393682378406e-03 1.230007444731189177e-02 1.709818360297553005e-02 1.087504736640279232e-02 1.335097015063487630e-02 4.344081577392717997e-02 3.255190344499139105e-02 9.704780917860806114e-03 3.377727690533380549e-03 8.152146095445998849e-04 1.736138483707781646e-03 1.504416132043872537e-03 1.117685143788565462e-03 1.420047682097437146e-03 5.863977549478888857e-02 1.572427981496102647e-02 2.306452411166146077e-02 2.328066182840848874e-02
1.017679622516070859e-01 1.002225445104414081e-01 2.119652237274284312e-01 1.725989968737792757e-01 3.660467392796503683e-01 3.722807728065557348e-02 6.901446396927694155e-03 7.409442676688053273e-03 1.191794829614800794e-01 3.759652395118778800e-02 1.039847416262840024e-01 7.003977183240685245e-02 2.556860573966796002e-02 3.717789935748454927e-02 7.078313498048513161e-03 2.944713579543064425e-02 1.961315274221952371e-02 3.986407756838743210e-02 1.315679158447459474e-01 2.166169357591673367e-02 2.021537234505910684e-03 6.096272039429063549e-04 9.510179011831998604e-04 3.477924508093965805e-02 1.953920306604263121e-02 1.283442197568996149e-02 1.255327530923693556e-02 1.008145632114040499e-02 1.723849979051747180e-02 1.936079861149113748e-02
4.741752455616154993e-02 1.316858028093545741e-01 2.890799613767322529e-01 2.336315028491858792e-01 9.517012658567679251e-02 1.466759731888255154e-02 1.155662849837105904e-02 7.780614234307843026e-03 4.773930875490042455e-03 4.644601576952617217e-02 3.088710269917182422e-02 6.229658336969902399e-02 2.808771669506970881e-02 1.851987812026386834e-02 5.394639633192001120e-03 4.045311695657092046e-03 8.370133992294935543e-03 1.552942471980853917e-02 1.089449283366029919e-02 9.197644929345771825e-03 4.071244739097386496e-03 1.416139722278860922e-03 4.465577304195927216e-02 8.908458927793705320e-04 1.600547906280345295e-02 1.179752216012527888e-02 1.079457131925317878e-02 1.023436434625741437e-02 2.019271735467698808e-02 2.197052126454842116e-02
2.734389970039388315e-02 8.235976504273927190e-02 2.300263818300082308e-01 8.915182063077026209e-02 5.051528168362008631e-02 7.343981440640865235e-03 1.122568584192338952e-02 6.241995706738176844e-03 2.907341043397309102e-03 1.056509425912804528e-01 1.377778608322498544e-01 1.187017405957994653e-01 1.745004358294913877e-02 1.416009782040421675e-02 6.465374172256337093e-03 2.331908371814315171e-03 2.469500611413670207e-02 1.410062459351266693e-02 2.248821168954087332e-02 1.281336047050049033e-02 8.718215945406957226e-03 2.435743469074425765e-03 5.215579398457936486e-03 1.503007740445392714e-03 2.869753762643472567e-02 1.595850274076351591e-02 1.142075093651800932e-02 1.318488008392395758e-02 2.011119732068239116e-02 9.518214972653326906e-04
2.722488931011969940e-02 2.769589733247143290e-02 1.242125677875164785e-01 9.952564058386789703e-02 3.922259146944160474e-02 4.205752766688388225e-03 5.127058580682400911e-03 5.490955892859956597e-03 5.178328112749127146e-03 1.630707649205564713e-01 1.327142497236966923e-01 7.069525416999457301e-02 8.003042686643374246e-03 2.718571306156635121e-03 2.001620849859079773e-03 3.144710992328545070e-03 1.344931927947008547e-02 3.502389090250685681e-03 1.128652882662591062e-02 3.877902509091979422e-02 4.665471241584590034e-02 2.712951028951542803e-02 6.559362895151798177e-03 9.215939834671836237e-04 4.283814496956572099e-02 4.225992540063867875e-02 2.659465099569780638e-02 1.828858064913854026e-02 2.359711176068034558e-02 4.242463907394378869e-02
3.851539448584215524e-03 5.930971481849328826e-03 6.253120844341141307e-03 3.161697268487565632e-02 1.510053246980738381e-02 2.504959100027108823e-02 3.800359667315875850e-02 2.166979952115325944e-02 2.584026858987759773e-02 3.119673807287393422e-02 2.479463820338541694e-02 1.035212359140726471e-02 4.397721084795166817e-03 2.078351997002500506e-03 3.689679630226013612e-02 1.693374811407784373e-03 7.502242405899231872e-03 3.559016902541728335e-03 1.813325636961564749e-02 2.475927550217714435e-02 1.132176758061174439e-02 2.992937279700389353e-03 1.324369351404565539e-03 1.250822860923003418e-03 2.982995970196554089e-02 3.175222915124546047e-02 2.802932031754701986e-02 2.411831109151612793e-02 2.683605090919975733e-02 6.379273638709893890e-02
8.661614547822400062e-03 1.574925297483486392e-02 9.137995393788650444e-03 1.949475440018021144e-02 2.963115411929178114e-02 3.320759929667427973e-02 2.942271694767616130e-02 2.774530706376300906e-02 2.211285847089241099e-02 1.268962142747011301e-02 5.202017468052865315e-03 1.627017936519919994e-02 3.609533439344783483e-03 4.398818062633844811e-02 4.893359945594987631e-02 2.508456465999527214e-03 1.585094645105243963e-02 2.550427598168187107e-02 2.238994424314566870e-02 1.581518669780358766e-02 4.233345899211684617e-03 2.224369816564265769e-03 5.300180728963868604e-02 4.624266039064563183e-02 2.321828173161667730e-02 2.403040477270106806e-02 3.592688335254547172e-02 4.126363492748150175e-02 3.970753835825745898e-02 1.838932400079777403e-03
2.245415994147826472e-02 1.499634170951366988e-02 8.865119010735630564e-03 5.152943442993896533e-02 3.309690621332069677e-02 1.392664219609105955e-02 4.466286998266852382e-02 2.000480994937938253e-02 1.656366357342370713e-02 1.652735696477873953e-02 1.486966353565043544e-02 1.975747599052458947e-02 4.504372633629415146e-02 3.161008016598391979e-02 4.656987373566111657e-03 3.991341148443083159e-03 1.605563013420943652e-02 4.907981563294687433e-02 4.832546616234141557e-02 7.968478395207777287e-03 1.507034956980233533e-03 1.623540874399713582e-03 1.934236021124028293e-03 4.532738413610737371e-02 2.741471857512138219e-02 4.007442296853401531e-02 2.017248232712201203e-03 3.502073646032623742e-03 1.007997669947906412e-02 4.997054074574028282e-03
3.886560883598888516e-02 2.521556190597218708e-02 3.899692944864019406e-02 3.697132765959292022e-02 3.269244044313260322e-02 6.438286400032400963e-03 2.953041299317697016e-02 1.250699320376046433e-02 5.153854976713384897e-03 1.948915975781576699e-03 2.869727198937117515e-02 2.822994207165053018e-02 5.982380629972423869e-02 6.459906174678371749e-02 3.059721913182145148e-02 3.349588744615128455e-02 1.803714321959684064e-01 1.873851811451415217e-01 7.483053214984827783e-02 3.299911453102569170e-02 2.440771018761178374e-03 5.001064306243410001e-02 5.460041346850901672e-02 1.390263406655718953e-03 3.328753341594748588e-02 4.251840321743468459e-02 5.753938635556639543e-03 8.293442714784514391e-03 1.164316962791749066e-02 3.167371860034356654e-03
3.356441688836588055e-02 1.754324905901977899e-02 3.701186910142281045e-02 3.088425260675988632e-02 3.944541029521765607e-02 3.634822267760350143e-03 3.002823932926739284e-03 2.577797020430355919e-03 1.575348190562676819e-03 1.430491886963142396e-02 2.275101492281414450e-01 3.850262543236847024e-01 7.992451193661855857e-01 3.943830285060168639e-01 7.267343093994570180e-02 1.430013105450583522e-01 2.670273256153594676e-01 7.375849375275317366e-02 1.747020999012285913e-02 3.855490812714996475e-03 2.281183113686790446e-03 4.968020813052487217e-02 2.129103115565069045e-03 1.694023678163519711e-03 1.616165152929110484e-03 4.714826265721980270e-02 1.485044116985459765e-03 1.404100766341211982e-03 5.055200677031891632e-02 3.629529048149975068e-02
7.663012023900822589e-03 4.409124411593805422e-03 3.019569280908047243e-02 2.871746895654711182e-02 2.206724998058056525e-02 5.004101597863871639e-03 1.893444103244639170e-03 1.187563522169333367e-03 1.433500233783902705e-03 2.753770888569149339e-02 6.867513671617517246e-02 4.593171190080670985e-01 8.305588728290154155e-01 4.303452664431378638e-01 1.548748042448938045e-01 1.748961524274962320e-01 1.933925510456105390e-01 1.138548467010941923e-01 2.787850881765237959e-02 8.775144306943406802e-03 5.648663712837539291e-02 5.456950463553287417e-02 1.861691994052535552e-03 1.893273218926057192e-03 1.941464842925292233e-03 1.350704880619490837e-03 1.273877283765507918e-03 5.477856870591552019e-02 5.581604209272347100e-02 1.394215157896560491e-03
4.773006802177477692e-02 5.017823368324212524e-03 6.993239954807989670e-03 1.894753718743410337e-02 1.203664567947449783e-02 3.734848744094731825e-03 1.855443388026012819e-03 1.495953606557743655e-03 1.884014852632323947e-03 1.390719402042032982e-02 4.774356201169691581e-03 1.453583956707230618e-01 6.188555597470956071e-01 2.653283044623364617e-01 8.334918786374723165e-02 9.645689385153449757e-02 3.564835756207375417e-02 5.230250899401846926e-02 5.949221407606173490e-02 2.424118729530257838e-02 2.005401616161565318e-03 1.869402410452514901e-03 2.032976986169048907e-03 2.617909888207362121e-03 3.402703105348306445e-03 3.154215644536241363e-03 2.738758176456961013e-03 2.979061758037445176e-03 2.234089237559433797e-03 1.426840411888310751e-03
4.168732341701515687e-02 7.074971302615438995e-03 5.819211074268641933e-03 3.233230635275228387e-03 1.843733611488041586e-03 7.003039221273125656e-03 2.355225785097514804e-02 1.981477814910130933e-02 2.596238006031182342e-03 4.266510719991237210e-02 3.460426828825488230e-03 2.355948642673447863e-02 2.824493940399417369e-01 3.822878627424919351e-01 4.072444355667148574e-01 5.493966714811886476e-01 4.953596825524032021e-01 3.224261167064925160e-01 8.830796175727636532e-01 4.099933458617903703e-01 3.360508888013107043e-02 9.660944165310297871e-03 7.231562960408138840e-03 1.817887710476956756e-02 4.232820212663102044e-02 3.968106846852630792e-02 1.083698119372738800e-01 3.475964966910783521e-02 2.601877549267492002e-03 2.304446967704556169e-03
3.811963625192366090e-02 3.557935020314411528e-02 3.587145728121655767e-03 1.514196803290749488e-02 5.329352277193095608e-03 1.214702203707531758e-03 1.569830018051511511e-02 4.527666980833113669e-02 3.132377774727967273e-02 3.296631388547780275e-03 7.278151760967519965e-03 1.169688637492544980e-01 2.526433636776241887e-01 3.211134188368008346e-01 2.901705792411467533e-01 3.506624378372288353e-01 6.005730066124211897e-01 1.042736935876182658e+00 1.066125649360752270e+00 8.392734071563197062e-01 3.577849986200884458e-02 3.729384131220801757e-02 3.327599141175813235e-02 1.046863938175980890e-01 1.511366177997195137e-01 7.747700982637157896e-01 7.723949065752920840e-01 1.513782700799207737e-01 3.160261430826126223e-03 1.753882121475016037e-03
3.509557361295877892e-02 3.610904139376794331e-02 4.167684848558944957e-03 2.453163108654749652e-03 1.205722341308477791e-03 1.217286380529506275e-03 8.611652367894443230e-03 2.439777323208233012e-02 5.050310332954808384e-02 1.841700021874061871e-02 1.972025043576305925e-02 1.805955076165614848e-02 1.429309086410749940e-01 2.898636990311637129e-01 2.705499951624542043e-01 4.148190686211107869e-01 7.221765446288753720e-01 8.829575214953937490e-01 5.131475369476445891e-01 1.122718425487446714e-01 6.759839092041193542e-02 4.658134197219568895e-01 6.820121791011084511e-01 1.148515321019613511e+00 1.080958713086893175e+00 1.405249284024338685e+00 1.112979760194120038e+00 3.089223869999330185e-01 5.052571268826115507e-03 2.171262085287391924e-03
4.374682291853396188e-02 4.871390860578026644e-02 4.491608712381661012e-02 4.020649336629338044e-02 1.298906678507949540e-03 2.396747603783417647e-03 1.411082842452164587e-01 4.753021332873114679e-01 2.321293821087450637e-01 4.051420143520602368e-02 3.111038398566593963e-02 5.067669003769295633e-02 1.017594168262006826e-01 1.504070594613410305e-01 1.991835592091516782e-01 3.579312629598252471e-01 7.771507026031492238e-01 7.874534123935136298e-01 3.752026206766787553e-01 1.295080332849493920e-01 5.613497209570814661e-01 1.023765837672561796e+00 1.320203588804410355e+00 1.361116272949021599e+00 1.191336719316803849e+00 1.013296580738429542e+00 1.467401666302801555e+00 2.505642712720215770e-01 7.803820264214354763e-03 3.187413268724545272e-03
4.446111887879432290e-03 4.161569817499545867e-03 4.111754241935754173e-02 1.791506782372327081e-03 1.536998721313876694e-02 6.917597446429110675e-02 3.889066117301047676e-01 3.187386381854662720e-01 3.136432743311371452e-01 1.600051690565127416e-01 6.046535892080868307e-02 1.694639564571464793e-02 1.678894335192495854e-02 4.322239059646836024e-02 9.781153200443126750e-02 4.504546617503357719e-01 4.772839687091244842e-01 5.599126006283541290e-01 9.822692323143258908e-02 1.745570469675533642e-01 6.224854785987474770e-01 1.353411831366723383e+00 1.676270272115428561e+00 1.742004927301659567e+00 1.412368746269657249e+00 1.323370981019099002e+00 1.200347034893542997e+00 9.419193648819319531e-01 4.147853337284317099e-02 2.704389146067377042e-02
4.315945994834891053e-02 2.497006279499505536e-03 4.277523007631480606e-03 2.859481129233135827e-02 5.774002619350741133e-02 8.131905484777354753e-02 2.559805599095433259e-01 3.192513475789833244e-01 2.187184417122238211e-01 1.746489701967354202e-01 3.767349845501351963e-02 3.778261264289524066e-03 5.790661545223032419e-03 1.638387430666175815e-02 3.568252250976707007e-02 2.099121187904098018e-01 8.056042245994296525e-02 2.587491330713772089e-02 8.734096224350420407e-03 6.379326926766076822e-02 2.436454289765981884e-01 1.301136408813902801e+00 1.649907472025092137e+00 1.708736741621978528e+00 1.222810659472551409e+00 5.552794257043186521e-01 8.871686289318857499e-01 6.025887744312243832e-01 5.404551447453963958e-02 2.102434691647595347e-02
2.117194120213164443e-02 2.706146318783409985e-02 1.706734048733725070e-02 2.086131894618472801e-02 4.796953698676764688e-02 2.728766314467486256e-02 1.394542505124021226e-01 1.789631610277124252e-01 1.640923361310628326e-01 3.959943074933007512e-02 1.012815023960664078e-02 2.170250715544565744e-03 3.829996724585844892e-03 1.128392238195443514e-02 4.442623913675365632e-02 2.946929709317877219e-02 5.390043544987552226e-02 1.597800356801412983e-02 3.015409347639834772e-02 1.437146682525401176e-01 7.755198122268587291e-01 1.467192079396747229e+00 1.573383303477660533e+00 1.482065247558199683e+00 1.126412914679299382e+00 8.175997196972192294e-01 7.871502700043215839e-01 5.255887751554807474e-01 4.707856051600255165e-02 1.655730003185632709e-02
5.718419875374034650e-02 5.220914146928901794e-02 2.670897995393433158e-02 1.912485445027806152e-02 2.466450898219657573e-02 1.311666416228119900e-02 7.379012033080714628e-02 6.523048817557111634e-02 1.769757316008583811e-02 9.727581827555998456e-03 3.398638605304794835e-03 2.742995944535194658e-03 1.668282702490308210e-03 9.352660241210967486e-04 2.429782871715083052e-03 8.140962022680841431e-03 2.913320979519678361e-02 6.647450217363057301e-02 6.403665677309733351e-02 2.861008873687815313e-01 7.789889476175552163e-01 1.122495187442594800e+00 4.542226144009253730e-01 6.832003767647880643e-01 8.864190865482274306e-01 5.040267881586490972e-01 3.767291127770341364e-01 3.067919757216521770e-01 1.332080341904362183e-02 1.238037533890377732e-02
4.629454828533543370e-02 5.269314690012331936e-02 7.811548922892576352e-03 5.423355346685254652e-03 4.453120675957415557e-03 6.585811883639540454e-03 9.247138591339744765e-03 2.272481871301388050e-03 2.963121830611848816e-03 4.783331245454253535e-04 6.497451928273356627e-04 9.867733359778764132e-04 1.119751162303903383e-03 4.056141503381150218e-03 1.151774573248106129e-02 1.491320805831269358e-01 2.861976090480987667e-01 4.138657615274458079e-01 2.823989469799025320e-01 2.115377243767679882e-01 1.485236706323079803e-01 5.258429878620550502e-02 2.023218515485479541e-02 4.428409310723365605e-02 1.623041527963125785e-01 5.538553948014589279e-02 5.106961550881763262e-02 1.716332200619002935e-02 2.350534361994501692e-03 4.773849756905764602e-02
9.453954574798106858e-02 7.166682036032637204e-02 7.975736789211261210e-03 3.489167449528561560e-03 5.072895595039872418e-03 3.929263528091383670e-03 6.128543337819694278e-03 6.579660228222165104e-04 5.993129356804676334e-04 2.668508377006595031e-02 6.561835646312276938e-04 1.162327540922381648e-03 1.504096216369711766e-03 8.373828487813964397e-03 1.414349224807827377e-02 9.021827699090959052e-02 3.313702303830720064e-01 6.191935267519378394e-01 7.022909090166464807e-01 6.064713041146609918e-01 1.276267503964939876e-01 2.820133227351429364e-02 3.483139125851206913e-02 8.675496976498664470e-02 1.947198674985552713e-01 5.786871527202164939e-02 2.200454769239453684e-02 8.254817403379331037e-03 4.575277065391353780e-03 4.273879080259811343e-03
1.150617040678263980e-01 1.477525072841612275e-02 4.181964859570526556e-03 1.404851340377574797e-03 1.541996116488303066e-03 3.366786082267685370e-03 4.449657801920119810e-03 5.389450648830650115e-02 3.083213690552990410e-02 3.534997589179779409e-02 6.181517688116672932e-02 1.118014992733795850e-03 1.182306365684130701e-03 6.483554411656211602e-03 2.633347949468383895e-02 1.313770039814393664e-01 2.562803234633089788e-01 5.931771949592763438e-01 7.506162250848937845e-01 6.363346772299938170e-01 3.158550508731028938e-01 1.810319120811008931e-02 1.284506694111376204e-02 2.818216500310506689e-02 1.632896223978331507e-01 9.918087508491776894e-02 8.895487713753347236e-02 1.661511904553268984e-02 3.530255819264271813e-03 5.399997915217961963e-02
6.643469272598839792e-02 2.083487133252775320e-02 7.878717381954445861e-03 7.577914291668994343e-03 1.578145416043825675e-02 1.080090419826744939e-02 4.655285154749843474e-03 1.959586826857890891e-03 2.996000132638668243e-03 4.154711786677135060e-03 3.775629888556895214e-02 4.216787285510503747e-02 6.911125168302194831e-04 1.494357334944679608e-03 9.558528741892105204e-03 4.081486141856460748e-02 4.142646881866862002e-02 1.777747900895839395e-01 2.293129719805944988e-01 1.986962980395876044e-01 1.674370876850851120e-01 2.165824538739862665e-02 3.351486048656846222e-03 6.634342791229085393e-03 2.948793602245160586e-02 7.464111293607296471e-02 2.000862626825381241e-01 1.120210493802577256e-01 4.060674500635372795e-03 3.186314584926331749e-03
2.406043396405593837e-02 9.648525916365740043e-03 9.969214801564943440e-03 1.732280854283313812e-02 8.811593573516348504e-03 3.952985352394165937e-03 1.848637251359228333e-03 1.306942121327007642e-03 4.131214505752419351e-03 1.635252061877879443e-02 1.300913269747340896e-03 4.051540166137680699e-02 7.408914376307454766e-04 1.543957846468304185e-03 7.751616129916384310e-03 1.456915068278497385e-02 1.010320427568044133e-02 5.044465416537843860e-03 8.021949720428332015e-03 1.479967422741226314e-02 2.671198305594219349e-02 6.197922605633246484e-03 3.257054005049736783e-03 1.690447363336082878e-02 4.140402470253171097e-02 1.486427711398538923e-02 5.139035432052987962e-02 5.751833470018616334e-02 2.018317163730883046e-02 3.009559601425459106e-03
2.440596969193543214e-02 1.975473981739913829e-02 9.338326739260962434e-03 7.028950423358710023e-03 6.079826205923986177e-03 2.285642490648419518e-03 1.540473592996078125e-03 1.591376777515293717e-03 1.755008914322846343e-03 7.028499232054711068e-03 2.138156358663571930e-03 2.011035709936494133e-03 1.943753006201753191e-03 2.479088054213107045e-03 7.620350206414983757e-03 5.627191615973427784e-03 3.975948519008093429e-03 2.479562949435949824e-03 2.271864979685959702e-03 1.803089184415458289e-03 1.483829410297096956e-03 2.242132614739551343e-03 3.699285674367875417e-03 9.602800321614052975e-03 1.726605178272422672e-02 8.440667286726724616e-03 1.359727320530376704e-02 9.135888240106087785e-03 9.202024136491156539e-03 5.852774293039529965e-03
3.318265074001164328e-02 1.741081855209815690e-02 9.610501572131554399e-03 1.344881787967068185e-02 1.099621184285401281e-02 5.997556458502802806e-03 2.089709850071089225e-02 1.595265775439594358e-02 2.350590722320714150e-03 1.791264505506273870e-03 6.393595466208158197e-04 1.459381801233447474e-03 4.377481380113618439e-03 5.199426570632769383e-03 1.716242877608061684e-02 1.367489136709535563e-02 4.535159591651823432e-03 5.633852328857969459e-03 2.716192253941523277e-03 1.480068019997218039e-03 1.374487929529601051e-03 2.125141890790891233e-03 2.797159215146297062e-03 9.316651903170884014e-03 1.010973337833684024e-02 2.541970111519617492e-03 2.912213791704363827e-03 3.827808323149961035e-03 1.263583442940302386e-02 2.602814962982232319e-03
4.410575584639377100e-02 3.849575672139163296e-02 1.151121574029646821e-02 4.006976168798477567e-02 4.338585543309169540e-02 8.236724500556438788e-02 5.640957294033070724e-02 6.464951064373830950e-03 2.328611309888668941e-03 1.417415593492927107e-03 4.415882453607791747e-02 6.360299649245844400e-04 7.660978223956007097e-04 3.215163727405611488e-03 3.867367124369104452e-03 1.869434351872531659e-03 1.927535838478007697e-03 2.491795474017762316e-03 3.561001072696931211e-03 2.248032991344795384e-03 4.248516894761829310e-02 1.707685065085545479e-03 1.597068249778976247e-03 2.965639510559281433e-03 1.024092945726642716e-02 1.750368266078648890e-03 2.668595627779800535e-03 4.550708684939064330e-03 5.676596068233157738e-03 1.137049411656155737e-02
2.302520835678121755e-02 5.798031663956057513e-02 1.817340780511905729e-02 1.925135108587940416e-02 8.751180503319676285e-02 9.241693179173106343e-02 6.210647757746387554e-02 4.300968209866979329e-03 3.064588534519397528e-03 3.106118476498899959e-03 1.299837874349029027e-03 8.317216258891344666e-04 3.853376746698387173e-02 9.261873596408784666e-04 4.233947137066451996e-03 1.336476517218701532e-03 5.104991403336608599e-03 3.333237061127999890e-02 6.222211878963718190e-02 9.999549022818883873e-03 1.975876864608613545e-03 2.526169446950487889e-03 1.786904255419766900e-03 2.153278561808137127e-03 3.137103611207817024e-03 2.616823856138573989e-03 3.254727617956331299e-03 4.135181674320011214e-03 5.771649244076249019e-03 1.430318310573805776e-02
