4.469569004923807376e-01 6.105581645820181702e-01 4.974913379578269068e-01 8.011660415099125521e-03 4.261622043143826755e-01 6.305761147808558800e-03 3.274925150895680211e-03 8.812856018647778622e-03 1.593673449378653004e-02 7.457674576910183761e-03 9.374371945729959021e-03 2.931226852234267710e-01 1.908233099050698489e-01 7.749254772021276459e-03 8.062448720923183834e-03 2.041391958816665686e-01 4.828805839811693527e-03 2.608886302810849676e-03 4.714547559733683370e-03 6.921050550800311729e-01 6.425936970855042896e-01 9.755456215668899256e-02 7.481903185102292686e-02 2.787819779016769139e-01 4.745133430572966438e-01 3.368911535668558388e-01 1.530640143968963196e-01 1.391673268796735606e-02 1.418167685044172815e-02 1.927588771317432365e-02
2.720719576817066110e-01 1.937916404354811384e-02 1.991963460084775900e-02 9.537590253735205026e-03 3.523068629827378045e-03 1.956456243207583406e-02 7.720813765865304316e-03 9.403962601586400571e-03 4.687282353335001962e-03 3.114593216546703448e-03 5.712606964831085966e-03 1.475563876579121803e-01 2.236050410768719854e-01 5.346615954801654524e-01 8.818044191391184727e-03 5.606470334263096156e-01 4.505273379948867250e-03 4.794080182225907150e-03 6.852499233665943108e-03 4.945095957447860624e-03 3.686492473441074225e-01 9.333805311732551457e-02 1.939250920354863017e-01 1.592298637931999217e-01 1.213315793909724161e-01 1.504664029786845214e-01 5.746399262664734359e-02 1.523216120827104725e-02 2.263001392196283684e-02 2.363554214201947501e-02
1.727981593485666822e-02 1.564302378217845985e-02 2.167288971932678290e-02 1.757773416885062556e-02 5.245592102126158535e-02 1.581624450950139260e-02 1.994557394370803372e-01 2.093314343082457452e-01 2.989740041880815241e-02 4.657578971050926192e-03 1.317232604648004533e-02 1.272627152766318478e-02 8.400056839096585112e-03 1.822531049500643319e-02 3.465336863125659805e-01 1.774551444148952245e-02 8.253233031713071849e-03 7.913020803295353622e-03 1.386678491212178788e-02 6.624640801095245043e-03 2.269640831892715815e-01 7.663659339512428337e-02 1.171951023657038238e-01 3.690572479483401891e-02 1.859327297604596030e-02 1.188706957277398980e-02 1.296313924847072169e-02 1.026664863417181724e-02 1.766722860096700196e-02 1.998521178829336387e-02
5.023340915601577465e-03 1.328689757745099564e-02 2.913860031176311940e-02 2.353392990413154251e-02 1.888188182351871469e-02 4.044804916490574720e-01 4.018629915668142649e-01 2.493033040597872618e-01 1.350114700279119451e-01 6.359848469852033559e-03 3.351998810172065850e-03 7.301494794134641246e-03 1.198794059688974151e-02 1.664980722614968489e-02 2.571750087262217321e-01 2.174955369401274929e-01 4.647494224257687212e-01 2.788040446638874199e-03 1.095394986132116472e-03 1.885968433135101372e-03 3.727912532253289668e-01 1.491582276486620173e-01 5.160796588424924891e-02 9.340253177941712504e-02 1.505941003518923918e-02 1.049267730274762445e-02 1.040830077123346131e-02 9.881661587808213479e-03 2.008003730373947651e-02 2.181643828752818579e-02
2.881416422439540739e-03 8.273511438505335228e-03 2.305624345936996278e-02 8.947802320940907023e-03 1.222473696038369612e-02 2.365622162179700227e-01 4.115987335454262541e-01 2.311608109656385079e-01 8.482003533051968303e-02 1.690937879174700745e-02 1.525864418514562282e-02 2.183275037527732804e-02 1.054084847196016736e-02 6.294465823558142992e-01 3.158828282027779100e-01 1.204871145485848782e-01 1.109695370246865757e-02 3.004243035486026201e-03 3.263352110621391133e-03 1.948941414818328817e-03 2.006065485113624203e-03 1.788873159521473521e-01 4.642756431897402947e-01 1.452177360300033193e-01 2.714127153847236892e-02 1.398577909695679009e-02 1.012146166832692505e-02 1.170119205245014754e-02 1.830323733796942326e-02 6.725684284606744945e-02
7.065035415776029816e-03 7.228087389510936753e-03 2.207794114605686822e-02 1.279402195949111941e-02 7.986791938549540198e-03 1.332786902589476741e-01 1.694591725480571465e-01 1.798905573737910601e-01 1.452927361548859708e-01 2.285065752071983522e-02 2.305224290622270855e-02 2.363970813745900137e-02 2.981543338571607249e-01 1.037185256772735487e-01 8.055920115758957722e-02 1.262740272492553495e-01 7.820854621182725397e-03 1.654952069523127067e-01 2.054476035051257862e-03 3.580438381605329824e-03 7.234645740364191446e-03 1.369670881936239752e-02 5.256683281116554252e-01 8.072019405668454106e-02 4.043809631022820400e-02 3.694828606322381193e-02 2.299392088701411249e-02 1.583841471501821682e-02 2.089229588547368219e-02 3.750438077702883399e-02
1.419562997868843990e-01 2.026941476107130824e-01 1.976623057225051217e-01 7.597677653581071805e-03 2.076923760714172260e-03 5.555388767129096003e-03 1.186566725648967140e-02 6.500967187156435172e-03 8.665271747017370269e-03 1.001035844276030977e-02 1.436487260052090459e-02 3.534254713371193235e-01 1.674531151525726069e-01 7.055447434890815828e-02 3.736347368426080201e-02 5.970216814079029599e-02 3.336780098630945379e-01 1.491945341137775882e-01 3.075893793013493964e-03 4.469100250264195807e-03 3.844939883287082708e-03 1.554503337071069524e-01 7.344788874507666987e-02 7.076658437133145907e-02 2.745033199740271046e-02 2.816769127071594783e-02 2.485434521637399849e-02 2.142217488046328777e-02 2.450445763821796838e-02 5.807482360970168955e-02
3.429866427439125509e-01 6.029784358784361364e-01 3.220978322555755335e-01 6.661865857331236707e-03 5.146618009031751415e-03 5.658808137277005282e-03 5.010490177786305899e-03 2.946844024842360920e-03 1.085746950026507916e-02 4.329589502217511265e-01 1.969909227764888859e-01 6.493679519840881431e-01 1.420347792308756518e-01 4.727109605394372305e-02 4.988865669186758056e-02 8.673369233851262183e-02 7.948998364460018243e-03 8.704828966804615056e-03 4.326545416376495132e-03 4.421656137710508298e-03 2.322169038098235716e-01 1.374239159589196180e-01 5.585966836084185067e-02 4.698564509552053542e-02 2.243261247084073554e-02 2.349719450109380436e-02 3.692057797398886482e-02 4.038275155627402829e-02 3.951358606318838840e-02 1.115962026986895284e-01
2.862970101263008493e-02 5.737577571183074543e-01 3.180431422417357434e-01 1.680929493765022029e-02 7.585158683782367364e-03 4.107616317365805347e-01 1.653739797521551827e-02 7.294326301397842729e-03 1.394903324464321498e-02 6.563780774799573559e-01 6.338861688340360345e-01 1.693358533160702062e-02 2.165322821427991679e-02 8.674115169121270411e-03 1.693405921862409791e-01 1.371204146369950916e-01 5.458216292716669971e-01 7.373646160783378124e-03 7.555375839623473637e-03 3.363105650747141295e-01 6.738163650136688720e-02 7.063645763287837442e-02 7.725828945515637869e-02 5.068213741223367985e-02 2.974187435837585131e-02 4.500156363100514534e-02 1.705472891565847637e-01 3.005632045391392060e-01 1.867759813314725723e-02 3.697804646388733185e-01
2.059975475370506154e-02 1.523390015808221733e-02 2.369293031522189466e-02 8.457453013954042975e-03 9.630937193765258184e-03 2.128867335994186760e-01 1.988354009025953065e-02 4.719655723383743839e-01 2.289232609141616526e-01 8.493225990184931351e-02 2.332046871199748919e-02 1.085126324169234831e-02 7.574202364574863719e-03 1.071752819549415606e-02 5.774805886294224685e-03 7.591501954350784662e-03 3.281539020692973707e-02 3.008742765007857423e-02 1.507655506720317548e-02 1.199153659708588129e-02 9.451371131800086201e-02 6.011869490600477844e-02 6.936245018526260298e-02 7.643074315382908379e-02 4.273446006403008868e-02 5.428223038933725070e-02 5.018430314791807456e-01 7.328247619702071836e-01 8.185164027352831440e-01 1.961998291027630958e-01
2.067725244728606596e-02 6.219551958907800771e-01 1.326314182448685465e-02 4.693633314969645857e-03 1.489908127879295205e-02 1.437402347494902421e-01 1.408210180725042449e-01 1.282453909718093699e-01 8.821453653080521540e-02 6.917197657085969453e-01 4.762688658810751430e-02 4.824181921250956379e-02 9.962515961874432446e-02 4.953700409056794457e-02 9.199771637721903747e-03 1.815135377266468425e-02 3.353504848214734074e-02 9.164702240718953716e-03 4.548582198015630601e-03 1.608073561856662725e-01 6.825570248939326345e-02 6.140917377444215369e-02 7.980873147045811078e-02 1.120345694128191960e-01 1.199286225327242661e-01 6.505185908469088285e-02 1.017948181798256635e-01 7.172388684297240080e-02 5.757686884075471911e-02 3.780915317115439434e-02
2.774750007329468415e-01 1.510703185184693598e-01 2.498839398298637743e-02 2.145301494143447146e-02 1.899933944161738900e-02 2.460783716544427402e-01 1.149065567944128063e-01 7.937231358486696031e-02 9.474507096173333254e-02 1.126157598026036009e-02 1.473511024627386333e-02 6.176729992043316492e-02 1.022023338061554265e-01 5.360605554997183164e-02 1.954909889898482495e-02 2.228094535686526295e-02 2.457626030610722892e-02 1.443330222637852385e-02 7.602104639825516506e-03 3.676045575193445103e-01 6.533536328216676958e-02 6.688893656507696739e-02 7.948282319981150867e-02 1.425025360601308022e-01 1.355310826570275406e-01 9.658820579593056788e-02 7.370495060438972401e-02 6.101823765605890459e-02 6.038963899239838118e-02 6.002721182873511224e-02
6.562947571322752527e-02 1.568196316738628693e-01 3.424051838216703447e-01 3.936962858103752044e-02 6.047414523637795192e-01 2.080686287963358361e-01 1.154547753635059293e-01 1.004271828418922541e-01 1.285636236922970688e-01 5.107744169680293253e-03 2.400970930203299714e-01 2.210628299038236433e-02 7.547362092419437896e-02 3.282424026041828174e-02 1.047532737142066114e-02 1.229208715120483179e-02 4.565212072614153321e-03 6.723699142156566548e-03 1.323091625498084081e-02 6.563394228595069262e-03 6.259410738121379270e-02 6.888859171255704017e-02 8.751238800717359156e-02 1.456116224685220784e-01 1.845968582385018875e-01 1.613603898266682546e-01 1.181010347968472485e-01 1.015875528008252371e-01 8.130216403495922617e-02 6.224935121430632406e-02
5.666338710586964894e-02 1.590485349912837965e-01 2.709376940698482450e-01 1.886644180250881819e-01 1.113755558858921524e-01 4.322717467519288093e-01 2.414619968535984887e-02 8.097334270228281894e-03 1.741576296373215094e-01 5.831956884566544264e-02 2.067379551016594319e-01 4.838577760888504269e-03 3.405091130410131672e-02 4.696057767600276406e-02 5.101175645696330585e-02 7.007814988849563054e-02 6.390269114010407869e-02 4.195688208441368527e-02 1.158232826155098233e-01 5.670299957436009120e-02 1.063705020584600550e-02 4.092016514285210516e-01 3.084439279457543148e-01 7.346331113434811932e-01 1.943445119431002482e-02 1.048364455859092555e-02 2.351216490177220411e-02 1.112852957701788471e-02 1.097877890563788567e-01 1.174462379617729618e-01
5.285156165009730067e-02 5.258137746280457103e-02 1.390662093783358311e-01 1.012665586070900181e+00 3.664859354011659187e-01 8.099286947810055426e-02 1.172411955693833212e-02 9.465172087970916137e-03 7.777874161596696687e-03 2.224811375882640996e-01 4.564637657615737698e-01 2.319029318436449313e-02 2.991392846120768945e-02 3.874362739946408257e-02 3.569679403096674697e-02 4.395696504163598001e-02 7.652611879950767249e-02 1.348806023527562570e-01 1.400082573948172038e-01 1.117499112140154377e-01 8.872455723619807749e-03 1.237906654570131680e-02 1.401552963954492796e-02 3.127645697809412068e-02 3.338869501673942530e-02 9.888164289243930871e-02 9.614242595100049027e-02 2.685418128412166497e-02 1.100231447112533650e-01 7.931988249582991313e-02
4.751556517335435437e-02 5.158692734786350653e-02 1.138643590732692362e-01 1.251121374462157432e-01 8.252563723547537422e-02 8.555392712456108550e-02 4.731106799530175877e-01 4.057789133221407878e-03 9.248391776828304711e-03 4.677142947070113757e-03 4.898861502319972090e-03 3.204466131532769484e-03 1.654596037835351710e-02 3.423778384595313473e-02 3.261270206842361435e-02 5.094564249053382815e-02 9.059524890990208745e-02 1.131929410552299509e-01 6.725862989231426448e-02 1.498213623693589458e-02 9.047347795499892376e-03 6.237149539279433080e-02 9.103609036987377057e-02 1.493552520141309403e-01 1.353771586743369726e-01 1.692722588191962196e-01 1.294197241541182875e-01 4.517555678082372378e-02 1.544645119293744373e-01 8.736590288979949326e-02
5.797971124279398952e-02 6.773474725898338822e-02 6.751206054699823711e-02 6.291590958512133236e-02 8.862932906475153028e-02 1.479490941145608363e-01 2.799919441631699285e-02 7.789790189207840276e-02 3.334331652141835772e-02 5.778158725198017341e-03 4.197162249185625200e-03 6.060097906881931062e-03 1.152007338119249644e-02 1.737848460446891896e-02 2.345122283041998004e-02 4.289034334497364431e-02 9.580619360450917665e-02 1.001546713357078511e-01 4.915172351244036925e-02 1.732333507551237287e-02 7.519824286972592864e-02 1.370440281113193270e-01 1.765279964777883570e-01 1.744156654630662218e-01 1.442197784774100766e-01 1.164578692879343624e-01 1.621494217457889186e-01 3.225636077044334582e-02 1.964017038574348839e-01 1.042743673160411028e-01
1.365766458436630804e-01 1.098713040190299056e-01 5.685054564617585127e-02 8.036728004132059899e-02 5.307172615138132897e-03 1.301480649062652407e-02 5.809705695163246142e-02 4.516144234356292420e-02 4.447579582763011574e-02 2.241345224607796394e-02 1.029316174052244404e-02 3.997910709518193682e-03 3.717984014504024416e-03 7.812037661624545923e-03 1.119880401608909677e-02 5.235246606290230864e-02 5.755068174375994883e-02 7.656081587345213435e-02 1.385827468552280201e-02 2.509643599500105057e-02 8.322196081468200002e-02 1.813780435458687834e-01 2.252872041604766506e-01 2.209171373086885604e-01 1.665946337454920767e-01 1.469887002551760746e-01 1.288132430506590820e-01 1.084090034466897584e-01 1.530552863170898600e-02 1.185624814034182302e-02
5.317565787421706103e-02 1.514501032620486076e-01 2.764200196294895329e-01 8.480612811751038135e-03 9.296912032048819385e-03 1.105041443533076942e-02 3.492284706610702949e-02 4.359123735616126510e-02 2.981211061745742824e-02 2.300010146291514221e-02 8.139042959839491720e-03 2.845424672743633865e-01 4.101901597794465615e-01 4.903101522623853903e-03 3.822554257871957004e-03 2.229156700168233307e-02 8.834972093543043067e-03 3.247579379504772663e-03 2.861112223005825572e-01 8.295229909054041562e-03 2.941651301834662113e-02 1.580378555502902349e-01 2.017326417454637921e-01 2.030854133057662381e-01 1.400288405268498848e-01 6.152283012376312532e-02 9.623693461966011109e-02 6.568984182355309953e-02 2.763395693177698662e-02 5.861144440395874566e-01
4.643643493496085392e-03 8.148551753500299019e-03 5.001825492301357340e-03 4.452442499266842310e-03 6.014833699881870152e-03 3.418949221948570320e-03 1.748561320989509144e-02 2.243557608968867190e-02 2.052802013133388573e-02 7.507520138147358302e-03 4.641312117437573423e-03 1.962897321956839636e-01 3.199821649880494889e-01 4.960604619071350141e-03 6.574657733951150967e-03 3.707629273068645433e-03 6.282890017555087768e-03 1.882619865165492939e-03 3.599228783375675849e-03 1.717006169108013097e-02 8.611814102089174194e-02 1.647302039400803109e-01 1.786707469082117750e-01 1.675913997405204248e-01 1.260324237866355945e-01 9.056151161046405162e-02 8.658084834260039442e-02 7.033368549701468631e-02 3.754822824547972282e-02 4.705955828816393294e-01
6.312099746584885762e-03 8.616742039592294872e-03 6.771957903342165283e-03 6.742598059881124185e-03 9.392198957612812871e-03 3.523723814546025120e-03 1.441338749903508382e-02 1.051710986219698933e-02 3.183680773023829340e-03 2.798631492459812721e-03 3.373907913354723398e-01 2.965526169097624787e-01 1.568827155516573091e-01 6.641972328284349858e-02 1.303184599806632149e-01 3.559931470499135275e-01 3.158347389361632063e-03 6.460509538413309293e-03 6.407623413249940655e-03 2.930618604299925489e-02 8.109979757312968385e-02 1.189219513061613998e-01 4.895181767985608279e-02 7.461519832128012120e-02 9.769284957693580296e-02 5.592998524456942872e-02 5.607802305955627425e-02 5.838937461137951729e-02 2.658331006670536234e-01 2.890948190825561870e-01
5.331371050872300843e-03 1.339450946450906205e-02 5.362035246919455433e-01 4.493919767107884544e-01 4.077473251747422145e-01 5.916240541317113744e-01 4.732376696301103525e-03 2.138563135575703711e-01 3.004818156159300702e-01 5.221691907436679797e-02 7.738399069502401029e-02 1.244687966166344584e-01 1.138184415608031741e-01 3.234422929930967916e-01 5.401984444811453595e-03 1.738194907215088666e-02 3.017575677102049547e-02 3.913856299073696643e-02 2.740900043921621482e-02 2.105417659843531950e-02 1.512240571797407451e-02 5.481279238089388842e-03 2.152232555497100592e-03 4.790606831710151475e-03 1.786035434154942952e-02 1.095320124133890641e-02 1.658936001659926801e-02 3.900993463623375623e-01 5.047595361872025260e-02 4.707485399151814520e-02
1.227705167784917499e-02 2.465910027756420403e-02 6.331002715332819664e-01 3.456163458116814358e-01 5.324598301261390665e-01 4.152794812720882467e-01 6.749855458878318837e-01 7.712097685421714921e-02 7.247031280748447712e-02 3.142824753590854614e-02 7.803996276273504618e-02 1.442626910473267798e-01 1.518546721659604359e-01 6.560619851324139828e-01 8.140755119675234519e-03 8.563010990034248399e-03 3.190849286051393452e-02 6.079422616653928912e-02 7.034838749378594103e-02 6.226742049105962740e-02 1.797974954799545777e-02 6.859637324853308342e-03 8.348338742126803005e-03 1.630799921689288917e-02 2.217809054485241071e-02 1.171969008617907738e-02 4.845667368064703329e-01 1.982321002768088203e-01 7.416532118427335285e-02 7.107455062113963995e-02
1.614917823482580825e-02 6.165659333148855274e-03 3.705398441745949012e-01 1.414521405383464547e-01 1.548982847452244904e-01 3.573265779820706811e-01 5.123576309615127666e-01 6.358019029101963371e-02 3.607817303049398044e-02 4.101697408531143618e-02 7.434233605368628650e-02 1.264949641715804318e-01 1.153176416941110172e-01 5.329309602479143093e-01 1.638236245058377963e-02 2.240691617195788785e-02 2.650258986571799036e-02 6.209189799443730340e-02 7.948104212905135468e-02 6.874499732674499430e-02 4.703479840866973266e-02 5.922420560863235206e-01 4.002890368985244640e-01 8.835389034176473200e-03 2.696989111962692920e-02 2.065416892781076277e-02 3.102525194261542690e-02 3.714758318799329384e-01 6.506219980066242636e-02 5.870962767234938484e-02
1.413548987085560225e-02 8.308633484802055436e-03 8.157984502970123675e-01 7.253495354410823825e-01 6.279303210709531388e-03 5.137967741965187435e-03 5.043312582711081404e-01 2.357375997888270791e-01 3.691040445209634591e-01 4.683952954520379519e-01 4.361048342949394585e-02 5.211703021793045315e-02 6.823606820867621214e-02 1.318165345494369534e-01 6.584480444361875406e-01 1.916516426747949531e-02 8.698938079877772608e-03 4.066019744133225061e-02 4.704077563956574060e-02 3.622951737399865424e-02 4.628757439046388145e-02 1.418616166992466010e-02 1.284978736967547497e-01 2.072537504136658104e-01 2.486193827309883184e-02 1.718661415798673764e-02 5.873124060247225664e-02 7.663635199823060073e-02 8.266691770519322968e-02 7.215363239360637893e-02
5.249661997840063266e-03 8.487269389609437553e-01 7.375807696766108201e-03 1.122899544257352326e-02 3.736666909337028018e-03 3.788802745115635306e-01 2.020441013678530573e-01 1.635722488319485413e-01 5.523164754315448288e-01 1.025716536190051861e-02 1.431742989175295577e-01 5.266018930076585280e-02 7.786952296525447015e-02 1.437643930965163963e-01 5.967621340045602407e-01 1.682190466337922519e-02 6.202174170653429464e-01 2.882101973094871039e-01 4.167989070373103733e-01 6.988022509141090799e-01 1.821751586616641300e-02 2.824122502306175564e-01 1.446122105958834447e-01 6.685963523962947797e-01 1.241866455481858145e-01 4.692436115604551317e-01 6.710007479387955498e-02 1.200554037010688746e-01 6.975543081266868395e-01 1.188362692525412323e-01
5.621225852775171318e-03 8.338778925240892398e-03 1.015685859113827805e+00 6.762011735736854767e-01 5.542720259362476920e-01 2.237948373183690221e-01 1.664001984357374453e-01 1.923864832521993140e-01 2.312133628637726424e-01 9.104210364181967163e-01 2.651136900120467654e-01 2.634262083404305121e-01 2.116497149698266522e-01 2.152265998387994650e-01 5.428724080994219436e-01 3.687085826821929757e-01 2.593198458701491127e-01 1.618345231230719772e-01 1.405178627328623753e-01 1.050150092660219747e-01 8.386876282741868860e-02 1.220198122017430165e-01 1.856970989955864515e-01 4.319454880874465386e-01 7.356080438185632620e-01 3.305650656987161873e-01 5.073499930257312496e-01 3.532180148873548253e-01 3.653011645158129039e-01 2.408760802822130787e-01
4.330919934699007344e-03 5.680173139003839855e-03 1.028286887248504478e+00 6.306031254024000755e-03 3.026895660090128757e-03 5.519434631647425205e-01 4.241254498096952430e-03 4.323904232068920446e-03 3.188179322228608115e-01 2.295958418699068915e-01 8.542610259472918632e-02 1.964700127419349573e-01 4.929789568478154527e-01 4.525020190279604448e-01 2.825713994947082891e-02 2.101934427413907139e-02 2.939832577064214747e-01 3.497843519884655805e-01 1.587654124413975798e-01 7.027156749220815624e-02 6.818880998875054278e-02 1.062700410344534219e-01 1.610135411263700633e-01 4.897117654045823887e-01 4.922559600474031294e-01 1.161166942171042993e-01 1.289526768070266838e-01 1.665135722626120973e-01 5.434117148215388271e-01 1.111014542153888063e-01
5.844570248273664101e-03 8.032070189249625181e-03 2.414647388430702334e-03 7.207027150833558715e-03 4.503244612241379119e-03 8.593390625654399179e-03 8.948790908888724568e-03 7.352780798567428722e-01 3.128586961553998513e-01 1.810384700868896135e-01 5.469509259449212984e-02 6.952501944500688591e-02 7.453948363225425255e-02 2.560690215897146738e-01 2.942499774700779169e-01 1.246813935492078196e-01 1.033079836641873500e-01 1.118821905798940142e-01 1.512445471271792463e-01 8.763626158108443753e-02 6.227002531674662861e-02 9.273695392322199582e-02 1.055146268926488440e-01 1.752962533969024128e-01 5.433578548473504410e-01 8.535257106856840303e-02 1.238390121328881294e-01 2.033769566834369713e-01 2.460152391111202486e-01 4.880769023489147651e-01
3.179044341364274748e-03 7.850544274727642644e-03 2.085745012015104149e-03 1.844041488807935791e-03 7.429075668492426607e-03 7.722429806759719198e-03 7.995286829823028754e-03 4.428643028057452913e-01 3.551258729202693143e-01 3.400874988638898921e-01 1.431418695619725845e-01 7.386485400879012897e-02 4.554291212662071875e-02 7.364560119783135350e-02 3.457153794219676723e-01 9.296886216592228913e-02 2.493174556656973517e-01 1.836582121356635650e-02 3.682845909314449301e-02 3.365517841705502056e-01 8.695847979062223954e-02 1.216938522513210941e-01 1.059405062393290187e-01 1.160345990266442584e-01 1.532822791233484638e-01 1.172159319382309467e-01 1.380305166395883743e-01 1.704237293688080079e-01 2.302488991301280541e-01 5.651862479503337866e-01
