8.703042574917593810e-03 1.291880913948603021e-02 1.130430687116009900e-02 1.433122997059201043e-02 1.092691668658168913e-02 2.402146977635299940e-02 2.387855415418912650e-02 6.476652458910513166e-02 1.177178307629138387e-01 5.262754926936760030e-02 2.420852414622733789e-02 5.488757364796349736e-03 3.214432623275468269e-03 1.204311015407645048e-02 1.405181210112284307e-02 3.088732987649668062e-03 1.074761919507865454e-02 1.853287285646531418e-02 1.650542627759651881e-02 5.725976498057150019e-03 5.132931076852947916e-03 6.295788640363014776e-02 4.947394904813211258e-02 2.160586225164021906e-03 3.715131700750189201e-03 2.905098333090745579e-03 1.361010528215236479e-03 1.261940029547011823e-02 1.228507782892746675e-02 1.547048590105974154e-02
7.010070449567785966e-03 1.574242555386250533e-02 2.831871015634804256e-02 2.319638725904312956e-02 1.618184024194461307e-02 7.249157876779405152e-02 3.445894123860220037e-02 4.359914264697377362e-02 2.848826399566260770e-02 2.394443751082916960e-02 1.661028981224110801e-02 3.199964919900313929e-03 4.231951171357974974e-03 9.722694856249776418e-03 1.365329908088347768e-02 8.783311452864591556e-03 1.071530220193935533e-02 3.445538360238034614e-02 2.551563060200850303e-02 7.547682465006263532e-03 3.036683041300792738e-03 5.972403721167602458e-02 1.762758233815328764e-03 1.304262277795140016e-03 9.402718634066027344e-04 1.234944378997500890e-03 4.794062203023822383e-02 1.275223536368646007e-02 1.854940495233122974e-02 1.856863250102238835e-02
8.676852975297169590e-02 8.948102587862014068e-02 1.891788632617134036e-01 1.539678578182009649e-01 3.264908248699492366e-01 3.324942690209699292e-02 6.178761920549172108e-03 6.643444541594862793e-03 1.069813178895687444e-01 3.193581119395055845e-02 8.338976014876567366e-02 5.424885759996257023e-02 1.980544833653671150e-02 2.915936213801689769e-02 5.623964010874192565e-03 2.375863322561446583e-02 1.571672034770968396e-02 3.152967450507650204e-02 1.027407997791520144e-01 1.677481489538576800e-02 1.716736335099945145e-03 4.875464440133527033e-02 7.795938492263269903e-02 2.753939297228147343e-02 1.645107828239403269e-02 1.101027105826151223e-02 9.990352390017769035e-03 8.019615453212234138e-03 1.370612476276899562e-02 1.538330216591795273e-02
4.036288623833340222e-02 1.171136498461920333e-01 2.571011225521926402e-01 2.077658768114919174e-01 8.466683633353892791e-02 1.306602157268209330e-02 1.031561256971733932e-02 6.952173161904847895e-03 4.268791506140963421e-03 3.945594265933587835e-02 2.485060710563227748e-02 4.833516773409430450e-02 2.172052127099440705e-02 1.449721087781056031e-02 4.282738720975930342e-03 3.263937681061958307e-03 6.730827229115131372e-03 1.237944398758432547e-02 8.611368740029691493e-03 7.229228793428459088e-03 3.322890719869019648e-03 1.243952293995798184e-03 3.501029510831340369e-02 7.024535963533458383e-02 1.355148481439672620e-02 1.004540619632321788e-02 8.659760611475083095e-03 8.229347377632893409e-03 1.673190647498702319e-02 1.819968604577740581e-02
2.322153603210117684e-02 7.287987695485348416e-02 2.035426038691510175e-01 7.889110355182174517e-02 4.472142469797971143e-02 6.506629628044322163e-03 9.954654561326952214e-03 5.538017047089295250e-03 2.579153540099594216e-03 8.946254769790869255e-02 1.111499694101212299e-01 9.245685016284779789e-02 1.351563038575201089e-02 1.315488227052841533e-02 6.239226573649505128e-03 2.352473753647199226e-03 2.036304717696233932e-02 1.159152360747301054e-02 1.843181630649443764e-02 1.048168140280741727e-02 7.153885767359178388e-03 2.005276055341289991e-03 4.902121863431728628e-03 1.485278853125951860e-03 2.454852993576517317e-02 1.343013885156641579e-02 9.342375744608806890e-03 1.082348771600583244e-02 1.695859354791532173e-02 6.246227496499866250e-02
2.306373173977550525e-02 2.438178399316861047e-02 1.093485995289529555e-01 8.761660586900178738e-02 3.453760779229798905e-02 3.704304217274899738e-03 4.516513316210871501e-03 4.837087249419767289e-03 4.560081126933919655e-03 1.377042229532745854e-01 1.073742146563202854e-01 5.533028182921105598e-02 7.685751794174669818e-03 3.092581133969404643e-03 5.914828475205306801e-02 3.486094300940874562e-03 1.283914233623048226e-02 3.009466156979778706e-03 9.714680102042336229e-03 3.340587583818048489e-02 4.011213550341975742e-02 2.479996795899041401e-02 7.215276328219075684e-03 6.656869736636825130e-02 3.677408005007303665e-02 3.512991565890914020e-02 2.188664472020471555e-02 1.511285442957172216e-02 1.994989941274939380e-02 3.594980220996940590e-02
3.180343886605024178e-03 5.081258149245250662e-03 5.377860155762930264e-03 2.728828049999363139e-02 1.307610139300301524e-02 2.173512148075686101e-02 3.300777361809392740e-02 1.883711288001196915e-02 2.247915626206190357e-02 2.615092074129040170e-02 2.004602667784994088e-02 8.126880162502177901e-03 4.282984379316044816e-03 5.086503377996078046e-02 3.007885156969845181e-02 5.235584447911911798e-02 7.324306462548679092e-03 3.161289254028414909e-03 1.619194992789427592e-02 2.216691693776564123e-02 1.006212026528036790e-02 2.870559338693034080e-03 6.538933080881917381e-02 6.296875140885102584e-02 2.545322337561716983e-02 2.606558431614244137e-02 2.279248666558676695e-02 1.969966859287120703e-02 2.201400840244115142e-02 5.253132564501850066e-02
6.752737838894241375e-03 1.240452651514387800e-02 7.273608735433858760e-03 1.571741110317519466e-02 2.423259634518599992e-02 2.742092974382025206e-02 2.442659767252013808e-02 2.314365832132919687e-02 1.852650141226143410e-02 1.035589328756342589e-02 4.145294972819694480e-03 1.272010092087224806e-02 3.535045160286741893e-03 3.357712661279752681e-02 3.853114047980697732e-02 2.349746426182305371e-03 1.470037325833786247e-02 2.167014688812775661e-02 1.911337177325560938e-02 1.446350170680163298e-02 4.869155795533436012e-03 3.545969007615254291e-03 4.690810325728690666e-02 4.053813934517892792e-02 1.934962189827104176e-02 1.942068117224918233e-02 2.877037760379250880e-02 3.340958321560984212e-02 3.245375643749716377e-02 1.553553327254147444e-03
1.776281840422733529e-02 1.170655906864468548e-02 6.850390558592239776e-03 3.981389973542750343e-02 2.583674896307353377e-02 1.100883097593412241e-02 3.562664539267839520e-02 1.610100031215087532e-02 1.367667811941736082e-02 1.346545430566486318e-02 1.195975488389563676e-02 1.542924275670603911e-02 3.519712621176795259e-02 2.512274102116475796e-02 3.753049011795834330e-03 3.260910145733919834e-03 1.307030110236630065e-02 4.005195365187524253e-02 3.956869964329449985e-02 7.755013973367817608e-03 5.212686613669950675e-02 5.433909225826957096e-02 5.964643854488091423e-02 3.957056360644348181e-02 2.313381484508453961e-02 3.174948608926368016e-02 1.644610805099009287e-03 2.866428629351358212e-03 8.441829266084648759e-03 4.260463700826784550e-03
2.977190449056291849e-02 1.952531156013282559e-02 3.081387712523818087e-02 2.882286346546483746e-02 2.510354246425875249e-02 4.978329285379233353e-03 2.310625677287736837e-02 1.055713716107891872e-02 4.520861956433889703e-03 5.434370219925553636e-02 2.300518009293752580e-02 2.207360218289942597e-02 4.670328598255445857e-02 5.067822538430358237e-02 2.416189553690245573e-02 2.667563166026176019e-02 1.438041179833342842e-01 1.493657067851031917e-01 5.969253237337776574e-02 3.375758128638587513e-02 6.762469389491741756e-02 4.280603354683638895e-02 4.859668539970634499e-02 5.269633116244688137e-02 2.915111517281214482e-02 3.484455043741799263e-02 5.903852683466532733e-03 8.491395822834745324e-03 1.079165163179438523e-02 2.798882572658266659e-03
2.487732362830716998e-02 1.314890702072907258e-02 2.902311875478657752e-02 2.470564699400996586e-02 3.097622325929977674e-02 3.562815519261644526e-03 3.631976532397971497e-03 3.515091959622112378e-03 5.395534429398630288e-02 1.343389859024376673e-02 1.834524779277479090e-01 3.025759336519446840e-01 6.262712844845060856e-01 3.096416015766590424e-01 5.719414340755493709e-02 1.129572803624101784e-01 2.107544565937012337e-01 5.813106638248968089e-02 1.376035974116746052e-02 3.657817957644373362e-03 4.595982894053707996e-02 4.116937443341904534e-02 5.133500025001123956e-02 6.924253277735591128e-02 7.258091351508411115e-02 3.923937001617466142e-02 6.150441115205291381e-02 4.689408330552390786e-02 4.298732807438405273e-02 3.172863318101137864e-02
5.707847839151514169e-03 3.319421903940130564e-03 2.381363968749185267e-02 2.341622623312614171e-02 1.802510739895432645e-02 5.194635219390369985e-03 6.467002321962299349e-02 4.584500231466104303e-02 5.591460624447901206e-02 2.604280172184787051e-02 5.501427572443377129e-02 3.635787855692391712e-01 6.534356135521719455e-01 3.372609494679523201e-01 1.209225513905705651e-01 1.360176269480602163e-01 1.501470181916751967e-01 8.829415153547098827e-02 2.160140804638198062e-02 7.577069392236148587e-03 4.356717700411295857e-02 4.444905633245893606e-02 5.041040860946679331e-02 4.863177016556340278e-03 3.515193362334949594e-03 5.983974130425824545e-02 4.829534328701161339e-02 4.457789039970289774e-02 4.880889823134099831e-02 5.321951348275585914e-02
3.355440640564751054e-02 3.803081242132052946e-03 5.533549572435188246e-03 1.697136595968710276e-02 1.103016796711330655e-02 4.371225516594010908e-03 2.664279512464732408e-03 5.882198975497184013e-02 2.436992298707447470e-03 1.258875326116394404e-02 3.883474430405237533e-03 1.159462193481489850e-01 4.889344858280870176e-01 2.075104167399157984e-01 6.453710084848343631e-02 7.393144384589704632e-02 2.726240447145740833e-02 3.996044993812268575e-02 4.542019464611599111e-02 1.892620652042052362e-02 4.110850986661675893e-02 4.483099603543713729e-02 5.414331189108298470e-02 3.169134003476449697e-03 3.300850463703125081e-03 3.583993675608779152e-03 3.240932695464362502e-03 7.487918782681202146e-02 6.317640379631124514e-02 5.257578638229867124e-02
2.948426357621565519e-02 5.505554388775073943e-03 4.739084118423692038e-03 2.937581987354092455e-03 5.030673848732948594e-02 7.050584015127274798e-03 2.366810697633579125e-02 1.891040705079563913e-02 2.494793655594714291e-03 3.441302747943795343e-02 2.860196018455200655e-03 1.895502634192724328e-02 2.242798924188196263e-01 2.982543216273533804e-01 3.126256164094034506e-01 4.150595438874464804e-01 3.732427112294390836e-01 2.427377760662809969e-01 6.643620098955903552e-01 3.120232953537236398e-01 2.789279507054015159e-02 9.263564590673858956e-03 6.832437715244317998e-03 1.569722567569542884e-02 3.237002417476343707e-02 3.047502756396584106e-02 8.808087968777052190e-02 3.259913723606629871e-02 4.542551447570933147e-03 4.594056112676629319e-03
2.824342863633763287e-02 2.682174924139795955e-02 4.135200119963985260e-03 2.310971007244425057e-02 7.195397796414509939e-03 4.211118664726480609e-02 1.481213206652477743e-02 3.916584902380354505e-02 2.706394573407424828e-02 2.792591096084387926e-03 5.984662135847777439e-03 9.321710023870403983e-02 1.988592901787812339e-01 2.495779152190716332e-01 2.227510328698975861e-01 2.658403001395127085e-01 4.534529163962248699e-01 7.850086509599758511e-01 8.004703431629344168e-01 6.297242551827663126e-01 2.693788150484193247e-02 2.817095440805961887e-02 2.520643198812947544e-02 7.951797173263427942e-02 1.152016190866388401e-01 5.931422153260859087e-01 5.944043875536102473e-01 1.181754367349172746e-01 4.624032744226787110e-03 6.687394845882876915e-02
2.692146525647243910e-02 2.816674632244813362e-02 5.512367397620396292e-02 5.700209341139285402e-02 3.743576204970341936e-02 4.519267303455139217e-02 8.057483908544878920e-03 2.099648877286749288e-02 4.341016335180326868e-02 1.550652483492709344e-02 1.607307118678177882e-02 1.420916010401465125e-02 1.112123436858710179e-01 2.243341577577684376e-01 2.082238033100113905e-01 3.174037866311719136e-01 5.494142542999691514e-01 6.680338502014512292e-01 3.862030054962690140e-01 8.431736555709096193e-02 5.098289248561173326e-02 3.527581994632190687e-01 5.184780919838722912e-01 8.743100050546381841e-01 8.271956011910248652e-01 1.086709369628130251e+00 8.737288231343933731e-01 2.470800027474461535e-01 7.358194460624871772e-03 7.767366336813112671e-02
3.494403131727755879e-02 3.939967799399528986e-02 3.706356641944464486e-02 3.374514170234634014e-02 4.944310939967253016e-02 2.532896638339599688e-03 1.236519698961613123e-01 4.071014792847993391e-01 1.984943772558573349e-01 3.389292636655677482e-02 2.512450599113259797e-02 3.936849146831545437e-02 7.830107885934113610e-02 1.158965803164155872e-01 1.536649566743971684e-01 2.766017576655152577e-01 5.957025825376524031e-01 5.987662777985459650e-01 2.830762085569194508e-01 9.736124786825753330e-02 4.241948024777887905e-01 7.774787971960397392e-01 1.007508401569457757e+00 1.039635044261586261e+00 9.207737810751654983e-01 8.019536108599535362e-01 1.194861963812955175e+00 2.064666031117768363e-01 8.786622276134080020e-03 3.927150805742323468e-03
8.771718484179920339e-02 6.793865128053978852e-02 3.279340311868748914e-02 4.633128261188661223e-02 1.448613018709949025e-02 6.152587793059666188e-02 3.312249128568884871e-01 2.712373503914152773e-01 2.663653255467356429e-01 1.325386316869017755e-01 4.826969623989518787e-02 1.299748551303637513e-02 1.278391208084550014e-02 3.316957919401533617e-02 7.567822667598554653e-02 3.520512042436831912e-01 3.688348721594344459e-01 4.278117823015522014e-01 7.426423279848104464e-02 1.313220404541255992e-01 4.712225043847665940e-01 1.030763943327370313e+00 1.284318251778350906e+00 1.336951880968430428e+00 1.108727010086574927e+00 1.081429172770385305e+00 1.017779833759431041e+00 7.988794884597993917e-01 3.519940974292985053e-02 2.296622200827918084e-02
3.522875257877542549e-02 5.777778389004571517e-03 5.813766141719772795e-03 2.396158998019719613e-02 4.899911997832982063e-02 6.714588280788665042e-02 2.117299840026202196e-01 2.644517927824217018e-01 1.808451085248235224e-01 1.400567110440393837e-01 2.926869101730005668e-02 2.868512368537100288e-03 4.398770146313651930e-03 1.261418493816771069e-02 2.791466874838439971e-02 1.671871036406760713e-01 6.342919666014945612e-02 2.010606685401046534e-02 6.704611795213902617e-03 4.865250471988821074e-02 1.867015629207992300e-01 1.001767314103307882e+00 1.276337630888433550e+00 1.340394334944105426e+00 9.832712665878792224e-01 4.603138918628905119e-01 7.538539313550638443e-01 5.121485358654168651e-01 4.593966587801984192e-02 1.787699067457770852e-02
1.661743308087923129e-02 2.113564647494744347e-02 1.312061378912296288e-02 1.619094900222107364e-02 3.775987427108545152e-02 2.160189459911831741e-02 1.107277726720116151e-01 1.424834237684662330e-01 1.305524015936233018e-01 3.071274502893221736e-02 7.708810665614788948e-03 1.634092227867547063e-03 3.031421224936915303e-03 9.096157215962193121e-03 3.668130939451971773e-02 2.438807260521286269e-02 4.418073112557758392e-02 1.293585065447922997e-02 2.411383400951775183e-02 1.141821701111266629e-01 6.181945933271051352e-01 1.173520284584147255e+00 1.262722227402528929e+00 1.203705956467679083e+00 9.302396869461202478e-01 6.868043030907069468e-01 6.700222644813798034e-01 4.474724696622007225e-01 4.009247539145530809e-02 1.410373625834576185e-02
4.442935051131448321e-02 4.024148325387985614e-02 2.046365589306742283e-02 1.456769089733613368e-02 1.868307960953741534e-02 9.935239404806220018e-03 5.607508238022132496e-02 4.971985214928994340e-02 1.383174796409258715e-02 7.897841056848989988e-03 2.768577865355905786e-03 2.172500294345504086e-03 1.328448987738907894e-03 4.713671741446920360e-02 2.074677472952737769e-03 7.067636671477195431e-03 2.509246319123289645e-02 5.663777034655760600e-02 5.398322550825133959e-02 2.397460661533875881e-01 6.542502812715300653e-01 9.447117206619022323e-01 3.830349917057467857e-01 5.774691134139136039e-01 7.513724462169076856e-01 4.286283823323334130e-01 3.213560152185082064e-01 2.686922370668181625e-01 1.245746895311769173e-02 1.175907341367361802e-02
3.608317385061984850e-02 4.106109338477617610e-02 5.980695019497120346e-03 4.094065777899882561e-03 3.324327017176202485e-03 4.907373235047515769e-03 7.110939865718611530e-03 1.829563103457020924e-03 2.485419334778358243e-03 3.334570503547708981e-02 4.604548102944982374e-02 8.491001285380478120e-04 8.941655541941475379e-04 3.359633562714862444e-03 9.941379122817534109e-03 1.311657699078932204e-01 2.498120173931280830e-01 3.577386541280486720e-01 2.418272493488939912e-01 1.803450109676191238e-01 1.270274348374925977e-01 4.510274522090691740e-02 1.739371682270750286e-02 3.793120103246619412e-02 1.383437198447468042e-01 4.701111075603119083e-02 4.325737633232419610e-02 1.938867963256704630e-02 4.504029271956853236e-02 4.237910874453704180e-02
7.533348538742207223e-02 5.745720812820920981e-02 6.106759560871449777e-03 2.618005303162904140e-03 3.825607932750016513e-03 2.955796986653651259e-03 4.766865822484630220e-03 4.893212877913015457e-02 4.590435668670420077e-02 2.003438788945429913e-02 4.671298057551163951e-02 1.009753226884880844e-03 1.141716500392747505e-03 6.560520601853089308e-03 1.149965725217639428e-02 7.637064410500157829e-02 2.773893488075883651e-01 5.118174747825823268e-01 5.733853561745294591e-01 4.925948121762959708e-01 1.042351242523718025e-01 2.314867674928589025e-02 2.871665864846935368e-02 7.135794402236694811e-02 1.596372558233044581e-01 4.731510762887192190e-02 1.798649430464366317e-02 9.654992643979733516e-03 6.243141336388423335e-02 6.062155103685273883e-02
9.379517356604247236e-02 1.187885590425317300e-02 3.210943017044797388e-03 1.050160791699145547e-03 1.196377863441228442e-03 2.598090744252005025e-03 3.529251932301091538e-03 3.975589558574938592e-02 2.274359696156531482e-02 2.614515595441325307e-02 4.540171718715380750e-02 1.043412232961344948e-03 1.002021540517575434e-03 5.537783162585943088e-03 2.097008584548619783e-02 1.076344261521152978e-01 2.069753652571881264e-01 4.718015571426281696e-01 5.886534131628002875e-01 4.962078843106327852e-01 2.481442729806765113e-01 1.432221398555347074e-02 1.022775050243075225e-02 2.243519221989781140e-02 1.298209142289925566e-01 7.876187641082281476e-02 7.074507576241623186e-02 1.846047001874352028e-02 4.995217324336131970e-02 4.557911994712204179e-02
5.191421530540676899e-02 1.598775282974106149e-02 6.077759092886825254e-03 5.659407523952801264e-03 1.271237888736349853e-02 8.612966634829719720e-03 3.578305165872987595e-03 1.468705032622794927e-03 2.226118270513850923e-03 3.087166253798131511e-03 2.750664031078761673e-02 3.183992497984830528e-02 4.093422716655675114e-02 1.410045689560306169e-03 7.502321994738612825e-03 3.263788483471811996e-02 3.268448683997103588e-02 1.384719836497722567e-01 1.764378686886886594e-01 1.523497627631605067e-01 1.295896554690068037e-01 1.691267535595868121e-02 2.638400410708762085e-03 5.228522876600378427e-03 2.323303984282842211e-02 5.879357341303459439e-02 1.579452596890421612e-01 1.009310140137326395e-01 5.566487551872055517e-02 4.893473966664457775e-02
1.857221578306646886e-02 7.332926328373292127e-03 7.689520305397772211e-03 1.294393887075687838e-02 7.154746495111411961e-03 3.172056704443538579e-03 1.427252469000225539e-03 9.818458866141116254e-04 3.073807488565647155e-03 1.218330706267248091e-02 9.790332459038092808e-04 3.048796752966838330e-02 4.513067678758745510e-02 1.459129836794063710e-03 6.066913487130804611e-03 1.158695498181765496e-02 7.938290846978144494e-03 3.922661736493970874e-03 7.056315018252048814e-03 1.452337494932254974e-02 3.093327696845035724e-02 6.554908922471703106e-03 3.080422992835277294e-03 1.334089787821854563e-02 3.269978388841925099e-02 1.175795211491264917e-02 4.075928394161882490e-02 4.841528505739319671e-02 2.662455027168701693e-02 6.947966385346007745e-02
1.882512572484657323e-02 1.502770375023754212e-02 7.195949387241702341e-03 5.254759772440401044e-03 4.941613992551587009e-03 1.833627130093014269e-03 1.189014645304767694e-03 1.195310366029165303e-03 1.305851680736702701e-03 5.479959072539935389e-03 1.664735332918143877e-03 1.824594383962046748e-03 1.673285747717126980e-03 2.113372870532871997e-03 5.963486009999139151e-03 4.474314913976778878e-03 3.122914761522904703e-03 1.929291661567576841e-03 2.721616506354098027e-03 6.559605947419369643e-02 5.349778876170870057e-02 7.252047479811200847e-02 5.430853230344616887e-03 7.573887584740822236e-03 1.557642322222223957e-02 7.626980885160795573e-03 1.234359121145698485e-02 7.311480582848791342e-03 1.084804567991096147e-02 7.097154238845071808e-03
2.557417558828518900e-02 1.325603743270571504e-02 7.398531635270880896e-03 1.005897217354615250e-02 8.945504393350492758e-03 4.809293492378024712e-03 1.612328076339220734e-02 1.197998756744024160e-02 1.749295209817029739e-03 1.404215509177250167e-03 4.944738017924935752e-02 1.419124724896669290e-03 3.984478067186486908e-03 4.397360791047529027e-03 1.344043252189527221e-02 1.087785368701966321e-02 3.562509659718436292e-03 4.384130060326576171e-03 3.182109775442496045e-03 4.358565422566351710e-02 4.300619765657785754e-02 6.352960576256298786e-02 7.650404176215075056e-03 1.128363328665462142e-02 1.117389505173286939e-02 5.837023638386511226e-02 4.594625012641431056e-03 4.704646912709010628e-03 1.206333161938041854e-02 5.127190574586258653e-02
3.436555334280901736e-02 2.957863282113650655e-02 8.820503892713216221e-03 3.002220317750402268e-02 3.534396260793293970e-02 6.617255059908794257e-02 4.368606208009391534e-02 4.872516104719871143e-03 1.736096878278097725e-03 1.112356770486996795e-03 3.314705687614644125e-02 3.892910180555698985e-02 4.166051190236652602e-02 3.191861174043146045e-03 4.374942200727655571e-03 1.838541797527063013e-03 1.811539322692843398e-03 1.937118786863908926e-03 3.496368171170647667e-03 4.211171723771643845e-03 3.866202474889819662e-02 5.610306945452378513e-02 5.884240979544355654e-02 7.629645719524003750e-03 2.027872245923986738e-02 4.374829995655089843e-02 6.417164225876703654e-02 8.804440007677480362e-03 5.375083401382345014e-03 1.076298517148416289e-02
1.860683775854436381e-02 4.608959762683897954e-02 1.363656465962374484e-02 1.462146413823079902e-02 7.173129551228607514e-02 7.592399952257956885e-02 5.033702969390869975e-02 3.441659811407611798e-03 2.422185273284133047e-03 2.423694422790653290e-03 1.408028657769859601e-03 5.210111431211700284e-02 2.986633342288251211e-02 4.361712632542377732e-02 4.964170033560521937e-03 5.374100666551297201e-02 4.760838261540873036e-03 2.573745745846513916e-02 4.783109816988868196e-02 1.347581124885460953e-02 5.466104168817932651e-02 7.583443906404133128e-02 6.309165806501670914e-02 6.146020303803918089e-02 5.907960520984826755e-03 6.276632604734967702e-02 7.379011693180970166e-02 8.010911141817454381e-03 4.597002743090217169e-03 1.125813667819821479e-02
