2.949032791345409521e-01 7.861741740358392863e-04 3.777625016688389570e-01 8.619761920131059109e-04 3.579800118148765975e-01 1.411083922343385521e-03 1.380508015104037287e-03 3.687905259259995419e-03 6.638248455191764728e-03 2.973074594043947742e-03 1.379541751243406646e-03 1.838247414090644627e-01 1.085668934796214236e-01 6.521849687336866812e-04 7.383970055016815873e-04 1.098740159665857197e-01 5.480122323451041590e-04 9.459795836713436826e-04 8.469782309479508345e-04 2.937543645413426079e-04 2.061098397388439751e-01 2.967534655992580192e-02 2.286266958145702355e-02 9.023039106016356170e-02 1.731606624577165521e-01 1.347293023758063257e-01 6.191898371029311288e-02 5.429225371530786368e-03 5.113333468081715169e-03 6.341170630502686659e-03
2.254932274635651768e-01 9.187427500838203122e-04 1.655039803748604640e-03 1.341864145630725915e-03 9.316361782635395727e-04 4.143249765966598198e-03 1.949258347760816175e-03 2.392075834812122659e-03 1.536822478012779504e-03 1.310598689060638901e-03 9.381717345827822029e-04 1.100539282642760963e-01 1.484644063042299678e-01 5.307978061394806428e-04 7.148041155224029320e-04 4.448270946359810874e-04 5.371433908601007043e-04 1.715161663165096174e-03 1.266959619059578133e-03 3.722223677316430571e-04 1.235868371714896885e-01 2.751378981758519082e-02 5.731916317454548160e-02 5.036209229573176266e-02 4.395255375078643834e-02 5.843787189142603256e-02 2.065938789433875711e-02 5.330753829965919482e-03 7.562854453920016956e-03 7.546082093083771557e-03
5.231372416832560414e-03 5.048277417232658465e-03 1.068973573499414770e-02 8.623475787535835393e-03 1.844272077145005934e-02 1.867893022409787378e-03 1.890862026576707877e-01 2.001394003496136387e-01 5.715798933553482147e-03 1.761639917496428398e-03 4.793803179108088730e-03 3.190190038404472610e-03 1.153564333085588993e-03 1.633031982077077279e-03 2.079051503566549663e-01 1.209183621419389646e-03 7.843460514704004259e-04 1.555584187670619109e-03 5.012073789308277294e-03 8.045790899661101189e-04 7.693199044483528537e-02 2.214538440602836777e-02 3.354535841228945686e-02 1.167671713312026099e-02 6.944445056139450338e-03 4.602544736986313202e-03 4.103955860118807183e-03 3.248283519004998079e-03 5.513412567928999489e-03 6.234116474901652341e-03
2.415730741877788849e-03 6.564364226347037951e-03 1.442732411239036616e-02 1.156150764629739619e-02 4.794253754198549156e-03 7.368385178925936866e-04 3.208431294911581189e-01 2.133955212916116007e-01 1.285012381285085270e-01 2.168458175691628624e-03 1.415075947324595951e-03 2.849713104083685927e-03 1.274824843528660689e-03 8.198466472347272363e-04 1.542614067565470093e-01 1.182649938806912271e-01 2.535802719438696728e-01 6.045195595190725434e-04 4.162871468568422732e-04 3.430509905734906552e-04 1.475646397118035025e-01 5.040659387545663728e-02 1.568909408400824546e-02 3.018842108784551212e-02 5.620868642018756953e-03 4.141706662454597461e-03 3.548925275239994508e-03 3.358318018966593814e-03 6.697095645364714925e-03 7.373054799863927242e-03
1.392963238890364188e-03 4.117650224586969290e-03 1.146490531355545510e-02 4.440207008584572124e-03 2.565324493399152167e-03 2.061625608934264109e-01 3.128669685394807054e-01 1.725691232974433664e-01 7.844540198400487552e-02 4.969544536053733738e-03 6.338897442479281101e-03 5.541549065754234303e-03 8.115411649503481272e-04 6.414692094301097363e-04 1.825944406318815438e-01 6.791599879457756173e-02 1.018644972443613454e-03 5.676449148063402329e-04 8.912194770712559330e-04 4.938670232644323116e-04 3.252772761423166508e-04 8.355619526139781983e-02 1.849984244659723664e-01 5.057930742042753003e-02 1.012752598007119961e-02 5.531351061182630466e-03 3.844365302209694531e-03 4.456090793001693182e-03 6.857298706406800629e-03 2.561996085320844552e-02
1.385369857396002297e-03 1.394731368182641892e-03 6.240915173163080754e-03 4.988020039559874601e-03 1.982701052304941102e-03 1.193049783113560858e-01 1.425654824655515074e-01 1.502088771750556828e-01 1.367357949854924593e-01 7.637043210257373621e-03 6.144431606090547220e-03 3.338618883805818255e-03 2.024481250114199549e-01 6.168433298355308070e-02 4.693140899363384272e-02 7.651309316782552161e-02 5.728576661903970850e-04 1.065115884025536475e-01 4.626355752396212680e-04 1.549065237151521371e-03 1.807988626825531974e-03 1.021419729740904178e-03 2.356162832218511860e-01 3.043432017034412157e-02 1.518710589350734733e-02 1.453624742966646080e-02 9.068890356506527015e-03 6.272732785245713552e-03 8.130142880589616775e-03 1.492048912494457584e-02
1.055820517391717339e-01 1.695407444132380204e-01 1.789185322344017948e-01 1.585624297546322971e-03 7.573680469186059531e-04 1.242329883931812644e-03 1.851781214225705578e-03 1.038815215781863522e-03 1.212588880716729484e-03 1.464106876717914587e-03 1.164574892415245469e-03 2.519504033163514345e-01 1.042887852896589584e-01 4.070734826991803668e-02 2.138366298775273150e-02 3.792360567217756273e-02 2.242970205851118060e-01 1.066969424350580342e-01 7.647722320629613381e-04 1.019883972369384087e-03 4.508520075680438064e-04 8.794337491589118705e-02 3.506805400225913860e-02 2.760313035578840918e-02 1.039190780895142205e-02 1.085953736548445417e-02 9.538467646339539308e-03 8.321914119888335071e-03 9.519732625746710891e-03 2.308680810790181628e-02
2.250474299234808129e-01 7.920661494466190496e-04 2.438361729168455061e-01 9.759505839885733794e-04 1.475536168836442171e-03 1.623863610330046614e-03 1.405630785923309232e-03 1.295755186002392305e-03 1.018527977826241826e-03 3.230705337447012937e-01 1.300501552587063625e-01 7.769004809713767317e-04 8.586099448178177718e-02 2.845933580357146164e-02 2.902223771937163105e-02 5.336682273680799782e-02 6.999757253517684824e-04 1.099715246938377106e-03 9.493872068689283416e-04 6.593454232774975622e-04 1.302046718877687970e-01 6.224716186407793644e-02 2.120151461034230217e-02 1.662961385709881001e-02 7.920363168738689397e-03 8.414156208826625155e-03 1.306805382126213950e-02 1.654909042252949644e-02 1.664608893159874245e-02 4.964083116821602082e-02
1.208134498209321919e-03 3.841487980981054262e-01 2.254108663382627942e-01 2.570741343559600559e-03 1.634106148161604266e-03 3.547991431311240396e-01 2.113037439132643344e-03 9.198414254510249057e-04 7.500776263584689246e-04 7.605623942675731252e-04 6.952428092984479138e-04 9.363828126778329410e-04 2.043819823667047866e-03 1.299649509042259893e-03 1.051627407255296826e-01 9.567884322421753296e-02 7.039308325820649954e-04 2.098458581532680178e-03 2.033917265079347898e-03 2.237449978775003512e-01 3.587554059128145179e-02 2.794169643375719880e-02 2.649250294989429627e-02 1.633525820722638022e-02 9.530086358164709809e-03 1.477273647775323093e-02 5.577032205200353754e-02 1.131933018320539774e-01 3.315337916808341282e-04 1.646212701742970075e-01
2.063064101119929140e-03 1.336771968728509355e-03 2.106800060053933867e-03 1.919212523125358571e-03 1.636211603839568887e-03 1.631259967374560360e-01 1.408063795168766966e-03 3.227273524511409253e-01 1.357663219717120395e-01 5.078051718479896504e-02 1.325357766448939569e-03 1.306316818746891539e-03 2.773629331878614546e-03 2.979535352959423143e-03 1.408787109733605335e-03 1.518040671305142565e-03 7.987267319765799928e-03 8.135552481270069691e-03 3.212732085690379099e-03 1.396756311716822359e-03 4.510926927367639450e-02 2.146119552865796004e-02 2.192100049782563093e-02 2.302697675785731618e-02 1.262741944798126750e-02 1.634142255826907461e-02 1.543169740134242018e-01 2.666185931459300051e-01 3.572976880988386686e-04 8.842674147954850128e-02
1.710121159159228759e-03 8.896398105547906159e-04 1.966371743294446570e-03 1.645681406362953887e-03 2.040558916366420721e-03 9.496952403363599637e-02 7.993480056145357837e-02 6.965903788162525201e-02 4.372113853212299811e-02 6.643985276589801665e-04 1.048370470673039637e-02 1.751337821977745277e-02 3.635586411156611214e-02 1.808289577665024572e-02 3.362148170197151210e-03 6.567421124381220103e-03 1.205403253585591791e-02 3.295688295396713777e-03 7.777372439201605701e-04 9.254154392083782654e-02 3.154983820298926794e-02 2.186242521747523010e-02 2.575489815828395368e-02 3.498379384439954248e-02 3.685274650886544157e-02 1.990815777081576116e-02 3.144171824600867915e-02 2.522915521485769030e-02 2.261811122810699487e-02 1.621693008242909226e-02
1.504426434599484830e-01 8.836651199290254666e-02 1.583834264808757931e-03 1.538770021832776540e-03 1.182538573074856788e-03 1.387916690056127944e-01 5.412075683523160513e-02 3.479648080193015192e-02 4.307662764511967918e-02 1.308583937157059302e-03 3.164521708516835480e-03 2.052819771291310158e-02 3.698173527847562619e-02 1.956997013254396789e-02 7.222264353272717444e-03 8.258179023717525380e-03 9.100713175174550071e-03 5.361513413120049497e-03 1.317402379748863718e-03 2.026116539914842862e-01 2.984828536716451625e-02 2.632466753524703024e-02 2.954451193734556474e-02 5.218616622418872919e-02 4.959634777680269058e-02 3.513740779099850525e-02 2.674571106549279015e-02 2.400406076069941386e-02 2.537679453998567536e-02 2.682506612594619949e-02
2.870368119432282344e-02 7.416126723637032903e-02 1.817009825489500630e-01 1.022592011939461041e-03 3.403364836367388513e-01 1.084485458920890488e-01 5.563812267152818541e-02 4.658701481843121467e-02 5.878150540694403181e-02 6.576795654723790888e-04 1.351039888583545900e-01 6.500459591831085973e-03 2.741289760903421746e-02 1.204927823223260995e-02 3.899812604870634379e-03 4.623060698229616503e-03 1.719365932259079438e-03 2.534853323092955708e-03 2.899691940746899031e-03 1.081719085410558483e-03 3.652616851021192601e-02 3.258842349765916219e-02 3.900922786164250089e-02 6.663222771725474392e-02 8.706097579932579877e-02 8.158002916703666063e-02 6.014334864773294986e-02 5.382658982470432674e-02 4.024677709907203971e-02 3.046280130263515767e-02
2.252083451634923419e-02 6.500960115372435288e-02 1.201934357002600040e-01 8.856077048959548614e-02 5.287246198277360809e-02 2.103220153739240872e-01 1.269629249706654426e-03 1.035839099504960899e-03 8.618064323147943406e-02 2.607009319064661906e-02 1.026756128551512409e-01 1.042980786580804389e-03 1.235864356372592954e-02 1.735293995119097793e-02 1.922256804379745068e-02 2.686704945409132406e-02 2.452068619164967170e-02 1.604361319681622475e-02 4.414093945322124235e-02 2.067580066766243341e-02 1.692442177666265545e-03 2.307341526123298792e-01 1.729032154272436284e-01 8.842800749505354534e-04 2.036570219298071589e-03 1.879749469856614339e-03 5.046580506315724753e-03 1.562335147127788450e-03 6.576032910319287716e-02 6.226995594726462968e-02
2.038069936048973393e-02 2.060441166455576414e-02 5.767773273112370563e-02 8.107684533194173910e-04 1.599673967579641753e-01 3.781191804309694954e-02 8.451592869451068392e-04 2.381073625770468907e-03 1.567322312468720068e-03 1.051346160523164430e-01 2.218120810812450605e-01 5.185284559951336240e-03 1.099259956596653452e-02 1.439420412530739365e-02 1.342942068946462869e-02 1.674577072807035757e-02 2.914767717482552589e-02 5.125701727464734847e-02 5.320733767329662023e-02 4.264027328918577192e-02 1.815557793305011287e-03 1.883222054832574179e-03 1.640657781193892786e-03 5.101383289236326862e-03 7.247878500445647729e-03 3.651767327334926733e-02 3.587882938014461121e-02 6.923184279728144055e-03 7.655447878922652660e-02 4.520245384295201729e-02
1.798798088689353147e-02 1.977330836950136339e-02 4.607642907328572679e-02 5.161009755085115697e-02 3.455152196357998834e-02 3.952933434681152325e-02 2.806435359209581426e-01 1.281528659384194042e-03 2.625792280430405516e-03 9.263424182616648069e-04 9.395699365010211704e-04 7.947671898084435280e-04 6.155441531983737655e-03 1.282447790509518883e-02 1.231072296894819909e-02 1.933916984237115527e-02 3.429826231995539848e-02 4.283820475712733777e-02 2.555589345418075170e-02 5.714278170692780809e-03 3.408504464472667493e-03 2.315983070380176617e-02 3.313592388543706857e-02 5.504219991230614728e-02 5.098582474496034245e-02 6.518635399059180546e-02 5.137335693473905895e-02 1.429955219691428012e-02 1.196444629930296655e-01 5.353687058807539423e-02
2.197120273665723045e-02 2.572157598192537781e-02 2.588698828741380076e-02 2.505904008965579438e-02 3.871758503396739021e-02 8.100362640984024032e-02 7.477977212062173612e-03 2.488630730379957912e-02 1.209514224426109022e-02 2.035954936889483070e-03 1.478829191865379134e-03 2.227145571644729635e-03 4.368080518212465006e-03 6.576530658284108349e-03 8.843227182660982205e-03 1.612218429981239834e-02 3.594244611297066350e-02 3.784036155580382255e-02 1.873963187588384427e-02 6.614947266235540052e-03 2.810491770198678477e-02 5.003404520558476370e-02 6.303772730616891140e-02 6.403773592678489723e-02 5.557678018344462678e-02 4.705637397715403680e-02 6.808591383910818362e-02 1.172105615704766707e-02 1.773134936547318963e-01 7.514106960577537908e-02
5.279542998473592957e-02 4.204360889058680884e-02 2.243156739937141736e-02 3.592931826805135370e-02 7.114745901337917941e-04 3.582747086607384734e-03 2.002704176487199797e-02 1.629507070663763907e-02 1.600040095529654122e-02 7.915557724553747010e-03 2.842409730723889118e-03 7.392488069307695661e-04 7.151871642168593441e-04 1.867059661713918808e-03 4.241979277189848220e-03 1.964885400862617301e-02 2.162529174647810290e-02 2.671658220883187107e-02 4.894168567492228512e-03 8.892222614136599187e-03 3.097578087267207486e-02 6.574842102917113906e-02 7.982810198229731147e-02 8.178956604116346951e-02 6.643177357460071375e-02 6.223838216349735636e-02 5.616347950541171474e-02 4.451528824428946374e-02 1.974263123465136958e-03 1.300411739406992463e-03
2.344067256640954694e-02 6.579773813855854803e-02 1.247389992484237153e-01 1.279337784750697767e-03 2.776101150905158597e-03 3.906954273175559239e-03 1.236125899920732102e-02 1.539283227659179326e-02 1.056433393691085486e-02 8.156759440408785367e-03 1.691333814129964124e-03 1.360202047702990247e-01 2.029169171526825632e-01 6.943582057406551527e-04 1.506656151912445177e-03 8.881705288356380595e-03 3.546268840370180118e-03 1.197704712293176004e-03 2.170072696534240675e-01 3.129275405089925952e-03 1.170175822390178214e-02 6.132752810101085861e-02 7.662508364780043491e-02 7.968839941606631339e-02 5.761408724933152203e-02 2.615099381556503649e-02 4.136956787785278644e-02 2.839452431641808702e-02 2.560308358645655563e-03 1.010637576548057987e-03
9.026576473722442047e-04 1.145774463923450665e-03 7.532656569677668957e-04 9.157258059338128963e-04 2.112795408906770200e-03 1.203947952967354034e-03 6.207806007610144894e-03 7.994567909102596320e-03 7.387247672911354673e-03 1.741438019178702130e-03 4.365497384810048602e-04 8.124025349060473578e-02 1.381054035872956998e-01 4.702867444075287183e-04 1.851089170547212627e-03 1.234371914990553976e-03 2.354919835165759055e-03 7.303541453509088338e-04 1.430017728227362533e-03 6.907422545596738662e-03 3.671121222419188729e-02 6.889445884449102442e-02 7.350641205039473713e-02 6.982792870517688655e-02 5.334667280816147300e-02 3.865266595553806112e-02 3.693423346888190240e-02 2.488514638502663245e-02 2.240468345483987572e-03 3.524057443137018630e-01
2.426608656814514906e-03 2.185275635803383444e-03 1.106304647992743025e-03 7.795778926487560668e-04 9.896399407341679218e-04 5.262390608081316022e-04 2.993601318507529627e-03 2.661101537779970213e-03 7.318867269576177521e-04 4.041268738689214384e-04 1.367880933241050478e-01 1.074353970140342479e-01 6.227100549513257810e-02 3.290692541604869903e-02 8.155253898683684222e-02 2.622946972604633942e-01 1.236024417552695175e-03 2.943042379663863596e-03 2.949335686249501213e-03 1.347432327244446094e-02 3.667313964739454812e-02 5.321521744000496518e-02 2.171913496615061889e-02 3.279458785346751892e-02 4.243971969506862146e-02 2.398253085072464541e-02 1.780666027203353652e-02 1.462507390869231989e-02 2.285732768507582890e-01 2.083326292863364182e-01
1.934772075115641973e-03 2.188146119718417659e-03 2.648562646565696954e-01 1.956962813657799616e-01 1.722854171885584429e-01 2.524539857060395542e-04 3.591374091610208610e-04 9.842204538209090026e-02 1.295786016022067721e-01 2.013722365988823704e-02 2.621728258584945029e-02 3.959253648384517682e-02 4.277190642134776760e-02 1.465984937707496827e-01 4.628334152351502515e-04 5.961653246262159020e-03 1.178420012181434148e-02 1.771360044230447378e-02 1.254436036895988441e-02 9.689286967965705932e-03 6.901214128351347912e-03 2.489828006103496534e-03 9.707716924507452279e-04 2.112950940088285587e-03 7.720356267159072042e-03 2.628716306060990913e-03 2.435200721104570365e-03 3.422296670333822566e-01 3.921301256145205694e-02 3.206900369027469722e-02
4.140265379845273902e-03 3.141394024546861116e-03 2.781321975549607139e-01 1.264002810549821332e-01 1.959507459813423225e-01 1.574301662560421700e-01 2.343683486610182321e-04 2.708069800507852815e-02 2.314423075013916781e-02 9.961507619391860371e-03 2.348589376022068922e-02 4.416809943092424307e-02 5.764832960850309329e-02 3.341467987157935998e-04 5.581453079444229082e-04 3.529017392944196890e-03 1.326451655214756602e-02 2.559242865161413805e-02 2.999015076820003151e-02 2.675722136656310049e-02 5.766697855464865928e-03 1.301627603976486958e-03 1.626819751856677879e-03 4.004006519158292803e-03 8.975305992737369135e-03 2.662967344532962514e-03 4.225304449110842686e-01 1.634315231419061487e-01 5.145756632834763006e-02 4.615658351565404133e-02
5.177173559543835069e-03 6.502986199541756695e-04 1.493307545010724713e-01 5.084014957908827848e-02 6.023685017146239440e-02 1.351599355278974013e-01 1.778306227810612095e-01 2.028918028814492500e-02 1.134183638848616782e-02 1.301817312048893227e-02 2.291074214682686447e-02 3.888739599392274093e-02 4.335115656378382698e-02 2.340383095430727256e-01 1.037081397548746771e-03 5.130206990608192699e-03 1.019082219061807036e-02 2.414396538653454730e-02 3.116707917077207735e-02 2.701832586098562583e-02 1.370979076584622793e-02 8.014343068180687386e-04 2.903957524380124111e-01 1.247738233448203449e-03 7.208728096633297902e-03 4.332627317505076403e-03 3.924129680710517626e-03 3.031944200788460608e-01 4.629903488703596137e-02 3.546053186807845287e-02
2.870322383861484070e-03 8.808677716241161866e-04 3.383456855039132776e-04 2.763211401227949615e-01 6.563623697350895111e-04 4.407428888253508200e-04 1.875043011083940281e-01 7.834013662231675834e-02 1.190085408176383419e-01 1.537730738149436782e-01 1.421012060017135675e-02 1.590498513964848024e-02 2.450358168703188969e-02 5.452681593407576743e-02 3.758182693451534253e-04 1.594637790574493985e-03 1.654189398252317762e-03 7.261499174057851717e-03 9.529586922503453447e-03 8.381915627568625737e-03 7.182936084469619675e-03 9.427005582015048589e-04 7.543378206481907156e-02 1.429258345551199516e-01 1.270127120238352929e-03 3.174977517101515521e-03 8.553577831368565712e-03 4.825963612490689197e-03 5.523770376662023862e-02 4.153091904105611631e-02
1.027361432488713535e-03 4.041964976632783212e-04 4.268361431771431464e-04 7.024700932132591207e-04 3.685194601857935920e-04 1.631367193658453119e-01 7.659862152234339638e-02 5.493339337824130336e-02 1.764209814028686596e-01 6.232382349717186486e-04 4.568337977368247538e-02 1.563406495313750255e-02 2.615453594578182744e-02 5.648053727504490085e-02 2.635054402496053716e-01 5.719039530423655282e-04 3.107747342718525374e-01 1.504109933539415078e-01 2.317958405722183590e-01 6.335589108412558205e-04 1.154538082322444960e-03 1.527586586494724119e-01 7.599336613519433459e-02 3.832833990394457491e-01 1.780891950464948224e-03 3.092019142929391951e-01 2.192592914473400802e-03 2.461461133426484128e-03 4.181427828889374698e-01 6.379916475491327621e-02
1.041585419823818758e-03 8.291574160025556080e-04 3.993656363208896928e-04 2.573643761747595460e-01 2.468663565683537064e-01 9.486733813706951790e-02 6.398613670937855491e-02 6.691347545657647111e-02 7.493353067249768074e-02 2.965057067341548835e-01 8.288972200093097653e-02 7.806287136134251736e-02 7.289167246516801979e-02 8.945257224211122793e-02 2.553455561963422493e-01 1.763197669153007408e-01 1.209464389786618355e-01 7.331625508602081231e-02 6.524776156666858840e-02 5.014442513791812078e-02 3.953008357973653020e-02 5.723105026815238083e-02 9.028044265205059649e-02 2.246473569707468920e-01 3.931856265581674670e-01 1.878074833607873417e-01 2.991264006055377456e-01 1.915806508252445028e-01 1.918902830406233884e-01 1.232093469379814954e-01
1.411108891282536817e-03 7.299686159199520862e-04 4.104120163393777405e-04 5.483203791051981160e-04 4.625739342880727739e-04 2.484189326104293549e-01 8.334549039275278466e-04 6.213998126675616268e-04 1.008497049131703849e-01 7.250761317825027419e-02 2.559821122666484233e-02 5.821680958927340221e-02 1.710191318255083193e-01 1.873830395311587849e-01 6.681295733600605465e-04 5.307552068235187569e-04 1.380900562199228743e-01 1.664978369742707298e-01 7.799255478399963470e-02 3.408113338152610888e-02 3.080705133878687205e-02 4.680278768183938204e-02 7.244365143410375074e-02 2.287733531342117932e-01 2.380202189100993349e-01 5.759950977973685160e-02 6.448613191542605649e-02 8.158123380448192852e-02 2.596031235004765403e-01 5.394176216749294039e-02
1.894183483337259777e-03 1.626017751085463790e-03 4.870085011849312672e-04 1.628693653752338790e-03 1.813825391512408460e-03 3.361009019351175915e-03 2.236535726260382127e-03 2.708099660440138057e-01 9.940880405037277878e-02 5.695607076694016169e-02 1.666137935693702901e-02 2.062745899981484332e-02 2.561687686470877010e-02 1.025755343851144641e-01 1.289098396579424488e-01 5.826786488664786878e-02 5.808787485772055892e-02 7.076137133244737865e-02 9.741244436323817646e-02 5.345960443795382683e-02 2.899477466795268715e-02 3.925865798328476153e-02 4.397762966330969608e-02 7.644143635405638293e-02 2.478226275545015178e-01 3.994880923717885474e-02 5.858142933724413970e-02 9.539680513428272501e-02 1.117639653364599361e-01 2.271700672641881469e-01
1.036608766659569657e-03 2.556390462728608433e-03 7.493739261992485995e-04 7.808535801489384105e-04 3.630158139546714111e-03 3.760408713902754860e-03 2.476470884327893179e-03 1.846139288315182814e-01 1.322458114797499806e-01 1.243023229401784419e-01 5.080842673585291014e-02 2.504350095749017374e-02 1.614736095006534186e-02 2.873675732133315619e-02 1.402080526977693697e-01 4.164182004127786607e-02 1.509666706448196671e-01 1.399612236038389520e-03 2.670853597574073500e-03 2.236355753166845151e-01 4.367128203217504612e-02 5.510601107545297361e-02 4.674119185104358420e-02 5.320343334261597168e-02 7.319318997237339586e-02 5.765258666123020126e-02 6.895685624930825153e-02 8.512315088662630869e-02 1.112190809462514085e-01 2.791292154343005261e-01
