5.053602139166531518e-03 7.404546186871540508e-03 6.415920358225641294e-03 8.056085852728793115e-03 6.083011966965173010e-03 1.326599043517311984e-02 1.310017378074681757e-02 3.530416609943781009e-02 6.378401481625790848e-02 2.856752994081995789e-02 1.316364991427528865e-02 2.984863939230187908e-03 1.738772954623565500e-03 6.427303309828298963e-03 7.398511844475473033e-03 1.604844742381384250e-03 5.640797978279727537e-03 9.899416030598543956e-03 8.977280448124864282e-03 3.150555544093626686e-03 2.785180140571518349e-03 3.605425869519168075e-02 2.818117282568874393e-02 1.476701794719004765e-03 2.438262335846427126e-03 2.002937336455706818e-03 7.694559371716705454e-02 6.897273296920268526e-03 6.519720097717130944e-03 8.103881094316039632e-03
3.985972895831169614e-03 8.730951184291069200e-03 1.563222185811953546e-02 1.273985887895903203e-02 8.844139731991197684e-03 3.929758609267444691e-02 1.848048517287260994e-02 2.312835344006984595e-02 1.496132640390110922e-02 1.284709599189048229e-02 9.088287345965853636e-03 1.776137373872080111e-03 2.346548552634499744e-03 5.284722403846375122e-03 7.265287210650835797e-03 4.572418350252650636e-03 5.624412037055944759e-03 1.839822794232494341e-02 1.385848714427277348e-02 4.136763066765007484e-03 1.640154930025775797e-03 3.409023990241115409e-02 7.281253526044935420e-02 6.286043898199954183e-02 5.413059753712202299e-02 7.339375335610534568e-02 2.649710858232020086e-02 6.921629635571651187e-03 9.786337553411796411e-03 9.702928092180082564e-03
4.809225120041933643e-02 4.801258717310146612e-02 1.015130749167153096e-01 8.259738939224489651e-02 1.751801509250113797e-01 1.768536585569478389e-02 3.237151266108471374e-03 3.428490647701452551e-03 5.444238055490344813e-02 1.689727231974228611e-02 4.593913640899052048e-02 3.078847812196798539e-02 1.127588733438459126e-02 1.614647516659963727e-02 3.027196295281962737e-03 1.239797041635917405e-02 8.253990731234568667e-03 1.683576594997824097e-02 5.572037670617194932e-02 9.151953511490893908e-03 1.021322894782793070e-03 2.809444338528113358e-02 4.462238106109502056e-02 1.550247295416950361e-02 9.183239897125480833e-03 6.048817961056201370e-03 5.399103968463998815e-03 4.232204515628919597e-03 7.187796481189948766e-03 8.019334549212558602e-03
2.241915287666786799e-02 6.301947888702698342e-02 1.383345244112458294e-01 1.117590213215944872e-01 4.556564733995372568e-02 6.972437990972970949e-03 5.425172727208510230e-03 3.718572556284698277e-03 2.248936785458237504e-03 2.145031002701466849e-02 1.362777827882969729e-02 2.728877391499820101e-02 1.230734915685924129e-02 7.995131663866280464e-03 2.518562632846094336e-03 1.889652370326006968e-03 3.931856975425052428e-03 6.482006457545549417e-03 4.547484516113100249e-03 3.825182936365161511e-03 1.891993503246414609e-03 5.711635622126364636e-02 1.949997983288088640e-02 3.847544022044489809e-02 7.444176013732300284e-03 5.357539945850106275e-03 4.592775105867927601e-03 4.341434955552636067e-03 8.780591974645408568e-03 9.502784702726392932e-03
1.294863153746913555e-02 3.942113571339235512e-02 1.100364681257361421e-01 4.264140497902319665e-02 2.418626503184361301e-02 3.489776494588864644e-03 5.264983296458749899e-03 2.998133477536627910e-03 4.247474417692353316e-02 4.872849218563621299e-02 6.056127389849819825e-02 5.176774602985097229e-02 8.807079230293118552e-03 8.607210756433383500e-03 4.721372342298064614e-03 5.110339150311166839e-02 1.364996364467690494e-02 5.922252678419868271e-03 9.410780621069127216e-03 5.335040374413733619e-03 3.839342418127673906e-03 1.066766641050835053e-03 2.855948627092737627e-03 6.044661517858666844e-02 1.335200724044621236e-02 7.159622866039122395e-03 4.975262101534661148e-03 5.733658241276846576e-03 8.936565422072925702e-03 3.274845700473814208e-02
1.496389030544502396e-02 1.508559176194636947e-02 5.943292716577072698e-02 4.760553431057431423e-02 1.877004068833120279e-02 1.996324099021252411e-03 2.401578134000775886e-03 2.627078816117814960e-03 2.442881226562206541e-03 7.500729215072404754e-02 5.810071104563799271e-02 3.476298463530135691e-02 5.568879706413884523e-03 4.174432625897418758e-02 3.478889343588394828e-02 5.837708581082121789e-02 8.242422382389416255e-03 1.492261717630550188e-03 4.775594047476455252e-03 1.629595999110282009e-02 1.933043036912256846e-02 1.192201835269395341e-02 3.771834240395744494e-03 3.549999147443533981e-02 1.982930135497071658e-02 1.872815748291300000e-02 1.171682786457216817e-02 8.053183429888413278e-03 1.059416705498261550e-02 1.899472593917672994e-02
6.551763336277682814e-02 3.244984061056443124e-03 2.972709640962827114e-03 1.503642505925612514e-02 7.188695181993215791e-03 1.183526241990054927e-02 1.773266972575241601e-02 1.000086295213257863e-02 1.181261260919602013e-02 1.390750202512042871e-02 1.082039370740373388e-02 5.523725276814920107e-03 6.445033351243920072e-02 3.037453223926001727e-02 1.762893513079891519e-02 2.971547978687150496e-02 4.742478530549465096e-03 1.528266748209760554e-03 7.714987729883331265e-03 1.044534130855219282e-02 5.973741169662096298e-03 1.723045499973128091e-03 3.482239030156141640e-02 3.302796283252103227e-02 1.346032017313842331e-02 1.392601247321724120e-02 1.230231996797696674e-02 1.057449628561764679e-02 1.206343801217081048e-02 2.863432252741507714e-02
4.615435819562039091e-03 8.348503530926599733e-03 4.206960816350903583e-03 9.012709278744594071e-03 1.376846366448592797e-02 1.535775247852704146e-02 1.347052989885011258e-02 1.258894035955872293e-02 9.960510838811107923e-03 5.605639885179142592e-03 2.265206454711522419e-03 8.931761265860054325e-03 5.495815379998323508e-02 2.005562615132253437e-02 2.253296371616387780e-02 4.059262974084768688e-02 8.980270305244024767e-03 1.076295023685179021e-02 9.385274906639458695e-03 7.088354423029894803e-03 2.950810397839459184e-03 6.271775060267290036e-02 2.549251370950291959e-02 2.163082681801693080e-02 1.035771749148023217e-02 1.071911188444440131e-02 1.599020244303568997e-02 1.824417725507771967e-02 1.755700179965989996e-02 5.179065720066483580e-02
1.080648861431149528e-02 7.077817600962064970e-03 4.093340940428622128e-03 2.348828629257211295e-02 1.504208243678665895e-02 6.316315290228934065e-03 2.012162928585670835e-02 8.949502634728974046e-03 7.492966082394597431e-03 7.395026703667927602e-03 6.604127736793580575e-03 9.474273731673350449e-03 2.157672504572328773e-02 1.649287130246564551e-02 7.264519161295324157e-02 6.056274616036583930e-02 7.880173285721322335e-03 2.032566838092893929e-02 1.993314410608553952e-02 3.947633033103904905e-03 2.885160660071453553e-02 3.000039873034025112e-02 3.277552860128801065e-02 2.151765453066068964e-02 1.263160210431434928e-02 1.761057625518103881e-02 6.108040410179028240e-02 1.654599922640234916e-03 4.862088040064692536e-03 2.404834594131749666e-03
1.813779906169833353e-02 1.189964946800683120e-02 1.875691532887955801e-02 1.737588834573030108e-02 1.626689663642775716e-02 3.718709324817315569e-03 1.978821565749262767e-02 8.254962402326482263e-03 3.047022877309291111e-03 3.276013184190216393e-02 1.277603971783170499e-02 1.222838585160951341e-02 2.567364087044575124e-02 2.984413211827946499e-02 1.470830057984168389e-02 1.579718031745434847e-02 7.791891057321496949e-02 7.720890192970789045e-02 3.297220421763262521e-02 1.887605982675719107e-02 3.774452101954232919e-02 2.380229150346727107e-02 2.705978585358816482e-02 2.975102996596012267e-02 1.662098427586602631e-02 1.989957324330945618e-02 3.619929148475499285e-03 4.815880961945254168e-03 5.260533302192517933e-03 1.320129046883320974e-03
1.652254254507822331e-02 8.672600592681956391e-03 1.915105963809825285e-02 1.493259069230747950e-02 2.028036622915116785e-02 5.552332614305871550e-02 5.368741910706004150e-02 4.920025499178407036e-02 3.351192923016135111e-02 7.705278839719489556e-03 1.020647865731938581e-01 1.667759842258759451e-01 3.421959315968446380e-01 1.675986899254751639e-01 3.068477738083365269e-02 5.994990870383501425e-02 1.115730738662407684e-01 3.076181001631127579e-02 7.784166382604428523e-03 6.229450449101261306e-02 2.606175017425952159e-02 2.334104956492743729e-02 2.986126813358696425e-02 4.173729152112749113e-02 4.466160599389063651e-02 2.344237982170925549e-02 3.483982359529774753e-02 2.567433766308295506e-02 2.301911233673266388e-02 1.658296111194293779e-02
4.797729112249358822e-03 5.114379109553678776e-02 1.902518310751579247e-02 1.405862898510900662e-02 1.359867401731853359e-02 4.825371162191363812e-03 4.211201065570186614e-02 2.955238195741245397e-02 3.524968416500451340e-02 1.630122979180546189e-02 3.053911019692587617e-02 1.986571604192139961e-01 3.541670111677544530e-01 1.830454987792819455e-01 6.575724500428524466e-02 7.411454892874538847e-02 8.178390341727177770e-02 4.806993949610594702e-02 1.262864333740244295e-02 4.478343973503711752e-03 2.510194140822673281e-02 2.563293559868588117e-02 3.009601386447377860e-02 5.373658511643251284e-02 5.109741080978827399e-02 3.634462115891631123e-02 2.780919264645954209e-02 2.476100830112045945e-02 2.656546694948170792e-02 2.820940997165542752e-02
2.235158772823624129e-02 5.139570928426449165e-02 7.360766376746083473e-03 1.180219738080456361e-02 8.758255755382757593e-03 7.091210730973859788e-02 4.087816156217815439e-02 3.733075218788899780e-02 4.798745192003010807e-02 8.515198555695933577e-03 2.164834599977804447e-03 6.291439348593046155e-02 2.633683378553846599e-01 1.130850356806056278e-01 3.560003557996571644e-02 4.128982558331355940e-02 1.523578501226385828e-02 2.230788892654098077e-02 2.532619327871381623e-02 1.062818955616610245e-02 2.391230208506072916e-02 2.610372870052424243e-02 3.265918277087252047e-02 5.471514352216264726e-02 6.975105549872352706e-02 6.160615681038727337e-02 4.533224368079315225e-02 4.187554336226964602e-02 3.607977751994888987e-02 2.933477819963551531e-02
1.939941502945071242e-02 5.227896784150697779e-02 6.378761231412699920e-03 5.364479611343824644e-02 3.197025320028756834e-02 5.352746584236573422e-03 1.821359157092647049e-02 1.427569543095352604e-02 6.607822671553931215e-02 2.114580384788815326e-02 1.597584351483168942e-03 1.020742474715949366e-02 1.199916483283522961e-01 1.633905539013100205e-01 1.751004638219378351e-01 2.377227273023814480e-01 2.139843540987017567e-01 1.388643903398970592e-01 3.792158401876072338e-01 1.774899936327989924e-01 1.584800883109747580e-02 5.411423397434139693e-03 4.558467881904153945e-03 1.174301705920743379e-02 2.465148417177086271e-02 2.078129020627961926e-02 5.254955998514170695e-02 2.028410731721573546e-02 4.892889942615243071e-02 5.532681889720409557e-02
1.835602772345914721e-02 1.758245376084293168e-02 4.180899294009238903e-02 1.901636366148339724e-02 4.989986724943333736e-03 2.625512780168488824e-02 8.751204108820046998e-03 2.453580111081575185e-02 1.700729496630697113e-02 1.737995294372608529e-03 3.389536426526354885e-03 5.111187679760596098e-02 1.080546312129846281e-01 1.377211999327178638e-01 1.248596408125358520e-01 1.514734074700460342e-01 2.590689475784105356e-01 4.488440170038859867e-01 4.580053694006725462e-01 3.593551800943442509e-01 1.520069933182475498e-02 1.571362838575697876e-02 1.388668651036695928e-02 4.320873048322834697e-02 6.169473509025859975e-02 3.130701595159174899e-01 3.088413709934475504e-01 6.862688493807292400e-02 4.996991215398020186e-02 3.750531172544187275e-02
1.716404367808892911e-02 1.812575257441628382e-02 3.536107082759255144e-02 3.639223068205051786e-02 2.345473201371948632e-02 2.822797210087196751e-02 4.833455744287903401e-03 1.235267446247656671e-02 2.548070398715518090e-02 9.007102014775071261e-03 9.218395162928605391e-03 7.962536534958318188e-03 6.161852627323539250e-02 1.247647453068141954e-01 1.163425972951029896e-01 1.782757542809585705e-01 3.100611514158584936e-01 3.787654560693478611e-01 2.199876163191791523e-01 4.797326287924118249e-02 2.858272892240434557e-02 1.948077894059057624e-01 2.819077101792225037e-01 4.672805714087323037e-01 4.339823142158631408e-01 5.591806336358027263e-01 4.409033754827158536e-01 1.302130498147839599e-01 7.196139807604950978e-02 4.159144607139730193e-02
2.219312594518208295e-02 2.513257456542063173e-02 2.356745195098425283e-02 2.128291487060060896e-02 3.104352347250265848e-02 5.496198285046955540e-02 7.423198347257715934e-02 2.408667606919962234e-01 1.173213543675024895e-01 1.992231693150848734e-02 1.465832994579587684e-02 2.256174636849512041e-02 4.423808526708251226e-02 6.496808682595993367e-02 8.554832404005187352e-02 1.529033866873278635e-01 3.320383218895392452e-01 3.367284501466235036e-01 1.605790049096601779e-01 5.523562543951614223e-02 2.362900974356497708e-01 4.252460978863236152e-01 5.411531232596338281e-01 5.469432156845894788e-01 4.733156778172976642e-01 4.020678916887426846e-01 5.823448819118220987e-01 1.024490292690787979e-01 5.088389888810370375e-03 5.004911164858787120e-02
5.556481439334633871e-02 4.326516275881098911e-02 2.089635782596787131e-02 2.918592491603597475e-02 8.882608037971400500e-03 3.714404617449412055e-02 1.992773919308226116e-01 1.612845837740458921e-01 1.584201517124047831e-01 7.876029240849825863e-02 2.860909999342468174e-02 7.606764847958909052e-03 7.353218361559813246e-03 1.871275409615244870e-02 4.188275810758535639e-02 1.908366315946160297e-01 2.025689675637515064e-01 2.383093367649635752e-01 4.189535092015878731e-02 7.419758443339358189e-02 2.606895816513096764e-01 5.585934870351980663e-01 6.821641198791981164e-01 6.928145951875468445e-01 5.583895223762310733e-01 5.250723912299471996e-01 4.757238947024086673e-01 3.735324193243242941e-01 1.897129606709524116e-02 1.281796775496474479e-02
2.218552975278278300e-02 6.087353055412406122e-02 4.023085228350751531e-03 1.448322782562154812e-02 2.911803166351546041e-02 3.979861747263316318e-02 1.259475670277938053e-01 1.578810172562005176e-01 1.083106645379538491e-01 8.379406376102002674e-02 1.740799812324199392e-02 1.689834867756285532e-03 2.536102709313825705e-03 7.046976972503287036e-03 1.510057097249928142e-02 8.763047112521460402e-02 3.366566794670608487e-02 1.083967064133187740e-02 3.664575087019097000e-03 2.668584260034369965e-02 1.007492272015906853e-01 5.318920864521673453e-01 6.668392756377291564e-01 6.839274624546650694e-01 4.872041610608584539e-01 2.196778553002942669e-01 3.474396641775213124e-01 2.361606320718623864e-01 2.119821950713016503e-02 8.254711647424275295e-03
1.107200638585007293e-02 1.431274650033383805e-02 8.951108919994905933e-03 9.532077982955085294e-03 2.225966610911610938e-02 1.278158154907294355e-02 6.590082398759185278e-02 8.536563272740045616e-02 7.870155854904044290e-02 1.843589895501582601e-02 4.604171301099662349e-03 1.146942324014150550e-03 2.063304175935662919e-03 5.788980738045122407e-03 1.945134765720352502e-02 1.234476902978316575e-02 2.264423032638207198e-02 6.737953659823064760e-03 1.275880614037908263e-02 6.075894253255505195e-02 3.254495359638905905e-01 6.112136354609437605e-01 6.505950037272261177e-01 6.051633060118645213e-01 4.525427655596180876e-01 3.224440466762411583e-01 3.049087178127536935e-01 2.037151836931093418e-01 1.825850030085103895e-02 6.426127668913762282e-03
2.517911337072606739e-02 2.326242254466641748e-02 1.183405106196031356e-02 8.433532530607384947e-03 1.083715159618625981e-02 5.811511550109639372e-03 3.310192030646915556e-02 2.963348735908375234e-02 8.334907280993902531e-03 4.788982788332177970e-03 1.925721414669219998e-03 2.014405059608031980e-03 5.985106670395985706e-02 2.794211301427820468e-02 1.069576300722036282e-03 3.428412948400885209e-03 1.233118465042024395e-02 2.829917854363880186e-02 2.741386116132073919e-02 1.228144848747358825e-01 3.337216004543532288e-01 4.799368664914154814e-01 1.937926550465990938e-01 2.849084494789648758e-01 3.589616053609873125e-01 1.980983533923882656e-01 1.444295371113543947e-01 1.210479052885436030e-01 5.704694679452301451e-03 5.400799946794806149e-03
2.045148940845384344e-02 2.369331286542610687e-02 3.446709192962032695e-03 2.356388579359860493e-03 1.910628063232141247e-03 2.845809574018583893e-03 4.184056202146225339e-03 1.091416679342497621e-03 1.503959311012117127e-03 2.088064785646080723e-02 2.970879748148436833e-02 4.687572625382758346e-02 4.308631282409401686e-02 2.733524604428192589e-03 5.066820027370751156e-03 6.252382146721617573e-02 1.206320764524324018e-01 1.755494328237566237e-01 1.205389408330107409e-01 9.069993930485735489e-02 6.376896019378852642e-02 2.261535119013843853e-02 8.708411545184346556e-03 1.855600653082442597e-02 6.575139318997227922e-02 2.170330183628088258e-02 1.949974333025972228e-02 8.902922288776935270e-03 2.279840693896244622e-02 2.144013777135474197e-02
4.343302041572377759e-02 3.346192219330246242e-02 3.691127209850689986e-03 1.656814601691624202e-03 2.437030758406808894e-03 1.793111893775802728e-03 2.804828733313219271e-03 3.039279646738642093e-02 2.866808196328588659e-02 1.253091720812476127e-02 3.138710416440169265e-02 5.676500798927090752e-02 5.699318019008890041e-02 5.273994554602286569e-03 5.940055227593099389e-03 3.737800431312696819e-02 1.374485257070508504e-01 2.574117376315147032e-01 2.927005003943408123e-01 2.530804473239207097e-01 5.320030159575302869e-02 1.174616733905616862e-02 1.448367162296309608e-02 3.537123171996256477e-02 7.755803214445852745e-02 2.252226092695705853e-02 8.420149081018298010e-03 4.614812349950325049e-03 3.258275934145588026e-02 3.159053376764098253e-02
5.419329763004823025e-02 6.881541573575233883e-03 1.956596580058384254e-03 5.341398685904382576e-02 6.740099840877546156e-02 1.579534573058958419e-03 2.217077151617600876e-03 2.474888324509954760e-02 1.427091438309638534e-02 1.630062866321524417e-02 2.978283497829471368e-02 5.024106924451697542e-02 4.375421213691180200e-02 4.391431361590440209e-03 1.203926959129962386e-02 5.408220161048543639e-02 1.051472186624956007e-01 2.428018568381151709e-01 3.060189376333608546e-01 2.583415413017317586e-01 1.277028692874466465e-01 8.132904665959809695e-03 5.728195823603512808e-03 1.219229121365031018e-02 6.387075519195743734e-02 3.827698460362747440e-02 3.402793111910609042e-02 9.049840290956361402e-03 2.674110472959467799e-02 2.434074988013691307e-02
2.984894738106569356e-02 9.211371206600420247e-03 3.736342668533089266e-03 3.656957340158892115e-03 8.090725611921759791e-03 5.512198038878242910e-03 2.507699109569475841e-03 9.623940558371019138e-02 1.520747479242978662e-03 1.946189056992583257e-03 1.750495891240959334e-02 2.080730970726650877e-02 2.626015468318677534e-02 4.920776161507617319e-02 5.063829399970495686e-03 1.685496989827233241e-02 1.703043100906456719e-02 7.271798152018311978e-02 9.323425641481576653e-02 8.028352339982350316e-02 6.716498124774858414e-02 1.150099645229869620e-02 4.620394418395072644e-02 3.312388919282257399e-03 1.156144849818908568e-02 2.909873427514720126e-02 7.783324998257647176e-02 4.997371484622772919e-02 3.054758508117838209e-02 2.676272878588383322e-02
1.067180574112082045e-02 4.222861849896516508e-03 4.508746501415652162e-03 7.578798783828560523e-03 4.056515233365990715e-03 1.969669403699015903e-03 9.316844760976453199e-02 6.807142258039564076e-02 2.235138339316032532e-03 7.851314565283823085e-03 5.392969551684410889e-02 1.978047726698413389e-02 2.903602319609060664e-02 5.179410704778421304e-02 4.174307029890782922e-03 6.035415017438168668e-03 5.298085868512027174e-03 3.218017186229521053e-03 5.618818442279019214e-03 9.747419313749550868e-03 1.813417406642429258e-02 5.739018888869048922e-03 4.842059867371546061e-02 1.113731386170911837e-02 1.646349191514163285e-02 5.888468527782176470e-03 2.034299730737358300e-02 2.416326054646191282e-02 1.788032309852591664e-02 3.927763630862826649e-02
1.081618212287664520e-02 8.655671200079895558e-03 4.219397245342767534e-03 3.075892922198334399e-03 2.800191478619333454e-03 1.147393277254457481e-03 7.742195618916722366e-02 8.167396408950525211e-02 9.006732809288996167e-02 3.808419024230619201e-03 1.411059691299314548e-03 1.779832701178294318e-03 7.269762324474041137e-02 1.682013999761401484e-03 3.725766806468650688e-03 2.334012052357491932e-03 2.084358142849839727e-03 5.554363182414065458e-02 5.023547654903671306e-02 3.954865397797217852e-02 3.131210199082052476e-02 4.384233352542633161e-02 5.953623772427230065e-02 8.402055520409163966e-03 8.340044590787170503e-03 5.527448720306381291e-03 1.134103365468764300e-02 6.812546626966954101e-03 9.432988115775418556e-03 7.065407674549342709e-02
1.469190208863664811e-02 7.636325514030724466e-03 4.338469963367069457e-03 5.887328621481333242e-03 5.066828137160084289e-03 2.809224790838805389e-03 9.872701214573287309e-03 7.788957691636898793e-03 1.321223110685504657e-03 8.921052108845514694e-02 3.171953798143661851e-02 6.758996765401938112e-02 3.366646878893565179e-03 3.047989858564236279e-03 8.248155569412640373e-03 7.187169816439000804e-03 3.080223357415099242e-03 6.239066088412572979e-03 5.716257609865434131e-02 2.645154831669048467e-02 2.540439764874033099e-02 3.819545357242929567e-02 5.288699771761465329e-02 1.285471735808675457e-02 8.995139804816969231e-03 3.461511625276605247e-02 4.173052960217337598e-02 4.951329526006011117e-02 2.048569148897222067e-02 3.014482898757233839e-02
1.976128368876144820e-02 1.705868934312535640e-02 5.171044563675761957e-03 1.754196962263256804e-02 1.998246189934133749e-02 3.757725890649893374e-02 2.521106196745160136e-02 2.848054330317202881e-03 1.216825161062078543e-03 7.100483703405376101e-02 2.150696210775909778e-02 2.468672131494357297e-02 2.567906015383534038e-02 1.823140658414983779e-03 2.675408817479841845e-03 4.131023813826642521e-02 3.513145727303004784e-02 3.861916316995622073e-02 5.363142241154275625e-02 3.242878901580450307e-02 2.285635881668649297e-02 3.350610436656885349e-02 3.561146121353390981e-02 5.290847840017632447e-02 2.026417536179347945e-02 2.689259953500987288e-02 4.087069970311803246e-02 6.245850195129225291e-02 6.686813383175736758e-02 1.340797803533222941e-02
1.077492120726111779e-02 2.678192917439761386e-02 7.972558942884538924e-03 8.433373112464051177e-03 4.009894527209460768e-02 4.212271265850257157e-02 2.793288699478711085e-02 1.910346026133212180e-03 1.475318631346541655e-03 1.783649656599423702e-03 6.390493875258033973e-02 3.207410740288293288e-02 1.804472728937338635e-02 2.593040166235781319e-02 3.086505194580150407e-03 3.142754883441203212e-02 3.291664559917328349e-03 1.806421550679888563e-02 3.458818681616000756e-02 9.047314932873282839e-03 3.223995321766182087e-02 4.481631871629124936e-02 3.777463828357136011e-02 3.760729911114368135e-02 4.890855591520948398e-02 3.843027013649823881e-02 4.663846602893206850e-02 5.502046834231010680e-02 6.467953032519985213e-02 1.539656626840158436e-02
