1.020890120979047327e-01 1.475115217431979819e-01 1.253180500564001210e-01 1.558279392954872167e-01 1.096699001991527783e-01 2.292721326267384840e-01 2.095658876310107221e-01 8.290955529137477784e-03 1.206883040694444083e-02 1.516773211321933990e-02 2.538805195959091265e-01 6.569763704594464016e-02 4.297971053240101647e-02 1.706505150188146747e-01 2.120369573571445343e-01 5.045351510253946736e-02 1.937924596242666664e-01 4.422898026882791760e-03 2.354988311560083421e-03 1.526351338312202655e-01 1.409116089848531372e-01 2.079867753185603990e-02 1.573106281198871637e-02 6.279623423381182346e-02 1.225778883411780817e-01 9.677132924228143418e-02 4.480606803188390969e-02 3.970636242673425235e-03 3.815848777769877305e-03 4.829975698999639661e-03
6.718510602282608268e-02 1.427590406516952293e-01 2.517952952873105388e-01 1.899580662639606676e-01 1.310375251462374824e-01 2.124568136631075493e-02 8.598197227132066758e-03 6.741289734607545936e-03 3.275911799582815597e-03 1.957402836602872565e-01 1.579556668826095633e-01 3.448765807074970213e-02 5.155709735114196585e-02 1.327232793423037960e-01 1.934348948155919234e-01 1.382821268466011555e-01 1.796671990236857475e-01 1.061608159500385812e-02 3.501374458111709397e-03 1.835895234789906016e-01 8.156350249102646555e-02 2.023055728413909043e-02 4.155798323657899224e-02 3.713282709542356508e-02 3.304337626113044296e-02 4.457891996866190920e-02 1.577967531627030157e-02 4.035416822086621003e-03 5.774961204506995002e-03 5.803035680581774755e-03
1.193354619404722247e-02 1.551993150723354753e-02 3.178039324398190119e-02 2.314024574084204769e-02 4.117171169049636814e-02 7.319306125829631686e-03 5.530683812687174628e-02 5.844159818009292406e-02 1.769355274444069093e-02 4.742396064737040666e-03 1.319377584281828525e-02 1.676279801817825640e-02 2.376913831029555391e-01 2.307967738454316450e-02 7.956734226615067018e-02 1.519758053370354883e-02 2.749686883608760124e-01 1.019308449196798007e-02 1.988204049882403776e-02 4.351966029940654637e-03 5.190171528252304073e-02 1.698623888753711050e-02 2.567235221166946219e-02 8.923915878808049915e-03 5.315502250055147322e-03 3.520177556578956736e-03 3.165347844340937224e-03 2.497248362255406751e-03 4.276637116490272089e-03 4.811872368872855028e-03
5.237210256166497692e-03 1.419170342176622086e-02 1.891401649313895553e-02 1.524104832592491562e-02 9.638084612883493843e-03 1.133665432287543490e-01 1.129150695183138015e-01 7.019736491295502923e-02 3.806364734204061018e-02 3.541900873128353642e-03 1.916160433187407471e-03 1.222430199594242393e-02 2.341182421471328934e-01 1.877612677363288129e-01 5.825473518067595530e-02 4.907628336329176999e-02 1.097937891175965325e-01 2.213435779538234782e-01 1.777681399455014188e-01 1.682489960485167857e-01 9.267882260854030940e-02 3.583964158731795663e-02 1.201072331418200773e-02 2.372104234371036346e-02 4.347093140296182448e-03 3.114379954431692119e-03 2.686806641640929107e-03 2.556181940690441592e-03 5.203593669020441757e-03 5.666230219126329459e-03
2.199114212021979486e-01 2.077977536508721079e-02 2.289623566252074402e-02 5.921389646491980602e-03 6.206809462256581734e-03 6.743259648765616288e-02 1.171256254329563345e-01 6.554841052971327464e-02 2.393895907619736363e-02 9.362194925863872447e-03 8.642952443555642489e-03 1.882698476233057860e-02 1.413144729580037562e-01 1.448148841357313754e-01 7.479238656516865036e-02 2.994660807227042185e-02 1.157448173666684142e-02 2.085171147531000857e-01 7.592934755895272558e-03 2.040035967560943631e-01 1.459622810259040004e-01 4.573920760265093310e-02 1.172581308194743377e-01 3.881638286455758174e-02 7.815847378485580449e-03 4.147627618392063335e-03 2.889692531621165621e-03 3.347344204061357582e-03 5.244762994667253979e-03 1.931304110234080551e-02
2.568152217517786218e-01 2.445930714967113895e-01 1.989172350015462956e-02 1.209165316317469853e-02 9.751456688544704252e-03 3.993523200552603208e-02 5.112248760483526638e-02 5.392552481545976467e-02 4.446528740183170597e-02 4.469461395557292049e-02 2.345909067531672110e-02 1.377963903355358850e-02 6.320261046772521207e-02 2.362562169780017124e-02 1.963769106496960834e-02 3.398993155481287026e-02 1.879183409903945057e-01 4.944299496424169049e-02 1.597103759590833283e-01 1.223298888950827279e-02 9.136813249530572126e-03 7.944058013757538880e-03 1.435342470386775093e-01 2.254469629349941176e-02 1.160985827583319030e-02 1.080269151338292093e-02 6.748801519062042065e-03 4.661810175879664737e-03 6.166820878897872824e-03 1.109409403904135401e-02
4.212714101949896484e-02 6.537715497364493533e-02 6.281005485889212814e-02 1.167618634998406416e-02 1.404055395872639278e-01 2.359696548330903754e-01 2.718111180310707822e-02 2.095078099310770936e-01 2.348620203305678000e-01 2.506172799755105318e-01 1.794538616928894881e-01 7.665443510436968644e-02 3.502285797214407803e-02 1.606420703591680821e-02 9.345381596284261377e-03 1.721432272980047418e-02 1.019211855400068978e-01 4.824454697920523699e-02 2.378469012638100011e-01 1.130041663517107435e-02 1.596397042654712495e-01 4.494232006570914734e-02 2.112979840805677759e-02 2.029471309888812233e-02 7.832767373819929033e-03 8.015669737909828299e-03 7.112240793344360400e-03 6.191211387965171557e-03 7.199214103696953589e-03 1.700536175070012715e-02
9.123573120620386001e-02 1.718226942791027945e-01 8.979070361692031987e-02 1.704912956229369114e-01 2.510321253377341688e-01 1.504204970188738159e-02 2.582769036640372162e-01 2.540789044037721767e-01 2.188229721016814733e-01 1.216012180414794558e-01 4.811624435735797900e-02 1.430351999324840639e-01 3.075628203669336994e-02 1.071174117190237460e-02 1.218801872019121234e-02 2.326254816388522925e-02 1.851661498289529917e-01 2.924978880881794474e-01 2.584388176812267846e-01 1.987326183306120375e-01 6.436695050783727834e-02 3.741139961702458910e-02 1.505463892868703045e-02 1.260644218162607424e-02 5.995720231112522738e-03 6.305495553897672023e-03 1.023721558512867384e-02 1.320877062508729258e-02 1.297766245381933026e-02 3.721604489710487323e-02
2.313518462029763578e-01 1.504614841581988771e-01 7.976215095902015884e-02 2.489491342939685603e-02 1.316464581845836965e-02 1.159266048798793941e-01 3.786371553028498871e-02 1.871957651783307530e-01 1.699907868629029484e-01 1.692341202133429146e-01 1.482434803119627165e-01 1.829566527799241504e-01 1.498644129612188014e-02 2.532844423856623894e-01 3.993313961516801319e-02 3.439570426296927746e-02 1.424786463050963792e-01 1.714887321291826833e-02 1.571544589512670342e-02 8.657648224086057775e-02 1.694491789714244398e-02 1.738025363997847822e-02 1.903667752755180270e-02 1.244849570065045472e-02 7.286834482576215813e-03 1.116933944371229816e-02 4.443852914343555949e-02 8.884229957617967299e-02 2.507771136181853877e-01 1.210097174940463066e-01
3.746924248189432149e-01 2.379535397506396810e-01 5.358917852208206628e-02 3.059003072764683584e-02 2.570317064772125737e-01 5.248866873291819363e-02 2.682612974427007746e-01 1.200843129328872105e-01 5.615701875948928001e-02 1.999717142269368669e-02 2.689888115718410133e-01 2.265927088366526676e-01 1.186598949930238456e-02 1.035772512402128795e-02 2.530927643321769227e-01 4.262004144186564390e-03 1.646251683876536961e-02 1.839470835759396405e-02 8.477283218390781541e-03 5.531496830956076846e-03 2.118426897975967879e-02 1.347092103393942447e-02 1.557128067431770568e-02 1.714391072226967988e-02 9.573615924363568924e-03 1.229496701355285368e-02 1.190878006045090337e-01 2.017081954829313128e-01 2.463167567135972069e-01 6.337995201667354084e-02
3.155902882433285206e-01 1.592761045672458631e-01 3.384289220081852512e-01 2.792539018102501713e-01 4.401793340380361075e-02 3.402796137319426956e-02 3.098011726159982659e-02 2.821082351796679738e-02 1.852320308953819133e-02 1.441747656473486572e-01 2.971737560464718375e-02 3.770580781037553147e-02 5.591708625852791215e-02 3.228209329374186892e-02 6.169509052077315654e-03 1.222973417581835892e-02 1.770714715043698526e-02 8.702860519584168855e-03 1.457155359516176252e-01 3.547462848740512431e-02 1.469953245991070627e-02 1.319097299627116499e-02 1.713995783589358085e-02 2.402751280471802919e-02 2.568594744671762534e-02 1.401344588537600279e-02 2.265148171464724872e-02 1.786346301702033609e-02 1.585815401336797617e-02 1.125224464155471539e-02
6.066095270193053862e-02 3.488529783404622359e-02 3.006845627318711078e-01 2.892932583551734438e-01 2.285523480910809091e-01 5.348797685617126541e-02 2.298863714629588093e-02 1.558014754538359151e-02 1.874390167146484237e-02 5.859510595907386869e-03 9.689300414239926731e-03 2.919332413150431405e-02 5.086508085913415272e-02 2.712919243220709986e-02 1.004836153296854648e-02 1.163015608907302587e-02 1.292820479806032138e-02 1.396121550427091400e-02 2.480771056964442556e-01 8.236931160005417363e-02 1.431658130758446494e-02 1.458161735870996609e-02 1.733568840555746449e-02 3.104005616979198939e-02 2.948380694918705316e-02 2.102679857221603082e-02 1.621141999639475612e-02 1.476078869132008836e-02 1.607299779719853841e-02 1.733683868113534282e-02
1.238770900986272197e-02 3.123455715098118202e-02 7.452555172141321627e-02 2.095188684104868637e-01 1.389339852971304967e-01 4.546906980197484849e-02 2.427939090655927695e-02 2.115366081219957964e-02 2.634542644591707575e-02 1.716481679232334245e-01 4.807303332745457153e-02 1.107581102900276684e-02 4.203721187387260416e-02 1.679708488431413266e-02 5.407197868407874128e-03 6.400128405027705539e-03 2.395467725508754718e-03 5.535588561223219947e-03 8.931768278155014298e-03 1.770198619268278095e-01 1.399311986434319081e-02 1.536125491580770351e-02 1.944453652201738256e-02 3.226476049732030643e-02 4.083505380472099433e-02 3.567939148593999438e-02 2.657344866116618728e-02 2.500281845198401229e-02 2.187963855518979331e-02 1.803429291287157385e-02
1.024520760928904727e-02 2.934117304925914702e-02 5.299817513304416056e-02 3.863245561140854489e-02 2.314052072803371787e-02 9.216759420800162139e-02 3.140002835088128164e-01 2.758562692080749890e-01 3.682434185289362033e-02 1.149547273380263461e-02 4.102770857037683211e-02 2.202839827951054708e-01 1.947697617578050822e-02 2.430864858819007865e-02 2.643490852171042835e-02 3.634900701974937143e-02 3.341507979549262347e-02 2.213722493925930970e-02 6.885481465632424525e-02 4.267904787629391711e-02 2.567033216270369622e-01 9.386889492455643969e-02 7.029963686059144401e-02 1.660674945858063856e-01 7.461858071199496852e-03 4.607297085512304484e-03 1.351637507558095357e-02 2.855369761268811146e-01 2.980562519507684235e-02 3.419098986144616936e-02
9.667058707929169353e-03 9.763068352816282880e-03 2.674739186972827087e-02 2.008603919115178604e-01 7.364983265310952321e-02 1.703583609816078370e-02 2.101340619341960925e-01 2.714033272812356110e-02 8.455659777696486121e-03 4.381695951414631141e-02 9.096478846055888745e-02 1.572555446092447143e-02 1.983562174678079465e-02 2.028501920970134098e-02 1.870360476378581452e-02 2.303656521168615662e-02 4.034148277983492376e-02 7.155227644079140137e-02 7.474415139586321200e-02 7.834675348257896799e-02 2.496994747490465238e-01 2.805597991893306609e-01 2.334769388565875736e-01 1.446786741644172543e-02 1.578091083219447868e-02 5.769493107009553839e-02 7.124856075881932926e-02 1.787689637867393572e-02 3.040126298319633866e-02 2.308983577341741644e-02
8.999407553282809391e-03 9.879663939469490383e-03 2.224875539264190710e-02 2.463400454592183653e-02 1.649555003430991720e-02 1.749880237203649616e-02 9.753762812205225841e-02 4.572045656453490800e-03 5.240251023041285483e-03 2.246646890414597253e-01 2.440543494180053841e-01 1.936028564028741961e-01 1.019116498486661963e-02 1.816336122941182574e-02 1.731558338146188883e-02 2.708171813080490278e-02 4.828699739871463587e-02 6.045185874918942992e-02 3.598229183111841673e-02 9.051970843497486596e-03 6.646514391383773548e-03 4.976053526176633934e-02 6.671237374128159703e-02 9.428164381620771084e-02 8.024084012915964903e-02 1.037290452089845577e-01 8.229328400525220966e-02 2.739182237752516014e-02 4.350899804310922464e-02 2.546238831069533304e-02
1.171069125960290565e-02 1.364633679560763382e-02 1.319906826213599650e-02 1.230964487586912182e-02 1.755166607342300775e-02 2.943006132170560701e-02 1.214882251478060712e-02 3.646547029697026765e-02 2.117060108903348267e-02 4.941058063702954278e-03 4.998318799368924210e-03 7.745410154105109198e-03 1.164156206623747150e-02 1.217779366077371625e-02 1.263812037341978910e-02 2.316670126601452079e-02 5.167911455766973500e-02 5.386606101011166131e-02 2.635033676064037905e-02 9.313823215962921745e-03 4.115973396279394569e-02 7.636726789825135087e-02 1.001077654672915540e-01 1.020997191105953300e-01 8.841233422863439828e-02 7.511579287738616439e-02 1.093254987199084871e-01 2.503161831568031029e-02 5.940976834006949509e-02 3.209783023583547695e-02
2.959862274331488685e-02 2.346995643366488193e-02 1.128866851052343252e-02 1.562950206255577304e-02 1.824891514452260943e-01 7.291818591663045204e-03 2.758691771946641946e-02 2.243599128823361294e-02 2.249303701371716674e-02 1.102890876668716214e-02 6.175791498032978492e-03 2.259805960092084731e-01 2.188389243404542939e-01 6.210228941196398525e-03 8.994804287467185813e-03 2.888202306662460833e-02 3.567546840216102855e-02 4.501934464446408213e-02 8.089043330383715799e-03 1.318484133178306900e-02 4.575885466168563148e-02 1.014721086426796509e-01 1.281541399961210470e-01 1.312226895158538353e-01 1.055771078987945699e-01 9.920223498489616487e-02 9.026463001687123899e-02 9.003041411789988735e-02 2.986410844354855376e-01 2.463079377380946455e-01
1.193904727276468014e-02 3.329077983659105289e-02 5.694292866938068659e-02 5.013317643259538291e-03 5.873502593685718705e-03 7.507470935789153227e-03 1.710739687967726200e-02 2.157484538312255326e-02 1.489093669731055697e-02 1.421905349426485360e-02 5.101966135631233988e-03 6.113172434112206649e-02 9.448061889983909445e-02 2.222635032109553377e-01 4.994552212453372796e-03 1.337366467720871137e-02 7.530493523685568950e-03 2.198245930281967353e-01 7.030801779617086578e-02 5.924127336607085473e-03 1.740193380506153270e-02 9.422809468733124583e-02 1.212207726667717533e-01 1.268183237659024076e-01 9.194824151161634651e-02 4.227007697355548294e-02 6.810121141271162359e-02 6.987024263642746535e-02 2.546437608786159684e-02 1.812712906800357515e-01
2.512861919377005204e-01 6.058398903581068903e-03 2.272352151117151831e-01 2.814929413123977604e-03 3.922250816759427841e-03 2.193082542777309487e-03 1.106698583914205933e-02 1.141491870069022939e-02 1.307796722616306508e-02 4.685003222809739493e-03 1.633845900374802373e-01 4.189993127745605950e-02 7.339584857540493168e-02 1.773597835035705950e-01 7.598447500451111468e-03 2.209639547617607298e-03 5.739921850660616859e-03 1.680351762953419537e-01 2.759691210189414434e-01 1.345188852502702398e-02 5.523440124265088791e-02 1.055027746316038600e-01 1.143252829804859289e-01 1.099448950648040241e-01 8.544288385102143113e-02 6.323296663270469575e-02 6.181820566352364682e-02 5.881361582606078886e-02 3.213924983756206166e-01 1.402729746820597645e-01
7.428067618694974596e-03 9.773740214489014602e-03 4.029950745823118567e-03 3.551247558069254434e-03 4.050824812690374810e-03 2.224672511378765483e-01 9.522408373190375738e-03 6.337673280094474788e-03 1.766881855207588000e-03 1.784271631156499616e-01 7.226154652536170842e-02 6.395128127560338605e-02 3.585680555206911813e-02 1.650708495175890259e-02 3.478382926399425923e-02 9.870762867319307632e-02 2.767792105772169057e-03 7.603499464863171936e-03 7.222791670160688335e-03 2.614446690571789814e-02 5.580637205179852373e-02 8.577013505410926997e-02 3.491067777060801597e-02 5.371738731840827730e-02 6.790410596820070643e-02 5.048718392489723317e-02 4.439668585598637723e-02 4.945009523993702111e-02 7.920770524764932097e-02 8.616142359058999445e-02
2.993436876138709252e-03 5.443843082322945628e-03 1.154995284650595921e-01 1.000339467679926819e-01 9.482577740638108155e-02 1.380495191683138445e-01 1.913716965880231102e-01 4.718821503676030177e-02 6.499014871392964909e-02 1.132920039188946987e-02 1.685174121952398921e-02 2.667781979779705950e-02 2.545481689357059416e-02 7.970594998498882477e-02 1.748259574949762862e-01 1.741430361922531242e-02 2.048492565667789367e-02 2.808323899610344621e-02 1.964459795950865284e-02 1.498040143734984293e-02 1.378344130802824224e-02 9.170208612065702813e-03 1.443672542707925832e-01 6.505297370541969666e-03 1.242807406678719806e-02 7.523038083954533550e-03 3.133824457891735138e-01 1.144721906346483908e-01 1.473729257805717063e-02 1.374783206505240420e-02
7.818697548976001263e-03 1.001375211085227430e-02 1.316978790745912398e-01 7.766185295918914822e-02 1.318210316430136197e-01 1.035188917618743154e-01 1.607956226635590402e-01 1.755503616944545028e-02 1.542469131895951411e-02 6.703590526095494148e-03 1.666708545216244453e-02 3.093976544876931092e-02 3.372055094970199951e-02 1.555038983574658640e-01 1.995291875392646297e-01 9.089487913705909805e-03 2.135030819523132603e-02 4.084733681300338481e-02 4.746937620019279352e-02 4.181208772178481026e-02 1.378352146468407591e-02 2.404440256875511051e-01 2.818107909345605733e-01 1.900106852214344250e-02 2.133844315907649364e-02 7.493065678609829063e-03 1.314954099570250501e-01 5.372494778201312993e-02 1.994894251557258538e-02 1.911475348731382293e-02
9.761054160951894085e-03 2.094401903591728564e-01 7.459183686148118664e-02 3.234407309962913230e-02 4.205552478485619083e-02 9.565996856819500294e-02 1.280062975832819139e-01 1.439746524619480925e-02 7.659691020021746136e-03 8.752484285197238700e-03 1.595654343774623174e-02 2.739157284413044208e-02 2.548044744984691648e-02 1.212065443103024498e-01 6.979208433153186696e-03 1.411525060217674876e-02 1.620975617885586292e-02 3.837375108372343552e-02 4.968848288604782448e-02 4.293083614445911134e-02 4.128094418591948811e-02 1.508931130148427058e-01 1.027645340652866973e-01 1.848455953057299983e-01 3.582439607636667828e-02 1.777589276109932392e-02 1.346721322535872171e-02 9.078859953529701265e-02 1.586712497627456100e-02 1.430881205592141742e-02
6.857597315723707593e-03 3.978548680767779108e-03 1.658910217755770744e-01 1.797604166836461459e-01 6.408625286108447956e-03 3.059238086393203382e-01 1.319363816619179564e-01 5.419534956178900797e-02 7.843612175929609576e-02 1.004826442711734547e-01 9.449594482692941569e-03 1.148021680613131416e-02 1.518744720361576636e-02 2.960373916194711935e-02 1.521318027731424494e-01 1.487304817622055880e-02 9.061107219383288114e-03 1.939483932072707736e-02 2.195003581426549499e-02 2.599702278657740201e-02 3.208468871603208789e-02 1.887458030368832085e-01 3.011657551722349974e-02 5.236569373375206393e-02 2.137697841588440117e-01 4.373106413131449405e-02 2.866876203956453609e-02 2.615589443341146542e-02 1.827250951462429385e-02 1.593053416953330720e-02
2.032975586927339862e-03 1.603878169665474140e-01 2.137607985080432482e-01 4.167897690367862173e-01 2.468013244651587890e-01 1.119300613058307470e-01 5.338159921923793516e-02 3.769730032361382627e-02 1.174040920175957320e-01 3.194791187108349424e-03 3.137525462439824664e-02 1.206363461096608518e-02 1.837181265313684447e-02 3.483674863186821125e-02 1.470541782286886034e-01 2.416295873604466515e-01 1.450097498883199110e-01 6.391665225726793353e-02 9.181757326311139333e-02 1.567042138200500367e-01 2.715385264973262380e-01 6.340838919773088278e-02 3.277093960527503042e-02 1.581657247469357430e-01 3.607268622330607188e-01 1.113232761381337810e-01 2.453019873397085937e-02 3.613796788556990908e-02 1.484322346697566075e-01 2.523251047894186500e-02
2.957865573281897274e-03 4.378853962691130197e-03 2.101413743761579855e-01 1.729778874613696893e-01 1.744457998856819847e-01 6.527577468279366357e-02 4.261634268266807635e-02 4.427449482311740514e-02 4.916582076593350309e-02 1.956054290011380314e-01 5.850966505102394438e-02 6.284514022908208042e-02 5.238190941859589139e-02 5.796365645280335266e-02 1.539162399358913191e-01 1.003902754029617900e-01 6.441943572256868256e-02 3.651014870579252086e-02 3.125158197224971873e-02 2.347865599345050694e-02 1.868105549107196284e-02 2.720316144638359676e-02 4.174569860658101927e-02 9.945438243358138697e-02 1.689992604688203282e-01 7.545732491091246275e-02 1.099091365665976622e-01 7.538794060638424888e-02 7.770398707490354384e-02 5.115036419577767557e-02
3.175617290483704735e-03 3.183445673158875056e-01 2.052859109455622277e-01 3.141129836948595155e-01 2.866762510967840738e-01 1.568233894042583842e-01 2.058317504256932263e-03 1.721716034188115968e-03 6.776247842563172530e-02 4.930335407779613127e-02 1.890519606096458319e-02 4.707222769023915870e-02 1.233930352105009343e-01 1.226209335979577819e-01 3.515117395390290334e-01 2.456186136604404657e-01 7.234672296653107959e-02 7.900655886465193789e-02 3.531047479159363234e-02 1.558137907003137937e-02 1.510842477967422499e-02 2.361122073782542796e-02 3.603010267967047403e-02 1.093041564049027914e-01 1.091528361259163638e-01 2.541471787495197879e-02 2.772508524246054470e-02 3.550036551042760891e-02 1.153977914058624127e-01 2.357005197102766264e-02
4.254753250539439029e-03 6.331834802824579111e-03 2.355292313687803174e-01 7.810965266660452842e-03 5.378727768848991231e-03 7.348750904547310565e-03 4.762584034842169342e-03 1.712086567595048903e-01 6.737328077315710151e-02 3.923518629291690429e-02 1.208975588089698967e-02 1.662370492458156712e-02 1.857832010838407488e-02 6.729208245740019023e-02 7.872706027836152975e-02 3.212106837714795438e-02 2.507748239248497671e-02 2.510259043777373147e-02 3.354132153306248892e-02 1.941407992211066635e-02 1.380966006934759328e-02 2.062860774227907174e-02 2.359959895812627217e-02 3.897649169517871520e-02 1.195466932263670873e-01 1.851043207524926890e-02 2.649326199527319431e-02 4.327531629540706110e-02 5.211162718518271009e-02 1.033437829211412279e-01
1.521994923417182817e-03 6.845722200564484557e-03 3.654407006461591889e-01 2.454870085305381738e-03 5.844621427182166741e-03 6.105508802276859472e-03 4.956362927478192085e-03 1.198160200337265169e-01 9.215732609326414415e-02 8.591371664922918538e-02 3.536278085842729790e-02 1.827910815491296317e-02 1.169242634369980181e-02 1.843540427821952279e-02 8.310274507029426216e-02 2.115986312085046950e-02 5.528229451423431751e-02 7.632650431070068034e-03 1.355658025865862787e-02 7.499750212810923911e-02 1.941972981309702043e-02 2.722544778155118472e-02 2.375794915415885278e-02 2.587542173182191471e-02 3.382971986235206591e-02 2.553266351970068931e-02 2.968733359895732449e-02 3.646163760947442739e-02 4.897256329566188754e-02 1.199314617114976833e-01
