2.502831834811193763e-03 3.675270448490085794e-03 3.253278938270718571e-03 4.171458821156930064e-03 3.217443265484936938e-03 7.136313539810873116e-03 7.143010362150798050e-03 1.951061258691618241e-02 3.570770828103131400e-02 1.613568508472083829e-02 7.493393395652443202e-03 1.712993422903222535e-03 1.006113291745022774e-03 3.749271437314715457e-03 4.348464534746707653e-03 9.498597434976536894e-04 3.382715430109943435e-03 6.035456185557861418e-03 5.568856807063518079e-03 1.984042731294413144e-03 1.555123613567060926e-03 2.203406931604073491e-04 1.661316312682731408e-04 6.383834110092952456e-04 1.181091217658210247e-03 8.810002111962540088e-04 3.857497281434088586e-04 3.435970563354384541e-05 3.288346690209035801e-05 4.119067938407513092e-05
1.999149804158347962e-03 4.406975735960685231e-03 7.973308313174328615e-03 6.571531820097236028e-03 4.611878681288588723e-03 2.082948468710843493e-02 1.000509539104509765e-02 1.280627099470488771e-02 8.464732662966758733e-03 7.226033622074820237e-03 5.075227675870781947e-03 9.863121019027870293e-04 1.307169512334353930e-03 2.994602626561599767e-03 4.189660491370205374e-03 2.681899702982967152e-03 3.376180188551112550e-03 1.135714134628757269e-02 8.820450843139761646e-03 2.708348403491221083e-03 9.328652767495918376e-04 2.046127637281662786e-04 4.165693748181661851e-04 3.530647749066317476e-04 2.922665127798895778e-04 3.663926059391544275e-04 1.212654493945383450e-04 3.241274469271043156e-05 4.766597227340944594e-05 4.896609126299091691e-05
2.443747912168964254e-02 2.463991146722701794e-02 5.211219190032161108e-02 4.244306635996190208e-02 9.002400341029780095e-02 9.237241197457675412e-03 1.740781066224080745e-03 1.901351126280581604e-03 3.112180748979382836e-02 9.450639997408067858e-03 2.510071830379959762e-02 1.649129984925507691e-02 6.029166100780281555e-03 8.874174308170895351e-03 1.710226539810728039e-03 7.202195847272165399e-03 4.956984946132962991e-03 1.051704214290821900e-02 3.639856097491968312e-02 6.237931083512298150e-03 5.770408595180745708e-04 1.636960424040056670e-04 2.425222026545208567e-04 8.038466765302196098e-05 4.446708677067092287e-05 2.724052113804473915e-05 2.238283960083662958e-05 1.881672785761832084e-05 3.383538065663370663e-05 4.015759027489664446e-05
1.147700393074978578e-02 3.264537179398350336e-02 7.166072026419641194e-02 5.791621290052463567e-02 2.358486481004647486e-02 3.669732377240995588e-03 2.941653226372447066e-03 2.015311923369394933e-03 1.257983923968389924e-03 1.178122938941860050e-02 7.530309721499438974e-03 1.479050944827973654e-02 6.658189908441047335e-03 4.435900040150220387e-03 1.307569048355443310e-03 9.935684552038036993e-04 2.116040510143219356e-03 4.069068886168214667e-03 2.967382773542011874e-03 2.589868512763975755e-03 1.145250615280513171e-03 3.834890860800788158e-04 1.168395746586344230e-04 2.136916307989885754e-04 3.688622850535587804e-05 2.501347179669116116e-05 1.974312539593181483e-05 1.994741486504633592e-05 4.254848274640784384e-05 4.949866454467654323e-05
6.669986131190770197e-03 2.058715224331626042e-02 5.749837652166552016e-02 2.228281311879052110e-02 1.262124971111539332e-02 1.853015047011164233e-03 2.881213840256987343e-03 1.628532049166571882e-03 7.707160895856668588e-04 2.699168659456457550e-02 3.392977752322348661e-02 2.850681160734682557e-02 4.176304058948073460e-03 3.428727533082888933e-03 1.591374456414520544e-03 5.862136726677492264e-04 6.362733138795199049e-03 3.727726770417848657e-03 6.105269997439566679e-03 3.560501692292028595e-03 2.438694681846181444e-03 6.697210260789659931e-04 1.437930134720153243e-03 3.724859996920515067e-04 6.926880830014369740e-05 3.496449651877452677e-05 2.250493133509449091e-05 2.783207031986252973e-05 4.591115266449957363e-05 1.817900723965150856e-04
6.695430894930388087e-03 6.983598218376822417e-03 3.131941843419330795e-02 2.509319229075138158e-02 9.886945876519007831e-03 1.070535648663591220e-03 1.326260096815272058e-03 1.441876291295395279e-03 1.379238078738691644e-03 4.192373928515628900e-02 3.297395152951915903e-02 1.713559175704047061e-02 1.931588993602801957e-03 5.708847909050920877e-04 4.240032526088808608e-04 6.792858507903134840e-04 3.568759244379478800e-03 9.452196781848047191e-04 3.096667347390588514e-03 1.079890840174623119e-02 1.312427740588702207e-02 7.729498112970046089e-03 1.896205113629553449e-03 2.319736383998566157e-04 1.076009400738780217e-04 9.531842438470024455e-05 5.525748846100930750e-05 4.092390238023757771e-05 5.711143231528996699e-05 1.114813786048365267e-04
9.359641994177804241e-04 1.480226679205460171e-03 1.567068209624627789e-03 7.953465988892793881e-03 3.811811297444336975e-03 6.389324370185052795e-03 9.834351073202386717e-03 5.682057151517168510e-03 6.859358583772011062e-03 8.016172112155384166e-03 6.184816291014391502e-03 2.525049255376770208e-03 1.026089405900219029e-03 3.886538349746405160e-04 1.988928993323707734e-04 3.441783478989927599e-04 2.033814505226841374e-03 9.746480050706559685e-04 5.012158841736700371e-03 6.902447670743164926e-03 3.187605313253416735e-03 7.562115701020634450e-04 2.914306668226726202e-04 2.171820532194133142e-04 7.605758531857393040e-05 7.350857411959069642e-05 5.994529236756038779e-05 5.628877226794038613e-05 6.940444099713665045e-05 1.797830434867376311e-04
2.020882291924003954e-03 3.701395784982883502e-03 2.175473517088152928e-03 4.711934497988868112e-03 7.280031874400474078e-03 8.271331245547368718e-03 7.409234286306016007e-03 7.057416470811006884e-03 5.676344574055229401e-03 3.187992979965421480e-03 1.284450192418476900e-03 3.969248197717954729e-03 8.441941801352154887e-04 2.767562558519033752e-04 2.784119653543654571e-04 5.064347490561431180e-04 4.215952409922806877e-03 6.829063895584872555e-03 6.032338343926626698e-03 4.292495826369721254e-03 1.165352343253560699e-03 5.422001435747110997e-04 1.806424220957429975e-04 1.353010690286407655e-04 6.053355048564662745e-05 6.010896071264338480e-05 8.784313156208879789e-05 1.202363389314567855e-04 1.305618948307774680e-04 4.159895663564008687e-04
5.383370400140452192e-03 3.554181898062643789e-03 2.091255109282971758e-03 1.221968866678319575e-02 7.970061687677242046e-03 3.398544804184677921e-03 1.097449195798918045e-02 4.948170588182519182e-03 4.121086495811381034e-03 4.080162902807700151e-03 3.648973280273749755e-03 4.828292512393935962e-03 1.058111036203354671e-02 6.934714448610131490e-03 1.033021676851795818e-03 9.514811379931621509e-04 4.185957558548466725e-03 1.284086596594864044e-02 1.268382031678664569e-02 2.103878138908140197e-03 3.275708765222899266e-04 2.489817296810870441e-04 2.315213111652012119e-04 1.370772764338460444e-04 7.581268332853367538e-05 1.110981785342150937e-04 4.000714556007433286e-04 8.835395352641807693e-04 2.767856799268423977e-03 1.472294644215071122e-03
8.972234838436178930e-03 5.913308976913365239e-03 9.489291143802256953e-03 8.996140549560355248e-03 7.914016281601758684e-03 1.566699725408808065e-03 7.204672722019111672e-03 3.059144098805980511e-03 1.263774679425097840e-03 4.782030969513703417e-04 7.042982419762661844e-03 6.926314353512014188e-03 1.477238313561425945e-02 1.619972818174228793e-02 7.785577433398640883e-03 8.645863252503773258e-03 4.669682852891043207e-02 4.854399708475806707e-02 1.938987343108447212e-02 8.581398076506841291e-03 4.165978895608131905e-04 1.945470456982086103e-04 1.953360645022318178e-04 1.986794753921584998e-04 1.042704617211221270e-04 1.286840207176002460e-04 1.167383117355344111e-03 2.198909229330205627e-03 2.966612077834223423e-03 8.358368724010746239e-04
7.409928285617595201e-03 3.930341915020501599e-03 8.855586168861782556e-03 7.702188654549030865e-03 9.816782754534549016e-03 9.017844312043343758e-04 7.450759939389271390e-04 6.397499592220950949e-04 3.911003287989666430e-04 3.547977211078881705e-03 5.639043958282282526e-02 9.535458211840952547e-02 1.990121428296663941e-01 9.943557944627082201e-02 1.852329495440691032e-02 3.680926710983253164e-02 6.890318807204760809e-02 1.905002261978206574e-02 4.513435778199233021e-03 8.947655572125753996e-04 3.003277499235193059e-04 2.054010320308417316e-04 2.391469714262933050e-04 3.179640708799390779e-04 3.248112571547275159e-04 1.693137424874575675e-04 2.591714228172201898e-04 2.239105067201654909e-04 2.142241580881894313e-04 1.623122872062411984e-04
1.343065039595251397e-03 7.986637207471491582e-04 7.175312617023916865e-03 7.224406672211611952e-03 5.677731859710309116e-03 1.290903525109590505e-03 4.883533489372476584e-04 3.063470216408519247e-04 3.697580596054127612e-04 7.018577966204598770e-03 1.733000482385710361e-02 1.152573759469328468e-01 2.084912122501369758e-01 1.083355537353985487e-01 3.905425141608447059e-02 4.414036015376205518e-02 4.899790846686174345e-02 2.896534458873220585e-02 7.118866677608958263e-03 2.011451031589405174e-03 2.963665388568187593e-04 2.620324277646931752e-04 2.940955632154928210e-04 5.165209222895983388e-04 4.849727001229012409e-04 3.371763779130373560e-04 2.524829204016250861e-04 2.369296627704233491e-04 2.620716048864509375e-04 2.869083993994606596e-04
2.515053505544320657e-04 6.532512005486826789e-04 1.643790047640538441e-03 4.778750033969274454e-03 3.166782587525717677e-03 9.926136566189573858e-04 4.931429099376183258e-04 3.977530945574089252e-04 4.830820530665242318e-04 3.524339073286852746e-03 1.194499360709159498e-03 3.695165876104804931e-02 1.565082059245581914e-01 6.666965304988600738e-02 2.078811287726390483e-02 2.385903248965577650e-02 8.870386159433729309e-03 1.311534510821344909e-02 1.502642432467262389e-02 5.655740558496426436e-03 3.790209023355824332e-04 3.412823574372597928e-04 4.133256281445333810e-04 7.109067715607282579e-04 9.328797677792549517e-04 8.730683677614531910e-04 6.429024007011043419e-04 5.888462452721621382e-04 4.527176333675830941e-04 3.463975510066828506e-04
1.945846093454067663e-04 5.600980730285196225e-04 1.075645012665838720e-03 8.106892853601169006e-04 4.894430852043059549e-04 1.890900952228367817e-03 6.364811047968306143e-03 5.361555373770432627e-03 6.787207679078386150e-04 2.138301689173451763e-04 8.828895057316725600e-04 6.069574139565444594e-03 7.194949141197021225e-02 9.584643902103150148e-02 1.003959986741797955e-01 1.330613206253619951e-01 1.210357780798288763e-01 7.970800996446199271e-02 2.206922054865164406e-01 1.036709349877526914e-01 8.636421959261300629e-03 2.525123015278059411e-03 1.924063020649639496e-03 4.909833962660745121e-03 1.158693482527920447e-02 1.100836211227070038e-02 3.046849672412519500e-02 1.005528181753152957e-02 7.908424605057388359e-04 7.408029604263864643e-04
1.756688188364599536e-04 1.768007877022081357e-04 5.063762328792210119e-04 3.869563040880273034e-03 1.419269822544685922e-03 3.283936118924301825e-04 4.256041342395647763e-03 1.231615746560858239e-02 8.268876473711083905e-03 8.616221970800443802e-04 1.866920646995129558e-03 3.024905176566930823e-02 6.451922883283400800e-02 8.067465625829098319e-02 7.162825552774064464e-02 8.496772554175445469e-02 1.467878077402310633e-01 2.577534104460872388e-01 2.663185721199084477e-01 2.122636632015768576e-01 9.221862267105996117e-03 9.801119868770255886e-03 8.923773396430004570e-03 2.837350500088229796e-02 4.127779856281068444e-02 2.134685513125155476e-01 2.153077047810955658e-01 4.362829281979305196e-02 9.527526470380956979e-04 5.544552294220577706e-04
1.542593535072562248e-04 1.685850520247154135e-04 3.967471160341182147e-04 4.434755064101338030e-04 2.926345812344268577e-04 3.293106882075793880e-04 2.342043090692833701e-03 6.674629852094176100e-03 1.390183977780909408e-02 5.024669295549438058e-03 5.264073143551305581e-03 4.679940319616411951e-03 3.656178977660620028e-02 7.306356565918666057e-02 6.711463481668844544e-02 1.011906693518231093e-01 1.775509616649735833e-01 2.192078375648858768e-01 1.285495812948931060e-01 2.848597452765946544e-02 1.754829338111459427e-02 1.237577528841956875e-01 1.855007968962398279e-01 3.136266584630162391e-01 2.956903726763758788e-01 3.873367930055388597e-01 3.111506372315323565e-01 8.896919063835558028e-02 1.501458042978892366e-03 6.658520844270286081e-04
1.879135366483978946e-04 2.181195697438905649e-04 2.161795521026919518e-04 2.051778039177338598e-04 3.086304517891858739e-04 6.486995749850251727e-04 3.850069686002571823e-02 1.308183335394399460e-01 6.444304301772772747e-02 1.112999227556961922e-02 8.342372340937475109e-03 1.315871636781741280e-02 2.607235047160628982e-02 3.803925437043523261e-02 4.965975642940939627e-02 8.790186676453655423e-02 1.921598288447733949e-01 1.963040035938731775e-01 9.423673825747126698e-02 3.296177258262171506e-02 1.467704364237065184e-01 2.749094004064374652e-01 3.639717324318666458e-01 3.746342829448553458e-01 3.281552678261260292e-01 2.827350519665028372e-01 4.167713370328436362e-01 7.228824273068268358e-02 2.286914322455474782e-03 9.484080366429100371e-04
4.491659809749833868e-04 3.535301131928003594e-04 1.843317286341611795e-04 2.865997916827292590e-04 3.671298993267039287e-03 1.875501847043424541e-02 1.064175023753553689e-01 8.809893017908941582e-02 8.751095635744222945e-02 4.401803922743402486e-02 1.621146701594312900e-02 4.398188048946377257e-03 4.303722977401411819e-03 1.096291123027518487e-02 2.451591119167683894e-02 1.114716636092785568e-01 1.187524568230092226e-01 1.401916803377938892e-01 2.473827963062523103e-02 4.455989285923641491e-02 1.637833843460078931e-01 3.668144633872849059e-01 4.677141135846570874e-01 4.833891814624471928e-01 3.935209175752499844e-01 3.756645998150347499e-01 3.462843307792020098e-01 2.717814564988547121e-01 1.197355105285709091e-02 7.812213934893691251e-03
2.033827990756491538e-04 5.580174936516554222e-04 1.021099562734960765e-03 7.042098188140916148e-03 1.553079991528020891e-02 2.199307727801851076e-02 6.927570826022393102e-02 8.647376554427389783e-02 5.916746199852629395e-02 4.628916600818775567e-02 9.752970678287151834e-03 9.625731315636219636e-04 1.471424548278756420e-03 4.162697522241974417e-03 9.075389848585069946e-03 5.347386362627327278e-02 2.061587333893510551e-02 6.647040517448069528e-03 2.251100375040308507e-03 1.655441391005244359e-02 6.416874633295270580e-02 3.477998881872784720e-01 4.476000449699443773e-01 4.696835079439207195e-01 3.425917047096057599e-01 1.589206446465203093e-01 2.580792132348185275e-01 1.752525290184762385e-01 1.571505280584825984e-02 6.111577703425822780e-03
5.215732342155130451e-03 6.692796767671804585e-03 4.455564340168884779e-03 5.513477552933188086e-03 1.287199159170143020e-02 7.295321239072988413e-03 3.690712069691554076e-02 4.687667151857585063e-02 4.248898755459464688e-02 1.007782191538957907e-02 2.549028291236992479e-03 5.444196488021836155e-04 9.677249338966083681e-04 2.893762297542897249e-03 1.161441458712592426e-02 7.887225467657753980e-03 1.450466869830901485e-02 4.314373971392854862e-03 8.165270552011008598e-03 3.897649433446041117e-02 2.102583569942226283e-01 3.977789057214307644e-01 4.267077981926788444e-01 4.089565786826139249e-01 3.178840235888485410e-01 2.357741969274846361e-01 2.307507175956365897e-01 1.540382358355591730e-01 1.379108325110102798e-02 4.848694345549220061e-03
1.525636750636695863e-02 1.390311725474639368e-02 7.123215689563733820e-03 5.104696901233548439e-03 6.583657290966000997e-03 3.446667609473855545e-03 1.896307185969078532e-02 1.638210816905086992e-02 4.351995091171082831e-03 2.393324426898968058e-03 8.382070431411458135e-04 6.790369674883405763e-04 4.200418899846321730e-04 2.434318409153634732e-04 6.585859104248468912e-04 2.308134656390426268e-03 8.308729042587141220e-03 1.901883574445314626e-02 1.837475914822776432e-02 8.181518265357287656e-02 2.195983016709562030e-01 3.118270611600982845e-01 1.243711545308800598e-01 1.898539300958279330e-01 2.519518643033945016e-01 1.463512398052927155e-01 1.112481012145405401e-01 9.057301664647617045e-02 3.307353570211660730e-03 2.968135897245832537e-03
1.246978638975092604e-02 1.424664094983668812e-02 2.099533996891645837e-03 1.452693707533197088e-03 1.191304402766348936e-03 1.727168043212452993e-03 2.358580910431709501e-03 5.633820362264141965e-04 6.992569371802268572e-04 1.133964282478351529e-04 1.547120512751555814e-04 2.432478072172460733e-04 2.816661615553900204e-04 1.061631577086776098e-03 3.160841546075161823e-03 4.306005762223503314e-02 8.322980653765202352e-02 1.209437155874671238e-01 8.292187048969093532e-02 6.182055038105229577e-02 4.248643381399461877e-02 1.471602607504674497e-02 5.536547534519995276e-03 1.227299791086637268e-02 4.597016453159807892e-02 1.601450297477534021e-02 1.501088877426350575e-02 5.046240271247161464e-03 5.767812873431409863e-04 4.720648579196823021e-04
2.580902477300099640e-02 1.968063118800613548e-02 2.128190521048504980e-03 9.252253078602117216e-04 1.368814755631761471e-03 1.041392300421492079e-03 1.543783906620230023e-03 1.582007574947761296e-04 1.284405457718408171e-04 5.736901066621191101e-05 1.405622603009000840e-04 2.723303053370410140e-04 3.787229134272045985e-04 2.166399334017157091e-03 3.780376504842103674e-03 2.500590013450796484e-02 9.264369769650750153e-02 1.743511144403289415e-01 1.991009651097364608e-01 1.715123952953944153e-01 3.546634061362306106e-02 7.701565683971436406e-03 9.348888200595793091e-03 2.349862396829085001e-02 5.357954857727768860e-02 1.616950766196941641e-02 6.225790895526155978e-03 2.342103039374464520e-03 7.424087863144834256e-04 6.723799701139881319e-04
3.157521530192307357e-02 3.984524979963604760e-03 1.108260256827289488e-03 3.696940386519058960e-04 4.268094343843541151e-04 9.150396275703276058e-04 1.132606820287625563e-03 1.214488459953298407e-04 6.431897764335844296e-05 7.594848770777633035e-05 1.377553963366585455e-04 2.394746549778761801e-04 2.823819890332803558e-04 1.662997511539435636e-03 6.880051400793145075e-03 3.505314804315999566e-02 6.916966591543734222e-02 1.617391062532405055e-01 2.064922136460249080e-01 1.749885158839012966e-01 8.567335807155750105e-02 4.844777160833191147e-03 3.393397557274253473e-03 7.485979967038128638e-03 4.380835053767913323e-02 2.687651451447913009e-02 2.432461250795762628e-02 4.568959122454963745e-03 6.577179632821748834e-04 4.995729496838412177e-04
1.707484501701432567e-02 5.246122404096406275e-03 2.073158504027006622e-03 1.983839454312080405e-03 4.503446864125745276e-03 3.020661424350372989e-03 1.205206716922425838e-03 4.739419337772399058e-04 6.879396068533555862e-04 9.078376821480223019e-04 8.572552672912171453e-05 9.745693237400858996e-05 1.578204124232848986e-04 3.811804485426685085e-04 2.455447748674178567e-03 1.056112491624864279e-02 1.092624031807338213e-02 4.770446788326473953e-02 6.248162605444635559e-02 5.438887259686159270e-02 4.536743292680160689e-02 5.811349215361748775e-03 8.911281884154128663e-04 1.765361297091755507e-03 7.870908065725559788e-03 1.998974766648542456e-02 5.382700875018373021e-02 3.041087233021822975e-02 7.514388117502385309e-04 5.559667945404955401e-04
6.085619755351887386e-03 2.398692306113666545e-03 2.618545952867427657e-03 4.534301106166406525e-03 2.530797357454270605e-03 1.111216759220776248e-03 4.924162593647946930e-04 3.326088253040553186e-04 1.025303061562538465e-03 4.014258900030851646e-03 2.762563703595713590e-04 9.576278135840768564e-05 1.685428962438858690e-04 3.935093913551148759e-04 1.983779556199770887e-03 3.741182692791408023e-03 2.654048986535024676e-03 1.353019933379893350e-03 2.193072782808492410e-03 4.078141293215402884e-03 7.307648094276203952e-03 1.683942197775816461e-03 8.792453841926344818e-04 4.554126046534882205e-03 1.114105200447130378e-02 3.995471164804973059e-03 1.383356636471328067e-02 1.564721095119359431e-02 5.546751694752361482e-03 8.359057865673472391e-04
6.166922029890086962e-03 4.917513675583766973e-03 2.451301728266926279e-03 1.840873418860936852e-03 1.747707493184300510e-03 6.421360678478553376e-04 4.101254545898139875e-04 4.048667249027303812e-04 4.356325610664263707e-04 1.756856632166138013e-03 5.018354113974377723e-04 4.797993376360938796e-04 4.726287069932556080e-04 6.320138500978578384e-04 1.950647648183006849e-03 1.445429015722741713e-03 1.044847553867783024e-03 6.652681515986590827e-04 6.210817763639790712e-04 4.970448346906135902e-04 4.068964788814230299e-04 6.121279985914747715e-04 1.005700320722770387e-03 2.602112115450401150e-03 4.662446494382644843e-03 2.271849635327935490e-03 3.659500122507925671e-03 2.485519889094330546e-03 2.530812497413231169e-03 1.627185744004216485e-03
8.376667149966801965e-03 4.339832257902287264e-03 2.521203039931135294e-03 3.524272068670528633e-03 3.163821980039461731e-03 1.684097841898624451e-03 5.560874410357934637e-03 4.057088565877175340e-03 5.834864370772962616e-04 4.278054043584790609e-04 1.545367442982470169e-04 3.577776018189171158e-04 1.110315527765200422e-03 1.325527490820380605e-03 4.393094748920341706e-03 3.513357616340480327e-03 1.192052542866212355e-03 1.511865886678677353e-03 7.426004609321553438e-04 3.352161959528585913e-04 3.102465156963377080e-04 4.829397113016180754e-04 7.661294704100317246e-04 2.539857009690084204e-03 2.740036060665188532e-03 6.851886100557359489e-04 7.838577940088456517e-04 1.041507857846075318e-03 3.475956512321633132e-03 7.238052768357596109e-04
1.129389981219945313e-02 9.714379701189509650e-03 3.011185311075563736e-03 1.052157551296996514e-02 1.249915021696570289e-02 2.318063099846599459e-02 1.508409128047992140e-02 1.653203020329884051e-03 5.805435000817883587e-04 3.392990647624945125e-04 1.012193133637503479e-04 1.272813762791633215e-04 1.667582276088270003e-04 7.298937484503624637e-04 9.898745168289758457e-04 4.803847162098272717e-04 5.068320616387625909e-04 6.690831754505198936e-04 9.738627126431364861e-04 5.334955150576677812e-04 2.865481182697665065e-04 3.911776741882995196e-04 4.407384405081813989e-04 8.135888848692208282e-04 2.786058499843860857e-03 4.725144997410751779e-04 7.184371807184945780e-04 1.238451481642686893e-03 1.561989900833731133e-03 3.162789966976353208e-03
6.255969800937758070e-03 1.543771317085544138e-02 4.700139084714694340e-03 5.123898983759281496e-03 2.530191602816773272e-02 2.662910454813292513e-02 1.751113903088779775e-02 1.187108358365562789e-03 8.293919782762613916e-04 7.907585775216992123e-04 3.270391466083135941e-04 1.625738731875241345e-04 1.093292822610755251e-04 2.081325752837471317e-04 1.079485008636243666e-03 3.399487005611005774e-04 1.333666455348685685e-03 8.920077417938244990e-03 1.700350607933202168e-02 2.390016862119333837e-03 4.578920175262744851e-04 5.809931083117165010e-04 4.934595696503803804e-04 5.904997989355765219e-04 8.525068023121989361e-04 7.050284842217794399e-04 8.724061126224870151e-04 1.113639006886724299e-03 1.562503308983658780e-03 3.892289479313294082e-03
