5.198559005891429004e-03 7.582956193270642617e-03 6.576474623686753840e-03 8.278531870487286851e-03 6.224530024125164360e-03 1.355614846682473909e-02 1.330988798288213967e-02 3.569619061604088761e-02 6.451768168351917909e-02 2.886936309360186442e-02 1.340076899982035538e-02 3.040166087425145644e-03 1.765313965651799100e-03 6.502644482067254303e-03 7.502526253461934413e-03 1.637925563670394576e-03 5.789864526016099203e-03 1.018758590756200025e-02 9.312748199518966485e-03 3.296587384165804331e-03 2.600702065882712355e-03 3.702789261545572151e-04 2.142295962420535244e-02 1.086714738404569386e-03 2.020622874708914805e-03 1.518532445733453574e-03 6.724934134977327178e-04 5.037052393834390643e-03 4.754635653056428490e-03 5.909395038321789764e-03
4.070054646214726728e-03 8.828130629978340332e-03 1.588364780891452638e-02 1.286352005918687744e-02 8.922804497496538215e-03 3.976152146061195242e-02 1.879964659513279693e-02 2.319970735598823885e-02 1.501190376534768806e-02 1.281271881847785218e-02 9.199855112166050591e-03 1.805095238035638993e-03 2.382118540800328473e-03 5.353542542106505715e-03 7.323209316607463132e-03 4.635152535868437319e-03 5.714042040333790901e-03 1.867573483106427581e-02 1.415459801618506111e-02 4.269554764551125592e-03 1.490979549949532227e-03 3.270931979012812801e-04 6.704571699356475390e-04 5.716576384340214074e-04 4.787015334907036498e-04 6.087058211428432496e-04 1.916716068734018036e-02 4.953764079025372441e-03 7.039489488844344681e-03 7.035183074881859802e-03
4.936735418286873622e-02 4.851143005440321926e-02 1.027137058191832653e-01 8.285426127956156683e-02 1.771815419341424280e-01 1.799185895205852523e-02 3.344661749370376157e-03 3.527082708819217691e-03 5.638087547367603980e-02 1.739215133056827567e-02 4.751751538201151592e-02 3.187798542011292813e-02 1.164921270820012261e-02 1.668441306251355893e-02 3.100170352826603186e-03 1.269347479642093587e-02 8.419494762735487206e-03 1.716464722603663548e-02 5.705391962884229923e-02 9.461890817561579778e-03 8.841670666410918894e-04 2.498946721033001687e-04 3.709286118720663298e-04 1.100911730473920491e-02 6.513631269305087540e-03 4.298380854248513155e-03 3.817291886680561006e-03 3.024037314737786867e-03 5.137451784178724036e-03 5.814458820435224745e-03
2.290883003049463268e-02 6.335001364710045324e-02 1.392260442486217831e-01 1.115710805674812456e-01 4.626099844817949114e-02 7.120208328750009252e-03 5.618643570043340210e-03 3.697405554036759141e-03 2.235936497711037748e-03 2.120466964071079236e-02 1.382416134347166925e-02 2.791167520552183257e-02 1.259906580823234000e-02 8.239291902637072007e-03 2.350733681348620568e-03 1.733338722395714928e-03 3.563677027827928667e-03 6.586199443017130839e-03 4.654628647834902974e-03 3.945333321075545144e-03 1.759037137257732277e-03 5.857518409985832970e-04 1.479619035527628655e-02 3.267429942914709716e-04 5.277282121477745724e-03 3.875662506573922771e-03 3.311724118965849589e-03 3.131202623126407708e-03 6.239276677828085524e-03 6.864164501239534977e-03
1.328652290755364708e-02 3.996226379946405532e-02 1.112612711341074284e-01 4.308712843422810718e-02 2.489320521610023651e-02 3.601301066074171636e-03 5.440083553618402928e-03 2.984084202118555528e-03 1.354365605484936230e-03 4.807502269809044854e-02 6.092726037876407263e-02 5.300751756907388923e-02 7.816093555033954213e-03 6.317912055466093704e-03 2.857979479146101343e-03 1.016573191533831980e-03 1.071966355902357129e-02 6.081519324966788362e-03 9.730168801568545023e-03 5.510275994957080509e-03 3.741388959056548592e-03 1.020461022466416599e-03 2.184302057069221689e-03 5.688872057759710409e-04 9.511084719405510368e-03 5.183646949061507421e-03 3.597461575845727587e-03 4.158774691977248569e-03 6.382776995276442586e-03 2.734171780396158478e-04
1.331205385599393623e-02 1.364464629008680686e-02 6.104718207157655563e-02 4.878774265475729899e-02 1.939323340161843920e-02 2.053724142323050308e-03 2.456140208703411643e-03 2.587023020306038028e-03 2.375274856434920513e-03 7.318843621425567825e-02 5.818994185444208156e-02 3.129215437579371123e-02 3.560487678260305325e-03 1.037386978914437092e-03 7.523713013417648518e-04 1.164618031511931162e-03 5.979006180337565445e-03 1.539706545616572816e-03 4.956028299257919136e-03 1.688124747328759168e-02 2.032971474067535658e-02 1.187107470057633708e-02 2.887688367146275421e-03 3.541515670658848406e-04 1.427020643937845085e-02 1.364230420432533883e-02 8.504549626355668857e-03 5.857719614141321945e-03 7.559822441614775027e-03 1.381388876324852327e-02
1.860439491280904602e-03 2.911878912063315620e-03 3.069078698942856974e-03 1.551555192863342432e-02 7.419463704409491947e-03 1.214155959622665280e-02 1.802616178914741643e-02 1.008181082242470133e-02 1.174096194148126562e-02 1.394419016120191333e-02 1.092261797461228923e-02 4.584866090514646934e-03 1.878880658444373334e-03 7.012318562036124261e-04 2.024666781132806320e-02 5.877533751941617585e-04 3.402088971959511300e-03 1.594756908387203690e-03 8.070819915316605406e-03 1.091622334746129158e-02 4.976437528208469373e-03 1.168183467254703400e-03 4.436547748016292456e-04 3.312029815387541962e-04 9.771109982892935489e-03 1.020435757453704018e-02 8.956623871019434024e-03 7.772933712153644314e-03 8.842654561003537167e-03 2.132556160290594027e-02
4.114070985866706900e-03 7.500576173079219477e-03 4.350490575863161236e-03 9.305894205678948150e-03 1.412884802054229297e-02 1.559111749901558909e-02 1.352248650418706732e-02 1.250185068400700740e-02 9.861396564937788961e-03 5.635270884233118532e-03 2.307339754292830718e-03 7.245194795061131454e-03 1.540032760040884819e-03 2.697099170302255308e-02 2.753302516789464874e-02 8.673935248195675188e-04 7.096186871395885991e-03 1.128491948352331256e-02 9.867453846409217008e-03 6.967972109267106876e-03 1.868659590145518769e-03 8.529807589629147951e-04 2.001363640891749493e-02 1.566686634271772377e-02 7.442541853990011086e-03 7.887108827851060586e-03 1.222031697885274729e-02 1.540858585577115775e-02 1.542933635961387176e-02 5.911178104437691139e-04
1.108751637990255251e-02 7.242481090444301620e-03 4.195173498151957142e-03 2.400633785590518265e-02 1.537339727877548926e-02 6.378321928587296630e-03 2.015055476248542310e-02 8.847439453419394390e-03 7.284437026062334959e-03 7.310170581141359376e-03 6.619507214069026563e-03 8.841502049585772335e-03 1.930399616671709187e-02 1.242311041591130476e-02 1.815163501693993486e-03 1.623053211091794387e-03 7.003146401046838124e-03 2.119093771657986139e-02 2.086555164643870419e-02 3.467326604763051011e-03 5.313685916811153971e-04 3.940906592234490386e-04 3.547610769789835044e-04 1.540725930331852955e-02 8.949381826678329266e-03 1.381335452174655212e-02 6.157004808119735184e-04 1.300988842345517007e-03 3.932777961888717262e-03 2.033232765050140261e-03
1.868709131667753431e-02 1.212617898555865166e-02 1.916359743172843869e-02 1.758802656963751390e-02 1.516061042581844098e-02 2.931116758605146252e-03 1.334083588239754620e-02 5.549536353929429913e-03 2.274748012071312747e-03 8.637255776977828146e-04 1.277691223964921158e-02 1.253509809382523030e-02 2.658081471031339960e-02 2.861656354210316555e-02 1.356247483414662475e-02 1.465780806451644561e-02 7.819955973357317625e-02 8.101452151284696535e-02 3.260618388503001841e-02 1.448980746738181072e-02 6.875540979826700975e-04 2.042295011040827502e-02 2.079969481965445247e-02 3.028191728553030035e-04 1.185023478841200698e-02 1.524285633582454086e-02 1.775051443970577895e-03 3.186991017871836085e-03 4.136956125047558039e-03 1.128475663947517719e-03
1.548419798610649149e-02 8.054657547281351970e-03 1.783949696677114560e-02 1.499645890516349347e-02 1.877976207869481301e-02 1.693515641890604726e-03 1.393874627959096855e-03 1.181788109352196808e-03 7.178302891300018720e-04 6.496170138035786690e-03 1.021694863119522179e-01 1.703190884294975282e-01 3.525399411709360109e-01 1.744893093933396755e-01 3.228034924420811191e-02 6.276260137888597934e-02 1.164180078756639203e-01 3.230049412038307061e-02 7.754019121173646653e-03 1.545651155335182533e-03 5.044773178828618806e-04 2.085477647324630868e-02 3.735336074127765466e-04 4.897591431845417899e-04 4.986822853435392364e-04 1.857147003388964074e-02 3.914323657692996570e-04 3.227156010268795810e-04 2.090485009947223513e-02 1.496154517076511356e-02
2.802565603449267036e-03 1.643851735003016125e-03 1.444139525446062888e-02 1.406777397210961893e-02 1.087312848050272888e-02 2.454146215939913018e-03 9.291772561265763258e-04 5.773127115650739712e-04 6.885773148911169834e-04 1.289159504187820625e-02 3.110227035592039863e-02 2.014794094505638067e-01 3.613793856707042673e-01 1.895513707224925348e-01 6.934415875427941967e-02 7.859420344997368468e-02 8.693070589055879038e-02 5.156428946479134356e-02 1.277762436090333457e-02 3.600366998364298160e-03 2.859986670507796980e-02 2.513815516797397037e-02 4.749311859035191923e-04 8.191454792973395203e-04 7.616904962043165479e-04 5.243482716131932014e-04 3.873342218529026142e-04 2.235913710940688054e-02 2.361523984894375178e-02 3.850035450634583167e-04
2.742129767130192103e-02 1.346680258969084948e-03 3.308366334212781666e-03 9.385230622055582006e-03 6.110605442389130393e-03 1.897648540005344303e-03 9.386879086834459861e-04 7.540511111880407024e-04 9.107218592088007570e-04 6.544189983622555537e-03 2.156793438373519507e-03 6.442881781952841669e-02 2.700658690669407447e-01 1.172050461206137484e-01 3.746504548184902139e-02 4.387639458618183830e-02 1.626783442680649477e-02 2.396138297845596538e-02 2.741736564600688597e-02 1.026830150587144420e-02 6.739940321763822437e-04 5.885974606617641082e-04 6.884968529967273182e-04 1.160807913386079472e-03 1.499172140823112724e-03 1.380604515840723337e-03 9.963463664138683812e-04 8.733810909313422140e-04 6.363125736752074787e-04 4.658527932197714942e-04
2.144793205598928554e-02 1.150685805780337669e-03 2.146380005404843055e-03 1.584948389258123216e-03 9.407953080730334676e-04 3.638149372880756030e-03 1.218283859652448051e-02 1.021091205034739893e-02 1.291279079817062025e-03 2.442394528261019812e-02 1.592978486205658302e-03 1.045276817365365166e-02 1.228786023308254538e-01 1.695848154597966728e-01 1.848785698956209866e-01 2.544907201905991512e-01 2.299790112990415802e-01 1.492176969899154937e-01 4.075971242976467179e-01 1.902263612576473861e-01 1.564202217269303544e-02 4.492617744529486638e-03 3.321240599462311430e-03 8.265903943251851418e-03 1.894687102985774529e-02 1.746621400248057898e-02 4.710394003387245732e-02 1.498095161606508019e-02 1.125239429354808751e-03 1.004778598649316325e-03
1.941868495880052017e-02 1.961341072736183175e-02 1.012116363837932192e-03 7.617623657033821029e-03 2.758416740551778833e-03 6.375742019370272311e-04 8.191865998313677816e-03 2.351804342229675548e-02 1.578314972398188465e-02 1.611974241473041174e-03 3.404604018523528508e-03 5.293255603296526113e-02 1.117028066578372725e-01 1.435773420650409138e-01 1.315987255701843717e-01 1.613083657561569517e-01 2.761840189486512442e-01 4.782450722751633299e-01 4.895649492078089637e-01 3.888225996968513454e-01 1.657425272249296588e-02 1.723045383937039932e-02 1.507082984018270899e-02 4.668601653927353934e-02 6.600172133432845312e-02 3.322611549526144903e-01 3.280479809121160661e-01 6.492832696947735405e-02 1.376494323313915812e-03 7.707149028858507542e-04
1.715969343684899118e-02 1.885857149398948579e-02 7.929762358363811638e-04 8.752350282912392835e-04 5.737156128506887406e-04 6.464211010839908921e-04 4.529372636224618387e-03 1.269448335227409477e-02 2.629023244254662106e-02 9.391098751766678923e-03 9.650471234465111264e-03 8.305826789534407131e-03 6.430637641073447264e-02 1.313836892436889836e-01 1.237657910724380833e-01 1.909062669126194989e-01 3.307035412007123254e-01 4.038430741498167387e-01 2.360526767570118589e-01 5.206225760594410112e-02 3.102696301266916895e-02 2.108528801963538979e-01 3.021284958755933725e-01 4.999480407689123607e-01 4.615969162465206610e-01 5.913836035986271833e-01 4.689944819146665833e-01 1.329943833312987600e-01 2.220790084588382569e-03 9.611370954237458738e-04
2.100125421353354546e-02 2.458849991144890570e-02 2.463319021976988210e-02 2.374377028130143091e-02 6.166777143969122237e-04 1.279436520346267057e-03 7.447839468786128514e-02 2.484119043288966211e-01 1.213656254375195531e-01 2.079199963986396588e-02 1.543387454966830760e-02 2.389104289193690056e-02 4.704252171131781401e-02 6.935472971140493881e-02 9.140654859458526016e-02 1.635238432809182907e-01 3.532108046062774065e-01 3.607168327089693149e-01 1.738840769547131404e-01 6.026210842470604290e-02 2.552799362069931299e-01 4.535025378184054934e-01 5.707442811308235386e-01 5.776017871866456765e-01 5.011529574389411712e-01 4.266604201025507859e-01 6.234995852457362320e-01 1.084336444760148621e-01 3.420992681210639416e-03 1.412203216448249411e-03
8.913399604171997606e-04 7.020350768075947316e-04 2.136585158619609681e-02 5.693832349476816643e-04 7.287251691226038011e-03 3.668659833766871325e-02 2.040169040802388978e-01 1.657500613751063945e-01 1.632935207865413019e-01 8.224012370732758370e-02 3.025242161026753945e-02 8.143662122249963053e-03 7.932859525863278707e-03 2.025414698956812254e-02 4.508059211070720995e-02 2.050493346700518194e-01 2.169044931909669960e-01 2.579367524112440857e-01 4.569821853612459489e-02 8.115410302708458978e-02 2.810552296975970532e-01 5.936125584077529549e-01 7.179507223301164753e-01 7.332216210102329157e-01 5.972441848571888867e-01 5.658336471284267644e-01 5.180188362560349535e-01 4.107094586123140600e-01 1.822522897790386162e-02 1.201363409532822842e-02
2.235935186901943927e-02 1.058687638252032385e-03 1.948079274494015755e-03 1.344113167692465374e-02 2.975234429065143349e-02 4.192608258796621384e-02 1.318525695187691416e-01 1.636656874556956520e-01 1.124373957762540288e-01 8.774362135665149387e-02 1.849193518355882887e-02 1.814027384294237882e-03 2.733610031557169671e-03 7.590392549520087045e-03 1.616814438078309837e-02 9.371848711303981672e-02 3.611286799138900550e-02 1.177859939543273414e-02 4.009594219918228598e-03 2.913644846713973197e-02 1.080046922422781136e-01 5.614359618138162755e-01 6.964844759864858847e-01 7.205031068654303983e-01 5.209414310750899446e-01 2.380578770996704674e-01 3.803211704145231797e-01 2.610567726086326923e-01 2.354141508670703348e-02 9.293612561433003960e-03
9.336617532006249998e-03 1.205895250232933043e-02 8.085157434226161038e-03 1.005173930438995125e-02 2.377976980106744076e-02 1.360777114558539558e-02 6.987118025909991315e-02 8.966435495028371450e-02 8.270500436791011767e-02 1.954493419199404905e-02 4.919808450068995434e-03 1.039971183190016319e-03 1.802286620966879645e-03 5.199233607160370745e-03 2.013842282975722778e-02 1.323277890777597998e-02 2.445375759570175833e-02 7.347574918699797605e-03 1.395722696790369435e-02 6.586399191832117972e-02 3.457170986477408059e-01 6.414298244574052621e-01 6.771387983031582625e-01 6.382044048572158568e-01 4.861363315753435832e-01 3.526932803160551244e-01 3.386140652221033553e-01 2.281590228146181398e-01 2.054306851332133449e-02 7.313110714647072692e-03
2.574342402792656817e-02 2.372537013763149905e-02 1.235084679522344478e-02 8.980023979788691324e-03 1.179963570576491455e-02 6.322479400633775060e-03 3.587653717624463001e-02 3.183408430498127495e-02 8.731022631450860091e-03 4.763485361521364522e-03 1.648812337713996892e-03 1.313645695011341451e-03 7.820369791512330263e-04 4.288841108152160347e-04 1.099381781630328139e-03 3.644777213871872555e-03 1.315620023941660097e-02 3.042974433454204847e-02 2.966086190215417445e-02 1.324245968604056689e-01 3.545145986437927554e-01 5.064487378098788684e-01 2.037320850476206369e-01 3.039184152914678472e-01 3.901117598770578176e-01 2.195062835203453189e-01 1.630321308177990480e-01 1.339086401987520103e-01 4.908552102835240377e-03 4.437228170166566260e-03
2.076125474827762024e-02 2.404064874051982381e-02 3.598127968174514094e-03 2.521627102626458790e-03 2.093322913550795233e-03 3.122608918354480376e-03 4.442047305351826472e-03 1.102483283718245100e-03 1.422653181904421065e-03 2.275423253861826630e-04 3.043753408974724808e-04 4.707829992099771222e-04 5.245318649728910113e-04 1.862517715246383553e-03 5.198254021051019677e-03 6.615573467515249717e-02 1.273289097646809476e-01 1.864968263764986700e-01 1.288705554268902154e-01 9.737356829131180169e-02 6.798561496253546776e-02 2.406429646827146912e-02 9.214217621805780717e-03 1.975836721693023310e-02 7.134316852025492095e-02 2.407544569099689252e-02 2.219239245634869323e-02 7.493674608290031708e-03 8.515129026079642973e-04 3.118664732284928687e-02
4.441996160977030456e-02 3.436743124025371660e-02 3.755890365025935269e-03 1.630747025438851429e-03 2.403130199616766976e-03 1.871054573390099323e-03 2.879082429809814297e-03 3.057185856723158368e-04 2.559666797190800073e-04 9.302204545295726656e-03 2.725386802197817177e-04 5.236523060686629205e-04 7.051422045746908113e-04 3.818888678114897017e-03 6.260005535420272264e-03 3.890656416318334643e-02 1.429021146592885372e-01 2.696023238774823971e-01 3.092341711867050424e-01 2.700377047633898409e-01 5.691809166646254192e-02 1.257602702544497429e-02 1.539407526601558468e-02 3.739901113876276800e-02 8.301463029519738634e-02 2.442182724217887430e-02 9.371433224983918842e-03 3.521587025231678793e-03 1.101996750053472942e-03 9.916761757593184866e-04
5.584493333754061289e-02 7.129601401017839762e-03 1.994884781377030940e-03 6.553204950488558927e-04 7.438541188344817076e-04 1.619612763322927310e-03 2.075706834485011119e-03 1.899164138866679327e-02 1.058202906290194034e-02 1.216737115784537540e-02 2.145153399972726804e-02 4.579370041410099667e-04 5.268580121797145424e-04 2.961838522581382738e-03 1.163878822634814396e-02 5.632302429221540396e-02 1.097096450914846755e-01 2.550952520204894380e-01 3.238051506290060555e-01 2.752427742422448587e-01 1.362777097776098623e-01 7.781766465171827130e-03 5.461293199851009750e-03 1.172836847067187938e-02 6.734495790047499708e-02 4.024296140206745642e-02 3.623151564718776751e-02 6.784021568378698595e-03 9.736502021622517322e-04 3.386543648103665372e-02
3.124357122205605186e-02 9.697707961000077981e-03 3.801340063440588994e-03 3.549935813825490661e-03 7.853580438016236759e-03 5.343763474303671497e-03 2.198094468919591787e-03 8.908975798436378178e-04 1.321043211185527009e-03 1.738634878356327311e-03 1.334422223922275899e-02 1.499092149220519407e-02 2.949162703938451114e-04 6.851625567194886621e-04 4.228311552240003948e-03 1.748107476938698390e-02 1.784301915436912328e-02 7.722660274706144579e-02 1.000997685092928635e-01 8.644848733154847364e-02 7.211203274745373037e-02 9.230128160324485229e-03 1.405447418591616654e-03 2.729103316716722811e-03 1.205656832033481438e-02 3.008124181843409295e-02 8.069888769748741197e-02 4.499611935891149883e-02 1.108015063925310746e-03 8.160660021885935474e-04
1.120115573107208738e-02 4.454171413390272359e-03 4.796176530188853843e-03 8.106980888983926145e-03 4.407153914746504697e-03 1.966177840128833197e-03 8.983896096449828055e-04 6.246791290883382721e-04 1.957787736697132880e-03 7.650579941010739182e-03 5.240232928606461957e-04 1.475516905727917299e-02 3.138896302663506414e-04 7.081183122049278028e-04 3.440884776880577187e-03 6.269881821067807212e-03 4.408500061329973310e-03 2.227645124693951664e-03 3.573876014488715919e-03 6.580289593397526879e-03 1.171612172964495505e-02 2.674362915978198245e-03 1.378180698660412843e-03 7.035745254198588761e-03 1.714317755378104435e-02 6.078756327751835484e-03 2.090641349574801425e-02 2.316459553876783900e-02 8.139125231128172683e-03 1.220049743076990090e-03
1.135701714087797472e-02 9.138711764829405421e-03 4.488554410528886561e-03 3.301559092829550388e-03 3.058631818176695254e-03 1.143062610918368005e-03 7.502434771082423922e-04 7.606726483961449327e-04 8.317121689296839027e-04 3.349895514821531629e-03 9.509444064059624935e-04 9.074930609195003403e-04 8.752084170249384938e-04 1.122072424921831228e-03 3.335992119283892957e-03 2.388979054874621182e-03 1.716671914126027603e-03 1.086405931799242939e-03 1.006479051877623085e-03 8.015026788211924514e-04 6.518801082332865635e-04 9.717050206187751414e-04 1.575078168268860155e-03 4.012171656492521075e-03 7.172861517464847875e-03 3.495248336403421023e-03 5.634601520187297249e-03 3.710771142264698147e-03 3.705369484264867813e-03 2.356438685038255050e-03
1.538712652583764350e-02 8.046754245685945259e-03 4.613778851667037911e-03 6.331869829561440760e-03 5.536302910173129463e-03 2.992496626252552291e-03 1.015537645755808412e-02 7.623158858401170995e-03 1.119553258481416303e-03 8.193020225713941321e-04 2.937106199228265379e-04 6.768574525201051561e-04 2.054332698742679895e-03 2.351452133681330731e-03 7.518633989378919330e-03 5.816221206552587425e-03 1.960899497300798953e-03 2.468259986813085664e-03 1.203553947235859196e-03 5.412636670841804816e-04 4.973878113950073489e-04 7.679948880770020529e-04 1.207737975046777653e-03 3.941091754566683307e-03 4.235336143493173208e-03 1.054542542781424733e-03 1.205926929721842225e-03 1.555161600981027747e-03 5.056732081292680467e-03 1.040733376131248609e-03
2.067500769192538029e-02 1.794651431415492798e-02 5.482370487678570568e-03 1.883290186294252558e-02 2.173100912145140007e-02 4.075888624609114164e-02 2.728068687278937393e-02 3.076760814646380300e-03 1.104198139834879815e-03 6.440520768501684741e-04 1.566005868565372230e-02 2.400611738572039334e-04 3.081216280991159171e-04 1.288788607272120523e-03 1.686551968900374971e-03 7.905950774327904877e-04 8.254601806495249355e-04 1.063208142233358503e-03 1.534476220328370461e-03 8.456843008382319057e-04 2.758168643372353734e-02 6.203713470783743826e-04 6.958882195715399618e-04 1.268479291304329057e-03 4.319110476860932822e-03 7.257525737144688086e-04 1.095707142687355438e-03 1.834059684168360717e-03 2.237696345622675401e-03 4.491232248967828508e-03
1.139221067125151601e-02 2.845007848555173441e-02 8.517870626005494272e-03 9.118452456689544669e-03 4.380649658370862343e-02 4.599606569780460841e-02 3.056343225436739669e-02 2.091746229880930494e-03 1.472339997068701067e-03 1.415139511002605401e-03 5.902998335808671681e-04 2.962867844923192931e-04 1.519462783154473806e-02 3.704453833213221204e-04 1.892238469175176437e-03 5.866675347137577812e-04 2.250821250027387754e-03 1.450777992517674787e-02 2.720897257744739339e-02 3.826320662706325822e-03 7.404043811125852375e-04 9.336934779319756589e-04 7.914572093267822211e-04 9.400848751810108803e-04 1.352927977849122717e-03 1.109055950975149172e-03 1.365929772914651003e-03 1.717301405239050286e-03 2.348940126637706280e-03 5.834258815620059491e-03
