2.543962435050917037e+01 3.842856530182984187e+01 3.327998653945468988e+01 4.193008361684969287e+01 3.165998417182028390e+01 6.982818166485529332e+01 6.976737215634196332e+01 1.906721193092446924e+02 3.517818038593001120e+02 1.594175217152164237e+02 7.550659327847040458e+01 1.757288617260760688e+01 1.062418251032556782e+01 4.174328567620889885e+01 5.166066045830176279e+01 1.217114889958294732e+01 4.673124762409578636e+01 8.984409169362430703e+01 9.029113192241072738e+01 3.489366831397904889e+01 2.830297399469866804e+01 4.155968489416293821e+00 3.271558352747728105e+00 1.329041230823816555e+01 2.644067790697986453e+01 2.142840960944107920e+01 1.030029769159205166e+01 9.284669609057798478e-01 9.047542566291887356e-01 1.170072859216783279e+00
1.902927387627579847e+01 4.326733046218862455e+01 7.777470357816288526e+01 6.296613157621316503e+01 4.371389160989121336e+01 1.974586770355817009e+02 9.582124675779641620e+01 1.218993919741742502e+02 8.175069970551768961e+01 7.109882606180057962e+01 5.250995861047147173e+01 1.069687897092286555e+01 1.484074766084794383e+01 3.550784870837804874e+01 5.204242199997155183e+01 3.552212719161664012e+01 4.800176476786891300e+01 1.737527658105363173e+02 1.469164756039868962e+02 4.912909665892480859e+01 1.788473092705687861e+01 4.106206234325469495e+00 8.839092840122642514e+00 8.082653021280213679e+00 7.416580556567511806e+00 1.042855181819107457e+01 3.917250105705260665e+00 1.001411460535118758e+00 1.416458212410240947e+00 1.417179654460417826e+00
2.238520277036918742e+02 2.341190854882928818e+02 4.956749535912139208e+02 3.998565366672955292e+02 8.551123283993570112e+02 8.822272432809222664e+01 1.696938158771791194e+01 1.865559355517735440e+01 3.138902417960631510e+02 9.859486604936907383e+01 2.778305707979034764e+02 1.957546831896462152e+02 7.590519465271412969e+01 1.154402407671367570e+02 2.293690693820081350e+01 1.015340623128195432e+02 7.437978544897455890e+01 1.700563807762442536e+02 6.405843671022556691e+02 1.196784951702159958e+02 1.180206697496389623e+01 3.541121773550645724e+00 5.608407188713576019e+00 2.057788684525209799e+00 1.304891325341169583e+00 9.303497625710041019e-01 8.983280993027327188e-01 6.751379794804878154e-01 1.097216972920713518e+00 1.195239371063524292e+00
1.067946438126702873e+02 3.140769621833931637e+02 6.900621240431028127e+02 5.529041696352311419e+02 2.291577792670067879e+02 3.569414543578472632e+01 2.891670493733279201e+01 1.961664254706697363e+01 1.229697366514417922e+01 1.167288383556210505e+02 7.697122288699478077e+01 1.594066641135462987e+02 7.561930737116951207e+01 5.333921808521395747e+01 1.651887248981946499e+01 1.332453065591234775e+01 3.002917380395028957e+01 6.128150925282230332e+01 4.819351566407948440e+01 4.535108255886851225e+01 2.167826663543861088e+01 7.777722235827619457e+00 2.549042780373231842e+00 5.207904946075312402e+00 1.041418490729979052e+00 8.297537491831855627e-01 7.728363608423003406e-01 6.868112354867689229e-01 1.294902709843906985e+00 1.354702524424523213e+00
6.402433229291268901e+01 2.052904690619476185e+02 5.713425731701872792e+02 2.211712606550047440e+02 1.277469101571359147e+02 1.861274507130540457e+01 2.853965457457267973e+01 1.593556253457693650e+01 7.386868430558920728e+00 2.569474099006234837e+02 3.218220757870690818e+02 2.792504871768327348e+02 4.274718926571263466e+01 3.783548655436705843e+01 1.886345279278509324e+01 7.437637528292462719e+00 8.495045622795336726e+01 5.203760301241489117e+01 9.028242064797206012e+01 5.555089996874696112e+01 4.085379831426336494e+01 1.214456325031279782e+01 2.845991159267951076e+01 8.291744728382603569e+00 1.782457013686738589e+00 1.050878916574721433e+00 7.908000322463987208e-01 8.594218035046224946e-01 1.246087156822051734e+00 4.407350994794149379e+00
6.678924562222780992e+01 7.322676979381969886e+01 3.274405265012511563e+02 2.615679046475181622e+02 1.039537552531807592e+02 1.100978404136971101e+01 1.320470031332141758e+01 1.398991006564315498e+01 1.294662194679262335e+01 3.825740051437995817e+02 2.938124429433199793e+02 1.539485256537373630e+02 1.798310348764250932e+01 5.807785310034454085e+00 4.703463024620324617e+00 8.204758641298369071e+00 4.501515377546161290e+01 1.225262910052522969e+01 4.183997954387054818e+01 1.522878891277177615e+02 2.000019205964643731e+02 1.284548290639280594e+02 3.465014073422543817e+01 4.773846774701447693e+00 2.552730321331265095e+00 2.633639031756966453e+00 1.773471783499199539e+00 1.146638009090444665e+00 1.396402595884155051e+00 2.417215012106966210e+00
9.396522200133198055e+00 1.571349029676511577e+01 1.664412413408053126e+01 8.455080950565633202e+01 4.062118339413764545e+01 6.645238288473612442e+01 9.846275425412522964e+01 5.509488991923399936e+01 6.436458100380711755e+01 7.210341566010494319e+01 5.370274703973528574e+01 2.160570382113998633e+01 9.007807748763275058e+00 3.727842397907134231e+00 2.090365637450590786e+00 3.987360161464956310e+00 2.435439539829967259e+01 1.187086947491160771e+01 6.272834993461282949e+01 8.957062048893543249e+01 4.470575937380810672e+01 1.164025823582693064e+01 4.969726336631151042e+00 4.164996857022532417e+00 1.673324262919298810e+00 1.881773058876542226e+00 1.782338264752159951e+00 1.448144323013189183e+00 1.552712208712401010e+00 3.547673554387220651e+00
1.924695112323751189e+01 3.665501073589225456e+01 2.159915015006740902e+01 4.701220906041909586e+01 7.278611703658523879e+01 8.165001521147785013e+01 7.188842669019857112e+01 6.766587955760502382e+01 5.447275101708259371e+01 2.959560571391950745e+01 1.159952134502571752e+01 3.506620123109898657e+01 7.506398732102127269e+00 2.592996078632819668e+00 2.769715069291396325e+00 5.355959816840607957e+00 4.608818462995520804e+01 7.664959007257965595e+01 7.034147903081074560e+01 5.275157202960856750e+01 1.562046243729902528e+01 7.954040421162897445e+00 2.900794926124881545e+00 2.407226212666155885e+00 1.211027163792443240e+00 1.368579120343762945e+00 2.261099460298367170e+00 2.695292455920654806e+00 2.563430722379496540e+00 7.258450007797872416e+00
4.880922485287463530e+01 3.270982540506713576e+01 1.941352159931279786e+01 1.144330624666824576e+02 7.587867206039501866e+01 3.241055201414884834e+01 1.052069495656856759e+02 4.780273123586097483e+01 4.094748463020733453e+01 3.936201318015120165e+01 3.436007092525714768e+01 4.455522822033869801e+01 9.713947648729083539e+01 6.478875097454593401e+01 9.874720973360698650e+00 9.252658378125811822e+00 4.173078671405873763e+01 1.325513026360513038e+02 1.375812149555953283e+02 2.442631495734222824e+01 4.159956826102996885e+00 3.458435929136003839e+00 3.514564558614631018e+00 2.278515139409045265e+00 1.390245658782699900e+00 2.273775287536227374e+00 9.058759180348552320e+00 1.743058229944919546e+01 4.839853690923899165e+01 2.311443248385459270e+01
7.936802001974075438e+01 5.190352756676945489e+01 8.383261546460190061e+01 7.995534560719715955e+01 7.253128414507639832e+01 1.460125345861437651e+01 6.898443240532623122e+01 3.014043284979056025e+01 1.313831209265128841e+01 4.817883259755742387e+00 6.940099769440666932e+01 6.678075733574451078e+01 1.401164134641580006e+02 1.505357693471045479e+02 7.158584951200123214e+01 7.818194004195278524e+01 4.333363534802505228e+02 4.710677498530576486e+02 2.007658819852645422e+02 9.599906562416403233e+01 5.077898656545825062e+00 2.582215708619212791e+00 2.832282195536122593e+00 3.108796306941028931e+00 1.768126408853293308e+00 2.398772134525953614e+00 2.375665713591290285e+01 3.911220439206465471e+01 4.703135907005619742e+01 1.198362373991056096e+01
6.689348442578149445e+01 3.486271828781262627e+01 7.837343880006524444e+01 6.787073293198972124e+01 8.920191558551744038e+01 8.420515375890538223e+00 7.276851225016777391e+00 6.564689728441986283e+00 4.304170429882051785e+00 3.790583000876898012e+01 5.844948058396674924e+02 9.619851011029003303e+02 1.951170436029122357e+03 9.354583079437201150e+02 1.684476523402607882e+02 3.208982661826410094e+02 6.085005945561906628e+02 1.749525194142419480e+02 4.398191454079592688e+01 9.344894833156267566e+00 3.365582240294145766e+00 2.475297429910206404e+00 3.112209171242779959e+00 4.377879936130031346e+00 4.745100545283341020e+00 2.666714120559555479e+00 4.398953041138755182e+00 3.409710684303386863e+00 2.972632159393756801e+00 2.083310280206992715e+00
1.270706951402991081e+01 7.463630469741568518e+00 6.566434322004134572e+01 6.501581533744885633e+01 5.189230472588079124e+01 1.229201957158298697e+01 4.957177036379105672e+00 3.322341638162733091e+00 4.315236564653884166e+00 7.913241298687844960e+01 1.878055653736516319e+02 1.203103081679650359e+03 2.095594332583247706e+03 1.042690024801865547e+03 3.634127030517502135e+02 3.938055488195092266e+02 4.341747672529476176e+02 2.597178678291639926e+02 6.536795314916186328e+01 1.905254562181887934e+01 2.916121224113309207e+00 2.680182688655381451e+00 3.145480789797795218e+00 5.680456468226994460e+00 5.488878816436407959e+00 3.994382360787135600e+00 3.133481800746086954e+00 2.796177445256704086e+00 2.954169283873577356e+00 3.133264806500956734e+00
2.499852389519605644e+00 6.453662018504414455e+00 1.562545178575565785e+01 4.438634744709541735e+01 2.944639379465591844e+01 9.639301419498135459e+00 5.152142405912786494e+00 4.531401370724386979e+00 6.043185020557095832e+00 4.251728290920314635e+01 1.379596413221751305e+01 4.085467240268025648e+02 1.647511023994025891e+03 6.632697842660949163e+02 1.976023203958895351e+02 2.166369414015475741e+02 7.810436878250308723e+01 1.129562584102947511e+02 1.276276273102872807e+02 4.809731991256805372e+01 3.296197332200941688e+00 3.017333525379500614e+00 3.715840463576305819e+00 6.414937890379830421e+00 8.446041466741238679e+00 8.038337543376382399e+00 6.049529242355117020e+00 5.487467804995542764e+00 4.195157836597390499e+00 3.279938987204858325e+00
2.030169510743884409e+00 5.849219318818848379e+00 1.056278659921616736e+01 7.687760955034564248e+00 4.589891436672950853e+00 1.878087989342691344e+01 6.893602978615727750e+01 6.431472034246601766e+01 9.122856899711013767e+00 2.751950299456297877e+00 1.083527981565733356e+01 7.089501984547494828e+01 7.935319651646865395e+02 9.894806162306413171e+02 9.835220219462210025e+02 1.242494587942218914e+03 1.064828675879502725e+03 6.611946708120606218e+02 1.739174049599809223e+03 7.956484679849766053e+02 6.664464160827314743e+01 1.959297400457350591e+01 1.491905703879075773e+01 3.739082826730539466e+01 8.589644973817517837e+01 8.053787643048168832e+01 2.243453075387551223e+02 7.574619116006030595e+01 6.237447175126749954e+00 6.266812625746108978e+00
1.849102923093886020e+00 1.872994459262349531e+00 5.163733698346424816e+00 3.888069317164381289e+01 1.432776483166669124e+01 3.464978075895105647e+00 4.746730149910204943e+01 1.467389925934569987e+02 1.064510498246887380e+02 1.099305479209695591e+01 2.354797981486317582e+01 3.746865651763126834e+02 7.638450694660081126e+02 8.882993290967344819e+02 7.417708995777392147e+02 8.330319785816438980e+02 1.323098003988256096e+03 2.140017242721746697e+03 2.061073934232962074e+03 1.575566338812486265e+03 6.763641117661509838e+01 7.113850690185941517e+01 6.338808424983098178e+01 1.955901067393990616e+02 2.752752371005769874e+02 1.402903058775866384e+03 1.424820635104499161e+03 2.985280601191224150e+02 6.891076551421582153e+00 4.292880986956061129e+00
1.646147816370604700e+00 1.821396996163090254e+00 4.216148924985777313e+00 4.742443546306790658e+00 3.222252850096794852e+00 3.748922077004008813e+00 2.711937577862698490e+01 7.908668128731135027e+01 1.711921950289721224e+02 6.354287740550432062e+01 6.819522447008597510e+01 6.195221414426782758e+01 4.711574854564697716e+02 8.757830852770641741e+02 7.553403217833088092e+02 1.072706294101589720e+03 1.683935035951104510e+03 1.874320651597436836e+03 1.008006913952537843e+03 2.105723396699489172e+02 1.256219612307011460e+02 8.585283972504787471e+02 1.243618145799623562e+03 2.040661158605145374e+03 1.875569811546950405e+03 2.443957402425077817e+03 1.997102665348335677e+03 5.924857530787005544e+02 1.047897859154141997e+01 4.847494489235681492e+00
2.045805577717983770e+00 2.419226247523623918e+00 2.431548378681689826e+00 2.386526008421657963e+00 3.782794000660274936e+00 8.006179514784037110e+00 4.677555796510494019e+02 1.585051833876117144e+03 7.955006641800589477e+02 1.428067710028962836e+02 1.131901792337868358e+02 1.903653297243785971e+02 3.741306501804497202e+02 5.032704981746177282e+02 6.097275762488015971e+02 1.010927694670022902e+03 1.924388500641505061e+03 1.742581657356578944e+03 7.555987845468850992e+02 2.441497430587738222e+02 1.028901655289155997e+03 1.825976953130098991e+03 2.305653929146949849e+03 2.303592633078377276e+03 1.999513690831963686e+03 1.744213872566373539e+03 2.651215195866061549e+03 4.730063602928453861e+02 1.534921542095313640e+01 6.532912164396291743e+00
5.035107560425037043e+00 4.066516701564847125e+00 2.176995382839268967e+00 3.567856755679583269e+00 4.929495389213560941e+01 2.511483398014063084e+02 1.382680626523422234e+03 1.132470109126394163e+03 1.144477481878340541e+03 5.997053183126394060e+02 2.355099382162820802e+02 7.009740978212549578e+01 6.884845228850133481e+01 1.606527692294082499e+02 3.303018222307572387e+02 1.406885673843022460e+03 1.274160768725091202e+03 1.306704107398070846e+03 2.036024264951245470e+02 3.320113356330770102e+02 1.132922040976864082e+03 2.369744671310952526e+03 2.853718663234877113e+03 2.870117642196656561e+03 2.351330498389113018e+03 2.315379218954715725e+03 2.236059088098927077e+03 1.774299221281440623e+03 7.884886504203191748e+01 5.207676342849104145e+01
2.293059529054165324e+00 6.579457443965644359e+00 1.273654991856741248e+01 9.415671525712798484e+01 2.276509089556952858e+02 3.283198839746464728e+02 1.031761203259393824e+03 1.297087378372090825e+03 9.149434737391056842e+02 7.318739232568701709e+02 1.610834897068810960e+02 1.674307978674655928e+01 2.488384405274382871e+01 6.363869520757107523e+01 1.259296924226497936e+02 6.843419950770565947e+02 2.285284020395559708e+02 6.484998958360147014e+01 1.943987941651394280e+01 1.294826889981632405e+02 4.660420305658583402e+02 2.360821445215627136e+03 2.868682134004438922e+03 2.879911399080552201e+03 2.053458924429954095e+03 9.492402474935128112e+02 1.559104800899629481e+03 1.070804061009811448e+03 9.662238557246983817e+01 3.816957387001938429e+01
5.962425211437924588e+01 8.171849074835273541e+01 5.893028155210205909e+01 7.992729260677305092e+01 2.090816548378721222e+02 1.245903000988343337e+02 6.509081815511538025e+02 8.551324426204178053e+02 8.101458835084763450e+02 1.916317003369056806e+02 4.860566601472854131e+01 1.040310008688670962e+01 1.741984452425535679e+01 4.668127611433426694e+01 1.691608278751412513e+02 1.047610344308832424e+02 1.696406025685751615e+02 4.475009242412247090e+01 7.516330085531826910e+01 3.231198410662408378e+02 1.617707902747166145e+03 2.878590831095182693e+03 2.927765834298985283e+03 2.629004030807996969e+03 1.931677834029087080e+03 1.377768528359909851e+03 1.324807646299488169e+03 8.930842836562250113e+02 8.045321083132819240e+01 2.865395263056420205e+01
1.781882163307383848e+02 1.781075722911949129e+02 1.016729021525172527e+02 8.238482354941876906e+01 1.224444504469102952e+02 6.955823629968126909e+01 4.091373089253918920e+02 3.786398305613639081e+02 1.076895121229730989e+02 5.624277918859722547e+01 1.872063489545356063e+01 1.444293295577084812e+01 8.173201253803824784e+00 4.195013867324112411e+00 1.014448425565273482e+01 3.198316008276930233e+01 1.018400214318882888e+02 2.083529708489965060e+02 1.808139050928542702e+02 7.337494194593059547e+02 1.837467697410695791e+03 2.468793756046630278e+03 9.402032454447341934e+02 1.302989739677973830e+03 1.569223601379915181e+03 8.437185774915806178e+02 6.139846035612822561e+02 5.045135442457153658e+02 1.850072851367835725e+01 1.672838942152890596e+01
1.511766394395998816e+02 1.903689237165025361e+02 3.155420956412630673e+01 2.487449733699251553e+01 2.358162289422346447e+01 3.773542862725368252e+01 5.633410385674653753e+01 1.477691824723737568e+01 1.990779222411435256e+01 2.978542308230944347e+00 3.743592040443998403e+00 5.487777216967625549e+00 5.749937437188797240e+00 1.913660495235113856e+01 5.048748692264724269e+01 6.124787347528415467e+02 1.048434094272028688e+03 1.370449045714069143e+03 8.509176421796876184e+02 5.849843259545230012e+02 3.761113354442290984e+02 1.232877585237362581e+02 4.400520677956562565e+01 8.647387099426855173e+01 2.881056562272337942e+02 9.109745469365387294e+01 8.059299098291725727e+01 2.716791924074560072e+01 3.082123001005071750e+00 2.518514770584368012e+00
3.331891890708951678e+02 2.765397198016003699e+02 3.319353333190599642e+01 1.607611611696378162e+01 2.677374518417837734e+01 2.230411684742811929e+01 3.603176508178047754e+01 4.039036798689044083e+00 3.524993387823852409e+00 1.467693177399914450e+00 3.356906684777878791e+00 6.139925245541725474e+00 7.747346637691464366e+00 3.892951524353733816e+01 5.963653278660160595e+01 3.488051722066153388e+02 1.149070757713155217e+03 1.950495284207680470e+03 2.024070998313236942e+03 1.606624953564735279e+03 3.091763960587695124e+02 6.276068507577659972e+01 7.096961868516882532e+01 1.606933540339799720e+02 3.350412359544487799e+02 9.326539544333409992e+01 3.434240639127190775e+01 1.276373145779943741e+01 3.952807206003356111e+00 3.525374787434130575e+00
4.424187444840135299e+02 5.990528250260392440e+01 1.801704513046869849e+01 6.498019474149156594e+00 8.250675404240826794e+00 1.916150372325765261e+01 2.579263883689739956e+01 3.019816100387172408e+00 1.721572681514726755e+00 1.920758855815165811e+00 3.294550545277165732e+00 5.461054361979376992e+00 5.866181070734686642e+00 3.027339728414408171e+01 1.100037865288765317e+02 4.958069923254530522e+02 8.716251204053558013e+02 1.837370521588609336e+03 2.130228492175112478e+03 1.649112366215252678e+03 7.396739023553454899e+02 3.859927277111957977e+01 2.494997060931549271e+01 5.107127151127559728e+01 2.821307263658193278e+02 1.625461118931590931e+02 1.418215372745242178e+02 2.604269696358387520e+01 3.680373181374652525e+00 2.739372626824251089e+00
2.672553952241370894e+02 8.657994070556092936e+01 3.553426674748891401e+01 3.565775026291908745e+01 8.754795460191098755e+01 6.328050637716044236e+01 2.730478884510935345e+01 1.170538121710722734e+01 1.814714458260807461e+01 2.284453704785592620e+01 2.066202266764439521e+00 2.270867313299399726e+00 3.361411218645301346e+00 7.093272639760499487e+00 4.009852214282459215e+01 1.534054534958710008e+02 1.419600019856723634e+02 5.615533715144101734e+02 6.704360478055948533e+02 5.277329970217678010e+02 3.958420092547420381e+02 4.626066122032335670e+01 6.525970761371437945e+00 1.238653049921951776e+01 5.408983690622899587e+01 1.333511640494020867e+02 3.519750442211362724e+02 1.909995432914913636e+02 4.605043703338935757e+00 3.334840638816724212e+00
9.715288141570243852e+01 4.024423771312125098e+01 4.517187821668247949e+01 8.175913444654675288e+01 4.926621687727781307e+01 2.331045039078765768e+01 1.116991947837343169e+01 8.220815154034127659e+00 2.694406378181271577e+01 1.008425232042624913e+02 6.665675456358211903e+00 2.244071605783685808e+00 3.603706237337299001e+00 7.364894620969044681e+00 3.270643547569557796e+01 5.512612588796414315e+01 3.517627437911777122e+01 1.629088629601928062e+01 2.414831281111513306e+01 4.088432498506874424e+01 6.639451403670011587e+01 1.399108435233750392e+01 6.738015804284232857e+00 3.367044783640783834e+01 8.110454566760702733e+01 2.845133676756919527e+01 9.638554295578310871e+01 1.036746814633542897e+02 3.562602476432675758e+01 5.252705189340239222e+00
9.854999949472809817e+01 8.259492538959565877e+01 4.229777370227628808e+01 3.332456325733750191e+01 3.423137849236907471e+01 1.355792130910634796e+01 9.332853415477465830e+00 1.001638754922104901e+01 1.144127690866275238e+01 4.413830622390112524e+01 1.209233914015091216e+01 1.120331225503303862e+01 1.003764063018131303e+01 1.165800596799491018e+01 3.167793080864156963e+01 2.098405112155177221e+01 1.368279763005060801e+01 7.937384891982341983e+00 6.794851187187127550e+00 5.041830119231754281e+00 3.845025737133972221e+00 5.402928902900629993e+00 8.297727027318870796e+00 2.030099596302057563e+01 3.506480016760301766e+01 1.657693569284143464e+01 2.597553076456548382e+01 1.660545206098571569e+01 1.621570089184585939e+01 1.014288347732925999e+01
1.335807275275717529e+02 7.274607193050906062e+01 4.350151303744249276e+01 6.396544959343104608e+01 6.203159901781428687e+01 3.550873033145973778e+01 1.263939527727468857e+02 1.004392483796144404e+02 1.539434439277318845e+01 1.079124696324038979e+01 3.733753008806124374e+00 8.353902220300170711e+00 2.353719170859941201e+01 2.440861492283931966e+01 7.133798942047998537e+01 5.103867418780319554e+01 1.561489992887097245e+01 1.801809017158841542e+01 8.119180051390555874e+00 3.450709200585587944e+00 3.064491321258053347e+00 4.576497108392194590e+00 6.968273447238033214e+00 2.128928890444005262e+01 2.147875432917608052e+01 5.068887042569159007e+00 5.557805149193008276e+00 6.957482478930547387e+00 2.212308441478660015e+01 4.478560332757464124e+00
1.793410662188680931e+02 1.621449150490547026e+02 5.174918912285033912e+01 1.906087949264664871e+02 2.437890126860474425e+02 4.837758379800656598e+02 3.395461489144127540e+02 4.052165233048680903e+01 1.515239656694133252e+01 8.463239114325824985e+00 2.425825203178389344e+00 2.954426832341755293e+00 3.518194611493448587e+00 1.333768295640875934e+01 1.596238369019390291e+01 6.923017268161244964e+00 6.564069281307135739e+00 7.752087295565932124e+00 1.034135805214804193e+01 5.467993163428273462e+00 2.955361645655869118e+00 3.997192882101764155e+00 4.471310340554595975e+00 7.388717146385443968e+00 2.280170252057126845e+01 3.536982674203638766e+00 5.047708633074297069e+00 8.202569527668959637e+00 9.786980536403905973e+00 1.932261834904685927e+01
9.835880593257840587e+01 2.566158474635443554e+02 8.111252136798810852e+01 9.366178024687235393e+01 4.959167803098229115e+02 5.489901706775110597e+02 3.814012026749886672e+02 2.744899646053939790e+01 1.994071293590563698e+01 1.815553709094489321e+01 7.212521506977285668e+00 3.470760812403481665e+00 2.135985059274694731e+00 3.584923205573446570e+00 1.657514672417393697e+01 4.688309194003889679e+00 1.601973135762702327e+01 9.294953894568791952e+01 1.582529693651898981e+02 2.116518363938594760e+01 4.101757769515566032e+00 5.179615042927489199e+00 4.396705990869481440e+00 4.785197420989339534e+00 6.289352692594793126e+00 4.768476561726581409e+00 5.545589661469708886e+00 6.788985357888543959e+00 9.091730383965671791e+00 2.220428856094956416e+01
