2.433620985426702965e-01 3.476529778210495358e-01 2.893528035905019169e-01 3.551785947819043887e-01 2.454405109513150551e-01 3.602028139134642176e-02 2.633355855925200925e-02 7.074041856399920780e-02 1.277953729200979049e-01 5.679760748560227362e-02 3.543899696712201480e-02 1.363642883767875735e-01 8.987071399967241914e-02 3.301758665375089663e-01 3.852877870782334124e-02 9.379494454819022053e-02 3.939655612104191462e-01 2.693693995657910761e-02 2.050876466497158004e-02 3.038627781641619618e-01 2.810744997964976233e-01 4.256645833854472150e-02 3.262558512237048042e-02 1.303152700082728932e-01 2.526000244813466633e-01 1.976392275972964074e-01 9.057678622697291904e-02 7.917419140248719081e-03 7.500138598638852842e-03 9.354842695798832111e-03
1.600693403876468912e-01 3.365829880040347999e-01 9.385966755903739356e-02 5.884926057181096015e-02 2.979803879322539539e-01 1.122129990314598286e-01 4.501404767614643893e-02 5.565642111889632787e-02 3.323407230977172555e-02 2.610917814771897619e-02 2.395198753924769955e-02 7.044790392504599041e-02 1.063094155954261433e-01 2.549444733223913406e-01 3.816423057251285000e-02 2.574150938020219881e-01 1.963000087729952978e-02 4.891405145417871553e-02 3.135508872678257480e-02 1.247507489945056530e-02 1.612966191975078456e-01 4.071774709806318809e-02 8.447680247992797598e-02 7.551415007229740628e-02 6.678704076797893630e-02 8.934752107643463559e-02 3.130364439250885727e-02 7.931716257971437728e-03 1.124506286015060190e-02 1.119629442269300459e-02
1.307470447060856689e-01 1.302527881207422300e-01 2.467100542756596737e-01 1.865011369125974539e-01 4.289568815868659568e-01 6.623994801752858264e-02 1.297600412337466258e-01 1.350038322147665004e-01 1.533360975439804763e-01 3.644403983308618089e-02 9.642666830243182274e-02 7.054267900565618088e-02 3.297007574946058533e-02 5.764035267021955233e-02 1.575981413540948894e-01 4.751734708256410977e-02 2.584066824768790557e-02 3.853963327741725953e-02 1.212659376785363285e-01 2.570816593457656701e-02 1.011684844184793236e-01 3.358497479435720856e-02 5.108314421110774634e-02 1.774854294474451089e-02 1.052326597212560784e-02 6.915036941486310193e-03 6.155538088260623097e-03 4.836699750621190931e-03 8.250678094105446531e-03 9.250469369931979893e-03
4.570007982992582013e-02 1.314522770436623023e-01 2.880654770928518515e-01 2.337076223988298895e-01 1.157392127631322459e-01 2.647353369574784177e-01 2.604935667176374037e-01 1.602875758095762271e-01 8.622019699298215378e-02 4.589455685400367635e-02 2.742091425754418846e-02 6.315742929524846561e-02 4.273341595543546367e-02 4.243722051514179500e-02 1.214849180511051452e-01 1.040695558170539464e-01 2.218846809791488184e-01 1.481250866934454014e-02 9.876257378704960885e-03 3.261508419431954353e-01 1.791845638792010920e-01 7.102984918628059419e-02 2.383199111260283706e-02 4.693729245203683703e-02 8.554355067208530006e-03 6.090344285179874646e-03 5.215630149153624960e-03 4.948605767706944041e-03 1.004550363127036661e-02 1.091303906604502473e-02
2.625523411851386768e-02 8.158297764885005798e-02 2.279989284632712998e-01 8.859831635720390175e-02 6.613008679832896308e-02 1.535910564343187235e-01 2.648368192570711988e-01 1.475443195913481720e-01 5.378423848662287898e-02 1.075304142387906586e-01 1.213908324219534068e-01 1.315383063867503755e-01 2.950867374707414892e-01 3.026756298411375501e-01 1.576100337767956661e-01 6.469940148647626565e-02 5.383377698920455146e-02 2.697671494095136083e-02 2.701271256753049257e-02 1.688389884387712925e-02 2.881912207890692801e-01 9.127882459351627231e-02 2.326171656613336136e-01 7.661896628040341939e-02 1.536914210051701021e-02 8.126326876206126440e-03 5.640662729005132582e-03 6.513022589290517680e-03 1.016930063240203096e-02 3.733088390054938033e-02
3.636382377001887156e-02 3.867514636266963790e-02 1.482820913002204366e-01 1.211514382518288913e-01 5.438628343081208794e-02 8.657652769575101270e-02 1.083825545774104449e-01 1.141995065377805346e-01 9.163430372066895535e-02 1.583162219356388789e-01 1.298442759408221792e-01 9.322377380868297758e-02 1.372250248060231936e-01 5.113178672298281102e-02 4.254415865444129141e-02 7.361399597340106959e-02 3.938150052794474054e-01 9.900636570197064723e-02 3.068687047525047729e-01 4.935396835990563114e-02 5.777319941454851782e-02 4.945017536279770753e-02 2.837676734551908830e-01 4.433735680199318158e-02 2.281704558713103931e-02 2.122088923969500662e-02 1.325383119735084811e-02 9.115807838082141956e-03 1.200361307940357551e-02 2.150736470472085562e-02
8.628070363513984375e-02 1.304349697093661054e-01 1.289156099414252854e-01 5.827688016646329072e-02 2.882827840329880709e-01 3.504665942352684638e-02 5.364031676054293457e-02 2.977162031451832322e-02 3.833486646668842618e-02 4.316864857779135339e-02 4.335667232534568677e-02 1.659087667427586454e-01 7.649487256924585032e-02 3.518312399388414530e-02 2.047740467843964934e-02 3.725552574944974993e-02 2.118492673298957019e-01 9.529091638067416214e-02 2.192979579588075559e-02 3.232157572602496753e-02 3.143646185141938942e-01 8.957127195563621691e-02 4.155219326718422035e-02 3.975999047791107383e-02 1.538891197849130872e-02 1.579595393700985312e-02 1.405730619742604805e-02 1.216523499268445073e-02 1.406527849989467997e-02 3.305725527402402636e-02
1.830715068364547893e-01 3.387665048324158268e-01 1.824505199343180173e-01 3.585495963760443328e-01 4.588986480370349508e-02 4.081769184622226210e-02 4.153378985164794118e-02 5.084724192927400632e-02 6.112601961053566735e-02 2.453503557473712682e-01 1.015590254309212681e-01 3.084516235359004988e-01 6.593334641242112881e-02 2.282801498199329288e-02 2.577934220898705706e-02 4.937695672578708977e-02 3.780287968120408792e-01 4.830993861986548898e-02 2.330398658095342995e-02 2.033151697488720655e-02 1.270472264551573138e-01 7.470460398656623979e-02 2.970404388558517059e-02 2.478685124092017134e-02 1.181345828634114761e-02 1.244704239872426559e-02 2.023213582844694824e-02 2.581892194082010053e-02 2.509392790173926510e-02 7.131354010009773037e-02
4.271029962378689038e-01 2.752958058557618548e-01 1.547907049844169380e-01 8.353793858266840566e-02 4.660905317347621701e-02 2.182646456599209306e-01 8.131742735440304626e-02 3.609853723004528558e-01 3.481157079176381841e-01 3.511345071880699886e-01 3.169238511968912042e-01 3.944218764815655143e-01 7.601988850008967180e-02 3.079381913011566482e-02 8.221605406440467279e-02 7.140694048036187735e-02 2.869068049646509855e-01 6.293427448494214038e-02 4.383446884880239786e-02 1.696941839307578026e-01 3.368471315364204161e-02 3.491166575083838597e-02 3.771042827521706164e-02 2.455859628654379068e-02 1.439170489173145426e-02 2.206177195058953502e-02 8.761269842019420162e-02 1.724025244171775717e-01 4.798685725343979636e-01 2.286784693205371477e-01
9.832253692113847310e-02 6.557910847100759111e-02 6.881481915697004736e-02 3.992351934511961797e-02 3.796726838659268688e-02 1.023720428111031672e-01 6.702946815523322388e-02 2.466268309887175991e-01 1.210084698021180183e-01 4.301488965941687587e-02 6.983074640318064075e-02 4.480151589484754338e-02 6.740624803110129015e-02 5.679149005825921692e-02 2.772997986400212514e-02 3.248072604677370440e-02 1.648699664711940072e-01 1.787297885293036015e-01 7.639409761039644975e-02 4.172426144220010152e-02 4.341139412575585610e-02 2.722958502139697853e-02 3.096625704769770393e-02 3.390568770471067556e-02 1.893068295566662299e-02 2.427909106277438903e-02 2.343426489719118988e-01 3.895651084154513888e-01 4.675407400101459499e-01 1.183202864043479685e-01
5.081182132488879649e-02 2.528396400669665200e-01 4.559383555997554432e-02 2.980699438964985737e-02 5.072563519112645303e-02 6.371070574588581781e-02 6.340812568060466559e-02 5.877059296812679051e-02 4.104939588604027828e-02 3.190031489161511136e-01 2.263911104661943952e-01 3.276366509332312993e-01 6.658971730541646261e-01 3.237797494392176123e-01 5.888285322117887965e-02 1.146148721377229646e-01 2.150000986607748521e-01 6.457955843497471815e-02 2.963392352436527988e-01 7.218652166725408881e-02 3.001211564004521021e-02 2.659224586488655520e-02 3.403030840016244007e-02 4.742042989520131591e-02 5.060312493296145048e-02 2.753441006653073453e-02 4.427878119467519580e-02 3.419695111336333582e-02 2.974158156634966119e-02 2.068841250014483157e-02
1.127099757352308246e-01 6.196082780951416014e-02 8.484945358141361693e-02 8.241954879323727667e-02 6.659548139563425950e-02 1.044950760947240403e-01 4.872628974078740960e-02 3.393910156316641558e-02 4.176131700937067703e-02 4.524342510919132643e-02 8.772084183243823718e-02 3.973167030712358438e-01 6.912233907710465530e-01 3.534813706601588335e-01 1.256279655179592947e-01 1.403034115358278988e-01 1.552476424965812396e-01 9.957276670086148695e-02 3.194643232316021764e-02 1.647061284952584248e-01 2.876302398986698913e-02 2.900993989881508334e-02 3.408611060112484020e-02 6.070314558568566665e-02 5.748566627977028110e-02 4.083506169293629057e-02 3.126686436541009639e-02 2.779602979011591701e-02 2.961151937072305576e-02 3.125942005167721416e-02
2.682905593258453486e-02 6.490296656822935883e-02 1.486207032319032673e-01 4.009036227067681035e-01 2.668746259160664214e-01 8.839134231474228554e-02 4.879215098933020744e-02 4.245598181420223716e-02 5.599599695906493785e-02 3.792528301270814417e-01 1.048928033059835091e-01 1.298769251688248472e-01 5.152562021662440150e-01 2.182728139600274564e-01 6.777829293244549969e-02 7.760059995884349693e-02 2.860694639470225814e-02 4.195872923370275176e-02 5.800861484856471850e-02 3.464305672017369830e-01 2.746189907481976986e-02 2.989423759137597308e-02 3.768383827187147400e-02 6.234596872970155773e-02 7.863948554097126287e-02 6.841951579077505674e-02 5.014602053159711997e-02 4.611752401209725377e-02 3.953150987030126795e-02 3.199908512403097649e-02
2.328279037204966304e-02 6.611846375506812146e-02 1.165607167584242349e-01 8.331721091103727606e-02 4.909592564707504492e-02 1.895672041406234742e-01 6.460418359475697536e-02 3.529616198875674266e-02 7.706952418858101228e-02 2.503480606920062412e-02 8.830289975307445416e-02 2.284784479001785926e-02 2.355959873874956256e-01 3.152434289260176437e-01 3.321468225352222636e-01 4.436396424397432980e-01 3.975981467885787435e-01 2.576479990593157354e-01 7.325629161425788460e-01 3.427602966633594983e-01 3.563385440094768430e-02 1.776519649504966769e-01 1.334165695870833668e-01 3.161529358735321038e-01 5.016818404619940996e-02 3.700137680513006233e-02 9.401727601260743972e-02 3.465144917763759991e-02 5.316194199409147308e-02 5.979258329065936794e-02
2.189210356335162880e-02 2.192420011523889267e-02 5.916656473641288688e-02 4.396496134235981512e-01 1.594236523915433523e-01 3.561394064003960830e-02 4.158990040891278328e-01 6.748656975820623016e-02 3.518339435208275856e-02 9.262932962307239559e-02 1.891226896604832897e-01 1.129159241804818525e-01 2.121245510140291890e-01 2.667018967451385558e-01 2.385708856615808837e-01 2.856176800206077226e-01 4.849929567695612787e-01 8.355358580428273729e-01 8.476898341628200662e-01 6.623557771679575712e-01 3.317602240084866622e-02 3.836216466372312922e-02 3.784758586432920152e-02 1.024641565425077339e-01 1.319621588395544776e-01 5.791732353113473453e-01 5.707671084598736622e-01 1.225495946066290087e-01 5.423253206618475902e-02 4.052898595270437027e-02
2.014190325322312569e-02 2.183700742132039033e-02 4.856034875070013024e-02 5.347697923799681063e-02 3.569011059871568525e-02 3.759295349374532080e-02 2.099545071018267817e-01 3.347642520411608924e-02 5.279009105452614481e-02 2.035697084154339601e-02 2.098098781495347231e-02 1.704131220468589267e-02 1.210810832364556111e-01 2.428953568209933356e-01 2.244672960659942762e-01 3.411387446550074309e-01 5.874195195793435742e-01 7.102810983846161719e-01 4.082548208717883820e-01 8.837941423785102002e-02 5.271845223487090643e-02 3.599917969283779606e-01 5.224511841875526530e-01 8.645407579083900229e-01 8.012443647040277117e-01 1.031505641883411206e+00 8.126890918842091249e-01 2.404303996756107231e-01 7.839473821356257588e-02 4.523066210988226782e-02
2.565693093343940703e-02 2.946087982748803527e-02 2.855380762233016706e-02 2.658656118834350213e-02 3.806579788383110396e-02 6.398337994905343995e-02 1.511996161364326796e-01 4.858179544286505003e-01 2.297192636599079130e-01 3.900599096709593538e-02 2.875583281612725459e-02 4.441259057157343620e-02 8.706400113546941544e-02 1.272906520217124138e-01 1.669076505827211676e-01 2.973185999365951515e-01 6.369176733556578540e-01 6.360423066342377751e-01 2.988131563521688183e-01 1.017634740963433981e-01 4.358030907746371363e-01 7.855803216459434912e-01 1.001217377549932896e+00 1.009336595327015695e+00 8.712992157574283025e-01 7.395037367562538044e-01 1.071285445761319677e+00 1.904091332981636686e-01 1.066983035714880040e-01 5.720464382238700518e-02
6.355731815450303690e-02 4.966178585812350277e-02 2.416015867058060942e-02 3.358229529034655741e-02 1.775169058182454046e-02 7.255261063775292341e-02 3.889797011733546195e-01 3.159635757923219823e-01 3.110345571770896655e-01 1.545142224715285173e-01 5.972190483476137041e-02 1.829643119716944585e-02 1.766137726513329620e-02 4.197995719096275086e-02 8.270183150983606568e-02 3.770156418282553101e-01 3.931650887659162152e-01 4.625786837448310762e-01 7.983244198156332072e-02 1.395542981483017531e-01 4.809507518815858695e-01 1.031071676271789750e+00 1.259204287433314473e+00 1.274377552468987762e+00 1.024129810391566808e+00 9.629694124151442214e-01 8.754071944835077890e-01 7.005553832563357064e-01 7.173933294834573815e-02 4.434139690454798610e-01
2.523082398925616601e-02 6.914488736269504277e-02 1.199686563012540563e-01 3.088570323533502970e-02 5.700355371001100679e-02 7.871958334424790371e-02 2.496780819959175390e-01 3.139246202232685024e-01 2.160982803742833303e-01 1.819866797796497737e-01 4.368025704443897345e-02 1.281661704918344580e-01 1.938781718773029128e-01 2.389872046360477786e-02 3.779931666493331621e-02 1.748360048940507394e-01 7.250101926608241987e-02 2.342152192094524785e-02 1.375134414147861361e-01 5.078961597221353513e-02 1.884409521351121108e-01 9.975310271421981012e-01 1.253503672573110572e+00 1.277980319488910999e+00 9.037717209246756145e-01 4.056229232669993356e-01 6.413108935949287659e-01 4.369034137476114354e-01 9.928683710108238136e-02 3.219426476014867200e-01
2.104298870615595868e-02 2.973598125419184973e-02 1.905520475795121835e-02 2.131383931815069438e-02 4.447858339646559855e-02 2.564258061861342947e-02 1.327609105025250313e-01 1.727921348845117555e-01 1.600153371934326385e-01 4.545293659807592146e-02 3.519172221590100569e-01 9.001813684658045711e-02 1.538332542760070532e-01 3.672573626487226628e-01 5.291925555520778091e-02 2.644304193791118668e-02 5.179152166741529673e-02 3.330779022788117327e-01 2.759757562561746674e-02 1.172168585183833295e-01 6.182107163370033076e-01 1.165986668581492358e+00 1.246165241182557226e+00 1.148762810973118054e+00 8.491991827657865421e-01 5.999158348232315197e-01 5.646047931416321441e-01 3.944461313838976135e-01 7.978486994930281129e-02 2.477779020007929156e-01
5.069848981165581830e-02 5.069622326685981756e-02 2.925317194650008806e-02 2.347937963133190850e-02 3.108997748573171654e-02 1.472636136887816444e-02 7.719381949416966038e-02 6.645769015079565356e-02 1.876635217577244524e-02 1.294017847369951027e-02 1.562832583731211811e-01 1.383306568426287686e-01 7.636441492460219194e-02 3.436851247076927462e-02 7.168781036787842675e-02 2.020793564526482122e-01 2.842333344361852934e-02 6.189265116943006712e-02 5.853294498372689503e-02 2.358848310195912623e-01 6.445465897095620234e-01 9.506876429166590814e-01 3.856702585446817322e-01 5.603429262030104052e-01 6.818947586065731148e-01 3.714960002102984382e-01 2.874324358048127026e-01 2.512399840030614118e-01 1.391504010417355386e-01 1.513079691216848155e-01
4.154170802333816137e-02 5.817353091329648118e-02 2.444258601523667807e-01 2.080322379380888931e-01 1.919832287772385293e-01 2.796190550570893940e-01 1.345213621416973919e-02 1.010373626249395224e-01 1.419386956388270782e-01 2.448188537647929403e-02 3.613383084583109833e-02 5.774591077371360459e-02 5.414242055298560535e-02 1.644653335121144533e-01 1.769621866425673609e-02 1.368970333107442927e-01 2.517792083839498485e-01 3.491046800836664632e-01 2.356578888052777154e-01 1.758496165854382398e-01 1.244009961995229674e-01 4.548703211233373622e-02 2.867169016120670877e-01 3.722526504890878718e-02 1.268180266140641055e-01 4.808811799728664876e-02 5.149322207283577729e-02 2.030782595552442782e-01 2.621563787551942776e-02 2.444353928126814790e-02
8.865842927042934252e-02 8.809146089127431467e-02 2.782922699896565599e-01 1.618907820492030414e-01 2.687296808828492090e-01 2.090126116359105057e-01 3.298153233408345208e-01 3.664900511853493720e-02 3.367131281750923577e-02 1.454595968228835669e-02 3.597903709242796649e-02 6.628570727902252657e-02 7.110027049203757055e-02 3.207416630267956870e-01 2.333333514349074378e-02 7.717100869237286664e-02 2.782377554116011176e-01 5.112016824472463972e-01 5.707630767993632226e-01 4.893241353906526148e-01 1.108040990733139275e-01 3.025018891114383476e-02 4.343746587274290721e-02 9.502118573185590333e-02 1.765846591402876475e-01 5.075628408516263262e-02 2.435350489565134002e-01 9.922550531547148778e-02 3.693436650015483741e-02 3.531457186896927447e-02
1.114318435652838640e-01 1.917089621897157675e-02 1.577961803274005315e-01 6.743585230948394293e-02 8.434877139138625968e-02 1.921640170616988608e-01 2.596454200593018569e-01 3.039133177374165468e-02 1.650530532927506691e-02 1.877556573128756970e-02 3.403699466610542179e-02 5.798024738232181868e-02 5.338419270947813988e-02 2.515203689302255019e-01 4.385517503740282014e-02 1.259053654943419753e-01 2.127792864140219120e-01 4.815542029057707230e-01 5.957253325790015097e-01 4.991991009273673563e-01 2.961458973747672085e-01 2.951015263429516700e-01 2.036502659270752469e-01 3.621819928683704948e-01 1.929244862049746823e-01 1.054157640573903099e-01 9.291312790380758246e-02 1.754415029727165176e-01 3.045385205035955334e-02 2.733964735868595064e-02
6.850434347481934583e-02 2.902943120938294985e-02 3.429843343748540385e-01 3.642236780552437492e-01 2.461943062589902476e-02 1.748243031315540111e-02 2.653335244807028537e-01 1.134544891369459324e-01 1.665531589606159546e-01 2.125332556597155087e-01 1.988217710146485476e-02 2.385779805649093643e-02 3.128264362596557685e-02 6.034541122128882912e-02 3.007544754998723313e-01 5.733592358104158682e-02 4.046254568376150135e-02 1.731689194515680374e-01 2.088709611114498987e-01 1.723010193475164875e-01 1.824882835157234373e-01 3.742481642621031668e-01 5.974261108534369841e-02 9.752004674803374518e-02 3.936744783423481442e-01 9.133370720703208601e-02 2.067224946154413434e-01 1.632506882186460229e-01 3.639864826189150027e-02 3.148353388218352866e-02
2.481098280908416651e-02 3.496214704402517137e-01 4.452893434232637615e-01 3.464016047699142870e-02 4.733751765620943242e-01 2.223778504344310347e-01 1.070908072893832080e-01 7.880000985845243833e-02 2.482905159517652671e-01 2.330462072028515255e-02 6.518623873123347012e-02 2.414073106948191536e-02 3.568298172960780029e-02 6.595558273715458608e-02 2.729432787208424527e-01 4.056380030078410998e-02 2.779429256272898940e-01 1.270449694339834124e-01 1.809013130921419688e-01 3.020956464497437377e-01 4.303501018464649108e-02 1.246134063000525205e-01 6.427753734122378104e-02 2.993270131122761080e-01 1.903426715536157554e-01 2.109897908430784785e-01 1.169478394620393907e-01 1.734276222561592640e-01 2.999061129189394270e-01 5.058065766219432824e-02
2.552877665852469613e-02 2.848634082849738763e-02 4.273830173116131559e-01 3.433260822565337156e-01 3.321580140878633847e-01 1.314711171447007776e-01 8.816127890049112181e-02 9.274048783946310659e-02 1.040168289888295100e-01 4.120034647176982756e-01 1.207231335754385682e-01 1.209919894142021946e-01 9.721031187584677768e-02 9.879545199157308000e-02 2.626246348611198655e-01 1.772988166667034959e-01 1.212858923004004746e-01 7.172070611609548951e-02 6.112294203340375848e-02 4.534644619653938058e-02 3.634743209603281955e-02 5.318291709120735039e-02 8.137043239316410492e-02 1.899574870552983019e-01 3.247073369734393977e-01 1.463899925143692937e-01 2.239461652530339297e-01 1.532943966915322198e-01 1.566733645595828617e-01 1.024031365808461685e-01
3.047747050921942313e-02 2.103343742133531591e-02 4.281650699662382653e-01 1.981849614509125293e-02 1.342356148481875337e-02 3.181038961952349364e-01 2.192143412185329140e-02 1.734814560201150199e-02 1.432370308625348365e-01 1.037472937289961178e-01 3.885997025413738537e-02 9.026767478630071118e-02 2.265065245158508211e-01 2.085009722178504110e-01 8.656008258855776849e-02 4.372288137536842756e-01 1.374384225764021250e-01 1.551246160374918359e-01 6.905572986035926619e-02 3.030964092254388384e-02 2.944572504296280938e-02 4.600597437825559854e-02 6.984228705475589716e-02 2.130692417412672901e-01 2.155043827756957242e-01 5.107913699715013744e-02 5.670989400923988344e-02 7.210344751894708082e-02 2.324006555449456557e-01 4.714396885831663442e-02
4.092368028728535917e-02 4.146594303944878268e-02 4.864912047014320340e-01 4.343987736992144938e-02 4.161379080129077451e-02 7.848058535898898291e-02 5.630496890293186507e-02 3.583993304020435255e-01 1.420664315847877390e-01 8.244390182510187570e-02 2.501408160517805401e-02 3.206089757813820884e-02 3.434231464862796263e-02 1.174639332899617833e-01 1.393039651377007970e-01 5.859251751455668566e-02 4.807221089744961179e-02 4.955700063319245369e-02 6.578834129025108723e-02 3.775100167715622623e-02 2.676220399518337845e-02 3.984067014147323060e-02 4.529645659912821809e-02 7.566500750224619543e-02 2.365694467029298698e-01 3.739679165966264263e-02 5.434797560278274708e-02 8.792651045015247024e-02 1.049395411942960904e-01 2.066577513696596646e-01
2.213634083935657471e-02 5.957587395369974559e-02 1.776917426276888867e-02 1.891791860041710377e-02 8.126871197995978735e-02 8.563118050313373031e-02 6.072612651200628986e-02 2.448927683390852705e-01 1.891414447646273533e-01 1.777329223689781412e-01 7.343465653301019247e-02 3.726377613186437204e-02 2.242574404982192876e-02 3.525708901531424133e-02 1.600405198874769452e-01 4.169158911882193952e-02 1.105972418175237559e-01 5.012030263777503963e-02 9.135578016206344354e-02 1.454840017318705658e-01 3.752280040075502143e-02 5.249428955346194942e-02 4.568740625822736989e-02 5.021375807552026088e-02 6.667812252606965251e-02 5.115174226869352581e-02 6.016756334558165387e-02 7.328010326961956200e-02 9.758448612101845721e-02 2.376723821274340509e-01
