2.501384512166251670e-02 3.756716019649795207e-02 3.267228656255334596e-02 4.116953302876221604e-02 3.127525018300034154e-02 6.859568442095022311e-02 6.819673945723130071e-02 1.849950267673015070e-01 3.357165435746869986e-01 1.481851092030798678e-01 6.702204436702917378e-02 1.493697443685259967e-02 8.632417290051715153e-03 3.219702137828301530e-02 3.737673680457011260e-02 8.171841175877525218e-03 2.850197295771501882e-02 4.942957846886966711e-02 4.426180342056015155e-02 1.543859979006949323e-02 1.318793654271619570e-02 5.533535246686119985e-02 4.393892728949244653e-02 6.819760397304523714e-03 1.257632352822622354e-02 1.043548480996306545e-02 1.402824107966135492e-01 1.287127238168556641e-02 1.246347304053373878e-02 1.587480542991523066e-02
2.029113657167332802e-02 4.626245779208233710e-02 8.292378884013340556e-02 6.782949544908577211e-02 4.717906251115117078e-02 2.107441091903571873e-01 9.995943827266645654e-02 1.267841537308960764e-01 8.280686540779712279e-02 6.900912675334991420e-02 4.724642015574045256e-02 8.963520736848720055e-03 1.165878471718103347e-02 2.648737012266055846e-02 3.682860273838500093e-02 2.342575547110881118e-02 2.866079307015075711e-02 9.284631778926465129e-02 6.923123863113109233e-02 2.059155632295009072e-02 7.780108588547699280e-03 5.245593355081462628e-02 1.138474989870410375e-01 1.018984371104718484e-01 9.250192068847387650e-02 1.319800326754513309e-01 4.992736880066977329e-02 1.322740890069321745e-02 1.898562454943029248e-02 1.911513158061915740e-02
2.520877277045106002e-01 2.658432314512887418e-01 5.624381019141798665e-01 4.583157712675160478e-01 9.696853856643314895e-01 9.850112191452764510e-02 1.824631507314038517e-02 1.967706613477745309e-02 3.173549074885325116e-01 9.355185587785165569e-02 2.421678016196026628e-01 1.559408501573172623e-01 5.589335749187848701e-02 8.078875892755360555e-02 1.533752792674602551e-02 6.373455272960640294e-02 4.233213079969426473e-02 8.567341306513275023e-02 2.814677831223515447e-01 4.622329560284930278e-02 4.807621017177048615e-03 4.333874631726928467e-02 6.996336797869333324e-02 2.531623293344957559e-02 1.592549857820428627e-02 1.113851075794153669e-02 1.050438599570529749e-02 8.283002391625113661e-03 1.415144386431687988e-02 1.588745797289106004e-02
1.177079809788435655e-01 3.490117136321335689e-01 7.669577337626360958e-01 6.204761640890820162e-01 2.519830116279902499e-01 3.878818918548943007e-02 3.052468541577807795e-02 2.104549247915281709e-02 1.294953729087214636e-02 1.175790441271074710e-01 7.199364069241170894e-02 1.378817810218088136e-01 6.105094386333378281e-02 4.050007486233622722e-02 1.254882506097680997e-02 9.604609713633482232e-03 1.990594673448736404e-02 3.439053404763452171e-02 2.393971786212430175e-02 2.014253704924311855e-02 9.580073665217585591e-03 9.129219318754074053e-02 3.155774601474946317e-02 6.434236482695213089e-02 1.307205677653074105e-02 9.883879531949154792e-03 8.876148971958213937e-03 8.418568140096026331e-03 1.707851876649042755e-02 1.854433861717095025e-02
6.788186381357040611e-02 2.174294062350146939e-01 6.078781352629661905e-01 2.355128229395548056e-01 1.329097811180822708e-01 1.930264809367884804e-02 2.953388872526140074e-02 1.681909762244052434e-02 7.615185610039142128e-02 2.662517394811744764e-01 3.197917822972236590e-01 2.600517312154871363e-01 4.087865486287465405e-02 3.831844983379824321e-02 2.042880886093960402e-02 8.680140770028087205e-02 6.799229419793599571e-02 3.295354033238397790e-02 5.202732846830059737e-02 2.955211235723965296e-02 2.101798958832683598e-02 5.872268164872100280e-03 1.431308375700432282e-02 1.041917641140013701e-01 2.370846130667609783e-02 1.311974053320870241e-02 9.399643992152158234e-03 1.085589985211560596e-02 1.695044542165250606e-02 6.224236452256378532e-02
7.367584479417986498e-02 7.824499261452637355e-02 3.262384636680116246e-01 2.613818261101436002e-01 1.027918360164781497e-01 1.102707596347619542e-02 1.347108237496351738e-02 1.475528913333070194e-02 1.399200227028321759e-02 4.097649270251821907e-01 3.064895663511645330e-01 1.649750935507587613e-01 2.289548317569011296e-02 6.889320173235810585e-02 5.939305157299324539e-02 1.032880971612975401e-01 4.186724657144738626e-02 8.766320227665290454e-03 2.793337211249942442e-02 9.557730057135110924e-02 1.155703798894408690e-01 7.010247653112391952e-02 1.978380516748186671e-02 6.306334290152139366e-02 3.561244729950546056e-02 3.407912147078448473e-02 2.160919219065347494e-02 1.486205466769191692e-02 1.955473304259521677e-02 3.507502188895232631e-02
1.061031507912471999e-01 1.627425720544387749e-02 1.591014493560752308e-02 8.083639482890070393e-02 3.880092628089080314e-02 6.460283504681636757e-02 9.839491404137551411e-02 5.638262344186292102e-02 6.779804305024131339e-02 7.616370982367237641e-02 5.665215122335309078e-02 2.525574549408402675e-02 1.036305331406787988e-01 5.081805331942706311e-02 3.072606727868319731e-02 5.407121645857992931e-02 2.475878853590074771e-02 9.341359064505153423e-03 4.717172745000251799e-02 6.416221584645127873e-02 3.339852233789249863e-02 8.896122264240882010e-03 6.366350972103296257e-02 6.016356462202573224e-02 2.437677138279077324e-02 2.511528426235204101e-02 2.211300011588912887e-02 1.900175635055996806e-02 2.165620941153825404e-02 5.131832995038956846e-02
2.050805952086311168e-02 3.820404491923835855e-02 2.077942954712702281e-02 4.525218290694914269e-02 7.042091930522931253e-02 7.999386244352955921e-02 7.135729208683166958e-02 6.782502077927961281e-02 5.447165751018930718e-02 2.959028752322908143e-02 1.157271631043951809e-02 4.006196995640643604e-02 8.765880250569105248e-02 3.289191666364140593e-02 3.802432567921303075e-02 7.058990636606632396e-02 4.511118424838090474e-02 6.128342316198113343e-02 5.358853455402540211e-02 3.939305794778875935e-02 1.383790102905601421e-02 1.096894057783069643e-01 4.468526812900749240e-02 3.782627259236935602e-02 1.803119583141148813e-02 1.859559759752073965e-02 2.769301630345503626e-02 3.198826143446506509e-02 3.112394703656467046e-02 9.273326062410780501e-02
4.725740967665590514e-02 3.166995404056590496e-02 1.883942252233153716e-02 1.113397906918316693e-01 7.341916849772367470e-02 3.152497567772716974e-02 1.019543482057848477e-01 4.619080561014952263e-02 3.893602830089324535e-02 3.755057148119206323e-02 3.283989265915136790e-02 4.466939251898665447e-02 9.941030778591905537e-02 7.210792862104294099e-02 1.187570223939845154e-01 1.007294986698145517e-01 3.888880768811241173e-02 1.086242141716085158e-01 1.071220885501915909e-01 1.966687498603009523e-02 4.815189310163325159e-02 5.028074115460693522e-02 5.518954080952827301e-02 3.619283855640598874e-02 2.116195542779822011e-02 2.943343932396439572e-02 1.020590958342098009e-01 8.561068047153810173e-03 2.599479586553069682e-02 1.333034775434182445e-02
7.458550581190909190e-02 4.955639381240852653e-02 8.041052356395066159e-02 7.754811810564418706e-02 7.296299933754275824e-02 1.608182112569664368e-02 8.208891586428829212e-02 3.492264733863550963e-02 1.362946700514999082e-02 5.179667386563234499e-02 6.275495618503319772e-02 6.044485260401027266e-02 1.265134148196512820e-01 1.411960189557538436e-01 6.806111871132747293e-02 7.364779025472284468e-02 3.802284403756356346e-01 3.879207321178412271e-01 1.619390090426446605e-01 8.393429142039210422e-02 6.035893887939817321e-02 3.829080328898753355e-02 4.383754768668044616e-02 4.819172523793553709e-02 2.682835371353649648e-02 3.203725215360975903e-02 1.464238190578452496e-02 2.251337076589696173e-02 2.715851212094782738e-02 7.272159099483226606e-03
6.455779777179031231e-02 3.430723076596371712e-02 7.764101049235687391e-02 6.475059239809682898e-02 8.776316579884704816e-02 8.275679045151250468e-02 8.049170749525041968e-02 7.429547967455274460e-02 5.106736081094785662e-02 3.440899097100815623e-02 4.937481029111486786e-01 8.223772505220300344e-01 1.684599864904637201e+00 8.125414010369539364e-01 1.465409020430526177e-01 2.839095295586548384e-01 5.320219531121832546e-01 1.478221982274481316e-01 3.656301985454070425e-02 9.617970209671197757e-02 4.047867396473418811e-02 3.645481636609863157e-02 4.697670529684853241e-02 6.569975373934210106e-02 7.011005721679339220e-02 3.671220658904660039e-02 5.460849567090932111e-02 4.193750540932185411e-02 3.918415987798223865e-02 2.949364419659918773e-02
1.605688573422721713e-02 6.977381270397441104e-02 7.161388252608302807e-02 6.060181981391107864e-02 5.430550910821496657e-02 1.675556817987930436e-02 6.100677577390920675e-02 4.303009298128412236e-02 5.165972873056817738e-02 6.890147941839615264e-02 1.464264730404168935e-01 9.706343381872967191e-01 1.733817312377317288e+00 8.805899633131654136e-01 3.107138221992412630e-01 3.452279303980764769e-01 3.812211783862616832e-01 2.244762521551833534e-01 5.727547216318379375e-02 1.854081792132949297e-02 3.853264905888834774e-02 3.955636494078570986e-02 4.668909261417216600e-02 8.348307757371713211e-02 7.933233912044514169e-02 5.637004030734996118e-02 4.323798474726322366e-02 4.018494365481866532e-02 4.502987907887569946e-02 5.007678148889765923e-02
3.066619111286046293e-02 7.058870530724190018e-02 2.353227631098300451e-02 4.595512570207520298e-02 3.260581324403406811e-02 9.952558705295527774e-02 5.754158681988984225e-02 5.271824606379944128e-02 6.809493600786022116e-02 3.459185653246615866e-02 1.001814888029601940e-02 3.037478807077503840e-01 1.278930172123306397e+00 5.395220998709142624e-01 1.667746910378971881e-01 1.903048695864920370e-01 6.992834696816786766e-02 1.021693451570551275e-01 1.157482597478858705e-01 4.607459341277986287e-02 3.636942180854222523e-02 3.988514177502349572e-02 5.014138676587798216e-02 8.421381108542735916e-02 1.074434725396694185e-01 9.493923747571818283e-02 7.015490003962883414e-02 6.765098453882747997e-02 6.095237904554658137e-02 5.203265315463403290e-02
2.686675027444689751e-02 7.225531760737873010e-02 1.913421342876051381e-02 7.359704537328248808e-02 4.367355390519803843e-02 1.941153740058756960e-02 6.627268971718743018e-02 5.379471111658496590e-02 9.092999754263354772e-02 2.989341655976549689e-02 7.251713280415022708e-03 4.890227162080060946e-02 5.800230425695910297e-01 7.732481053990112319e-01 8.130061772349456151e-01 1.084648752173784869e+00 9.686786357291022886e-01 6.253933404356312176e-01 1.699493023533341640e+00 7.885894952458213369e-01 6.787209629775881048e-02 2.170898873905860102e-02 1.762952151559334796e-02 4.511100240299918684e-02 9.827352993475754750e-02 8.633976364670635506e-02 2.263946917194811503e-01 8.517297086430822284e-02 8.246419042863488424e-02 9.816443066860730537e-02
2.588215068398707144e-02 2.464736343808244731e-02 5.807789198862238489e-02 5.974075969672144187e-02 1.700464804801672322e-02 3.564581515969747483e-02 3.594123032891102798e-02 1.029430726338818464e-01 7.080960422414653288e-02 7.392129203792000523e-03 1.530059199621123210e-02 2.443557168422470782e-01 5.236734535151740255e-01 6.561158203322229321e-01 5.852195970221932830e-01 6.993119337658862955e-01 1.182942677091647132e+00 2.029335233145972417e+00 2.049623377316727169e+00 1.595876570165927655e+00 6.772112482394787580e-02 7.034477449658349535e-02 6.284595733152818775e-02 1.975534536219120119e-01 2.855804817195769507e-01 1.468175513853754000e+00 1.473258899441306058e+00 3.234307485645679936e-01 8.557352418468287814e-02 6.709013895782588166e-02
2.465398203612719288e-02 2.578038891634007804e-02 4.961996726118866885e-02 5.034834220579788300e-02 3.196091634617082705e-02 3.824260394557254389e-02 1.975968278023374283e-02 5.311349594046270439e-02 1.102606731520540673e-01 4.013883619543436726e-02 4.239218551935124840e-02 3.824701334716160139e-02 3.008482480460290542e-01 6.005669224933292139e-01 5.524288573583925332e-01 8.368360336373359409e-01 1.435048717422150011e+00 1.727026529675278699e+00 9.875012028290743871e-01 2.131009243692124355e-01 1.276443321544438736e-01 8.764321513662427510e-01 1.280529548242263616e+00 2.165189034148183644e+00 2.065926271570614148e+00 2.741673128162694706e+00 2.227352622475589961e+00 6.606293882324852929e-01 1.264486878813126380e-01 7.527134841086971506e-02
3.260835858498676437e-02 3.639678890709394099e-02 3.340596129556314131e-02 2.957968836348015898e-02 4.224064200499878796e-02 7.430861760700917251e-02 3.126430373219240555e-01 1.032721108552098865e+00 5.044771644298419178e-01 8.854089988009047896e-02 6.748896852023032744e-02 1.088638101358895965e-01 2.175804765871053870e-01 3.161285749598143346e-01 4.124266325119343990e-01 7.323503565351452416e-01 1.558773248066730899e+00 1.546374685440549346e+00 7.219241903525465132e-01 2.453423538506792900e-01 1.058072914878158688e+00 1.921489659284131513e+00 2.465601611176896135e+00 2.568641687964032805e+00 2.318773606326411940e+00 2.061238692323781763e+00 3.128139697632096095e+00 5.518788532023219950e-01 2.308618605341061086e-02 9.152784136500501100e-02
8.339630102360057196e-02 6.378038670773239494e-02 2.997528761340997189e-02 4.088181822982124569e-02 3.465509947976178062e-02 1.568157687757717744e-01 8.583863185422149211e-01 6.976684169176193828e-01 6.861527469027027815e-01 3.520478494175153239e-01 1.324456236303563905e-01 3.694813075292861099e-02 3.647922254062417602e-02 9.217610532732441186e-02 2.056443933044282135e-01 9.370622772684520374e-01 9.675026242315991620e-01 1.104889760351601913e+00 1.893141009538890362e-01 3.306663713808422611e-01 1.171474580118473607e+00 2.529857313942841746e+00 3.107773853339026005e+00 3.289196381348984399e+00 2.809831808506413786e+00 2.827835212924582287e+00 2.732025365827837504e+00 2.137978782317309090e+00 1.016201507349762251e-01 6.760891961556825258e-02
3.356822482971845434e-02 9.014845848947773688e-02 1.374427118221507871e-02 6.250950437866997778e-02 1.303834764243589073e-01 1.810797425530625837e-01 5.715554030574332423e-01 7.155354568270807514e-01 4.910811237323273737e-01 3.880887275683750914e-01 8.277431407187695045e-02 8.295562280976274613e-03 1.271089146202974800e-02 3.563927256155675211e-02 7.733339589302629102e-02 4.546746136174904529e-01 1.699844077767176109e-01 5.307329933641580233e-02 1.747961001626508262e-02 1.257346344624410972e-01 4.792694311947159336e-01 2.552235247717220989e+00 3.222590567432592756e+00 3.403988079607379813e+00 2.527863212936320547e+00 1.199881573689991487e+00 1.991709755815597616e+00 1.349692053627035593e+00 1.208701918022592331e-01 4.687780166091398693e-02
4.965198877222849749e-02 6.279231173198220051e-02 4.012171979541479666e-02 4.569363174355604851e-02 1.062728767503438032e-01 6.098140427680096703e-02 3.141371338864891172e-01 4.067002491887384275e-01 3.747138689952601021e-01 8.886910256753942361e-02 2.250029138644928442e-02 5.277949354333533530e-03 9.553067514126867971e-03 2.785509549327480974e-02 1.025135150758163111e-01 6.794347852777066210e-02 1.213179386963374323e-01 3.503095029471486183e-02 6.460739987605973456e-02 3.041650496598662934e-01 1.642312372904293438e+00 3.105450096167859275e+00 3.325395085278711083e+00 3.152369971925218728e+00 2.425272186153029086e+00 1.785439797896961611e+00 1.740432306395665929e+00 1.159849253318195439e+00 1.037248499201926383e-01 3.638906452032433791e-02
1.275725622907921408e-01 1.152862191745878118e-01 5.891648642072314090e-02 4.224837337253131014e-02 5.465147134471239759e-02 2.935569806047523544e-02 1.673330356486081028e-01 1.500770463086825712e-01 4.163320302331113137e-02 2.318576216347623120e-02 8.673619627423863332e-03 8.192431750771002677e-03 9.162551705894760035e-02 4.472746914200954188e-02 5.931559259405355146e-03 2.029067008338305070e-02 7.116212037023883497e-02 1.586624951168512099e-01 1.496018191975774791e-01 6.604816937697890467e-01 1.801184922533529686e+00 2.596149345655396790e+00 1.050242124026253610e+00 1.556307852414737569e+00 1.984952833037280984e+00 1.111460276959560511e+00 8.215038016848474900e-01 6.778736360292335617e-01 2.857591303468288990e-02 2.651702136579547550e-02
1.030541475483844199e-01 1.171704444988054122e-01 1.734603041478309515e-02 1.209149470525188591e-02 1.001482773387983582e-02 1.496811535312434632e-02 2.158162281001802310e-02 5.488072470160022982e-03 7.285743748917409765e-03 3.119716240791331127e-02 4.432178564706645840e-02 6.999913672627997019e-02 6.609154743271808408e-02 1.236042500063539579e-02 2.866231696564609799e-02 3.807856492133105952e-01 7.182172053315603044e-01 1.017229319585839287e+00 6.805787439559877194e-01 5.039653306458776738e-01 3.543763135817711296e-01 1.255282633651794433e-01 4.838441716715434493e-02 1.033781147291626817e-01 3.668141045119857613e-01 1.212017051290555092e-01 1.087907023476976515e-01 4.356615984047962353e-02 4.201886162480977099e-02 3.952135450014819529e-02
2.116973483105679676e-01 1.614195458685439288e-01 1.799626132870926765e-02 8.162196483038217099e-03 1.237016674636222564e-02 9.377319588870244513e-03 1.440205463198626287e-02 4.593151246025593132e-02 4.284166946828217581e-02 1.870608931988253926e-02 4.682516838560496497e-02 8.476354592871042370e-02 8.695260917477287688e-02 2.400660218865400403e-02 3.325259427377523502e-02 2.180672559116637876e-01 7.835304996042231629e-01 1.429012664657773213e+00 1.582603362175316164e+00 1.345575519189454505e+00 2.826093945189044887e-01 6.233666795712190095e-02 7.710967036917243389e-02 1.892407103319131978e-01 4.152505426102794384e-01 1.206340980189554712e-01 4.490576432059544681e-02 2.097077886272401270e-02 5.730447896838520433e-02 5.556063882744177729e-02
2.584288936683383220e-01 3.279256195293091952e-02 9.467321104778235463e-03 8.172807189914171877e-02 1.074214394379477550e-01 8.412119280044375730e-03 1.105298040074729343e-02 3.762912459065300558e-02 2.129870554489268764e-02 2.433516356748779280e-02 4.447524441425261543e-02 7.509989041849700342e-02 6.640547945088738635e-02 1.910356291485575814e-02 6.285443332652526638e-02 3.022443555367331780e-01 5.739782002481189638e-01 1.291792069649830843e+00 1.592046223965009499e+00 1.326471798406749114e+00 6.565522357220142657e-01 3.989238391020447777e-02 2.829054151714105458e-02 6.092364080656270664e-02 3.323793809961345103e-01 1.996879471706696219e-01 1.772380056866961207e-01 4.019882062727898886e-02 4.514237955046690454e-02 4.106580793549902825e-02
1.395072954145257227e-01 4.327689447147624324e-02 1.797084102687273102e-02 1.816077241312170909e-02 4.295364663015661943e-02 2.910952463644002342e-02 1.221627640322765773e-02 1.473484808582600503e-01 7.060218319362349115e-03 9.122843581186397890e-03 2.617760599786637943e-02 3.112556991313273139e-02 3.964543348820874502e-02 7.542762937162568460e-02 2.417244606876364083e-02 9.055305679139337427e-02 8.919305067972149725e-02 3.719575956651131610e-01 4.671754020031481103e-01 3.982627995355103034e-01 3.345971588286187903e-01 5.102955119022320463e-02 7.450821121922861223e-02 1.517712826190219938e-02 5.876572382459736149e-02 1.482710573237695229e-01 3.963822548870965523e-01 2.378414681001241038e-01 4.964040455105395849e-02 4.342371789569828000e-02
4.969625502911693971e-02 1.979975990271041347e-02 2.222922725150502585e-02 3.965802417931935803e-02 2.295380266081049198e-02 1.059358545688955308e-02 1.472173676055241465e-01 1.043272299065960557e-01 1.044408144832281553e-02 3.862036362107358622e-02 8.075032674790291742e-02 2.962430695482668949e-02 4.379143461846723290e-02 7.904429253647492215e-02 1.966369093866375192e-02 3.204006176879909545e-02 2.463474106772015754e-02 1.353967589173604019e-02 2.237981010613784155e-02 3.918717359195255517e-02 7.245863871213256702e-02 2.108217856175553795e-02 7.681499277673504988e-02 4.585041511464210684e-02 8.289700271327921088e-02 2.973843245244134348e-02 1.028900982156911448e-01 1.187044890014843507e-01 6.615589325040932556e-02 6.275380231991938007e-02
5.036809220755282535e-02 4.060383627763709813e-02 2.081559897021120764e-02 1.609881090546251559e-02 1.584818739304061710e-02 6.140495910639261201e-03 1.222935384553673621e-01 1.251853813558795325e-01 1.348010519366047710e-01 1.774297839343497163e-02 5.844422257549970225e-03 6.712996101893716275e-03 1.097338533034687286e-01 7.205553794113670613e-03 1.836084848738658501e-02 1.244120873057316147e-02 9.764894075472306881e-03 8.591906387386444299e-02 7.727061046367232622e-02 6.081781584119109324e-02 4.849896893709358670e-02 6.838414790981608982e-02 9.358516332989311182e-02 3.182776183617310600e-02 3.910232242341624836e-02 2.293334729039986711e-02 4.364809184895574595e-02 2.764871573326357565e-02 3.448270861679390842e-02 1.132669665813439558e-01
6.843755242695569174e-02 3.585260787825012702e-02 2.141590036397853988e-02 3.082210788622496977e-02 2.869565570279643957e-02 1.559898491938877148e-02 5.236465108240859201e-02 3.925142307263135288e-02 6.050160775579095478e-03 1.332840838747689216e-01 4.745273232984813933e-02 1.013269475766144651e-01 1.367849716119344701e-02 1.386324401191803626e-02 4.111759473679840737e-02 3.473469503466013186e-02 1.320283362297849580e-02 2.257478208798209540e-02 8.792474577195018293e-02 4.061371393180222833e-02 3.914358322338634677e-02 5.907697105077568123e-02 8.218975665942558628e-02 4.383470206587606471e-02 3.485504024060628175e-02 5.519716503640317851e-02 6.680372453745364592e-02 7.942832724417632495e-02 6.649833784786338131e-02 4.841146666061961479e-02
9.251328110830489559e-02 8.041810101973022318e-02 2.562159212294081237e-02 9.213735295485915577e-02 1.135032155109134688e-01 2.124688097068661574e-01 1.386203498759585040e-01 1.527333599278688989e-02 5.814869363072835105e-03 1.065370066317075093e-01 3.223956338394036447e-02 3.705928579498288244e-02 3.881000861398137269e-02 7.997209505845042851e-03 1.151224572589275817e-02 6.487280789018072535e-02 5.478093276631881836e-02 5.990955450678731725e-02 8.271403286531536780e-02 4.975808095924767749e-02 3.501304977705126803e-02 5.131124634556302050e-02 5.459552943360961724e-02 8.225521461499954445e-02 6.340623201377700024e-02 4.268591043371532112e-02 6.530327349949231752e-02 9.993510998546534241e-02 1.072513860457453283e-01 4.765532623171019749e-02
5.193835992291701009e-02 1.289383924990707975e-01 4.026620876637838908e-02 4.517182160724159123e-02 2.305511739772598268e-01 2.449453580874809411e-01 1.616482068250027215e-01 1.100791785842836733e-02 8.026872160373734258e-03 8.478722950059877292e-03 1.007850370587315691e-01 5.009537077819734702e-02 2.809058635151377020e-02 4.037998047071617025e-02 1.302808838127457111e-02 4.912413947597232822e-02 1.408557085733332277e-02 8.095733948577052419e-02 1.497329065870712517e-01 3.113579651356323044e-02 4.905551573586107439e-02 6.817015433769263444e-02 5.748813392418396229e-02 5.789348856990799569e-02 7.609602919744173910e-02 6.024026270787766202e-02 7.355082031190388059e-02 8.698638739887190607e-02 1.026382638559139027e-01 5.435503897953213731e-02
