1.736723797989683793e-02 2.570675374751861877e-02 2.222901667482440891e-02 2.784498797276918278e-02 2.103147855923349560e-02 4.595201662193242054e-02 4.560556968135228567e-02 1.235349879982083066e-01 2.238693098270920501e-01 9.967763838106415142e-02 4.556302851371279300e-02 1.027593366894231051e-02 6.002156690286574239e-03 2.251454616859243155e-02 2.627293699058234899e-02 5.773412462470483252e-03 2.039804823774738970e-02 3.591927685097937029e-02 3.268129205771587442e-02 1.153106911884357010e-02 9.685525027095003708e-03 3.940985495993585414e-02 3.080602248692863865e-02 4.082720900801358604e-03 7.361581101941052675e-03 5.657948508513443477e-03 2.574839163981927637e-03 7.623326006684973469e-03 7.341929296656843698e-03 9.149602394257192600e-03
1.375886085924584931e-02 3.065206530932121018e-02 5.479993470789334964e-02 4.471240947592492604e-02 3.101246779131167433e-02 1.378893405601837874e-01 6.503310447911749004e-02 8.210259001244543664e-02 5.338259700334915814e-02 4.554581781921716171e-02 3.191323065856732644e-02 6.200802889939565667e-03 8.204862261111712379e-03 1.869407235628430669e-02 2.604004895155968835e-02 1.657288040631922643e-02 2.051471448987550808e-02 6.745050988747187948e-02 5.107908538116160552e-02 1.535492493796252605e-02 5.696655538429204989e-03 3.724452934085500933e-02 2.920660722278953497e-03 2.316627864628276884e-03 1.813657862147895596e-03 2.351301554400518634e-03 2.887136965912960596e-02 7.622938238480442968e-03 1.101053150968703959e-02 1.095147541771233739e-02
1.667479994558293821e-01 1.706774528068005781e-01 3.612090130721636871e-01 2.944180566902448448e-01 6.228660960125856905e-01 6.287036635093722070e-02 1.151892560814958555e-02 1.230342015513019582e-02 1.966158504401590013e-01 6.047750769196783699e-02 1.628122194046578430e-01 1.085786894757305859e-01 3.981812913813136817e-02 5.750103900447119804e-02 1.090417051547783005e-02 4.512438174782524430e-02 3.029221605549817231e-02 6.219775105610439447e-02 2.074380354995240816e-01 3.439861345777809470e-02 3.321069692306848845e-03 3.026680407929700084e-02 4.778436954065037184e-02 1.673873292775211741e-02 9.935571467326247824e-03 6.594193685365357278e-03 5.924286475368907394e-03 4.740526617741503031e-03 8.081316029760803044e-03 9.048791426051434189e-03
7.805500743085484749e-02 2.250522039467744428e-01 4.945894178885933412e-01 4.001416208832196397e-01 1.624467007613101810e-01 2.480427457648806677e-02 1.924870389295072620e-02 1.286684924097489767e-02 7.830779226888956793e-03 7.423874702426946914e-02 4.809496741907878098e-02 9.559030097977952445e-02 4.312455091375891336e-02 2.823831708080306452e-02 8.199729123889649626e-03 6.130143384156788201e-03 1.275504941407356631e-02 2.384123754967172257e-02 1.683285168880523444e-02 1.428932908550693652e-02 6.399591165525010845e-03 2.257140139849358584e-03 2.123930991688552025e-02 4.232607712212565348e-02 8.105229116569545936e-03 5.966547402648176082e-03 5.108474383593531072e-03 4.841734890376717983e-03 9.817497876747001070e-03 1.065289707210294659e-02
4.511014660321311515e-02 1.408635179333429244e-01 3.940600938447914592e-01 1.526933297673660206e-01 8.612885450628104955e-02 1.238983072739431417e-02 1.865033790531774385e-02 1.023099250870950980e-02 4.726910564303578657e-03 1.668456181779566505e-01 2.117685888021267615e-01 1.790209820579372058e-01 2.622414126022740849e-02 2.342712881890501864e-02 1.085403535660717927e-02 3.998970502240752588e-03 3.769703139546389664e-02 2.158690644971906353e-02 3.449349653172551627e-02 1.974450668295486822e-02 1.348385526881364267e-02 3.730226357429864900e-03 8.526043170597163642e-03 2.413607153793476557e-03 1.455878127337258826e-02 7.934259558720633057e-03 5.503182583438207161e-03 6.349169535358144094e-03 9.905397081117669686e-03 3.633705365649636532e-02
4.501536046729694152e-02 4.735072107720413037e-02 2.126050256701469132e-01 1.703926497845315302e-01 6.698816091811145290e-02 7.107894246835416707e-03 8.520292337297325977e-03 8.980872928637405675e-03 8.376171283553911218e-03 2.551031894152687718e-01 2.012589363973800727e-01 1.046285894932112992e-01 1.333614782883065300e-02 4.761295302220597964e-03 3.763373034578214316e-02 5.317577199239536742e-03 2.211385068665761358e-02 5.409940855088959943e-03 1.739922572826175379e-02 5.987865199249654824e-02 7.233958928957071044e-02 4.367874924719113844e-02 1.172092738665354503e-02 3.922426467074065226e-02 2.163005000201376551e-02 2.065350687498078083e-02 1.287270786965472903e-02 8.837302387564666128e-03 1.159865302263359509e-02 2.078925202351626297e-02
6.283285886932474945e-03 9.984200798593509396e-03 1.055980104046297559e-02 5.351775005243880612e-02 2.560167414304097971e-02 4.208447518208844468e-02 6.281909135922525422e-02 3.526489014863765786e-02 4.152759927482998353e-02 4.826636968537259542e-02 3.709499250950276661e-02 1.508204775343413399e-02 7.156967087157149743e-03 3.277388571549463142e-02 1.900066673874288917e-02 3.236907005366648771e-02 1.235792467595546971e-02 5.509538985982232948e-03 2.794520015067172847e-02 3.811446210261339174e-02 1.748486419440554648e-02 4.584447039203343004e-03 3.812560815409331283e-02 3.670089079688602929e-02 1.486374591347767830e-02 1.526915859953490752e-02 1.339548231194592938e-02 1.149049715638005183e-02 1.275439192274031505e-02 3.024504441151136189e-02
1.357969757147668363e-02 2.494747582744855433e-02 1.456241639357306814e-02 3.131421033186781999e-02 4.805301113209409225e-02 5.377148089670778786e-02 4.723940573112580393e-02 4.421617733428653829e-02 3.495651157531212694e-02 1.941581617469216592e-02 7.754362049722999042e-03 2.382131386599185136e-02 5.926754600132579272e-03 2.171493636112257000e-02 2.446407310129203663e-02 3.621511927268430443e-03 2.509188405896330826e-02 3.833971703808883302e-02 3.367085829112189538e-02 2.472479663474150269e-02 7.599062753228129352e-03 4.717525691435272076e-03 2.772594758410975788e-02 2.390762384652314956e-02 1.141738277857591403e-02 1.147444538250198647e-02 1.701608692967821260e-02 1.953885531531282874e-02 1.876553009503759487e-02 2.389285491015414199e-03
3.623454434585610118e-02 2.395706689876394430e-02 1.390758530369339691e-02 8.020831735667277584e-02 5.159043104052682405e-02 2.175009024588469078e-02 6.960411262296942181e-02 3.117460772840764324e-02 2.603935511642824913e-02 2.540853498621436363e-02 2.246276998775448980e-02 2.911488667322697024e-02 6.464532977416204140e-02 4.372248472732659375e-02 6.397959966024736704e-03 5.595018097252817124e-03 2.334918874439072950e-02 7.181196026397697330e-02 7.107566951305610559e-02 1.298469679590095148e-02 3.175795294437434857e-02 3.283084408331085613e-02 3.573677175159756941e-02 2.361874936354548676e-02 1.379250515365453705e-02 1.892391888595150104e-02 2.641331765025639860e-03 4.939771002062559244e-03 1.443505556646792684e-02 7.193985370427740528e-03
6.000544387073981911e-02 3.957158877628333404e-02 6.253662655299015161e-02 5.831460625029417921e-02 5.024761930786952879e-02 9.869463538386781531e-03 4.540409762324978948e-02 2.009875002807785804e-02 8.463592964623510226e-03 3.654118257618312049e-02 4.377305099975289243e-02 4.212138520300492267e-02 8.809155266909708681e-02 9.374012720461312453e-02 4.380141615143157835e-02 4.754034662260825383e-02 2.578327924409936633e-01 2.702483891453656972e-01 1.088194926975595278e-01 5.590723067458806816e-02 4.190681551114908837e-02 2.626649116621513486e-02 2.950635925183754324e-02 3.182926666944860261e-02 1.756112400313262351e-02 2.093428380382777662e-02 8.755210821463060150e-03 1.342264907889596098e-02 1.677147846431293124e-02 4.320742836525199616e-03
4.971918235737686487e-02 2.641542663502754323e-02 5.836684260007880126e-02 4.989650467062829720e-02 6.213166767990351697e-02 6.487392597411791723e-03 6.128553182228606462e-03 5.713148038944247491e-03 3.672336095906537229e-02 2.456119224316908461e-02 3.523545158955113110e-01 5.810783197486442120e-01 1.186492635134294149e+00 5.757244703417276899e-01 1.044423561756016722e-01 2.032341293911386904e-01 3.817091509677841832e-01 1.062326727832176160e-01 2.535419755673044492e-02 6.010482077694137733e-03 2.885061291966976513e-02 2.560196183473675835e-02 3.158947536003425816e-02 4.234957482989940014e-02 4.420564100466515406e-02 2.376316692411252832e-02 3.696273068340993895e-02 2.750160251189198712e-02 2.464782528745759413e-02 1.777097239156022815e-02
1.039604575649237528e-02 6.121442531589071749e-03 4.779028629964400532e-02 4.717623096880677741e-02 3.625104721360344895e-02 9.478245459069854773e-03 4.432618697283042392e-02 3.140991069314080092e-02 3.831321775023705661e-02 4.846857500404121166e-02 1.073035736504926452e-01 6.993382582821361382e-01 1.238718179702322120e+00 6.306917898030641734e-01 2.230195971258108478e-01 2.483416774714985453e-01 2.747124192036065615e-01 1.619981979929837890e-01 3.971649555981493496e-02 1.275581708265459586e-02 2.751165645274486135e-02 2.785689070033710302e-02 3.135766013813175157e-02 6.101421089647866489e-03 4.654134291890829091e-03 3.652216277700587321e-02 2.902793296863030031e-02 2.609936953245103539e-02 2.789278853613653963e-02 2.968973417906764500e-02
2.329024198683109226e-02 6.262961127541738504e-03 1.109084102510686336e-02 3.298632845158255833e-02 2.139035033189997867e-02 7.762275737765433718e-03 4.434813165478246680e-03 4.037462933467106385e-02 4.183402111486242241e-03 2.399899071401582346e-02 7.523946662022671164e-03 2.230367062172645132e-01 9.264066364039463819e-01 3.903680699652837260e-01 1.204706568522917604e-01 1.371992410707706389e-01 5.046403408490299225e-02 7.382994709852661042e-02 8.374827410006092931e-02 3.320390410428629424e-02 2.608648988923883971e-02 2.826650723474730814e-02 3.393714975801633005e-02 4.814902718159566782e-03 5.385360711541950854e-03 5.447547766253030277e-03 4.384793187597621142e-03 4.353895902324704525e-03 3.621555999240469448e-02 2.929352845332613628e-02
2.042802957014108398e-02 7.909089341460975170e-03 8.607986711148768108e-03 5.715731831882057967e-03 3.465405884268276532e-02 1.338301625914493746e-02 4.528178549660274305e-02 3.734628054446458012e-02 4.887411021880330372e-03 2.329543954404086209e-02 5.586602979996226070e-03 3.653856743450758365e-02 4.252578108230721798e-01 5.650173151764753543e-01 5.906896082304109452e-01 7.831620174396694001e-01 6.996089172580504112e-01 4.522344208109124186e-01 1.230261588588203558e+00 5.704931370857128092e-01 4.879367566630714304e-02 1.524951643977176703e-02 1.126631030176035962e-02 2.651954577025975035e-02 5.693507988077965709e-02 5.312421325029135361e-02 1.439797804987245633e-01 4.894553279985455752e-02 5.484106609029869815e-03 5.364153866089087577e-03
1.963079341073797543e-02 1.866413634170710489e-02 6.259275992703823566e-03 3.809516447378025195e-02 1.239314518069324807e-02 2.896727113584044583e-02 2.921950228718536366e-02 8.089153131592283219e-02 5.551189449906757806e-02 5.625251892861251463e-03 1.184680971758546135e-02 1.832368974841635523e-01 3.850198213219361842e-01 4.807796601741857745e-01 4.268548897513926854e-01 5.073755250277556250e-01 8.574817392028379892e-01 1.470484172592930072e+00 1.484343151417170104e+00 1.153612966469930168e+00 4.874752829499343076e-02 5.042095544184947015e-02 4.486854257828742226e-02 1.395231787009261204e-01 1.991819451215735004e-01 1.011955311550027048e+00 1.000018654323508782e+00 1.944025753891827912e-01 5.934599697766978349e-03 3.731432642705111158e-02
1.878442947928168558e-02 1.966060208227673328e-02 3.832498095243827563e-02 3.945948499699145073e-02 2.580485047295259793e-02 3.111159511974461236e-02 1.604009566282916036e-02 4.362628727178476801e-02 9.065533689823879193e-02 3.206007666246680349e-02 3.290979465348395361e-02 2.865771246591574881e-02 2.211329197280379466e-01 4.405644220142058143e-01 4.042039733020663106e-01 6.103894228101387487e-01 1.044611737087480563e+00 1.254502991458285699e+00 7.155505252411478168e-01 1.538675955960321362e-01 9.169761114000994640e-02 6.265931158304357540e-01 9.113049563454221902e-01 1.508378055913196070e+00 1.400174418433091983e+00 1.808310467491307305e+00 1.429063839968311322e+00 3.968408835360150433e-01 9.311780614307214876e-03 4.333923627522510286e-02
2.433176190390635291e-02 2.746544012288064385e-02 2.577950179333996644e-02 2.335820018788885288e-02 3.407449673661483436e-02 4.827747308417723940e-03 2.551176339278901639e-01 8.524621267394656421e-01 4.169495133466047943e-01 7.095936438036598570e-02 5.247167166165351421e-02 8.153310238590823211e-02 1.598808187153195892e-01 2.322201555077037238e-01 3.027214932887516974e-01 5.364237252963810487e-01 1.139057244495281118e+00 1.125712525598524083e+00 5.233028996393237486e-01 1.769372814371416025e-01 7.586663034019603957e-01 1.370394911938302540e+00 1.749435996555424477e+00 1.763862841306848450e+00 1.525528702281261584e+00 1.299526422374035484e+00 1.890160032470582507e+00 3.222013126319607235e-01 1.196781920691586572e-02 5.151693285745690722e-03
6.066462962343008303e-02 4.708323226697414682e-02 2.277896221206012276e-02 3.209037892583220530e-02 2.768695855085492527e-02 1.271804509780256887e-01 7.007528528314389549e-01 5.762862942330104765e-01 5.678144329662513368e-01 2.825008713055385257e-01 1.030684937444227151e-01 2.769103398412185724e-02 2.681897313661843821e-02 6.771007695727977727e-02 1.508894402995594464e-01 6.850685632722830487e-01 7.063893977778739064e-01 8.037036358642167810e-01 1.369929317657949119e-01 2.378296522106641830e-01 8.373664845269032098e-01 1.798382187659141040e+00 2.198235823336853301e+00 2.225841727231280931e+00 1.793635315544025666e+00 1.695980822292694423e+00 1.550446379752146164e+00 1.212724212930169410e+00 5.322907499678718179e-02 3.459880269288322790e-02
2.419529701871143967e-02 8.124669085877654975e-03 9.619216559545838360e-03 4.849160807151302321e-02 1.032755361183249759e-01 1.447923216059258666e-01 4.592951002078697331e-01 5.780798511408100637e-01 3.979313921869974124e-01 3.076646385046288845e-01 6.399931618816648293e-02 6.241724333937573484e-03 9.355140178334261924e-03 2.579568452678789384e-02 5.499461201830693063e-02 3.174369948084614368e-01 1.184598971180986365e-01 3.692959374130409117e-02 1.212161069382409681e-02 8.678921470866581001e-02 3.287184018521679962e-01 1.739613453858424696e+00 2.183085407444645742e+00 2.226071337034532416e+00 1.577927029062711872e+00 7.112454374699453963e-01 1.130027973821389642e+00 7.654670035631352398e-01 6.850315770701125018e-02 2.655131866805775925e-02
3.314028867724004568e-02 4.304643288022871883e-02 2.784579610649852432e-02 3.483027823173619197e-02 8.239028244594692740e-02 4.767013730850964970e-02 2.469109694213890427e-01 3.215931460236998163e-01 2.975773115315882844e-01 6.945430326463830628e-02 1.729661247692582116e-02 3.644477133564494667e-03 6.438083019434418311e-03 1.835906901115525250e-02 7.048959413406483132e-02 4.522101490008768876e-02 8.059219268084363841e-02 2.327000725360891045e-02 4.289798085640169484e-02 2.013663812185577939e-01 1.081312163858403119e+00 2.033306463063239811e+00 2.165196471213796325e+00 1.995182480618381549e+00 1.477805519481657504e+00 1.047165868147212020e+00 9.884409532955439337e-01 6.585326474497579241e-01 5.887897112121043969e-02 2.064818953297764895e-02
9.086479082101807381e-02 8.446502891929687229e-02 4.350074958981826889e-02 3.146958211839928632e-02 4.110730883814951026e-02 2.227375057414594794e-02 1.277870154392350133e-01 1.154089433510811225e-01 3.220752450781839277e-02 1.779833617956087799e-02 6.156636607573500244e-03 4.840202854950615557e-03 2.857106632549753777e-03 3.071134987781618669e-02 3.935982939237475317e-03 1.279383825240748042e-02 4.482042066718135154e-02 1.000559351179472062e-01 9.441005615736386414e-02 4.163757123761821499e-01 1.131550872527261609e+00 1.625423575876000060e+00 6.554040010447075293e-01 9.511491627154200490e-01 1.182024760443179501e+00 6.451026930201990695e-01 4.668715052105989471e-01 3.850585494790640384e-01 1.620351321415732307e-02 1.503106811542207107e-02
7.471432370824221403e-02 8.715629102531312344e-02 1.282364787996695399e-02 8.891025175272643938e-03 7.331484698693490308e-03 1.104359398633836600e-02 1.610658238489318106e-02 4.138972922973024708e-03 5.544921840189244965e-03 2.338382178927176508e-02 3.224719691469851712e-02 1.835981102474062206e-03 1.936529852870721947e-03 6.785505048472587758e-03 1.880857491491100958e-02 2.360266988992895665e-01 4.448182959746200260e-01 6.307228319727672394e-01 4.221881822135090667e-01 3.121346612788024055e-01 2.186835376282905696e-01 7.722079820914165560e-02 2.971652137289313225e-02 6.257839725562049094e-02 2.181524856417920988e-01 7.089181971573479957e-02 6.279633438393278366e-02 2.506765403281386445e-02 2.493134618317113457e-02 2.343147495514294118e-02
1.601078429079123566e-01 1.241436290013793881e-01 1.327879137217650475e-02 5.721425733870976610e-03 8.402295593425116935e-03 6.602008446966043526e-03 1.056933877723633362e-02 3.385899260554855322e-02 3.201785629612582951e-02 1.394431384317032681e-02 3.246486959103865588e-02 2.103845233233805987e-03 2.524895704827963012e-03 1.361747893684332050e-02 2.249397772880360261e-02 1.412707108214438789e-01 5.075741576900397733e-01 9.267526983863092482e-01 1.027038229437346351e+00 8.707914154447561339e-01 1.816821769535523212e-01 3.983782207149475646e-02 4.908053938269209271e-02 1.192239078665532498e-01 2.584180521321501889e-01 7.419902971944236647e-02 2.734815233274824620e-02 1.270836228410930462e-02 3.565123049822911672e-02 3.450131573614293595e-02
2.023513297041875936e-01 2.586584800833683154e-02 7.067326122447493628e-03 2.313888277401326792e-03 2.616593161319576578e-03 5.761575134539656008e-03 7.720783082381493280e-03 2.732498501351576792e-02 1.575574881528349694e-02 1.806840377545657420e-02 3.132590441544617216e-02 2.008327554022025594e-03 2.046084595047831852e-03 1.110062003789658372e-02 4.172642791739251955e-02 2.040168379413882516e-01 3.877223190853697488e-01 8.736196930000236227e-01 1.074523967941447777e+00 8.904462854538797156e-01 4.366424119760858313e-01 2.474966412996224344e-02 1.745618122021505222e-02 3.779521405210560514e-02 2.149351142902160838e-01 1.282811949504547577e-01 1.131300132309687179e-01 2.547641480925749713e-02 2.929517888789191435e-02 2.657167114935934243e-02
1.129188372680256236e-01 3.506314943172643417e-02 1.350980109297645823e-02 1.257106728187306829e-02 2.752954621165867866e-02 1.884137998531364155e-02 7.915810462344723825e-03 3.278765111207817152e-03 4.983663875358794286e-03 6.677116759651237181e-03 1.885965684380929569e-02 2.178630811062881242e-02 2.768456149545668946e-02 2.724423986846150926e-03 1.523389510118153614e-02 6.361373087209128141e-02 6.272491409951444497e-02 2.612515397355731350e-01 3.269693598223638586e-01 2.767456061377991938e-01 2.297060093211894527e-01 2.931314697234217725e-02 4.494944173371571289e-03 8.881712759862032611e-03 3.932623528713308919e-02 9.928793050237788576e-02 2.645448142868507269e-01 1.571872021411498122e-01 3.346979320551757286e-02 2.916270208080590925e-02
4.045348836209877730e-02 1.611043553525013522e-02 1.713654684264097339e-02 2.879750197877270143e-02 1.546117578832838409e-02 6.920862139282918379e-03 3.189552876057290525e-03 2.242277451134785330e-03 7.141808209910767945e-03 2.787518101974997137e-02 2.054266927555428637e-03 2.084089203590139966e-02 3.051740908182825826e-02 2.825346491559159109e-03 1.239126655504228618e-02 2.276870113030628889e-02 1.531543767249244833e-02 7.421838687156864442e-03 1.237837549473591765e-02 2.393772946791569711e-02 4.732787575528086405e-02 1.021539711369484106e-02 4.939220492323744514e-03 2.296014413904089516e-02 5.616829512149619508e-02 2.020691728362350101e-02 6.964220602941209592e-02 7.924723234904607061e-02 3.612667347156025416e-02 4.180515095333438985e-02
4.101180644969071309e-02 3.302076759954571811e-02 1.603866483058396034e-02 1.168324547437729621e-02 1.066746373087653493e-02 3.998770176257224543e-03 2.656875675688064476e-03 2.730262925751359045e-03 3.033923310160871814e-03 1.235818987329561323e-02 3.610048561942464165e-03 3.696040942934552317e-03 3.418135198313330264e-03 4.291026095056104349e-03 1.221616152027492179e-02 8.818747445788211944e-03 6.040370160130412169e-03 3.657772780151459600e-03 4.276430157218936989e-03 4.092525564057179766e-02 3.336000789538173111e-02 4.522804066138009366e-02 7.697325359092563497e-03 1.331489548201833691e-02 2.580971367530730462e-02 1.430483199407213413e-02 2.292425077033683617e-02 1.402044950268198885e-02 1.538638478244360244e-02 9.840052263126801771e-03
5.574427082895527796e-02 2.914318891954924620e-02 1.649212466258696483e-02 2.235246683456568878e-02 1.930020283369935502e-02 1.049222426237618293e-02 3.604142590357532761e-02 2.736999222934136111e-02 4.061886835605426661e-03 3.082958846552020116e-03 3.385928965104805649e-02 2.828049883260497742e-03 8.106765667003719769e-03 8.976488567958976206e-03 2.752714619777901425e-02 2.143886282057319917e-02 6.890769146587074657e-03 8.314736200733667190e-03 5.038705993023787424e-03 2.719933444906713627e-02 2.682814637097354071e-02 3.963790285828144855e-02 9.532848775790355583e-03 1.733049852544531894e-02 1.764820319495421716e-02 3.700560704374760562e-02 4.262443859115939288e-02 7.636484314361224358e-03 1.866174525031518219e-02 3.089427447461021506e-02
7.493592746114841052e-02 6.505403482560416506e-02 1.965995008168789152e-02 6.662186134333908383e-02 7.620606215266738370e-02 1.442526485889825127e-01 9.742769768665597574e-02 1.109324668780744746e-02 4.014728068097666788e-03 2.435085297618628988e-03 2.266195208520887031e-02 2.660412333871281163e-02 2.815550407428040608e-02 5.797273451626155233e-03 7.705208503795155615e-03 3.319647687151002554e-03 3.254808151201359252e-03 3.698710474242482109e-03 5.918471562468157789e-03 5.506323433003466016e-03 2.413198106673324073e-02 3.502030333135098400e-02 3.674696640428543742e-02 9.649820895273254762e-03 2.708446370561895522e-02 2.761356678008782331e-02 4.037324804567056502e-02 1.203322303325181017e-02 8.376463330322068968e-03 1.632476858013385407e-02
4.058360885723730910e-02 1.013316049687670722e-01 3.018927635068956866e-02 3.201845974014968371e-02 1.532306375563459444e-01 1.620787712976589912e-01 1.081676017520550453e-01 7.451613507993309904e-03 5.287776789668806147e-03 5.194400506476016567e-03 2.590513274956252228e-03 3.515055175000977861e-02 2.003286725850789499e-02 2.887592182509443953e-02 8.538675344811414575e-03 3.461360768845061359e-02 8.491403841372629352e-03 4.864949715130190838e-02 8.853649020043970197e-02 1.914162501235780814e-02 3.422764095144885388e-02 4.747221405793810439e-02 3.950557551862313860e-02 3.848168861229690069e-02 7.948946240862665019e-03 3.924219531088977281e-02 4.598684250493278308e-02 1.022823524177392078e-02 7.639674166172367477e-03 1.829128940450032090e-02
