2.879922174293422787e-01 1.352925095017141989e-03 1.175773403650202205e-03 1.482680607359160687e-03 3.478569046884301685e-01 2.428111999119967907e-03 2.376651648744765397e-03 6.351723143678193566e-03 1.143961814842658041e-02 5.174143112411475932e-03 2.427176223171624049e-03 1.835634143562356879e-01 1.090154569556981701e-01 1.171555051967340059e-03 1.329244322041404219e-03 1.103164502951416298e-01 9.930153968935257272e-04 1.720297424561252663e-03 1.544340130670714432e-03 5.363096758348946712e-04 2.069124344439380037e-01 2.971166272492152191e-02 2.283685738275085392e-02 8.891946343165668676e-02 1.667383507930543796e-01 1.264321759677164703e-01 5.653758913368796268e-02 4.900729947746292406e-03 4.561106933844015672e-03 5.585809201563608425e-03
2.176353311865515949e-01 1.547379768350036575e-03 2.787342232933081622e-03 2.259855425441967096e-03 1.569082681832031445e-03 6.979080941406203345e-03 3.283693161093141286e-03 4.030372496859619368e-03 2.590566923708325850e-03 2.242803933778146630e-03 1.630384145814666027e-03 1.092296585795814873e-01 1.484953655600398659e-01 9.508997759020979467e-04 1.285571164830922458e-03 8.036063819100812541e-04 9.761698897161203694e-04 3.134835067642913285e-03 2.327200216467740189e-03 6.860267159557706428e-04 1.244680784704917526e-01 2.762950567504596222e-02 5.738118529652350835e-02 4.959004083216349973e-02 4.207544958444324468e-02 5.421457346334348365e-02 1.853153358657941632e-02 4.748374802299972636e-03 6.688679218936868960e-03 6.624468247249889509e-03
8.739892306880924291e-03 8.324469799815286189e-03 1.763036932400289733e-02 1.422527560214774216e-02 3.042884336250631719e-02 3.081127439004187080e-03 1.779351133148765751e-01 1.882453807971832538e-01 9.416348961943647733e-03 2.960820191618422376e-03 8.225571308964224962e-03 5.586540776407963177e-03 2.050230142615828977e-03 2.917147563008736996e-03 2.079293770554707654e-01 2.187949866712476758e-03 1.430387962508594506e-03 2.858865751897397573e-03 9.279741571570097880e-03 1.497882375818368906e-03 7.773779868724446651e-02 2.229885409113936678e-02 3.363912303553676791e-02 1.148014856830177274e-02 6.603234551478431857e-03 4.216543590354524494e-03 3.611637836264709831e-03 2.853360594438682837e-03 4.833695730138088710e-03 5.454367654452466074e-03
4.037579619705804375e-03 1.080331877735923526e-02 2.374426787705306158e-02 1.902833579479169118e-02 7.890606111299852676e-03 1.212824033206426040e-03 3.018642214351108799e-01 2.008539145825959105e-01 1.209977869869955230e-01 3.642218979280699952e-03 2.420298731900286451e-03 4.960437799768949683e-03 2.246051205486012097e-03 1.448313715777350703e-03 1.527292996240268153e-01 1.169819806304968901e-01 2.516537585407153665e-01 1.090941783687269595e-03 7.565899195961746024e-04 6.267072210652405509e-04 1.471662732724470790e-01 5.011150407018436642e-02 1.553882371803209927e-02 2.938738830444041078e-02 5.316266524571268415e-03 3.795712875806991730e-03 3.145307402109537472e-03 2.977701153803363841e-03 5.940706002613658880e-03 6.543172173295659817e-03
2.328714353859816840e-03 6.762795182888754753e-03 1.883026915678131380e-02 7.292862150631073369e-03 4.213577562231602021e-03 1.939055047334280191e-01 2.946893952115435256e-01 1.628140095917653130e-01 7.414265878015809108e-02 8.361588227063778897e-03 1.082406339875459887e-02 9.595094538301745385e-03 1.417186325372334944e-03 1.119546958195251352e-03 1.787045239016348819e-01 6.609761997974622494e-02 1.785602245205024537e-03 1.000491455106440868e-03 1.579322918015498662e-03 8.785625711767626207e-04 5.775469500667572160e-04 8.160153280457312086e-02 1.801193167521429606e-01 4.860826779713569440e-02 9.534723715851629866e-03 5.094850692617295708e-03 3.462101420915025905e-03 4.021408694574121929e-03 6.201437647192449554e-03 2.321847613250236503e-02
2.316361258670308117e-03 2.285624571640403838e-03 1.022748554009668409e-02 8.174466218454497571e-03 3.249445334055211989e-03 1.121541752180507806e-01 1.344303469858533773e-01 1.420699156824661025e-01 1.296920112177886442e-01 1.287651331315550242e-02 1.047874949323337156e-02 5.754292065868398670e-03 1.997408037376712520e-01 6.027670226015501009e-02 4.540262574178236671e-02 7.321425731865081887e-02 9.812778457107876589e-04 1.020944549428119269e-01 7.982650316391507600e-04 2.679882500683628856e-03 3.123495135677879959e-03 1.763847732894287604e-03 4.139948277160831677e-04 2.886267207998654757e-02 1.423365740107318880e-02 1.345499973558976492e-02 8.290487520305200864e-03 5.756320336181916172e-03 7.489848342186272712e-03 1.379955677980627612e-02
1.015564477568631496e-01 1.602542166053205486e-01 1.688775543930720602e-01 2.609018000946064682e-03 1.244622228584046355e-03 2.048294038644751010e-03 3.073001497095207996e-03 1.734987484643000545e-03 2.037992696695788489e-03 2.480814573392227818e-03 1.988400842728604758e-03 2.479526051390588959e-01 1.027030412053843295e-01 3.958732509428249807e-02 2.051303765630006076e-02 3.583426975074922166e-02 2.114353201743679744e-01 1.006647783287938913e-01 1.289748532249281824e-03 1.721979825916845116e-03 7.603288358616809789e-04 8.284295032598544550e-02 3.297847405777384888e-02 2.588550935463446862e-02 9.710347071912187392e-03 1.010793215478856394e-02 8.845587543791619614e-03 7.758482665864971373e-03 8.925047513867294391e-03 2.178321461102521520e-02
2.213840633891351328e-01 1.343820534140820894e-03 2.360894761650890739e-01 1.640691513468350632e-03 2.468397285290286833e-03 2.723177858882044281e-03 2.375103332200452413e-03 2.205762092508268841e-03 1.746405435014194507e-03 3.156924772372745602e-01 1.277684767414453693e-01 1.343657446418219503e-03 8.478736009440293597e-02 2.785283968514266212e-02 2.813714958018454643e-02 5.121331322691276972e-02 1.188863451774008900e-03 1.871288090820984228e-03 1.618905627003573971e-03 1.126191286804504319e-03 1.248117460851937144e-01 5.960795233005825033e-02 2.027435726678319602e-02 1.587414532017593707e-02 7.544783674151723379e-03 7.995767058797129470e-03 1.238635211006777932e-02 1.567996196441544601e-02 1.576750148831131473e-02 4.704042048711949003e-02
2.120117519681623611e-03 1.364868124984385455e-03 2.232027543379738188e-01 4.408476216725442862e-03 2.781435588682760161e-03 3.459778601680900123e-01 3.632243595692898064e-03 1.594165465035578873e-03 1.310449130234239831e-03 1.326084563322576680e-03 1.210666053394654582e-03 1.629803544388293323e-03 3.550187247248932920e-03 2.246884120960710839e-03 1.030231910408849622e-01 9.320173346537088954e-02 1.207070750035122743e-03 3.605861492367366198e-03 3.503111841596054724e-03 2.178684809766958386e-01 3.490518205785984179e-02 2.716862587181936850e-02 2.573154041697911162e-02 1.585561841866146848e-02 9.245645706194464269e-03 1.432008260442691090e-02 5.398777905069062494e-02 1.089622331020737439e-01 5.767559285283546579e-04 1.566162055109570350e-01
3.688720911857844807e-03 2.381458908301103093e-03 3.721476049428568047e-03 3.358024459832255858e-03 2.834512793328690904e-03 1.615989637751492902e-01 2.461098465228017673e-03 3.223045894847534898e-01 1.360550746496056729e-01 5.075440963875432754e-02 2.332398565784553606e-03 2.289822339976451022e-03 4.844064465379038613e-03 5.183838029230087609e-03 2.442713139767912090e-03 2.624513902654443571e-03 1.382188319778857553e-02 1.410535274865835388e-02 5.583805477303372018e-03 2.433983852585080900e-03 4.449581797289096224e-02 2.116378654209944560e-02 2.160017910581269254e-02 2.270228261966881350e-02 1.246424467527748083e-02 1.614493390471920947e-02 1.524966268515655088e-01 4.801418477491771822e-04 6.259867797403769005e-04 8.442693836687946429e-02
3.092938079915835171e-03 1.606174756682264299e-03 3.520627316985234199e-03 2.921902211499785226e-03 3.589735006445065549e-03 9.537605744526755913e-02 8.054599400823353461e-02 7.042284454675870609e-02 4.432779855740916208e-02 1.188607347762072773e-03 1.861363866420415528e-02 3.088019363687493843e-02 6.374672117634898327e-02 3.157788770999763600e-02 5.850481533098861320e-03 1.139449255281124555e-02 2.091869118493207280e-02 5.725573639685162773e-03 1.353437593785037935e-03 9.196004995207315846e-02 3.135161344057280780e-02 2.172991186167507263e-02 2.559302833734988097e-02 3.481276230756846085e-02 3.675639853935069173e-02 1.990200011681357573e-02 3.148403830202882447e-02 2.490329811087014719e-02 2.198717551554239813e-02 1.549888936496394455e-02
1.557721147321418920e-01 9.139290152739974749e-02 2.859532159334220863e-03 2.758930586503591936e-03 2.106398465198157550e-03 1.409961843697202233e-01 5.510648779330889341e-02 3.551167768646156658e-02 4.404562217126076207e-02 2.362508057977275033e-03 5.658223857322910999e-03 3.636202747230382615e-02 6.499611333490870613e-02 3.419526193273981357e-02 1.255261312150532209e-02 1.428270010464029356e-02 1.571701750985059903e-02 9.253110480061638166e-03 2.272968019720280307e-03 2.011715265714020817e-01 2.963869374049969349e-02 2.615005826547981901e-02 2.935636441561727261e-02 5.191654506893483845e-02 4.942891232888552144e-02 3.509999055025904424e-02 2.674690345876063954e-02 2.364619539558143746e-02 2.459952064446267045e-02 2.554472571709867634e-02
2.985297929818679294e-02 7.706012760194254352e-02 1.880746121397926240e-01 1.851193203979137076e-03 3.494642716921216308e-01 1.112770315216881217e-01 5.716111699441273758e-02 4.792338656560565791e-02 6.051912704434163348e-02 1.197843777243368492e-03 1.368855452763139691e-01 1.157130904652444760e-02 4.831028186208725927e-02 2.106980362393095010e-02 6.770198314929322045e-03 7.972007844079531669e-03 2.955871548703261319e-03 4.347619933505883320e-03 4.963152731822593165e-03 1.849860497459963893e-03 3.625427816962949884e-02 3.235611143782642085e-02 3.875002199179186646e-02 6.625777889130966825e-02 8.671887755599543002e-02 8.141286750174143994e-02 6.003341119931748793e-02 5.289023292968205586e-02 3.889498694420788494e-02 2.890285745979570900e-02
2.352410489446037783e-02 6.786273500159112348e-02 1.251565318787245251e-01 9.199388374873276875e-02 5.479162119845668727e-02 2.178106958738271204e-01 2.329831546002116872e-03 1.912907886785011240e-03 8.926785792258190577e-02 2.678025311281680837e-02 1.045148544492806725e-01 1.866736206435934886e-03 2.185036520654215844e-02 3.037026159239296710e-02 3.333337910970880780e-02 4.619588380756135815e-02 4.196940762586153645e-02 2.735366922116139882e-02 7.498969177294285970e-02 3.505018582059754584e-02 2.872501092175331130e-03 2.290885688511694607e-01 1.717877766122058725e-01 1.507802379393779124e-03 3.477520361074056942e-03 3.217280173597894619e-03 8.650253656145710790e-03 2.645835286952898970e-03 6.334937010113807221e-02 5.886555048748545738e-02
2.100154008399952171e-02 2.122994237905740517e-02 5.954170067687612061e-02 1.477310636053596202e-03 1.657075129611776387e-01 3.919740987602573362e-02 1.553767575240438568e-03 4.395762485141158256e-03 2.903799258663771702e-03 1.080384788944841329e-01 2.257383004988827990e-01 9.299101509503518090e-03 1.948822475794521197e-02 2.526344058840547871e-02 2.335269857610387106e-02 2.887033884687875696e-02 4.995529565860730437e-02 8.737707622047265199e-02 9.025110469869389307e-02 7.210078468527728046e-02 3.072652966373933935e-03 3.190897300509507300e-03 2.784258475402156402e-03 8.644576145044644000e-03 1.225420002485928458e-02 6.165959205914649244e-02 6.047653690926892839e-02 1.155522026746540198e-02 7.329735014966495821e-02 4.259380669135905129e-02
1.827276402466785493e-02 2.010650347678279853e-02 4.710812445282219763e-02 5.306418523759483252e-02 3.573422524310278237e-02 4.097094755059538240e-02 2.909967818418738861e-01 2.362778780840619000e-03 4.847589024471685333e-03 1.696121532576218456e-03 1.705449369066422546e-03 1.427864947651711486e-03 1.094622203120916917e-02 2.259313671276293178e-02 2.150052173901428540e-02 3.350379502773984802e-02 5.898367827031049393e-02 7.316420528261546874e-02 4.337298717762234218e-02 9.659248009553400224e-03 5.765243800320034827e-03 3.920869774782356071e-02 5.616635885891382851e-02 9.284952323312650746e-02 8.542538316928868780e-02 1.085781065059316097e-01 8.508001162407743956e-02 2.351469688888203902e-02 1.136411407901741638e-01 5.029433899598887564e-02
2.199970974201703039e-02 2.581531116236468471e-02 2.623584963277864057e-02 2.562623520354856410e-02 3.998550087742057391e-02 8.395071473163971676e-02 1.378518234920949638e-02 4.588284959638366800e-02 2.229755844887944954e-02 3.724742998163246572e-03 2.685651082612369473e-03 4.010270331765427437e-03 7.795153492694426901e-03 1.163412373566512226e-02 1.551938777816066865e-02 2.808611574779068185e-02 6.204624419759461468e-02 6.476231730035293677e-02 3.182802237050366689e-02 1.118030591000200753e-02 4.751763616723602562e-02 8.464229188906498280e-02 1.067284474960897428e-01 1.075184290663543651e-01 9.226495927340949699e-02 7.729126241685824183e-02 1.106574355752607125e-01 1.897443416075871372e-02 1.669778458134010823e-01 7.037167679319032698e-02
5.228573742027447374e-02 4.179976263003101766e-02 2.257372916263278642e-02 3.657210546247150612e-02 1.309090236401189589e-03 6.624112315993739564e-03 3.697661776063864564e-02 3.007518051078040752e-02 2.952160862406990813e-02 1.449089500137693692e-02 5.167124885119833699e-03 1.334498098351337859e-03 1.280796072497485723e-03 3.315561385261943730e-03 7.476645788558382300e-03 3.440717537402219334e-02 3.745876593546589722e-02 4.580595330560005563e-02 8.317111195313576372e-03 1.502705078224370570e-02 5.234397228625013720e-02 1.111263654758829766e-01 1.349884592057608856e-01 1.366700081515212495e-01 1.092428958621949470e-01 1.006491305871902581e-01 8.947810358605395864e-02 7.092420936687690580e-02 3.145456228059578634e-03 2.071657591266092262e-03
2.324959408922327997e-02 6.568176338552968174e-02 1.254817162946050557e-01 2.312618257509461463e-03 5.086206097798263645e-03 7.184971537134637182e-03 2.273587529420495468e-02 2.833218827534918216e-02 1.945407404616330063e-02 1.491991923864690976e-02 3.072836738263110164e-03 1.355516303623102159e-01 2.008694717090226400e-01 1.229222286480742424e-03 2.641089849717383371e-03 1.542469635091431659e-02 6.095527901145794160e-03 2.038671171350231025e-03 2.120467087311382615e-01 5.248962597016043619e-03 1.961454713977255071e-02 1.027174804774897143e-01 1.282423529003458573e-01 1.317925680439159253e-01 9.379739967088633612e-02 4.188959501436587823e-02 6.536248814036887955e-02 4.486607743544196447e-02 4.045886583092787002e-03 1.597190841665205698e-03
1.587083942283467816e-03 2.037802156605412682e-03 1.350531335739427879e-03 1.656203522506407471e-03 3.856874464272158631e-03 2.205913747189434341e-03 1.138830056773360369e-02 1.469004887737158059e-02 1.358881658635991384e-02 3.182642543075002786e-03 7.928264178234187146e-04 8.070387112201707347e-02 1.363025701981608329e-01 8.303335242230197501e-04 3.228415196158008777e-03 2.126873450296444708e-03 4.017956363290699218e-03 1.234641095808991680e-03 2.396023511949962187e-03 1.150411576859633987e-02 6.104870618276891925e-02 1.143703306611208032e-01 1.217886751137750856e-01 1.142725213591578998e-01 8.597362042433696894e-02 6.135937871125993204e-02 5.791647999161224358e-02 3.902526388371876931e-02 3.513813730455187835e-03 3.273103253327838136e-01
4.299195491075115047e-03 3.930414721530098819e-03 1.995704227505830635e-03 1.411683182594067635e-03 1.800106173341083559e-03 9.600766045285620033e-04 5.473981263598519040e-03 4.877426999185132880e-03 1.344233628738274134e-03 7.379017893310468217e-04 1.358655964122750248e-01 1.063750403052362847e-01 6.126109872208727880e-02 3.206062527621906383e-02 7.862325788018852124e-02 2.499026328422415122e-01 2.090610219895866831e-03 4.933928358635382427e-03 4.902221212135703977e-03 2.226141415420099592e-02 6.044605517607251621e-02 8.746302156274431139e-02 3.558337594868225123e-02 5.307160190599247152e-02 6.770639763217159435e-02 3.774349250403519901e-02 2.773134508000748080e-02 2.277807983610312045e-02 2.117101917502959008e-01 1.930163835799708905e-01
3.461468836999107273e-03 3.969343830505349564e-03 2.655788226342480907e-01 1.949216752342082803e-01 1.704224066968583473e-01 4.565752601050316142e-04 6.525557001254373097e-04 9.745961257301857805e-02 1.284467427328410127e-01 1.994222103965158713e-02 2.593888202600837592e-02 3.913565150912732410e-02 4.204330990973693949e-02 1.426552587494388236e-01 8.046907722714125586e-04 1.019290759288844772e-02 1.996246111320274658e-02 2.974869594099405559e-02 2.089155987067643425e-02 1.603788439534140076e-02 1.138494461105421345e-02 4.091139766959066282e-03 1.587447218596745166e-03 3.415424143041139934e-03 1.232088647333050811e-02 4.144980801863478760e-03 3.804458708222271772e-03 3.184052413081521760e-01 3.648596377030979832e-02 2.983278478755638924e-02
7.485848404506205249e-03 5.726150919934397919e-03 6.019055084310155146e-04 1.250310421613927692e-01 1.913993170279464917e-01 1.538478987365202721e-01 4.217551839167495088e-04 2.672846769182568930e-02 2.293235706160000331e-02 9.866236121791374311e-03 2.325183180592980611e-02 4.371048083556312858e-02 5.684210237384929032e-02 5.939292600650545456e-04 9.817476889500971037e-04 6.138778151861637965e-03 2.288404004648356138e-02 4.380334208958318321e-02 5.093633756967432674e-02 4.517984763392236119e-02 9.701881140423439243e-03 2.180449513304628072e-03 2.710967678517368917e-03 6.613015338549789630e-03 1.468379511282445413e-02 4.317220259011411362e-03 4.019146496127478096e-01 1.554780830544978121e-01 4.896360773905212432e-02 4.391493583199855555e-02
9.451285495708429407e-03 1.191448478856560423e-03 1.492021689944614260e-01 4.993241868988214371e-02 5.805752802984982114e-02 1.305794420635327246e-01 1.734139972872429103e-01 1.996095762587895076e-02 1.123812789946416167e-02 1.290056518508770310e-02 2.270627311818677191e-02 3.854458882164524258e-02 4.290177363641081709e-02 2.309365963719831882e-01 1.844964841616955533e-03 9.067572680998782844e-03 1.787838185743717556e-02 4.205380427355114026e-02 5.392117003055599267e-02 4.649343021385893976e-02 2.349910097279882260e-02 1.367476982972235574e-03 2.846938819609979299e-01 2.105575838613353828e-03 1.209547383734258137e-02 7.228894696133913132e-03 6.517362160967219223e-03 2.944940903653139874e-01 4.498269066166754593e-02 3.446896307757905953e-02
5.299457075522877487e-03 1.624001010039464185e-03 6.109605501734868653e-04 5.427487123060873928e-04 1.128355767609253660e-03 7.638459437647180435e-04 1.815210641284324133e-01 7.682793414841937452e-02 1.179134357124468346e-01 1.524505570288856859e-01 1.409630569142794609e-02 1.578682328976094285e-02 2.433789606611644687e-02 5.419643271426702325e-02 6.763210422737783549e-04 2.862146930883069720e-03 2.949385460084264637e-03 1.286534389866044077e-02 1.678627124213168814e-02 1.469217660097022447e-02 1.253605635443301274e-02 1.637752847807534377e-03 7.504864486117113209e-02 1.420371736390510231e-01 2.186914251242776022e-03 5.456657784641278340e-03 1.467523681516615629e-02 8.272467688603705668e-03 5.478333859160015168e-02 4.121887415730673271e-02
1.900388312885860484e-03 7.459548609862244346e-04 7.705594854355229213e-04 1.238184706248436281e-03 6.312377682640725723e-04 1.552905762494832809e-01 7.404678094287457657e-02 5.384040166465969834e-02 1.747939477470220604e-01 1.133970212011320812e-03 4.532715945475346286e-02 1.552319873067581693e-02 2.600331930391773516e-02 5.625295171208578165e-02 2.628780250749456759e-01 1.031135261968771843e-03 7.314316740980366651e-04 1.501657244550484993e-01 2.312799393817223381e-01 1.117808954752700160e-03 2.029786816556193758e-03 1.527598919863479843e-01 7.602226031878775436e-02 3.833840894826743284e-01 3.101770244497380029e-03 3.089960943848030772e-01 3.813150103624035094e-03 4.278128889462018761e-03 1.520007230694158306e-03 6.388857543055311006e-02
1.926858304009027630e-03 1.529900270579196255e-03 7.208156995352597721e-04 2.504665893290004552e-01 2.336588760333460357e-01 9.031862218077778282e-02 6.186296252366781101e-02 6.559054063354813335e-02 7.424297633179398337e-02 4.965353001674671510e-04 8.224394370209328620e-02 7.750983334191925700e-02 7.247145252708847574e-02 8.909362089854154509e-02 2.547403234927363980e-01 1.762859714292773217e-01 1.208456317543287056e-01 7.319620831841848474e-02 6.510222160139665648e-02 5.004024318386466469e-02 3.948278544072002932e-02 5.720113292855140419e-02 9.027613216572802357e-02 2.246775031451823390e-01 3.932530105721411817e-01 1.877884907123511249e-01 2.990868082689567831e-01 1.915784561844268985e-01 1.919935366065338989e-01 1.233825506351815121e-01
2.610662486387504630e-03 1.346589744652770034e-03 7.405969704839157185e-04 9.659923797176536318e-04 7.918733201314097836e-04 2.365442741626833933e-01 1.470133794260112961e-03 1.116185361037866060e-03 9.992101275071617328e-02 7.189173545396955467e-02 2.539895368306436391e-02 5.780476375429011160e-02 1.700360574428342597e-01 1.866342354586787433e-01 1.206411086012777962e-03 9.568402133467903553e-04 1.379737646558841513e-01 1.662241120883906631e-01 7.781821425279573934e-02 3.400366466231663498e-02 3.075223047952777011e-02 4.674056643236423197e-02 7.237610624581454488e-02 2.287146435032526848e-01 2.380694015026672550e-01 5.761672006941171570e-02 6.449528883133895385e-02 8.159970287277963641e-02 2.597195055820903375e-01 5.400180309999551287e-02
3.496869103497914338e-03 2.994553965195177747e-03 8.779735012651008162e-04 2.867536767470540201e-03 3.104465133229366170e-03 5.807750165420800734e-03 3.940561384143460508e-03 2.650171167072212230e-01 9.829461549048931768e-02 5.638681124305724296e-02 1.651382399023195238e-02 2.046675247867398711e-02 2.545771706474866253e-02 1.021349239591388680e-01 1.285831056754934421e-01 5.825159453349784688e-02 5.803797853868390699e-02 7.063661068995145953e-02 9.717818307722640714e-02 5.332494669383306546e-02 2.892323172833273157e-02 3.916300331612392743e-02 4.387225600751774174e-02 7.636134250659748490e-02 2.478064663581473759e-01 3.996378159478344849e-02 5.858998172514078007e-02 9.540486900997652286e-02 1.117990639419974286e-01 2.273683329661157770e-01
1.886658230191493296e-03 4.664067290776965913e-03 1.343391799154233226e-03 1.370726759523175752e-03 6.219464735529851504e-03 6.460782283922729928e-03 4.297784551366021222e-03 1.765480375673055269e-01 1.272335733158988236e-01 1.202333598275211468e-01 4.940062877355810844e-02 2.447301596920166411e-02 1.584799234493819431e-02 2.831085114906933126e-02 1.386495497839815849e-01 4.134562972831459793e-02 1.500856154205836568e-01 2.466409099226844759e-03 4.682081382081532475e-03 2.230042909305247067e-01 4.355569707635432303e-02 5.496024475117958219e-02 4.661762342787926366e-02 5.310915444750622522e-02 7.311974729221902558e-02 5.761872708718987490e-02 6.890057193282211889e-02 8.496423831302320206e-02 1.108944189564171484e-01 2.781651156632419797e-01
