8.457810688087976647e-01 1.792409086387916368e-03 1.079093779637050998e+00 2.001985739357482752e-03 1.031015121883614327e+00 3.329900330414522353e-03 3.273096893713974866e-03 8.782630540798211372e-03 1.587322697979261579e-02 7.170720205275402798e-03 3.353721652668967095e-03 5.473021828789406129e-01 3.238790365179082809e-01 1.599439192403653365e-03 1.808841493969378256e-03 3.280273523611242914e-01 1.321591175461386304e-03 2.236532659605045339e-03 1.959898950079986754e-03 6.689366373998136689e-04 6.054522608904131520e-01 8.789472226163647095e-02 6.823487816172953135e-02 2.707933822527727186e-01 5.212285596040681090e-01 4.019960965075194403e-01 1.792827030130212385e-01 1.565957500824731452e-02 1.472602795790656574e-02 1.830692997790432999e-02
6.339808502322301642e-01 2.063442913663283453e-03 3.734285350569375994e-03 3.041715115768521029e-03 2.121694362459700198e-03 9.495399478617889966e-03 4.499643663812896363e-03 5.557059304291329591e-03 3.590817449225056513e-03 3.083452287206688534e-03 2.229520238346456747e-03 3.268711512067319358e-01 4.422990638783131923e-01 1.278018546134479560e-03 1.727130328813196621e-03 1.079574844633108058e-03 1.290864423819680380e-03 4.060854983023170703e-03 2.952952663755385732e-03 8.593107582880900449e-04 3.657585819330788635e-01 8.229996040398715462e-02 1.731051800934960139e-01 1.528248167058373075e-01 1.337995729414238333e-01 1.751871231614333113e-01 5.917167326766585578e-02 1.529234015123009938e-02 2.175613719831305179e-02 2.179560874448360774e-02
1.172077858682948025e-02 1.128360470194372106e-02 2.389705115847023248e-02 1.928273068335060667e-02 4.125304260041001703e-02 4.202854636671119262e-03 5.243062980854202859e-01 5.588375718265586878e-01 1.318066387328773945e-02 4.055069032986644353e-03 1.112197256561870025e-02 7.475154800731242943e-03 2.705250494347079520e-03 3.858406624329286175e-03 6.183072343882839439e-01 2.910047853289225543e-03 1.877810507128413421e-03 3.688167619570489539e-03 1.177266670423580790e-02 1.885266598784298862e-03 2.294861808467921760e-01 6.690255725853384849e-02 1.025107750833114950e-01 3.587234423615374285e-02 2.138641846814090877e-02 1.385109208413858213e-02 1.172661387794552562e-02 9.317201972805192953e-03 1.587513584194916172e-02 1.802055590140609273e-02
5.450838579507405121e-03 1.478561347714543034e-02 3.249382385110983346e-02 2.603741402772665609e-02 1.079624020052138110e-02 1.671875839463959901e-03 9.005757133570684303e-01 6.035523752260550934e-01 3.659974891794301466e-01 5.065885898818569058e-03 3.299953157235995492e-03 6.656542794711999868e-03 2.981530877722796385e-03 1.940893741325171347e-03 4.591811215582495276e-01 3.530335846816545775e-01 7.575368212552425762e-01 1.457956501316264595e-03 9.995268163475827788e-04 8.238792634243773810e-04 4.453917608545405749e-01 1.538270888304420769e-01 4.835937190676366931e-02 9.342462456938918636e-02 1.735117061753117113e-02 1.247045232696437390e-02 1.018472769353992967e-02 9.678432592417619135e-03 1.938147848964190401e-02 2.142731162459977218e-02
3.163468958008246526e-03 9.333713310650726055e-03 2.598671235788811706e-02 1.006375050109515820e-02 5.813994852728088941e-03 5.814487034938015109e-01 8.905358638217556466e-01 4.954953647997845656e-01 2.270450896911534455e-01 1.182036851450176014e-02 1.493299587315496946e-02 1.293182892445246882e-02 1.894547456082006694e-03 1.522605383719247141e-03 5.432205954929223424e-01 2.034577407149052442e-01 2.510103890788301269e-03 1.400515055985500704e-03 2.199754771484117855e-03 1.222013948996084716e-03 8.153638950481603091e-04 2.582051988222102135e-01 5.765020649805610020e-01 1.575689310782127928e-01 3.119464036626701936e-02 1.664555162730760318e-02 1.115960672688913816e-02 1.300536240977440139e-02 2.012048133127579755e-02 7.557139913214787341e-02
3.163929539176121072e-03 3.177692319808813302e-03 1.421839674672156599e-02 1.136348666047825445e-02 4.516705413618981278e-03 3.405613690626967394e-01 4.113614791881363142e-01 4.377449463075875347e-01 4.019908299058879142e-01 1.848117755158179554e-02 1.462096940256856110e-02 7.811777986316072869e-03 5.871322720128731021e-01 1.811798024690039477e-01 1.394990234624717551e-01 2.299587344983078929e-01 1.437807167526153253e-03 3.244436698514905904e-01 1.175427284479501743e-03 3.956831795694145185e-03 4.656752831016477967e-03 2.653290466968535877e-03 7.400143585501199883e-01 9.494978940704297543e-02 4.660101935661273287e-02 4.372312348292171913e-02 2.667434332949875087e-02 1.858029231778829393e-02 2.424663651471859610e-02 4.479178763385260192e-02
3.022925716585741496e-01 4.866602797716160778e-01 5.135830322783585533e-01 3.624950765369800137e-03 1.733011604154045598e-03 2.886420322288589697e-03 4.408210154873734576e-03 2.529611187279627756e-03 3.015798418205038398e-03 3.582602696767310350e-03 2.792116949271178893e-03 7.282326946163365511e-01 3.009375662306371102e-01 1.192161001674448273e-01 6.352163330263917163e-02 1.137996871732074311e-01 6.784627711667950978e-01 3.254606603879378057e-01 1.979169938308311932e-03 2.660035142212740546e-03 1.179176838578007260e-03 2.742254082878735622e-01 1.096623763621710074e-01 8.562291269004652927e-02 3.176101923876937377e-02 3.268470055323977747e-02 2.829055657483666233e-02 2.489582209654131462e-02 2.871439238814227010e-02 7.021081277510737850e-02
6.399589451214875435e-01 1.772732180993160734e-03 7.039017547986879952e-01 2.220633819051914901e-03 3.381157921956589717e-03 3.775823205126752589e-03 3.328923103233518213e-03 3.120783437011103757e-03 2.490953240944447731e-03 9.531201951264751671e-01 3.821531477777808106e-01 1.838028563858989462e-03 2.511083636520967666e-01 8.398942393425898323e-02 8.634978761850559126e-02 1.599988205269845809e-01 1.751083401359778162e-03 2.772994119141784092e-03 2.412037864218179780e-03 1.687469481837049895e-03 4.036298267510953219e-01 1.943472072969172626e-01 6.664825903848235755e-02 5.199431160207948488e-02 2.445718922598138015e-02 2.565028415875958076e-02 3.936347109760943153e-02 5.024424562041270720e-02 5.086507399275343871e-02 1.525071893807097012e-01
2.522580401645747438e-03 1.059370625282521017e+00 6.396891158979765013e-01 5.794543330071999336e-03 3.754859770080047621e-03 1.045328319956878582e+00 4.970735107564021489e-03 2.186442481716444758e-03 1.798766788812197672e-03 1.823789225518708881e-03 1.665009743686036428e-03 2.239006030095174599e-03 4.897046639897443578e-03 3.138475138599433958e-03 3.133790167732192211e-01 2.853898123657752084e-01 1.732025966620576000e-03 5.186623106085856694e-03 5.049423345768896954e-03 6.787607557230361799e-01 1.098838447500007087e-01 8.643959263757883260e-02 8.275455063102096775e-02 5.087874618917510167e-02 2.939386902607666469e-02 4.511137778426431433e-02 1.688198343572184512e-01 3.464215465361437096e-01 8.605400188585971086e-04 5.104482439377920899e-01
4.048985432849724550e-03 2.635778270309474536e-03 4.318666954052871945e-03 4.158022520796447567e-03 3.723209384035471720e-03 4.809273980683272942e-01 3.282892674629790761e-03 9.397041361643130308e-01 3.927608022484525008e-01 1.486115759390884139e-01 3.176115299981303007e-03 3.155866675487948789e-03 6.731511472618201437e-03 7.233568340981192182e-03 3.416863014215199782e-03 3.678349786416248556e-03 1.935997022411208371e-02 1.973572597095877429e-02 7.801036827206401375e-03 3.405968984973607554e-03 1.362893225504375472e-01 6.557459658498300537e-02 6.776147239388324861e-02 7.113643600738531192e-02 3.873921898517584950e-02 4.978185316061817939e-02 4.676191736458080728e-01 8.196232663818970865e-01 9.397201460735922496e-04 2.764049699631023760e-01
3.369215142708407648e-03 1.755254123417096350e-03 3.968928583705493701e-03 3.445419452118916002e-03 4.521553413304959038e-03 2.755067093503456022e-01 2.313461189883324332e-01 2.009565896423514131e-01 1.258170332327461227e-01 1.559136356101683326e-03 2.495132886573550937e-02 4.230882657659961604e-02 8.844598545354792618e-02 4.380284995314158436e-02 8.102853946705431201e-03 1.576984778506764287e-02 2.889707906899771986e-02 7.891148830471431813e-03 1.860119182372580067e-03 2.749802273321353407e-01 9.477620329851857428e-02 6.638021006220089226e-02 7.912263834531421680e-02 1.075873865007375557e-01 1.128464556186855039e-01 6.070290248710845382e-02 9.568349388776774267e-02 7.790550425621474429e-02 7.066882760842603528e-02 5.093140456419822937e-02
3.863636311716970306e-01 2.271409402085305673e-01 3.216311385522506623e-03 3.196369187500189106e-03 2.553476491720576853e-03 3.917271143395627542e-01 1.531451246371333119e-01 9.867583886391806391e-02 1.224247712652821451e-01 3.018472064436628251e-03 7.437673274589896508e-03 4.916343711915810433e-02 8.930444530205200460e-02 4.703889034483941384e-02 1.727680139148853045e-02 1.965776965540610988e-02 2.163650095632473763e-02 1.273931317149342400e-02 3.128739956106669270e-03 6.044216093150108771e-01 8.988775682806865452e-02 8.004236557910955618e-02 9.069139968938133567e-02 1.605356488207802523e-01 1.523539823982432706e-01 1.078388962130006068e-01 8.216443181244448279e-02 7.466799884351482675e-02 7.951706331561261831e-02 8.426195454454105116e-02
7.450387454775045382e-02 1.923586086705750264e-01 4.749920167301445728e-01 2.113957269024815521e-03 9.265713153649342004e-01 2.990978149974735656e-01 1.540236286407948851e-01 1.294231586489095753e-01 1.639950544293652668e-01 1.487971218012957338e-03 3.925729470640342833e-01 1.542938401995632910e-02 6.562268374025706508e-02 2.872252355255374909e-02 9.258268874626589956e-03 1.093183392947620798e-02 4.065175481172768161e-03 5.995968315254231532e-03 6.862515502374563411e-03 2.570409013525439511e-03 1.104000301688403407e-01 9.927341559587966879e-02 1.197980048034205935e-01 2.053447435066661775e-01 2.687342237749288931e-01 2.522730211101815168e-01 1.866172956166061714e-01 1.686559696912817985e-01 1.264942554971300870e-01 9.574071326999031295e-02
5.907295620763653582e-02 1.701292256140369830e-01 3.152051747465805520e-01 2.333016051288896997e-01 1.417941402300209042e-01 5.685971757897307910e-01 2.698651517912565526e-03 2.209032746497831962e-03 2.346052160807418907e-01 7.325565381134671594e-02 2.961271981776182338e-01 2.457765001722108343e-03 2.934947047120206598e-02 4.099878434448766401e-02 4.527878690357482055e-02 6.309093366148899040e-02 5.765625155399708990e-02 3.779374312725961027e-02 1.041733402482071386e-01 4.901595817631374669e-02 4.058270168447497377e-03 7.037459344452123844e-01 5.305397447931113897e-01 2.193760200264272507e-03 5.094032928062286816e-03 4.738841657542880101e-03 1.286167455252870684e-02 4.086520886616912436e-03 2.074360056139698538e-01 1.958772205360887197e-01
5.436265397852563241e-02 5.475374573723219840e-02 1.529797733874921073e-01 1.680970861045277993e-03 4.292848921120993588e-01 1.019022386130379598e-01 1.786079737688523426e-03 5.043749640412928566e-03 3.333443753869547253e-03 2.936437441500379109e-01 6.366691738026011294e-01 1.211142227505831830e-02 2.591728810855013776e-02 3.378577946780027264e-02 3.140543978108937401e-02 3.902193503741958197e-02 6.815972705141556953e-02 1.203727294905527767e-01 1.254839510518338530e-01 1.012354316690752681e-01 4.366226339239567822e-03 4.589126047592871280e-03 4.052782652427784973e-03 1.277984110136691845e-02 1.839188100184781238e-02 9.374800512722002155e-02 9.320712021727653451e-02 1.824563661206457868e-02 2.413024488865942174e-01 1.419874267845221416e-01
4.915251299172186672e-02 5.374466859876149416e-02 1.242475832000587144e-01 1.388670511565676113e-01 9.291302446175216112e-02 1.064073846769689469e-01 7.565646370051222203e-01 2.706550087088273500e-03 5.569108455279036390e-03 2.020433632082077081e-03 2.107911577845333721e-03 1.842577502336981447e-03 1.442652609958568720e-02 2.992035656955862460e-02 2.859169798330532530e-02 4.471339996133808642e-02 7.976563104552442107e-02 1.003161580389390628e-01 6.026103882668766565e-02 1.360253912535939330e-02 8.242286217548650679e-03 5.690343944040569812e-02 8.274473097649995279e-02 1.399871709696806632e-01 1.315554002755164320e-01 1.700166390511984593e-01 1.351132442545985857e-01 3.786033200851706554e-02 3.757043603944217880e-01 1.676357978546798577e-01
6.115439146337269677e-02 7.122613022132757987e-02 7.112459844665118547e-02 6.820980999938791589e-02 1.043014139172028787e-01 2.177747424945405685e-01 1.569955181015111889e-02 5.241248659195714421e-02 2.558712676138036324e-02 4.404408384042136915e-03 3.283128938024288193e-03 5.119568301236360197e-03 1.017061274436578677e-02 1.524513922362946694e-02 2.039919960269697199e-02 3.702376869279426497e-02 8.313849616555579747e-02 8.836081863892301935e-02 4.417768458784747387e-02 1.578618357711320669e-02 6.832352575197170319e-02 1.238870696159516671e-01 1.589751733220624019e-01 1.650582562616859372e-01 1.451508114955631923e-01 1.238068572311586818e-01 1.806748707894285100e-01 3.124702041505812364e-02 5.539654423993340959e-01 2.344452382815215563e-01
1.471540849991389566e-01 1.169309244736367465e-01 6.231699427077473652e-02 9.890966860834282670e-02 1.492625755843164995e-03 7.500912260087929696e-03 4.203407801905070101e-02 3.428960130266726219e-02 3.379445284309950254e-02 1.701443209268875545e-02 6.252137655962891269e-03 1.683008488065743796e-03 1.652398361814117964e-03 4.304979261738957341e-03 9.748350230955115520e-03 4.504656512561091425e-02 4.993854254771343260e-02 6.233517433206515329e-02 1.155145663500259726e-02 2.129415648947834833e-02 7.573908153217032146e-02 1.640501917410425725e-01 2.031600376285186971e-01 2.133128761096186321e-01 1.750932972123968590e-01 1.654119873485457304e-01 1.505274078851163988e-01 1.193154409527008020e-01 5.292369152057436847e-03 3.486706178881815617e-03
6.611868365545223170e-02 1.849424065131032580e-01 3.510047907531939071e-01 2.771371138155645682e-03 5.975161196213581508e-03 8.368035884249865400e-03 2.640182806569145446e-02 3.277342936872788826e-02 2.246271155059534341e-02 1.763140059384520064e-02 3.726858356394803853e-03 3.930412516502101439e-01 5.920540171858371670e-01 1.605648325169893717e-03 3.526384997458580171e-03 2.098857887506137138e-02 8.430495920608101559e-03 2.864628926072910337e-03 6.574740108930363647e-01 7.628721209335089827e-03 2.906986389393256126e-02 1.551721693812090075e-01 1.973934702983809741e-01 2.085249000304342515e-01 1.525300120482138977e-01 7.026662121076465706e-02 1.124424892677419047e-01 7.716634421985134329e-02 6.957119824470380312e-03 2.745849045391401434e-03
2.048857705088320477e-03 2.562353437679272886e-03 1.681201736570945519e-03 2.031810445783757343e-03 4.641187142241348651e-03 2.628812028877029576e-03 1.348185819657062717e-02 1.724809575681232263e-02 1.585878336920315199e-02 3.787108936599094255e-03 9.572108947662682447e-04 2.316978388166411607e-01 3.975192745753580725e-01 1.087658509610629981e-03 4.402068388147462388e-03 3.011036310448393476e-03 5.748234176822915320e-03 1.781407367617537799e-03 3.486825506116113249e-03 1.694977872825384133e-02 9.155539431446831078e-02 1.745192049849834393e-01 1.890197010773976838e-01 1.826163240354701789e-01 1.422061928542385223e-01 1.049560395944994645e-01 1.017280386199128084e-01 6.853287201312290022e-02 6.169425566096823146e-03 1.114556579187855334e+00
5.670114459490444361e-03 5.018334884655974507e-03 2.524655707682231607e-03 1.765388667127895791e-03 2.220496517658611477e-03 1.171962660087381590e-03 6.632266073458831408e-03 5.856597109640160510e-03 1.599053778289683155e-03 8.807826195776709451e-04 3.877796370119376279e-01 3.017108915521213852e-01 1.768333412799623638e-01 9.592905165506279697e-02 2.433614674400007005e-01 7.991184818395705713e-01 3.108899937966845724e-03 7.348866579938537202e-03 7.314888252921511284e-03 3.344402089416430995e-02 9.220804398818001346e-02 1.353924693653428268e-01 5.586075046575839087e-02 8.608358112231041803e-02 1.139470392653222641e-01 6.578731106332710854e-02 4.966286348330299638e-02 4.078473404584599671e-02 7.285834871330897355e-01 6.646575000942857026e-01
4.543761450522155500e-03 5.049626227237501153e-03 7.613427615256754821e-01 5.613481594839816458e-01 4.925833746456819151e-01 5.669480868649274218e-04 8.012614847432001676e-04 2.845928105722765888e-01 3.745438910351961415e-01 5.751787966001546681e-02 7.391281325531803836e-02 1.102966024989622124e-01 1.205788802728933740e-01 4.261665928822367388e-01 1.131957233721852260e-03 1.532936091442113798e-02 3.010885949331976522e-02 4.487684600048578998e-02 3.152073165596424448e-02 2.434185756489385885e-02 1.754752867428029800e-02 6.395860613535913654e-03 2.515001071616319861e-03 5.584679480912030196e-03 2.087560286804286333e-02 7.266182930925265196e-03 6.848727484818416082e-03 1.099819495162108751e+00 1.261589116828367163e-01 1.031753830952102102e-01
9.487121910914388459e-03 7.084273007457512344e-03 7.962011619792506156e-01 3.630065721590436389e-01 5.619746075212883607e-01 4.521488423755858355e-01 5.221735600884014556e-04 7.787595371769114039e-02 6.633716998320528246e-02 2.830887031254159664e-02 6.618173966778448380e-02 1.234143060351586829e-01 1.629377506241409534e-01 7.715286973397747407e-04 1.352803139775167647e-03 8.967461683049104612e-03 3.363754301329060364e-02 6.466423021066743104e-02 7.550357040346949988e-02 6.767673715283827052e-02 1.482287926878278136e-02 3.392719950584758681e-03 4.290964822866476756e-03 1.072923953341071296e-02 2.446069433706729232e-02 7.379362775205072431e-03 1.364252632250206432e+00 5.285682247231708875e-01 1.667010362291570791e-01 1.495981053042277631e-01
1.162845544961015401e-02 1.454068683344599639e-03 4.249040944608117876e-01 1.462089073081838664e-01 1.733667674411521753e-01 3.883561038888740380e-01 5.094576083825173018e-01 5.789311320894027779e-02 3.217750342433525063e-02 3.678272200481200183e-02 6.448565154909013941e-02 1.090300795613417806e-01 1.228628271990279963e-01 6.776953160038335922e-01 2.487866182045863662e-03 1.283660667949867301e-02 2.560985650396464114e-02 6.086007794800571413e-02 7.902860722996660203e-02 6.933304683576045624e-02 3.589584724469324639e-02 2.136033365895576280e-03 9.248862546800651341e-01 3.416047089546555247e-03 1.993903798514648495e-02 1.210697181090494325e-02 1.106449741290618967e-02 9.848581614955953523e-01 1.509291573217277638e-01 1.159069958546944112e-01
6.542244450580875573e-03 2.003519222955008235e-03 7.501776138431638912e-04 7.958971766831447470e-01 1.501802015639961329e-03 9.978603578926217247e-04 5.351186198534745309e-01 2.217195492913952848e-01 3.343749175635050697e-01 4.318323298698495960e-01 3.992936531204461376e-02 4.472361700278801311e-02 6.961429952352640727e-02 1.575365845456734581e-01 8.912491283808625722e-04 3.920217127657446392e-03 4.108345185188180121e-03 1.823954491312367032e-02 2.422710531927951827e-02 2.166264708079275458e-02 1.901726476565885823e-02 2.551433788603689381e-03 2.427369423907236312e-01 4.607431534126331663e-01 3.541657271801584416e-03 8.881862006577020963e-03 2.403106794578896768e-02 1.365597520008745257e-02 1.799594025755641979e-01 1.358241018095929786e-01
2.355105944773513895e-03 9.231796663789284835e-04 9.443767775163553618e-04 1.585930811537916447e-03 8.447061146068374476e-04 4.701129990591565999e-01 2.184109316227401676e-01 1.551471184916737300e-01 4.944381969773679053e-01 1.336760964282530115e-03 1.283033920960804652e-01 4.399262597799103586e-02 7.435188986837140690e-02 1.630773020376137805e-01 7.724687780176011653e-01 1.398256029125232672e-03 9.377974142892835374e-01 4.601821678175800345e-01 7.182984850787252906e-01 1.632377925019965099e-03 3.038645319540393686e-03 4.859008111417201792e-01 2.433821242752338132e-01 1.230311487157814687e+00 4.926311115946743584e-03 9.927703163651484530e-01 6.117061071321601429e-03 6.925323357889119971e-03 1.354089285363939243e+00 2.074297870598094395e-01
2.388569695395761916e-03 1.892290728684141053e-03 8.839663400152023270e-04 7.416299699204835782e-01 7.157467791542772018e-01 2.733515690025473677e-01 1.824310256933181495e-01 1.889650192764611991e-01 2.100099427203301616e-01 8.313669337921083535e-01 2.328031040438243437e-01 2.196646757895530655e-01 2.072475369368009801e-01 2.583153689392349017e-01 7.486554341185501782e-01 5.249703759305348605e-01 3.650134765965572514e-01 2.243403792510405559e-01 2.022150246248922700e-01 1.568218067932789506e-01 1.243445754008151577e-01 1.809995211952066529e-01 2.869633997948554116e-01 7.167170190226955784e-01 1.258563372294325244e+00 6.030151537822532326e-01 9.637752351965438447e-01 6.187404851290072560e-01 6.216251738171896246e-01 4.005970742949254149e-01
3.237125846347695471e-03 1.664607460058971193e-03 9.087905740818004669e-04 1.238156593324057876e-03 1.060774453256973192e-03 7.157212082231150241e-01 1.848046937065231073e-03 1.351123376441374464e-03 2.826442596057723855e-01 2.033036509208447640e-01 7.189618820646445640e-02 1.638217848680618427e-01 4.863205066274359778e-01 5.411907124208230613e-01 1.580215080790562656e-03 1.298125052722940180e-03 4.168027854015354250e-01 5.095334273572423855e-01 2.417405047513015715e-01 1.064578266698694570e-01 9.652519513198376533e-02 1.470826722400873365e-01 2.283269408765042918e-01 7.254322311465735140e-01 7.593807563796705073e-01 1.848030832054617656e-01 2.079252998768496841e-01 2.636921107732935754e-01 8.407036591496384048e-01 1.751979551665929780e-01
4.315541176798624347e-03 3.682917257917626887e-03 1.081324193608068206e-03 3.681407387464075837e-03 4.164303888570467481e-03 7.626236659881274402e-03 4.970705013245250124e-03 7.652338787582531054e-01 2.788548739209823490e-01 1.598311165363985598e-01 4.682702673728689896e-02 5.807906447107821085e-02 7.287625817533917305e-02 2.962888506384570020e-01 3.780011776393481515e-01 1.735040197845096333e-01 1.753467577058819560e-01 2.165349533201253451e-01 3.018954246156380639e-01 1.667562242182646093e-01 9.046504064846190574e-02 1.225111277932466880e-01 1.372700642720227626e-01 2.407150648414885796e-01 7.875539633056649613e-01 1.279830024659805443e-01 1.888930247799394391e-01 3.081999324969492693e-01 3.615390668171923894e-01 7.368413532821028733e-01
2.308548839576716853e-03 5.650795147051645290e-03 1.684366149938351523e-03 1.778034539706196135e-03 8.403998049852139107e-03 8.675182476328494041e-03 5.657123930056504046e-03 5.269171640438728987e-01 3.751886275184385666e-01 3.527150568076590220e-01 1.442623830338567448e-01 7.125787423420802680e-02 4.622792213394784355e-02 8.292279439432218013e-02 4.079584929670209137e-01 1.221588491044145186e-01 4.505298494200903336e-01 3.468910901573329410e-03 6.738921459813839929e-03 6.951692038333866508e-01 1.358114323084285702e-01 1.713778038691926298e-01 1.453685819258678791e-01 1.664900741862082312e-01 2.305717122316944812e-01 1.827489053147100806e-01 2.197199217613090838e-01 2.717752719425775010e-01 3.552586869302643557e-01 8.940921073989285262e-01
