5.859655930587322550e-03 8.539895081015588807e-03 7.415525420454470787e-03 9.346838071222468569e-03 7.037250039366074739e-03 1.533554094910527868e-02 1.505393998641331790e-02 4.036066384152810216e-02 7.294525356699246843e-02 3.276498140512563301e-02 1.527632693746668047e-02 3.482263915532210138e-03 2.026876844096382572e-03 7.446302363083134868e-03 8.570124343173265991e-03 1.866734539545805054e-03 6.607717239268298681e-03 1.164982249573278533e-02 1.065933140192372452e-02 3.768855900853436761e-03 2.955832026154000224e-03 3.244977482824679127e-02 2.494755504074271796e-02 1.218494321940200281e-03 2.264903396626662038e-03 1.698599415918708184e-03 7.498872568180521472e-04 5.947987302784491989e-03 5.608717491238451869e-03 6.962982646408107101e-03
4.571667440728419650e-03 9.898147791355633301e-03 1.781947044505633251e-02 1.444025359858047003e-02 1.002328527686294907e-02 4.467695273930917532e-02 2.111605156711219775e-02 2.605654105294243766e-02 1.685509589139011499e-02 1.443324339033595985e-02 1.039549033239035684e-02 2.046899112426853011e-03 2.708622520056383313e-03 6.092017615273426744e-03 8.342360164114659415e-03 5.287399112746943644e-03 6.540408426925060567e-03 2.144546087266161263e-02 1.628364080216489207e-02 4.904972385794196567e-03 1.695147883998979199e-03 3.015341009396097297e-02 7.469367591690695331e-04 6.351804993402664556e-04 5.319170551885368152e-04 6.750683809741283518e-04 2.266342187824131604e-02 5.850562728084889377e-03 8.303849232150346121e-03 8.288652419223095993e-03
5.524544718933382947e-02 5.417407489523171082e-02 1.147094150660498690e-01 9.253640939754069483e-02 1.979010000963697946e-01 2.009374983364247552e-02 3.733701474025760345e-03 3.935318141007036058e-03 6.284527785008944822e-02 1.943736807166571504e-02 5.324199536682328038e-02 3.580854907703544254e-02 1.312757836983604459e-02 1.887168285524447320e-02 3.522254012084678580e-03 1.449614671512691744e-02 9.666859381561384787e-03 1.979051444684487224e-02 6.594934342673913763e-02 1.091759805776688214e-02 1.005234604330968546e-03 2.431953417684595831e-02 3.671334073771000128e-02 1.277671479133925085e-02 7.612461324850035814e-03 5.052755139925247524e-03 4.512334976563423666e-03 3.570613279376353907e-03 6.059072911566435599e-03 6.849581596462735525e-03
2.565766917708600311e-02 7.072083490855737842e-02 1.554264310669917215e-01 1.245544150199542066e-01 5.164484302658876175e-02 7.952456965221180868e-03 6.280811529108819985e-03 4.136066236797268300e-03 2.502413001161526811e-03 2.376331813709492077e-02 1.551943423401267244e-02 3.137950841868735602e-02 1.419749312824261298e-02 9.313428999495486707e-03 2.667197187973163568e-03 1.975409313501753222e-03 4.079737260743974969e-03 7.569397725475807311e-03 5.366097231419891291e-03 4.543507083781974862e-03 1.996169712973042045e-03 6.552110146397589676e-04 1.716903662896632557e-02 3.301985606444420018e-02 6.153898490503588795e-03 4.537960601727328291e-03 3.891558276852526404e-03 3.684679468959242265e-03 7.352148482459811007e-03 8.098816438163397927e-03
1.489142506635493350e-02 4.459122037348430684e-02 1.241499426821822544e-01 4.807876697831652002e-02 2.777724083421017481e-02 4.024011523071168925e-03 6.093143463615774760e-03 3.350099529411650415e-03 1.523864110923332359e-03 5.409695202094691457e-02 6.859963262993243327e-02 5.974084200077086487e-02 8.821495231391448047e-03 7.145193468297329070e-03 3.240262652219031651e-03 1.155972842835466469e-03 1.222630473441689569e-02 6.956076019796652438e-03 1.115960890218210474e-02 6.315508463065395983e-03 4.231371688807050724e-03 1.138990876488826277e-03 2.404258336266886995e-03 6.228022884230358797e-04 1.106471187326584643e-02 6.040697438255722765e-03 4.196558359313699860e-03 4.873748477999232873e-03 7.514639351129845726e-03 2.813068940214297209e-02
1.492806027462899657e-02 1.520620741001138879e-02 6.803492159697194230e-02 5.437308945960733775e-02 2.161370405238768541e-02 2.294863166829784647e-03 2.756434517830654973e-03 2.915247864581602209e-03 2.687133906717222541e-03 8.270147961850123075e-02 6.571325259979174382e-02 3.533316930628549457e-02 4.023108032874249396e-03 1.173403728953781398e-03 5.114671295244385685e-02 1.320793534807184876e-03 6.788898435445111200e-03 1.750722895971874079e-03 5.644511731159495421e-03 1.920583795854711312e-02 2.285518387873213333e-02 1.319454710246463491e-02 3.171100606036685293e-03 3.322653125418592590e-02 1.655628603888580075e-02 1.582060800296257452e-02 9.854380044044781101e-03 6.838809847355168184e-03 8.893935801336086411e-03 1.637838589416169138e-02
2.085746920545575832e-03 3.241601236340741453e-03 3.417409956486458338e-03 1.728029477343510228e-02 8.265010122641882478e-03 1.357683082004246949e-02 2.027594543898608714e-02 1.140104172611798583e-02 1.334441109812137954e-02 1.581248334271456030e-02 1.236464077583680765e-02 5.184304296404063442e-03 2.123963655627743047e-03 4.421824640209685159e-02 2.329999496788773966e-02 4.143957285544529190e-02 3.844246391869042372e-03 1.801404678305055943e-03 9.116964898473547269e-03 1.230810497953187949e-02 5.556163595563032298e-03 1.292217419683223088e-03 3.832916890364432977e-02 3.010580467603707691e-02 1.130453818195514305e-02 1.177976940459228225e-02 1.031917421451310386e-02 9.044930453702085954e-03 1.039674486233789844e-02 2.534821425925120469e-02
4.600148027074108664e-03 8.356613813027609361e-03 4.855184699396301526e-03 1.040223304592790415e-02 1.581415413361560857e-02 1.751243706188177623e-02 1.526231432110421692e-02 1.417122369329821760e-02 1.122273284141759968e-02 6.394025280533127339e-03 2.611504460621016759e-03 8.186383536916051751e-03 1.738075233635653308e-03 3.091518035144220564e-02 3.159936940367537306e-02 9.762323784303746565e-04 7.976577510717799968e-03 1.267056230146919316e-02 1.106842997111880458e-02 7.797520583682618356e-03 2.074761887922999069e-03 9.399364339672494455e-04 2.313272556273462260e-02 1.812125828897610813e-02 8.619039594011574518e-03 9.141609424318106886e-03 1.417641502092909303e-02 1.802760778604414749e-02 1.821030885138176514e-02 6.674859045400851915e-04
1.238528226368861181e-02 8.075962379866456764e-03 4.690864892058194992e-03 2.691352035210643409e-02 1.727780156349675161e-02 7.192280139577715385e-03 2.280207828108917270e-02 1.004296695287796790e-02 8.291595258035477228e-03 8.290850802885354337e-03 7.485402911017537825e-03 9.974799380570508606e-03 2.173325775059397127e-02 1.395708228923454863e-02 2.035855007903623979e-03 1.818071649878530427e-03 7.828625086421504148e-03 2.363743842336792078e-02 2.322590715770269168e-02 3.849283378444260089e-03 3.913294007144387660e-02 3.045965604277470901e-02 2.885150022627780073e-02 1.778343290703330443e-02 1.037435810505529452e-02 1.607676440245028524e-02 6.834180210198350508e-04 1.454040807786357095e-03 4.424773153331844518e-03 2.302367041038172902e-03
2.081880354088641236e-02 1.351726892270669125e-02 2.148844589196059751e-02 1.980256424700868600e-02 1.712269747802131620e-02 3.318649480939843844e-03 1.513401560369105614e-02 6.306434295084019370e-03 2.588716183349215605e-03 5.551248898537533560e-02 1.443117552581591606e-02 1.411588909271113343e-02 2.984312105685166250e-02 3.203181095126557409e-02 1.514662890621286569e-02 1.634397369493702235e-02 8.692926349941117181e-02 8.975539705007522240e-02 3.600330845302862626e-02 1.594807645422636339e-02 4.908381542986792884e-02 2.334349903623524763e-02 2.382529050780499147e-02 2.504271170086719983e-02 1.375099754286131064e-02 1.781557286406442592e-02 1.992428955135290385e-03 3.592063493107213422e-03 4.680378888574797738e-03 1.280887127295060645e-03
1.730349664975843263e-02 9.010512047076417452e-03 2.005181003205219747e-02 1.694617011998040754e-02 2.129187243306525715e-02 1.923152659475757661e-03 1.584610650688475725e-03 1.344949567023014277e-03 4.779867547327358579e-02 7.369946783286461349e-03 1.154853643920977085e-01 1.918702246427085867e-01 3.956476406022502168e-01 1.950392909220103332e-01 3.596629360034733769e-02 6.975723491030366707e-02 1.289268932322602534e-01 3.563092186082396362e-02 8.519569845255939300e-03 1.692463455342385278e-03 3.427648365908077949e-02 2.374945387653684681e-02 2.796557396891079239e-02 3.803127523392123288e-02 4.014545418275354549e-02 2.173223695989836418e-02 3.440704760694226344e-02 2.766337518809477286e-02 2.484961376902842384e-02 1.784482497757482883e-02
3.151470251770751782e-03 1.850822610675277504e-03 1.629911732891337756e-02 1.592481661530878445e-02 1.234812343454402828e-02 2.791975295387675617e-03 5.876713338787425966e-02 3.783385016077935037e-02 4.689482798416816367e-02 1.465838459212120450e-02 3.525035607257555326e-02 2.276450405729938675e-01 4.065697128778779645e-01 2.121040858874781998e-01 7.722154913037324042e-02 8.714998171882279432e-02 9.606131624744171371e-02 5.678474512007963132e-02 1.402218029479020134e-02 3.939902882214324498e-03 3.241981040565711236e-02 2.859634267570989458e-02 3.209487823672808882e-02 8.980078052930191542e-04 8.424280217377655509e-04 3.834405674161322358e-02 2.924772837812653764e-02 2.628996447274576514e-02 2.783455313838906903e-02 2.945390106741611891e-02
3.098307566459464896e-02 1.525131035421716658e-03 3.748130857830276122e-03 1.064133104447120663e-02 6.937256325818551977e-03 2.156479124022735432e-03 1.067573355267736933e-03 5.042362028767267274e-02 1.037456833583886998e-03 7.450479395807960495e-03 2.451061611226696899e-03 7.304236721909983243e-02 3.047222581730131830e-01 1.312972336090270642e-01 4.169142587021293367e-02 4.852617455711376315e-02 1.793327327765195656e-02 2.633818833840224569e-02 3.004915097749934899e-02 1.123043281068277291e-02 3.967097452712510519e-02 3.540219617089445520e-02 4.239029565022241208e-02 1.274305179518679318e-03 1.656863654879345369e-03 1.536317305153225322e-03 1.115514948794399126e-03 5.886427683070498407e-02 4.406430021377340245e-02 3.337436081548474098e-02
2.439054088064741485e-02 1.309481290307585189e-03 2.439738709077257303e-03 1.800009223922390813e-03 5.695829891680134760e-02 4.130269596101819596e-03 1.383920848700522302e-02 1.160559207015072168e-02 1.468383835336469889e-03 2.823211383745244038e-02 1.815211389343879787e-03 1.189536629614743046e-02 1.391066906772014111e-01 1.901925224442204132e-01 2.055468637686839739e-01 2.806555098986829311e-01 2.528664859207210847e-01 1.636886730846941473e-01 4.461046691637403638e-01 2.079365495021761323e-01 1.711807910449104908e-02 4.921726707122663774e-03 3.641708079387508297e-03 9.094115210067695715e-03 2.094260243071647404e-02 1.939875433248802045e-02 5.251996378544615540e-02 1.664272236682949255e-02 1.245891893208782384e-03 1.107424402137967539e-03
2.205318395813485322e-02 2.227625222227559362e-02 1.142938581585829219e-03 8.610622273188215173e-03 3.121665933337261674e-03 4.069431956455431265e-02 9.277596601232118712e-03 2.663963758767229004e-02 1.788270320644026051e-02 1.827839553636341138e-03 3.865636455885225389e-03 6.002106494737985409e-02 1.260299867714216870e-01 1.605980863620385113e-01 1.460239185563609321e-01 1.776598525021477748e-01 3.033645988613966615e-01 5.242094729485387017e-01 5.355112427136409226e-01 4.249347847239699494e-01 1.814674551935814215e-02 1.889858831732302291e-02 1.655706483421246974e-02 5.143942367681288153e-02 7.297453984360931234e-02 3.686091091168082201e-01 3.648260064130105507e-01 7.192400591306088997e-02 1.519022339643912685e-03 4.935740329968306417e-02
1.946006939377722955e-02 2.137087092493981932e-02 4.971075653815000550e-02 5.560263427430980204e-02 3.718509863375780988e-02 4.253670293664159330e-02 5.113229303710243971e-03 1.433181936496380482e-02 2.968101604658655163e-02 1.060469736516981079e-02 1.090466837691224898e-02 9.365805374547155060e-03 7.217030582623415458e-02 1.463947974676478858e-01 1.370016133919266244e-01 2.100547420706799229e-01 3.630249359130248710e-01 4.424589144513968453e-01 2.581319250425239686e-01 5.689651438599431510e-02 3.398640963970628315e-02 2.314944797459316805e-01 3.324373581729551663e-01 5.514611397445947638e-01 5.104128747390876963e-01 6.553329553922444539e-01 5.204150973328676155e-01 1.471405015608081568e-01 2.448069028828935532e-03 5.842292174334077354e-02
2.377239037206524408e-02 2.780359227072722039e-02 2.793326277710640737e-02 2.698719331553042083e-02 4.165786118827520534e-02 1.440639928739746636e-03 8.383529179074647453e-02 2.795771708045912129e-01 1.365717607329843264e-01 2.338683226073449972e-02 1.735629175589185891e-02 2.678787993542462720e-02 5.250922520001320704e-02 7.697141115854233551e-02 1.009280935486050190e-01 1.797333257351600988e-01 3.874465444953002491e-01 3.950050464026243491e-01 1.900925548838172940e-01 6.585965417140843270e-02 2.797748661371047274e-01 4.984416593500381465e-01 6.290768138829152534e-01 6.378246566222148806e-01 5.540995672894999391e-01 4.721410809340305659e-01 6.894991476788658868e-01 1.196842672291195953e-01 3.768412965815262465e-03 1.552465628695828305e-03
9.835759826872397284e-04 4.549750551717313823e-02 2.422563995130333492e-02 3.872149635042877736e-02 8.163973394991176635e-03 4.117757333953718513e-02 2.289828026361893087e-01 1.860677016034441023e-01 1.833275089452950646e-01 9.223186297776388154e-02 3.389376881994741325e-02 9.089982201217011726e-03 8.816894313130291261e-03 2.241240248078863601e-02 4.969347143852027165e-02 2.252922170648982148e-01 2.378770401529219647e-01 2.824282036714585997e-01 4.996173365078776518e-02 8.872078001805550063e-02 3.082469710682579356e-01 6.532596024592280948e-01 7.928497612779239478e-01 8.105794156787407001e-01 6.601834634503823684e-01 6.244100949821480562e-01 5.701936525729799365e-01 4.520663788639547320e-01 2.005925056341972823e-02 1.322131321790493558e-02
2.546743338125768974e-02 1.168485765546272565e-03 2.156924227495061585e-03 1.492926378180861255e-02 3.309902502945778757e-02 4.675912836682104279e-02 1.475186880478091267e-01 1.836730771993302369e-01 1.265079370435761297e-01 9.870564816056986990e-02 2.076735134945093680e-02 2.032294289425451948e-03 3.053714001011673292e-03 8.453749908832582094e-03 1.795795962732010809e-02 1.038394522738594061e-01 3.992377508801621400e-02 1.299391257988153497e-02 4.414129816339488338e-03 3.205075723148326228e-02 1.190200484413175275e-01 6.198057381417300116e-01 7.702313217858274275e-01 7.950043753334399277e-01 5.723717033703545898e-01 2.600333553190168345e-01 4.131565498119633140e-01 2.836299402563826066e-01 2.558010600972045190e-02 1.009965842471738026e-02
1.036187280571258459e-02 1.334935304291540170e-02 8.944004279986293021e-03 1.111408935535610279e-02 2.628429761264779174e-02 1.509642732220073738e-02 7.791814692321338831e-02 1.005587172437465426e-01 9.321730150915530366e-02 2.200886547885325811e-02 5.534519430557606826e-03 1.168722599181121462e-03 2.022586461867074796e-03 5.825475846733705818e-03 2.252970045993206438e-02 1.478426651221806387e-02 2.725160338549859410e-02 8.167084351056466685e-03 1.547424409903443501e-02 7.291579076485601996e-02 3.829119392974628111e-01 7.106407073440929034e-01 7.502951262847392666e-01 7.027854257613823652e-01 5.306139717948027412e-01 3.813864207971070508e-01 3.632007560624868070e-01 2.447539760328434344e-01 2.203979557497695585e-02 7.846837530901276669e-03
2.864753658461863944e-02 2.633501369384076349e-02 1.364991884643960637e-02 9.881702010854285373e-03 1.292643203523881693e-02 6.954468682939347543e-03 3.975254986527126944e-02 3.553940641212050000e-02 9.820304769740228340e-03 5.360103000790348432e-03 1.856312841226039068e-03 1.479133042955481933e-03 8.803644376701531740e-04 3.582724175271199268e-02 1.237250821812912278e-03 4.099419700728277466e-03 1.475684824307387649e-02 3.403067378131626602e-02 3.307121919609940647e-02 1.473392339253582484e-01 3.941610368789294494e-01 5.624758737597834735e-01 2.259562810550340972e-01 3.337092843049390689e-01 4.230193328515446938e-01 2.350564077195648471e-01 1.727836733010167936e-01 1.419336036913451116e-01 5.203280470940973082e-03 4.704175832889084634e-03
2.311695436387135177e-02 2.670228592442284998e-02 3.974661685207492301e-03 2.769923905994347343e-03 2.285394984993964484e-03 3.422042534448765765e-03 4.905300689769312439e-03 1.226838513909057297e-03 1.595349313226740147e-03 2.182582072067650730e-02 2.839081516374894476e-02 5.291182824204579763e-04 5.902071563382560709e-04 2.099237157585300603e-03 5.867042869148399349e-03 7.473862869632126593e-02 1.433958785084900045e-01 2.093043592208796433e-01 1.441241509692248179e-01 1.086191949102394139e-01 7.573994866980290896e-02 2.676176147771088670e-02 1.022334837770669247e-02 2.167324571003548944e-02 7.718851625894310176e-02 2.569887107560264727e-02 2.343533555874550978e-02 7.915330941804967282e-03 4.235057962575150547e-02 3.463463006742477368e-02
4.936884049227828475e-02 3.807782979310056493e-02 4.149159060662765963e-03 1.793569481435938490e-03 2.630313504179348019e-03 2.054657052870605995e-03 3.182165850567479116e-03 2.938251795869192134e-02 2.508431061463468198e-02 1.079266310916518652e-02 2.543646842862132273e-02 5.855541080894762374e-04 7.898947054789343548e-04 4.292585569163024674e-03 7.060677639565281390e-03 4.401368468103648846e-02 1.609817996277282948e-01 3.023704220932795783e-01 3.453138771004189977e-01 3.006757585882575690e-01 6.331701106356200925e-02 1.397167507371722094e-02 1.707442583998265012e-02 4.115321465548342494e-02 9.048385217524052004e-02 2.637149684548191486e-02 1.004769979953186801e-02 3.782339057982921863e-03 5.574510604038887540e-02 5.000712202572091258e-02
6.182141321263068257e-02 7.867223894604409226e-03 2.201994166185400163e-03 7.216678932139863369e-04 8.163373443732132011e-04 1.782014973930821575e-03 2.295772005814909495e-03 2.201382580619433774e-02 1.228566854640533029e-02 1.410367129374545669e-02 2.482489053005175472e-02 5.093295468516123754e-04 5.875482228726201187e-04 3.321434312268300906e-03 1.311595098714128139e-02 6.377890037999191242e-02 1.235694065395956526e-01 2.857610036966293787e-01 3.606583959129724959e-01 3.054616132957088670e-01 1.511619693214580618e-01 8.626104634673607829e-03 6.049661249007395880e-03 1.293390720265647463e-02 7.386341128337720052e-02 4.389920352924400748e-02 3.937806526569809923e-02 7.397488275569752587e-03 5.028744790337125181e-02 3.853671263674574021e-02
3.447309328946999984e-02 1.066772732362076918e-02 4.191664374984145625e-03 3.914373948454213242e-03 8.631480736452736002e-03 5.884266149942937382e-03 2.430909338538694234e-03 9.893539507531035233e-04 1.472050413173154031e-03 1.933365718484835686e-03 1.540329256359096281e-02 1.725125677651283274e-02 2.661021194170539589e-02 7.662323764834235839e-04 4.760687173977314751e-03 1.980933993767025614e-02 2.009121823844625329e-02 8.635796634093839685e-02 1.111481503339973309e-01 9.559478090850663523e-02 7.973724138568089037e-02 1.020796465665650340e-02 1.555042433370737703e-03 3.016416395743335734e-03 1.330530726087869597e-02 3.314350786234886159e-02 8.888761448776558161e-02 4.979910336760976636e-02 6.017999259290508079e-02 4.528122621241905538e-02
1.235269813337652213e-02 4.898120554202848274e-03 5.287845188062812937e-03 8.941235863712083259e-03 4.844830222048408797e-03 2.165458150643768606e-03 9.935467278639330702e-04 6.934833785097955020e-04 2.179982084768950553e-03 8.499448569057405090e-03 5.803704287217708408e-04 1.696100078757428742e-02 2.840793666406257745e-02 7.912923383875923328e-04 3.873490350888564131e-03 7.106025983306768663e-03 4.963149244732299563e-03 2.489321068334239377e-03 3.963978349830060699e-03 7.267382869578763345e-03 1.294017954327512585e-02 2.954572766178419248e-03 1.523534641704121697e-03 7.779636034604296355e-03 1.895864367605294004e-02 6.723612947738777552e-03 2.315556233076378201e-02 2.579929729661421811e-02 9.115269243234845956e-03 6.966806587660920314e-02
1.252387770976337057e-02 1.004978106079802355e-02 4.948771160087107879e-03 3.641254764347866268e-03 3.362223284212666110e-03 1.258966571682525572e-03 8.297379766255572140e-04 8.444880821712841094e-04 9.260852582343919804e-04 3.721500157465458623e-03 1.053163908234424490e-03 1.001720468838816509e-03 9.699052060400851312e-04 1.253968287097808904e-03 3.755654988533791913e-03 2.707625805001947876e-03 1.932527812785862775e-03 1.213936786700847356e-03 1.116264605983250183e-03 5.469556772798558203e-02 4.313136680407984175e-02 6.245498951786222774e-02 1.740043690227417901e-03 4.433673520222504785e-03 7.929381745969538847e-03 3.865260095428911871e-03 6.241092725939392100e-03 4.133037897039453998e-03 4.149981223926527130e-03 2.653994138503876568e-03
1.696710342731997181e-02 8.849151885882967222e-03 5.086921605427396909e-03 6.983250015519549062e-03 6.085528882814043861e-03 3.296061142744101564e-03 1.123181804003786990e-02 8.463448903658537040e-03 1.246559829888207582e-03 9.101670180875038544e-04 2.775045715410006872e-02 7.471140492293277570e-04 2.276798884458702474e-03 2.628061682196774010e-03 8.464999338455160560e-03 6.591581005144070936e-03 2.207318345567097287e-03 2.757803957571469677e-03 1.334744573974294647e-03 3.717146350344056882e-02 3.360697267524903609e-02 5.106451178875828778e-02 1.333896639376362832e-03 4.353375979961745038e-03 4.680188013589253043e-03 6.283460157513003075e-02 7.032393328027600199e-02 1.732221459264866523e-03 5.663800599514514506e-03 5.889180366139519507e-02
2.279636315443879166e-02 1.973470164345392242e-02 6.044973948848219106e-03 2.076978246598471661e-02 2.388782914799359239e-02 4.489468762423400733e-02 3.016917319896583738e-02 3.414951421858719235e-03 1.228947536038474007e-03 7.153711945416614450e-04 1.806555772853545710e-02 2.238140437514354528e-02 2.782622832339037497e-02 1.440479576885055936e-03 1.898753213077986664e-03 8.958478861674165367e-04 9.291232269073183619e-04 1.187848450989724544e-03 1.701626067964533227e-03 9.339973964533925714e-04 3.162136190214724640e-02 4.281558498455348416e-02 4.796291098025809441e-02 1.400974014461206030e-03 4.771421716381701872e-03 4.358626805709268220e-02 6.388495749224984421e-02 2.042981319953451023e-03 2.506470043062621403e-03 5.058904009136850483e-03
1.255993991685344646e-02 3.128889741596278806e-02 9.394191844763071647e-03 1.005349298280314510e-02 4.818892607801789074e-02 5.065116900056354510e-02 3.372838596786110338e-02 2.313188791729921517e-03 1.631249077137146694e-03 1.569234651361115732e-03 6.550549449587622468e-04 2.723881792802988408e-02 1.755612418836388980e-02 3.122188201727053858e-02 2.120002915720791900e-03 4.520391739971700573e-02 2.515888673106814188e-03 1.612393062280966308e-02 3.006485643162173926e-02 4.214938459662458808e-03 4.760396056874857673e-02 6.006868356098246653e-02 5.095078982692523295e-02 5.801270882894089820e-02 1.496302248858700709e-03 6.287122103520179084e-02 7.517042568915471845e-02 1.914624492210813093e-03 2.627147623383689970e-03 6.547129905998509344e-03
