1.109876024473145477e-02 1.564626118270467936e-02 1.370278197411528218e-02 1.741673202656236763e-02 1.322092813468729935e-02 2.898310535780856956e-02 2.856282207686956093e-02 7.686922023749982735e-02 1.393954613643177409e-01 6.529806647279103038e-02 3.178696201586731634e-02 7.545890044357123419e-03 4.507565110263054599e-03 1.661521052122933578e-02 1.918023814325812981e-02 4.188397666704937738e-03 1.466036092248807973e-02 2.543707115237482316e-02 2.289673580086286006e-02 8.010282596068854510e-03 6.401527603685436447e-03 9.867202614575940056e-02 7.689328808616782696e-02 2.561588253683962351e-03 4.174097175568412983e-03 2.834741170668945119e-03 1.542059665635558685e-01 1.412140625703622518e-02 1.435503955620543760e-02 1.945829929170208791e-02
8.133787632183690774e-03 1.680454081759473126e-02 3.039068145093098278e-02 2.473991896727210926e-02 1.725050491095680635e-02 7.731441933067700889e-02 3.676304762349284772e-02 4.560417493401958816e-02 2.963850681755309663e-02 2.677261788750373225e-02 2.050746516215082305e-02 4.286292067657878138e-03 5.892459989783729868e-03 1.335903693844685963e-02 1.844417136019559783e-02 1.178849722921291622e-02 1.445924367337566088e-02 4.676522290611142413e-02 3.502944884977485934e-02 1.047365788824157658e-02 3.692218660977729730e-03 9.193582487639502532e-02 1.936946373957409984e-01 1.570897148568350388e-01 1.180950903100347615e-01 1.452296153623339747e-01 5.577870550406385797e-02 1.511984174362286659e-02 2.256237626138124161e-02 2.370479044198273849e-02
9.300118958345360287e-02 8.729124144598036927e-02 1.849200169553626427e-01 1.492569471811513449e-01 3.194032212296591955e-01 3.259718776005057078e-02 6.106880298722529646e-03 6.481896693800710471e-03 1.041265382505220383e-01 3.377422986372347058e-02 9.950758787630897828e-02 7.239895894119557918e-02 2.790588355715151528e-02 4.065029178288620537e-02 7.688812950927900389e-03 3.210338460420735646e-02 2.128763246664974740e-02 4.309509648737176041e-02 1.421023822313659812e-01 2.343195453526982636e-02 2.203415714256500967e-03 7.437181321187816274e-02 1.139074731786348105e-01 3.600478814084741297e-02 1.817197905627358084e-02 1.167674001465972104e-02 1.268627708675252111e-02 1.016539996198280275e-02 1.747800584054901712e-02 2.003196309134228775e-02
4.308222960474507313e-02 1.136001775326515167e-01 2.496689112183287373e-01 2.000807722275782241e-01 8.296260005148367589e-02 1.285127823348409387e-02 1.024979964208132255e-02 6.808731823360941217e-03 4.150850830902079111e-03 4.139030003272414771e-02 2.916786863812789732e-02 6.408501237911837234e-02 3.031274499715610679e-02 1.972122742141855373e-02 5.603076115628406392e-03 4.120168009104059094e-03 8.456800916940454549e-03 1.559520620484795492e-02 1.098864182882035995e-02 9.296840840803899386e-03 4.165716551747971827e-03 1.601727036390713788e-01 5.043120993142798103e-02 8.907721174689815780e-02 1.459727653797873378e-02 1.047372029496821191e-02 1.033172264904533288e-02 9.826654340874216645e-03 1.969410685985710507e-02 2.178890323045629129e-02
2.496103099126501315e-02 7.145464012010646626e-02 1.989474065372131006e-01 7.704702057474432930e-02 4.451445552983405302e-02 6.495073999755935669e-03 9.952038176736207123e-03 5.530949306596171476e-03 1.921348690667083747e-01 9.511171461174283692e-02 1.306810444048844000e-01 1.239971103231339300e-01 1.897544969390566050e-02 1.483003462154822150e-02 6.480540620758531295e-03 1.933375843907093050e-01 2.338727238887000973e-02 1.329213467960212169e-02 2.129128106838944559e-02 1.207220959320209723e-02 8.223979297854989989e-03 2.249549873690659309e-03 4.823982602681602637e-03 1.419055423482564471e-01 2.624230243258533074e-02 1.386653608837562328e-02 9.975421393770032147e-03 1.163033704899830642e-02 1.799983993745091562e-02 6.762801929799033829e-02
2.497176683039037393e-02 2.430219301790201639e-02 1.087349525528684968e-01 8.690262217338790007e-02 3.454514349178017946e-02 3.698942839906226368e-03 4.504725649273516250e-03 4.825402009000731920e-03 4.500451687242334152e-03 1.467253035693337759e-01 1.268540258521479447e-01 7.460545750921518393e-02 8.717234551019675121e-03 1.840638574343458900e-01 1.310173264896909995e-01 2.012433722093535104e-01 1.208388067770398318e-02 3.128596242707237969e-03 1.011915635784936193e-02 3.459866794013672503e-02 4.173181561970901177e-02 2.440788046585423351e-02 5.943164398060848085e-03 8.184429383391869650e-02 3.929291598801224611e-02 3.658555714306813145e-02 2.254026690128985502e-02 1.569569551734545723e-02 2.047495435235685210e-02 3.780971814659406932e-02
2.723667387473849288e-01 5.294737687541303285e-03 5.555178359581828748e-03 2.797126632907825233e-02 1.332883882004035937e-02 2.206222321017346083e-02 3.343517783380668684e-02 1.906059839169204490e-02 2.259932713555404954e-02 2.852878472320451858e-02 2.427217790049296040e-02 1.110960179504425979e-02 3.322153407204144204e-01 1.191309309857607468e-01 5.748751044084720457e-02 9.540971007827289685e-02 6.600446855786797594e-03 3.115686395760780374e-03 1.587299246888116550e-02 2.157447058304661283e-02 9.832791068793839129e-03 2.308186261215276671e-03 9.242285863453769679e-02 7.242405798257568750e-02 2.693866017775637875e-02 2.781281480795443420e-02 2.415634385084779526e-02 2.123293511535252753e-02 2.446476685369711537e-02 5.976794363276283217e-02
9.163664443762375988e-03 1.576773115439229073e-02 8.886177040301059676e-03 1.848109910661224764e-02 2.733296828487593103e-02 3.021073881867190891e-02 2.669160607683557923e-02 2.510507214234944731e-02 2.012542938174445573e-02 1.216468097505929262e-02 5.292474046258017518e-03 1.763241723998161883e-02 2.740214167501220932e-01 8.579327174477975604e-02 8.236538551338330738e-02 1.429882820063571869e-01 1.453061925475238221e-02 2.318001335210149658e-02 2.032784074431206317e-02 1.440191587703354772e-02 3.880742545736677162e-03 1.724977220793272314e-01 5.941965534903638491e-02 4.648487147486933535e-02 2.191277154097224025e-02 2.304072459424508917e-02 3.541283781400360320e-02 4.424733544894960541e-02 4.402524912028708826e-02 1.303257301662928136e-01
2.745091038719869175e-02 1.748599382607302077e-02 9.781411341342728660e-03 5.362337402460316815e-02 3.273991902411135801e-02 1.345542645746809589e-02 4.318778385934502612e-02 1.925518351320445326e-02 1.608654617759599018e-02 1.670138493370211530e-02 1.564346441565907936e-02 2.159977191328936452e-02 4.743207477639622971e-02 2.956561551842096236e-02 3.159902391838299573e-01 2.778675855900814007e-01 1.546727177487128985e-02 4.677621412847648985e-02 4.602760547285035531e-02 7.662571157256811705e-03 1.062591836625349784e-01 8.393700660152664250e-02 8.068561741385883723e-02 4.971696833350989359e-02 2.876278257102164379e-02 4.421472706504833705e-02 1.651858412715161983e-01 2.793568778600858012e-03 8.230505167872301936e-03 4.181632590749855515e-03
4.871917846938533803e-02 3.146042925302246218e-02 4.880714338028290661e-02 4.320528986709178121e-02 3.541706930950550697e-02 6.743706783959959802e-03 3.110736596967823148e-02 1.310812582204774410e-02 5.440860014642295676e-03 1.595244855828961139e-01 3.103114841935448315e-02 3.071239520347940344e-02 6.526120960020365125e-02 6.974096656143688455e-02 3.280005126749593880e-02 3.518234200732701933e-02 1.868186542539405637e-01 1.927538963599427779e-01 7.725682467849687152e-02 3.435115152976729591e-02 1.449474120813886713e-01 7.008723761928875584e-02 7.275210028995407474e-02 7.652365225624439826e-02 4.170006613500581300e-02 5.362404269793041162e-02 4.361858585744654744e-03 7.397064760332249488e-03 9.080224149262926259e-03 2.371892175687880487e-03
4.098025805693821660e-02 2.128578991720925240e-02 4.667877158183773856e-02 3.845696747635020396e-02 4.705924904212344106e-02 3.107148777169261855e-01 2.634885962098084677e-01 2.312644240675004181e-01 1.461452049937930486e-01 1.644600257632507223e-02 2.557067125966325238e-01 4.214212022484190578e-01 8.671028169012635622e-01 4.296910553436560365e-01 7.962188053520763420e-02 1.552343744840377071e-01 2.869494892303438016e-01 7.923982728269007847e-02 1.893054449083438756e-02 3.037034728929376981e-01 1.052886758912550402e-01 7.418281832734655024e-02 8.888835240625175826e-02 1.211843206404611406e-01 1.272803872516617696e-01 6.855417472686262115e-02 1.074618518490718794e-01 7.992699913572900994e-02 6.602026109772732299e-02 4.417838020268258920e-02
7.527563746092878587e-03 3.115655963235813841e-01 3.807543933836723266e-02 3.646457296740461540e-02 2.826233423197199029e-02 6.422409471633774153e-03 1.871546294521323761e-01 1.210441729663167820e-01 1.506597720670894702e-01 3.405092900427844627e-02 8.034204151902078761e-02 5.069145135984368666e-01 8.924794920129845988e-01 4.655302984315757286e-01 1.694430248595144850e-01 1.911609312911994318e-01 2.107313068248307664e-01 1.245896005574714527e-01 3.076911612494059173e-02 8.681994725259057841e-03 9.831282620639100744e-02 8.786927177597658734e-02 9.993625287781435218e-02 1.772686127115953303e-01 1.684496730355062866e-01 1.193714960685527404e-01 9.035543046303996795e-02 7.519211854105789516e-02 7.331949245972733953e-02 7.247236166921552925e-02
1.024582184163475851e-01 2.630491552253727550e-01 8.758749082760752813e-03 2.431873510339951916e-02 1.591702340746354097e-02 3.729004382136587026e-01 1.921777663278434745e-01 1.616207340365366507e-01 2.049276791996975933e-01 1.759558770631294844e-02 5.718643526916095642e-03 1.646109236897795036e-01 6.692778893042066191e-01 2.869021793341705040e-01 9.064534027011396378e-02 1.049885471776415974e-01 3.882220125962149160e-02 5.709539204964715620e-02 6.522720523343430998e-02 2.448143386765177024e-02 1.188840792859545414e-01 1.070938631854974898e-01 1.294703160846940315e-01 2.222394722359700703e-01 2.911870067151860475e-01 2.736656615487695898e-01 2.009272248500493796e-01 1.666754295367741667e-01 1.150657722055576648e-01 8.162119250697205675e-02
8.107701267006536816e-02 2.318972231840275011e-01 5.686334338893747620e-03 2.965934317553568511e-01 1.762068336607526542e-01 9.307734402406342422e-03 3.124513443940235558e-02 2.624237622334436859e-02 2.910818617428675981e-01 9.132337439326773665e-02 4.296209204229475831e-03 2.709894039434794510e-02 3.055739172528456615e-01 4.134965518026303966e-01 4.426810543533326037e-01 5.988603026622125736e-01 5.403362424764542871e-01 3.507678243260232698e-01 9.586013577068244196e-01 4.487526823903870143e-01 3.724841216515097087e-02 1.080023893905503879e-02 8.061025707256825462e-03 2.028784426666298268e-02 4.703873489092105092e-02 4.384404571529158107e-02 1.185324068503565975e-01 3.506707339065693457e-02 1.860396105144253021e-01 1.654738348984442220e-01
7.239777887790560529e-02 7.264466518501867809e-02 1.983759368592769023e-01 1.942119418589492025e-02 6.993837512839808958e-03 1.254909349884432701e-01 2.077522531454953358e-02 5.972217850797944400e-02 4.026151898162393106e-02 4.269249502994639130e-03 9.085704323091411266e-03 1.354050997786918897e-01 2.739511402232707726e-01 3.468661848774780565e-01 3.134385158565602403e-01 3.789751487189504942e-01 6.481145640491872140e-01 1.122721322789637544e+00 1.149786534399264371e+00 9.163828016393543718e-01 3.948257005927447577e-02 4.148690604301349255e-02 3.667553098571302989e-02 1.138245927317200340e-01 1.605512194806697213e-01 8.059285146593540006e-01 7.878636771642528736e-01 1.464326737624205566e-01 2.116532272556736205e-01 1.192230831723270212e-01
6.201347567348153289e-02 6.798074248004690179e-02 1.568917453797983586e-01 1.746598560720084570e-01 1.151661741048300158e-01 1.310370391713520100e-01 1.141939897372827584e-02 3.205795023429063029e-02 6.672698833352047609e-02 2.462505971646488864e-02 2.537439984648331981e-02 2.082963950748521406e-02 1.548676246932480793e-01 3.139791801836306351e-01 2.936440341609763416e-01 4.498762570629908919e-01 7.785793784078265389e-01 9.504712008900222386e-01 5.554268496438264924e-01 1.229984232917107623e-01 7.431028060411300207e-02 5.119003018721820508e-01 7.434435194351280973e-01 1.214787218100119581e+00 1.093447831240521362e+00 1.363139523637230788e+00 1.049626423122324903e+00 2.858767413511401623e-01 3.219791597204008093e-01 1.402397726198690575e-01
7.199860452529377453e-02 8.522955014956008768e-02 8.825309218108155773e-02 8.537916911625056948e-02 1.292948483340758958e-01 2.681769900479099022e-01 1.866400739274751974e-01 6.237610084244084030e-01 3.064125065195512643e-01 5.396598337485705027e-02 3.996161381482887104e-02 5.868654148174605456e-02 1.111899221554160933e-01 1.638931963696480532e-01 2.160172281592523391e-01 3.866731580071436913e-01 8.342081826235254738e-01 8.510519519146646505e-01 4.098532515395458264e-01 1.427053526230580016e-01 6.146382078299612584e-01 1.109882775078382178e+00 1.419424523323533638e+00 1.396699515091573529e+00 1.152597541564122308e+00 9.322681404772543701e-01 1.307925133568304421e+00 2.239832964393559667e-01 6.973498350273589497e-03 1.955289926396537037e-01
1.641933889707676841e-01 1.335068954104272898e-01 7.574940395897636347e-02 1.231133846144686766e-01 1.836948731146052435e-02 9.182303148042011975e-02 5.115160831042108169e-01 4.162635920798987144e-01 4.119916962274270400e-01 2.115770937451885159e-01 7.718090347755926506e-02 1.961650565350816361e-02 1.842865222057904137e-02 4.729004735241477270e-02 1.058498958887849201e-01 4.848102444192357030e-01 5.120175478372047673e-01 6.078579739899745427e-01 1.075612852681473997e-01 1.921263693625625824e-01 6.787880273922297647e-01 1.461910054419706562e+00 1.802138942309037706e+00 1.761711569107690112e+00 1.331833369095677178e+00 1.179998491505442004e+00 1.042402263829741660e+00 8.264493496552505203e-01 3.666791273192074319e-02 2.416369190144189438e-02
7.262718823882978458e-02 2.101595587565243672e-01 4.800565004717474368e-03 3.418483549764511631e-02 7.608183000065210644e-02 1.071115598417684417e-01 3.371393325502619609e-01 4.186496474545879365e-01 2.878291376696631709e-01 2.246583626261408617e-01 4.632976841803321255e-02 4.341867148776393237e-03 6.336276300592134578e-03 1.738307713361740212e-02 3.655940493141197206e-02 2.091644271668218757e-01 8.023300194905737259e-02 2.607144279813825710e-02 8.847368348907617627e-03 6.453603713104365258e-02 2.433944657369926379e-01 1.286928313510514732e+00 1.623352735177420847e+00 1.623263834188579668e+00 1.116604102761460826e+00 4.901383638310860547e-01 7.669301424975530912e-01 5.264136820295515218e-01 4.746908916794093797e-02 1.873907837066036280e-02
2.143601659757646619e-02 2.858237074614821890e-02 1.968991236637393158e-02 2.503242541254604991e-02 6.019870569378673458e-02 3.446214862325401584e-02 1.767731784447545973e-01 2.265345235754448461e-01 2.085431905504466499e-01 4.866889112227371778e-02 1.199395833669721599e-02 2.469477408305352940e-03 4.160429023029167325e-03 1.164276075433128693e-02 4.362987928600148974e-02 2.774578662546814747e-02 5.090444925582598285e-02 1.520889730498499459e-02 2.872977087913402769e-02 1.357807765515014475e-01 7.227433445858968408e-01 1.359426722466814619e+00 1.454461953178841638e+00 1.349865139557987259e+00 1.006528633571576181e+00 7.186882734394743899e-01 6.847965473039343554e-01 4.614037138374824099e-01 4.154272519663013141e-02 1.478831362446047376e-02
5.929061115780974445e-02 5.684997146672159107e-02 2.962391306352666481e-02 2.153924111432420005e-02 2.826723961726973489e-02 1.510322808374573236e-02 8.543849996482993925e-02 7.553275750017043877e-02 2.064280223632277214e-02 1.125491192537781716e-02 3.889130301698618970e-03 3.090843529002037723e-03 1.922208971838437752e-01 9.580997165232742196e-02 2.282526217223182149e-03 7.273223331940497326e-03 2.601896749209000118e-02 5.971852135611813162e-02 5.776762954994081600e-02 2.575968122005410921e-01 6.964835685181305358e-01 1.004456202220634697e+00 4.077317221855800700e-01 6.105234613902632557e-01 7.857856395756428469e-01 4.436859292750297556e-01 3.306980460396525823e-01 2.716145254060577940e-01 9.955980789563893124e-03 8.999761526963729816e-03
5.052169285445318181e-02 6.035620230431416183e-02 8.713586746100459787e-03 5.878703321827140338e-03 4.690077295355360790e-03 6.957374050162832765e-03 9.962948468800920943e-03 2.486961116382412594e-03 3.226415940003527546e-03 6.297832201510845940e-02 8.248083474642284307e-02 1.254314051119261031e-01 1.320451356401244336e-01 4.064129726977089296e-03 1.078427765668027796e-02 1.324233501714849326e-01 2.520041328932914326e-01 3.652243226758038475e-01 2.497874778137968710e-01 1.880967602098740366e-01 1.323273962769907219e-01 4.715000725333519382e-02 1.816015390525789475e-02 3.935424877690258533e-02 1.437771606503496502e-01 4.907858037646569555e-02 4.565424323526304229e-02 1.542049595891151550e-02 1.057699253456429456e-01 8.648352445243248643e-02
1.172954445183007066e-01 9.197280297175544628e-02 9.392384187251669181e-03 3.747581826090484909e-03 5.019424943087217456e-03 3.910504098785986746e-03 6.228125687353512803e-03 8.310287668357826951e-02 7.276624745398468930e-02 3.138705484249299654e-02 7.418212771747165202e-02 1.398863245404672606e-01 1.798089239950563245e-01 8.621066341843413097e-03 1.377717536452215293e-02 8.353360219887194515e-02 3.027428473968165612e-01 5.639248849335809499e-01 6.388369066374770533e-01 5.561846476607905654e-01 1.185489473283707490e-01 2.645615068984890489e-02 3.267917636087135785e-02 8.004992308693029135e-02 1.791258672911305860e-01 5.311876002199040353e-02 2.052375949860810872e-02 7.735226114641824240e-03 1.467263683892956472e-01 1.316415639770618096e-01
1.554909974695414532e-01 1.985043356659878938e-02 5.139243640456193224e-03 1.561927276504710971e-01 1.605750252027241531e-01 3.167734835626202956e-03 4.320388969205340643e-03 6.160798533261107462e-02 3.603514603749211065e-02 4.130412214974164831e-02 7.260233379489730576e-02 1.230871224698012328e-01 1.365996953926509327e-01 6.907722144334448727e-03 2.722056545484172890e-02 1.318290279067290405e-01 2.531042676144186210e-01 5.800122990918380461e-01 7.262724245710800997e-01 6.159972558516187968e-01 3.095699053917538857e-01 1.791977309289133000e-02 1.273637925698663589e-02 2.751544451899677612e-02 1.586873910013815170e-01 9.524238186412235796e-02 8.615481237033285888e-02 1.623193054178059813e-02 1.423676137826740684e-01 1.092945727403232120e-01
8.673408786948486049e-02 2.666376662759614019e-02 1.005742489525658992e-02 7.861896575297825165e-03 1.426546330760747848e-02 9.846305008580722579e-03 4.398279412691144877e-03 2.354151387054787270e-01 3.091897760568016254e-03 4.042752553766238745e-03 4.515089643032168393e-02 5.028409535765338001e-02 7.798240539652258330e-02 1.760566910394703033e-01 1.046483753760864624e-02 4.450947299211808345e-02 4.474422959145248069e-02 1.907216622952852825e-01 2.435619445466310484e-01 2.100828096566555725e-01 1.785606400740697985e-01 2.326051953507412076e-02 2.488098316043227121e-01 7.018568507703772455e-03 3.102627204323633175e-02 7.746545060960666196e-02 2.084050238617073947e-01 1.173667363497674226e-01 1.836933207402202672e-01 1.385962305492887126e-01
3.091774554867449815e-02 1.219137486734303381e-02 1.272997138084260536e-02 1.785223921614470521e-02 7.909729635319264970e-03 3.586642412363152000e-03 2.091500391130842462e-01 1.647976743711612735e-01 4.591846407585899181e-03 1.780473362799214754e-02 1.452319619028830666e-01 4.940554421057596901e-02 8.346579181174131057e-02 1.840242775444930479e-01 8.646465475690246621e-03 1.633221362189355569e-02 1.131140184210784744e-02 5.632279109136661965e-03 8.905856377765853510e-03 1.637250957671327473e-02 2.965988943306548109e-02 6.883920415123883155e-03 2.571070920585194486e-01 1.850948900292272853e-02 4.524647142450517745e-02 1.609407962637012662e-02 5.564127003401216770e-02 6.241845941891872862e-02 2.218186310618852977e-02 2.196467398186149611e-01
3.133705404692234409e-02 2.502320717084080895e-02 1.189864487326931786e-02 7.254572972226530116e-03 5.481729540038621749e-03 2.086607372004983980e-03 1.748687966171492136e-01 2.009158255009826088e-01 2.412346136026292664e-01 7.795416650284042216e-03 2.195243503897804493e-03 2.077866924729948259e-03 2.326626999413579644e-01 2.719474187831185004e-03 8.385832480190969634e-03 6.224109732281104916e-03 4.404046182524846802e-03 2.445962790589501779e-01 2.159055402314996597e-01 1.655363967385261592e-01 1.312679261436053568e-01 1.911075233336588519e-01 3.030573902808643694e-01 1.040592620181192592e-02 1.876237605003742981e-02 9.218588667712513535e-03 1.499787088350297906e-02 9.999987790521228451e-03 1.009942101833448055e-02 4.241936379326917139e-01
4.244251138024412312e-02 2.204210200363373659e-02 1.221519434059109913e-02 1.388300534294715713e-02 9.908456066673308749e-03 5.466529690899028446e-03 2.020294196341528015e-02 1.667907085822988023e-02 2.625441486726417910e-03 2.318892369779496088e-01 8.136995646328486209e-02 1.839508286009137183e-01 4.797558444584985524e-03 5.701036737869587950e-03 1.890644418931185927e-02 1.515103209827366876e-02 5.029865760170827010e-03 6.238971945966641230e-03 2.580578717937627720e-01 1.123722852443526932e-01 1.018916072818665530e-01 1.552685587833941283e-01 2.410527210460056136e-01 1.007336790588284417e-02 1.097882918856823639e-02 1.952373606210156265e-01 2.197170589826406006e-01 2.788710091771161026e-01 1.378418495439123412e-02 1.855398817757127339e-01
5.726856039806281495e-02 4.935519225265734555e-02 1.440468981649480930e-02 4.101194214645434433e-02 3.885116542162443676e-02 7.434445180915558171e-02 5.392015426208595502e-02 6.666012043337204290e-03 2.562495256608372709e-03 1.806796864334136166e-01 5.265738793347555374e-02 6.493017763645883567e-02 8.160920290873481531e-02 3.122089469858356850e-03 4.239963186105227821e-03 1.978202494588053861e-01 1.953996289139592890e-01 2.359941240124546202e-01 3.222226756663016944e-01 1.760214653136229213e-01 9.549018760922327320e-02 1.293165167175592545e-01 1.448955326140418665e-01 2.541250963137203778e-01 1.109422123227779555e-02 1.352016630149235066e-01 1.996066997372027418e-01 3.259571508924711258e-01 3.826905660448366442e-01 1.237174178577258969e-02
3.136182940363579225e-02 7.824229785299167961e-02 2.116020037160087561e-02 1.910982670115676796e-02 7.844703527358323769e-02 8.246750435186585293e-02 5.651180813819006721e-02 4.014140294790494341e-03 2.932796333647703750e-03 2.880064824158829178e-03 1.438987677253829034e-01 7.240914408713067241e-02 4.826251244161058884e-02 8.940442561940027677e-02 4.620887509752287861e-03 1.396074784148463033e-01 5.695981029705528970e-03 3.637583095942618916e-02 6.758445634958167025e-02 9.453044269702183186e-03 1.435713105566221726e-01 1.811669660824678785e-01 1.536696465923225730e-01 1.760133604718152611e-01 2.437817996826645850e-01 1.932134459311071750e-01 2.322985626932402847e-01 2.874326640113972209e-01 3.758907367146338552e-01 1.575203807614015267e-02
