9.182907065015468106e+03 9.193284711934065854e+03 9.189136861647260957e+03 9.195965218670766262e+03 9.187637495994760684e+03 9.217958857207995607e+03 9.217818280190682344e+03 9.313738808865449755e+03 9.441365725662020850e+03 9.289069880129754893e+03 9.221863783238981341e+03 9.167931272523981534e+03 9.165566567782008860e+03 9.195688189105492711e+03 9.204206342789959308e+03 9.166592013693241825e+03 9.200805209810441738e+03 9.237133846158192682e+03 9.238034641146557988e+03 9.191552771321290493e+03 9.184514136622428850e+03 9.162589957926513307e+03 9.162386536543475813e+03 9.162645499395570369e+03 9.178971287688909797e+03 9.162810878582267833e+03 9.162394075579824857e+03 9.162377999929731232e+03 9.162377951528776975e+03 9.162377951245827717e+03
9.169400920838159436e+03 9.196975836664760209e+03 9.224665144358325051e+03 9.212683453599098357e+03 9.197231179428430551e+03 9.319084542281614631e+03 9.238100566595627242e+03 9.258507909638727142e+03 9.226929483698113472e+03 9.218669287034321314e+03 9.203665795541273837e+03 9.166580837738698392e+03 9.168022064305618187e+03 9.190660103665517454e+03 9.204420787439792548e+03 9.191296789378922767e+03 9.201788162338307302e+03 9.306907022999073888e+03 9.285527262979539955e+03 9.203639062916347029e+03 9.166866703043786401e+03 9.162635274679636495e+03 9.162410517737907867e+03 9.162548733295987404e+03 9.162539262101661734e+03 9.162607496458545938e+03 9.162384710333401017e+03 9.162378007544859429e+03 9.162377951716358439e+03 9.162377951247237434e+03
9.341131287986587267e+03 9.348745698016962706e+03 9.558213436152811482e+03 9.481453443762233292e+03 9.844878621150141043e+03 9.232477129943994441e+03 9.168725111663568896e+03 9.169653622181986066e+03 9.409823623532118290e+03 9.240316929661821632e+03 9.382231392968522414e+03 9.317066982354726861e+03 9.222529101198028002e+03 9.254451237629649768e+03 9.180819046897395310e+03 9.244658862840626171e+03 9.223409846312322770e+03 9.303815178416074559e+03 9.699751538882710520e+03 9.263145293991925428e+03 9.165781638466289223e+03 9.162780031840369702e+03 9.162509983399035264e+03 9.162389751434033315e+03 9.162383376414527447e+03 9.162379002489306004e+03 9.162378566284651242e+03 9.162377961601639981e+03 9.162377951433847556e+03 9.162377951255042717e+03
9.248128350485110786e+03 9.413905660695951156e+03 9.715084763568236667e+03 9.604819516360850685e+03 9.345479846328451458e+03 9.190734015299485691e+03 9.184860093691258953e+03 9.177611600922984508e+03 9.167106219681485527e+03 9.254289230581387528e+03 9.223105763249517622e+03 9.288062372590376981e+03 9.222148315300610193e+03 9.204302968934065575e+03 9.168410670264964210e+03 9.166687372752998272e+03 9.186755019120559155e+03 9.212850832482779879e+03 9.202384571942488037e+03 9.200189085396994415e+03 9.180415558731072451e+03 9.164463172446565295e+03 9.162829657071448310e+03 9.163126105351220758e+03 9.162395851431740084e+03 9.162378124041173578e+03 9.162377955649997602e+03 9.162377952257274956e+03 9.162377952701441245e+03 9.162377952624487079e+03
9.213940712517478460e+03 9.327508662350917803e+03 9.621962341132963047e+03 9.340260833965881829e+03 9.264666536460212228e+03 9.169078537202425650e+03 9.184432384631470995e+03 9.166931795974523993e+03 9.165078092787451169e+03 9.364113966247747157e+03 9.415362339355882796e+03 9.381033261125787249e+03 9.195737136954881862e+03 9.191432861109853548e+03 9.167859298732446405e+03 9.164402984962627670e+03 9.230293328733991075e+03 9.204629939801279761e+03 9.236222380330380474e+03 9.208064170453113547e+03 9.195793553994064496e+03 9.166610633642831090e+03 9.185461255943590004e+03 9.164188756519231902e+03 9.162419712987582898e+03 9.162378424046095461e+03 9.162377959232346257e+03 9.162377966196721900e+03 9.162378000401240570e+03 9.162378109473060249e+03
9.215918071801250335e+03 9.221108012932225392e+03 9.425917095837829038e+03 9.373299007923502359e+03 9.245877455217552779e+03 9.166445519922912354e+03 9.166846527823807264e+03 9.167027536509367565e+03 9.167174989178072792e+03 9.462457578783492863e+03 9.392585082537520066e+03 9.281869850509785465e+03 9.168403691634113784e+03 9.163857262183822968e+03 9.163487820559210377e+03 9.164457306522308500e+03 9.197881773792170861e+03 9.166314827805203095e+03 9.195976750452557098e+03 9.285335546048227116e+03 9.322898682431501584e+03 9.265011467930033177e+03 9.189890962591565767e+03 9.163338333379193500e+03 9.162442175230951761e+03 9.162379477082393350e+03 9.162378301841770735e+03 9.162378669266327051e+03 9.162380006025210605e+03 9.162381209828923602e+03
9.165454453462580204e+03 9.168335899561217957e+03 9.169055478709278759e+03 9.230772394912686650e+03 9.195219199672123068e+03 9.215617601837391703e+03 9.240302889306916768e+03 9.205687831030429152e+03 9.212879948605697791e+03 9.218859415791455831e+03 9.204331034539256507e+03 9.179013502220175724e+03 9.164822900376228063e+03 9.163080424048179339e+03 9.162718997088271863e+03 9.163314498680236284e+03 9.181349289164169022e+03 9.166210825254536758e+03 9.211904882426559197e+03 9.233139487508926322e+03 9.197344806279164914e+03 9.165719379719028439e+03 9.163539066326040484e+03 9.162931808682469637e+03 9.162402988777515930e+03 9.162381240767284908e+03 9.162389710758363435e+03 9.162395384611398185e+03 9.162414763528333424e+03 9.162449826923138971e+03
9.177852068529900862e+03 9.191843243416136829e+03 9.179828492037844626e+03 9.200508295437748529e+03 9.221610474052620702e+03 9.228659338799761827e+03 9.220434864246752113e+03 9.216745352986086800e+03 9.205959095790020001e+03 9.185905531097190760e+03 9.166173502970625123e+03 9.189847943600323561e+03 9.164436381761153825e+03 9.162991469901737219e+03 9.162926271839436595e+03 9.163623734864988364e+03 9.198396874821937672e+03 9.222782026321086960e+03 9.217891583984004683e+03 9.203850301402306286e+03 9.166439886478307017e+03 9.163695218492050117e+03 9.162614509399727467e+03 9.162450062196217914e+03 9.162390150963823544e+03 9.162401320109169319e+03 9.162491903090811320e+03 9.162721261068372769e+03 9.162740235725470484e+03 9.163342937073561188e+03
9.201934164172642340e+03 9.188911755410716069e+03 9.178163015856853235e+03 9.255652071954671555e+03 9.224243029666420625e+03 9.188788134566892040e+03 9.247839203922107117e+03 9.201007932699747471e+03 9.195369753728571595e+03 9.193873058550354472e+03 9.189928880698891589e+03 9.197928413658981299e+03 9.239821996168031546e+03 9.213573565162660088e+03 9.164998531392864606e+03 9.165309235575385173e+03 9.195118080253721928e+03 9.266906786473417014e+03 9.271042952480009262e+03 9.181501088586137485e+03 9.163452476910137193e+03 9.162760428666730149e+03 9.162545924285623187e+03 9.162415135526474842e+03 9.162392408742734915e+03 9.162535990805421534e+03 9.163620805950322392e+03 9.165691374650970829e+03 9.195423990005654559e+03 9.178252264224503961e+03
9.226703541325152401e+03 9.204461648062366294e+03 9.230672050531189598e+03 9.227755573506930887e+03 9.221634957995707737e+03 9.168266568799608649e+03 9.218107311227342507e+03 9.186666085642973485e+03 9.166776825681497940e+03 9.164009692539668322e+03 9.218748603077838197e+03 9.216410876052230378e+03 9.274895971419797206e+03 9.282367594208519222e+03 9.219047641258972362e+03 9.223720716602314496e+03 9.503022354728727805e+03 9.533660029180249694e+03 9.320692861970850572e+03 9.237503107056299996e+03 9.163550403425613695e+03 9.162586855604489756e+03 9.162481498920911690e+03 9.162454134812445773e+03 9.162421328510223248e+03 9.162538544033710423e+03 9.178205033413263664e+03 9.189014473969835308e+03 9.194531985924948458e+03 9.164210063299100511e+03
9.215952851867508798e+03 9.190329961074461607e+03 9.226178631029762983e+03 9.217992053896763537e+03 9.234932189011586161e+03 9.165462108497757072e+03 9.164611844834997100e+03 9.164349737250839098e+03 9.163561444169425158e+03 9.193089710988348088e+03 9.641551726440075072e+03 9.948694786535408639e+03 1.074561593744770835e+04 9.915901706552644100e+03 9.296926900249474784e+03 9.415383344592308276e+03 9.641460023138071847e+03 9.300310341318585415e+03 9.196900736092957231e+03 9.165203380933417066e+03 9.163076045720014008e+03 9.162556591321224914e+03 9.162510808252987772e+03 9.162552642389238827e+03 9.162593627556185311e+03 9.162569230889468599e+03 9.162877628987833305e+03 9.162832901242602020e+03 9.162699607914766602e+03 9.162552909711468601e+03
9.166151170705734330e+03 9.164894276774984974e+03 9.215017288379329329e+03 9.215236152058701919e+03 9.204486389682459048e+03 9.166436808830316295e+03 9.163510653952589564e+03 9.163056410201499602e+03 9.163464187700668845e+03 9.226576155956980074e+03 9.316289852437876107e+03 1.014317108816806831e+04 1.085982146853897211e+04 1.000200670809108669e+04 9.453371291307101274e+03 9.474069405149833983e+03 9.505319079007762411e+03 9.367627466355565048e+03 9.213717638172460283e+03 9.167061089522010661e+03 9.162814475936669623e+03 9.162569614472458852e+03 9.162562583320519479e+03 9.162727811706125067e+03 9.162768170420371462e+03 9.162711118547449587e+03 9.162673935095855995e+03 9.162605474323127055e+03 9.162550999012195462e+03 9.162515446825043909e+03
9.162850323898232091e+03 9.163978241578010056e+03 9.167158777250029743e+03 9.197742195515713320e+03 9.186102496129293286e+03 9.165421754122111452e+03 9.163807912539839890e+03 9.163575470161713383e+03 9.164037687675543566e+03 9.196794058514580684e+03 9.167326152126728630e+03 9.495225642234860061e+03 1.049478190194643139e+04 9.696422004990023197e+03 9.320310371209443474e+03 9.333834758049610173e+03 9.224024282631577080e+03 9.251352636858775440e+03 9.262006980320085859e+03 9.199753475407447695e+03 9.163208015100231933e+03 9.162788280360058707e+03 9.162823056858758719e+03 9.163296800652813545e+03 9.163780705130920978e+03 9.164062240248727903e+03 9.163700174520899964e+03 9.163439323807220717e+03 9.162794987080358624e+03 9.162551652019232279e+03
9.162691251512274903e+03 9.163475041350287938e+03 9.165367335972969158e+03 9.164807882783927198e+03 9.163908452158610089e+03 9.177460226012413841e+03 9.219494409263086709e+03 9.216047819273386267e+03 9.165409654215822229e+03 9.163160158052389306e+03 9.165932734349820748e+03 9.220250324677386743e+03 9.804127124692364305e+03 9.960002634092352309e+03 9.951650116902659647e+03 1.015198538009142067e+04 1.000608093341018866e+04 9.684713480433516452e+03 1.053232413932437703e+04 9.787852698476503065e+03 9.214031025331794808e+03 9.166248739076050697e+03 9.165503447997460171e+03 9.190702786766349163e+03 9.227886411772466090e+03 9.223837506063311594e+03 9.333351080569185797e+03 9.219238945574576064e+03 9.163390602240149747e+03 9.162764661651955976e+03
9.162620887112621858e+03 9.162684775685633213e+03 9.163679919230105952e+03 9.192011992641708275e+03 9.166669805533278122e+03 9.163359838632180981e+03 9.201776538356343735e+03 9.284145584145173416e+03 9.250513642089925270e+03 9.165755429595081296e+03 9.181599943513832841e+03 9.468197059455851559e+03 9.780767306629755694e+03 9.876485100341244106e+03 9.755461962372701237e+03 9.824753728715226316e+03 1.021047158217954166e+04 1.085149952921316617e+04 1.078496223120080867e+04 1.040043909113560039e+04 9.215085582401246938e+03 9.217280000575960003e+03 9.211184469742833244e+03 9.313255890784274015e+03 9.374243242602162354e+03 1.023595073536535892e+04 1.024736294532822467e+04 9.387488034733953100e+03 9.163807465443960609e+03 9.162673194281203905e+03
9.162543971434019113e+03 9.162619824832107042e+03 9.163390759356700073e+03 9.163672067558967683e+03 9.163320004238237743e+03 9.163388438334395687e+03 9.184055689682631055e+03 9.225839856939677702e+03 9.299430597679864150e+03 9.213695079214803627e+03 9.217935848116097986e+03 9.212708807250643076e+03 9.542731696383481903e+03 9.864802257459408793e+03 9.765638986015530463e+03 1.001540283089059267e+04 1.049501525057500112e+04 1.064002035502728540e+04 9.954609531025260367e+03 9.327394340609400388e+03 9.260454552746359695e+03 9.832903118384614572e+03 1.013042461468997135e+04 1.074006163208697762e+04 1.060007118538740360e+04 1.102095328179872376e+04 1.067188933094270033e+04 9.607913313883191222e+03 9.164834409634278927e+03 9.162778085541922337e+03
9.162528711675457089e+03 9.162626000365262371e+03 9.162730741204177320e+03 9.162851862279943816e+03 9.163313285264368460e+03 9.164916534551277437e+03 9.527628953422539780e+03 1.040442653425692515e+04 9.785902278762434435e+03 9.275649782554701233e+03 9.254072214177522255e+03 9.316895883025283183e+03 9.463765540549658908e+03 9.565260592983171591e+03 9.648873968282916394e+03 9.965942411139541946e+03 1.068484680977070639e+04 1.053578713255139883e+04 9.756854830569052865e+03 9.353902624204045424e+03 9.966847930599344181e+03 1.058588470532881911e+04 1.095558319723424393e+04 1.093904694117380677e+04 1.068913524914123809e+04 1.048188048904623247e+04 1.115363000229267163e+04 9.516806942885739772e+03 9.166895378895409522e+03 9.163422157224913462e+03
9.162686379510412735e+03 9.162722164089520447e+03 9.162747360958730496e+03 9.163335081904662729e+03 9.202435375661718354e+03 9.358731694383592185e+03 1.023904279667489936e+04 1.004358663317821447e+04 1.005661038459678457e+04 9.634054482153762365e+03 9.351142425958902095e+03 9.219298773213431559e+03 9.217770129973714575e+03 9.290844091840865076e+03 9.425957289606492850e+03 1.028038546127025802e+04 1.017050279456824319e+04 1.019252668877009091e+04 9.322661278744861193e+03 9.422392336227963824e+03 1.004682391546948929e+04 1.100843758029216770e+04 1.138160687691715430e+04 1.137311485226978948e+04 1.095306638176363049e+04 1.090623321086269971e+04 1.083297965866444974e+04 1.048820630167666059e+04 9.221037414384001750e+03 9.201016040818138208e+03
9.162732210564574416e+03 9.163594754922114589e+03 9.165705017047177535e+03 9.241204495350984871e+03 9.348735556880448712e+03 9.421801761943113888e+03 9.966941213996104125e+03 1.017316929927894307e+04 9.876707175636103784e+03 9.738785839323823893e+03 9.291405689365759827e+03 9.168323647281291414e+03 9.182380577238383921e+03 9.213268266655753905e+03 9.263140520350534644e+03 9.707411019512084749e+03 9.343743330377641541e+03 9.213657541806807785e+03 9.177703436485775455e+03 9.263953022823206993e+03 9.527036380626930622e+03 1.100553682330084666e+04 1.139601548119691142e+04 1.138323849977026839e+04 1.072724931181399188e+04 9.877335518802861770e+03 1.032609398198515191e+04 9.962161686727768029e+03 9.234585708755932501e+03 9.190897723021826096e+03
9.211594132221940527e+03 9.229671965297466159e+03 9.211437681438839718e+03 9.229312976473564049e+03 9.335269475738117762e+03 9.262116200365302575e+03 9.673360707206671577e+03 9.831487573860895282e+03 9.796569986986007279e+03 9.313967647389630656e+03 9.201704605312690546e+03 9.165659961870944244e+03 9.167223442635013271e+03 9.199665551034730015e+03 9.298158027360945198e+03 9.246369807199207571e+03 9.297826966681981503e+03 9.197951767352180468e+03 9.221721365573332150e+03 9.416629812976287212e+03 1.043126199652081232e+04 1.141468432665105138e+04 1.144771869583585976e+04 1.119348970566885509e+04 1.063599840239885634e+04 1.020039202357464637e+04 1.015107760492384659e+04 9.828177988291430665e+03 9.221259208330153342e+03 9.183241138789022443e+03
9.308519070903630563e+03 9.308345463868794468e+03 9.246405110687286651e+03 9.231649979508212709e+03 9.265195385589842772e+03 9.218997511955529262e+03 9.487316573088579389e+03 9.461423595377682432e+03 9.247605821259927325e+03 9.207882923625289550e+03 9.178130752292856414e+03 9.166320953239919618e+03 9.164366655779156645e+03 9.163624262470246322e+03 9.166007638942704943e+03 9.187978091391387352e+03 9.243564137781202589e+03 9.327827368626733005e+03 9.305389470202533630e+03 9.740995998450573097e+03 1.060777052541468947e+04 1.109994731453962413e+04 9.898705783736515514e+03 1.017173259540442996e+04 1.036164395161199718e+04 9.798873008984175613e+03 9.621041060756409934e+03 9.538255382478591855e+03 9.166943596703036746e+03 9.164623982735318350e+03
9.286115512850195955e+03 9.317739218705928579e+03 9.188228078869613455e+03 9.183421798377676168e+03 9.182640178346839093e+03 9.194063505946200166e+03 9.208815736344547986e+03 9.168367988870662884e+03 9.178898318070114328e+03 9.163485694170629358e+03 9.163579472499170151e+03 9.163638717190575335e+03 9.163719317044668060e+03 9.167460965265150662e+03 9.202302889174581651e+03 9.650138548830898799e+03 9.995129145396003878e+03 1.024700241650999851e+04 9.833282106205522723e+03 9.622211143153355806e+03 9.457304614721108010e+03 9.258861269401089885e+03 9.196735477232607082e+03 9.229162539791466770e+03 9.382054310818173690e+03 9.230988858502727453e+03 9.222111030801523157e+03 9.182166979666788393e+03 9.162885728972023571e+03 9.162563937435817934e+03
9.437085101264829063e+03 9.388799566422989301e+03 9.189519897866963220e+03 9.166557639900711365e+03 9.186042232683770635e+03 9.182507353535065704e+03 9.195236375944203246e+03 9.163934927510266789e+03 9.163450245762776831e+03 9.162688878046752507e+03 9.162602326856267609e+03 9.163225915451334004e+03 9.164258861988055287e+03 9.192618871490483798e+03 9.209079839070982416e+03 9.436968500223929368e+03 1.006425380448889155e+04 1.068891662122285197e+04 1.074144617397912043e+04 1.041168725891691611e+04 9.402013030568057729e+03 9.210834880456462997e+03 9.216971626087266486e+03 9.284918110179278301e+03 9.415454911565368093e+03 9.232156430862345587e+03 9.187739566198251850e+03 9.165446489722664410e+03 9.162843371481169015e+03 9.162600956115706140e+03
9.529889415091116462e+03 9.211724116055742343e+03 9.167760253540624035e+03 9.163665555609355579e+03 9.163753747793465664e+03 9.166340093235789027e+03 9.182053280305201042e+03 9.162778909492606545e+03 9.162409350690022620e+03 9.162392889787399326e+03 9.162429023599577704e+03 9.162992430115498792e+03 9.163789752107883032e+03 9.185748638947745349e+03 9.247815612838508969e+03 9.548004651670293242e+03 9.838894312460062793e+03 1.058485767072753333e+04 1.080671247402774679e+04 1.043069152470682093e+04 9.728611851206795109e+03 9.191663073034940680e+03 9.181148068745216733e+03 9.200622324761736309e+03 9.373144536807620170e+03 9.283314323120501285e+03 9.266895351043473056e+03 9.181261755884299419e+03 9.163133801224639683e+03 9.162596874050135739e+03
9.385786058695666725e+03 9.234041159433958455e+03 9.191109336715639074e+03 9.189384500294550890e+03 9.224232522268457615e+03 9.205393201244538432e+03 9.180247669872520419e+03 9.162757750148442938e+03 9.162984388649465473e+03 9.163104557019874846e+03 9.162441299980415351e+03 9.162574494734752079e+03 9.163093991287198151e+03 9.164292048771250847e+03 9.193127708354017159e+03 9.280264281664189184e+03 9.271177991390979514e+03 9.591895468521461225e+03 9.673942199359393271e+03 9.563842724505022488e+03 9.460655503734182275e+03 9.196579124770616545e+03 9.163852017627905298e+03 9.166185124357329187e+03 9.202465850011029033e+03 9.261248496571372016e+03 9.422988886651537541e+03 9.302936073407270669e+03 9.163566158085746792e+03 9.162874670507968403e+03
9.242919652627193500e+03 9.195405465794132397e+03 9.198369373199957408e+03 9.223538211441931708e+03 9.197100848409634636e+03 9.178070289212009811e+03 9.162816393972414517e+03 9.162534374055563603e+03 9.178941998451458858e+03 9.225064462191263374e+03 9.162748386333607414e+03 9.162653609594075533e+03 9.163091276733022823e+03 9.164298602217404550e+03 9.187429864387304406e+03 9.204453655022232851e+03 9.188870247146734982e+03 9.166819217811758790e+03 9.180366370510222623e+03 9.192873831534285273e+03 9.211308960946760635e+03 9.165167349768196800e+03 9.163675406504862622e+03 9.185992699103857376e+03 9.220560277107773800e+03 9.183259134669940977e+03 9.231584865842953150e+03 9.234076860462966579e+03 9.184694337368056949e+03 9.163104856933625342e+03
9.241467324122590071e+03 9.228003637082636487e+03 9.194962540648844879e+03 9.186847365973917476e+03 9.186154165300124077e+03 9.163134246686182451e+03 9.162701001769397408e+03 9.162683535217902318e+03 9.162947119672924600e+03 9.189838006311671052e+03 9.163231170876208125e+03 9.164930977495405386e+03 9.165000510690641022e+03 9.166121424155408022e+03 9.186849132584755353e+03 9.178286662149263066e+03 9.165737619788049415e+03 9.163941351171068163e+03 9.163633559072917706e+03 9.163276763507108626e+03 9.162956671374176949e+03 9.163116236026797196e+03 9.163794785492285882e+03 9.167152482458701343e+03 9.185665854585648049e+03 9.166903561867344251e+03 9.179181212471248728e+03 9.165165255508980408e+03 9.164468755467245501e+03 9.163351765272591365e+03
9.266640772212896991e+03 9.218622020827078813e+03 9.195196892488800586e+03 9.208159867993032094e+03 9.204784739044134767e+03 9.185885313215485439e+03 9.243925491334221078e+03 9.225049315734875563e+03 9.162810166736537212e+03 9.162539925270408276e+03 9.162611313904963026e+03 9.164327483175087764e+03 9.180790522757348299e+03 9.181100947789014754e+03 9.216774697219945665e+03 9.200525259661006203e+03 9.166239109069661936e+03 9.166411125063799773e+03 9.164142818720387368e+03 9.163049943548188821e+03 9.162817257021590194e+03 9.162938633292937084e+03 9.163376850370445027e+03 9.166118061069328178e+03 9.174840480464905340e+03 9.163208360928096226e+03 9.162988503883090743e+03 9.162946399771704819e+03 9.163748224751205271e+03 9.162633923617999244e+03
9.300513190608262448e+03 9.286080762020630573e+03 9.201115220068459166e+03 9.297898754798012305e+03 9.329890981912378265e+03 9.488202101109432988e+03 9.385383523024163878e+03 9.188020345237848233e+03 9.162659271222075404e+03 9.162390457193798284e+03 9.162454357535722011e+03 9.163023787111971615e+03 9.163256486047070211e+03 9.165921556083820178e+03 9.166662368738785517e+03 9.164246195472711406e+03 9.164558658083567934e+03 9.165234018693849066e+03 9.166196847262908705e+03 9.164192711876012254e+03 9.162933198887199978e+03 9.162878342590283864e+03 9.162945841752391061e+03 9.163430114139911893e+03 9.165421324281054694e+03 9.162743550887027595e+03 9.162688213120500222e+03 9.162804877771335669e+03 9.162805913567784955e+03 9.163203369890708927e+03
9.237560339884346831e+03 9.356683349637100036e+03 9.222630549650248213e+03 9.228236704306193133e+03 9.500462967285544437e+03 9.530504895382760878e+03 9.412350594662999356e+03 9.179793112895347804e+03 9.162541300962364403e+03 9.162390441044528416e+03 9.162448793243134787e+03 9.162583492460998968e+03 9.162734903469663550e+03 9.163016403569938120e+03 9.165341813424696738e+03 9.163396400168137916e+03 9.167759888089718515e+03 9.231928748334281408e+03 9.281544336335695334e+03 9.177796895658520953e+03 9.163122960516024250e+03 9.162954474984579065e+03 9.162816665294683844e+03 9.162876440445912522e+03 9.162984286142984274e+03 9.162740474222800913e+03 9.162656857098731052e+03 9.162673063965554320e+03 9.162732519052255157e+03 9.163219282617137651e+03
