3.737098333473117262e-01 5.399849915343259976e-01 4.565959451733058727e-01 5.651188829826868654e-01 3.961016934010785917e-01 8.244382505906552305e-01 7.501656897000075208e-01 3.006880509636819868e-02 4.232135664287593052e-02 5.709931307860113131e-02 9.189641899225740040e-01 2.402342602501986724e-01 1.579051984885989635e-01 6.249838106391476522e-01 7.736308969360452537e-01 1.831633132690322352e-01 6.886451102662221047e-01 1.569806019792593585e-02 7.685181463706542912e-03 5.058331209995622357e-01 4.727497950622694955e-01 7.046874213371190354e-02 5.368885549822205450e-02 2.135079116629176044e-01 4.113738567283927172e-01 3.201130040660435938e-01 1.458389191261202367e-01 1.275184864015517679e-02 1.209308266391332688e-02 1.509928359325942229e-02
2.423609215705507525e-01 5.138494893236420502e-01 9.041028495465703863e-01 6.803548049638745709e-01 4.683498185050614659e-01 8.089172362023869245e-02 3.217729077619699285e-02 2.432363471542688810e-02 1.133471974426628233e-02 6.892466888495338839e-01 5.622796646619201422e-01 1.241824306539137251e-01 1.870125453461444487e-01 4.828112133935504868e-01 7.044785614412328867e-01 5.038073496114648941e-01 6.390144026637301078e-01 3.791285748513253950e-02 1.122890622724884158e-02 6.022812547115473647e-01 2.702657574102582672e-01 6.762106094109418541e-02 1.395211677126652339e-01 1.241635474711965115e-01 1.092535966688266691e-01 1.455152942377909986e-01 5.074330158341891495e-02 1.283819900101042071e-02 1.819091060210966185e-02 1.809546472423991317e-02
4.411274559088806252e-02 5.787199106413708216e-02 1.181486826129483220e-01 8.551086566453118543e-02 1.503585207768165233e-01 2.724615541664532348e-02 1.930785644114163535e-01 2.023085689640122253e-01 6.140495694123532244e-02 1.652187921149359667e-02 4.691668557720285460e-02 6.240476524855705781e-02 8.491779692341631103e-01 8.884853043458368349e-02 2.882770381479997091e-01 5.913446961167401206e-02 9.779680341012939593e-01 3.613109861805108292e-02 6.439008112167345088e-02 1.389756053076178326e-02 1.697970948245540734e-01 5.590928448087438551e-02 8.464217873197694975e-02 2.926130408481045914e-02 1.724788760589899758e-02 1.128855059063747432e-02 1.002268510894530583e-02 7.857777977818560314e-03 1.338149567872433041e-02 1.496156676611840215e-02
1.887407161365644084e-02 5.028932404211892276e-02 6.345578150771515047e-02 5.115265443102686577e-02 3.389970835512312597e-02 3.926944125474947644e-01 3.910567498503714212e-01 2.426910043926002736e-01 1.310206276991904006e-01 1.184696077458444012e-02 6.355986063856816637e-03 4.483686084191079030e-02 8.324633013637916523e-01 6.738333107782231712e-01 2.105708644628718762e-01 1.786417520918014146e-01 3.917155124389224419e-01 7.685627016412966972e-01 6.007171593925916264e-01 5.558173305276018494e-01 3.060196851475458502e-01 1.181572975728816255e-01 3.947913867290615830e-02 7.749224688558860319e-02 1.408512684406092175e-02 9.988941126735517359e-03 8.534862086209446530e-03 8.094506993393573574e-03 1.644053727876075913e-02 1.783335920262041699e-02
7.584799300182190063e-01 7.468373949969830949e-02 7.755902504404493802e-02 1.922418376353805455e-02 2.145967658206448733e-02 2.296904061765950578e-01 4.020985951980990403e-01 2.264035471199621063e-01 8.299480307943118973e-02 3.205573610263810769e-02 2.877959948502093607e-02 6.823251992878072436e-02 5.010381078899091012e-01 5.185233796997343880e-01 2.700655949219379903e-01 1.090134194227410508e-01 4.419290003159823815e-02 7.334827933377026099e-01 2.692047475297568160e-02 6.891554651310265456e-01 4.882828684200877234e-01 1.516222964821962449e-01 3.848948012329469481e-01 1.268378869270705700e-01 2.543572209566011266e-02 1.341099646899932517e-02 9.288466848768701586e-03 1.074526187051983231e-02 1.683099453640364562e-02 6.185617356235853515e-02
8.721644430665543846e-01 8.115437751117566823e-01 6.727230167585705745e-02 4.011584268722167418e-02 3.356670946336353517e-02 1.336509945133655120e-01 1.739609627898481004e-01 1.862141784031395852e-01 1.556809593427964378e-01 1.638870970259360960e-01 8.520163878305986316e-02 5.047791821984167621e-02 2.237164009827122269e-01 8.445681519162008544e-02 7.084811684434903778e-02 1.238168537614813963e-01 6.781151854736597873e-01 1.761103125670106795e-01 5.602329431870665122e-01 4.351190721908025638e-02 3.086522215979088310e-02 2.668539287035173041e-02 4.708968008123636251e-01 7.363763031598256903e-02 3.793906107443138775e-02 3.521553030128960621e-02 2.195713559797451975e-02 1.517323694958084244e-02 2.010429223966653592e-02 3.615110388544747616e-02
1.422438625193090667e-01 2.154715919657677337e-01 2.062917126259796452e-01 3.995527338309987075e-02 4.598860560511633944e-01 7.822090545572806253e-01 9.724256534181165146e-02 7.251958628646717475e-01 8.299851517157801339e-01 8.832899522229398226e-01 6.317487868982505361e-01 2.699818539920016414e-01 1.238758925586878334e-01 5.724333131768034877e-02 3.359411940985494033e-02 6.255796027617896438e-02 3.688046860547087857e-01 1.734020969267026369e-01 8.472680307156682522e-01 4.154506712609348090e-02 5.477176892633286442e-01 1.506110937701682917e-01 6.926385743151747265e-02 6.629078952773218014e-02 2.569638707375666853e-02 2.634394900513438095e-02 2.342564299081799362e-02 2.042476718231648475e-02 2.381358289819896293e-02 5.630316924657734201e-02
3.134824558863988364e-01 5.812812761758673341e-01 3.021730905967233705e-01 5.712856221982471894e-01 8.390660643353737846e-01 5.295402925275874417e-02 8.859220703544611331e-01 8.870839237465095728e-01 7.770463558294166129e-01 4.307003764768085330e-01 1.701059220098531666e-01 5.049645378312194177e-01 1.086530773944633793e-01 3.783233868801058608e-02 4.312070944985433446e-02 8.247390256410780385e-02 6.544286827288359198e-01 1.029908026340433880e+00 9.051254599220478481e-01 6.903043481287552963e-01 2.190678840528480220e-01 1.249680708271294072e-01 4.942029402601557514e-02 4.127772179188336776e-02 1.971432880512960506e-02 2.078611567925208944e-02 3.384396707829497725e-02 4.358671117144823082e-02 4.275302552793571603e-02 1.222759529494209657e-01
8.112141267391623778e-01 5.230645869682669646e-01 2.748686494760896881e-01 8.930925760156561977e-02 4.686393561123717438e-02 3.977423721995612671e-01 1.389066301280616200e-01 6.586647392833212544e-01 6.046079903132838274e-01 6.002330299872719044e-01 5.245852258117591482e-01 6.463199018796448314e-01 5.592280414600789284e-02 8.858687747031260828e-01 1.389698936583073086e-01 1.191631592240939425e-01 4.925683219715825123e-01 6.061332335169304641e-02 5.515525330301933316e-02 2.966450886243973684e-01 5.720204852925324379e-02 5.785236111438338269e-02 6.247915605009873863e-02 4.081031471474261957e-02 2.400513445354077527e-02 3.691621749680177450e-02 1.473225509651700516e-01 2.931201269679121202e-01 8.230516031100300056e-01 3.946285090750111246e-01
1.339620546223465603e+00 8.487804996926298085e-01 2.029231198031707373e-01 1.127146853876346833e-01 8.926337720835411105e-01 1.827345882635502128e-01 9.414125985768907467e-01 4.246265165063220492e-01 1.999049973033744376e-01 7.097700744025163544e-02 9.522438488830637926e-01 8.005200829272326457e-01 4.344665010580682496e-02 3.660860629677693823e-02 8.670711210595639651e-01 1.408024109958077100e-02 5.233837897187759020e-02 5.889394523968801559e-02 2.747482825972156692e-02 1.841558142286692581e-02 7.091237517160525750e-02 4.465788675086029141e-02 5.106840219019243704e-02 5.623567257626797822e-02 3.156934128316037091e-02 4.071632096090355840e-02 3.953574074773802405e-01 6.643208487258422945e-01 8.043215692332369438e-01 2.050693740029958800e-01
1.142321621853409574e+00 5.767544993142829091e-01 1.210992544803009663e+00 9.907893965213692145e-01 1.625453565203796857e-01 1.193792662732496429e-01 1.090332633044756167e-01 9.964007408799632759e-02 6.559691678587786789e-02 5.089512018211508337e-01 1.073417055245783347e-01 1.328380187337089846e-01 1.866783604793088025e-01 1.060165249370313284e-01 1.970460854545298679e-02 3.796471751723499294e-02 5.247454525092277999e-02 2.768850566178621478e-02 4.872508471299073496e-01 1.185422535782943848e-01 4.872601020135822192e-02 4.339402950801322933e-02 5.594066561868001747e-02 7.849977686182799119e-02 8.433652374733532908e-02 4.620971328930420507e-02 7.487101503132317926e-02 5.848044133764496860e-02 5.142462747283321062e-02 3.612141782165887577e-02
2.211666276919669327e-01 1.272976591573570515e-01 1.083519701580917260e+00 1.032073476657202615e+00 8.048074768381737742e-01 1.869940988650160840e-01 8.042948423996101881e-02 5.462373215881234645e-02 6.587780356574302054e-02 2.152069519160975872e-02 3.470463100475173340e-02 9.595919948538318700e-02 1.636090256590165548e-01 8.487449078665762481e-02 3.063620558222581933e-02 3.462762640622776833e-02 3.811443717269705211e-02 4.400426576985717875e-02 8.187491763778707021e-01 2.710796536001971457e-01 4.677679422763161149e-02 4.730876779584693159e-02 5.586902581816001467e-02 1.001104677529813941e-01 9.545104146287945734e-02 6.826637537490687357e-02 5.270046365766684060e-02 4.764505619384535456e-02 5.158765322552225085e-02 5.525845003137159345e-02
4.556934839387451197e-02 1.148435795097094425e-01 2.700360600085836560e-01 7.491813078852650465e-01 4.893967399737894630e-01 1.589869622482419642e-01 8.480201640860897394e-02 7.387408274991456858e-02 9.200416588441150123e-02 5.969313515710362728e-01 1.665923809510551912e-01 3.657977860497823447e-02 1.348707760773337205e-01 5.203651868507538913e-02 1.641292962297612873e-02 1.906393507037069251e-02 7.033610118842104596e-03 1.702010511667880963e-02 2.799608397311042357e-02 5.734178967141808636e-01 4.505244180849284075e-02 4.916096078924464541e-02 6.188295711685241202e-02 1.026417310055778992e-01 1.302051038612138389e-01 1.139417179683322734e-01 8.499222949086158996e-02 7.968317999381258065e-02 6.965845958082388101e-02 5.717677627526492751e-02
3.805005706446386998e-02 1.088142824927885999e-01 1.930509013800146279e-01 1.385298234474205137e-01 8.171220783508797991e-02 3.217603376449094110e-01 1.093335259008826554e+00 9.593650877399340082e-01 1.278666143242822018e-01 3.972931991729904133e-02 1.412256351933383891e-01 7.549063940218286861e-01 6.169352341351894836e-02 7.462319976645404029e-02 7.994122961179919717e-02 1.084725138509209513e-01 9.777854166532330693e-02 6.355735637799334037e-02 1.976574341947764935e-01 1.248890720842804891e-01 8.138607433283656656e-01 2.961496919875451495e-01 2.206676426524019075e-01 5.206156158026471470e-01 2.163175677121341456e-02 1.281011292440660185e-02 3.769489658678520927e-02 8.977580857925524516e-01 9.398415727699052646e-02 1.077447606208631614e-01
3.499209145686420219e-02 3.519685272542132093e-02 9.549877774765022642e-02 7.108337866155192142e-01 2.583611954776472430e-01 5.922313402761204132e-02 7.277291704378557879e-01 9.788215754893413167e-02 2.996725623892569981e-02 1.499700883286571307e-01 3.106750801771361870e-01 5.309640139682613585e-02 6.318937005139944885e-02 6.174596799010548254e-02 5.624274153033635704e-02 6.854303881427817324e-02 1.176555859070759907e-01 2.045834758382853447e-01 2.098208599059626922e-01 2.246139039251544289e-01 7.871645842775795154e-01 8.795531687527932130e-01 7.276671845773632352e-01 4.096164908837938295e-02 4.354853102357248568e-02 1.520247892018307956e-01 1.941246596048928630e-01 4.987628232616233420e-02 9.657624447881929530e-02 7.335988988641151121e-02
3.160062604279962467e-02 3.444237306552243305e-02 7.757295970206394553e-02 8.594862992072796470e-02 5.753479216822052211e-02 6.053039514821809131e-02 3.348552219250769957e-01 1.565049684631090315e-02 1.694141890197457812e-02 7.619274728790429441e-01 8.275014686866922764e-01 6.558746694688311063e-01 3.178222946437575525e-02 5.479511202084242499e-02 5.170700542846998898e-02 8.017575397874679433e-02 1.402781490510395801e-01 1.723310662531952198e-01 1.007888725228940907e-01 2.537538920798403791e-02 1.873557686190547092e-02 1.388054524516072197e-01 1.803703778459579965e-01 2.499015184999602290e-01 2.129189034411446968e-01 2.794432150102759138e-01 2.242311792105866897e-01 7.633736147029065999e-02 1.402815202651833126e-01 8.212463197669488124e-02
3.992023731305827799e-02 4.605427609474822132e-02 4.483092564874548852e-02 4.215023058009707141e-02 6.063281838465740120e-02 1.013071663992168581e-01 3.903147532413922538e-02 1.126806399279354498e-01 6.560986678525147775e-02 1.596063984004479977e-02 1.657747657544266992e-02 2.576523881853785142e-02 3.767379152223004901e-02 3.762755410719557242e-02 3.748852948523083428e-02 6.829930289253964559e-02 1.496130278404499414e-01 1.531193853315107323e-01 7.365035010307069419e-02 2.557133283375835966e-02 1.105758708156008713e-01 2.008030289954926273e-01 2.576478355028231637e-01 2.667412844863173427e-01 2.373164921910604630e-01 2.067611855744037330e-01 3.069091789601428588e-01 7.335345963563691396e-02 1.948711293778357390e-01 1.052705427262643767e-01
9.830932316897342260e-02 7.705776111714464360e-02 3.756498448806864371e-02 5.275275036286697361e-02 6.249758733505655917e-01 2.432777528430591849e-02 8.490498013989181136e-02 6.706167137169760650e-02 6.578435172278040977e-02 3.248996839455291219e-02 1.939461252327881816e-02 7.579457935491025200e-01 7.328940184665944102e-01 2.007842405222566573e-02 2.783305141488989082e-02 8.487689323000370545e-02 1.049873230398902235e-01 1.308780463115047921e-01 2.311928181309869448e-02 3.642312933207238895e-02 1.224872770227342089e-01 2.653943618346435995e-01 3.275882709014814598e-01 3.432449499411914795e-01 2.866642009934274871e-01 2.788091525979746188e-01 2.605665821891398615e-01 2.695508134971277281e-01 9.945234270213438865e-01 8.201335264801988822e-01
3.929064672270198705e-02 1.087616447181836976e-01 1.872109896702824905e-01 1.674343746310865549e-02 1.892951255046107853e-02 2.390960945812312805e-02 5.116512536049397375e-02 6.406142621483852662e-02 4.389147248536418716e-02 4.337369897377636729e-02 1.650448672107318951e-02 2.046539154378100023e-01 3.161879461074479924e-01 7.418728353251197172e-01 1.606459849665380427e-02 3.946668652715121239e-02 2.298399696948026302e-02 7.154819003482996154e-01 2.265652364269927777e-01 1.707420092795580019e-02 4.771074936611609252e-02 2.556755347453089633e-01 3.254629079331686214e-01 3.442433865425398865e-01 2.539235971239018341e-01 1.186141056544339073e-01 1.934609927623488768e-01 2.109861231629520106e-01 8.370121848251597940e-02 5.989617530557361791e-01
8.174047223247853378e-01 1.978154206011620633e-02 7.382275424470823300e-01 8.920868520947471125e-03 1.162833506268002963e-02 6.554693370524921833e-03 3.341419008670955954e-02 3.370367206792782011e-02 4.023278927531252075e-02 1.507591026598180221e-02 5.461548873535415627e-01 1.399861487098946755e-01 2.452960766460256792e-01 5.930609752015851832e-01 2.485260245284323655e-02 6.705774568691653080e-03 1.787606367703063054e-02 5.519976677083621164e-01 8.975276204966050608e-01 3.928916535775666546e-02 1.551287217830014109e-01 2.967051552365536082e-01 3.217859395527431499e-01 3.090749820470797826e-01 2.397516504816847305e-01 1.770850873939561476e-01 1.727946296353761735e-01 1.738636399490504636e-01 1.051414251264770394e+00 4.589339686217364100e-01
2.306080765776855751e-02 3.112163357854109622e-02 1.249248938352070029e-02 1.113360644532626446e-02 1.245103741892747938e-02 7.180284495433424397e-01 2.998547946478380410e-02 2.001470094197764504e-02 5.722858135334294057e-03 5.974873006818325338e-01 2.414431864781269588e-01 2.131698166802845074e-01 1.196402773140541609e-01 5.529209948475612146e-02 1.170334883556373856e-01 3.337670000015091065e-01 8.583316380315895652e-03 2.362327687947142485e-02 2.199542951782117520e-02 7.705552363005133132e-02 1.605585916969061444e-01 2.523478074402379367e-01 1.037816645140826471e-01 1.574514782168915106e-01 1.933809852224379899e-01 1.470968165561265251e-01 1.299487336832093332e-01 1.495733466668735800e-01 2.566819302776935374e-01 2.791953702242659374e-01
8.383135278191254647e-03 1.636570545535184773e-02 3.711059380205516955e-01 3.192542430126206754e-01 3.002596044551826826e-01 4.416188976437354086e-01 6.225078926057162620e-01 1.561672569361568230e-01 2.181696750246818473e-01 3.788156896644277738e-02 5.620834380681465764e-02 8.864378385877035027e-02 8.465284351668007912e-02 2.667703623207498542e-01 5.893162226060564279e-01 5.611221427531131595e-02 6.126481422845529018e-02 8.151125607031112219e-02 5.609616774803750927e-02 4.269789779774764427e-02 4.193611433920730464e-02 3.021787171192086285e-02 4.876787215713499490e-01 2.092916577723846067e-02 3.578270089702817458e-02 2.275980043662793537e-02 1.010251766218505987e+00 3.692981751511337229e-01 4.766378903450766563e-02 4.444196946216805166e-02
2.308060734437675926e-02 3.141916168914218876e-02 4.257844290342894800e-01 2.489650704748261889e-01 4.181352450622753958e-01 3.309166339016542668e-01 5.217408432207639724e-01 5.787093515170400881e-02 5.155219914139429205e-02 2.231348260797150554e-02 5.534423975537483553e-02 1.021651596960097969e-01 1.114805614325874994e-01 5.182758047844185922e-01 6.706572284559171315e-01 2.891668294883089838e-02 6.282399721094222844e-02 1.176238093945016494e-01 1.339813088560610210e-01 1.176562353135415656e-01 4.244373556881827353e-02 8.047758072918916872e-01 9.510671559581637124e-01 6.265015846888248585e-02 6.523198581853524580e-02 2.291002677907756288e-02 4.290853772830934276e-01 1.755256847803657594e-01 6.538655365622220161e-02 6.263011135774111671e-02
2.927183305022965087e-02 6.885849186257699817e-01 2.426578116129038676e-01 1.040922025394254852e-01 1.335538747322674580e-01 3.055052691182244540e-01 4.143724292066578996e-01 4.723328478590369667e-02 2.538404600005026227e-02 2.888034878813045686e-02 5.250017195922650204e-02 8.968833741183633579e-02 8.364081616268875807e-02 4.021531726330436762e-01 2.343285273288899656e-02 4.551201915014151111e-02 4.754610296110359929e-02 1.096473333037741443e-01 1.386150142378912986e-01 1.192481766595053505e-01 1.288739068053511294e-01 5.036783996431268839e-01 3.462488108828032374e-01 6.211111514941850542e-01 1.164171056339144833e-01 5.646994395480710305e-02 4.203040410929068105e-02 3.002986052096059399e-01 5.268942249535803202e-02 4.752254395563587641e-02
2.162523407009757370e-02 1.334175006676325236e-02 5.435448472368272776e-01 5.807394430735541846e-01 2.138920686071051416e-02 9.736951476071739053e-01 4.245716765977133877e-01 1.762380506498555932e-01 2.569517869618430650e-01 3.277804702600670694e-01 3.073084237725021151e-02 3.724756240511314931e-02 4.950193080086044695e-02 9.789548491208475978e-02 5.100405479599765535e-01 5.123052412965838770e-02 2.990430681173743971e-02 5.940687871799842090e-02 6.434702575584438922e-02 7.860802431019017766e-02 1.019478397328913988e-01 6.279277751788249207e-01 1.012976594059509378e-01 1.765040961567028166e-01 7.190174582229811318e-01 1.460431997558336026e-01 9.056776507319597158e-02 8.643968128450559008e-02 6.150485353816020212e-02 5.366287240717388524e-02
6.294768670745767153e-03 5.324533820326196043e-01 7.013802446648280675e-01 1.347958828103608342e+00 7.837881260419888863e-01 3.559812137494727802e-01 1.715078566343254673e-01 1.223109056098747871e-01 3.837493833783807706e-01 1.107492773571355262e-02 1.018899022585279396e-01 3.909859643283715436e-02 5.986922416029241689e-02 1.152054326210706081e-01 4.932927801926725309e-01 8.209236055198575466e-01 4.847609182934674577e-01 2.103933185084514712e-01 2.979119250740209224e-01 5.068953847762227571e-01 8.884936995358833078e-01 2.097178718231504368e-01 1.095202577937242766e-01 5.318288489541946884e-01 1.214650176501788081e+00 3.750196397547172489e-01 8.261449860331905592e-02 1.235693818200184202e-01 5.030479002374548259e-01 8.555936845496180110e-02
9.631966231248749802e-03 1.500713806139644668e-02 6.899186568158532928e-01 5.595516005631139267e-01 5.540215133836314809e-01 2.075676132905445448e-01 1.366864194038609481e-01 1.434625462990279932e-01 1.606093984069684455e-01 6.366111243492371674e-01 1.901965818587050272e-01 2.037027711866762347e-01 1.708675164502812260e-01 1.923409812775642991e-01 5.182988226131528542e-01 3.422328439825406132e-01 2.158961956935090409e-01 1.204613102560130183e-01 1.016201580556342216e-01 7.596446471877099649e-02 6.090013190564718543e-02 8.938742934466807621e-02 1.384815580187435669e-01 3.327031319904911189e-01 5.676324639461514110e-01 2.540492362877301846e-01 3.706606235336245003e-01 2.556332127757833805e-01 2.639967836561283865e-01 1.736796815398889970e-01
1.008374025675977739e-02 1.057307422165787214e+00 6.729877257239105237e-01 1.014236336029459506e+00 9.075739817580026347e-01 4.974356911999216480e-01 6.307387142408861849e-03 5.541266529933392727e-03 2.215096228817038659e-01 1.606116131623063215e-01 6.153538451022725481e-02 1.525678927950424590e-01 4.026221768482984298e-01 4.070599209511443495e-01 1.183643425665105609e+00 8.368850445657960435e-01 2.423439537027569923e-01 2.606833894328509649e-01 1.148304350184073952e-01 5.034341412101911439e-02 4.904353314763842259e-02 7.706044283292258490e-02 1.183551943617647262e-01 3.629532497507189648e-01 3.650207634452398153e-01 8.557506754118214543e-02 9.380354749289074312e-02 1.208013536606249577e-01 3.941113425578723906e-01 8.035403560252728228e-02
1.347826083034359308e-02 2.133609226856130608e-02 7.705817636005580784e-01 2.574645240396324780e-02 1.636718414669115565e-02 2.129808168869554846e-02 1.410157128831154676e-02 5.534685042330249605e-01 2.200388564305907346e-01 1.278306756567226254e-01 3.933817425113789179e-02 5.391574734543911479e-02 6.063841722850435434e-02 2.237135947158322147e-01 2.654402246296038714e-01 1.095716238301892020e-01 8.400619810408183064e-02 8.279830150925476806e-02 1.090732656700762332e-01 6.270595318719549005e-02 4.473805481663113010e-02 6.696934901574629062e-02 7.680471992951223847e-02 1.284271829833500966e-01 3.981689543258031261e-01 6.236717771602912075e-02 9.003034014508433380e-02 1.478153805387795727e-01 1.788490206041730979e-01 3.539968164897538405e-01
4.382533327599481485e-03 2.193317441651691443e-02 1.184872454251068907e+00 7.716709140419606913e-03 1.557867350355934995e-02 1.629532325393779832e-02 1.419602385037311600e-02 3.821703120629913464e-01 2.962640736438350575e-01 2.775859184976989802e-01 1.148437975145898959e-01 5.965429296281254262e-02 3.835592298417887791e-02 6.105343359986759727e-02 2.776674962177320127e-01 7.126644001388289518e-02 1.827859300708248314e-01 2.387421526214735662e-02 4.118951458893337081e-02 2.389079865573914552e-01 6.197255960133293828e-02 8.699350651986331728e-02 7.601236074493522565e-02 8.379680771427040764e-02 1.108137271707142074e-01 8.473876515910906682e-02 9.954002520330257342e-02 1.228579364456077044e-01 1.662167900099367768e-01 4.071131186488606279e-01
