9.361437635211865976e-03 1.382511963666643168e-02 1.193282976431508068e-02 1.491854236716891671e-02 1.124710804191410111e-02 2.460325043087182792e-02 2.452111230990910648e-02 6.669846302729047494e-02 1.213639437725167747e-01 5.408356922619877299e-02 2.470659284477758413e-02 5.563221455522428943e-03 3.249900382878086018e-03 1.225063933175570691e-02 1.436310626914779828e-02 3.170257062924422727e-03 1.135654310633298775e-02 2.036272626819148751e-02 1.886973948081581420e-02 6.755510443119861277e-03 5.339363207499362059e-03 7.939361205108238367e-04 1.888685394572762327e-02 2.364522920498642565e-03 4.312722756510248279e-03 3.361769168693302078e-03 1.553106402447202578e-03 4.818722495198509044e-03 4.645128042849726475e-03 5.797668963775514869e-03
7.453533900117582066e-03 1.656342903865290137e-02 2.958112133921382211e-02 2.411261199090456234e-02 1.670620593843647958e-02 7.446786724319451323e-02 3.533116333383187063e-02 4.488976344120758355e-02 2.938442797026407510e-02 2.511369639146956642e-02 1.760874611673904702e-02 3.419164057330580098e-03 4.521040158574994756e-03 1.030797206977394388e-02 1.436245898510668355e-02 9.137510973751587773e-03 1.143404835519940162e-02 3.819131967597141214e-02 2.939231937118360130e-02 8.956374339540823862e-03 3.108493130825955037e-03 7.177458567654330067e-04 1.502295303458374594e-03 1.309028518928384262e-03 1.078265720016267654e-03 1.419174572968975910e-03 1.832425775040052648e-02 4.836781300992409015e-03 6.985859131874634122e-03 6.948759153940946461e-03
9.075368035868038030e-02 9.252716326232944544e-02 1.958171803201684547e-01 1.596076858833426759e-01 3.375977818290731292e-01 3.420318488353715075e-02 6.312818718832260631e-03 6.800403075240066784e-03 1.097181824201855921e-01 3.386138711386033756e-02 9.130013320233461294e-02 6.092562286509830421e-02 2.231153505576900786e-02 3.212945953012213279e-02 6.066905097468253127e-03 2.497387177900358551e-02 1.689616318416161528e-02 3.516056671877874212e-02 1.189379589493332057e-01 1.998392225286559076e-02 1.864397453814399530e-03 5.489820403057894642e-04 8.402017979481399106e-04 1.028512798579939505e-02 6.179823296318537502e-03 4.174598389663850516e-03 3.782522324544641563e-03 3.020919310478664428e-03 5.140188214345681357e-03 5.746016343272603542e-03
4.285314888441871944e-02 1.238487325651601856e-01 2.721533034523361816e-01 2.201603948377577891e-01 8.935162419416507740e-02 1.364472864933373615e-02 1.060108403351724994e-02 7.106077359974509108e-03 4.341472108638362928e-03 4.138714796738904994e-02 2.691890208103916646e-02 5.369456066796775978e-02 2.422448517545845725e-02 1.579986100988622563e-02 4.566853861034352383e-03 3.396999787281327742e-03 7.126502338683666019e-03 1.349189614861310768e-02 9.650658619356523860e-03 8.296760799950923457e-03 3.695742159529255381e-03 1.273401866559646699e-03 1.315640599086890551e-02 7.818413227982799925e-04 5.088771971321954905e-03 3.813604089251648125e-03 3.291010858400451444e-03 3.106377640078247793e-03 6.108971654167978833e-03 6.620220290648085905e-03
2.497177250420575673e-02 7.866367543523794525e-02 2.200447881843850817e-01 8.525162110751245692e-02 4.806850987568799666e-02 6.890384917674812273e-03 1.031678977815133312e-02 5.633958813120428302e-03 2.593945332099687872e-03 9.231334820691265708e-02 1.180351960761266555e-01 1.003751875140945216e-01 1.472566799190156393e-02 1.187268500775398410e-02 5.420269975635846546e-03 1.965847161190435732e-03 2.109389825903211502e-02 1.223648883658139293e-02 1.980329693992028545e-02 1.148063488756482196e-02 7.943436073511623771e-03 2.226792515262773862e-03 4.831246774896542744e-03 1.352471606675244601e-03 9.134616529107597929e-03 5.124833115305795807e-03 3.579261325564145769e-03 4.103849158336656845e-03 6.220348029316733612e-03 7.520455616853187128e-04
2.512577495752681481e-02 2.683490975221733757e-02 1.204790279868544894e-01 9.654556651311793636e-02 3.794464200104658708e-02 3.997068570832610669e-03 4.732469745394599775e-03 4.927986914329177126e-03 4.542137829112227569e-03 1.399744345348100660e-01 1.116682625289613789e-01 5.862099734971420312e-02 6.617988080350797192e-03 2.109195453557749424e-03 1.561921557196223592e-03 2.490257310117737974e-03 1.168437901949997276e-02 3.079366973738141382e-03 1.003153697401710023e-02 3.498276275834165394e-02 4.298153217076958188e-02 2.551116516820908786e-02 6.299362673770591593e-03 8.404229203232281738e-04 1.362749829001111239e-02 1.347780728936260990e-02 8.450411708233998911e-03 5.758545427930672998e-03 7.183160115551478174e-03 1.283542690157399302e-02
3.527369514581363014e-03 5.711184386522315248e-03 6.045316312442669190e-03 3.066014145380516198e-02 1.467637934653983484e-02 2.387391979944794920e-02 3.497437370216197050e-02 1.925957126642125622e-02 2.223685550894221111e-02 2.625560399376707793e-02 2.048508902112737562e-02 8.440339435519934180e-03 3.518289382122007612e-03 1.527529892502537930e-03 1.139658395617773601e-02 1.313583389272047000e-03 6.593903357992239068e-03 3.155975258976811450e-03 1.621719167811910486e-02 2.241673746466567307e-02 1.047939070261564957e-02 2.669666373640957810e-03 1.123593522622612926e-03 9.716821678473982777e-04 9.462923543734394136e-03 1.005509305617368135e-02 8.865125444083991543e-03 7.546992266885782334e-03 8.141722086591205235e-03 6.812127916760286027e-04
7.627014034424619941e-03 1.419134775402900589e-02 8.305837162687483219e-03 1.790639729800524299e-02 2.755931892455173657e-02 3.050603647544171404e-02 2.623519487419218033e-02 2.401467364774811930e-02 1.855246919243448006e-02 1.049441612646679831e-02 4.264584607039295649e-03 1.330268273281270085e-02 2.904826330759455091e-03 1.338114635622176390e-02 1.495965910301608540e-02 1.914003555455407206e-03 1.364910335519916793e-02 2.219733386558474242e-02 1.966888979412016389e-02 1.404934392369507415e-02 3.838396902847535010e-03 1.931360587090670804e-03 1.665679722605330551e-02 1.449656105590622565e-02 7.245999558096054109e-03 7.477395511915025522e-03 1.115500198466002311e-02 1.276204172517603555e-02 1.205178208539530241e-02 1.351663650885172926e-03
2.031406210487094605e-02 1.354847552590333383e-02 7.906007283853390064e-03 4.582898296200194760e-02 2.962298093007597818e-02 1.234354123361309716e-02 3.857358066853372458e-02 1.685875869109805178e-02 1.358814687170736835e-02 1.352489148804660729e-02 1.218132651823140497e-02 1.625305561677597641e-02 3.650905218164494231e-02 2.476917793293112111e-02 3.652108680784854969e-03 3.223612080818520111e-03 1.360257331698316516e-02 4.205386845517803535e-02 4.179457556831732423e-02 6.957766289886946690e-03 1.219723109101379871e-03 1.163756457774899750e-03 1.289488392944907608e-03 1.387341609851509838e-02 8.336936653162872399e-03 1.212924833872745800e-02 1.621913010544699012e-03 3.073145105095205758e-03 8.985769442375413432e-03 4.477555031913804315e-03
3.370647766075061946e-02 2.229418467644913443e-02 3.537113775023330992e-02 3.320364758470643884e-02 2.882997319967356073e-02 5.596405498109912301e-03 2.509150694168600995e-02 1.042176551772294561e-02 4.202690896974218236e-03 1.599114994921077386e-03 2.370861737183517504e-02 2.352499136499737811e-02 5.005979154270271542e-02 5.402930865325182574e-02 2.555687069864295488e-02 2.804589399458416385e-02 1.525463355774553664e-01 1.600788354304051864e-01 6.444855937350046915e-02 2.865100367219831218e-02 1.792831887997715446e-03 1.517390363793386099e-02 1.649991970123363197e-02 9.640194885667995256e-04 9.904917523937651139e-03 1.255446388429313359e-02 4.540278085634552423e-03 7.223953451911303489e-03 9.748702766153102481e-03 2.631820207118001128e-03
2.769823304039139428e-02 1.473333548735529346e-02 3.277510538476888224e-02 2.819243235111237519e-02 3.540044695619672110e-02 3.199580793166402828e-03 2.594201673840447822e-03 2.193637624299583835e-03 1.319604945940144403e-03 1.197851306943297986e-02 1.911371827912581589e-01 3.249873925873375535e-01 6.766506439393192851e-01 3.346030822884730194e-01 6.172912059461799911e-02 1.219950283525346735e-01 2.296590841048151144e-01 6.388972391176506171e-02 1.521921920955979744e-02 3.216432945212180199e-03 1.549239156385695841e-03 1.515382812141315844e-02 1.379619846226511721e-03 1.288976704921478015e-03 1.255582423610158331e-03 1.385879540162492096e-02 1.078838224575755060e-03 9.681365989373342737e-04 1.489395729636140003e-02 1.078934937771766633e-02
5.711601568678462137e-03 3.364998934816373737e-03 2.652125652690628943e-02 2.640363285061648677e-02 2.045463860057376154e-02 4.588223540670703302e-03 1.713157682860357760e-03 1.064926882029538927e-03 1.275133884051324893e-03 2.402068704359643786e-02 5.907701918528875107e-02 3.917353217892471928e-01 7.079812359207873218e-01 3.690179915296930568e-01 1.333917024498861292e-01 1.516605628335594980e-01 1.684565227457362202e-01 9.944779214125779032e-02 2.439265707500586078e-02 7.331515089184320773e-03 1.758919512851846514e-02 1.687204103590232707e-02 1.341262774697935976e-03 1.676176935958030188e-03 1.634655452052822307e-03 1.125570460395768600e-03 9.539595740591103523e-04 1.604274321569054348e-02 1.654194455702245187e-02 1.022470102192715811e-03
1.447016098246886769e-02 3.388556062425642380e-03 6.086072743373230690e-03 1.742411639544742125e-02 1.139290088675221774e-02 3.542568854705296835e-03 1.752041848373378898e-03 1.408614659126944738e-03 1.741077715097660720e-03 1.247183034373030956e-02 4.156578834739636970e-03 1.249874388412371695e-01 5.301528681697919021e-01 2.298998265998457857e-01 7.291480785133999665e-02 8.523873376783637490e-02 3.154324115053686040e-02 4.627997326234219860e-02 5.261910853824419004e-02 2.061128430098363440e-02 1.554823294697899646e-03 1.424412215739372014e-03 1.600904390785909057e-03 2.290886725691278995e-03 2.941495686478653570e-03 2.696476573895776122e-03 2.147365925174430160e-03 2.149723758624544779e-03 1.621834681479297638e-03 1.106128894280869685e-03
1.251580577000680795e-02 4.150435699835715482e-03 4.569158903623542559e-03 2.958933340676951022e-03 1.763822852406897630e-03 6.783998912436395821e-03 2.290622075364454752e-02 1.937966423620268372e-02 2.508833431031990725e-03 1.425905439121165526e-02 3.095674659960822184e-03 2.047264819324033994e-02 2.436125297205117834e-01 3.348757676743719380e-01 3.616903548805228685e-01 4.945931085518995851e-01 4.454741619140444864e-01 2.893333390111085812e-01 7.903934887604064929e-01 3.649382992446642549e-01 2.967599211392784112e-02 8.480091807508288032e-03 6.335988583871822281e-03 1.574032784861814291e-02 3.617184603016070088e-02 3.350828875736663881e-02 9.029712916356527619e-02 2.877419893109704058e-02 2.192116394293263000e-03 1.994848666340578221e-03
1.206212431530764677e-02 1.136566867805127549e-02 2.655013016281190710e-03 1.428360558135798909e-02 5.169842324695451963e-03 1.190317365682056448e-03 1.544443315905812998e-02 4.477182778135657681e-02 3.059884970677695035e-02 3.127040850211068850e-03 6.635464595907645917e-03 1.037460454080121053e-01 2.223542117111560468e-01 2.856331710153591774e-01 2.605580336548369291e-01 3.178249836047710164e-01 5.431312475770229131e-01 9.395884557928676495e-01 9.560979886515010850e-01 7.465434550566538707e-01 3.149314767286772593e-02 3.254081691601896226e-02 2.895425129432117189e-02 8.965519416386176499e-02 1.271611425667946160e-01 6.415521586956027811e-01 6.307017983377336545e-01 1.241349449408568895e-01 2.635798027600020754e-03 1.498814080001458805e-03
1.148379567020258243e-02 1.193737504656466712e-02 2.851403492886707761e-03 2.054700459626752473e-03 1.141768413703297133e-03 1.208010341643069117e-03 8.576702678515337949e-03 2.439856367138924439e-02 5.055761431133480588e-02 1.802979498868328978e-02 1.865781877256404014e-02 1.644047424378481878e-02 1.289527982251701954e-01 2.620411753232203544e-01 2.449196504358998883e-01 3.764316925845244688e-01 6.533471785316208313e-01 7.949438733914658828e-01 4.590754717265564389e-01 9.946992537154011882e-02 5.919183832421056474e-02 4.041063666939581633e-01 5.875514684478250205e-01 9.685694440614555090e-01 8.941152789102243537e-01 1.148386884716199097e+00 9.041443007330667303e-01 2.532719061758497703e-01 4.182681012455633472e-03 1.824523379833509684e-03
1.423800640167647256e-02 1.607328607497920253e-02 1.526786551133601892e-02 1.400771782676232813e-02 1.236820674491636608e-03 2.416075389980388861e-03 1.425805748510018678e-01 4.813760304966885895e-01 2.350931782563923655e-01 4.035346193591426989e-02 3.009201841797034052e-02 4.735196650402291596e-02 9.406382426956733100e-02 1.382202514710824393e-01 1.820723354148784390e-01 3.257173631528797464e-01 7.034913282191121997e-01 7.074158387544500215e-01 3.343825245146610503e-01 1.142475785501838453e-01 4.891339127686090693e-01 8.824947339839553928e-01 1.125622522491792177e+00 1.131069595258608729e+00 9.743454880135896667e-01 8.269792018855217641e-01 1.202066021153879838e+00 2.059275471796283563e-01 6.435057000329515164e-03 2.640389757758054151e-03
3.011489703313165959e-03 2.748842900784712918e-03 1.379549042851710774e-02 1.468168881204991519e-03 1.488658617854818865e-02 7.095259700968108152e-02 3.995775175564363346e-01 3.280398437928501165e-01 3.228670175786025887e-01 1.620043349593348614e-01 5.963105109293779377e-02 1.623144468924199793e-02 1.587623817555713218e-02 4.027519919454208147e-02 9.005423904068324270e-02 4.098225745245065998e-01 4.310037773663905059e-01 5.008826043090560676e-01 8.717750715044986221e-02 1.533419243803620102e-01 5.389576322256240948e-01 1.155501693203764058e+00 1.410084203783424472e+00 1.424611003465493742e+00 1.145724132825547859e+00 1.083979029848591846e+00 9.922789042302174733e-01 7.760394730260650187e-01 3.405524015773868374e-02 2.213559900476601630e-02
1.371481600334986846e-02 2.213542940282150519e-03 3.952974859813471881e-03 2.737258388318861146e-02 5.878923656269039594e-02 8.361604425178516264e-02 2.632657051561929640e-01 3.289631366486960307e-01 2.250767056350981843e-01 1.752772139310050936e-01 3.678066901185984144e-02 3.624178407267034802e-03 5.475943879651751223e-03 1.516912078648637724e-02 3.246392347766324793e-02 1.878812668165739386e-01 7.158026881269821673e-02 2.280257889015670919e-02 7.647966362035085904e-03 5.543023037454663376e-02 2.088136471478847234e-01 1.099329146126181378e+00 1.372780157888905617e+00 1.405272462188160265e+00 1.003510648972716135e+00 4.565240073946696397e-01 7.308263960578251783e-01 4.949195677149591521e-01 4.428145139181539902e-02 1.715669413635027146e-02
1.876080897289306507e-02 2.457169981685145693e-02 1.617260088464977236e-02 2.035211767221878007e-02 4.841373414990381152e-02 2.780947657957240013e-02 1.422203444830888730e-01 1.828519102987429812e-01 1.673244394734101359e-01 3.934526242946143754e-02 9.872598887180273480e-03 2.096142548023880239e-03 3.639340639547786280e-03 1.046077867898191627e-02 4.043031938286347632e-02 2.647001179198957971e-02 4.820461794067405770e-02 1.423235280851242908e-02 2.682136882574572348e-02 1.273265906663662572e-01 6.776981600695407559e-01 1.263453131465408497e+00 1.334370938892809777e+00 1.243016807381739808e+00 9.366956059236292154e-01 6.746073448905491876e-01 6.452934016830684794e-01 4.298087593655270378e-01 3.841584334882201801e-02 1.346741186044298280e-02
5.146593760611120616e-02 4.820706471879905586e-02 2.521418321542929705e-02 1.851507730818629377e-02 2.454145682667935660e-02 1.316823889334090697e-02 7.414708025934800550e-02 6.573053018545368942e-02 1.781998266057329902e-02 9.661799860304336879e-03 3.341511822494599906e-03 2.678716664975288198e-03 1.596766044570172103e-03 8.730676597905279255e-04 2.232780781983195392e-03 7.422848557566228550e-03 2.659760329918163177e-02 6.076001299290725854e-02 5.864270562901500311e-02 2.612326080549159935e-01 7.013856006774937812e-01 9.955868663284664910e-01 3.967907715827895809e-01 5.857734203758949709e-01 7.462614499566649906e-01 4.169368194308789577e-01 3.073353292538744674e-01 2.524026138114628948e-01 1.018491616012873538e-02 9.363092731886787229e-03
4.190813533548506942e-02 4.926663689234330595e-02 7.406512395745067437e-03 5.245621345993768149e-03 4.418974906125456778e-03 6.591637017270654542e-03 9.271252529410778029e-03 2.286793590191087480e-03 2.945750439356769300e-03 4.712478050210524736e-04 6.356212017003895227e-04 9.732481359780439456e-04 1.078028457143677919e-03 3.798079664954787625e-03 1.060152206636810757e-02 1.359503732787080699e-01 2.623697265409524193e-01 3.810332708876549290e-01 2.610751887662611237e-01 1.947375555785597900e-01 1.343763537509394257e-01 4.674464760812636899e-02 1.771192342576265524e-02 3.802807002638225464e-02 1.363569737470628762e-01 4.550452641867284292e-02 4.112435846975263931e-02 1.395610917090042875e-02 1.569831231644487277e-02 1.472039639732922178e-02
8.915899160181336991e-02 6.976914162696060129e-02 7.634167164116476348e-03 3.371580026953946777e-03 5.078585867929972728e-03 3.960694720528273177e-03 6.091169810213467074e-03 6.482208230224758248e-04 5.636837269881174277e-04 8.375068905867609492e-03 6.066648419320477652e-04 1.116077221013549951e-03 1.452776360378101083e-03 7.833892471416884981e-03 1.292320065573545132e-02 8.101604151486152539e-02 2.985843435489023978e-01 5.591241645053375287e-01 6.348804213713562516e-01 5.424956240896194881e-01 1.111383925928853267e-01 2.394323048900280637e-02 2.898134072220600113e-02 7.130184551285297101e-02 1.577109323745234104e-01 4.617609541334573298e-02 1.726022961397213548e-02 6.513852497310433816e-03 2.927898705963221434e-03 2.705924786614240067e-03
1.122941065003086464e-01 1.451088618580551569e-02 4.050830802623100850e-03 1.362176579037097449e-03 1.586162588624422977e-03 3.475467361039681971e-03 4.463148487584075660e-03 1.697155907621021934e-02 9.669482875255408158e-03 1.108546303177329086e-02 1.939142541290052660e-02 1.025880564062840120e-03 1.114310944005307601e-03 6.081302545869775832e-03 2.397368039217117469e-02 1.165753004098928347e-01 2.276693772061962329e-01 5.268699165211785385e-01 6.654067563769124893e-01 5.555141365317974866e-01 2.666953066684575324e-01 1.481314745128301143e-02 1.024059148725728861e-02 2.230031245278218596e-02 1.283611934653477449e-01 7.752509240636268339e-02 6.887833133655840712e-02 1.273662677556351534e-02 2.293962578041512310e-03 1.562177642722129521e-02
6.248546320278304533e-02 1.962290036476293728e-02 7.727789703267485578e-03 7.392724705651988054e-03 1.676801262624912428e-02 1.144640319820754149e-02 4.732372883787077690e-03 1.930140720644957881e-03 2.896509886157530404e-03 3.890684765544328173e-03 1.185888217683722483e-02 1.325508244131348018e-02 6.401733565817143085e-04 1.411866138452154158e-03 8.751952514071759462e-03 3.621657734586852806e-02 3.677855748737667713e-02 1.576865143633448263e-01 2.029881726595832436e-01 1.728717619600684263e-01 1.400554526417119028e-01 1.746545220663675568e-02 2.620120080523986872e-03 5.170924438937582815e-03 2.298305252603633636e-02 5.823983183889810261e-02 1.553748579514611927e-01 8.583706404146107527e-02 2.617513080262755341e-03 1.992046367480921915e-03
2.237464500305332352e-02 9.012429089913474856e-03 9.801517210869402710e-03 1.693707522867257675e-02 9.429438149666121566e-03 4.210261555215046546e-03 1.910243424257753765e-03 1.323153878877684694e-03 4.163781789539194519e-03 1.628687599799300348e-02 1.196927023296862460e-03 1.275159715551842099e-02 6.867303136982174467e-04 1.463600677640374166e-03 7.118042990352328563e-03 1.294659560538661582e-02 8.977383345767270956e-03 4.479710527656513563e-03 7.118757535955046699e-03 1.295297086844273381e-02 2.261499623259829658e-02 5.089714896982233672e-03 2.603280185691709322e-03 1.341825133134964820e-02 3.271165640453346790e-02 1.170942831970365680e-02 4.020378792531854872e-02 4.437142083134470311e-02 1.533324074254567050e-02 2.252589327305399083e-03
2.268466082773710688e-02 1.847590548755009138e-02 9.175815784294320820e-03 6.873167227499025166e-03 6.507783556881574331e-03 2.432002101141422876e-03 1.590915942751820441e-03 1.610875899109416370e-03 1.768844648728348703e-03 7.067940928592799862e-03 2.070553470451990015e-03 1.956209223526953877e-03 1.864736689417927345e-03 2.356342010668467397e-03 7.018158740640027642e-03 5.015744152353839545e-03 3.542192906321199510e-03 2.206087297851483300e-03 2.018684423131211249e-03 1.585913040815249610e-03 1.277113104804583274e-03 1.890766089147265195e-03 3.062442014534400882e-03 7.836873438983531226e-03 1.387115588911106388e-02 6.675812258098961192e-03 1.058240888095229003e-02 7.027416510086944776e-03 6.989916763357850553e-03 4.389704763674126889e-03
3.083699044935380232e-02 1.631034383372118729e-02 9.437615542738512012e-03 1.315347196692346482e-02 1.177878787213250573e-02 6.380504122829392007e-03 2.157918554222259047e-02 1.614632974836795534e-02 2.367957325157208411e-03 1.756897574394189650e-03 6.283201292263854805e-04 1.439264053252433274e-03 4.291826499827797528e-03 4.941991763958190724e-03 1.580200034158764366e-02 1.218880210362652955e-02 4.040865791018654479e-03 5.014335883479001735e-03 2.414132831884947903e-03 1.210617712798693320e-03 1.113720390572472052e-03 1.710545986527976445e-03 2.400145361122876624e-03 7.815321260942944409e-03 8.257755017653597637e-03 2.024322522798619340e-03 2.265768258714848625e-03 2.943969622863292033e-03 9.614179958749205501e-03 1.956700656125528060e-03
4.156270511666891598e-02 3.650317621168318316e-02 1.127114979483363061e-02 3.925326153211729924e-02 4.652937237512479174e-02 8.775604044542338611e-02 5.838543454421093321e-02 6.553237259927131853e-03 2.344405253623622898e-03 1.388556865410682777e-03 1.386911934031241980e-02 5.673862474856448436e-04 6.957034808093555357e-04 2.887341406968529055e-03 3.561685424792381156e-03 1.668220486702973052e-03 1.722228283878274964e-03 2.232870309210877903e-03 3.188059237288294948e-03 1.883935965018725296e-03 1.311278716476715032e-02 1.414024920118339647e-03 1.425219157850082970e-03 2.560215151147219974e-03 8.508845957135940941e-03 1.404341217546488775e-03 2.080172426239079112e-03 3.506143373350923288e-03 4.331684388070551964e-03 8.572933636883387637e-03
2.287458377008098551e-02 5.774278250364123927e-02 1.750731902477026605e-02 1.900408784391401790e-02 9.356030285317537554e-02 9.893945162692201201e-02 6.550053437127012490e-02 4.475279101572653476e-03 3.149258249875653854e-03 3.066234545096750870e-03 1.266578620679384166e-03 7.148220411403598306e-04 1.198453913638320399e-02 8.165624301301310090e-04 3.873785572016022905e-03 1.193978758734512337e-03 4.542118129523117429e-03 2.958735132678973201e-02 5.481851325268678743e-02 8.253723129051397309e-03 1.612865683515456909e-03 2.059737757740077568e-03 1.565252701146668335e-03 1.834557213568303348e-03 2.587819736539394028e-03 2.095890642593938556e-03 2.542055797264638518e-03 3.192142781778848932e-03 4.416853535906133804e-03 1.081799666310245128e-02
