2.861229566487200615e-01 4.163924069366055636e-01 3.526054023749616850e-01 4.371965364097932238e-01 3.068337986130028061e-01 6.392405135990105736e-01 5.817623053957572399e-01 3.695139389789833806e-02 5.450645238537054488e-02 6.356413146334514985e-02 6.898572776904198234e-01 1.772698465684934555e-01 1.149676725295986773e-01 4.513311151281825806e-01 5.551559210214644935e-01 1.309273884517194730e-01 4.908046319414611225e-01 1.543520855291851887e-02 7.970533932813052627e-03 3.548772771833372808e-01 3.327691688797091429e-01 4.984847337634305126e-02 3.824736272924690594e-02 1.555175702703331109e-01 3.102140848626137593e-01 2.499666535961085900e-01 1.176856335501996198e-01 1.044530778805777098e-02 1.004683342918774765e-02 1.272581625895310813e-02
1.894497862444656788e-01 4.062870373298998472e-01 7.153723502975436466e-01 5.388796803589109841e-01 3.711279403094587259e-01 9.520436345815223855e-02 3.818768126707764582e-02 3.023569180856525845e-02 1.482906468040033274e-02 5.376545290753551587e-01 4.288022675253070903e-01 9.243688400648825132e-02 1.366057658701962940e-01 3.489811485417446679e-01 5.057578243263408657e-01 3.598449069063066608e-01 4.554050950883028470e-01 3.649476527209487980e-02 1.172781081417388627e-02 4.234896834485720740e-01 1.905439982496544560e-01 4.781259898434412486e-02 9.929592880095415575e-02 9.061682293412261224e-02 8.310443956819184297e-02 1.153012607039592546e-01 4.176741282400872612e-02 1.066829033630389660e-02 1.524441380304557107e-02 1.530037461010515416e-02
5.695789536010489873e-02 7.453066303711691765e-02 1.529778260879882390e-01 1.118462663326040690e-01 2.009044319890357644e-01 3.444654925313488103e-02 1.575297548641086676e-01 1.656671846120738034e-01 7.963415167456927568e-02 2.085267792261957451e-02 5.651004652722244059e-02 6.859078237298806002e-02 6.251421547290408887e-01 9.043500638207906117e-02 2.080938203379017748e-01 5.847151430163634311e-02 6.976974964941248247e-01 3.487098338638480038e-02 6.473281982559733749e-02 1.298821670879654611e-02 1.199715692598383177e-01 3.958141837842174549e-02 6.023976233350310933e-02 2.146007262787813161e-02 1.327760146801028676e-02 9.111010581667832939e-03 8.434691466394042547e-03 6.631767291215636892e-03 1.131861402529458008e-02 1.269830607673092665e-02
2.446581340602696497e-02 6.724406366384558242e-02 9.443545478414287764e-02 7.611663474310226274e-02 4.616228768937240962e-02 3.190106109353504360e-01 3.184148479173840030e-01 1.984294315339237280e-01 1.078805013725679385e-01 1.630072366801736325e-02 8.771854572635543953e-03 5.049350727206670941e-02 6.163462273334896491e-01 4.971662710563919951e-01 1.554128367974238478e-01 1.320146530528155115e-01 2.879397869169873503e-01 5.609431326694950259e-01 4.355766606315450984e-01 4.013915747876782292e-01 2.214918460720304849e-01 8.572497874950851804e-02 2.872835451837284573e-02 5.775416275675498978e-02 1.092205116677421976e-02 8.061706751960375991e-03 7.137104448067006258e-03 6.768526345239489310e-03 1.372995463294476512e-02 1.490713059432496879e-02
6.049023575273966280e-01 9.127458680160202564e-02 1.064447334043709115e-01 2.860748529986016989e-02 2.842043872604720078e-02 1.862230653454497731e-01 3.267435386060345004e-01 1.848563871207486164e-01 6.828980966251971263e-02 4.287453863281985578e-02 3.971434373410445695e-02 7.835537197496443562e-02 3.733657238787937982e-01 3.887976906952069767e-01 2.043006941585512881e-01 8.325931069004073592e-02 4.605300553559660282e-02 5.528285798951538821e-01 2.749448006750536064e-02 5.134252013652113034e-01 3.648096496033939040e-01 1.134773110439079996e-01 2.887715346263529659e-01 9.653012342038407023e-02 1.984330803882978708e-02 1.074326000390952648e-02 7.623957389273941856e-03 8.804542190961170758e-03 1.374680858127689913e-02 5.047399821628526656e-02
6.948530818439276890e-01 6.550198479082283143e-01 8.721658471302039251e-02 5.379357077968377476e-02 4.199518095740693846e-02 1.082097128966282990e-01 1.411648372553939990e-01 1.519602806632037728e-01 1.279314576704545792e-01 1.956919582339159969e-01 1.001652491407502010e-01 5.660237889035931586e-02 1.678912770420441514e-01 6.440790207194428685e-02 5.497214987074516140e-02 9.774290552609940508e-02 5.336528179485456880e-01 1.372525166474851122e-01 4.337725777304528019e-01 4.635994651201558875e-02 3.400602992224745214e-02 2.793324724814594609e-02 3.641072678110139349e-01 5.724288732459588414e-02 2.979286005522873218e-02 2.801842838372315889e-02 1.768577686628118248e-02 1.217164149169075796e-02 1.603395935340950346e-02 2.874908120588328883e-02
1.118684207966452321e-01 1.712339224418012729e-01 1.648720383155643787e-01 4.845161113409730130e-02 3.691519645624367074e-01 6.294311515994714945e-01 1.165720815034831520e-01 5.884810514494608347e-01 6.783445374274537087e-01 7.059298848512775004e-01 4.925567019778804290e-01 2.051049092364560789e-01 9.343511968757091390e-02 4.423041144034169786e-02 2.657046224466524595e-02 5.052656836967644310e-02 2.970452614615247677e-01 1.383678993341581898e-01 6.726635785096301001e-01 4.536124403548374290e-02 4.335298145808688108e-01 1.192637899951351915e-01 5.490706736804853300e-02 5.241922858320233886e-02 2.027228018705054882e-02 2.079706743935071100e-02 1.850160982136343432e-02 1.603600448840832721e-02 1.856212594227529128e-02 4.367511156367603897e-02
2.366106622260811532e-01 4.423803287082546110e-01 2.327500034366085380e-01 4.440956525006736766e-01 6.568834548526790718e-01 6.252132560021919638e-02 6.986637668272497326e-01 7.017773187492736264e-01 6.177060702537834347e-01 3.365215402097467279e-01 1.305387511737567396e-01 3.806799217342274888e-01 8.139895840122160497e-02 2.880259345558553938e-02 3.330866863131714400e-02 6.466106486490796890e-02 5.116235542446512241e-01 7.993385726774691058e-01 6.991265189356341558e-01 5.310861092894244573e-01 1.687450507580957326e-01 9.629290255824524136e-02 3.807214691677100749e-02 3.172152881707303307e-02 1.511386740645060886e-02 1.592881932932420017e-02 2.591617880716896513e-02 3.343836767141875055e-02 3.284861988149338080e-02 9.434571229099834866e-02
5.828296789724658478e-01 3.786456850628620030e-01 2.034927437848343956e-01 1.016930245702499513e-01 5.352088086795113442e-02 3.049404128885926379e-01 1.559502544967088233e-01 5.079847505413700448e-01 4.697199814536773266e-01 4.610817339978902640e-01 3.981848799211358814e-01 4.851825102312111171e-01 5.824897836306118515e-02 6.654341764722279118e-01 1.049413874644318512e-01 9.052187386233759292e-02 3.734013925022048319e-01 6.445297877177358359e-02 5.865451100719046990e-02 2.226954318195690230e-01 4.292381295322864054e-02 4.339227912024330031e-02 4.684067841347800548e-02 3.051867783747947913e-02 1.789540519970912041e-02 2.746179426743712571e-02 1.093087770884454829e-01 2.193545443871446066e-01 6.230024468654266068e-01 3.029125524496645849e-01
9.198208160534502298e-01 5.849257137191729017e-01 2.083411534659052322e-01 1.233400386071377558e-01 6.626875143567199089e-01 1.368004159243155771e-01 7.065656327511179446e-01 3.201783953480032974e-01 1.518745713345924231e-01 5.362036730011486563e-02 7.157999000559870373e-01 5.992307046687321836e-01 4.631886544807815864e-02 3.925101605293877111e-02 6.393396232448540495e-01 1.549819456219625816e-02 6.138368144246827973e-02 6.808324686071955123e-02 3.102781769873210610e-02 1.958426632959478844e-02 5.192883742724761775e-02 3.264525155962483965e-02 3.729618191592761617e-02 4.094271248575061944e-02 2.289887256848420830e-02 2.942695485824689192e-02 2.851749490201604398e-01 4.874650698326483678e-01 6.019960576668820229e-01 1.569069409940175019e-01
7.727380246489501392e-01 3.902920294690588876e-01 8.397801322176567940e-01 6.999597822592188434e-01 1.732182737261254435e-01 8.700075154044933923e-02 7.974785564278313865e-02 7.321420192871687382e-02 4.858559916740392420e-02 3.770878478018205859e-01 1.196351008376553421e-01 1.547751919818114719e-01 2.325381149667326286e-01 1.256841578702527773e-01 2.299549330735152844e-02 4.391906514179955839e-02 6.526261438059303976e-02 3.032562276045961194e-02 3.515390447560007847e-01 8.550261763684255389e-02 3.508989142688263146e-02 3.118840994407287223e-02 4.013650778168217914e-02 5.612684296858953120e-02 6.004545347610102529e-02 3.276495956801244586e-02 5.298881609639295026e-02 4.236000220380650716e-02 3.815513347957041196e-02 2.753591305892505794e-02
1.504505417858535699e-01 8.635313457690542427e-02 7.452349468012751110e-01 7.177009933637256145e-01 5.690102693452859794e-01 1.335717506970333646e-01 5.759284132024693192e-02 3.919928261580801765e-02 4.736494430709690950e-02 2.208396828738675571e-02 3.717032998719204534e-02 1.214133033926916433e-01 2.088397259486936275e-01 1.071793664297391868e-01 3.828775028802518243e-02 4.283315388251599659e-02 4.725338272718127702e-02 4.789242605055728935e-02 5.883743530824583345e-01 1.948649977561595636e-01 3.359544795123215605e-02 3.394528016931816494e-02 4.001911859869637655e-02 7.148699037232873754e-02 6.791372331437960097e-02 4.842024350382483078e-02 3.734942008820302944e-02 3.456216968426768094e-02 3.824208300562461499e-02 4.201947358584334075e-02
3.113553593035872646e-02 7.820725355031600545e-02 1.848282715279453703e-01 5.152777582111194299e-01 3.397499211004670339e-01 1.109178171447804534e-01 5.924020145667618920e-02 5.166821178905470213e-02 6.444394187501013838e-02 4.214901420201311866e-01 1.185956224092503536e-01 4.358369559342514105e-02 1.656846190206913982e-01 6.511217070512274885e-02 2.041018614383239768e-02 2.357059886521989736e-02 8.709783358054343574e-03 1.899521331267806784e-02 2.966397991818048308e-02 4.113962744528226190e-01 3.229732191924765405e-02 3.522273914777272058e-02 4.428695990044218683e-02 7.334486513235700944e-02 9.277818907560300699e-02 8.099248962309468780e-02 6.032166466960121876e-02 5.779223715223671259e-02 5.147014894043407118e-02 4.332488445861616688e-02
2.601571429141391611e-02 7.416641758188892430e-02 1.310613562705275348e-01 9.396917172271375407e-02 5.552217199402435105e-02 2.198560387462984711e-01 7.474772211929268106e-01 6.556506239977216710e-01 8.743324911116881482e-02 2.745735812674131651e-02 9.862683645636539931e-02 5.349583926830273617e-01 7.474607967594926183e-02 9.262184893044904388e-02 9.904439049812367724e-02 1.342832337289910360e-01 1.211162134955647285e-01 7.877496989539736760e-02 2.378280183960759242e-01 1.413954875667475242e-01 5.831230012261117146e-01 2.121248024122916465e-01 1.580433930605640025e-01 3.725349173585514873e-01 2.252990274838006374e-02 1.415187259353448655e-02 4.088497708633958422e-02 6.520534566375483232e-01 6.944184155545018999e-02 8.155690831753291403e-02
2.433370080877203176e-02 2.433810777872467274e-02 6.554009361580387383e-02 4.856459235683401321e-01 1.759554090615596811e-01 4.039310465620498530e-02 4.957540971764752280e-01 9.453410223802342915e-02 2.933734401239477402e-02 1.036085556566185562e-01 2.173574804217051903e-01 5.671089071627065381e-02 7.478424084367440994e-02 7.720530686919320484e-02 7.002828991506665490e-02 8.507876199859866484e-02 1.459594803132623908e-01 2.537162369045701804e-01 2.601385702118135246e-01 2.603961059616155538e-01 5.638861051941702618e-01 6.298784089095849081e-01 5.211059544531707610e-01 4.443560215254688250e-02 4.954819591106275622e-02 1.873091996475664267e-01 2.267256989622409846e-01 5.622939338688268118e-02 7.187065636218573084e-02 5.569140505326471841e-02
2.242405808512355075e-02 2.425348290667963397e-02 5.393928595679264165e-02 5.916816580347344229e-02 3.929864630982726759e-02 4.137372967660329914e-02 2.288105352737050679e-01 1.614213002959260720e-02 1.878772462916128427e-02 5.279357544932626878e-01 5.823595836449612095e-01 4.702780972307455953e-01 3.894985896660748542e-02 6.930881126059768027e-02 6.488990462095862999e-02 9.989833814625875830e-02 1.744509435185589152e-01 2.140767424917829065e-01 1.250996374247431708e-01 3.047932854172354794e-02 2.153105398379096327e-02 1.571080205636793681e-01 2.081472280454924606e-01 3.018117885258909117e-01 2.647248782188614258e-01 3.489977984475112760e-01 2.816658843476542717e-01 9.261672998900069564e-02 1.057556051954951781e-01 6.273492335456234970e-02
2.892689734056464249e-02 3.304302439720486345e-02 3.175450731292309148e-02 2.943835115384550727e-02 4.171540131343385444e-02 6.929545116693523743e-02 4.513697446740456976e-02 1.342910293809926880e-01 7.508466253202027152e-02 1.735507069519164752e-02 1.753087163274674384e-02 2.779572101704113826e-02 4.277596541764679822e-02 4.532575222124224368e-02 4.740909815097490293e-02 8.547314825604704347e-02 1.865375690407431453e-01 1.905556716138986084e-01 9.152808600704173680e-02 3.171902619056053696e-02 1.366088420892919708e-01 2.470827216776104729e-01 3.157844829200956993e-01 3.295466574555466766e-01 2.968525094632904482e-01 2.619109786886790192e-01 3.943345828927824481e-01 8.781715002987759700e-02 1.482012137355991355e-01 8.061226264504484096e-02
7.274714439122950682e-02 5.637629777510973911e-02 2.696074898404947004e-02 3.714461284631444260e-02 4.317911063452904430e-01 2.659350445552366091e-02 1.033311574498450708e-01 8.219228397834571487e-02 8.061013266792857457e-02 4.065656184218490593e-02 2.234010434586751123e-02 5.528241733711435346e-01 5.382018180886313230e-01 2.222069759255340671e-02 3.264897169211031930e-02 1.070605488549979667e-01 1.271687119994293902e-01 1.565406201549570941e-01 2.765866803714222069e-02 4.463072555476971931e-02 1.511050892083256325e-01 3.253547186730071927e-01 3.990914489851610236e-01 4.235746689841863866e-01 3.610199117268690916e-01 3.594535994507591647e-01 3.434725188784494287e-01 3.331387447689308501e-01 7.642929179139980045e-01 6.304285035735447407e-01
2.936483186468424877e-02 8.017718281081308296e-02 1.360876224133590884e-01 1.736703714593959558e-02 2.122007671482157090e-02 2.722556101450551019e-02 6.437706223098491054e-02 8.039147877266530906e-02 5.504445391036245916e-02 5.217277568326028625e-02 1.815444454691236831e-02 1.492450154973886389e-01 2.321438053886933639e-01 5.451860364356330146e-01 1.799523756148752388e-02 5.124469630349894056e-02 2.705097614252963134e-02 5.255949040949700057e-01 1.662361717554584339e-01 2.035158136710649157e-02 6.052334813811981878e-02 3.230813514627045024e-01 4.096754680523258529e-01 4.355448672898160623e-01 3.243107193763775653e-01 1.535016016856719512e-01 2.533233621076747544e-01 2.483085664824100092e-01 8.436395019961454023e-02 4.589910290568405271e-01
6.187584900529566889e-01 2.107327177146730776e-02 5.436228871507038374e-01 9.785325827423786704e-03 1.419190356832236884e-02 7.959835711422993607e-03 4.052209280415948467e-02 4.332517414126507010e-02 4.861994114168369241e-02 1.683129176926790108e-02 3.952766265399475509e-01 1.021343734728615005e-01 1.803131677946277767e-01 4.399647133854782677e-01 2.761947678982566712e-02 8.630556682465359564e-03 2.110063658096571551e-02 4.152628992337280556e-01 6.736060640031471536e-01 4.787345044847087644e-02 2.023254564583198134e-01 3.862033966935534135e-01 4.180080438965476652e-01 4.008412953350701802e-01 3.110146606486680065e-01 2.299935756637629114e-01 2.247194667832951576e-01 2.052152293283451279e-01 8.045980546418178836e-01 3.512044012210531196e-01
2.721308438942513994e-02 3.417999756668724937e-02 1.400510214641222106e-02 1.189589454737895180e-02 1.340903373585499402e-02 5.236762894359666687e-01 3.316444801473308890e-02 2.313834746389106106e-02 6.551911691862428132e-03 4.355815891918887739e-01 1.761126265312351336e-01 1.557419286337173026e-01 8.820428288645444648e-02 4.144330386587979920e-02 8.928037054671619788e-02 2.595132768292221503e-01 1.070016087876367143e-02 2.826373550793037995e-02 2.647504136889838877e-02 9.724080942818211226e-02 2.161776689176208299e-01 3.336659301735578897e-01 1.373205835358323745e-01 2.067797637271766853e-01 2.548160297127691210e-01 1.780632538792183972e-01 1.509724497149458333e-01 1.641002023661537468e-01 1.961653039550494693e-01 2.134281007187317503e-01
1.169106936853559278e-02 1.978371983063758471e-02 2.763171919870097692e-01 2.374727872717481147e-01 2.233701622763271111e-01 3.276326263047472653e-01 4.606442866112029910e-01 1.152852308172984258e-01 1.607247364265605716e-01 2.783025491838347215e-02 4.113489962079099754e-02 6.481328178089074132e-02 6.246807944956250802e-02 2.005269924783558422e-01 4.518697784162892250e-01 6.926523253779728884e-02 8.338970532172833294e-02 1.124319232662841783e-01 7.676489813986804578e-02 5.817740547809236579e-02 5.286621934114089233e-02 3.404681668368927244e-02 3.791732893627927647e-01 2.442115764598603786e-02 4.736232179751997950e-02 2.579835498911194416e-02 7.700186672455866521e-01 2.811940592071069944e-01 3.616304547708019262e-02 3.374220539729936436e-02
2.924679765871667642e-02 3.511662529075595257e-02 3.139353440981003107e-01 1.856730541303296678e-01 3.157854723996438850e-01 2.490157272346541495e-01 3.892077630369794039e-01 4.278480427269112929e-02 3.781179173115468972e-02 1.633982044761952968e-02 4.041809715473110298e-02 7.469390882565360434e-02 8.205628517199602123e-02 3.863752616406381790e-01 5.068786459523320076e-01 3.587417946550132408e-02 8.541892124296301958e-02 1.582457505062639103e-01 1.783937688285338885e-01 1.558103775155438298e-01 4.995722839706630281e-02 6.103858671932754776e-01 7.232514923320755296e-01 6.778435719581826779e-02 7.707896643815520532e-02 2.561694704269633013e-02 3.219986760159094796e-01 1.314759627445288570e-01 4.874548808004291328e-02 4.671355158299090454e-02
3.600713540635258614e-02 4.915541018978177856e-01 1.773426274322163210e-01 7.789984968540190902e-02 1.024469478623269841e-01 2.331613604705459475e-01 3.114068070349865214e-01 3.497317377712790692e-02 1.857703949830304471e-02 2.113728053537981127e-02 3.838068092911037232e-02 6.565340838394187473e-02 6.148761802153719647e-02 2.975268349643411248e-01 2.508626763153881667e-02 5.429194417642903281e-02 6.333664671331996898e-02 1.441632062330850950e-01 1.801822228741401521e-01 1.541194895721825497e-01 1.417151753477088605e-01 3.742645424234659068e-01 2.581472540410639227e-01 4.626368078732405187e-01 1.228993969369137768e-01 6.025288913661604184e-02 4.492490563728830655e-02 2.219213705022040628e-01 3.869692204660298701e-02 3.488722061222490622e-02
2.416950467240186473e-02 1.315562852006694865e-02 3.935553056590588294e-01 4.362418325722619561e-01 2.033373634805360833e-02 7.561592113515596125e-01 3.226281490589302803e-01 1.312406191430619540e-01 1.883676017114984391e-01 2.403821320092649760e-01 2.253116641816927529e-02 2.729131585076610342e-02 3.633272128204940998e-02 7.183738340698389568e-02 3.747195597038656678e-01 5.356920462113669290e-02 3.175670788237748565e-02 6.707297419220424606e-02 7.360389547276337263e-02 8.384204081115001483e-02 1.039878460915409919e-01 4.575246389557270366e-01 7.406572506231273723e-02 1.288174841692971695e-01 5.249368928227574616e-01 1.456793652540373241e-01 9.855561310659616270e-02 8.598822568471849170e-02 4.454162343136463392e-02 3.879585822309794541e-02
7.284645331823635592e-03 3.699498758969973489e-01 5.070224699631270537e-01 1.012935677799776890e+00 6.142868047102509887e-01 2.774149961892309890e-01 1.306705211074644934e-01 9.121592926742953800e-02 2.812060915490448565e-01 9.814859810114517566e-03 7.463379621109107742e-02 2.863044831379949612e-02 4.387532753757332482e-02 8.428565359470338580e-02 3.607573263861300061e-01 6.014581454680493211e-01 3.528555442635046835e-01 1.521604966799690040e-01 2.141857815943063181e-01 3.636576763824756475e-01 6.394947047560729514e-01 1.514099017380902967e-01 7.925039696412095047e-02 3.836261306013468708e-01 8.774222300445904121e-01 2.716434178493628560e-01 8.143388558178910053e-02 1.173101216244084172e-01 3.617032472793633713e-01 6.142551459231773009e-02
1.009777260114228317e-02 1.411623078886726536e-02 4.985853528108231680e-01 4.205289735110969707e-01 4.343788167959965474e-01 1.618086574263149779e-01 1.043520571287053500e-01 1.071543928713027116e-01 1.177764517008641071e-01 4.667048304844151896e-01 1.391992922092193941e-01 1.491387115270640384e-01 1.249980050685402244e-01 1.399700596109906547e-01 3.766992316917287531e-01 2.493439399574562398e-01 1.564588077750813377e-01 8.678489199966485379e-02 7.281140760717454141e-02 5.433682902929607567e-02 4.367791171292671748e-02 6.421386241457388566e-02 9.930435884363671140e-02 2.379584671847371491e-01 4.075689419187077389e-01 1.834299360967977244e-01 2.687000754164485250e-01 1.836976225765397930e-01 1.890675052365164421e-01 1.243871220063995642e-01
1.110494982912485322e-02 7.348978732723804308e-01 4.873700237214526609e-01 7.641119163758256505e-01 7.141751864519381154e-01 3.887588767083968722e-01 7.145468276887627715e-03 5.769254741728950531e-03 1.623051943259028740e-01 1.176168513964970380e-01 4.497635043302459362e-02 1.117088023694699506e-01 2.944336450573352693e-01 2.960889044513285717e-01 8.605358085066888707e-01 6.101077621924486660e-01 1.757091984031137200e-01 1.877438957623366877e-01 8.224338198773332997e-02 3.598457659524146451e-02 3.506867364947441335e-02 5.505943695381976949e-02 8.427511118745444063e-02 2.580430439330169134e-01 2.611933415486105692e-01 6.155708852878694765e-02 6.766722859174456595e-02 8.638172308208853789e-02 2.802953794766555040e-01 5.721851911096755700e-02
1.491074196772720212e-02 2.069868414521480043e-02 5.597264052751841357e-01 2.547294295072858109e-02 1.865402979843627795e-02 2.658866646807514500e-02 1.709812818720099145e-02 4.150886640729292143e-01 1.616887610330282332e-01 9.375550849747599225e-02 2.879939246528920305e-02 3.951254640141101809e-02 4.438633728479842583e-02 1.624521258287282832e-01 1.926315736451867655e-01 7.969591616033121217e-02 6.088903730678479204e-02 5.964852620066100897e-02 7.809977218206957950e-02 4.470387066913246443e-02 3.174994684330804257e-02 4.738840579707148670e-02 5.410180031132991174e-02 9.067692247568701069e-02 2.835962788636938736e-01 4.465453805296117074e-02 6.460504794894736391e-02 1.052399316846085592e-01 1.265087140958481293e-01 2.506192219613313510e-01
5.762505463421301564e-03 2.336782293023118712e-02 8.728747180927809435e-01 8.411036552348028633e-03 2.268817051565449536e-02 2.377263493813215958e-02 1.840669963846820051e-02 2.969786467449323508e-01 2.275831378257303916e-01 2.116577345305752367e-01 8.690479221094800366e-02 4.485190709855107344e-02 2.869281821981004357e-02 4.523786210990513035e-02 2.045412827243285048e-01 5.223169947258953644e-02 1.332305412560655378e-01 2.511991164537367635e-02 4.243459352135466045e-02 1.708772926745854015e-01 4.421073128573398126e-02 6.196181624644820501e-02 5.403805064215894127e-02 5.968904626540020436e-02 7.946338900546569273e-02 6.094367244778620130e-02 7.166479951562745865e-02 8.791142213726932386e-02 1.179133078408371865e-01 2.889679057624703895e-01
