2.099888502531511492e+01 3.162467245115712444e+01 2.730200459339349806e+01 3.427547443893632106e+01 2.580918942203031463e+01 5.684559464198757439e+01 5.677785868539847769e+01 1.552685997864305989e+02 2.862492686981249221e+02 1.298299025289578310e+02 6.145481113325479328e+01 1.428941796785097118e+01 8.652031734946415753e+00 3.416095392420022137e+01 4.244429008009012705e+01 1.003200779701880663e+01 3.863015836084854726e+01 7.452675546909722470e+01 7.511766197432505976e+01 2.907794406864414327e+01 2.351337458192401186e+01 3.442025203744206507e+00 2.699994265540909488e+00 1.089011678333536359e+01 2.143258015137007533e+01 1.716803131978081609e+01 8.150626854857796033e+00 7.271514397950707975e-01 7.013746539882987907e-01 8.975642273600676901e-01
1.566608209937568219e+01 3.553474135583554272e+01 6.379352427108599954e+01 5.155921764607037971e+01 3.574683063709677810e+01 1.611831774344639712e+02 7.814800365736051901e+01 9.938697317079312654e+01 6.657772387004183656e+01 5.781290794611378203e+01 4.269245924562952155e+01 8.680434335853346894e+00 1.206162228374094880e+01 2.898971463593268894e+01 4.269802715167707419e+01 2.926241938685104316e+01 3.969005260763977105e+01 1.441992382666454660e+02 1.223643298502889110e+02 4.098394763173418909e+01 1.484181953615107830e+01 3.395583093595716750e+00 7.277985063713089176e+00 6.606867851647519885e+00 5.997257531756122084e+00 8.334960008091018224e+00 3.091914771673643703e+00 7.820107226720796056e-01 1.094647038759692936e+00 1.083530532295742921e+00
1.839372964505458867e+02 1.922761896169947704e+02 4.073256849815276155e+02 3.285797890264040007e+02 7.024726959096801693e+02 7.228753777239197120e+01 1.384756671225082769e+01 1.521178464533461572e+01 2.555098439568684796e+02 8.011007449805390479e+01 2.252183834982324697e+02 1.584658394427226540e+02 6.143645047329157194e+01 9.388595890416279133e+01 1.875641465425984578e+01 8.341860601729413816e+01 6.140310214257365828e+01 1.409276466295841601e+02 5.329933972514957077e+02 9.975860861228025556e+01 9.780247143694166923e+00 2.922704964369804870e+00 4.606152366088669403e+00 1.676609844080879430e+00 1.051507211646861117e+00 7.408162393783473965e-01 7.065876238644184237e-01 5.254158448099505163e-01 8.450418777978013773e-01 9.106360679317400120e-01
8.797951444133673249e+01 2.588062426478588804e+02 5.687711691936966645e+02 4.554911137535788725e+02 1.888508970612567168e+02 2.930680325632560823e+01 2.356827699710971658e+01 1.597594965428296021e+01 1.000678198788149587e+01 9.474975169160539679e+01 6.235699461631580220e+01 1.287448132573820772e+02 6.110462480785028561e+01 4.325946800330729047e+01 1.345118967314983394e+01 1.089304620437279070e+01 2.465124394234893757e+01 5.047817933979350613e+01 3.979503741692710150e+01 3.749242328646116107e+01 1.779626540643698718e+01 6.353420549783059812e+00 2.071379282244475206e+00 4.201986685102669483e+00 8.322062593860679591e-01 6.564422097152755597e-01 6.054179298934954101e-01 5.338261606440212192e-01 9.988081938879835864e-01 1.036088625309775857e+00
5.282011832395019013e+01 1.697402898063054977e+02 4.725449682586823883e+02 1.829094624801405189e+02 1.055272401380985912e+02 1.529019540955965795e+01 2.328426102290153565e+01 1.294734959343161940e+01 6.014900828114107867e+00 2.088867604994529188e+02 2.607607092345155593e+02 2.256729099710593687e+02 3.451660884333850987e+01 3.055281483754522753e+01 1.526296962215625186e+01 6.042237484070211551e+00 6.917912491136323183e+01 4.247722398445612413e+01 7.378275300300632011e+01 4.544157226814404282e+01 3.322763371204921867e+01 9.811026551755725578e+00 2.281497828989334664e+01 6.605050906258165710e+00 1.410176080583557257e+00 8.257430193570660659e-01 6.173594869263079321e-01 6.678554295285381581e-01 9.642416104636004626e-01 3.393031408934473525e+00
5.507288197276525210e+01 6.070518961813995418e+01 2.715602028233577130e+02 2.168663811757681401e+02 8.602680783872320092e+01 9.061423089944046438e+00 1.080413288166714736e+01 1.139322844028611748e+01 1.054633556622457391e+01 3.109907003584375502e+02 2.380348859433331654e+02 1.243408533996291681e+02 1.449265362767823717e+01 4.668911069192267504e+00 3.787033581439256835e+00 6.628462347225966056e+00 3.638876829881419184e+01 9.914676864480625795e+00 3.385449967488170131e+01 1.231323697073366077e+02 1.605923835012342238e+02 1.022980970099772122e+02 2.735201852770772035e+01 3.750821330698680178e+00 1.998953018294266082e+00 2.055304503427643148e+00 1.379910448465680783e+00 8.909522379154795058e-01 1.084127522540273114e+00 1.873209004237830655e+00
7.755161507495465401e+00 1.302578753923394572e+01 1.381496957699923200e+01 7.018907574354361145e+01 3.371461025421923097e+01 5.495384417466094362e+01 8.097409127710261600e+01 4.507105590936599526e+01 5.245770430866585343e+01 5.860464738277497787e+01 4.349266168790972387e+01 1.744100081751012254e+01 7.238842670679470181e+00 2.988061523426282839e+00 1.676918644661216096e+00 3.203648930514317428e+00 1.955732941596192376e+01 9.527975174156114946e+00 5.028618985457070778e+01 7.160989269772271371e+01 3.546141673528673266e+01 9.145315200122979604e+00 3.866228461771892722e+00 3.230079576954935305e+00 1.297628759009473498e+00 1.459180861385219519e+00 1.382604682247023931e+00 1.124961143412109843e+00 1.208621344599400071e+00 2.765409092761144993e+00
1.594558562006145941e+01 3.042263810569767912e+01 1.796872959852355933e+01 3.918648431159090961e+01 6.078855126081759153e+01 6.807005938712850934e+01 5.966953739397621348e+01 5.592217696545547767e+01 4.482986085968083501e+01 2.426323200919600964e+01 9.469998226085216686e+00 2.849686144862465653e+01 6.077036609556083491e+00 2.092664488182228943e+00 2.229099749349352066e+00 4.302025938516692349e+00 3.701974081762861601e+01 6.158884270187683541e+01 5.646348037329896385e+01 4.219521352748084553e+01 1.237891600689633442e+01 6.244611089283086613e+00 2.257676807173068845e+00 1.866985636323596598e+00 9.389138190151056218e-01 1.060530487320864301e+00 1.752011200929065371e+00 2.089789140259409095e+00 1.989244969840400001e+00 5.632134731063692890e+00
4.061014742629813412e+01 2.726565209186851746e+01 1.624038265045130558e+01 9.602993244665259454e+01 6.383497839409369590e+01 2.723353125451940571e+01 8.806835768519685814e+01 3.988625179750592054e+01 3.402849932610405403e+01 3.256148269700331355e+01 2.829063698716268149e+01 3.654156715184117132e+01 7.931824027301404101e+01 5.258824777949740792e+01 7.969657413694712034e+00 7.445653410294367447e+00 3.359902005582240037e+01 1.067250897397084941e+02 1.106793804380259871e+02 1.956880589359464295e+01 3.299557209959434800e+00 2.717213300139178944e+00 2.736727469776135901e+00 1.767350136419773232e+00 1.077487948351660618e+00 1.760783974581452638e+00 7.013830404243262429e+00 1.349881671814027584e+01 3.744851438886495032e+01 1.785434040272463463e+01
6.626630620076494438e+01 4.342570321408184952e+01 7.045081412751876826e+01 6.748079365897660864e+01 6.143534585289776118e+01 1.235839423075948318e+01 5.818003627806228906e+01 2.535593498932300349e+01 1.101633118016794910e+01 4.023411279987125333e+00 5.776806983188515687e+01 5.542151426608197085e+01 1.156168413509689401e+02 1.231843364347997181e+02 5.805695612142660167e+01 6.296881927868330564e+01 3.489297796155617561e+02 3.794299983579965101e+02 1.615963516636093118e+02 7.692628738486715179e+01 4.026927516400384377e+00 2.029367196081689695e+00 2.205636510432242403e+00 2.411320037849648656e+00 1.369798613204785021e+00 1.855943258920762506e+00 1.835901015511765877e+01 3.019425754213008162e+01 3.623556758240319908e+01 9.208371268265997500e+00
5.601843755139906023e+01 2.926890486546127335e+01 6.607954324038746563e+01 5.744240035194303573e+01 7.575202809345213950e+01 7.141172376043712688e+00 6.144358522974904702e+00 5.529868387319202938e+00 3.613552043857060525e+00 3.170359118502543083e+01 4.887958149692341863e+02 8.027413249000659334e+02 1.618394037298138983e+03 7.690160531473243282e+02 1.371190768532960078e+02 2.589776795287384630e+02 4.907508073308864596e+02 1.411132589396229662e+02 3.544733737691537812e+01 7.495939323486314976e+00 2.674302053824714420e+00 1.950234187185521328e+00 2.430610278647187705e+00 3.405281171513818705e+00 3.685161433695200550e+00 2.067429684407579238e+00 3.403838076248997258e+00 2.630297144891081018e+00 2.285848388890067362e+00 1.595788143567385742e+00
1.066676658232335484e+01 6.283875111108159217e+00 5.546141307685444133e+01 5.506115897697334560e+01 4.401309096201283921e+01 1.039353554421552062e+01 4.166092020508664895e+00 2.785155309203596552e+00 3.608850945690193601e+00 6.596495506531206843e+01 1.566290583817703350e+02 1.000430570768343955e+03 1.733514130302120975e+03 8.564012537799710572e+02 2.962392650994132737e+02 3.187222943379751996e+02 3.510306897333250618e+02 2.098828533350206840e+02 5.270904820607938746e+01 1.529467148994365999e+01 2.324130774895059481e+00 2.122219653794905181e+00 2.472119840547176928e+00 4.448204224232557458e+00 4.290324992727033937e+00 3.115638748145685533e+00 2.438107891923598558e+00 2.164423033378272354e+00 2.276407647713387217e+00 2.401005550774406583e+00
2.102642823035575148e+00 5.444730619588177056e+00 1.320857161350783926e+01 3.756523786430694400e+01 2.492003073615562414e+01 8.127249081774017725e+00 4.323353004509515429e+00 3.789155156297590032e+00 5.036875674445900231e+00 3.526710521105206197e+01 1.144468514092114475e+01 3.386266381841872999e+02 1.358580548603642910e+03 5.441764576870275505e+02 1.612214875681141848e+02 1.759283842371936544e+02 6.337957945053179287e+01 9.159168021739293408e+01 1.033886291631736469e+02 3.885031825994165189e+01 2.638475670619476077e+00 2.399010434428596295e+00 2.937736796528777283e+00 5.053360277557793268e+00 6.640047378784331045e+00 6.308298686025125335e+00 4.735486047838018742e+00 4.264619013920430746e+00 3.239546653418176714e+00 2.514045767160679734e+00
1.714276762151932143e+00 4.947215130676005046e+00 8.939438217289593425e+00 6.502777390220297882e+00 3.878495457288388959e+00 1.579545691892185388e+01 5.776228496450925576e+01 5.370013474239556928e+01 7.584126190365468645e+00 2.274659724392023907e+00 8.928852379081737567e+00 5.846765468039324531e+01 6.521418240660096899e+02 8.111537445635990480e+02 8.047942425942344471e+02 1.014860880385494056e+03 8.689656240603231936e+02 5.389310993482497452e+02 1.415417457750925678e+03 6.460038699598275116e+02 5.367942667092020770e+01 1.563676487196201137e+01 1.185008784104960888e+01 2.962143424635731748e+01 6.817396162633434642e+01 6.393865707940191356e+01 1.775717609076917256e+02 5.930381753355570851e+01 4.822219288371990764e+00 4.799667751931711024e+00
1.563413595939952661e+00 1.582496098460497214e+00 4.350808900804209678e+00 3.264212422021979876e+01 1.198138975146459195e+01 2.884543189752710290e+00 3.943060825171141914e+01 1.215950805156305137e+02 8.786900496716856424e+01 9.031073697609162565e+00 1.927786484915620235e+01 3.069957535918783265e+02 6.251179490320814693e+02 7.255893585948441569e+02 6.050053564987792925e+02 6.788728181992862574e+02 1.078519199640788202e+03 1.742696353000521412e+03 1.676599362249224669e+03 1.278371324554933153e+03 5.453368473051864385e+01 5.701527031613061069e+01 5.075309422793162639e+01 1.563129074019422831e+02 2.196178674412264513e+02 1.115958045142567698e+03 1.128570485367001766e+03 2.344976102493330927e+02 5.339039347503542032e+00 3.294119032505421707e+00
1.392963862589134960e+00 1.535914812791048023e+00 3.534684043185347235e+00 3.950002975092392621e+00 2.664551205273605561e+00 3.084437296074426627e+00 2.230771672045827358e+01 6.500948618390356160e+01 1.403855362613456634e+02 5.189805353322474701e+01 5.556344745552175368e+01 5.048072325934306548e+01 3.836993250308430561e+02 7.123280253471657488e+02 6.139794502877630293e+02 8.714919647754918515e+02 1.368205553417053125e+03 1.521787058766673226e+03 8.171774484787729307e+02 1.701852359412002329e+02 1.011502984453456264e+02 6.903456643197314406e+02 9.989942254225425131e+02 1.633403518733155124e+03 1.493951626730578482e+03 1.935662712394470418e+03 1.572580138343951603e+03 4.645848852226794179e+02 8.129323921044674606e+00 3.730836922307383396e+00
1.732560289066219283e+00 2.036371137072635396e+00 2.025282050644102938e+00 1.967542959668802549e+00 3.086474553388288911e+00 6.515437034182693488e+00 3.811446931379477974e+02 1.291991816118548059e+03 6.476417384698294200e+02 1.159552069537475916e+02 9.170131878107940793e+01 1.541614322841630269e+02 3.030554598914380904e+02 4.074628770138814389e+02 4.936196963135047895e+02 8.180703774603255169e+02 1.557416792427627115e+03 1.410019092120196547e+03 6.107464368974715399e+02 1.967968028361350434e+02 8.285433932955206728e+02 1.469844113695650094e+03 1.855300201776851054e+03 1.843935353895763001e+03 1.588764759865071028e+03 1.375189508465489325e+03 2.076611008170103560e+03 3.699598227543733628e+02 1.195805075022370190e+01 5.047812921257708751e+00
4.252736979815510132e+00 3.408135113526305382e+00 1.803184116524435776e+00 2.919584717693086251e+00 3.983741606850763617e+01 2.025187620083216018e+02 1.117219506890030743e+03 9.159030599593788793e+02 9.255685308695922231e+02 4.840948139195623412e+02 1.897965807575727126e+02 5.645758535767603803e+01 5.544493562250595886e+01 1.293650645365994762e+02 2.664198153679283223e+02 1.134323361963033221e+03 1.027351023866932792e+03 1.053319368798020832e+03 1.638802443618394591e+02 2.667557971587183374e+02 9.117165478556582912e+02 1.908369598524459889e+03 2.298905912405766685e+03 2.296257771353497901e+03 1.863448564502307818e+03 1.817256212540707111e+03 1.742003844365911618e+03 1.383093525138646783e+03 6.144553051256075094e+01 4.036908732952957024e+01
1.917134439099092535e+00 5.460247922367523543e+00 1.046217227309916709e+01 7.658203468184248663e+01 1.831882488677248375e+02 2.636863806296282746e+02 8.293515844956502860e+02 1.043252052026022739e+03 7.356753171454306539e+02 5.879678051670620107e+02 1.292111407844474229e+02 1.342173882431774601e+01 1.996480746982898324e+01 5.114568993076139236e+01 1.015805728849771015e+02 5.524379099908385342e+02 1.843454418830688724e+02 5.221154777839328887e+01 1.561431021108587025e+01 1.041137347829778577e+02 3.752696263791137881e+02 1.901419180934260794e+03 2.308969668361577988e+03 2.301841770986170104e+03 1.625638885817414803e+03 7.443046583555460529e+02 1.213126568771852817e+03 8.331640593947338402e+02 7.515307013228357391e+01 2.955359157282514815e+01
4.935712745755513708e+01 6.719538175205008201e+01 4.804411226883159003e+01 6.462026196846032633e+01 1.674423873311069713e+02 9.954170558059992402e+01 5.201289779380064147e+02 6.834905732402534113e+02 6.471484103793072791e+02 1.530210106309659466e+02 3.878921449191076931e+01 8.305950710125381775e+00 1.393657080440607565e+01 3.745430690353618530e+01 1.362201866365041951e+02 8.453763486600283272e+01 1.366312322402426389e+02 3.592805552278692005e+01 6.033610729563822872e+01 2.603834680616547530e+02 1.303511743941553277e+03 2.317664173825845864e+03 2.354759627851992263e+03 2.098931920922658264e+03 1.527245424098493459e+03 1.078279328936601360e+03 1.028340812949416886e+03 6.931195147484345398e+02 6.236386166342948911e+01 2.214820985382086249e+01
1.461642511939826932e+02 1.451413923863435400e+02 8.219973568312883572e+01 6.608559520388732267e+01 9.741321264180211870e+01 5.520850824621908259e+01 3.245513133294397221e+02 3.003897785272718011e+02 8.534533520134118589e+01 4.459734821462490828e+01 1.485973227077563585e+01 1.148799747729055554e+01 6.519316064301733604e+00 3.360819328382294024e+00 8.157895997463851856e+00 2.584506269301290615e+01 8.222645112772751474e+01 1.679587990574678429e+02 1.456396597577024750e+02 5.916974811997068855e+02 1.481158954236879936e+03 1.987248778088855033e+03 7.557286930833013230e+02 1.039238394290798396e+03 1.239405832681343782e+03 6.597019512576224542e+02 4.759635390632801091e+02 3.906394436831866415e+02 1.429809070192997211e+01 1.291403342651797104e+01
1.240844281405149445e+02 1.551755915917005950e+02 2.552623805630653919e+01 1.997104876167621512e+01 1.879947295274703833e+01 2.997870132953248046e+01 4.465730607872109204e+01 1.169463247492333835e+01 1.572030145915786647e+01 2.353600838308326892e+00 2.963710959126204969e+00 4.348174680424972571e+00 4.561833988049676769e+00 1.523595260143434515e+01 4.039451322495396113e+01 4.935962413580036809e+02 8.456074016999436935e+02 1.103569724759520341e+03 6.836863045761588182e+02 4.692295870841078340e+02 3.012699149452254233e+02 9.862927289299398126e+01 3.515744195760192525e+01 6.862344932090206839e+01 2.266392322427180375e+02 7.100134543492762873e+01 6.223729382725933590e+01 2.094624917900253536e+01 2.376466934644499318e+00 1.944661126778344240e+00
2.756855371294607835e+02 2.271785659401381281e+02 2.706595752467008253e+01 1.302931401989585147e+01 2.157485300722566635e+01 1.789513728093136535e+01 2.880402878403700129e+01 3.218110361189102875e+00 2.799640825427331503e+00 1.162582509348799809e+00 2.653254971221849168e+00 4.839257460543144873e+00 6.098337535981140256e+00 3.071342778455074551e+01 4.724068910314007042e+01 2.778480880627077454e+02 9.157382193174596523e+02 1.553126093575588129e+03 1.609058167319839413e+03 1.273994911707883603e+03 2.443418191928254544e+02 4.939131096079341177e+01 5.586630173484694950e+01 1.261022164902003624e+02 2.613615435209032398e+02 7.229680645842739750e+01 2.645040852906931406e+01 9.822271288074436058e+00 3.044104162335991681e+00 2.718445312921614843e+00
3.689010298380119366e+02 4.960269339539456723e+01 1.482031313052917909e+01 5.319631280509349303e+00 6.718898644609783588e+00 1.552968068841818550e+01 2.079453110227564139e+01 2.422135516190297988e+00 1.372659404752782475e+00 1.522402425461932385e+00 2.597024013146614685e+00 4.279823959591637639e+00 4.579451999169940279e+00 2.364801398688242529e+01 8.607503458036467237e+01 3.892809709208203230e+02 6.859025333113718261e+02 1.445646381602051633e+03 1.674252373504755724e+03 1.293118126057916015e+03 5.776701171012223313e+02 2.999394861846657534e+01 1.938973417369755481e+01 3.966730414243273373e+01 2.184452909877572608e+02 1.254254408523928532e+02 1.091297163616235650e+02 2.005471503346986140e+01 2.831033702451706713e+00 2.107084388010851406e+00
2.242292899432811168e+02 7.216428122621454122e+01 2.947962518880172667e+01 2.946596000829665130e+01 7.195372632388360046e+01 5.168576744559449310e+01 2.215628974860990041e+01 9.434966834893124599e+00 1.452676379386404193e+01 1.812388976784936290e+01 1.624638109074092007e+00 1.769547579336087306e+00 2.603192006703054062e+00 5.486462254528733595e+00 3.100774541076920343e+01 1.186225570476181304e+02 1.100434053377082932e+02 4.357704749198547916e+02 5.201066747963941452e+02 4.085700231852096067e+02 3.050248516592566261e+02 3.546765397709401668e+01 4.999864589304023887e+00 9.514196827637213971e+00 4.154833708451955943e+01 1.023688990152926408e+02 2.700650497501266045e+02 1.467856840905164404e+02 3.538070327818819472e+00 2.556784329066070782e+00
8.158637777788212020e+01 3.358242211448217773e+01 3.754855458538386870e+01 6.768828827446529317e+01 4.056670972260305774e+01 1.906887573553780868e+01 9.075047840602067595e+00 6.632933559403787704e+00 2.158897473759957109e+01 8.002592697483817119e+01 5.238859180970451668e+00 1.746411027708481889e+00 2.787730244637828037e+00 5.684185272246025988e+00 2.520400065130402822e+01 4.239717634631278997e+01 2.706177908126546328e+01 1.253943147030119221e+01 1.858981947032338766e+01 3.142866747504379532e+01 5.085865261363004208e+01 1.069236071171817493e+01 5.150395691801066711e+00 2.577780942091656158e+01 6.212459599122500009e+01 2.180430622261891926e+01 7.386302901392042486e+01 7.958723811880577159e+01 2.735421310218404756e+01 4.025974496574516337e+00
8.276806938442874184e+01 6.891492258372659307e+01 3.515590924696596176e+01 2.757796748721002444e+01 2.817142174865904281e+01 1.108418025576747112e+01 7.580179973214617561e+00 8.081073967303304073e+00 9.166561781636133333e+00 3.502249469870305632e+01 9.504803237499590551e+00 8.722195615164929805e+00 7.770149435297023288e+00 9.018659966798050931e+00 2.447074985619984488e+01 1.617632252062155374e+01 1.054456452484762607e+01 6.115280030062995031e+00 5.232958866825867084e+00 3.877981577537133795e+00 2.953124957057156941e+00 4.147418525565148784e+00 6.374431468388404909e+00 1.559382742685114742e+01 2.689319349274703796e+01 1.269581913693717823e+01 1.987484006441627216e+01 1.273360994755501352e+01 1.244832843543051837e+01 7.788683151498178248e+00
1.122068245368655823e+02 6.070626066159397283e+01 3.615523400177248448e+01 5.291466108694788772e+01 5.103940974561716359e+01 2.903156949426852762e+01 1.026674340338515492e+02 8.103048469461627690e+01 1.232756876102269672e+01 8.558945631833294598e+00 2.934153807859511964e+00 6.503084688625936138e+00 1.822310786421300577e+01 1.888714942640650207e+01 5.511171532513103699e+01 3.935568187878229196e+01 1.204257844498326158e+01 1.389784702733086164e+01 6.258871526421067699e+00 2.657566088351642986e+00 2.359856674020564871e+00 3.525836903530049860e+00 5.373868735428962040e+00 1.640182766318327978e+01 1.650076517008540833e+01 3.882658462867233595e+00 4.248642249004265459e+00 5.334796531898197358e+00 1.699868094704974908e+01 3.445174826889115138e+00
1.506206976572935332e+02 1.353038526267590953e+02 4.301413250676743161e+01 1.576336078442396342e+02 2.005999227904502504e+02 3.957281696700071052e+02 2.758884977236989471e+02 3.269651022534061724e+01 1.213486669283365771e+01 6.714490719443675815e+00 1.906449420390922578e+00 2.299873019041480227e+00 2.724064236812457018e+00 1.032664085010617683e+01 1.233835685835580520e+01 5.345908525726812854e+00 5.078668822846012176e+00 5.994841913785844412e+00 7.994943224344844168e+00 4.223922561473133719e+00 2.280999303048889537e+00 3.090009038016052312e+00 3.461760550896164190e+00 5.707909956572388310e+00 1.754516028543287831e+01 2.711501364503393408e+00 3.861556911676753412e+00 6.292168858041200963e+00 7.521703070812830738e+00 1.487479366163413985e+01
8.239974006607215529e+01 2.135473709275207739e+02 6.719144100585910451e+01 7.713370143102358156e+01 4.061152347034117156e+02 4.471145715768205378e+02 3.088258384949522224e+02 2.209866453574834466e+01 1.595574350357222215e+01 1.440333193184866545e+01 5.671359287807266725e+00 2.704238839176151377e+00 1.655949655476002924e+00 2.773458893435905459e+00 1.279069256118614817e+01 3.613163396656613457e+00 1.237190144361023592e+01 7.175516686397591570e+01 1.220131945005472005e+02 1.628853503991075513e+01 3.149108119597120226e+00 3.982042029732804966e+00 3.383622895418777254e+00 3.678727807265074201e+00 4.821203116358410590e+00 3.647298413256166327e+00 4.236265354290942753e+00 5.198249527625229405e+00 6.976368006938969302e+00 1.705243934156087349e+01
