8.165511891864674077e-01 1.729504413543375523e-03 1.044996608376888236e+00 1.930586323590627578e-03 9.983152304131106547e-01 3.209413471149711629e-03 3.153871270790219172e-03 8.460714781726785122e-03 1.528783756842948607e-02 6.960173179701443016e-03 3.283852830024483905e-03 5.426230693413358619e-01 3.231561405598385450e-01 1.595090030610024244e-03 1.810495086757020478e-03 3.312395423144737783e-01 1.328860803618695310e-03 2.249202085653039841e-03 1.971296087313831932e-03 6.722623881546111770e-04 6.071677271395858888e-01 8.747328769807694027e-02 6.730718647819841638e-02 2.613661792399727402e-01 4.942480425602163718e-01 3.881379373814156097e-01 1.806424871589507597e-01 1.598047235811098435e-02 1.503363168943306662e-02 1.843104813513431195e-02
6.166877669221373370e-01 2.015636229226405556e-03 3.647045429188842686e-03 2.970070942537530231e-03 2.071308169062530905e-03 9.266285398199829854e-03 4.388753608941126268e-03 5.417302896671047016e-03 3.498838863141353304e-03 2.995368354101082646e-03 2.166734413970919197e-03 3.200851914983211532e-01 4.368527025531598884e-01 1.266934773542964868e-03 1.723244748190437201e-03 1.083565178403258404e-03 1.297695850176681411e-03 4.082920874793571214e-03 2.969260307778989836e-03 8.635674585417828664e-04 3.680260750478103193e-01 8.248044010438097817e-02 1.727234396594808652e-01 1.496759229500245758e-01 1.284775834250886095e-01 1.724499133588078825e-01 6.053941774017613381e-02 1.559320062783456362e-02 2.202439974229157896e-02 2.181117048978510262e-02
1.147299494887810134e-02 1.122660371941120762e-02 2.377141834081971175e-02 1.917741308433449157e-02 4.101933197485765209e-02 4.176684741512443413e-03 5.248502540717064901e-01 5.590639646829350662e-01 1.306776158309658382e-02 3.955329535784009656e-03 1.073006864124097237e-02 7.200792416578376091e-03 2.639664904399593309e-03 3.801034495182147900e-03 6.171201223860225404e-01 2.918811838565486469e-03 1.887377157844649439e-03 3.707368046906307345e-03 1.183386258551952404e-02 1.894548439542684606e-03 2.316229265106330981e-01 6.745257365515712478e-02 1.032369112435193859e-01 3.564573577664278264e-02 2.079933992359907571e-02 1.388187556665231720e-02 1.176278382326482672e-02 9.321099501444780888e-03 1.583331904928815537e-02 1.791040927213411599e-02
5.282374594211734775e-03 1.449232653673404939e-02 3.185421146808976173e-02 2.552883979445138771e-02 1.058699838687731515e-02 1.639462775488431234e-03 8.902241010262730292e-01 5.966845564305653937e-01 3.618791150946454316e-01 4.908366138566926974e-03 3.186950232703824118e-03 6.455294130352553714e-03 2.915695058562169269e-03 1.902818555117115167e-03 4.539242584888692478e-01 3.515013760044568558e-01 7.557143852635291870e-01 1.446894561086398264e-03 9.918654636104553418e-04 8.174071654058699113e-04 4.441700896751541450e-01 1.533462408130480681e-01 4.819232447646414064e-02 9.162794830102917454e-02 1.685987304881240642e-02 1.248232540910520875e-02 1.036338056652557835e-02 9.844223737906479879e-03 1.970523170987937764e-02 2.177583654123221857e-02
3.033587236996893814e-03 9.004603871231340456e-03 2.507425248873963036e-02 9.711871764738786578e-03 5.611565971597463724e-03 5.657099919365758955e-01 8.668898593667252461e-01 4.825951942930492566e-01 2.212545710971328128e-01 1.136461643689278510e-02 1.445391598948315981e-02 1.266944363164947650e-02 1.865842270982951724e-03 1.489280519211000527e-03 5.298708514488772447e-01 1.973535472528230028e-01 2.418363992784184919e-03 1.348902299091709429e-03 2.117998473341201580e-03 1.176291822433513752e-03 7.848539458050759294e-04 2.501162303315185853e-01 5.585193475495101589e-01 1.517849548027009887e-01 3.022670495020506054e-02 1.653206275384191265e-02 1.141342363803347221e-02 1.329925370753752382e-02 2.057210227529247468e-02 7.725599253211985762e-02
3.002067376811513172e-03 3.018159958259462091e-03 1.350661065247103776e-02 1.079624291298892508e-02 4.291884564614065721e-03 3.262406337781844634e-01 3.944200263099880144e-01 4.201104846588178954e-01 3.861712495248458277e-01 1.763942389618247675e-02 1.418597058438896344e-02 7.731339636559201450e-03 5.856287564167386162e-01 1.777565598792703316e-01 1.343777733557656173e-01 2.182409965658785866e-01 1.352152521654520273e-03 3.069659917682008854e-01 1.103696554642812945e-03 3.715277069655386830e-03 4.383754165046609315e-03 2.503720707806548693e-03 7.055802370700496873e-01 9.101238729169994213e-02 4.516800877128896580e-02 4.304560317720186602e-02 2.673589324685207713e-02 1.862137456902481641e-02 2.429811242968621041e-02 4.488335424600387036e-02
2.871294069996185305e-01 4.568485607619510724e-01 4.822192838054740749e-01 3.383209873001578449e-03 1.618125423112888248e-03 2.698866173489948388e-03 4.130347397593442035e-03 2.375102050857417699e-03 2.837348225727478763e-03 3.404661070174944647e-03 2.715310531217818724e-03 7.289517233624372983e-01 3.024340993619993867e-01 1.170276703666527085e-01 6.084034287983300371e-02 1.075930118711815736e-01 6.410017942485274345e-01 3.072682069811176753e-01 1.851619437719210582e-03 2.490253390772243121e-03 1.111089798369137944e-03 2.625041447319537147e-01 1.056784665225063147e-01 8.287160148025501938e-02 3.083451798808189287e-02 3.183144145399387920e-02 2.763853598767313652e-02 2.432435635547279887e-02 2.805529753466663376e-02 6.859322368720810470e-02
6.296098226201418679e-01 1.701457976029344121e-03 6.684804871148006811e-01 2.079721659164515159e-03 3.137611177943565484e-03 3.508677625883395868e-03 3.116402408762521982e-03 2.943356682563649102e-03 2.366815895519612436e-03 9.209611534931584353e-01 3.741164329251714382e-01 1.815645514093005859e-03 2.494236627413318197e-01 8.235743466584986849e-02 8.344281923034892190e-02 1.525618369254563844e-01 1.654980961032093004e-03 2.618360962006269915e-03 2.275421639914390701e-03 1.591671458078593952e-03 3.843295170830044460e-01 1.855507364457184560e-01 6.380122334172433352e-02 4.989592076814612642e-02 2.352572656380031574e-02 2.473317373683260254e-02 3.804473702616784775e-02 4.857963737061188336e-02 4.930609539509738654e-02 1.485288268878796336e-01
2.604657007837875987e-03 1.080791759111289885e+00 6.361566526133908273e-01 5.603476255449254227e-03 3.538165251899647208e-03 9.861310859822476349e-01 4.738210825570206459e-03 2.110590954304960437e-03 1.758434624458659386e-03 1.782946077786319149e-03 1.629615160482721353e-03 2.195555087963225321e-03 4.803334878752765248e-03 3.069226399691813486e-03 3.069469918318038504e-01 2.790821318484765778e-01 1.683409466203090749e-03 5.038155053496768537e-03 4.902080069379676983e-03 6.620709446784753816e-01 1.071165017442701484e-01 8.420577772349210899e-02 8.056005624692406941e-02 4.956166104745743373e-02 2.867194210994566950e-02 4.406372378264479528e-02 1.650027631108192949e-01 3.356115703682903684e-01 8.239568958752370963e-04 4.959736460531305458e-01
4.495205906092004759e-03 2.905509690316051413e-03 4.585475139359659544e-03 4.226118227309817732e-03 3.619387984290422557e-03 4.643817402240765224e-01 3.207372839978643933e-03 9.341280137069986056e-01 3.959866650932455934e-01 1.481096555116863389e-01 3.123749752229972206e-03 3.080552130419292409e-03 6.563139680301609269e-03 7.095857690211461455e-03 3.378055000438481750e-03 3.668354282127104637e-03 1.933875313218996403e-02 1.971606484079060570e-02 7.794103816318682931e-03 3.401805863267771870e-03 1.365483696709188233e-01 6.559984054317651025e-02 6.768209764518476335e-02 7.103632205435111979e-02 3.870095668307756837e-02 4.975205137133219269e-02 4.669080394076805529e-01 8.031332773021264693e-01 9.014278354473868361e-04 2.681329895443548272e-01
3.838964811061974791e-03 1.990452877004648784e-03 4.368417080568360450e-03 3.644597964457721440e-03 4.553307267056513549e-03 2.733367007040423680e-01 2.306886951817414544e-01 2.014788770729516176e-01 1.267743624530547897e-01 1.556916084607627964e-03 2.471021509635794658e-02 4.147264937443416455e-02 8.642447956425590438e-02 4.313437548469336441e-02 8.043491192569437662e-03 1.576706113009828172e-02 2.893893586702023235e-02 7.907874930951261025e-03 1.865366981573859766e-03 2.768658638345249945e-01 9.536029678223875705e-02 6.674240257480838767e-02 7.949930189303612560e-02 1.081115499626329329e-01 1.134477405842689579e-01 6.105108234922204669e-02 9.615378597067388011e-02 7.675874516777608791e-02 6.838233438625228311e-02 4.925435499693767843e-02
4.406859116997954851e-01 2.581423849727395026e-01 3.572871740716706320e-03 3.452656900066017505e-03 2.656930520809041782e-03 4.010707640804719309e-01 1.561544484774485264e-01 1.002062681565613900e-01 1.238302955795440585e-01 3.029606965851912997e-03 7.416585304389111850e-03 4.861951731389688169e-02 8.793919685996257063e-02 4.641561140611979996e-02 1.708526059016185830e-02 1.948495290006835301e-02 2.146311838110012693e-02 1.264403428786669767e-02 3.107050065530591459e-03 6.019067040978306471e-01 8.940285134710952708e-02 7.951222886558875769e-02 8.997905905756534151e-02 1.592566319779589734e-01 1.511979641197596091e-01 1.070576915424599346e-01 8.145733676268887558e-02 7.259842617313433388e-02 7.619609474163938079e-02 8.088700004432740343e-02
8.492056661320385169e-02 2.187630927351675858e-01 5.335235656117640612e-01 2.330707847184092414e-03 9.970695732076630957e-01 3.172587410081892934e-01 1.623348981312617845e-01 1.355233205561683640e-01 1.704612606396125885e-01 1.512072797681546189e-03 3.950296246030933212e-01 1.536513319099152078e-02 6.512011161123576475e-02 2.839571348826119834e-02 9.120054305784235441e-03 1.073174186292530710e-02 3.990305323489044126e-03 5.887783438772924843e-03 6.741336847196733456e-03 2.524727922350137720e-03 1.085928893440094994e-01 9.753318626866042118e-02 1.175588680959372967e-01 2.014729556345344896e-01 2.637404605472707386e-01 2.476488440502302990e-01 1.827799524714738277e-01 1.618188185902098564e-01 1.199896785839006247e-01 9.121631211629767366e-02
6.728838462237912710e-02 1.936438404481261033e-01 3.572579288480304816e-01 2.627721148275229401e-01 1.571926988176735041e-01 6.257496688306907195e-01 2.958193812935037883e-03 2.416464161751633033e-03 2.559229757147373774e-01 7.611926545328639993e-02 2.991711338721805280e-01 2.457212294011878496e-03 2.931991821881342608e-02 4.060361258721169320e-02 4.442646359444428483e-02 6.135224852321120859e-02 5.601772988574095502e-02 3.672773900169525735e-02 1.012589772648154612e-01 4.764214001674382110e-02 3.941206914445480325e-03 6.849552032881169872e-01 5.160763494767544035e-01 2.126063848766897128e-03 4.936756576315246003e-03 4.592504114992589093e-03 1.241784453061374818e-02 3.850418319673647345e-03 1.947080617648326850e-01 1.852026746926900835e-01
5.829894078790793382e-02 5.891176509007643031e-02 1.665339602492164617e-01 1.846361555307640505e-03 4.743927517825907714e-01 1.127045082826822059e-01 1.970984698864464840e-03 5.564081238607110000e-03 3.662053585824888782e-03 3.077812960851172841e-01 6.457975968658853372e-01 1.208871524602252862e-02 2.579454498853376437e-02 3.343461550315884878e-02 3.089367061222255545e-02 3.815747060792770706e-02 6.646757235306050005e-02 1.171212893436908431e-01 1.218313309498862684e-01 9.812460023030089573e-02 4.229031722997968201e-03 4.441693158839831942e-03 3.919665005223500580e-03 1.229508508481777680e-02 1.758446569440143964e-02 8.915958078248728547e-02 8.808903246299698564e-02 1.701678565632893173e-02 2.257729638380770731e-01 1.341226272704913736e-01
5.029543725428986534e-02 5.521413421266277433e-02 1.301014164699510756e-01 1.487825600624211320e-01 1.019635216723800836e-01 1.176957068123855032e-01 8.367269026199125603e-01 2.986480396321520431e-03 6.120506825536040085e-03 2.124696534641552087e-03 2.141561844867269186e-03 1.831703071846484121e-03 1.425827779152880059e-02 2.957144601973775086e-02 2.825583265661650578e-02 4.417858128576600263e-02 7.842292658904900793e-02 9.810276759222077980e-02 5.862610490158766396e-02 1.318391265543058383e-02 7.982295041134752217e-03 5.506468010303174065e-02 8.000731353334851470e-02 1.337710006171145549e-01 1.242176466016453734e-01 1.592268950672852956e-01 1.258921942769623270e-01 3.520194748258685669e-02 3.526682950082483115e-01 1.588311008000814484e-01
6.174497694139532977e-02 7.189746898086667171e-02 7.256250753001491915e-02 7.151363334040797270e-02 1.137412433863317224e-01 2.408992205721600111e-01 1.733303800627375088e-02 5.784551821530908855e-02 2.813450392745121473e-02 4.659161230849548016e-03 3.350105832818196273e-03 5.068051703192584523e-03 9.981934185624584746e-03 1.505013679016627137e-02 2.025597754739752107e-02 3.695750827094636953e-02 8.241817311066572393e-02 8.685202206448389139e-02 4.306487944721954647e-02 1.529958656898296535e-02 6.615964476614549783e-02 1.198611255286396449e-01 1.536814725628274925e-01 1.567862937726423322e-01 1.358771702415808857e-01 1.151665430010358759e-01 1.682309720748303428e-01 2.916460923388443718e-02 5.232669120216635328e-01 2.228478294059458298e-01
1.489875413845252461e-01 1.180327862211086321e-01 6.282685324158157614e-02 1.018199754840194426e-01 1.603046949414505679e-03 8.206725859952232471e-03 4.605900616496218236e-02 3.762358598868811854e-02 3.700476504242992265e-02 1.800885716941415943e-02 6.384048323126043957e-03 1.659004143450104607e-03 1.612066084161432704e-03 4.242250373614565861e-03 9.709998347099953880e-03 4.532531326755100121e-02 4.981726381554363314e-02 6.149792393437752969e-02 1.126901182002198673e-02 2.061702901882712935e-02 7.327749192695648395e-02 1.586101304586895466e-01 1.962982732836199840e-01 2.015568480508312388e-01 1.630564204181815802e-01 1.541152101298943200e-01 1.422410356970644218e-01 1.127486769909068209e-01 5.001801004894331631e-03 3.296171578348313334e-03
6.679321203718364963e-02 1.867422266417885224e-01 3.530552324695812594e-01 2.801399641929959699e-03 6.155591351846310087e-03 8.729997764342483160e-03 2.771727761973586529e-02 3.462006794969357815e-02 2.377452895311026743e-02 1.810790469568916705e-02 3.734356716168008884e-03 3.876702074547880295e-01 5.802312721504176984e-01 1.572146522304049363e-03 3.463855882006774967e-03 2.072003731698398785e-02 8.268164925417051739e-03 2.788462453560939039e-03 6.369688375161923766e-01 7.326868309128183390e-03 2.790146013209174672e-02 1.488399372740217830e-01 1.892194303789195842e-01 1.978119898091207085e-01 1.434410027671838284e-01 6.596634085150271387e-02 1.063192352381614886e-01 7.296409375291831867e-02 6.578253884954986946e-03 2.596316801150792830e-03
2.054405320398331163e-03 2.578624075420435802e-03 1.686107039426492510e-03 2.037552999408304144e-03 4.672318672329027478e-03 2.659272159266948439e-03 1.369472068961050462e-02 1.759350010522675242e-02 1.619271000745694730e-02 3.794906480717958296e-03 9.493051540697299614e-04 2.294921779707544962e-01 3.922142568883784652e-01 1.061056195335971898e-03 4.258542082364061461e-03 2.891001076818588197e-03 5.540573653715758634e-03 1.724204512531338782e-03 3.387124867237431211e-03 1.649209610216043759e-02 8.904037186052816966e-02 1.696446930879295378e-01 1.836536312013629935e-01 1.758231826224037897e-01 1.354864603394278777e-01 9.933591972542836490e-02 9.619226457754126436e-02 6.480346796647011576e-02 5.833697006859225528e-03 1.063936231697786061e+00
5.657853137159891965e-03 5.048002034809993648e-03 2.535734874494293377e-03 1.771117799984946129e-03 2.226140664176697297e-03 1.171662345605146895e-03 6.599063111424294768e-03 5.800254940248895583e-03 1.576795632334284953e-03 8.675927970790488523e-04 3.841371390939521957e-01 3.013748197747673219e-01 1.761022063825716522e-01 9.382961934775765900e-02 2.338108180419280480e-01 7.588783310017169770e-01 2.973824298617888141e-03 7.139421061581874110e-03 7.211454126170941704e-03 3.326591906124843484e-02 9.169015769572021191e-02 1.346058864975704095e-01 5.552716605101989944e-02 8.452452218648920379e-02 1.102182274794133998e-01 6.279184344835440912e-02 4.696185177525144527e-02 3.856656845627357694e-02 6.957298985393779445e-01 6.346680379973340669e-01
4.540467948091047798e-03 5.054685601562408995e-03 7.679107799855910965e-01 5.673482049722389231e-01 4.984152240014846358e-01 5.663892162644189581e-04 7.920484346287820238e-04 2.791352726410393226e-01 3.652034034763121939e-01 5.658325614229509776e-02 7.348893765545908008e-02 1.109776260013591032e-01 1.210203517471052370e-01 4.187223422362127412e-01 1.081479072250925719e-03 1.444910778945251301e-02 2.884179877456979901e-02 4.372181353010391042e-02 3.122476181957417607e-02 2.436753424899667370e-02 1.757083654203889928e-02 6.406700243789298192e-03 2.520400702930779887e-03 5.522171529216611703e-03 2.027768956395373592e-02 6.930498479320939056e-03 6.433988478213678586e-03 1.043197097685401697e+00 1.196841112931822521e-01 9.789981838343979337e-02
9.445792031420388590e-03 6.987494241259558682e-03 7.989965553511592100e-01 3.668853620560558193e-01 5.686385394780992808e-01 4.534500542647511567e-01 5.172781664368951123e-04 7.679786265226529185e-02 6.528402969335166117e-02 2.807677625551363229e-02 6.616530963392185105e-02 1.244105672404329510e-01 1.640088870170817725e-01 7.620941442453041219e-04 1.313196596797802998e-03 8.567237605925859950e-03 3.232909960535037402e-02 6.256720242855565162e-02 7.354811986253116662e-02 6.620151212319042022e-02 1.450310950572512164e-02 3.320309941145120191e-03 4.200347655931044831e-03 1.038891792200905689e-02 2.334953958901344814e-02 6.941927183087918604e-03 1.277634112695374524e+00 4.949715689369266203e-01 1.560923896540306888e-01 1.400701400332113322e-01
1.143060554741174434e-02 1.419501939858938602e-03 4.239602529472437098e-01 1.478230714150664260e-01 1.753465546611148174e-01 3.905958075744285773e-01 5.093614071460891290e-01 5.764821344320079921e-02 3.202720070861028029e-02 3.679189083045202036e-02 6.481016797412408881e-02 1.100850390649388277e-01 1.239646786132240636e-01 6.791435595533611425e-01 2.457199083387919154e-03 1.254791339931353444e-02 2.491175574419014424e-02 5.893635603062001571e-02 7.615271482187191410e-02 6.662435341276318201e-02 3.449427875470940930e-02 2.052490929586720664e-03 8.938444195221710853e-01 3.261907319212167203e-03 1.889123522254734094e-02 1.137925130146376709e-02 1.033091607053498659e-02 9.255380969790847345e-01 1.417872568180561788e-01 1.088475850328648881e-01
6.391367785752277708e-03 1.957280152709770654e-03 7.423824373493507264e-04 8.051724861038296321e-01 1.513487527639986599e-03 1.004320091249024131e-03 5.400742148256019171e-01 2.236256389390117449e-01 3.371382664622787351e-01 4.358159003886153959e-01 4.033475754867683893e-02 4.521668952145677794e-02 7.035491830496294619e-02 1.589706649033419683e-01 8.925077375885898806e-04 3.914541401313463911e-03 4.053068265300378836e-03 1.779256316987743933e-02 2.339961644727612394e-02 2.081368792060789980e-02 1.826559571689759243e-02 2.449270580740860702e-03 2.342788612714844509e-01 4.440318550063138137e-01 3.384898523117210040e-03 8.471267061120210662e-03 2.287745228989138818e-02 1.299015990644012894e-02 1.722288581867846280e-01 1.299025822769805660e-01
2.301326163618492258e-03 9.026329896011617586e-04 9.340238621637145244e-04 1.600296677908155359e-03 8.514663767012313478e-04 4.756167412894141688e-01 2.209183607937300620e-01 1.569832789359398018e-01 5.001800143750110283e-01 1.347855167402997947e-03 1.297677270356664136e-01 4.449140515446518840e-02 7.516493169895499538e-02 1.647743573956219620e-01 7.801819285521836012e-01 1.402750238722802727e-03 9.338118694103061390e-01 4.528597041038722182e-01 7.002843500401584320e-01 1.577752838925654180e-03 2.936336781269733263e-03 4.718327258813490577e-01 2.363411630008349640e-01 1.194700460326803215e+00 4.754046690811889082e-03 9.640678806536233658e-01 5.900695261322468077e-03 6.676260627233550522e-03 1.313678765933009807e+00 2.011454910633553028e-01
2.334205062689517860e-03 1.849982362801184076e-03 8.745591572661543227e-04 7.504432782408765323e-01 7.244736990738719351e-01 2.765496050999814992e-01 1.845258394268119440e-01 1.912018233897967434e-01 2.124485012869249401e-01 8.409285095106278085e-01 2.354599168990341163e-01 2.221550426551272550e-01 2.095126192317200431e-01 2.610023596977841254e-01 7.561279561840703600e-01 5.300136264955632726e-01 3.634186513767004301e-01 2.207483094320209505e-01 1.971285331525326479e-01 1.522289946253567172e-01 1.207207019679795018e-01 1.757427115720227584e-01 2.786528327957030204e-01 6.959904413865602990e-01 1.222177260814779398e+00 5.855675941799847184e-01 9.357587210006191869e-01 6.005238817575407895e-01 6.030667974682517585e-01 3.884590087863333263e-01
3.163692369523977456e-03 1.627224642309053632e-03 8.994088056561333651e-04 1.249478435531011693e-03 1.069255037251932517e-03 7.240891061734792133e-01 1.862450995534224588e-03 1.362741232237135768e-03 2.859258888432889556e-01 2.056416614227208894e-01 7.271663055254729002e-02 1.656789358013389668e-01 4.916329140793879171e-01 5.468177549466410881e-01 1.586755679395579531e-03 1.302053018260989573e-03 4.149320489449702665e-01 5.013242960006152327e-01 2.356417180917901311e-01 1.033365646306219354e-01 9.370301698982484717e-02 1.427930166785529309e-01 2.216819361713881775e-01 7.043989743368561651e-01 7.374120945684659034e-01 1.794546544627947937e-01 2.018758588833017564e-01 2.559217086188919632e-01 8.156083043468911331e-01 1.698926775936210887e-01
4.213188820161289233e-03 3.597319841651890407e-03 1.072051898522172978e-03 3.715397925493043804e-03 4.197543101071665554e-03 7.683220480519055255e-03 5.008363624472240462e-03 7.742210919929500834e-01 2.821444840891166317e-01 1.617091247671250120e-01 4.737290769211172786e-02 5.874876926887501183e-02 7.368041574127479065e-02 2.993859862893862300e-01 3.817818668254098213e-01 1.751216370852357318e-01 1.745391826353714371e-01 2.130276500592910849e-01 2.942606480936281743e-01 1.618627510499794364e-01 8.780969183159606506e-02 1.189158082182565912e-01 1.332425711953538483e-01 2.337053162057655120e-01 7.647440940660493736e-01 1.242802720304306829e-01 1.833966068005476457e-01 2.991212571517587460e-01 3.507541424641265060e-01 7.145480677432027861e-01
2.262370542606503658e-03 5.528844937896394002e-03 1.686231107861457888e-03 1.794366664128287450e-03 8.470682982643759976e-03 8.738318335711838664e-03 5.691136983253790305e-03 5.321222285711345590e-01 3.786369854301224191e-01 3.562949242671638039e-01 1.458937568015102049e-01 7.212993486995218639e-02 4.679308763157137563e-02 8.389789268858696691e-02 4.125352452440541606e-01 1.234084890155210390e-01 4.487967759760053132e-01 3.399776967390578854e-03 6.544809016389221967e-03 6.750951197077834642e-01 1.318862878689454343e-01 1.664239878106663906e-01 1.411659448318265120e-01 1.616835845054542531e-01 2.239092640189850048e-01 1.774501285198427092e-01 2.132819127626899292e-01 2.635929726910628546e-01 3.442898323119620851e-01 8.657449400490717650e-01
