3.648918554019365823e-01 5.545279385783472570e-01 4.776854867677016725e-01 5.987216372127853736e-01 4.488895467529028238e-01 9.847931688574474984e-01 9.765197866891071055e-01 2.651095523030723378e+00 4.861696930351669721e+00 2.189781348982285269e+00 1.031018608034755202e+00 2.383572397824495204e-01 1.434196704732444705e-01 5.657062626122342230e-01 7.038923166590718150e-01 1.669026322348899083e-01 6.377800319415950492e-01 1.214976937477697749e+00 1.210675755887590022e+00 4.657369709502345301e-01 3.827447423192472109e-01 5.691149469481579515e-02 4.539003454484638600e-02 1.849882207040544069e-01 3.670459348934159149e-01 2.965374074662278647e-01 1.420953912544984932e-01 1.265734743713765008e-02 1.217865692281670277e-02 1.554569971467165135e-02
2.775164073834436307e-01 6.360622488180320833e-01 1.137924152942420886e+00 9.209570529508187553e-01 6.369060197579536897e-01 2.861871363580689387e+00 1.376151569315729795e+00 1.729533660852293098e+00 1.152330324312506482e+00 9.849720273903752599e-01 7.171024876349002541e-01 1.437311632765257419e-01 1.979310186910770986e-01 4.763264916992667186e-01 7.025916406024237393e-01 4.835596526549551522e-01 6.505095811800182259e-01 2.332649544547890752e+00 1.955261272367140535e+00 6.506806118866577116e-01 2.396508485651475395e-01 5.547854340249826904e-02 1.205505819444605414e-01 1.107392107106896506e-01 1.017029353412580023e-01 1.430667760572589264e-01 5.375164709972481830e-02 1.358138989281579972e-02 1.897345285534216691e-02 1.874848440406094371e-02
3.313938465853030202e+00 3.498519723340035359e+00 7.401492887441242452e+00 5.968487311810795504e+00 1.276874387353260687e+01 1.314573223734657237e+00 2.511638370300479650e-01 2.726731334332582191e-01 4.533951440131532173e+00 1.386472701578938205e+00 3.799741760387067124e+00 2.612102510723234516e+00 9.994411012535070471e-01 1.536566106715308910e+00 3.078199006872970878e-01 1.376503207950229957e+00 1.003385511530463736e+00 2.274200433231704288e+00 8.492807959318827926e+00 1.577630192021109101e+00 1.567060470936190164e-01 4.720964526176509718e-02 7.515124231287267920e-02 2.772981978334977324e-02 1.768104547630862736e-02 1.266056748741528973e-02 1.226325201955123789e-02 9.109616162370699419e-03 1.462789681249315223e-02 1.574979279351084241e-02
1.576503035427831101e+00 4.672800949643622914e+00 1.027015623451431559e+01 8.249328262629207487e+00 3.415877416873722705e+00 5.311748449829092333e-01 4.280579096046854826e-01 2.860725776734879822e-01 1.766877066069333091e-01 1.630351192449917885e+00 1.046663704618020496e+00 2.115290364452973026e+00 9.948946174700598055e-01 7.119317312937631925e-01 2.225945016303566282e-01 1.812872761885225004e-01 4.067783687484704536e-01 8.233557030748820393e-01 6.432521381816845851e-01 6.019315412837423773e-01 2.887540781896326680e-01 1.037019665336216534e-01 3.400188583487897404e-02 6.966523153439616034e-02 1.397794994324594829e-02 1.117692171093576624e-02 1.043641505038809224e-02 9.199021314815225905e-03 1.718889629669555219e-02 1.783380466487270721e-02
9.446423130338119645e-01 3.038456298984912429e+00 8.463979398220704553e+00 3.276189918755607167e+00 1.897704169256885232e+00 2.766377973091552755e-01 4.196933312347132516e-01 2.317052904142339609e-01 1.052852677914795226e-01 3.565503057171397483e+00 4.359744233032630589e+00 3.711542733871262101e+00 5.656630097815322777e-01 5.085279915235599857e-01 2.563175110875717255e-01 1.019079352817569700e-01 1.160355981958562932e+00 7.058484094760504313e-01 1.217841965080475708e+00 7.443922484182816657e-01 5.459033970876508990e-01 1.618825316163227113e-01 3.786442680160756469e-01 1.102645299642175530e-01 2.372764039784837006e-02 1.400759371095675748e-02 1.054886739960523255e-02 1.141986925526289158e-02 1.647961317749658747e-02 5.805041381883891544e-02
9.862668063269819374e-01 1.082716744093265904e+00 4.832584525905385675e+00 3.862423619194274238e+00 1.543560370994619069e+00 1.625449780836700497e-01 1.925208251339164955e-01 2.015749303886302524e-01 1.833112423558408977e-01 5.287570741638901950e+00 3.977006400219750937e+00 2.051188903241129236e+00 2.394405597551814424e-01 7.846288638086675038e-02 6.424339703298620474e-02 1.130244029852961879e-01 6.187164469595468619e-01 1.673262499949674520e-01 5.686424331020115686e-01 2.056392102686031009e+00 2.682982030813320318e+00 1.713169678076387425e+00 4.594092737490410583e-01 6.307591231506183560e-02 3.370062821964130845e-02 3.475586717605304299e-02 2.339062985313927756e-02 1.512422271832507964e-02 1.840231823525552077e-02 3.185629203495627532e-02
1.373301403294028000e-01 2.307755899381222775e-01 2.442596295940210327e-01 1.242348628151154211e+00 5.975791844658819851e-01 9.710648793484671915e-01 1.422176447521485754e+00 7.872529907039526043e-01 9.072569454296537383e-01 9.964082275782135678e-01 7.287330523374565550e-01 2.897248664880998081e-01 1.207132074176098524e-01 5.051956265449108335e-02 2.861672255887276126e-02 5.511785246366389390e-02 3.358953819208922442e-01 1.628134102107774983e-01 8.566465827582000481e-01 1.216211423171105421e+00 6.008219809243720011e-01 1.550330195863975358e-01 6.555124109391276266e-02 5.462541137072404046e-02 2.190305913571164928e-02 2.459746387643200680e-02 2.326962327484925763e-02 1.897840265342675553e-02 2.041455535968155974e-02 4.683135734242800663e-02
2.727754016222178612e-01 5.228218094136227734e-01 3.093327512274237079e-01 6.763154914040074850e-01 1.050110316981456515e+00 1.173786375941461291e+00 1.026510720155475509e+00 9.614263750487065385e-01 7.706295349707488196e-01 4.122789352801810026e-01 1.591435509552457384e-01 4.738020136676394656e-01 1.007141299616133856e-01 3.501092174848243616e-02 3.763358613375879236e-02 7.316612107417283517e-02 6.279764297003582740e-01 1.039722620933174912e+00 9.517977858427364435e-01 7.111374043974022507e-01 2.084574963688962668e-01 1.049718842080790693e-01 3.778204055047554299e-02 3.119021031667628882e-02 1.568308068560047772e-02 1.771909307622416760e-02 2.925840072244993012e-02 3.497499167087017580e-02 3.335906715327510014e-02 9.488013823136834390e-02
6.697997332076998100e-01 4.491361033018684279e-01 2.688951998586212588e-01 1.598892176070761950e+00 1.070744370860488015e+00 4.583793655962226099e-01 1.487422886344627271e+00 6.755853323485760953e-01 5.796824947612919665e-01 5.493567058604794662e-01 4.728558862307879473e-01 6.046450501441462677e-01 1.308185513278165013e+00 8.736433883912305687e-01 1.332984712556458673e-01 1.245781450702555249e-01 5.595988721874627370e-01 1.773104273531017405e+00 1.839654988102511712e+00 3.260843370901870819e-01 5.493703039348477729e-02 4.511061880530802676e-02 4.518817383184709630e-02 2.916418375330996279e-02 1.780670257260871456e-02 2.913505543718569735e-02 1.159690120618750708e-01 2.236421330385792994e-01 6.233331674909097231e-01 2.992250183978807376e-01
1.053823213326732233e+00 6.881894240925960915e-01 1.125923158362921672e+00 1.086012227571735878e+00 1.000558984892458536e+00 2.032844471076596660e-01 9.668222497023098994e-01 4.242356759225114349e-01 1.859796135271438444e-01 6.732422519320478693e-02 9.572967457467772556e-01 9.045895046835976672e-01 1.880874676704005433e+00 2.015189200444451600e+00 9.575662269801336057e-01 1.038441351778902177e+00 5.739277942038095937e+00 6.234763706317257181e+00 2.661213163389229752e+00 1.271056699529806044e+00 6.643333110562935073e-02 3.330114394763306063e-02 3.595743617464544628e-02 3.930101145070002272e-02 2.238709138221041048e-02 3.040574789788331317e-02 3.012480336052310581e-01 4.974990020256331857e-01 6.008352141454351703e-01 1.538387140215593807e-01
8.816722853383972547e-01 4.572805062363597406e-01 1.041298788269668041e+00 9.131080462559871824e-01 1.219866755291473259e+00 1.164147012688542121e-01 1.013833032857209687e-01 9.186371720231895077e-02 6.059583214926358985e-02 5.287575375149927703e-01 8.044175321428431502e+00 1.300566768633556514e+01 2.610271198245273183e+01 1.246233829655592906e+01 2.237904217347912006e+00 4.228953492698638073e+00 7.997461188067400251e+00 2.299511085688382472e+00 5.792720333171647029e-01 1.229550620029314228e-01 4.373022226661919809e-02 3.171502339589708785e-02 3.926817899594901157e-02 5.499532008859107923e-02 5.965924259462491303e-02 3.354971774180123129e-02 5.536500695691123214e-02 4.308304899604826349e-02 3.771865739702861403e-02 2.654612492491210951e-02
1.689853187220096420e-01 9.906819507338229802e-02 8.777544902383092040e-01 8.764162075746163572e-01 7.097928659731778112e-01 1.701817916577779699e-01 6.878937544624770528e-02 4.612611239858050577e-02 6.009559224070593064e-02 1.095243210539998069e+00 2.566849423319472301e+00 1.614485757546211175e+01 2.787364504450080815e+01 1.381064949856894408e+01 4.813331591755527938e+00 5.186155045783425344e+00 5.705942827043654297e+00 3.415041647258527657e+00 8.616607750340270488e-01 2.506716677422837769e-01 3.789611616493981927e-02 3.437847008992554049e-02 3.985484867610974979e-02 7.161317186189587736e-02 6.909805626570644788e-02 5.021700650125498350e-02 3.935205146105296564e-02 3.525877376120406526e-02 3.736171678853622558e-02 3.975329482620305194e-02
3.345957347694219347e-02 8.657620904381077565e-02 2.107749807690383614e-01 6.018617804424380990e-01 4.041622237533344930e-01 1.329212925916279930e-01 7.087702207326791737e-02 6.229556801363404089e-02 8.315494335294271178e-02 5.840385563729306728e-01 1.881692864973573964e-01 5.479887614253681427e+00 2.188121263903384772e+01 8.765394044780178362e+00 2.609797431926579758e+00 2.848146034575227858e+00 1.025280300976486147e+00 1.481709784294752197e+00 1.675634636119040621e+00 6.310431878078222034e-01 4.298387860494305712e-02 3.883318253322668584e-02 4.728666378257098679e-02 8.123398648431430502e-02 1.066311284993941844e-01 1.012462978359253002e-01 7.598873585604698500e-02 6.920303271348986207e-02 5.289590531142614183e-02 4.142650206338443358e-02
2.733029849329545249e-02 7.890384630893805540e-02 1.429592528221590164e-01 1.045395343270013322e-01 6.278794394735036366e-02 2.575029885276844954e-01 9.412007139829248192e-01 8.755370503778333591e-01 1.239978359581874745e-01 3.742623099456476171e-02 1.474584912414210747e-01 9.529538669195940503e-01 1.056828457912359553e+01 1.309419096322865883e+01 1.298528142890608272e+01 1.632869718666692904e+01 1.392747706271310548e+01 8.616105639638499625e+00 2.264686098200542119e+01 1.036962964463427639e+01 8.674358214433188774e-01 2.531787343579144922e-01 1.912383763041682616e-01 4.765814715154781389e-01 1.087004463534729792e+00 1.010890833790972776e+00 2.805013846483892515e+00 9.539015485254715987e-01 7.866195893217102497e-02 7.886704923849079119e-02
2.527679805355215192e-02 2.552297773837082853e-02 7.013606100171468349e-02 5.273977018985550602e-01 1.942454211064915670e-01 4.695689972095951764e-02 6.416375375636388378e-01 1.978269684714741183e+00 1.433840119719651307e+00 1.482311819865331504e-01 3.179871555743029599e-01 5.030087831482009442e+00 1.016692201690799102e+01 1.175190730505484993e+01 9.762716406595327356e+00 1.091500278519056444e+01 1.723281488595413435e+01 2.779953090947212857e+01 2.674283843781350711e+01 2.046200370127001023e+01 8.770072325306983441e-01 9.170177974089818163e-01 8.082518247371971443e-01 2.479797471707983814e+00 3.473625785899216556e+00 1.765665993540667955e+01 1.794600078299436774e+01 3.791934298655096569e+00 8.805023438595703522e-02 5.460430357623149988e-02
2.288568107935387563e-02 2.512588620961399982e-02 5.752420385380853374e-02 6.414485484802577575e-02 4.325711725678395986e-02 5.028083457002787554e-02 3.629910023370384597e-01 1.055170328487982756e+00 2.282145505509892924e+00 8.485902160036602471e-01 9.114029453330835251e-01 8.247581247268650495e-01 6.241191242878485035e+00 1.157211242943121832e+01 9.958538569847060984e+00 1.407514772723139096e+01 2.194006776800294389e+01 2.431511915084642084e+01 1.304597061541925029e+01 2.722638725978495877e+00 1.617435513685495430e+00 1.094638026577171885e+01 1.569934527207360553e+01 2.577448188144869690e+01 2.379855525821696816e+01 3.117470031511297890e+01 2.560559928119642947e+01 7.640658853258242900e+00 1.366014763326679760e-01 6.289349679364142354e-02
2.885560128488408316e-02 3.373725121837215651e-02 3.342838701202893725e-02 3.229002739381067744e-02 5.040927705710011170e-02 1.061280329972757314e-01 6.184918225052090435e+00 2.091380844630935698e+01 1.049641367339240361e+01 1.887921830155841807e+00 1.497776146313495982e+00 2.514705297775448933e+00 4.939340426475386181e+00 6.647669925201920016e+00 8.047936028989177260e+00 1.330975251258897352e+01 2.514305567136078068e+01 2.263980303956831364e+01 9.798638915388025339e+00 3.158709908705125358e+00 1.315702104253036531e+01 2.309380121400176478e+01 2.899833467752601379e+01 2.916224113949035868e+01 2.562548100241650673e+01 2.262321245737981101e+01 3.465362785721043792e+01 6.202691109196982744e+00 2.031101567025862809e-01 8.645086916214890504e-02
7.176254441710216980e-02 5.711748341249277272e-02 3.000126716112840389e-02 4.814566795721445663e-02 6.508300378989541057e-01 3.289487169928132726e+00 1.807659962780978447e+01 1.478936230904965754e+01 1.495502925746500011e+01 7.860240453118394477e+00 3.093616503012354357e+00 9.197539764752582503e-01 9.052695693413400635e-01 2.122164832757234887e+00 4.371164458651495721e+00 1.866232586491341294e+01 1.673507969356620251e+01 1.705761105049876036e+01 2.648688923534609607e+00 4.288024420595070829e+00 1.441974573483893352e+01 2.990720781106885440e+01 3.591043743704844360e+01 3.655196490863130521e+01 3.037563257683294538e+01 3.043796548146143621e+01 2.978869928373206122e+01 2.370262805647066173e+01 1.061441766726824554e+00 7.024471301220469588e-01
3.249618212531876077e-02 9.176107780827318094e-02 1.747192527680498930e-01 1.268686948473124687e+00 3.011230636230461055e+00 4.311014670184381004e+00 1.352408220328560695e+01 1.696279676904697098e+01 1.196274485960910461e+01 9.615207249743532358e+00 2.124206130500572609e+00 2.208949530894521451e-01 3.292539101176509830e-01 8.476055047807536935e-01 1.686272045956241916e+00 9.216537434577249499e+00 3.048718527153676749e+00 8.592352255886028800e-01 2.554487286785928624e-01 1.683070539067548443e+00 5.995803347441260200e+00 3.029364791953629776e+01 3.692051234471786358e+01 3.731674972389261313e+01 2.689129735707247804e+01 1.255902002526487848e+01 2.079976019412876198e+01 1.432702104266729037e+01 1.299582963315832895e+00 5.146935507965294532e-01
8.392273235062658321e-01 1.129768253318641502e+00 8.034030311435683691e-01 1.073540237316098711e+00 2.770410091579469380e+00 1.641801820102246845e+00 8.561710486939869469e+00 1.121220539924510007e+01 1.061563772108876691e+01 2.526016962122912712e+00 6.436616048730203765e-01 1.380332709680758552e-01 2.320681457192277919e-01 6.269596891275371897e-01 2.291991498704402108e+00 1.432073477616254698e+00 2.297724965496546368e+00 5.996107517126731956e-01 9.942014721982098679e-01 4.226012694898450661e+00 2.109503346994261008e+01 3.764901428991262122e+01 3.845548401943681682e+01 3.472051514210988188e+01 2.561251979417925284e+01 1.835988134792284043e+01 1.773280002846282599e+01 1.198659627660240901e+01 1.083473197627191187e+00 3.859549852711917084e-01
2.488748317170979885e+00 2.440885099751795906e+00 1.379010277892977143e+00 1.105426263624505800e+00 1.625734001725921196e+00 9.188620116671174509e-01 5.394037386273931034e+00 4.973577442256144288e+00 1.413873945557681200e+00 7.438256171042666454e-01 2.489254566260397650e-01 1.927410281892139310e-01 1.096489711942958550e-01 5.679479370530344379e-02 1.388867595650403741e-01 4.416337003132826400e-01 1.387486267135753071e+00 2.799381636791556272e+00 2.395506289915845244e+00 9.644606059642256923e+00 2.429588098492204296e+01 3.289806651192692755e+01 1.264323468060498179e+01 1.753964753598749127e+01 2.110834003889494070e+01 1.133293176415765480e+01 8.242830754983321739e+00 6.792860429304671044e+00 2.494227080464590796e-01 2.250079936243187806e-01
2.096045342815767043e+00 2.589899210042712507e+00 4.267973985891549971e-01 3.343103042195452734e-01 3.146716880100818847e-01 5.014212704464219295e-01 7.467094989481573020e-01 1.952635203892843785e-01 2.628550109733068241e-01 3.951405117430713265e-02 4.979890082480314950e-02 7.322530276333995281e-02 7.714434378029845496e-02 2.591247635059041876e-01 6.913089351248877801e-01 8.437880043235852057e+00 1.418156830022919479e+01 1.822743413967160464e+01 1.115809729437063247e+01 7.660729656483456829e+00 4.999263590123497636e+00 1.665256688039862709e+00 6.017029121529784419e-01 1.177361846541614909e+00 3.899476952858318857e+00 1.226312415675183898e+00 1.082235208077257704e+00 3.652570257730678449e-01 4.135853085507593119e-02 3.367568824322995924e-02
4.590869869414374804e+00 3.741969730288654983e+00 4.495076814351335881e-01 2.171852272142244245e-01 3.605288915693719010e-01 2.994511866119101140e-01 4.822648143784081798e-01 5.387963389695663019e-02 4.685921614183713446e-02 1.948091046865660370e-02 4.447457512906480281e-02 8.133295705438872703e-02 1.028745122890031422e-01 5.202051435556540593e-01 8.026337793970257373e-01 4.713869118143006354e+00 1.522888023764991239e+01 2.538100055165513780e+01 2.597831316420457881e+01 2.067771700088308506e+01 4.060427940793615242e+00 8.375971735428945353e-01 9.551019027213023538e-01 2.149654832076504984e+00 4.460807146992706862e+00 1.236252004743052524e+00 4.543588953133739228e-01 1.690357196220015901e-01 5.226157310358078845e-02 4.653576771400790013e-02
6.051545707974732125e+00 8.054591102963581939e-01 2.439030717885072308e-01 8.813948913542010710e-02 1.120243736295733344e-01 2.592938534169116904e-01 3.476751984075405200e-01 4.053397016661799968e-02 2.301303067831783969e-02 2.553471115461754606e-02 4.353150119421403397e-02 7.176357583533442275e-02 7.707437313244160093e-02 3.992823442280953317e-01 1.457513128236860078e+00 6.586589080082569936e+00 1.135876649414487360e+01 2.351889804172157028e+01 2.690851417975174442e+01 2.085768071439325411e+01 9.536292843123668206e+00 5.050405178195016553e-01 3.288273184333326271e-01 6.701266882983668571e-01 3.687863640128339782e+00 2.116687413235816884e+00 1.844406975941449423e+00 3.390318338969569578e-01 4.797432844965669047e-02 3.568726959975120072e-02
3.631515454501509144e+00 1.157780875925251030e+00 4.810212378989076609e-01 4.859120291449631757e-01 1.198863788459963109e+00 8.642299428959673291e-01 3.712904793174842677e-01 1.583684699644800353e-01 2.439995602609626724e-01 3.041954591651682138e-01 2.721564208693607809e-02 2.958499225057709819e-02 4.367413366528124369e-02 9.224553185170397684e-02 5.224301497575999376e-01 2.002026563065280040e+00 1.823977472019179702e+00 7.096252455245261714e+00 8.354535400513054100e+00 6.576962190189338919e+00 5.015705414486161473e+00 5.934656719990586415e-01 8.419245728927556016e-02 1.593717294150724384e-01 6.942706936183603572e-01 1.706206754024482963e+00 4.501177165810774206e+00 2.446296318511224754e+00 5.910452121297642136e-02 4.288267877402233280e-02
1.318269423636133197e+00 5.376668670065256617e-01 6.110754388661513437e-01 1.114884298384396288e+00 6.756506115351397224e-01 3.189266883853690837e-01 1.521764259820490017e-01 1.114167643005160024e-01 3.626670071487774760e-01 1.342917474170922665e+00 8.769361159902284986e-02 2.915741731836789946e-02 4.664327377054355850e-02 9.536873120253946956e-02 4.235799465497836480e-01 7.144222477372916824e-01 4.504536614156009477e-01 2.060456207293257236e-01 3.014876268983515684e-01 5.084166354006476318e-01 8.334602134701902809e-01 1.768972710642632284e-01 8.557357275997522217e-02 4.276869924149948599e-01 1.031117553814292265e+00 3.614629245807147728e-01 1.225265452074985717e+00 1.319318977289398731e+00 4.540295398379015079e-01 6.706533702403957853e-02
1.336530148158437958e+00 1.103808867006917493e+00 5.722656904610301520e-01 4.546454008722113360e-01 4.697543359226861170e-01 1.856049640535907264e-01 1.271754674751011116e-01 1.357492152589832857e-01 1.539809582337379190e-01 5.877516138506380106e-01 1.590421672601566305e-01 1.455004740516577244e-01 1.298140070281814107e-01 1.505689978293251186e-01 4.089632159665830824e-01 2.709846586387078538e-01 1.743956547147116620e-01 9.989970729861152865e-02 8.444795788187535457e-02 6.237607162156540846e-02 4.783827600996124613e-02 6.753431897077044610e-02 1.040179610916831393e-01 2.551832626426379091e-01 4.431871374533039032e-01 2.106630511350801593e-01 3.316131547347096475e-01 2.116043905494095767e-01 2.065476695512160621e-01 1.292278550886243049e-01
1.810268990076497664e+00 9.719408624188433654e-01 5.885194618112259413e-01 8.730289966647234445e-01 8.513631929583171942e-01 4.860026342681865175e-01 1.721982742158517876e+00 1.361166528780178409e+00 2.072584217142511287e-01 1.437381678757639059e-01 4.911229174288365279e-02 1.084852407238151434e-01 3.043487913313880355e-01 3.152190360797111901e-01 9.212107050284346066e-01 6.590844905190188507e-01 1.989333435906769920e-01 2.265677290273169775e-01 1.008327714282353654e-01 4.261450412650918951e-02 3.791873883774883602e-02 5.671161870884065814e-02 8.639241564283461905e-02 2.652534693229822715e-01 2.700587198892671625e-01 6.429577292773003272e-02 7.098702137201556850e-02 8.862733104000539153e-02 2.812351172637227448e-01 5.693201602871523354e-02
2.434708582474861771e+00 2.169470486761421402e+00 7.002331261129184359e-01 2.601234587954295296e+00 3.342249278251246292e+00 6.612351094441810240e+00 4.623732959978074319e+00 5.492497362890699231e-01 2.041119974329305420e-01 1.127424065428277583e-01 3.191450388177533015e-02 3.837082531552649112e-02 4.550000621645203247e-02 1.721291938271984900e-01 2.059806561603670372e-01 8.926285915614386168e-02 8.323672895224316914e-02 9.671860791236974730e-02 1.277250421840346595e-01 6.718794110467862790e-02 3.634032580885946523e-02 4.906778742118868275e-02 5.476763146032993801e-02 9.124515634303145828e-02 2.851413643086709859e-01 4.474180066487895568e-02 6.437627313161337073e-02 1.043488863264387806e-01 1.241724706732950240e-01 2.451722522174020202e-01
1.355032837057504880e+00 3.473702912180306690e+00 1.104253472954932480e+00 1.280688531453777701e+00 6.786694371849428364e+00 7.509416550238688259e+00 5.219092744477148216e+00 3.755981288274887753e-01 2.719945725967983785e-01 2.444026322283009978e-01 9.577788954720603543e-02 4.542046267101730594e-02 2.779016512649186768e-02 4.656146621682939746e-02 2.149088223817676169e-01 6.063872847922424647e-02 2.034520553016759825e-01 1.159191444056184572e+00 1.952080995519839934e+00 2.596480987296648224e-01 5.038254367962216596e-02 6.352248940420469892e-02 5.386240280135063535e-02 5.897059411923297190e-02 7.824905695362058267e-02 5.982978745996882924e-02 7.007149961517510073e-02 8.585591644642190379e-02 1.148617015697026011e-01 2.812148278549879143e-01
