3.588328508046016441e-01 5.040593508942618067e-02 4.135225621258233342e-01 4.058475304814703616e-02 3.755811140653021463e-01 5.255886427574656822e-02 4.403141655006950761e-02 1.193373749801604766e-01 2.170153897906732243e-01 9.831906557147027104e-02 6.076657591572723338e-02 2.350567934271740878e-01 1.504739434592190506e-01 3.836991100866082860e-02 4.258999644073366286e-02 1.617584322952041742e-01 2.903181468167803647e-02 3.623371522034969650e-02 3.781668761076940888e-02 5.465228674916702278e-01 5.051024949980463807e-01 7.636016912330191586e-02 5.835720810184330531e-02 2.324784248305440115e-01 4.495813552600257390e-01 3.503397168730454925e-01 1.592463833394215655e-01 1.396973626365680121e-02 1.330090247216234728e-02 1.669615368483644627e-02
2.333306655333815538e-01 5.328468370455061165e-02 6.462349167590250576e-02 5.825154718649944857e-02 3.366917829826771014e-02 1.620229969926801905e-01 7.255013931868135868e-02 9.097760609764213302e-02 5.524767402532695243e-02 4.433726418579760770e-02 4.026887941527729220e-02 1.195516744980617552e-01 1.760054783870528272e-01 4.218692686714023421e-01 4.422027528348024261e-02 4.444607603243731497e-01 2.838651911531537425e-02 6.801454011192728522e-02 5.821553398600235602e-02 2.292379852568998677e-02 2.913300311084378036e-01 7.358972738841035310e-02 1.527212920701017385e-01 1.360992510403261357e-01 1.201666526425213960e-01 1.599023724378391964e-01 5.550427331713202184e-02 1.409872235608169294e-02 2.005041620420476220e-02 2.003159410628737799e-02
1.689573885657421337e-01 1.687339110420016386e-01 3.291110507807090135e-01 2.683965820501511557e-01 6.190336807025575983e-01 9.601752057975365684e-02 2.002115641275130087e-01 2.104967259510082955e-01 2.469844645137143635e-01 6.055870865733653519e-02 1.619267806219330808e-01 1.178555592216696674e-01 5.314470016916321427e-02 9.342138463665486392e-02 2.736490699560939488e-01 8.253376758291568194e-02 4.587122611192086946e-02 7.128818607382025885e-02 2.082626448721306145e-01 4.355790975356964301e-02 1.803458968844650068e-01 6.089730868117119306e-02 9.322477687689380288e-02 3.238503022452049462e-02 1.915044374907296301e-02 1.249153572183369851e-02 1.103167889536161954e-02 8.670212987680690764e-03 1.479490776956612040e-02 1.658863239485837415e-02
7.171526775513603624e-02 2.049273391915810705e-01 4.496621987904492745e-01 3.648474851866756463e-01 1.781331171512977318e-01 4.068894005177550732e-01 4.048438883611290562e-01 2.518006814846431851e-01 1.368293528364823708e-01 7.661225439852475949e-02 4.640138597754449312e-02 9.338632515306929949e-02 6.374897717800961927e-02 6.470152823386970953e-02 2.114648997941611652e-01 1.832478399958625548e-01 3.940730938126899563e-01 2.747140230992504636e-02 1.716524100704052910e-02 1.683157063081662172e-02 3.157942448137709412e-01 1.262053091077194600e-01 4.361079823421085827e-02 8.600085571271025298e-02 1.565891062960747537e-02 1.107868717577402753e-02 9.411027602519030089e-03 8.932055002701978774e-03 1.814098642302395051e-02 1.970656898009300745e-02
4.141378007934960748e-02 1.288778410266683827e-01 3.599213590940424368e-01 1.397881745931810471e-01 1.019624882138109034e-01 2.382810266390247289e-01 4.155460210054952586e-01 2.340529904651245385e-01 8.621858438520615953e-02 1.803612577345787560e-01 2.070631042440465031e-01 1.955913877825480041e-01 4.662593770651588670e-02 5.190834090715714666e-01 2.742408874305504174e-01 1.102115005614334176e-01 6.373296996426948413e-02 2.712547704147761848e-02 3.892750873601554668e-02 2.249904044879996040e-02 1.720470055877486304e-02 1.650852866797486440e-01 4.272637704606071507e-01 1.409402732789755142e-01 2.822990477496483894e-02 1.486495064638116564e-02 1.025802104544612861e-02 1.186437251813489760e-02 1.856110641671471218e-02 6.823579335688963188e-02
5.422191914132218349e-02 5.783813638053030004e-02 2.271072096018446895e-01 1.661612511787458057e-01 7.480593628044426846e-02 1.345324333861074029e-01 1.715399147003048574e-01 1.827111053631000348e-01 1.481958319735421636e-01 2.683184652082297728e-01 2.208185234608548153e-01 1.410459168000123831e-01 2.348794430622294094e-01 8.816461051156618267e-02 7.409761292243104147e-02 1.248925005644581365e-01 4.168580668630331165e-02 1.663126124307811315e-01 2.156180333092697077e-02 6.391585446204384180e-02 8.659211359497319405e-02 7.792932624487457216e-02 5.231254879762509136e-01 8.180346261737239666e-02 4.203558622781400356e-02 3.900072629177595701e-02 2.428821432952598877e-02 1.675455803031283136e-02 2.212353550263905164e-02 3.977041348345523863e-02
1.306722615217638106e-01 1.991011857961525466e-01 1.954032146194893682e-01 6.389185002435282534e-02 2.554509607009721600e-02 4.917407947734724755e-02 8.543912269546778682e-02 4.791225286638817193e-02 5.825048751739847486e-02 6.453366582113352623e-02 6.471870304573344723e-02 2.815083107280811348e-01 1.322440008018978541e-01 6.132256783075757528e-02 3.571737366619349291e-02 6.159722184659226912e-02 3.486842331175004084e-01 1.564865048845467954e-01 3.475190009204835728e-02 4.828929361634849704e-02 2.750891257595601200e-02 1.624244929887377897e-01 7.644187385336108365e-02 7.342703399086236704e-02 2.841975326816637004e-02 2.910761479300385743e-02 2.563432339073775865e-02 2.215298984023087933e-02 2.539441188908147379e-02 6.033359798637816240e-02
2.720279568769443657e-01 5.058734987206378042e-01 2.798333391076736620e-01 4.250553870565308007e-02 5.144493268253457624e-02 5.782391866249417950e-02 5.110314818589357239e-02 4.250835252161967726e-02 4.105415145893616391e-02 3.684593537123322937e-01 1.590885009659477045e-01 5.102449406408532395e-01 1.118844233547803407e-01 3.985092546222245014e-02 4.511343654256701197e-02 8.350677135522312222e-02 4.132909033074062821e-02 5.552441983787292923e-02 4.259686305162584119e-02 3.420355556984208678e-02 2.285007512748304381e-01 1.346506044784146761e-01 5.450322701306229561e-02 4.572114187793863138e-02 2.178621910044971008e-02 2.271956068126373268e-02 3.523778055046386526e-02 3.972360265136892082e-02 3.933646290553804992e-02 1.138602633460559788e-01
9.055360407386689459e-02 4.191691500496747547e-01 2.425120546002795807e-01 1.035174375870283048e-01 6.007309751808552478e-02 3.567936080826045186e-01 9.862657332900907903e-02 4.232302379717761687e-02 4.185192223357790675e-02 4.710495748840892033e-02 4.921624732947630365e-01 5.990687273698184351e-02 1.013641084506989865e-01 5.403893573496335034e-02 1.446417193353892183e-01 1.216989696253882591e-01 2.801229040042353680e-02 7.586601751791408055e-02 8.204041089678520970e-02 3.046770654973873782e-01 6.072511823135851028e-02 6.336087189589822977e-02 6.901178015941820953e-02 4.516211918991165641e-02 2.645493846905641599e-02 3.970480735911915970e-02 1.476807947802865617e-01 2.610118979491907187e-01 4.144360331111421325e-02 3.494384314074459597e-01
9.025266319660499303e-02 6.318350977335079888e-02 9.981090188047306300e-02 6.440467388641794855e-02 6.319702937264337628e-02 1.709676564342538785e-01 8.446466788149938065e-02 3.697453097100232289e-01 1.720410252347157887e-01 6.350286594030238319e-02 6.284491493229338310e-02 5.631904889370659140e-02 9.006031001797591695e-02 1.028381333062169667e-01 5.040484506213004090e-02 5.496570666962627416e-02 2.798781467343200435e-01 2.830435983748406659e-01 1.300292683349017209e-01 7.055092588447911539e-02 7.775288315362992309e-02 4.919885458579861121e-02 5.651188204517509223e-02 6.213626998392236811e-02 3.469807705841505829e-02 4.378758772232123342e-02 3.984547542029701628e-01 6.010539129422602933e-01 4.304057476205127436e-02 1.839489125443845852e-01
7.952788082851182383e-02 4.174530421464182073e-01 7.331976117867569642e-02 4.930980044725521982e-02 8.337206671957156368e-02 1.073344410405066285e-01 1.038259934622803166e-01 9.338789164169353230e-02 6.363609036220105319e-02 5.098337367440801682e-01 3.783754861525168156e-01 5.785801606988589807e-01 1.205535643476651542e+00 5.925064105325237307e-01 1.087903392583707551e-01 2.140259563143116495e-01 4.003959068766735352e-01 1.108715229467913399e-01 3.170925125972531844e-02 1.267502908123832872e-01 5.347062821747686212e-02 4.783194320300142299e-02 6.186436041427118004e-02 8.662871136775307512e-02 9.258893394874112559e-02 4.998978107680754346e-02 7.765977150942542095e-02 5.755724745903281064e-02 5.088288206918379492e-02 3.615401910570819471e-02
1.854142782893709318e-01 1.015584702885998641e-01 8.897751362756714522e-02 8.375832110411707276e-02 7.090088216464557336e-02 1.744270195937616674e-01 8.072576182416990598e-02 5.533281496588596249e-02 6.564686532688843168e-02 5.765323452568410501e-02 1.169085295370538985e-01 7.072799252408812354e-01 1.257663523743332012e+00 6.474071504504537167e-01 2.314547103042316478e-01 2.600919303019271211e-01 2.874399195064980539e-01 1.692493665045670115e-01 5.064279560287147236e-02 2.887736652003767279e-01 5.113363803126029505e-02 5.217542447211084844e-02 6.179141628742050585e-02 1.105883602414840516e-01 1.050614613635816041e-01 7.476404709745966548e-02 5.733409951358980905e-02 5.214790726242632402e-02 5.703726431902982758e-02 6.181956204592319037e-02
4.393514751705680788e-02 1.056741303826488482e-01 2.376581534240512772e-01 1.080018395787370189e-01 4.309291932215574827e-01 1.472814161103641606e-01 8.134876531734730465e-02 7.048112795319731727e-02 8.988818557700760381e-02 2.805876565082065718e-02 1.741237671430358180e-01 2.315014629189105499e-01 9.396776033447734600e-01 3.995357817370618903e-01 1.244405897390272603e-01 1.428953467347224282e-01 5.268479146750557063e-02 7.721391528734522502e-02 9.997992540562589125e-02 4.079258435085765522e-02 4.899197088081520129e-02 5.383721178888198344e-02 6.830179630471018559e-02 1.135897613410395968e-01 1.439562728168649608e-01 1.258138599021053627e-01 9.287396062793520923e-02 8.820561002728248556e-02 7.831028450867980051e-02 6.554300317342048876e-02
3.802131399864525779e-02 1.074840120524472031e-01 1.891797451062213198e-01 1.362208273196551522e-01 8.086291596264685855e-02 3.138312982738417634e-01 8.533572075678473590e-02 4.493807845411998403e-02 1.262016923469763685e-01 4.147259715956143344e-02 1.482434719138781554e-01 4.078833295579964435e-02 4.309123528648985957e-01 5.761335217770723327e-01 6.070092687152629507e-01 8.102003100366584887e-01 7.278744719632662674e-01 4.728270873024995047e-01 1.292403227321261561e+00 6.047315921107188075e-01 6.248496095115874116e-02 3.203494851609820504e-01 2.416595882823982799e-01 5.760463991824013030e-01 9.371569630106282855e-02 7.075335100890427220e-02 1.830829845162294522e-01 7.031548855610544879e-02 1.076162532185598597e-01 1.262657817866816023e-01
3.615183466057078632e-02 3.612054817786969352e-02 9.784843062031245431e-02 7.305347051761649224e-01 2.662114061787158592e-01 5.909826205672608079e-02 4.752999490024888141e-02 8.407190081023820094e-02 5.928983923369375575e-02 1.585525616525232384e-01 3.268039515072858059e-01 2.011451383321603281e-01 3.862229787582445173e-01 4.857795606069773009e-01 4.346479025112459094e-01 5.202499841480653364e-01 8.864771822954551350e-01 1.532436127202288834e+00 1.559575548565462988e+00 1.223545272994004840e+00 6.104930356998176932e-02 7.073491777572310513e-02 7.003252298225648431e-02 1.939493929387173798e-01 2.555354273941006227e-01 1.152395441922009045e+00 1.157637539161038065e+00 2.580704314048102299e-01 1.115365348885128949e-01 8.648597065429482200e-02
3.350981795411185626e-02 3.635504635539726220e-02 8.096054437377042667e-02 8.937300386497838700e-02 5.975142935175267733e-02 6.240322118859122080e-02 3.456264560746521997e-01 4.282629482130034110e-02 9.052666374519485748e-02 3.514934935716201858e-02 3.657808822427179030e-02 3.034416724105988561e-02 2.191428377956487483e-01 4.404329110514365597e-01 4.076359232467015037e-01 6.203734144047684529e-01 1.072994108986176087e+00 1.302868948526272552e+00 7.515798324479595616e-01 1.636211136699575464e-01 9.878834420897711355e-02 6.832521409473246710e-01 1.005131031355401827e+00 1.698585478598500620e+00 1.613717888579571769e+00 2.131081297853685719e+00 1.723233960495462291e+00 5.213340732093104668e-01 1.628609241500038607e-01 9.617026683237921147e-02
4.298503796023726842e-02 4.944599736778923504e-02 4.788325181612070047e-02 4.462613827207154160e-02 6.399571198116102422e-02 1.079035777762679255e-01 2.565906760093658590e-01 8.314951104292311879e-01 3.957725234290835892e-01 6.784353171253253156e-02 5.041631291934052517e-02 7.904301924880671737e-02 1.564990449380282977e-01 2.296261916354567223e-01 3.021396749321155206e-01 5.402563291063354756e-01 1.162438241633310998e+00 1.165964745342580544e+00 5.499577283066156008e-01 1.886960863670574529e-01 8.212684291599972042e-01 1.504750199780167108e+00 1.948935693299622240e+00 2.020890560142262871e+00 1.804962624354659706e+00 1.586038018034996000e+00 2.379578582362546157e+00 4.267455783497398070e-01 2.141530862646215672e-01 1.157842410819934775e-01
1.068089073753654139e-01 8.375489383185730219e-02 4.070506962409802670e-02 5.673264314478874970e-02 2.973594483283873227e-02 1.242416849386085709e-01 6.692367179247866726e-01 5.441878502113675076e-01 5.357619454899914535e-01 2.677370106474247224e-01 1.032399831642608345e-01 3.131198509374395755e-02 3.053800485986297997e-02 7.362016324836058445e-02 1.493109737879876053e-01 6.860155253302052669e-01 7.179615830831245216e-01 8.461095853221898277e-01 1.467121461759602341e-01 2.588415123842768284e-01 9.112986957963973289e-01 1.990840531006067948e+00 2.476050567017219262e+00 2.597697446622773576e+00 2.180769329592331829e+00 2.150480702140782352e+00 2.033326543784108598e+00 1.616756654313988406e+00 1.020958940688799915e-01 7.248325535203496706e-02
4.191713063434180514e-02 1.155016425231598365e-01 2.016929861279710134e-01 5.224390341028452983e-02 9.869953944773743326e-02 1.364941483316260973e-01 4.306086142524779836e-01 5.387277889718640189e-01 3.689602337831053847e-01 2.863056320885292161e-01 6.775569742373059590e-02 2.150046952012863444e-01 3.230507186147363319e-01 3.308385883627230212e-02 5.481956159748209434e-02 3.226914591075753513e-01 1.223129928800364419e-01 3.953914213475015482e-02 2.453327940755585246e-01 9.538357930794733042e-02 3.587979876871165708e-01 1.920986339706639567e+00 2.440699113774768669e+00 2.585320623443574828e+00 1.920648177551305569e+00 9.092353175241149055e-01 1.500423928191688239e+00 1.020008052417829658e+00 1.542679668525439862e-01 6.564369923062884915e-01
3.493763688035196602e-02 4.936837135648716041e-02 3.213490245742956636e-02 3.662754358781823705e-02 7.784241370317540598e-02 4.465734117762126809e-02 2.288023603540181861e-01 2.946829060824793234e-01 2.701265706935895849e-01 6.938601583695627739e-02 2.350395240485451259e-02 1.485922656365649963e-01 2.530255621546878553e-01 2.733882504035028277e-02 7.569068932180923748e-02 4.930899606337372371e-02 8.727056832868025638e-02 2.538870957800243300e-02 4.727556882333513316e-02 2.231145726427078146e-01 1.182871580201186212e+00 2.237478882543874725e+00 2.398311371877193121e+00 2.305993529537264219e+00 1.804393348830200861e+00 1.348255228893999291e+00 1.328467576542770257e+00 9.237235600702585758e-01 1.712973142411606808e-01 5.275928362113526671e-01
8.474099545874574924e-02 8.504478561555012250e-02 4.951705237386841429e-02 3.993294156396538092e-02 4.941705899850849792e-02 2.325557961524617884e-02 1.205313338204813955e-01 1.122699299954011687e-01 3.117074055521047715e-02 1.915342937126472342e-02 2.547748013748902807e-01 2.251339039214353965e-01 1.249080275292152042e-01 5.776120350543719612e-02 1.237054432904895335e-01 3.642506857666551467e-01 4.933968157579578240e-02 1.082808228794928662e-01 1.034309024998875948e-01 4.593880440937526677e-01 1.247465700966779778e+00 1.791594090294029273e+00 7.225368705412021919e-01 1.097847017136606373e+00 1.446691162804045749e+00 8.366935551480447764e-01 6.764940284697738004e-01 5.881019310412266554e-01 2.985775376780817059e-01 3.245945169664202767e-01
6.952018706854011521e-02 9.709160026875959804e-02 4.064638779616621678e-01 3.507010896576492343e-01 3.255989548842181391e-01 1.574827434948914556e-02 1.723868267196478066e-02 1.652023942120589284e-01 2.338623833833374244e-01 4.035027610210454446e-02 5.935478620058007304e-02 9.493237009138422167e-02 9.076697080289336528e-02 2.831132691654866251e-01 3.168886935704996050e-02 2.638602918688395804e-01 4.907842746908436804e-01 6.853020942224680168e-01 4.646694033632795540e-01 3.461437874638807477e-01 2.419535675475729675e-01 8.529714370590109340e-02 3.270630022845758683e-02 7.190368400213847933e-02 2.654822989197652694e-01 1.057442459351749381e-01 1.176234801315065581e-01 4.318685846914885884e-01 5.585633084055503794e-02 5.212406026242440843e-02
1.497520159291667319e-01 1.472325113545959463e-01 4.644056004322421050e-01 2.729423443340854849e-01 4.534687770160409914e-01 3.433308767171018849e-01 1.379615021216874446e-02 5.935011619481926626e-02 5.586638464031068452e-02 2.420043408652193528e-02 5.995729229814931310e-02 1.107140529586767425e-01 1.202919784273290965e-01 5.531272052620732627e-01 4.130270654259484558e-02 1.468865277957572824e-01 5.347355267193623085e-01 9.899384334555987319e-01 1.112679723111429153e+00 9.534514256212160976e-01 2.119472760274367928e-01 5.435429121311606548e-02 6.658278558445764050e-02 1.536857926876083469e-01 3.065895317146435928e-01 1.059405473381862667e-01 4.929556713826237502e-01 2.017626667622538783e-01 7.547937107141663993e-02 7.242758717460305584e-02
1.892303359435407173e-01 3.160222091997037797e-02 2.635266625893115666e-01 1.134654486703448734e-01 1.441769943493152739e-01 3.186112914766469628e-01 4.234082386278681387e-01 4.881805648464250524e-02 2.761694726525106697e-02 3.151463032667387032e-02 5.727745954182478921e-02 9.777898206162020933e-02 9.079356409498660907e-02 4.331124780871046798e-01 7.676040645820082775e-02 2.325961525914323480e-01 4.021128775119611753e-01 9.201336296345639099e-01 1.153069870976737965e+00 9.696540178093724371e-01 5.088193269989469414e-01 5.256048237552546354e-01 3.560337318011113639e-01 5.677312501043031701e-02 2.699713059632088408e-01 1.753119997165913380e-01 1.891659378075661868e-01 3.410716490343878582e-01 5.968559364785893523e-02 5.392865551937994079e-02
1.037444783132128734e-01 3.887578270623431170e-02 5.575357500576043623e-01 5.947257201941009708e-01 3.789252089115503069e-02 2.682333268660341483e-02 4.534293102160809052e-01 1.927205553148211570e-01 2.817943205675635387e-01 3.600134276485503215e-01 3.375110756087376651e-02 4.057967972366764015e-02 5.340890819822952801e-02 1.035101415136364666e-01 5.192872131777436229e-01 9.925998494026558316e-02 7.373263592027878843e-02 3.207029641058944947e-01 3.971589945843027047e-01 3.311485719221619051e-01 3.116439519201531505e-01 5.877121279685297572e-02 1.050838876191908244e-01 1.709663964724835172e-01 9.955324221565969856e-02 1.449061709908368578e-01 3.988536541302590277e-01 3.158966572329771627e-01 6.843319241044837353e-02 5.975336235499766058e-02
3.700100953756906702e-02 1.687460375016510555e-02 2.215630544441881192e-02 4.130497138275871644e-02 2.176856390051701284e-02 3.778757055892952854e-01 1.836945189269763024e-01 1.343589441085421554e-01 4.212398041534839432e-01 3.966568374178453676e-02 1.108824376850396920e-01 4.110326431375356526e-02 6.087385521720162229e-02 1.118930255195205725e-01 4.625289603815885275e-01 5.907974874947923005e-02 4.808531700210887383e-01 2.246418500929886208e-01 3.268331975544362944e-01 5.503017463312723789e-01 7.355779784765723028e-02 2.233335520434535648e-01 1.148090046101327144e-01 5.324526602209356252e-01 3.154379149365983404e-01 3.746676957154744803e-01 2.113908746292968432e-01 3.163710916203645862e-01 5.541361037534621170e-01 9.443386881521634302e-02
3.749363430438783923e-02 3.009937990395662039e-02 1.614549636101086233e-02 5.438140762123289118e-01 5.639613729871014725e-01 2.228440028532480133e-01 1.512112988562712146e-01 1.581180561367719617e-01 1.764676688984125330e-01 6.995399334546443804e-01 2.053198987614272830e-01 2.057409369509670682e-01 1.654813313967897770e-01 1.675970788420924895e-01 4.213044160419868733e-01 2.847639130727675494e-01 2.009665892828651768e-01 1.260552731191279530e-01 1.101144242420829811e-01 8.261575961084591246e-02 6.607013234514225175e-02 9.631321251163625641e-02 1.468840891599634269e-01 3.422971122723152959e-01 5.836273779369559600e-01 2.625799989777801158e-01 4.026059295816961092e-01 2.798456980109923498e-01 2.895947235341553294e-01 1.911738397775370746e-01
5.093769533020007373e-02 2.655943574730250736e-02 1.658741555948841859e-02 2.471117156759851385e-02 2.324547540784586280e-02 5.499604455871045516e-01 3.855194435380735613e-02 3.015476932843242155e-02 2.429918008535900675e-01 1.761471267638664573e-01 6.608671102640881201e-02 1.534689887833214916e-01 3.854499118598748719e-01 3.523662651187378647e-01 9.097278241378334296e-02 6.874222950996933257e-02 2.278251434142335441e-01 2.724873075798343036e-01 1.244302915096201223e-01 5.526584697958498299e-02 5.365989503656609649e-02 8.370615148645882408e-02 1.269488188552639341e-01 3.864524435090607168e-01 3.890666716622332988e-01 9.185724201228301355e-02 1.020415859649797946e-01 1.317145212814872512e-01 4.300363854799833518e-01 8.804598414893560765e-02
6.876134333944222687e-02 5.950819464787578117e-02 1.825940610083714305e-02 6.232195333032132523e-02 7.512947196067476519e-02 1.414452163360173653e-01 9.973194847262564777e-02 6.121002793170833289e-01 2.414782999719869427e-01 1.401690024670274870e-01 4.257857744900905156e-02 5.453310808168970736e-02 5.841981265512320720e-02 1.994723628825926798e-01 2.280736972604207047e-01 9.618249870215808683e-02 8.010481794566723379e-02 8.729691858333996080e-02 1.187092685530471148e-01 6.893508967082612182e-02 4.891605523866938282e-02 7.283907275539630577e-02 8.288004408860835670e-02 1.379428306364355872e-01 4.284883498688097925e-01 6.738500602597338740e-02 9.783667326012211729e-02 1.606971293888910524e-01 1.944755422540521139e-01 3.862814362874289476e-01
3.798816107425102839e-02 9.455426770892255695e-02 2.829150615135680308e-02 3.033544024543203405e-02 1.484935554708829153e-01 1.573104001799392193e-01 1.108331554145658565e-01 4.266108949456041688e-01 3.287375601913575807e-01 3.070709184426060889e-01 1.261046134917648831e-01 6.362490958739597247e-02 3.818367303463969520e-02 5.982362111615466965e-02 2.726451684041410473e-01 7.137122825543820714e-02 1.928568850757063635e-01 8.805359832961504041e-02 1.676417734264190051e-01 2.650833769508805227e-01 6.838980286771449701e-02 9.569613330839354948e-02 8.331186996394439326e-02 9.137146115032834803e-02 1.208810827990189907e-01 9.249926283141429728e-02 1.090675108353859335e-01 1.351855728495569009e-01 1.833520716386145832e-01 4.521826750552554453e-01
