2.574269233284769143e-02 3.664283513659510882e-02 3.196519327255211568e-02 4.038902751185956264e-02 3.076396729781377681e-02 6.767655969864214138e-02 6.753173751095631339e-02 1.838800683674670089e-01 3.349637966306704406e-01 1.563884010077234987e-01 7.503122594878988694e-02 1.770440986319876328e-02 1.062790709697654726e-02 3.985016379363644917e-02 4.646699509965959707e-02 1.019837865450914580e-02 3.602165582515448605e-02 6.351641924680170859e-02 5.787862469084072148e-02 2.047399391844845901e-02 1.750982051840899861e-02 9.241023602250930669e-02 7.309034151104124022e-02 8.244513426939594977e-03 1.264995234864074204e-02 9.174737539340446085e-03 1.485954725868244841e-01 1.389909488424251847e-02 1.418154180666689884e-02 1.927588511296076529e-02
1.900081543718386973e-02 4.001544816772475976e-02 7.187657428423319117e-02 5.892432168922397129e-02 4.106782872420567526e-02 1.838492678312720341e-01 8.743498257120801975e-02 1.112728113244703804e-01 7.293547745974932051e-02 6.632336121989834687e-02 4.990943175111170471e-02 1.038434130954282372e-02 1.432526784928066579e-02 3.275084863804735708e-02 4.577067259079632688e-02 2.922286511239708534e-02 3.622557300420097687e-02 1.193891343893215967e-01 9.065701051927999021e-02 2.735745535552785990e-02 1.036998909371155894e-02 8.749703711816562979e-02 1.890891510496670869e-01 1.508877255244820137e-01 1.121157415803836488e-01 1.409739853608202031e-01 5.544502785500975139e-02 1.521037950086658735e-02 2.262977862676355742e-02 2.363553867683280962e-02
2.159878473704303636e-01 2.087620595927584810e-01 4.419929745877875793e-01 3.605149599970647323e-01 7.633227651838434547e-01 7.757485089688938296e-02 1.437648031795298910e-02 1.552532498575404617e-02 2.508703024761475553e-01 8.221114219600923756e-02 2.416209348406941626e-01 1.766316841355723422e-01 6.850527623917482267e-02 9.972424521010904430e-02 1.905254000782377957e-02 7.946700846909982019e-02 5.349806747561421105e-02 1.101923096950778863e-01 3.689215808195505653e-01 6.150262866262733163e-02 6.433882399389937931e-03 7.221861437774278192e-02 1.161004130585133742e-01 3.667458891209951499e-02 1.847360768808466863e-02 1.183666210637134009e-02 1.292727147328301754e-02 1.026244444740894400e-02 1.766713454806053199e-02 1.998520994432435860e-02
1.009918566491788128e-01 2.758308260407923984e-01 6.060443965410265976e-01 4.903224012933965481e-01 1.990578258515298127e-01 3.060194769078260213e-02 2.403747513799417077e-02 1.657059888481633714e-02 1.018819879204266136e-02 1.027678247544967644e-01 7.169919741050992390e-02 1.569598142414952713e-01 7.455182907370130896e-02 4.826064793199878744e-02 1.462700928712924731e-02 1.090569665090433335e-02 2.278525421533523707e-02 3.989369260528680128e-02 2.828734426223634274e-02 2.416704939023884072e-02 1.156581859306701071e-02 1.389116540141688005e-01 4.804692754072321936e-02 8.723327001855341045e-02 1.490450438707113454e-02 1.049058566297049813e-02 1.040809892747785771e-02 9.881606653236597870e-03 2.008001333617071005e-02 2.181642775274303045e-02
5.843523099414305727e-02 1.734441917368829411e-01 4.848560279002357976e-01 1.878353161391355663e-01 1.059621076863288547e-01 1.535254067206192480e-02 2.340047755647682928e-02 1.329157393789284769e-02 7.875461145174716959e-02 2.331191638412561939e-01 3.197156694943451560e-01 2.984451902154579006e-01 4.989214983117657570e-02 4.417664500606136718e-02 2.218896878747024862e-02 1.121600544487074275e-01 6.848287478665571193e-02 3.340406733047306120e-02 5.361303987290962081e-02 3.089457403767167931e-02 2.214118662291084810e-02 6.223342012725615463e-03 1.546628714316912977e-02 1.306302227986174125e-01 2.678955896354265342e-02 1.398076602262979078e-02 1.012137354593843630e-02 1.170109209924386461e-02 1.830292764199977981e-02 6.725585006147083433e-02
6.397062292793595506e-02 6.331836651026688523e-02 2.628284116113159818e-01 2.105655112193691447e-01 8.278760481975905305e-02 8.847005155157901951e-03 1.073547836369539640e-02 1.168869933522840264e-02 1.100622226693930700e-02 3.591322081132252153e-01 3.074135357093667476e-01 1.912349664787666992e-01 2.799235899377477965e-02 9.674638893257961336e-02 7.523180208415550241e-02 1.187020127566922600e-01 3.722467130944564356e-02 7.808553504482232226e-03 2.524022502848344285e-02 8.749810680471027668e-02 1.066023435067116332e-01 6.537621442953146789e-02 1.889848895969259077e-02 7.371475425556392458e-02 3.989870750540032429e-02 3.693169586071536753e-02 2.299049461127497529e-02 1.583398203451020017e-02 2.088049668622385044e-02 3.748611719130435366e-02
1.282975017036905585e-01 1.390864561131583375e-02 1.341688081038301672e-02 6.764059550098759643e-02 3.223949032550625649e-02 5.322829456465096726e-02 8.023874867340806405e-02 4.547959726137007497e-02 5.407501652368513351e-02 6.784063614199764558e-02 5.756800301210277665e-02 2.957792670912551963e-02 1.598705941876784054e-01 6.905262359983585507e-02 3.674944758746645501e-02 5.791369918373451969e-02 2.041480181489484236e-02 7.677150651935692703e-03 3.916087340449808663e-02 5.378206404563296711e-02 2.854255420926865919e-02 7.751499663368823650e-03 7.062642511430713976e-02 6.707158767381996012e-02 2.724360535801241198e-02 2.809376303966427263e-02 2.475105818142721639e-02 2.129282945181983078e-02 2.431634199219410986e-02 5.769709010193449505e-02
2.346584387299818775e-02 4.078042268231366063e-02 2.112865595976599550e-02 4.407941555998460409e-02 6.583434549733491181e-02 7.313088108227901174e-02 6.452829039914199927e-02 6.062747681179043308e-02 4.809793347066238650e-02 2.874762110923335251e-02 1.241566193339932629e-02 4.776942804879344417e-02 1.364304449010766418e-01 4.695553237465863866e-02 4.958563399460164112e-02 8.423703639535720655e-02 4.172515890805304772e-02 5.647536315530145984e-02 4.970567442853736362e-02 3.687892381707291722e-02 1.330064235002429741e-02 1.336704012820262022e-01 5.494606687753304797e-02 4.670426157856794047e-02 2.228573878754076809e-02 2.298596137048347296e-02 3.417203286413726671e-02 3.829934979991883592e-02 3.629081986677954591e-02 1.056033037045168710e-01
6.458972460217624056e-02 4.172825051321211315e-02 2.331754410386981807e-02 1.284948444604531170e-01 7.866093324462175573e-02 3.257605740543884076e-02 1.041987384829115570e-01 4.661044435714170597e-02 3.880598109838762078e-02 3.986445407286745568e-02 3.711000624236351214e-02 5.375365446155674215e-02 1.218147039523184705e-01 8.512299744515135214e-02 1.692013935294991445e-01 1.362270182635217375e-01 4.110746986845028456e-02 1.144657688118649597e-01 1.131773382291127172e-01 2.100112393505435340e-02 6.583383650767277162e-02 6.934207450470580847e-02 7.677873146767781598e-02 5.051592898545249899e-02 2.954578110641762484e-02 4.106692365076042295e-02 1.417332146225969147e-01 8.883133631688194462e-03 2.530725241510608028e-02 1.227699977447360528e-02
1.146385849098079113e-01 7.520020151011734544e-02 1.158419340351423271e-01 1.038378555646846391e-01 8.955236614752744295e-02 1.894582003420056115e-02 9.599249909385311474e-02 4.030441947027148253e-02 1.545758729767426898e-02 7.757775459610685709e-02 7.434038938221729231e-02 7.332914977442482607e-02 1.555395861164776128e-01 1.737263657495478342e-01 8.345946867539902336e-02 8.956167055386868303e-02 4.597486656810984562e-01 4.676379337944791548e-01 1.953873083361470919e-01 1.023133574975292892e-01 9.354624948860693068e-02 5.986371126184100722e-02 6.912296772496002994e-02 7.621134443000454617e-02 4.241758057835792739e-02 5.062636333493544805e-02 1.870691126701941320e-02 2.567715127535983785e-02 2.786850286030597215e-02 6.817383507994827403e-03
1.019956366178341872e-01 5.381662512546006583e-02 1.171734745868455718e-01 9.282288249133552327e-02 1.191032529099985693e-01 1.402794311132366523e-01 1.352370177237816051e-01 1.235805795203140794e-01 8.394307870289871576e-02 4.355304503274803896e-02 6.170517437091075363e-01 1.019836093450958714e+00 2.095977138304621956e+00 1.027514240583987215e+00 1.881438306806751948e-01 3.693516140921059288e-01 6.923312926183716742e-01 1.919707898181647887e-01 4.748773020021648805e-02 1.585231027330004649e-01 6.731942820937317218e-02 6.118973449275574850e-02 7.955143128542686848e-02 1.116417113186565641e-01 1.192308846753125373e-01 6.246143906810400215e-02 9.215020450687939901e-02 6.294450440603288621e-02 5.202125633705020208e-02 3.501287664835110724e-02
2.546796873816616763e-02 1.410651040333482098e-01 1.086843937836931007e-01 8.828764490760745987e-02 7.843378821617244534e-02 2.427944686738433763e-02 1.118829950954008806e-01 7.842725809109185597e-02 9.346213973120313934e-02 9.485243953848501719e-02 1.938629616926687282e-01 1.242529555396101326e+00 2.188142253504738122e+00 1.125196453670731955e+00 4.016360127025100923e-01 4.511684623719350862e-01 4.990189350397115087e-01 2.938180621891567923e-01 7.512801071490936289e-02 2.456493389988090650e-02 6.434914301942840087e-02 6.648918040855936185e-02 7.901217523703860102e-02 1.416831290851384706e-01 1.347779644868682125e-01 9.585247483183381711e-02 7.288624244069004388e-02 6.030622719339974458e-02 5.987254741448171796e-02 5.964607570661690367e-02
6.206986219487369005e-02 1.419527198192869766e-01 3.609607883937522577e-02 6.778630017308101552e-02 4.832364700668451835e-02 1.893792084960483624e-01 1.092155335451017867e-01 9.977890075670983738e-02 1.284407955551175595e-01 5.036315447664609785e-02 1.398958419100089327e-02 4.002907116595181281e-01 1.634470314963040405e+00 6.957983470259421210e-01 2.168550729664143750e-01 2.493091889051615717e-01 9.188703302616624269e-02 1.345480716100935226e-01 1.527280929118450814e-01 6.120652631700770896e-02 6.089709042207086531e-02 6.704087609714352858e-02 8.460734188497917585e-02 1.423946528901345876e-01 1.819421492534005202e-01 1.610317409815185674e-01 1.179600964765005477e-01 1.014317215853983711e-01 8.115612964085736070e-02 6.215640668149315096e-02
5.407371524202315982e-02 1.445895738656119700e-01 2.936555085820491406e-02 1.399903151994575934e-01 8.317188839467824779e-02 2.890985725582593743e-02 9.873555972270370296e-02 8.003720150309864834e-02 1.736339544133597701e-01 5.732242695992789683e-02 1.056454305674369917e-02 6.613934207684092625e-02 7.489559337541272788e-01 1.005460588813248624e+00 1.062215545162970010e+00 1.422420372587323234e+00 1.276369650652422694e+00 8.279254669979922987e-01 2.259673149876375575e+00 1.052102038765499792e+00 9.097124450814418617e-02 2.931860379998172880e-02 2.395025674893453554e-02 6.153667676187816321e-02 1.342261708159571409e-01 1.181321581801104137e-01 3.070881654246923054e-01 1.040768366496308550e-01 1.097831236736124261e-01 1.174188615194710350e-01
5.058029200554330085e-02 4.819206651255578122e-02 1.119898357552016888e-01 8.940485730007113885e-02 2.543051040799656007e-02 6.802388798350954280e-02 5.307005232303362713e-02 1.519584312106205259e-01 1.049145891583348200e-01 1.106320826572754386e-02 2.237537421896240025e-02 3.310107060118626654e-01 6.752704305562865494e-01 8.512975648383003247e-01 7.629608506861629280e-01 9.151132261883465624e-01 1.557119167518430158e+00 2.687151056239577063e+00 2.729099943008732154e+00 2.133606589671467546e+00 9.070976396245394868e-02 9.441860522135732403e-02 8.457121941123374453e-02 2.626845638724863985e-01 3.730859118467451663e-01 1.884991799866100770e+00 1.843147221162550142e+00 3.697614622881426616e-01 1.099677160281029298e-01 7.924592605172524340e-02
4.594606700542971239e-02 4.851242130237650579e-02 9.390289273225332911e-02 9.623151766202812929e-02 6.114933985927705623e-02 7.307019741620694731e-02 2.926596798210025219e-02 7.851039351896454965e-02 1.634633576992878812e-01 5.987502061691804545e-02 6.176840358914281737e-02 5.154582150504210397e-02 3.860001059873388596e-01 7.753655936415789762e-01 7.170444024610138634e-01 1.091111529101558730e+00 1.884276139113517878e+00 2.283375492530743678e+00 1.313997035238329891e+00 2.850349629099445115e-01 1.713760262257333356e-01 1.181427379649748755e+00 1.733744137933822982e+00 2.827893349260940603e+00 2.556713031904628508e+00 3.211094376686476792e+00 2.466198524816590965e+00 6.885254382826828667e-01 1.542283114530209331e-01 8.715850364390098637e-02
5.657584833488775444e-02 6.497238503590883896e-02 6.269371036189018420e-02 5.666364737131449059e-02 8.104328701796406631e-02 1.421538748858158230e-01 4.634322526441411183e-01 1.532367476898537362e+00 7.513003290895033937e-01 1.322321916481535575e-01 9.812473812919268734e-02 1.458974468955910875e-01 2.775761496175698784e-01 4.060591116987911642e-01 5.329205327014188143e-01 9.505615072414004274e-01 2.041106883803089467e+00 2.041035610595646421e+00 9.598482520665398976e-01 3.282998986798333352e-01 1.424055795908764077e+00 2.601824926377755531e+00 3.359634813325498293e+00 3.291250369466958148e+00 2.710400954479497138e+00 2.197124499142047327e+00 3.078873173753764902e+00 5.285794966780525961e-01 2.193732591959885597e-02 1.040750819901577751e-01
1.342032312310678932e-01 1.070066000973965148e-01 5.497551347034685537e-02 7.802639158720896251e-02 5.200732447671372466e-02 2.333568825710761185e-01 1.277752108952770138e+00 1.040612479031620907e+00 1.026909207388156053e+00 5.254080108793290904e-01 1.917614532998940802e-01 4.920724097536875730e-02 4.624273784968962325e-02 1.173294135040135189e-01 2.626873548491200361e-01 1.198783837243600603e+00 1.252676866525639365e+00 1.446139981337051239e+00 2.501518184206446560e-01 4.407132968985369992e-01 1.574718378846682754e+00 3.431154271398703326e+00 4.254403181852196347e+00 4.127341625262991087e+00 3.097141580331896016e+00 2.753560415444023857e+00 2.440778817299609216e+00 1.909830953287447119e+00 9.127181020678409862e-02 6.075241580310900696e-02
5.267006034022180677e-02 1.491891871579875684e-01 1.933346439585880566e-02 9.082285716014784627e-02 1.934693843842665573e-01 2.693811160119825576e-01 8.497003051091724934e-01 1.063417207977483736e+00 7.290543879065125576e-01 5.673014183825344503e-01 1.163369520812348040e-01 1.092996827769531984e-02 1.592255214757399076e-02 4.331570148731449243e-02 9.099773255398557747e-02 5.171814103357459391e-01 1.953024147280221778e-01 6.173836242101662236e-02 2.055471331480932320e-02 1.489758212222766498e-01 5.693357589473031499e-01 3.040537662420174758e+00 3.851321254944088945e+00 3.816942489652953352e+00 2.600946414592629097e+00 1.139389804884386237e+00 1.790049697265910345e+00 1.212754585645342109e+00 1.085966780322696890e-01 4.210128691056616579e-02
5.890448110852776475e-02 7.968766801437920932e-02 5.333764037587230417e-02 6.320939588655286046e-02 1.531169473034121875e-01 8.830644413660203307e-02 4.532514690267389623e-01 5.849316230837966479e-01 5.366314812398099710e-01 1.242990813069482087e-01 3.046438764890192080e-02 6.925780811906681080e-03 1.190417575627272795e-02 3.239917193924994609e-02 1.105772517135141381e-01 6.825029741649801807e-02 1.229432394180761390e-01 3.597678851273031914e-02 6.719392600159679318e-02 3.183871408340148146e-01 1.714494856332790196e+00 3.233933236528815591e+00 3.455658074580426842e+00 3.169438326232631997e+00 2.338470906675730543e+00 1.658639615315700588e+00 1.576007063443726430e+00 1.050047488367364057e+00 9.389678921574236281e-02 3.292870168452188828e-02
1.463700021207526847e-01 1.429566241888787503e-01 7.481648553879581554e-02 5.495427525885594744e-02 7.282489636428303437e-02 3.922874660973470901e-02 2.221217824601260937e-01 1.979745702696153742e-01 5.466577974040706667e-02 3.040658144254168235e-02 1.139800162071402494e-02 1.078488824492823857e-02 1.441518977558775838e-01 6.322342202627799501e-02 5.848157268031163765e-03 1.814951571815783676e-02 6.424241913079598021e-02 1.452287112194838303e-01 1.387365631945016720e-01 6.157104991428875573e-01 1.666388309739078144e+00 2.384869482482702363e+00 9.584717789615097017e-01 1.417541876779491838e+00 1.807506074522118755e+00 1.012496472499576639e+00 7.491012535959911123e-01 6.188023188957871845e-01 2.639637007436458627e-02 2.454516754142926568e-02
1.260606596044309413e-01 1.531958108011773345e-01 2.216076624610360118e-02 1.508371943207985691e-02 1.219716609131040255e-02 1.822812424079444868e-02 2.653165992504701379e-02 6.814452085866908558e-03 9.143362961390486682e-03 5.088322322298332451e-02 7.294135828330239324e-02 1.160244326824691197e-01 1.036736619969064188e-01 1.359207247671274238e-02 2.769057028289654068e-02 3.320038302728819946e-01 6.319079480716910391e-01 9.063633347893365055e-01 6.136825852897961342e-01 4.555092638308759212e-01 3.163532093874943385e-01 1.107613617323933708e-01 4.223693295356591160e-02 9.137809051916699621e-02 3.304910212878557352e-01 1.113434903734048381e-01 1.015532297627963626e-01 4.118978313885514331e-02 4.860980623344379054e-02 4.569804048963142795e-02
2.932620191418702227e-01 2.328544386522624909e-01 2.417263736560344711e-02 1.004369063606589882e-02 1.378837091077619176e-02 1.049342987836233802e-02 1.686190148966955696e-02 7.237536015749981844e-02 7.006436510362737402e-02 3.071061110152536328e-02 7.718175246924166566e-02 1.400348791962863493e-01 1.381181737278321942e-01 2.768739497307011466e-02 3.490274057079625208e-02 2.112036363452734211e-01 7.668526557705355184e-01 1.416851544049686940e+00 1.588731202395497144e+00 1.353546563436821781e+00 2.805898280929486344e-01 6.115572995163976594e-02 7.483124806486099456e-02 1.852287260036662442e-01 4.119851695388498380e-01 1.213485698392119116e-01 4.568686609874497706e-02 2.170762590193517361e-02 7.272042287359126167e-02 7.050841927622365779e-02
3.917849028113825072e-01 5.060847659183131952e-02 1.327867658095575193e-02 1.264350767364520733e-01 1.387853628267842754e-01 8.612156312527376525e-03 1.234678183366395669e-02 5.829677530590017531e-02 3.520174319291707182e-02 4.015804157703943555e-02 7.331464458917055782e-02 1.235405254248378160e-01 1.067845360807379435e-01 2.320866974987438602e-02 7.209307603372991369e-02 3.299695324730692603e-01 6.346429222046123808e-01 1.447933086654062729e+00 1.804684752504492673e+00 1.505069707212566277e+00 7.351581567634309922e-01 4.435966648002785673e-02 3.110805664945674731e-02 6.721035504930727988e-02 3.681582230100580722e-01 2.229652652081606234e-01 1.992813751538105860e-01 4.603196718212978350e-02 6.382551084015981868e-02 5.811173643020325907e-02
2.184905150046264344e-01 6.790956558191305059e-02 2.618664233241428663e-02 2.136683974107031828e-02 3.958793041917806760e-02 2.750287220343164418e-02 1.299998635917922959e-02 2.240615764511752483e-01 9.242125616765857476e-03 1.185339544988294261e-02 4.314227432435680659e-02 5.099902129321974564e-02 6.455458219972314005e-02 1.220637801310145848e-01 3.023311199724995277e-02 1.111654158552669996e-01 1.111562016565953021e-01 4.697117869755066399e-01 5.964898082458346407e-01 5.088054752190357410e-01 4.219094765562644289e-01 6.437130634016727249e-02 1.164913566882062601e-01 1.888076300178354039e-02 7.254142863797669039e-02 1.833657875906627710e-01 4.914055800685664943e-01 2.981823245533607447e-01 7.807029134308249296e-02 6.844306853590902129e-02
7.786011498020317667e-02 3.107233147674462459e-02 3.247263407877105934e-02 4.607689662326434205e-02 2.064665065287799028e-02 9.847450702696125893e-03 1.967906535577700344e-01 1.581568560688555725e-01 1.368672577354460365e-02 4.988227953293648820e-02 1.330001783130247972e-01 4.846075520938433051e-02 7.155011573903363731e-02 1.295556854295909777e-01 2.515506291223830113e-02 4.063468997407025662e-02 3.205441002618846652e-02 1.798664010935627916e-02 3.017405446245231826e-02 5.285806403791711017e-02 9.688362425058176519e-02 2.823588414215832954e-02 1.255636620643405810e-01 6.010128238695357922e-02 1.066097618091200738e-01 3.819281200993372705e-02 1.321978021011286641e-01 1.539876260996972668e-01 8.914277526244814009e-02 1.032760261246172262e-01
7.891113124335291662e-02 6.371688264788086253e-02 3.035665057611406509e-02 1.865309601552742058e-02 1.422462620868786103e-02 5.715636420181577533e-03 1.636458736299370442e-01 1.899491920338810813e-01 2.250709579742372068e-01 2.310658737138798768e-02 7.662808739562011577e-03 8.799425593701587500e-03 1.792313893101049049e-01 9.290207638476429691e-03 2.341535049722682019e-02 1.578496740912492535e-02 1.270941919077548526e-02 1.430260880873466256e-01 1.291939622401875321e-01 1.016820509616305351e-01 8.067692519084154745e-02 1.132568093943976395e-01 1.541548898469295159e-01 4.225105083675843864e-02 5.086717776088943432e-02 3.003777386342735764e-02 5.752736958311703563e-02 3.652719631250848226e-02 4.653014121848512985e-02 1.863466822563058234e-01
1.072329535717466281e-01 5.626509104103123715e-02 3.118042230447149593e-02 3.561668194473462806e-02 2.570708709995433994e-02 1.445817379594595276e-02 5.456133343067156444e-02 4.644332551820593014e-02 7.952837567965061194e-03 2.212125851726974290e-01 7.820178981372019611e-02 1.656368527864767459e-01 1.771552050809091158e-02 1.777032382561567758e-02 5.239249300909992052e-02 4.440962028501230230e-02 1.730786813184506667e-02 3.040730571390595771e-02 1.470597011655999375e-01 6.801200246213670586e-02 6.541022486924669144e-02 9.851573501602682581e-02 1.366130706935838601e-01 5.902841580174737757e-02 4.626806353049798398e-02 9.016142920546829642e-02 1.088861307108784926e-01 1.298475783478751922e-01 9.052147458847092931e-02 7.964181317229039603e-02
1.450417513180901896e-01 1.263285701931581295e-01 3.693417217409426800e-02 1.055236579244393513e-01 1.014257725274217148e-01 1.958316028753384064e-01 1.423217287508854734e-01 1.766025989301499635e-02 7.476797696186586115e-03 1.746822177748664218e-01 5.270835160166006256e-02 6.026453508531243869e-02 6.319354416931063922e-02 1.029094946521411785e-02 1.487040796471382140e-02 1.067389353905798532e-01 9.069520037851874772e-02 9.971249028845302620e-02 1.382586426037209493e-01 8.344012281978049894e-02 5.883688007120031760e-02 8.634845233529611641e-02 9.184121293600211455e-02 1.369833691658398911e-01 8.647021467574077247e-02 7.005840677446983911e-02 1.067882277558231674e-01 1.639009467089733163e-01 1.761440823823507973e-01 6.479214605802041671e-02
7.899832338335824322e-02 1.989843536003468860e-01 5.406485325902241068e-02 4.905031870683582151e-02 2.042764543294073587e-01 2.164924021826004075e-01 1.483833610896198862e-01 1.056598848145333044e-02 8.125709881399933998e-03 9.023948247949532819e-03 1.400322397233978444e-01 7.171750970136120396e-02 4.166034775336427409e-02 6.224059671808664096e-02 1.641473954405764032e-02 8.115487374783998675e-02 1.853958905098037138e-02 1.074605042484438333e-01 2.012775867986336675e-01 4.278226334007365073e-02 8.255654617678864771e-02 1.148502683106643468e-01 9.687976047367585775e-02 9.678046682632353293e-02 1.262520494636040214e-01 9.934867694860993748e-02 1.208573679281224195e-01 1.434364832458873973e-01 1.695424169145803295e-01 7.429617061810206424e-02
