3.308057818694450924e-01 1.286877827341119385e-02 3.821885806480159742e-01 8.380341630056404104e-03 3.478341307061319498e-01 8.356858458618981328e-03 5.198815661028015171e-03 1.401465628213856632e-02 2.537866636019287664e-02 1.148132002842591759e-02 1.086026320755319186e-02 2.151420593786969038e-01 1.350705293070601221e-01 5.607474768262768819e-03 4.014136990344484117e-03 1.450224996630497531e-01 3.241472805912192032e-03 3.739249718085341234e-03 3.285463286274434465e-03 2.692428752478045334e-03 4.465607797496139453e-01 6.918791598622943406e-02 5.303428150092042576e-02 2.104449958148863764e-01 4.054991142629910672e-01 3.186135173541995713e-01 1.485018974819027893e-01 1.316078515394520677e-02 1.266370836092470427e-02 1.606618600034406819e-02
2.160189929900447059e-01 1.310979111486685299e-02 1.117138267739129637e-02 1.132997946475001148e-02 5.188674236114769120e-03 2.740679169825720879e-02 1.124272199753788108e-02 1.380244576559744481e-02 7.414955176664909248e-03 5.099541410466068223e-03 6.913863188070106490e-03 1.094463140171408055e-01 1.576854716222032549e-01 5.088833089110346777e-03 4.907183342322530423e-03 3.297227971994652531e-03 3.122320974368347768e-03 6.900576234667194810e-03 5.042497775951490513e-03 3.561595835929486954e-03 2.588601229093237532e-01 6.668818170251442079e-02 1.388190845476373614e-01 1.231873974578635983e-01 1.083663107826161459e-01 1.462079265945070428e-01 5.261669562231326147e-02 1.344654611433185147e-02 1.923520370757947004e-02 1.932934688987189911e-02
2.448779398311450028e-02 2.430130661974852502e-02 4.049250766167612758e-02 3.285810581810646308e-02 7.000318672806429832e-02 1.947502180832421173e-02 1.903576838461256693e-01 2.011868305853938277e-01 4.475069835764866610e-02 7.628913929966365387e-03 1.979472702729257599e-02 1.591256718937340137e-02 5.922695802414130323e-03 1.271561347246277437e-02 2.404852342947068067e-01 1.341441029080426076e-02 5.986005298313319331e-03 9.442261985812860567e-03 2.017411915675702827e-02 6.858328822677320705e-03 1.639581538128593308e-01 5.533873853691406719e-02 8.474247669647372305e-02 2.931076544319636407e-02 1.726997750672328025e-02 1.150302801634129658e-02 1.064084179083031774e-02 8.371358666824948308e-03 1.429915142405853608e-02 1.604996216086532548e-02
8.724847041836642642e-03 2.490868474488242695e-02 5.463747625711216915e-02 4.408995513591902615e-02 2.434346491101727419e-02 1.523496621334304371e-02 3.845875503620041491e-01 2.398935890879307919e-01 1.306044889111915575e-01 1.018061730099807140e-02 5.315887443523454985e-03 1.052586085483284487e-02 4.747966606941631668e-03 9.175945315783081563e-03 1.836490028675891728e-01 1.648722568018551882e-01 3.582540906077204546e-01 3.602066938306790027e-03 1.697447038519183434e-03 2.304699960670428954e-03 2.866856623805699167e-01 1.144592678281466380e-01 3.951269810281603928e-02 7.771382560155365438e-02 1.418976912626830275e-02 1.023456296328154741e-02 9.009933314555525208e-03 8.553829672230712708e-03 1.737627691239585284e-02 1.888088013187657482e-02
5.011914902567236353e-03 1.545826278592086177e-02 4.310146801751990608e-02 1.671933808188594967e-02 1.526065692467850135e-02 2.254645884483775231e-01 3.932522306551451963e-01 2.220170544970574145e-01 8.186831047785679549e-02 2.599298035310595653e-02 2.407865679293557867e-02 2.634265995266792115e-02 5.307175038014098727e-03 1.004652005430139300e-02 2.384279468072221797e-01 9.869031304755097878e-02 1.292605020285679182e-02 4.021286410202324149e-03 4.786425891181216030e-03 2.798501567406696394e-03 2.581494838605987319e-03 1.490313751386951324e-01 3.852516080268191256e-01 1.274505489661829638e-01 2.576690691131061986e-02 1.376930472186427799e-02 9.695267826531444449e-03 1.122095696008486472e-02 1.756510797515780514e-02 6.461904715490285334e-02
8.588153669378269239e-03 9.253402054852904318e-03 3.219776550036630020e-02 2.122228752985279299e-02 1.212248583524416258e-02 1.274857369851511990e-01 1.623344127527359126e-01 1.726430299847389882e-01 1.400235564982194036e-01 3.639319591337933368e-02 3.070882195915726476e-02 2.424724583644589926e-02 2.061968743078100852e-01 7.716755283985107794e-02 6.468913485562745314e-02 1.120523579800821179e-01 9.669695307379277266e-03 1.507815201494224211e-01 3.069551016085639988e-03 6.555254756108446629e-03 1.116448379469730211e-02 1.701453399918244347e-02 4.729403962507275905e-01 7.442933137989325709e-02 3.867422680409134811e-02 3.628046970469150229e-02 2.284800788690986503e-02 1.577559469035394804e-02 2.084903074719882815e-02 3.751738047560856243e-02
1.152313285228387107e-01 1.758552626224343385e-01 1.725456458583649877e-01 9.792222061079039128e-03 3.421586241401229200e-03 8.230284188560066036e-03 1.671266927372012587e-02 9.285864060236256531e-03 1.124796303883815810e-02 1.131674765393307809e-02 9.517272755197463824e-03 2.505828525184057298e-01 1.169158894660249498e-01 5.513776446311419166e-02 3.214236141583629025e-02 5.582514914481713497e-02 3.178574799693188457e-01 1.427216131914307296e-01 4.931942066648280568e-03 7.038346955454029275e-03 5.328784813157455037e-03 1.485156859357827930e-01 6.996853527170636411e-02 6.752692842414792507e-02 2.634124537691269474e-02 2.721965084379199609e-02 2.421059393299404214e-02 2.094691051518702066e-02 2.403715833571328300e-02 5.718694051759720676e-02
2.398980576542803778e-01 1.381679842418366208e-02 2.449923598893919419e-01 7.085048772169191475e-03 7.414649814485939350e-03 8.334794899008238916e-03 7.454823974431098489e-03 5.029953619354614672e-03 6.541932793759392718e-03 3.358487286800625471e-01 1.405405182840600564e-01 6.899804916166675343e-03 9.896315539007222162e-02 3.609756950267747205e-02 4.086343464528992275e-02 7.563204509264009889e-02 8.899348252862843145e-03 1.000433374337732044e-02 6.304225464057368160e-03 5.975494041906967077e-03 2.069236965999935174e-01 1.219270190409771498e-01 4.934055825991556093e-02 4.166452474109512416e-02 2.007626935096749540e-02 2.118779071607239384e-02 3.325466904032250287e-02 3.749799265772914281e-02 3.721249945696677996e-02 1.080066360842897588e-01
1.244262137920673986e-02 3.669003258465528550e-01 2.120691805089042759e-01 1.649585738764042242e-02 9.503885762995687575e-03 3.297124661828043646e-01 1.964064998139709167e-02 8.262838491972625612e-03 9.408365976685723747e-03 7.739003806032320257e-03 5.542571156756240409e-03 5.605548646587170218e-03 1.062459928112944110e-02 9.515068056739574634e-03 1.316020811519492406e-01 1.104975581992519995e-01 4.087747205983423109e-03 8.425209247399145784e-03 1.077055078541444035e-02 2.760114123012502585e-01 5.499126846925711520e-02 5.733690634624599713e-02 6.237670681514977111e-02 4.112922387517084499e-02 2.440351684948190158e-02 3.711229101216107634e-02 1.397802941049610115e-01 2.469306706831951859e-01 1.216915036880380184e-02 3.321219662877702428e-01
1.235041328899480310e-02 9.322726863226389604e-03 1.484072138160382782e-02 8.750317529412795364e-03 1.068907489050005197e-02 1.572691059578207040e-01 2.048984459665850744e-02 3.506846832494274757e-01 1.642982539650520435e-01 5.819020421436931628e-02 5.270551169264434989e-03 4.934615330272699649e-03 1.045525719664251209e-02 1.367031170827182063e-02 7.171605797347473804e-03 7.722560574013262111e-03 3.445282680202296777e-02 3.201247981625628125e-02 1.877439349755150033e-02 1.324113817103697056e-02 7.066636694137964914e-02 4.467298610285777571e-02 5.123992125262691322e-02 5.678528854528630543e-02 3.213459919898888073e-02 4.111614014580627918e-02 3.789909942511648921e-01 5.708184726848289925e-01 1.261887325462636086e-02 1.753048298835440111e-01
1.315792547408735705e-02 6.605345323660325417e-03 8.395431892382936717e-03 5.701561807457405581e-03 1.491658643713212121e-02 9.814115621127525446e-02 9.664310936065792501e-02 8.828863559772887060e-02 6.064232221118946720e-02 5.557107755323275645e-03 4.167726502351826179e-02 6.675388453308893355e-02 1.385774263687566954e-01 6.878630476250109649e-02 1.275069605784213619e-02 2.516623166075472942e-02 4.656245704489378467e-02 1.274711830794992770e-02 5.120074015107242346e-03 1.159475120612221966e-01 4.889349039138397163e-02 4.369621705133190648e-02 5.643398436161206622e-02 7.963222059045448054e-02 8.618190044207867107e-02 4.715170135970477017e-02 7.413962214907306170e-02 5.478024552353247256e-02 4.832884697871790702e-02 3.438339510132194105e-02
1.669303499872486218e-01 9.091800543779254840e-02 1.558214769065865979e-02 1.663263491427777879e-02 1.560285440103518183e-02 1.580155318058822367e-01 7.449178014022853067e-02 5.173453801818925918e-02 6.156032126322782960e-02 8.935587559543154909e-03 1.265500398106901396e-02 8.274508909226269138e-02 1.426867046552683926e-01 7.463386594237009231e-02 2.714162774119456556e-02 3.087360493212810975e-02 3.404904579342020454e-02 1.999515777477851169e-02 8.516249765981637534e-03 2.674020471089713080e-01 4.732677721672733095e-02 4.819999440916700184e-02 5.700169722463403754e-02 1.025997989682936040e-01 9.845994408436294087e-02 7.081093034674745823e-02 5.481973761619415852e-02 4.946184978848260777e-02 5.368208154899584139e-02 5.794203554474577911e-02
3.955322880205162928e-02 9.293996903915693886e-02 2.036635887526954125e-01 1.887992285302935239e-02 3.736659852616698307e-01 1.308002009362356777e-01 7.377316176078940746e-02 6.501560873295815501e-02 8.344852900068616686e-02 4.951240213559834728e-03 1.599226732915145777e-01 2.821873444619783441e-02 1.056553494492854239e-01 4.580413369489155784e-02 1.457001569217235282e-02 1.704881725929856609e-02 6.322068253705280874e-03 9.298805176883338103e-03 1.556451456993673821e-02 7.253871603822223402e-03 4.589758663672850736e-02 5.033825005798638064e-02 6.318843993281723914e-02 1.054360383916992383e-01 1.344741008689318007e-01 1.196500515576326418e-01 8.880124391572284670e-02 8.324135041285843362e-02 7.293749815847795637e-02 6.045868889498078741e-02
3.404597209544783787e-02 9.334345060031618013e-02 1.444034820137858610e-01 1.012220437155005870e-01 5.994275295300807715e-02 2.643020460591965493e-01 1.814416447903490978e-02 7.932286462011637479e-03 1.151372822022903031e-01 3.778612090323400785e-02 1.349508670934106980e-01 5.622520099592761764e-03 4.787823863874025171e-02 6.567428090517933581e-02 7.105634225325108133e-02 9.722773514255005078e-02 8.841735265419815859e-02 5.792660175605403305e-02 1.596055710689636975e-01 7.689688104101492783e-02 1.163740889766369524e-02 3.034329643009860966e-01 2.258493106893419977e-01 9.318769516059146121e-03 1.539964166308012417e-02 1.203353211750331220e-02 2.898326388544911203e-02 1.355070587054892778e-02 9.913677948271004681e-02 1.145532852908391908e-01
3.194690669768803643e-02 3.083611348563157495e-02 7.394752967946927047e-02 2.403411343029230804e-02 1.921201450117035470e-01 4.860746000490290958e-02 8.591648193091546565e-03 1.090621303818452466e-02 8.441646293758649916e-03 1.441247568366635923e-01 2.969619393112798988e-01 2.696374816188951834e-02 4.202441135846812087e-02 5.416637249330888415e-02 4.969784158653427208e-02 6.095230460771734748e-02 1.058449619735463698e-01 1.861584111874643455e-01 1.928447635462617882e-01 1.538365781269303845e-01 1.025305666863631990e-02 1.337859751856323304e-02 1.150398520040204521e-02 2.555899699559193577e-02 2.830524792288952735e-02 1.453046727993909104e-01 1.450486189695066597e-01 3.843567355353411791e-02 1.017833896399506638e-01 7.787858816366834136e-02
2.956265737264331811e-02 3.119670393874026185e-02 6.103962789640712816e-02 6.464195403027253595e-02 4.210226828873098182e-02 5.111503809233981788e-02 3.132634792310330374e-01 5.002756900807658197e-03 1.101262252120752648e-02 4.950330789689798110e-03 5.171931386340225707e-03 3.812485336743566197e-03 2.322912407889379804e-02 4.782992307389588582e-02 4.535043033180202743e-02 7.055606279167836448e-02 1.252157583556615938e-01 1.561730568639913275e-01 9.263578360324134509e-02 2.063632405311797979e-02 1.252659631550929326e-02 8.683656284182139640e-02 1.275193102593336070e-01 2.154238545824352369e-01 2.035600420161584323e-01 2.660244711474676893e-01 2.127947227527330343e-01 7.170660014501968604e-02 1.474890991648118987e-01 8.642644342872794760e-02
3.813852108706926314e-02 4.309671989710557594e-02 4.050754058402782076e-02 3.668669332534851835e-02 5.357101076662004746e-02 9.478465439577753171e-02 3.145954794493623086e-02 9.617768056284405065e-02 4.299693597053949601e-02 7.268760193195772726e-03 5.312777050211194008e-03 8.163182300870232971e-03 1.616428381598442043e-02 2.426322916981758088e-02 3.259779396315923283e-02 5.941783016710244086e-02 1.323745638481966247e-01 1.381147309761906750e-01 6.768232899274256864e-02 2.387533906052260319e-02 1.043049808393424760e-01 1.913525184549539349e-01 2.481137121459091599e-01 2.566203709845538139e-01 2.267359113074824406e-01 1.959834850962507147e-01 2.895143536654526395e-01 5.575924356463236864e-02 1.925727627961167365e-01 1.038165338685211186e-01
9.552463346222983542e-02 7.442336816205256944e-02 3.599807308279234092e-02 5.036292987397464338e-02 4.322829846874163065e-03 1.454000776925006705e-02 7.306782644721093734e-02 5.813065567511319087e-02 5.709236032341162559e-02 2.814740416164132272e-02 1.197714805984309919e-02 4.381772052217256484e-03 4.255573905453524999e-03 9.456779583997416624e-03 1.565076640829362112e-02 7.316449422253054613e-02 8.002527156412936327e-02 1.030556636096844891e-01 1.866353950619211929e-02 3.390668368610628286e-02 1.159384464610858645e-01 2.542428973757153710e-01 3.176482846143298122e-01 3.315201160494706811e-01 2.737889134231597521e-01 2.638022293633797699e-01 2.449910050606047274e-01 2.014466701976746210e-01 1.206583743538229038e-02 8.498001512024677684e-03
3.824395954976397838e-02 1.050683504646272443e-01 1.831700302612662423e-01 8.109061226299894495e-03 1.092085823448717477e-02 1.397126141612759116e-02 4.411603403158770309e-02 5.504825693415348747e-02 3.759960003121564504e-02 2.895307307586879320e-02 8.820854255813023043e-03 1.949689594054239139e-01 2.928324613912401952e-01 5.430641002781563115e-03 5.682709944321641046e-03 3.410699957499956775e-02 1.349026624619669053e-02 4.777103777137310658e-03 2.309172481955947820e-01 1.229441954608057400e-02 4.494072340327110587e-02 2.423932092446717257e-01 3.105555061371811920e-01 3.280075817435184615e-01 2.410395714453960059e-01 1.124868266401327782e-01 1.831037116184557056e-01 1.248047997894265460e-01 2.406434218745419698e-02 1.067853847271243821e-02
5.360553752975957299e-03 8.452691995702556887e-03 5.127684161178531867e-03 4.828515534114050101e-03 7.696785894169094928e-03 4.368007159757934452e-03 2.232642774792038126e-02 2.862081103357721340e-02 2.616697741677984773e-02 8.332616376202637773e-03 4.346684349329998052e-03 1.346158105941567540e-01 2.290615143972961620e-01 5.299350694356003665e-03 9.235422450597314745e-03 5.765267400217842508e-03 1.011719911077626002e-02 3.035850106811920513e-03 5.834089667592835815e-03 2.805455597903993431e-02 1.449234719043097086e-01 2.776004388320361671e-01 3.014488310184871844e-01 2.906062363263237636e-01 2.265897212314564035e-01 1.682341518778033840e-01 1.645290746841603369e-01 1.248680229271727782e-01 3.684685708601066756e-02 4.622317703092797547e-01
9.356235589746624004e-03 1.076203841235676487e-02 7.459451398838690128e-03 6.778516117812768277e-03 7.650612436089304635e-03 2.857274665198543742e-03 1.191551985224639613e-02 1.239690080020532797e-02 3.616536283185194101e-03 2.839772534156027959e-03 2.307041878824941938e-01 2.032040970695057069e-01 1.122989374583059363e-01 5.188977201091735103e-02 1.112537775816670460e-01 3.290396435746027470e-01 5.579189347187494055e-03 1.192601218458823331e-02 1.181339980168581369e-02 5.400181121008153923e-02 1.492533903960412967e-01 2.185120179062390589e-01 8.979630370055247113e-02 1.377890659649488592e-01 1.821748250917699097e-01 1.053336396010217807e-01 9.689001698121285644e-02 9.427751641329604193e-02 2.667789553521587864e-01 2.900907842326376218e-01
7.564157825406529756e-03 1.454768562987772754e-02 3.758546432178951346e-01 3.215173631002663512e-01 2.952404443635324727e-01 3.122809626222577527e-03 2.375709036910532944e-03 1.494625959672215565e-01 2.117309455735516821e-01 3.653254557715473333e-02 5.365408485878651879e-02 8.518950255535225058e-02 7.891369066346505534e-02 2.461797552416511992e-01 3.949606420987838810e-03 3.011705701086216103e-02 5.460520585788352504e-02 7.411852656431590358e-02 5.195220055643888502e-02 3.992156780419175988e-02 2.861402567490643062e-02 1.034358652325779483e-02 4.052625377455039250e-03 9.000544872781209363e-03 3.348636511990141229e-02 1.737707306970046051e-02 2.399056145194476686e-02 3.883039732540849442e-01 5.021409915324846762e-02 4.686309196229652974e-02
1.583785857367687663e-02 2.357289356712605199e-02 4.255333322908494420e-01 2.492405343814174112e-01 4.101122024890857531e-01 3.097379883485718577e-01 2.651087415425726693e-03 5.364458568602679944e-02 5.057087944566563548e-02 2.190667388280915368e-02 5.415942934695050504e-02 9.879145747864039040e-02 1.042602241661971935e-01 5.773500889234114281e-03 5.748526565035835291e-03 1.488471483994852074e-02 5.581073793650243725e-02 1.066984545102225013e-01 1.239447735277755813e-01 1.099257969424609904e-01 2.376920213988008290e-02 8.359619713604190053e-03 1.034300766889033676e-02 2.432535792071651923e-02 3.884546328098874984e-02 1.737563180135839880e-02 4.498327154746735723e-01 1.842034574334101837e-01 6.893656612677694084e-02 6.615953520487441453e-02
1.952262600416759461e-02 4.199979048515121126e-03 2.368286857944593982e-01 1.015268200951136290e-01 1.297443610063555852e-01 2.864538268658460285e-01 3.814382685131286199e-01 4.406415276335518688e-02 2.498007174189074281e-02 2.851356696627150439e-02 5.174840047337712912e-02 8.746912876100937373e-02 7.865723958912539115e-02 3.738251335740336856e-01 8.960132772446692540e-03 2.123127557248623981e-02 4.214688661752743343e-02 9.943196884470460739e-02 1.284495021620553623e-01 1.116608202841202629e-01 5.715426448913567270e-02 6.699511338310573140e-03 3.376293665796588628e-01 1.102304882309069686e-02 3.944714572342568337e-02 2.834665483069866501e-02 3.850684161569728481e-02 3.171944493961703637e-01 5.559181037016656945e-02 5.025981589338232580e-02
1.068415742686434911e-02 4.207076120782901607e-03 2.577197832462998529e-03 5.266957266993881337e-01 7.128337040118871114e-03 5.530577613679762451e-03 4.079162819909195603e-01 1.738463717821235321e-01 2.542550773447633805e-01 3.250848684869462879e-01 3.048091789612069821e-02 3.648260539173382028e-02 4.780898418535489691e-02 9.201582076044007019e-02 6.050126176617802269e-03 1.638094505756478372e-02 1.038177920616102645e-02 4.821032844956309182e-02 4.860956108834935813e-02 3.891561877119608520e-02 4.118959021630988482e-02 1.390670179378485430e-02 9.986879172595140852e-02 1.617840321342224608e-01 2.634960161800255912e-02 2.206423648257507114e-02 7.082474948170902618e-02 8.155917968097921300e-02 6.493753814902485100e-02 5.680078543164465699e-02
3.818512363423324021e-03 1.498923723713042281e-03 2.922795449063809309e-03 6.207336012351556340e-03 4.267131723905861866e-03 3.388230507411454373e-01 1.652004881798378455e-01 1.211654493544807587e-01 3.799773775621941296e-01 8.759285933411138647e-03 1.001823532507987446e-01 3.714395918628558141e-02 5.492981553925195548e-02 1.002246329079442000e-01 4.149934846798286614e-01 1.436184204208314046e-02 4.422730421506677057e-01 2.094172563879425908e-01 3.073149287095091053e-01 8.082898514623154673e-03 1.714993273098857837e-02 2.131556549197841099e-01 1.094045263815958680e-01 5.062756633134810613e-01 1.206546833799789775e-01 3.558113206045961929e-01 6.666718313813872754e-02 1.163021669607995079e-01 5.302973622794486808e-01 9.050065968268833361e-02
3.869556824907102819e-03 3.070778403044471631e-03 1.995379625180008273e-03 4.918441855108228733e-01 5.057897535279469725e-01 1.999692576639315600e-01 1.359687094509797189e-01 1.424593375472674173e-01 1.591170139825308638e-01 6.315923519409727405e-01 1.855185842221981907e-01 1.859792825712170694e-01 1.495513282954825940e-01 1.514129992119165324e-01 3.806269606974848063e-01 2.578751128633957612e-01 1.847851317869772525e-01 1.175448934283672420e-01 1.038387927789994614e-01 7.850520147710084162e-02 6.290022986531842997e-02 9.191419739845917147e-02 1.400216228580179190e-01 3.260541801849770049e-01 5.561140237701215350e-01 2.503284584101935217e-01 3.846274253275328014e-01 2.678782263665754337e-01 2.774506836546888899e-01 1.833184053607209707e-01
5.254217426209141159e-03 2.706958112195183893e-03 2.050079550321008606e-03 3.659742049081456464e-03 3.757689990770750419e-03 4.930524025727785475e-01 5.167416832697936842e-03 4.489025700691129037e-03 2.193508049089988310e-01 1.592293574925180422e-01 5.976340474802362135e-02 1.387441364489157003e-01 3.486266915458222648e-01 3.187985786051651393e-01 2.591920580432185289e-02 1.939280322639826137e-02 2.095141679047374528e-01 2.541125158140580820e-01 1.176519607801576051e-01 5.267571146646313207e-02 5.119274647915965371e-02 7.984836763830502337e-02 1.209979505192593785e-01 3.684003970243182602e-01 3.712573567396137975e-01 8.776101843888547971e-02 9.764669059390837513e-02 1.261432247127775574e-01 4.121096242714497593e-01 8.443628347524659294e-02
7.061324105591689805e-03 6.036228308263754186e-03 1.787487150896818408e-03 5.968085437483224703e-03 7.579500746745921475e-03 1.411545539381649228e-02 1.182331594300861655e-02 5.505700592443845132e-01 2.179141198267313118e-01 1.266896912176815326e-01 3.850972030458646445e-02 4.931263252187360197e-02 5.285632380292903942e-02 1.806093001492692918e-01 2.066776972687641156e-01 8.727839922764710212e-02 7.364694025887907891e-02 8.135382720089691377e-02 1.121833402355040948e-01 6.570275426496946514e-02 4.664385598238278419e-02 6.942895751567326745e-02 7.893064271211075456e-02 1.314558068986826367e-01 4.089438655208416096e-01 6.440987803970910086e-02 9.364928972025206300e-02 1.538998694530801514e-01 1.863386171675436298e-01 3.703722084629705869e-01
3.843622390278872251e-03 9.423381563713504466e-03 2.759991477223334034e-03 2.888875870754905630e-03 1.368612809793730289e-02 1.430016877062277939e-02 1.217106510900077022e-02 3.827015901354841043e-01 2.953958125102353893e-01 2.763438800186842625e-01 1.137274204305911418e-01 5.749821510334408858e-02 3.461029707579966336e-02 5.447176796321433895e-02 2.494149261639247994e-01 6.559386818691478882e-02 1.789010291890042459e-01 1.895972834979236729e-02 3.802678243066488772e-02 2.524920968360502838e-01 6.520171880146047316e-02 9.121893180805552837e-02 7.938161613789897209e-02 8.711462276019271700e-02 1.154098126994497486e-01 8.843735867512682314e-02 1.042954824450157830e-01 1.287181338278841625e-01 1.738183459739548464e-01 4.269214820809628108e-01
