3.117027078668281348e+01 4.706848862419683144e+01 4.060359553363376506e+01 5.095054938566804736e+01 3.828023020801116161e+01 8.421695983758819182e+01 8.418223007316602491e+01 2.301699405658799833e+02 4.247659896547771723e+02 1.925428077953719423e+02 9.121300557210039983e+01 2.121742441449848826e+01 1.283062012461199330e+01 5.052398459703287870e+01 6.265018248238692422e+01 1.478415670934461090e+01 5.683912006182528387e+01 1.093917422660736918e+02 1.099482863867551430e+02 4.246828322717585991e+01 3.436820800809649512e+01 5.033137091041774980e+00 3.950070072143839539e+00 1.602646153568221976e+01 3.187513482750406979e+01 2.581144271455549344e+01 1.238738648182940949e+01 1.109221783235197378e+00 1.073247845805871847e+00 1.377683007699016526e+00
2.323443633279671516e+01 5.278291750588409315e+01 9.469529807008436251e+01 7.651104114979568749e+01 5.300539469035552997e+01 2.392672500752428277e+02 1.161812460597985819e+02 1.478209042062764524e+02 9.908566973667711864e+01 8.610137826743871869e+01 6.352471131475981281e+01 1.292570059336800803e+01 1.792822449651392347e+01 4.295778101162667895e+01 6.304609873924567154e+01 4.308477686791999162e+01 5.821213055594361663e+01 2.105844350366604658e+02 1.779381556746060369e+02 5.945407607967293018e+01 2.161412497102063668e+01 4.952940402725484859e+00 1.063911080676982834e+01 9.731297626388316857e+00 8.943998477151220428e+00 1.258122513549970556e+01 4.723389205203339714e+00 1.197462817327746176e+00 1.679098712594986775e+00 1.665171666916586579e+00
2.723105451679959970e+02 2.843730269778529305e+02 6.020747349693974684e+02 4.856469706848503165e+02 1.038452030299573835e+03 1.071662442512282070e+02 2.062242917352416072e+01 2.265331745454503221e+01 3.807473597359590940e+02 1.193789073828249911e+02 3.357151676928455686e+02 2.360063903111827983e+02 9.140848671293349526e+01 1.391423158594980976e+02 2.766325277807218441e+01 1.224939532818537344e+02 8.966903123264825126e+01 2.048155621661656483e+02 7.707954567562402417e+02 1.438989990128112879e+02 1.418451878367787700e+01 4.252006813145533748e+00 6.726709277391830888e+00 2.472783884668107834e+00 1.573140639518252781e+00 1.123332341217933239e+00 1.084101672536424088e+00 8.069869354770864422e-01 1.298822364885668268e+00 1.401193753692242083e+00
1.301166838585139374e+02 3.824129600223844818e+02 8.401793942937040356e+02 6.731346291911564776e+02 2.789922645055787029e+02 4.342216468302189725e+01 3.509677162173341003e+01 2.375106761464810745e+01 1.484941575978487549e+01 1.407749896382238717e+02 9.268872591316856813e+01 1.916177683057226773e+02 9.081167713977436051e+01 6.409381071368291316e+01 1.985867044407413573e+01 1.602299410438315164e+01 3.608126813505349162e+01 7.355170035372609050e+01 5.777871106968277815e+01 5.432646402430061983e+01 2.596407384908213345e+01 9.309292085670900718e+00 3.048474703371723216e+00 6.244111443023180996e+00 1.254141422028358654e+00 1.002123337954114790e+00 9.336472166515019655e-01 8.231121107489169919e-01 1.539309182936189124e+00 1.597220764165887985e+00
7.812782351212332799e+01 2.504348844025823269e+02 6.969788959751122093e+02 2.698031686090098447e+02 1.558252539834332993e+02 2.265052044794522601e+01 3.458974254725252706e+01 1.923236261794125213e+01 8.877142772900880274e+00 3.085841365495733157e+02 3.861720292690969814e+02 3.347175535925560439e+02 5.120504830794799034e+01 4.533906361880656277e+01 2.261087595146253904e+01 8.916831247816254802e+00 1.017496678646273978e+02 6.225331875012699356e+01 1.078741639012166047e+02 6.631906598956469168e+01 4.877284853846568069e+01 1.449020082472443605e+01 3.392908677530488148e+01 9.915495910112110067e+00 2.142475631326798968e+00 1.268761793114912440e+00 9.567398563669171629e-01 1.033996426034349270e+00 1.490798617506750245e+00 5.242880869064753924e+00
8.155004462971206181e+01 8.942938472807173866e+01 3.999001221070741394e+02 3.194446267408141011e+02 1.269422451566162522e+02 1.340143772132631916e+01 1.598196575395930097e+01 1.683334384932536665e+01 1.548573443056316812e+01 4.576100619186869949e+02 3.513712083040890661e+02 1.840132731851276162e+02 2.148794154242875720e+01 6.940925127049602850e+00 5.620908146235503722e+00 9.796856570879601378e+00 5.367485314021430298e+01 1.459059484415100627e+01 4.976070306580447777e+01 1.809720999207559942e+02 2.376982260484999188e+02 1.525855567137405160e+02 4.112697346067094628e+01 5.691831619175555801e+00 3.062378925442932776e+00 3.176183315290590947e+00 2.147062824921268209e+00 1.384390655229849276e+00 1.680517321648498985e+00 2.899565722483757213e+00
1.147259698812192141e+01 1.919694264085039137e+01 2.033934586853860083e+01 1.033457185568467764e+02 4.966027680047256609e+01 8.094707688121057743e+01 1.191595161046915621e+02 6.622655866754394083e+01 7.683304892100396444e+01 8.609578827580803306e+01 6.412997426319736860e+01 2.579468499195111164e+01 1.075088189251825810e+01 4.447498332333719162e+00 2.490990382683445858e+00 4.738956533196489573e+00 2.889942609782808702e+01 1.406550345304935590e+01 7.422776665747957736e+01 1.059074211265429710e+02 5.286188009445696423e+01 1.375546026126565735e+01 5.867675907915012701e+00 4.948557723024971544e+00 2.003124088243911860e+00 2.266266565969177638e+00 2.155751761321743842e+00 1.751763046345909736e+00 1.877195477043610561e+00 4.285354314085829230e+00
2.345095921562293739e+01 4.469772108432945856e+01 2.636838285582181740e+01 5.745571018072891434e+01 8.905115138619218840e+01 9.964575251020242774e+01 8.728916489197493433e+01 8.173858092572464784e+01 6.545468674365186246e+01 3.554418565534702168e+01 1.392215532714843462e+01 4.205606893311630756e+01 8.991268929094289319e+00 3.099441310600479227e+00 3.298252942016003608e+00 6.351835113572111169e+00 5.460299895126095748e+01 9.075055145050990291e+01 8.318241055668391937e+01 6.231745618953480914e+01 1.843727979020679442e+01 9.373791858886201922e+00 3.412438679211430070e+00 2.846489596052159676e+00 1.441844438232450898e+00 1.638569365728628879e+00 2.719261175320642820e+00 3.242072792561235595e+00 3.083806297529948726e+00 8.729502699273142596e+00
5.931272123575939048e+01 3.978572597593793603e+01 2.366225694382706735e+01 1.397574498022822240e+02 9.284761411939722109e+01 3.959829025566378391e+01 1.280534573469348345e+02 5.796514781201500455e+01 4.946739467267077828e+01 4.748400258228849680e+01 4.137289248587885737e+01 5.350070145249803488e+01 1.162631094120495590e+02 7.721772281979997388e+01 1.171383048348244671e+01 1.092333101483874280e+01 4.932146825009075286e+01 1.567214963200005684e+02 1.626067769083470012e+02 2.883540944005351747e+01 4.902378660798554222e+00 4.066020216175563640e+00 4.120681304240223497e+00 2.682292517258413334e+00 1.646653206694254745e+00 2.706174162668813388e+00 1.082370125633279123e+01 2.084272489185465815e+01 5.791203040899809196e+01 2.767232590017396632e+01
9.611170293517076857e+01 6.291525506228322939e+01 1.019345436424816285e+02 9.751032382155018752e+01 8.870357064019827931e+01 1.784571389241065020e+01 8.408924869383073997e+01 3.664831144514180750e+01 1.593652123556689659e+01 5.817935231187433942e+00 8.339868726683781119e+01 7.981027705162702546e+01 1.665707483283322290e+02 1.781781917629031398e+02 8.434562605699170490e+01 9.164036597622455815e+01 5.091744610296506153e+02 5.555232427945638847e+02 2.368962172853697439e+02 1.132082416560513138e+02 5.974602486271245461e+00 3.028685592298844931e+00 3.310292505392464335e+00 3.644496295625595295e+00 2.083979553474459845e+00 2.838462755581542485e+00 2.820082660677686448e+01 4.648675394257477933e+01 5.595929159960888910e+01 1.427127287929464927e+01
8.109110447044278658e+01 4.231022310898902816e+01 9.539224043451756074e+01 8.284032107358287078e+01 1.091621976174699000e+02 1.029650865727665021e+01 8.874455482410480656e+00 7.986487472643830188e+00 5.223930023302965964e+00 4.572136364967610689e+01 7.005781403904509261e+02 1.144415112269134852e+03 2.307511565679083105e+03 1.102207479813775763e+03 1.976474978169425185e+02 3.748034462766858042e+02 7.131229363823853191e+02 2.059312639407698953e+02 5.186452300791449943e+01 1.101941434256392327e+01 3.960818671656993750e+00 2.903569252467047779e+00 3.636431660810643507e+00 5.128724989754166685e+00 5.584646358573950309e+00 3.147782404972454984e+00 5.204306100053226025e+00 4.040362434405557757e+00 3.527242056725342856e+00 2.474757325254033802e+00
1.550109126092519674e+01 9.121021750101627745e+00 8.040756819173813597e+01 7.976940230533216436e+01 6.378227143562328649e+01 1.508280768398456040e+01 6.061629349927063259e+00 4.049418015643080793e+00 5.242511377542324880e+00 9.545116475615000695e+01 2.249052814084677152e+02 1.428684977250176416e+03 2.473865035261606863e+03 1.227662595676250476e+03 4.265781805717975885e+02 4.608426617993309264e+02 5.095456814134514048e+02 3.058575534423825957e+02 7.717110667646798561e+01 2.249136728616446135e+01 3.437464443548511994e+00 3.153975431463523993e+00 3.691130845294639862e+00 6.681961092457925133e+00 6.480613581869862472e+00 4.728467829723862259e+00 3.714838842907191019e+00 3.322109402262995115e+00 3.516284210731076332e+00 3.735014770154108099e+00
3.068933377787242733e+00 7.941833339245544465e+00 1.925026065730691016e+01 5.474348860787077342e+01 3.635406782285890159e+01 1.187026719164791899e+01 6.317257649365233263e+00 5.533297578526461535e+00 7.348822958626106683e+00 5.128502094888046514e+01 1.650515339937378911e+01 4.842079143586981900e+02 1.940773093581514559e+03 7.801139604399188556e+02 2.320382698400515267e+02 2.539827882672417445e+02 9.176286549814749094e+01 1.330747247602514278e+02 1.507664390250831730e+02 5.682388073147935614e+01 3.888221999676174434e+00 3.553677649041490749e+00 4.368800492760867904e+00 7.570114500293106730e+00 9.997593062856674706e+00 9.533322810404531111e+00 7.184177679343390466e+00 6.535461745252776566e+00 5.008373291259410109e+00 3.923082620234874973e+00
2.508206160618926539e+00 7.248582262036888046e+00 1.309355066110332722e+01 9.532251967207924892e+00 5.692572888951782595e+00 2.321173192217533909e+01 8.475493214590892421e+01 7.867816861023976571e+01 1.110416565844040804e+01 3.319491696863660302e+00 1.295004348519766602e+01 8.381141227980745612e+01 9.324603405485858048e+02 1.162537472647517916e+03 1.155314661077116853e+03 1.459287027692993888e+03 1.252302649801127245e+03 7.789355660266276118e+02 2.052686224752320868e+03 9.401677902411540799e+02 7.862080376389540959e+01 2.307712377864760356e+01 1.754454880245652149e+01 4.415354470851988111e+01 1.018877369838077414e+02 9.563252615732365314e+01 2.665210621533991571e+02 9.041790326605431005e+01 7.467521332483324947e+00 7.519981588777818082e+00
2.300774716456437829e+00 2.334635839789384715e+00 6.426631068053126228e+00 4.831427214653814417e+01 1.777595224473931523e+01 4.281929354843807545e+00 5.836541483447163614e+01 1.795526059777404271e+02 1.296056681702969513e+02 1.327275953170149414e+01 2.818821223134647624e+01 4.444164008418614458e+02 9.008006862812742384e+02 1.046893505373267544e+03 8.736684767241663394e+02 9.806020505976329105e+02 1.558917402892507198e+03 2.524426216390684203e+03 2.434437971031334200e+03 1.862355585040914548e+03 7.983623974774340581e+01 8.383272619502150746e+01 7.458047561493232536e+01 2.311705025264427604e+02 3.266316207786103405e+02 1.665897872175248722e+03 1.691935358729314885e+03 3.555742567208050104e+02 8.228083168459072283e+00 5.136336321188615273e+00
2.061895858928786129e+00 2.283036025115108725e+00 5.266548115574684275e+00 5.902572623076371094e+00 3.991792234605112455e+00 4.625793814379904667e+00 3.332884739416870445e+01 9.676284838659347542e+01 2.084773325073313401e+02 7.680903577719848840e+01 8.180651177412693187e+01 7.374189272937357487e+01 5.581080113796615478e+02 1.035719500084180254e+03 8.918883306298614571e+02 1.264769311514683750e+03 1.987595986870036995e+03 2.214387252401336809e+03 1.192081307465526606e+03 2.491547630003149152e+02 1.484148404836952579e+02 1.012476377207836322e+03 1.463977144297011819e+03 2.412494979749185404e+03 2.223549748479837945e+03 2.896059523862476453e+03 2.363363986787607246e+03 7.024083830084100555e+02 1.244074686523883599e+01 5.762742474858130848e+00
2.578400354276552342e+00 3.049081107228243326e+00 3.048064255724299620e+00 2.970969165393306355e+00 4.672048338551006097e+00 9.848525756112168850e+00 5.741681543004801824e+02 1.938984063937620931e+03 9.690131634752556238e+02 1.728193698588874270e+02 1.360599616846860727e+02 2.272621364473553740e+02 4.444796107440104151e+02 5.963114812366102342e+02 7.206196897978257994e+02 1.191869459491842463e+03 2.272091451631235941e+03 2.060546374178810765e+03 8.940742555246508800e+02 2.889938178748329278e+02 1.215868543519698505e+03 2.153518359559565397e+03 2.713486548713815864e+03 2.722578427587337501e+03 2.365073797912007194e+03 2.060488295128506252e+03 3.125146335274788726e+03 5.579924409716086302e+02 1.811892998560767154e+01 7.716485881698004867e+00
6.366781179683159486e+00 5.146533479363320396e+00 2.736808717418437009e+00 4.443722863319735872e+00 6.077537713773917005e+01 3.084224426250873989e+02 1.695970431324531546e+03 1.386124305554504645e+03 1.395487425290950796e+03 7.271196793217759478e+02 2.838941315513868631e+02 8.399981891039372783e+01 8.208401172142114888e+01 1.908149538815767414e+02 3.908993789507360361e+02 1.659120281281676853e+03 1.505356677132202094e+03 1.546512583173185476e+03 2.411289613638032563e+02 3.932217924914291416e+02 1.339126443134391138e+03 2.794650425691460441e+03 3.356814858916330195e+03 3.387116782972684632e+03 2.773867625597956248e+03 2.725563040265511518e+03 2.623989889563617908e+03 2.082199915581814821e+03 9.253367914887274992e+01 6.111477256463008700e+01
2.881084330566235252e+00 8.276371531370751100e+00 1.593471201383466251e+01 1.170029857482688413e+02 2.806672994383401374e+02 4.037654502223643931e+02 1.268598672334526555e+03 1.591690931400002682e+03 1.119072165459450844e+03 8.923292457317627395e+02 1.957515922651807614e+02 2.026867032531253443e+01 3.000851826848853676e+01 7.647154008328513441e+01 1.507996002939659945e+02 8.166733767330093769e+02 2.728427686418101530e+02 7.740436607115330503e+01 2.318412215580169544e+01 1.540822598631319522e+02 5.534658281421884567e+02 2.797434635974632329e+03 3.389049530042500919e+03 3.404370416166486393e+03 2.425490927819294029e+03 1.118821374984622707e+03 1.832571125846553969e+03 1.258557503507184265e+03 1.135579756349838760e+02 4.485583729246351936e+01
7.435777674862254116e+01 1.019012949844089064e+02 7.319753654813484900e+01 9.885313006505747069e+01 2.573241399004344885e+02 1.529730463828148288e+02 7.978545687668547544e+02 1.046343757809405133e+03 9.895214477504298429e+02 2.337626901522069431e+02 5.919267010892635028e+01 1.264655674450705192e+01 2.112237997929999267e+01 5.641897666491131247e+01 2.037817222084185005e+02 1.257882864549072224e+02 2.033689760731850242e+02 5.355855215608816877e+01 8.980472100933138790e+01 3.853314739875343093e+02 1.924828301954416020e+03 3.416889940794871109e+03 3.466581650535528297e+03 3.112237725732831677e+03 2.284451285575762540e+03 1.626235378371680781e+03 1.560167871586930232e+03 1.051709137713271502e+03 9.473849717334837806e+01 3.374024023300705011e+01
2.202220442162094685e+02 2.198018713670560089e+02 1.251427073005932016e+02 1.011060643950510496e+02 1.497811147051500882e+02 8.487733406492185395e+01 4.981548164956436722e+02 4.599930907064975827e+02 1.305638198605553839e+02 6.819711263995606032e+01 2.269993200279473200e+01 1.750282777824971703e+01 9.886876645675961583e+00 5.059737224320306481e+00 1.219849995343604654e+01 3.834073302696266694e+01 1.218771228769343509e+02 2.489329503691561172e+02 2.156653411691858651e+02 8.737602007182313173e+02 2.184801457436228702e+03 2.930983982338997521e+03 1.114512166156286639e+03 1.544324473719196021e+03 1.858021920994208358e+03 9.974339906288969360e+02 7.245876099730999158e+02 5.953706257352897637e+02 2.183159720406003146e+01 1.974028483025999492e+01
1.859151459203721117e+02 2.334686185348687104e+02 3.860310649934099558e+01 3.034965588872046283e+01 2.868778061200023899e+01 4.581689094414478802e+01 6.828783427285704022e+01 1.788174894188029995e+01 2.405386636832180614e+01 3.600039553159952277e+00 4.525904301786202844e+00 6.631941873801604714e+00 6.938071431939078160e+00 2.303160422144141251e+01 6.060076955449738279e+01 7.331691953995648419e+02 1.253061542668657694e+03 1.635347122851396762e+03 1.013752731026495894e+03 6.959186429252674770e+02 4.469584144125578860e+02 1.463585359247293241e+02 5.219046467909860354e+01 1.025655550371537998e+02 3.414704985333570448e+02 1.078550315418133323e+02 9.531698865965503842e+01 3.214498245278829813e+01 3.648356871277226965e+00 2.982519715589073694e+00
4.093455135220917214e+02 3.385897819676195581e+02 4.051842052779868908e+01 1.955942576758747364e+01 3.245882667031212065e+01 2.702005557420935489e+01 4.366246005737531988e+01 4.895430781443272039e+00 4.272788865242104883e+00 1.778611577417056777e+00 4.064756339999541446e+00 7.425450582599717464e+00 9.354030843366100356e+00 4.690975445218931128e+01 7.171547159948957528e+01 4.185866536678289549e+02 1.376484381745747214e+03 2.332233174741415496e+03 2.415651408305830046e+03 1.914338961035285138e+03 3.679203056763630570e+02 7.456509429385383214e+01 8.416858941301711639e+01 1.905517226757886533e+02 3.971546581510339138e+02 1.104840826807071039e+02 4.067100625211689646e+01 1.514334554147285061e+01 4.698137136040946515e+00 4.197252663274647411e+00
5.425534048026421488e+02 7.318706757974169363e+01 2.193497638419408347e+01 7.880918642229357118e+00 9.964568007823597640e+00 2.315405328973576360e+01 3.123496373402166881e+01 3.664862258535711348e+00 2.092711890455599022e+00 2.332350232810309620e+00 3.993300311213071829e+00 6.605209075226760262e+00 7.082426067534612457e+00 3.649782064698844408e+01 1.324232667812673867e+02 5.959464697739127814e+02 1.045525132694084505e+03 2.199313965960663154e+03 2.544340397750702323e+03 1.966345701692786406e+03 8.807537341531108268e+02 4.587264262787574864e+01 2.957052997114269743e+01 6.050143821210127726e+01 3.342438917715417119e+02 1.925105658050983379e+02 1.680141959936500484e+02 3.093899345657502309e+01 4.381614883833561791e+00 3.267867500034964401e+00
3.269903122173481052e+02 1.054461292560472430e+02 4.311135829785823148e+01 4.307535900650307781e+01 1.052503138533592164e+02 7.621259726651635447e+01 3.301842102886980967e+01 1.421232528262988559e+01 2.210467527239599406e+01 2.778346940500803086e+01 2.506421966122227118e+00 2.745781133587898104e+00 4.055957473205868524e+00 8.551231737716516790e+00 4.829310887836703614e+01 1.845605132531831316e+02 1.703852806378460514e+02 6.723746489171658141e+02 8.007875712034301614e+02 6.293067874643637651e+02 4.714098790021915875e+02 5.495772479663437338e+01 7.724409642275506194e+00 1.464989329993359135e+01 6.397855234829340532e+01 1.577413435782651447e+02 4.166201442865529430e+02 2.266969518341390426e+02 5.479014629305224204e+00 3.976334285373030575e+00
1.188153266363834604e+02 4.898533748363068696e+01 5.476823694722983760e+01 9.868958707639430372e+01 5.917202817359334688e+01 2.805575439077168909e+01 1.350323932538021054e+01 9.982562738599064289e+00 3.283448890498509343e+01 1.226863771715420057e+02 8.087013888437871501e+00 2.712877560818764522e+00 4.347244230586175817e+00 8.877631270633045801e+00 3.939054531856987040e+01 6.632906299966263930e+01 4.221790474902651624e+01 1.950253037784676025e+01 2.883583020388861229e+01 4.874664262780876101e+01 7.909823688339125169e+01 1.663851026294462443e+01 7.992245552031567613e+00 3.988845667338540579e+01 9.600249648073811670e+01 3.364976900336242238e+01 1.139678025601114086e+02 1.229330703663502220e+02 4.234809997500961742e+01 6.255140980772832648e+00
1.205181402773868626e+02 1.005308424523445581e+02 5.128155961274772778e+01 4.022324834175820030e+01 4.111171109872030627e+01 1.631843232363262430e+01 1.128285613712487567e+01 1.216345116443893914e+01 1.394240210215550846e+01 5.369797495335863147e+01 1.467041312052389657e+01 1.354333915004074740e+01 1.210878068698990973e+01 1.405316299377303935e+01 3.815383350981906574e+01 2.524968673024974208e+01 1.642230731751261885e+01 9.502354766158763510e+00 8.113933978205036368e+00 6.011772959735001365e+00 4.583281932411361836e+00 6.435286545644499867e+00 9.871420238382555112e+00 2.411927901294983911e+01 4.159599194178306902e+01 1.962549663805660316e+01 3.071200401511867639e+01 1.968979127034221221e+01 1.927578465085087345e+01 1.207909888339634108e+01
1.633506491945439620e+02 8.854070546313766954e+01 5.273897231189817347e+01 7.720345050003402321e+01 7.449576622630520717e+01 4.274053838926803195e+01 1.528096013478769919e+02 1.219741764042384347e+02 1.875929469610656142e+01 1.312806378714982358e+01 4.529626845428647464e+00 1.009838160871612445e+01 2.839369978282739382e+01 2.942327439004460743e+01 8.592067653989531095e+01 6.141248656675363549e+01 1.874110476338017151e+01 2.157065545791609651e+01 9.695301198569254097e+00 4.114638113948179132e+00 3.654013169337406275e+00 5.456047518893026194e+00 8.305218545518494366e+00 2.534510187185762931e+01 2.552077623788611760e+01 6.006952160225513815e+00 6.571288001256599287e+00 8.250030365954390987e+00 2.629956514200737061e+01 5.333756576349059308e+00
2.193039253800762367e+02 1.973549753469088728e+02 6.274246519352802665e+01 2.300797393817406942e+02 2.928132433005765733e+02 5.823764240566838453e+02 4.105078191267731995e+02 4.920440425836960685e+01 1.846059314496384829e+01 1.029359960900093185e+01 2.942383337172188362e+00 3.570933267213094897e+00 4.243851724130063729e+00 1.607753189176447606e+01 1.922532973674682211e+01 8.330296893425098048e+00 7.879062105019575490e+00 9.281638855663809196e+00 1.234977766867792681e+01 6.520377224685782735e+00 3.524148074297603905e+00 4.766697185594695796e+00 5.332329401757178289e+00 8.807758731904097971e+00 2.712918574302099017e+01 4.195149623207036882e+00 5.968578376034951560e+00 9.727003255764710588e+00 1.163533433983320009e+01 2.301337600503489256e+01
1.202935608397984595e+02 3.124836819470238538e+02 9.842425827885361400e+01 1.131892200710712473e+02 5.965375423743365673e+02 6.613133287013877180e+02 4.608419598375626833e+02 3.326402161482616293e+01 2.421364040452530730e+01 2.201004520802477060e+01 8.724907697689644692e+00 4.187163062474323461e+00 2.573416439556345914e+00 4.317823350902862067e+00 1.995649288952456146e+01 5.642252388605242253e+00 1.923405607617749169e+01 1.113296267301169280e+02 1.890731693990909434e+02 2.525187807925255612e+01 4.893627952572662920e+00 6.179781766151252853e+00 5.245797507707396612e+00 5.705313148814905588e+00 7.483926230498969545e+00 5.656952538506677897e+00 6.557428303754894827e+00 8.035188280291080787e+00 1.076855172369288383e+01 2.629811999658316068e+01
