2.718247507722463818e-01 3.961509715445211688e-01 3.339462382593972878e-01 4.121123025480938340e-01 2.878292611370152909e-01 5.975622897665572308e-01 5.426830366710322373e-01 2.750968395078931192e-02 3.948735229882339298e-02 4.959623754505061710e-02 6.373402699374673963e-01 1.634827762078871483e-01 1.060587551369266968e-01 4.177358069991556899e-01 5.155256602136015776e-01 1.219682155585189165e-01 4.580318060352764342e-01 1.212750078392205340e-02 6.019223626704124988e-03 3.337893142345517150e-01 3.158087123686317277e-01 4.771206413332051283e-02 3.690251074300674589e-02 1.497962558201437755e-01 2.960722412710858897e-01 2.361052611839514759e-01 1.101963727494253281e-01 9.685805482432958621e-03 9.224362929474590883e-03 1.156643651961512809e-02
1.806561207132658664e-01 3.889081376764247366e-01 6.833538734429877026e-01 5.136126261285381966e-01 3.529134030564050617e-01 7.605889097847967628e-02 3.007160531456474703e-02 2.297687025558501836e-02 1.088698940604026187e-02 4.998483690755706199e-01 3.971464498341979454e-01 8.544585800430272438e-02 1.263518962568966064e-01 3.234237281686735410e-01 4.695934751743802149e-01 3.347723465310531998e-01 4.239751543757674379e-01 2.892481636807481965e-02 8.759584012054089444e-03 3.962607839476794958e-01 1.795537261063046008e-01 4.536556492972929067e-02 9.481453799197250842e-02 8.639148583858810571e-02 7.838794118103582786e-02 1.074970199904538432e-01 3.856224812845725908e-02 9.790714717902977357e-03 1.390585406994286621e-02 1.387056799366058989e-02
4.422209833892624259e-02 5.906435132040227520e-02 1.208851007224611002e-01 8.763532311858318602e-02 1.550408525221939893e-01 2.751344213682752407e-02 1.497215173912204988e-01 1.559878022858458557e-01 6.020299493640741267e-02 1.767425322092163256e-02 4.819931596397926399e-02 5.754395251047940418e-02 5.792825113438487827e-01 7.314866611811307595e-02 1.931179616829743761e-01 4.713786371846401951e-02 6.480348495499496098e-01 2.754909181579747943e-02 4.942918102621676746e-02 1.015660470629763980e-02 1.122382259711615371e-01 3.721425411727277699e-02 5.689884081205436733e-02 2.021728662812683971e-02 1.236898785911264530e-02 8.378869312338435224e-03 7.674893960775342437e-03 6.022236137583328666e-03 1.025723265346412290e-02 1.148210306814055441e-02
1.890606891423644853e-02 5.177834313413701844e-02 6.835576925106055801e-02 5.508288544994618952e-02 3.534245203188343676e-02 3.063717567623858162e-01 3.023434924018296721e-01 1.862910864082049922e-01 1.001509687470803628e-01 1.397003783145035066e-02 5.044173284354505071e-01 4.218768651403463632e-02 5.707527181850216014e-01 4.597302523771119587e-01 1.434524258538809049e-01 1.216408029037908123e-01 2.655539755906525246e-01 5.182063079141285833e-01 4.030271246211467040e-01 3.721427049451913049e-01 2.063744809951607584e-01 8.025644330490541711e-02 2.701756983484734920e-02 5.419873399304055150e-02 1.014331813381385422e-02 7.405860606793575676e-03 6.493419172979970899e-03 6.154443228723098513e-03 1.247796897742184212e-02 1.353922801062789651e-02
5.816460653190492769e-01 7.454612530051034358e-02 8.122820416797266185e-02 2.072562701912368174e-02 2.216320459215305808e-02 1.788766345894656218e-01 3.096674036289501220e-01 1.728369511525382485e-01 6.298523510953117632e-02 3.630534310378127905e-02 3.390884459706612619e-02 6.571007187073733824e-02 3.454938017606487555e-01 3.584319134176767729e-01 1.875867601667841889e-01 7.612422379394706562e-02 3.640047365048916517e-02 5.073274466478091549e-01 2.156625680167943704e-02 4.734662290891881731e-01 3.383316746318603685e-01 1.057869005866455131e-01 2.704947884684018033e-01 9.027065532254252567e-02 1.842767090441067498e-02 9.902947668580705173e-03 6.977996901031894260e-03 8.060097770920964660e-03 1.258837119995426419e-02 4.622873970986679515e-02
6.693967216956234756e-01 6.350815068589285017e-01 6.956842376442330667e-02 4.274338641848345749e-02 3.502415619516306006e-02 1.041077553088987501e-01 1.335859300545686468e-01 1.414046301939820005e-01 1.171269717957162393e-01 1.514573899679305946e-01 7.664896309999244539e-02 4.389655590914912087e-02 1.551664482475640650e-01 5.918812496086919839e-02 5.022191212770408392e-02 8.867582555890811402e-02 4.843095881704450045e-01 1.248470509923686744e-01 3.953732332178265807e-01 3.576491047221515979e-02 2.570046126376775847e-02 2.170141547267322168e-02 3.389441979271455851e-01 5.330916920818520172e-02 2.765840043746459892e-02 2.591198883894731131e-02 1.629283654201720347e-02 1.122492445015074204e-02 1.480419889330914125e-02 2.656959942645907569e-02
1.078883066817432901e-01 1.660651937181456261e-01 1.602832114201493963e-01 4.498994308969066908e-02 3.621389521577089710e-01 6.081130423127024676e-01 9.576911447512720388e-02 5.457096269279679834e-01 6.177784367957457334e-01 6.455537381536201602e-01 4.523684789315582933e-01 1.892467079031486810e-01 8.626644132862837377e-02 4.055895905094662052e-02 2.418851878245148468e-02 4.561838552913059092e-02 2.680368423420160240e-01 1.250294348268271571e-01 6.086105238755484814e-01 3.493110329569056732e-02 3.960106797085891639e-01 1.096852011371221292e-01 5.081408141359257391e-02 4.863993210530690586e-02 1.881726909398502567e-02 1.929979711674594672e-02 1.716333352267239432e-02 1.490120573283250371e-02 1.727923197819749776e-02 4.071960463333813840e-02
2.273452840976608880e-01 4.267804224283434644e-01 2.248202914264309515e-01 4.433866135627016480e-01 6.578155520754228602e-01 6.779040934685996722e-02 6.590791114958045593e-01 6.516606576876836643e-01 5.656532127456402881e-01 3.089184355498768575e-01 1.201342482526607663e-01 3.515027241641837108e-01 7.521642819578353012e-02 2.650008785319462809e-02 3.050654132958899659e-02 5.889245674080008375e-02 4.664277022442548382e-01 7.307305908237605729e-01 6.407191062927484193e-01 4.882444727507518345e-01 1.558418722671933154e-01 8.934148526785157252e-02 3.548108577277304942e-02 2.963327529676018299e-02 1.413354601858217950e-02 1.490364252993216926e-02 2.425150510897156053e-02 3.122079691553398054e-02 3.060176105212137482e-02 8.768443564849642824e-02
5.594868149532941093e-01 3.638481065754368693e-01 1.953137007257164104e-01 1.110293066473691664e-01 6.723117003627522292e-01 2.973203801902416510e-01 1.312691911405618195e-01 4.722408395025556871e-01 4.318108602756371428e-01 4.241885673849312699e-01 3.668339714453571765e-01 4.478795307658605118e-01 4.651493695671718442e-02 6.141777159718656565e-01 9.742473857248530600e-02 8.378257787124411549e-02 3.459648703553662719e-01 5.111860386537331324e-02 4.631474533985548148e-02 2.070686466830404526e-01 4.003346910978438505e-02 4.057513355453028908e-02 4.390728336324743741e-02 2.866640265256865938e-02 1.683767259356113918e-02 2.587190335476662745e-02 1.030465414836784221e-01 2.056964338236247636e-01 5.807108530391168477e-01 2.806091080580088160e-01
8.789584965465089272e-01 5.593145998928180651e-01 1.811514683293398154e-01 1.149594166908069343e-01 6.457406937668116464e-01 1.325209575877684953e-01 6.640787364155547046e-01 2.978834341222385551e-01 1.401069223727689217e-01 4.944525656135998620e-02 6.601168563996939742e-01 5.528567676891122940e-01 3.617675507794425316e-02 3.069013904345735747e-02 5.978358217782475670e-01 5.983270020734537953e-01 5.620710638130408526e-02 5.071972084228394684e-02 2.328127673217561186e-02 1.522218940788992031e-02 4.882121944707546596e-02 3.072543490053560034e-02 3.512091668412978263e-02 3.862282771126710618e-02 2.164946912900869366e-02 2.787347293049364724e-02 2.703404377239010947e-01 4.585512884845149850e-01 5.614027212876256945e-01 1.448912177331668771e-01
7.356692056234460653e-01 3.717564020676153991e-01 8.006644435015861649e-01 6.687370316413822069e-01 1.496172251598442693e-01 8.288227802759176588e-02 7.546680462878221918e-02 6.884997721976827967e-02 4.538638700118529518e-02 3.512396306146928215e-01 9.135373177269648370e-02 1.147411181082035186e-01 1.651631598606927431e-01 9.240247489264422076e-02 2.143767862774768190e-02 4.065636266595846343e-02 6.067628486582057890e-02 2.305518457447664621e-02 3.309194516769866645e-01 8.069664252690002260e-02 3.313590548191563262e-02 2.946995324355735843e-02 3.791474632223898467e-02 5.308221479271296728e-02 5.689886146888446794e-02 3.109977511502714717e-02 5.031610289769709171e-02 3.986287139635540794e-02 3.555914104286732325e-02 2.535682590085479998e-02
1.428938187594253895e-01 8.215497284110127862e-02 7.123416963436567384e-01 6.889637941152477740e-01 5.482483772872080996e-01 1.285777710535017382e-01 5.530620352061108025e-02 3.752020611216859425e-02 4.516621650288411838e-02 1.781666266425912040e-02 2.898532350126316326e-02 8.582397786388043515e-02 1.463240041008082859e-01 7.548059219171145140e-02 2.711990959390426364e-02 3.388715501400658969e-02 3.733386449958273068e-02 3.893277216334729840e-02 5.555034625688519689e-01 1.842124985625267497e-01 3.175740728910654564e-02 3.208919017894621556e-02 3.783972501532735511e-02 6.761545827899691219e-02 6.425821402757454781e-02 4.583810235024041863e-02 3.532004243446953268e-02 3.240235327870762128e-02 3.552841977973707904e-02 3.860781466191155059e-02
2.950247167025755665e-02 7.430242051658507429e-02 1.770767123805132015e-01 4.975478994610843531e-01 3.304276964725369470e-01 1.080696808116307223e-01 5.766959309399678768e-02 5.024319731518644971e-02 6.255222833215420830e-02 4.059852477128361170e-01 1.132465674910708292e-01 3.188391545587184600e-02 1.186465295724095648e-01 4.615566146766802991e-02 1.453553984451433356e-02 1.868217413435886015e-02 5.506164270747943013e-01 1.537001123658793267e-02 2.319733945698497501e-02 3.895547453536168936e-01 3.056693921390394794e-02 3.332026011151169309e-02 4.188344271625379922e-02 6.929002352304475254e-02 8.784287536459968460e-02 7.669259419020423019e-02 5.704026175547485117e-02 5.399191108540013495e-02 4.768523517928648786e-02 3.971855769409606690e-02
2.459948377561198968e-02 7.037509402144430382e-02 1.259074620631019659e-01 9.132894772844994680e-02 5.457005483946594793e-02 2.169923387711058249e-01 7.386076596139576900e-01 6.485078628795195588e-01 8.638851765980044839e-02 2.683361424778919410e-02 9.541625412127904826e-02 5.107533258095438011e-01 5.395528940157092584e-02 6.607002297575614858e-02 7.091982647742112178e-02 1.069227865711998016e-01 9.609609278337938321e-02 6.218391316756904930e-02 1.739527005623756895e-01 1.069172148048730259e-01 5.525341440593695141e-01 2.008156336177625845e-01 1.494925450873391681e-01 3.515875295334700557e-01 1.921914434874056471e-02 5.960857417090147381e-01 3.438163818795158394e-02 6.070539838929384091e-01 6.416432079117073695e-02 7.458728368314221369e-02
2.314413261445300019e-02 2.324165635962137724e-02 6.321166356005722409e-02 4.731310647152042193e-01 1.732189285526103961e-01 3.994826595130823721e-02 4.920350808044738899e-01 8.493691358929435220e-02 2.635083609451537370e-02 1.015206636149715708e-01 2.106788199627825653e-01 4.439900654379130840e-02 5.488636915544976846e-02 5.497797360189483895e-02 5.006812342906465096e-02 6.105555537651025794e-02 1.049144947071748157e-01 1.825383761204894262e-01 1.873230118685233758e-01 1.943999037394317786e-01 5.337371795837873023e-01 5.951103538678795823e-01 4.914703996334817693e-01 3.404779083643243859e-02 4.077408403525782654e-02 1.523056996689053366e-01 1.853109848188042308e-01 4.168198616465289275e-02 6.656850859213553351e-02 5.112822602719131054e-02
2.145173713160430581e-02 2.330191211154448647e-02 5.221545266510348865e-02 5.775719955868535704e-02 3.870817103793811748e-02 4.092670389213720616e-02 2.278102814104912832e-01 6.093511969791929328e-01 1.664796001833408409e-02 5.174344308036836759e-01 5.642499247119234784e-01 4.489554431095091891e-01 2.813854830401201976e-02 4.917244801096026102e-02 4.624172374869294638e-02 7.147565688303532394e-02 1.250624614612107777e-01 1.537442451126480869e-01 9.000143729993648201e-02 2.230111768446889700e-02 1.605243848730964970e-02 1.175337872968355152e-01 1.532417715046910378e-01 2.168244059640010157e-01 1.875239555915016731e-01 2.469308795494536135e-01 1.988134951461821842e-01 6.640005291786724162e-02 9.850098123449960164e-02 5.806812949063233642e-02
2.775385374533722790e-02 3.186211355419432678e-02 3.083991446961539123e-02 2.878106563616385921e-02 4.110508163124523134e-02 6.854478411826374351e-02 3.995186951094360089e-02 1.178551445831683003e-01 6.602974717332107946e-02 1.371242521297145502e-02 1.403696249080621690e-02 2.183155987377049037e-02 3.253790601861471232e-02 3.326865065124462451e-02 3.367482110952529223e-02 6.097670189018270653e-02 1.334035658884559494e-01 1.366465270442900892e-01 6.580267442373351205e-02 2.280104016635197545e-02 9.767255803059267383e-02 1.757591680650029131e-01 2.235778411447397473e-01 2.330797818482668593e-01 2.098442939295667720e-01 1.848649027614538698e-01 2.767528991725559107e-01 6.380503062221311306e-02 1.389525120315542872e-01 7.533131979555315882e-02
6.991927897267299907e-02 5.443399520297803607e-02 2.621178296775092051e-02 3.634005971386388562e-02 4.252578377120312947e-01 2.095617921236861414e-02 7.696606775249204002e-02 6.107617306959604170e-02 5.995923559064936931e-02 2.981498210223958861e-02 1.714297196960799796e-02 5.269977854725618194e-01 5.096793348131778423e-01 1.726591195563613457e-02 2.437581914203874184e-02 7.611968053594921069e-02 9.239076567712171950e-02 1.147051284612015387e-01 2.030486198479664051e-02 3.226319781824760896e-02 1.078354579192701834e-01 2.310307425939085724e-01 2.822158975616373411e-01 2.992107587030221616e-01 2.548042087382060283e-01 2.522038738265166002e-01 2.392168993203420413e-01 2.400724839627625395e-01 7.216249563667039846e-01 5.951080284270529042e-01
2.819677944615235285e-02 7.727826071475897562e-02 1.317226230576095669e-01 1.422490519677670727e-02 1.647472569062276293e-02 2.093075156118164720e-02 4.717166916164376028e-02 5.909053790958506552e-02 4.053129855234856305e-02 3.934829044563244865e-02 1.436043841432096090e-02 1.430143925047543951e-01 2.211413986743605842e-01 5.182055205668494313e-01 1.392765315580024935e-02 3.601547630054696691e-02 2.000223834502339385e-02 4.942017880271423191e-01 1.559219685225075036e-01 1.490801233662518259e-02 4.259154386180215995e-02 2.268317720992040210e-01 2.870993118906180475e-01 3.057657291787081455e-01 2.278638854759377219e-01 1.074185317879018942e-01 1.764422907640132987e-01 1.827931215829617373e-01 6.793005524055939492e-02 4.331524718899444348e-01
5.934148692265036606e-01 1.722577706935088729e-02 5.240382308575101122e-01 7.736245080495995387e-03 1.057893339265714855e-02 5.947543504424063730e-03 3.035251678196977318e-02 3.149523861859242907e-02 3.667627416934241685e-02 1.325528443867233196e-02 3.827404118041103365e-01 9.836375249118485542e-02 1.727351054011850295e-01 4.189476049690391002e-01 2.154196846371761800e-02 6.127331992589676000e-03 1.558287290422041317e-02 3.867773199158935915e-01 6.249815212514893137e-01 3.450960620031406911e-02 1.404455010285774463e-01 2.684504208086928578e-01 2.910222882860350468e-01 2.797563811430655578e-01 2.172321509133330053e-01 1.605351378112108707e-01 1.565675136953866842e-01 1.501484849452548176e-01 7.583982779491736936e-01 3.310495006960356701e-01
2.116066548392802130e-02 2.739981077850479896e-02 1.102860500701226612e-02 9.538279057924948026e-03 1.066463009034055061e-02 5.055710623946678695e-01 2.602399278778078084e-02 1.772198009038785868e-02 5.053432078045407005e-03 4.218252421785291251e-01 1.705017541338927634e-01 1.506408411768256073e-01 8.486852086704242681e-02 3.949081646231317189e-02 8.412503546119760867e-02 2.412601197105382900e-01 7.630381477968475878e-03 2.049000897824547821e-02 1.907328868430530761e-02 6.826455753786822567e-02 1.472915268883630557e-01 2.307222898410493384e-01 9.548929589983008726e-02 1.443646240219512711e-01 1.770448479779635209e-01 1.283714685313647186e-01 1.108280295599601700e-01 1.242725298106224785e-01 1.846786594676018689e-01 2.009334382836342470e-01
8.280565041770387644e-03 1.499725248166483560e-02 2.647830263741790535e-01 2.272575689871905724e-01 2.135145404292462801e-01 3.136652563457997811e-01 4.419958268894516040e-01 1.108617393762313941e-01 1.548817194126791696e-01 2.687279825604456038e-02 3.980487965142728152e-02 6.279145459741375390e-02 6.023676710406165868e-02 1.913225505189015685e-01 4.256803611983520086e-01 5.042082081693313733e-02 5.676797917790510350e-02 7.546566432910775668e-02 5.141946643976045422e-02 3.903741545462394852e-02 3.718847669951874657e-02 2.566369347555116573e-02 3.522764420114398720e-01 1.831267874880564139e-02 3.293940465220922958e-02 1.928798532897263093e-02 7.262481394137102475e-01 2.651734770310195111e-01 3.410255520944754232e-02 3.181260847997863239e-02
2.153105139918435468e-02 2.747715152548138584e-02 3.004631164103901408e-01 1.769970373487142201e-01 2.999333719232911699e-01 2.370762263242342238e-01 3.723785212570074332e-01 4.112040016786269042e-02 3.650583348588115618e-02 1.578505619636139806e-02 3.907452026232798720e-02 7.224360449041995758e-02 7.907329346315010443e-02 3.694410009391067007e-01 4.803183780414631010e-01 2.619241152818089710e-02 5.836402538108600990e-02 1.079667613043781421e-01 1.215362768196101978e-01 1.063825034587233126e-01 3.652439192641487864e-02 5.694825577745565859e-01 6.792963587450219221e-01 5.320051890583844811e-02 5.725002304663399239e-02 1.942492487221107039e-02 3.064528709473504642e-01 1.250876363749422737e-01 4.636570254873616931e-02 4.440838642580441364e-02
2.659558483579755814e-02 4.722530159186023035e-01 1.696446009158451840e-01 7.575826515774523873e-02 9.983143578796194184e-02 2.280698154916847575e-01 2.978109752032429003e-01 3.361760410633774648e-02 1.800012673903508831e-02 2.046655779292441690e-02 3.709803310263518755e-02 6.333516874563939469e-02 5.916408373916915570e-02 2.850463337980010947e-01 2.020567628705343538e-02 4.057258130808379104e-02 4.384308767552273778e-02 9.972682420282320825e-02 1.244113481428133633e-01 1.065708139087353512e-01 1.073264932352447631e-01 3.525799343081780779e-01 2.447881687586492550e-01 4.400524224098893433e-01 9.784982182494490754e-02 4.745492890928976887e-02 3.500060105087322848e-02 2.123611044262012915e-01 3.702596643014467032e-02 3.335996548755841562e-02
1.852395108240056931e-02 1.077577879756471020e-02 3.769848620257570393e-01 4.253274837962429111e-01 1.058576544308260869e+00 7.425781334078792595e-01 3.077649689909352504e-01 1.260631832014781073e-01 1.905321249450586951e-01 2.423808318102144421e-01 2.256261787836170291e-02 2.626382753111161650e-02 3.489788756120371788e-02 6.890571168254798484e-02 3.583740244502721661e-01 4.386558238531008264e-02 2.539312615361059150e-02 5.057852902799950257e-02 5.433195437807007006e-02 6.399013444510157078e-02 8.221146477038998590e-02 4.352893771508175580e-01 7.093669264981675160e-02 1.236150522256759671e-01 5.040366660512283215e-01 1.219943140601200543e-01 7.681153911231003439e-02 6.968901032390652228e-02 4.281854941999203162e-02 3.727815859796301812e-02
5.460661516724693750e-03 3.567987746663307536e-01 4.855478704799622847e-01 9.852348081725111895e-01 5.957861511699105161e-01 2.721533760004983815e-01 1.244493584871611269e-01 8.763704196603533392e-02 2.840755914083835654e-01 1.073482648746814094e+00 7.445144241443300837e-02 2.754470653195216501e-02 4.212879625409646916e-02 8.087610338039266655e-02 3.454462692416370162e-01 5.737030901376830583e-01 3.356511421394095529e-01 1.443197037731231147e-01 2.024358184331104815e-01 3.434159556740886132e-01 6.063318694202993742e-01 1.442330914556832211e-01 7.590294313636775092e-02 3.682597168243048058e-01 8.432499326176118304e-01 2.613449751325508941e-01 6.806832628251878459e-02 9.910150819896217100e-02 3.484275801185245380e-01 5.914882394519669490e-02
7.921930184751830792e-03 1.171627152829799769e-02 4.767875329870797652e-01 3.987041541083428675e-01 4.070718043932815000e-01 1.520691602765444628e-01 1.004754630531187465e-01 1.044501397212976856e-01 1.204050604491091886e-01 4.698628506561896012e-01 1.384188134732353970e-01 1.434226968541194303e-01 1.200344677752066685e-01 1.343557174161423839e-01 3.608555248368153778e-01 2.379352791507769183e-01 1.488664658290614895e-01 8.233155801767801096e-02 6.883060503433899302e-02 5.129900867385656094e-02 4.134187685556136443e-02 6.095717482581895774e-02 9.459949751097668225e-02 2.273797179976932981e-01 3.905211337688823114e-01 1.762474924281037247e-01 2.588018549445776362e-01 1.770457575559313546e-01 1.821971046782388803e-01 1.198076800281456522e-01
8.482630376663014699e-03 7.083274855752091925e-01 4.645671740975886865e-01 7.207173109673525868e-01 6.644774010776727247e-01 3.639368756912242375e-01 6.940845817335756542e-03 1.014873170703791239e+00 1.599157290995692482e-01 1.140011001566238469e-01 4.344013670651015319e-02 1.074087220484703370e-01 2.827438750871421047e-01 2.842193126732256991e-01 8.243130489291001783e-01 5.821448768737973456e-01 1.671743878807536166e-01 1.781077462902640463e-01 7.774597189002509234e-02 3.395757939481828386e-02 3.313753587717738897e-02 5.210674583979066354e-02 7.989955620683711346e-02 2.455483992147243777e-01 2.495614550434698542e-01 5.908151197462269133e-02 6.520961776065471727e-02 8.328885418253224870e-02 2.702536762887381983e-01 5.514180983117337315e-02
1.137656673693040674e-02 1.673650689284418916e-02 5.331803532751739905e-01 2.037838690498563685e-02 1.387827206601225521e-02 1.909491084917275955e-02 1.625335387346808422e-02 4.023504393149042180e-01 1.587359837258066342e-01 9.052084349316964762e-02 2.774088381376845630e-02 3.795848779626576769e-02 4.260664113774555867e-02 1.559308694599513267e-01 1.845293468820459193e-01 7.605167301650915535e-02 5.793087777520227605e-02 5.658169365732135941e-02 7.382450204417755069e-02 4.217086718342596963e-02 2.996303686732610175e-02 4.473360715741892674e-02 5.108729169707638962e-02 8.596640833340118970e-02 2.702746782607820530e-01 4.282166480597369290e-02 6.229448530502881137e-02 1.015103523394021018e-01 1.219997362282692482e-01 2.416088395037954417e-01
4.098902836044232730e-03 1.815185757440177308e-02 8.304631082493387773e-01 6.439022139716375596e-03 1.527373263274909437e-02 1.601467270142583471e-02 1.304309056672372027e-02 2.806288060403500650e-01 2.163891478742828722e-01 2.012445521550954297e-01 8.262207214829836444e-02 4.260176344412949789e-02 2.729809902539728425e-02 4.316242036652544189e-02 1.952916093154218602e-01 4.983829849099156994e-02 1.267589444878886862e-01 2.005303031323391744e-02 3.367961145079147178e-02 1.614366176808593178e-01 4.177719125841895809e-02 5.855727144221090086e-02 5.107500734834093808e-02 5.652389085462038859e-02 7.546135568126689785e-02 5.809880564799816544e-02 6.862068603975796099e-02 8.442512473959733199e-02 1.135098144350985133e-01 2.787631435098178456e-01
