9.309103830242313263e-03 1.393497778309490606e-02 1.207533460536213896e-02 1.516374015103283922e-02 1.145392835528419653e-02 2.498764516665576141e-02 2.468360768019024765e-02 6.653802785050591528e-02 1.202030643292613526e-01 5.292412953200292813e-02 2.395776363037942919e-02 5.340842090606028915e-03 3.077194370109732468e-03 1.138501289329985761e-02 1.312274614585363930e-02 2.850480637394254418e-03 9.875404182412646573e-03 1.698860797294738170e-02 1.508862908936394430e-02 5.238661493026895710e-03 4.751759457349356668e-03 5.144282279998971946e-02 4.117082100312623172e-02 2.152219240189821945e-03 3.869161511847502618e-03 3.112636961818906426e-03 1.491608225994728310e-03 1.165573299077540120e-02 1.125157359340847076e-02 1.404995105478118109e-02
7.604500876637181397e-03 1.728323956057463764e-02 3.093499049217738120e-02 2.521022779200642397e-02 1.749757889029906338e-02 7.777110228807848635e-02 3.659319798412315888e-02 4.582793820109980903e-02 2.964408282788162999e-02 2.455899885915209871e-02 1.676819283359559307e-02 3.173310339381845042e-03 4.115368630411929581e-03 9.291092082636794036e-03 1.282451904098177824e-02 8.112777423744070918e-03 9.842955451952361406e-03 3.156127031289637092e-02 2.328755956684792905e-02 6.875707214219931723e-03 2.765286007950405571e-03 4.785613131489430822e-02 1.608811224054018099e-03 1.238740949847460778e-03 9.457635458646728712e-04 1.288057307786932013e-03 4.419685593104270144e-02 1.169142689216802131e-02 1.690734735787817467e-02 1.682881982143575109e-02
9.536576691608407430e-02 1.004194408380229275e-01 2.122176647328960497e-01 1.726177269140256043e-01 3.658287378007408219e-01 3.694733809971235960e-02 6.767259216691681387e-03 7.171919412958065003e-03 1.138551324191283826e-01 3.338330605465161804e-02 8.589515829715758943e-02 5.487934664879515895e-02 1.958084046347527418e-02 2.817877294312353884e-02 5.313951870023788174e-03 2.195966411870529933e-02 1.443274132888424516e-02 2.886329923852183274e-02 9.361896706367996146e-02 1.520795431270948773e-02 1.544706786840738255e-03 3.828350051088354883e-02 6.107852232058798986e-02 2.218003488287810521e-02 1.387193240935721654e-02 9.681204201945846008e-03 9.118703756803186664e-03 7.297811438636071443e-03 1.243460167228456481e-02 1.391530769340274323e-02
4.433275983851899665e-02 1.308207797375997294e-01 2.872170396670375991e-01 2.321016596566906343e-01 9.459845677339871750e-02 1.449162199853978004e-02 1.129079099013509911e-02 7.508608446884291673e-03 4.549648022675098664e-03 4.145739670176134400e-02 2.582857193073652760e-02 4.960909023361902148e-02 2.190509763118334702e-02 1.432680320206097292e-02 4.146375532338211593e-03 3.096119035147733289e-03 6.329856180108516667e-03 1.156883620679430465e-02 7.990338978759257277e-03 6.668080772047321747e-03 3.065108419643028641e-03 1.139384622703719548e-03 2.821389163432728650e-02 5.799985868182486876e-02 1.161172169210621108e-02 8.914089702311204025e-03 7.934532500444044928e-03 7.520940572610631050e-03 1.524857529563018385e-02 1.654551706695456606e-02
2.547994361201078029e-02 8.098356730883564392e-02 2.261869368423852777e-01 8.767150012459297426e-02 4.970718815179668570e-02 7.184888543663119249e-03 1.086338338884188827e-02 5.971782659065154146e-03 2.747635667867896845e-03 9.436607374985023222e-02 1.164470655840724178e-01 9.623328877101181011e-02 1.391319043173172045e-02 1.325059619342677450e-02 6.175083365739841672e-03 2.287430041365909848e-03 1.971176023613277831e-02 1.110309924466430440e-02 1.746600130719679067e-02 9.867998799930065984e-03 6.810788329736403024e-03 1.925242556852842452e-03 4.710070988499824758e-03 1.442095700377745609e-03 2.164998711118718000e-02 1.213524696227997503e-02 8.636960328377329618e-03 9.975318976678445096e-03 1.557746609054968048e-02 5.720850405886161727e-02
2.527696035126545185e-02 2.695767052779481782e-02 1.209072160682145708e-01 9.688078860541390891e-02 3.819347520748402752e-02 4.073967537959558363e-03 4.917396802033931549e-03 5.210925623303301266e-03 4.858688098014204287e-03 1.458390681626417773e-01 1.134351277937153540e-01 5.841893254569439919e-02 8.022362959038015565e-03 3.163011069219870582e-03 5.186057759689755020e-02 3.465233400864491629e-03 1.270004221917019234e-02 2.946026861613236514e-03 9.376969287883687998e-03 3.203281839804006381e-02 3.923887137118185070e-02 2.465204875036168530e-02 7.229414343687132552e-03 5.958573553283196683e-02 3.336599972703870737e-02 3.232676137299782954e-02 2.041991208775965558e-02 1.404280098586813304e-02 1.845954846811151753e-02 3.314538252757292386e-02
3.452151754124846861e-03 5.554022963473214877e-03 5.884534274246395850e-03 2.988916171270806707e-02 1.433602746826746765e-02 2.372423160448119961e-02 3.571390268506646065e-02 2.019241729219853690e-02 2.386249753284824804e-02 2.767547043138777335e-02 2.123347264497126019e-02 8.644668213208486773e-03 4.520899928352444495e-03 4.586703943581840748e-02 2.684560228445656560e-02 4.619613437555600971e-02 7.367498710671206881e-03 3.141160154629807702e-03 1.584531276668008429e-02 2.158229660657087073e-02 1.006928569711449360e-02 2.919971389926584015e-03 5.985031344115193663e-02 5.829656009525065880e-02 2.367432311046364576e-02 2.437923566846238177e-02 2.144004007614511848e-02 1.843955267865127548e-02 2.050821237397362426e-02 4.873173359853116143e-02
7.083847651038562357e-03 1.316455641389112710e-02 7.758472305875829637e-03 1.684651428459449374e-02 2.607742557420319671e-02 2.935209390566860532e-02 2.587240267405409647e-02 2.428068917663471146e-02 1.927156643997837010e-02 1.072912478918485943e-02 4.292411934247824384e-03 1.320658130058189814e-02 3.630239687337844575e-03 2.941351330045781018e-02 3.335231176770681039e-02 2.303071404024003340e-03 1.436672723924045832e-02 2.103055445490166139e-02 1.836475944763710580e-02 1.384585983381675378e-02 4.741531073509120016e-03 3.487617254692961313e-03 4.207840040636440931e-02 3.676336463696857487e-02 1.762788288141940024e-02 1.778210550295798026e-02 2.647341559834423194e-02 3.069866791052771812e-02 2.978127577112205798e-02 1.606992547980141527e-03
1.787745596016676250e-02 1.192209708362994801e-02 7.056550092856865401e-03 4.143856612702583042e-02 2.714772166328201231e-02 1.151659244962961737e-02 3.684267459751008889e-02 1.649167856503049034e-02 1.389400402785077523e-02 1.362371660912312619e-02 1.208950908815584376e-02 1.562314820042644270e-02 3.536500303437974807e-02 2.473402321527691863e-02 3.630148902901062652e-03 3.105834419767812549e-03 1.241187187425072530e-02 3.788491894273468552e-02 3.728370596756545169e-02 7.289009840911994491e-03 4.374136328200853990e-02 4.668152132531320359e-02 5.240870746397465613e-02 3.513716194746094312e-02 2.063481551920459331e-02 2.845123521020946275e-02 1.682746087219494369e-03 2.960411046918916267e-03 8.720233205661072351e-03 4.399139570852484034e-03
2.818360400697821760e-02 1.865983847467324666e-02 3.023001232957964191e-02 2.886432617053932143e-02 2.557172057851203606e-02 5.065482611420827654e-03 2.326842293185385491e-02 1.051584793199761801e-02 4.470140435033103342e-03 4.591613941256028619e-02 2.269849800869665896e-02 2.177981360479654821e-02 4.565840542873771807e-02 4.851650649182031455e-02 2.266802838767894082e-02 2.454439474062856258e-02 1.321535013538298609e-01 1.376074349270336727e-01 5.515227738449195866e-02 3.120492018248436500e-02 5.570104893474586011e-02 3.605202006550741606e-02 4.181093492241743509e-02 4.579548799324981850e-02 2.544652287954370790e-02 3.054529248725004753e-02 5.882283505875613404e-03 8.542806105701121477e-03 1.087843904641718623e-02 2.828230679855917810e-03
2.296842075170370256e-02 1.221542144266004291e-02 2.771777084173789388e-02 2.423051132623565626e-02 3.104802971099235656e-02 3.554240316933161316e-03 3.576281127832806571e-03 3.427676846550106651e-03 4.516900603983436263e-02 1.305467216557687840e-02 1.781094833367751484e-01 2.924475237422746732e-01 5.989261197528191749e-01 2.909152531172343181e-01 5.283531856398038240e-02 1.026833132420321704e-01 1.917445490681958797e-01 5.311890626600624526e-02 1.263812121845788415e-02 3.359665218139153836e-03 3.741394790195358422e-02 3.414893947714783135e-02 4.336991475121842327e-02 5.897763400566984060e-02 6.200740222114967809e-02 3.361050023714403506e-02 5.283260984854350889e-02 4.065994108850988498e-02 3.762235619857570712e-02 2.800577141610533644e-02
5.241751939115127899e-03 3.070248632825070371e-03 2.272705925018147013e-02 2.289456546481017513e-02 1.803575822368471554e-02 5.186616453922308391e-03 5.464353471129690387e-02 3.861729609310857875e-02 4.696061788588680452e-02 2.531948773721279938e-02 5.309255952613219087e-02 3.465896918893006662e-01 6.166000375599991479e-01 3.159002337991663190e-01 1.125045570062446904e-01 1.257733770321342315e-01 1.388801993145072355e-01 8.180275938106183753e-02 2.005287518979981254e-02 7.018539840663444093e-03 3.535594790483424787e-02 3.652136943744175440e-02 4.193662116436275289e-02 4.567246699176629419e-03 3.308423583987627360e-03 4.990508290324687651e-02 4.028715569944986419e-02 3.761353023899199899e-02 4.160600125538259364e-02 4.575109367342877764e-02
2.615939930475688277e-02 3.495436006750596378e-03 5.276405255712325951e-03 1.650964098242617764e-02 1.095734198749915948e-02 4.340070904626195693e-03 2.624888596699958675e-03 4.956030079381452957e-02 2.387910657560766720e-03 1.226172379945558201e-02 3.726361661602255269e-03 1.092064387298684602e-01 4.559890969717999565e-01 1.940087241059609280e-01 6.053282781630785203e-02 6.961636679725086152e-02 2.565091962384729793e-02 3.754651636962818423e-02 4.262495490803313442e-02 1.770386545030913292e-02 3.326828176086848998e-02 3.649549279311413430e-02 4.434483489942832313e-02 2.958697063718034471e-03 3.078286020284679275e-03 3.308789217706797816e-03 2.964633586756170065e-03 6.144129420223862909e-02 5.247429799240576481e-02 4.408323400015465299e-02
2.299379330310604569e-02 5.030388509024812105e-03 4.484806184716379381e-03 2.848486349071828200e-03 4.210881085939226914e-02 7.007002642787093540e-03 2.351798615033929424e-02 1.881620116283761607e-02 2.476071098152974291e-03 2.856098902334866171e-02 2.736970851004869899e-03 1.766707306742721501e-02 2.070438996866564851e-01 2.786767472186242878e-01 2.959686748648599486e-01 3.984955743575831488e-01 3.574534432932473527e-01 2.313897019776190445e-01 6.304981761645701566e-01 2.948913345662371177e-01 2.621460944944544250e-02 8.647185465958474870e-03 6.359782893652784173e-03 1.449936705110131500e-02 2.963821025057798708e-02 2.757874182027319002e-02 7.890723741532526536e-02 2.940165639837513667e-02 4.071776386769049988e-03 4.124737421836827470e-03
2.265452467962184024e-02 2.158883375420475592e-02 3.948324636542480635e-03 2.240591540226961192e-02 7.072695191614838083e-03 3.549342175899413560e-02 1.475532560868043561e-02 3.914857196059977340e-02 2.700735132388323509e-02 2.742770481974142298e-03 5.771156899353595444e-03 8.775101727284133346e-02 1.853147918032427566e-01 2.345817041311062390e-01 2.114203374330904384e-01 2.550678486175948501e-01 4.340886998873529912e-01 7.486276249005514583e-01 7.606137825099950067e-01 5.955891407661538794e-01 2.528085200535826194e-02 2.622881410488973886e-02 2.327469016926507830e-02 7.298142187794245950e-02 1.052149580379131422e-01 5.392201984601390219e-01 5.387674029400645326e-01 1.079895409057458483e-01 4.175389903194651718e-03 5.491397987988575619e-02
2.224891071789001154e-02 2.328172494481147922e-02 4.578497583930555420e-02 4.760697232772826554e-02 3.147143127600931373e-02 3.809984028841509329e-02 8.034326261221766061e-03 2.100735940384454783e-02 4.342149767831405410e-02 1.533181942531520493e-02 1.567682315863853232e-02 1.357573995897842431e-02 1.051426048579895550e-01 2.125090808126152975e-01 1.978052680107979244e-01 3.025940245191963140e-01 5.228776931321418298e-01 6.344786349992284080e-01 3.661774246140266365e-01 7.957717789345872261e-02 4.754690740102849450e-02 3.250519928630811184e-01 4.719549684516692323e-01 7.982837602615875383e-01 7.619332322526909396e-01 1.009447336253753713e+00 8.178844118957185882e-01 2.322394791926538360e-01 6.817908075798825678e-03 6.502018505001395943e-02
2.962514754020056582e-02 3.332048700313056111e-02 3.130985969825673954e-02 2.845464511400213475e-02 4.167720770649713247e-02 2.516788206782512825e-03 1.236555140075856346e-01 4.077123183497737835e-01 1.987531835878753039e-01 3.368924447839005687e-02 2.475447923329113925e-02 3.818875018469793797e-02 7.512391656069494772e-02 1.106744092260388002e-01 1.461401234035692165e-01 2.620963791802674581e-01 5.638103477335001390e-01 5.665060998930370184e-01 2.678644159598070895e-01 9.169429627293806950e-02 3.931345892925007246e-01 7.092010748007209209e-01 9.046528035728986783e-01 9.450747012778172307e-01 8.556355625749038074e-01 7.609419162296110484e-01 1.151626187908421306e+00 1.992313630646866396e-01 8.401522883729261454e-03 3.750135399364714836e-03
7.566773390673887933e-02 5.832906989821374372e-02 2.802847415231426997e-02 3.936138600554199563e-02 1.442040255444143604e-02 6.149831718123684871e-02 3.320578843115105649e-01 2.721626004633606044e-01 2.673367047920903739e-01 1.326757784214930014e-01 4.813356599896301963e-02 1.283134846582194288e-02 1.247619102104993022e-02 3.199879399141389996e-02 7.218332338550974281e-02 3.321080330135308123e-01 3.476532218757900083e-01 4.035994160985806878e-01 7.017742935275027294e-02 1.234804182297031677e-01 4.343905864631819047e-01 9.319027493792082506e-01 1.139156860772291946e+00 1.211183880043099848e+00 1.039740757158393869e+00 1.045674361222252546e+00 1.007640929073513103e+00 7.907985448385764782e-01 3.483734103855350844e-02 2.272798193214156659e-02
3.036923800074312063e-02 5.773052929833036827e-03 5.820159887072429497e-03 2.411868316550193347e-02 4.905773461683148040e-02 6.736827963441438527e-02 2.132778628300092127e-01 2.673836925187098590e-01 1.835456108234844452e-01 1.428065141662020199e-01 2.988365785720527648e-02 2.926313680975226993e-03 4.441397375602153252e-03 1.249887846376643297e-02 2.713739334682615731e-02 1.595132251937304846e-01 6.041478180526819314e-02 1.915866743678040773e-02 6.396733800401448178e-03 4.631355005801769675e-02 1.758781093321150069e-01 9.341593957159303185e-01 1.178443772777354681e+00 1.252505537509245537e+00 9.356856730933712507e-01 4.451998037534950492e-01 7.386627277197447272e-01 5.019098261482733969e-01 4.502646435196247521e-02 1.752553658206787435e-02
1.700281415206501487e-02 2.146088767009018267e-02 1.325773575188301384e-02 1.626460366487173653e-02 3.777435382826239973e-02 2.169618992435951021e-02 1.119848025306439537e-01 1.450937852872897227e-01 1.339360252477577451e-01 3.181537648897851678e-02 8.057688930724853441e-03 1.722274124951511361e-03 3.159339357230340518e-03 9.238059296330196346e-03 3.629827075109690049e-02 2.354865394569133352e-02 4.255867830367702359e-02 1.246034190420742226e-02 2.324422133760098430e-02 1.101088294677358276e-01 5.953117729236224731e-01 1.128591328394447313e+00 1.212836876928936158e+00 1.158425511134568708e+00 8.977142358540560751e-01 6.644489913389353131e-01 6.493762488073789862e-01 4.337514580341751413e-01 3.886715783695646881e-02 1.367564080481184149e-02
4.531270000726727448e-02 4.067721547081060152e-02 2.052961958192665512e-02 1.452674568153788058e-02 1.854816878343314157e-02 9.927246038131139552e-03 5.661137353284160373e-02 5.071241303867714267e-02 1.425354816740075949e-02 8.269954111030632105e-03 2.950163073887815575e-03 2.357933590417402026e-03 1.429525144550745789e-03 4.146612589060846843e-02 2.089544054457462881e-03 6.891013004518398329e-03 2.439755076002423501e-02 5.504772574295350995e-02 5.248058964779414581e-02 2.338138598691475445e-01 6.427241349638898038e-01 9.347383514966393081e-01 3.816204913504094298e-01 5.712409145454411252e-01 7.353169684466389633e-01 4.149251790205741863e-01 3.081244296033114893e-01 2.574263673895715310e-01 1.184303451562580649e-02 1.116545853574175268e-02
3.634033614266563017e-02 4.102054525867317170e-02 5.971299010128660288e-03 4.086260590815553144e-03 3.317503715986765828e-03 4.940937416483250078e-03 7.234473928393675250e-03 1.876781047926340956e-03 2.570755432671265224e-03 2.919311964644481783e-02 4.104657285034184894e-02 9.234160352759020283e-04 9.707747937646077395e-04 3.532748141754695707e-03 1.012177214052753169e-02 1.293938968487070018e-01 2.450272805931316689e-01 3.495572786358062678e-01 2.355630649418166411e-01 1.761967117264491567e-01 1.256441157841998169e-01 4.515344855313863787e-02 1.762101267799901991e-02 3.798071946439736390e-02 1.361175155448189067e-01 4.542694347923452447e-02 4.113634498321654814e-02 1.826888707751329888e-02 3.814732090016467042e-02 3.589226891576857703e-02
7.441698234083260477e-02 5.637488906226641866e-02 6.088113377431900002e-03 2.639493368369336037e-03 3.891308281820521353e-03 3.040030139841247078e-03 4.944545526840068810e-03 4.268497559023680388e-02 4.029172080047430105e-02 1.764849302510310136e-02 4.131967119268573074e-02 1.068141866426705220e-03 1.213882587143224560e-03 6.840556066000429321e-03 1.175585371848084787e-02 7.654593350510058292e-02 2.742647702407122190e-01 4.996274799283392243e-01 5.529276335112575103e-01 4.733080194968734555e-01 1.011410364494513131e-01 2.267628690791639520e-02 2.839385586322471650e-02 7.002257998825987817e-02 1.547867084281920325e-01 4.531299972649918684e-02 1.703900375572722087e-02 9.037744528924241544e-03 5.228658837873732812e-02 5.075116524180737360e-02
9.031269807315404907e-02 1.140185351726719608e-02 3.192663638421008865e-03 1.069836318195158164e-03 1.239134237116993600e-03 2.726665617801606826e-03 3.733187513012147310e-03 3.543526101979199705e-02 2.036470097576657465e-02 2.316973979049808882e-02 3.983887538912388171e-02 1.068474998492193904e-03 1.031314491239157614e-03 5.692514395959816231e-03 2.150931906946917244e-02 1.096419837927399277e-01 2.062169768614415810e-01 4.597596951048842917e-01 5.612194226359639160e-01 4.681533563533226694e-01 2.358156077269817352e-01 1.370588142402631021e-02 9.854727157986103991e-03 2.153133349424887072e-02 1.237528627303153966e-01 7.455500222931463195e-02 6.653828048727211675e-02 1.715017326606686071e-02 4.130900517701690394e-02 3.767561116815449501e-02
4.862401768787173728e-02 1.503689490387107031e-02 6.027632850044366275e-03 5.828433213113408048e-03 1.337227649584728055e-02 9.200374888693609032e-03 3.871417883192752266e-03 1.605047808796463034e-03 2.439645988003973174e-03 3.282642572217711694e-03 2.393621687199213102e-02 2.705256457314369686e-02 3.471487613465502886e-02 1.429382249352606580e-03 7.729205762150370002e-03 3.384581718874640766e-02 3.284338241956407528e-02 1.347541679928049019e-01 1.662710976825510223e-01 1.410595814127624803e-01 1.205415901133162215e-01 1.580127183112273875e-02 2.475522090457330827e-03 4.902969037049131201e-03 2.174863439981951710e-02 5.493296303680732240e-02 1.472093069402301002e-01 9.329450488489293702e-02 4.540811486513045975e-02 3.990518874198632771e-02
1.732337656084554506e-02 6.879908999100008138e-03 7.625829299234192747e-03 1.336058290516241309e-02 7.548804104116027536e-03 3.400531697958264141e-03 1.553921684041872833e-03 1.082460485075580547e-03 3.404262786203631624e-03 1.308567871998061495e-02 1.009404013324018308e-03 2.574613067224016186e-02 3.804831210137572112e-02 1.475436755523044409e-03 6.260466424748020731e-03 1.208675699604164905e-02 7.998691715072376793e-03 3.815587997779563891e-03 6.594832954281330296e-03 1.326557725769186326e-02 2.824875871181708673e-02 6.019246805718853413e-03 2.844455940883298430e-03 1.238364811452075977e-02 3.036915404525918766e-02 1.092466495535195092e-02 3.784020924572420452e-02 4.464384794416134672e-02 2.412925985547440672e-02 5.632471654785961568e-02
1.755565162855098060e-02 1.410733155346770816e-02 7.139778758759224124e-03 5.425717434792182332e-03 5.214930811429745010e-03 1.966193839823557245e-03 1.294755198719185936e-03 1.317959926988985847e-03 1.445840921601941349e-03 5.870805291009898244e-03 1.723978932906326334e-03 1.824308855872383128e-03 1.672455810861504452e-03 2.145738770245096769e-03 6.153688048112167935e-03 4.666599251393130712e-03 3.145377740363254192e-03 1.875858047752486640e-03 2.524485535067813764e-03 5.242038270527014238e-02 4.284615320831471064e-02 5.823455083638053725e-02 4.966276777456962027e-03 7.013214205356142067e-03 1.438829616847530843e-02 7.056449168666999866e-03 1.141961049810927102e-02 6.753290860029841081e-03 9.855454859365883613e-03 6.412573714798703271e-03
2.384351283111680112e-02 1.245067042480409343e-02 7.344203162378311854e-03 1.038949485185401179e-02 9.441582740585237679e-03 5.157600107846284886e-03 1.755862098121848541e-02 1.321068584934434638e-02 1.936457444370440336e-03 1.497713911313916166e-03 4.290631378928523587e-02 1.417114341477044908e-03 3.984810761121082047e-03 4.469958132244853527e-03 1.387059058253149214e-02 1.134164412554101130e-02 3.586983051152176430e-03 4.261248192274553516e-03 2.952017916264466999e-03 3.481145739747851242e-02 3.437711450485603226e-02 5.085318296284408596e-02 6.939474590297297317e-03 1.035516222484710383e-02 1.025566835265161528e-02 4.721888317693818254e-02 4.206286753450744556e-03 4.302321345200570829e-03 1.102628016204544245e-02 4.157297724541941103e-02
3.220836010409459244e-02 2.790377098020488736e-02 8.777963777379113944e-03 3.103102882509380794e-02 3.729815988110374292e-02 7.092216085087982291e-02 4.754514492087377059e-02 5.369683207235323615e-03 1.920352864766970659e-03 1.186164582190118782e-03 2.877321304114662665e-02 3.287860781740366278e-02 3.516102103821092811e-02 3.211672133214493307e-03 4.461112448474500308e-03 1.902783728656864569e-03 1.812950108023299962e-03 1.881770288866976403e-03 3.255629748680144691e-03 3.800343525612146119e-03 3.083774614362782412e-02 4.473829237340813669e-02 4.693886865039388623e-02 6.914489027913169397e-03 1.840730959717592694e-02 3.533708292702096576e-02 5.201849369784567606e-02 7.995528182153982880e-03 4.913676154152182840e-03 9.789861769116375151e-03
1.807058015118906749e-02 4.470338888861778714e-02 1.377740480369008674e-02 1.516769744784705366e-02 7.556649065551164501e-02 8.091256536047966574e-02 5.428626171922496663e-02 3.756137352228443565e-03 2.657627815999845031e-03 2.596285671857614507e-03 1.446468528825241642e-03 4.482264429092692321e-02 2.567117088322635327e-02 3.794191369405553599e-02 5.114057936740449076e-03 4.777709945703833422e-02 4.787208770476716543e-03 2.503972238035623993e-02 4.478733153167327452e-02 1.220149625775025608e-02 4.349881360204350955e-02 6.032400244016465629e-02 5.019247749131811043e-02 4.905893968200270711e-02 5.346182594320514347e-03 5.041180843877292317e-02 5.952526384587734226e-02 7.286254580161333726e-03 4.255584218327989124e-03 1.042896040648769521e-02
