3.440282083847441830e-01 1.284313885127215393e-02 3.972762645893788691e-01 8.301563043458953101e-03 3.606076077478382325e-01 8.205697299005318412e-03 5.055059863033543703e-03 1.362552422497881333e-02 2.467232043494888352e-02 1.115088797325339970e-02 1.071890751963522175e-02 2.248250575140756380e-01 1.420867983168175586e-01 5.617207548967308173e-03 3.990953027703351107e-03 1.521677565510281827e-01 3.239714594444102324e-03 3.715432850821010283e-03 3.279168110080020460e-03 2.762015888825717930e-03 4.709595689883020464e-01 7.294033353381175477e-02 5.589788037939849574e-02 2.225514060754620882e-01 4.356149500858403911e-01 3.453936584020343425e-01 1.587423301632150952e-01 1.398270619901830804e-02 1.336817427790364110e-02 1.685076692363504658e-02
2.255250007604880091e-01 1.317476978217045104e-02 1.113858679524431378e-02 1.131527330574272350e-02 5.149388801638753177e-03 2.724374663883494252e-02 1.114490509999472787e-02 1.367916679196979832e-02 7.325968027094748730e-03 4.984479048823172061e-03 6.819550931137860136e-03 1.142610571813080927e-01 1.665553804932667081e-01 5.127652658654190988e-03 4.912197453443704551e-03 3.299795791523930065e-03 3.121606926370163165e-03 6.858585939109046112e-03 5.031964134725694891e-03 3.653186033721253761e-03 2.730122732903401128e-01 7.034184895453940434e-02 1.464266374892718992e-01 1.301491945596741084e-01 1.165824907078689132e-01 1.585006951308935985e-01 5.569907455882125435e-02 1.417967592310874839e-02 2.021190282858086398e-02 2.024050122741031729e-02
2.432136353709900625e-02 2.412927999964734754e-02 4.001637015235112727e-02 3.247220694702904198e-02 6.918086354564105533e-02 1.947312003311878897e-02 2.000386153933703948e-01 2.113514512865710127e-01 4.467289249780846683e-02 7.553626158065984697e-03 1.942105390252018421e-02 1.575666788431053650e-02 5.962904122072736242e-03 1.283329070822901603e-02 2.536505626208598319e-01 1.349946702073265281e-02 6.009614228829394597e-03 9.479662377732457970e-03 2.012934008876179556e-02 6.998047367059770027e-03 1.729407732147540677e-01 5.840524183332591879e-02 8.948699565529047439e-02 3.092515931083709979e-02 1.859992012289962346e-02 1.244708286288447215e-02 1.114310538927419311e-02 8.761349887215044360e-03 1.495785183623973662e-02 1.678028121148496948e-02
8.623334616403327546e-03 2.464969569817054146e-02 5.406787021961830669e-02 4.363037700120668549e-02 2.420761257897119031e-02 1.530689829397099966e-02 4.049860546620012158e-01 2.528782230932685171e-01 1.377973542485513847e-01 1.015753798715635786e-02 5.235490111719694022e-03 1.037647469610558128e-02 4.732580826818467978e-03 9.246323741526500661e-03 1.927632438456312047e-01 1.727949945647575258e-01 3.752883096116373940e-01 3.596857095081791578e-03 1.684370614432995289e-03 2.324792474192159501e-03 3.012553985566245318e-01 1.204228711953161390e-01 4.161921140912645811e-02 8.236485588794315027e-02 1.528594074360775830e-02 1.105980768907416888e-02 9.552936185498218935e-03 9.065307744188448591e-03 1.841011544198305899e-02 1.999683678373575038e-02
4.955407193629830266e-03 1.532157905116961379e-02 4.271944524753576444e-02 1.657106418265314948e-02 1.523430702026401691e-02 2.373867824925893488e-01 4.152432445331134536e-01 2.351039042396588508e-01 8.692878394734096514e-02 2.614376622186956323e-02 2.386029401210337103e-02 2.617338802217607230e-02 5.330920013675195801e-03 1.012999437255057353e-02 2.508343719494157131e-01 1.042267852939986472e-01 1.310954595028170251e-02 4.057986803051012378e-03 4.814301223321324971e-03 2.826579484701579291e-03 2.633863874624925612e-03 1.582558350254294477e-01 4.099016096579425339e-01 1.363235594963686514e-01 2.773013265351717549e-02 1.484132568134935264e-02 1.040858245224318863e-02 1.203433072168298701e-02 1.882199391168177388e-02 6.917465802454282608e-02
8.569392185648965279e-03 9.268035069907551091e-03 3.213486402258806246e-02 2.111878542968119790e-02 1.212740858754189979e-02 1.343309941563174403e-01 1.719172531374580093e-01 1.837500068947509890e-01 1.497648885013266040e-01 3.677686917256434845e-02 3.078709113135438824e-02 2.430662621643585319e-02 2.173669782570904485e-01 8.137589561756088108e-02 6.864645924127919796e-02 1.197986537709367083e-01 9.955788906077001760e-03 1.612698388913885728e-01 3.133681155857599536e-03 6.635858635485596992e-03 1.144791347920984595e-02 1.774709784814691368e-02 5.091077921073755563e-01 8.008200594759570801e-02 4.153718925092880071e-02 3.891494376958975349e-02 2.449240957935154214e-02 1.688422685845922949e-02 2.228156497619035795e-02 4.002989132549823748e-02
1.202849236303846492e-01 1.843036511834613422e-01 1.809911044499553090e-01 9.806884661918193954e-03 3.415519664194395337e-03 8.280110475443023740e-03 1.694530240097780194e-02 9.462104487285837376e-03 1.153427949539168919e-02 1.156790076276940048e-02 9.638232563110488843e-03 2.643350830289755704e-01 1.232680056261971635e-01 5.836736450050941660e-02 3.433912427837561288e-02 5.993735842012852533e-02 3.410455352033493481e-01 1.530883195085740722e-01 5.041707029252293602e-03 7.214272767900745467e-03 5.523041795266525611e-03 1.594802911457561534e-01 7.519701043744350666e-02 7.254101497508591567e-02 2.820661892635215051e-02 2.897852572600055632e-02 2.556727608456046963e-02 2.207530736026389745e-02 2.527889375550923523e-02 6.000133875889086116e-02
2.472408663861421774e-01 1.365300002735743770e-02 2.531836879864088341e-01 7.033099489191404520e-03 7.370035952356253361e-03 8.328015767833117644e-03 7.484449555742673024e-03 5.045033072455087919e-03 6.654096931709879356e-03 3.577178091598897103e-01 1.484024452154121265e-01 6.932347599604111316e-03 1.042887065826700044e-01 3.801563609088941253e-02 4.325441152081906104e-02 8.065957957137372125e-02 9.124126136110487229e-03 1.022317157525249112e-02 6.420732566431805281e-03 6.123423612356499943e-03 2.215638767326268410e-01 1.308743023433842911e-01 5.309916350349348085e-02 4.462926989661840371e-02 2.129561015804894153e-02 2.222534161445816406e-02 3.447546952115001367e-02 3.895854679335000736e-02 3.874974981490780790e-02 1.126820499659778457e-01
1.267650668225859742e-02 3.863368857604823625e-01 2.211838752404751418e-01 1.634877113722336267e-02 9.424938709847579046e-03 3.447702732873190179e-01 1.967404389488346464e-02 8.298234739338050669e-03 9.498771683487259448e-03 7.770035900063122780e-03 5.543518947331488311e-03 5.606283905081031055e-03 1.063013029019160317e-02 9.548029894886678193e-03 1.383256760674465846e-01 1.164569882705579901e-01 4.104867496562716184e-03 8.393441489590751370e-03 1.079792794329627326e-02 2.913590670995834242e-01 5.820600344199432924e-02 6.086453455172693983e-02 6.641129029220781133e-02 4.351405649643610291e-02 2.551358392521715923e-02 3.831506904270055164e-02 1.425521046042839690e-01 2.530425436790840199e-01 1.229026831653840836e-02 3.444409994982024492e-01
1.293576952695752597e-02 9.782977402501608424e-03 1.548014778208827054e-02 8.943625687815421124e-03 1.082049669323472199e-02 1.660316011582241291e-01 2.060335977002682867e-02 3.682846477897802062e-01 1.723214174079413796e-01 6.103742521483641881e-02 5.207473283878762300e-03 4.898584337870786135e-03 1.041364925728984620e-02 1.365530681329431631e-02 7.166823125099915787e-03 7.707633287444750486e-03 3.426332729153930279e-02 3.176153734446149346e-02 1.877715556674337122e-02 1.334328139177171253e-02 7.428043596498620782e-02 4.702857061264929112e-02 5.402768234321979335e-02 5.944459458566644233e-02 3.323221859979329923e-02 4.198942241887634180e-02 3.823590857927903763e-01 5.779114466341812584e-01 1.259271814997667965e-02 1.807095132240024715e-01
1.380407038366208115e-02 6.938010707550004361e-03 8.778723043618864158e-03 5.913608177380864223e-03 1.542844738589783417e-02 1.052873796843325216e-01 1.027801486008103615e-01 9.314440516351223109e-02 6.354014651745901188e-02 5.557345910621390786e-03 4.136293698327522111e-02 6.646839679146934743e-02 1.383544362922414228e-01 6.872699897896566990e-02 1.274700220910791187e-02 2.516974281048363349e-02 4.657672400266541640e-02 1.275049175563701398e-02 5.177946173585158511e-03 1.223736242937806251e-01 5.160650588961390728e-02 4.612290098833553981e-02 5.957696658489623764e-02 8.341789275430851192e-02 8.921410232029977627e-02 4.822301557071507344e-02 7.493032135125216042e-02 5.533695649894059682e-02 4.918761204736521453e-02 3.541087014335637939e-02
1.843494600472388445e-01 1.005203342050963317e-01 1.642361974243049597e-02 1.751976656789983045e-02 1.633406955277274392e-02 1.714473233619197012e-01 8.014998276567489310e-02 5.521527738145099590e-02 6.521676452206269514e-02 9.015955391230278185e-03 1.264860721060841534e-02 8.269063252213840198e-02 1.425551614403581246e-01 7.477122913671627180e-02 2.726419930101595113e-02 3.109377687672435636e-02 3.430677108323423180e-02 2.014604696362031627e-02 8.673178238421699188e-03 2.831139586798885333e-01 5.010574332431101674e-02 5.102696816616861253e-02 6.034634127152858907e-02 1.079385077064864279e-01 1.026180318760167298e-01 7.310180596380647100e-02 5.607759352147788368e-02 5.058205655933634137e-02 5.526172972284695839e-02 6.027407184402421014e-02
4.365788314414741078e-02 1.026913005271834212e-01 2.254121902023447088e-01 1.995033256560713869e-02 4.116514524369601080e-01 1.432418765654929205e-01 8.035169465035785219e-02 7.043044184786692585e-02 8.992630729182231331e-02 5.076721181883219608e-03 1.707222491783476903e-01 2.831717514803962915e-02 1.056479314444471879e-01 4.602296073987868080e-02 1.470363580718182794e-02 1.727394544994743236e-02 6.408869288985704488e-03 9.426157039887597677e-03 1.590106672236216850e-02 7.433993277000516126e-03 4.867646333669609082e-02 5.337988839731705459e-02 6.700201963024117469e-02 1.112876021892532374e-01 1.410065633910900229e-01 1.246404229991261436e-01 9.194876025294618227e-02 8.627913204810198911e-02 7.604895032619819750e-02 6.359766905663352676e-02
3.756298491946304108e-02 1.030758216393901083e-01 1.596053553613988596e-01 1.119777081345142700e-01 6.619944348959658220e-02 2.913928285561760978e-01 1.912012667158281831e-02 8.332905267601668081e-03 1.265010177336410302e-01 4.115067933996482963e-02 1.451413496214226662e-01 5.678833322991287680e-03 4.792533201589689595e-02 6.619603780517763214e-02 7.202785704849938575e-02 9.903778943797085510e-02 9.011250621393705751e-02 5.903089870088709668e-02 1.626158595928307304e-01 7.836996340435738173e-02 1.198338595597573872e-02 3.218733441005363072e-01 2.395264156909146513e-01 9.586414263656372475e-03 1.571403722215057933e-02 1.219834810626654539e-02 2.922932555333045482e-02 1.380281900903356992e-02 1.047991894154824410e-01 1.219527419128905582e-01
3.535384326911730768e-02 3.414818045270284069e-02 8.183301201662507296e-02 2.545128598894856597e-02 2.121344759478851483e-01 5.362798445002321668e-02 9.054924934768802947e-03 1.140463875154543172e-02 8.862108252781396994e-03 1.574996798381287089e-01 3.205269265277245205e-01 2.733271780645235918e-02 4.217275901273709326e-02 5.466105736128000492e-02 5.039057866918131290e-02 6.206180297526316114e-02 1.078651268327528445e-01 1.897764563253516168e-01 1.966311051429733281e-01 1.568053394343973950e-01 1.052955167685008277e-02 1.376492847607345936e-02 1.181959936564974320e-02 2.606806304391313944e-02 2.864845506760205218e-02 1.467646071315205913e-01 1.463121843012031575e-01 3.919440597831979484e-02 1.083163355455785959e-01 8.331091843130902785e-02
3.245077301909887746e-02 3.431255763790575647e-02 6.730155693385671267e-02 7.132193196093770948e-02 4.646573120179461891e-02 5.639794584028248736e-02 3.454639426239431987e-01 5.221014836839036818e-03 1.152153842128457971e-02 5.169839932009247414e-03 5.345658114104836350e-03 3.876574937683579039e-03 2.337895361307974068e-02 4.829179131952025805e-02 4.592014861044227403e-02 7.163674693391032522e-02 1.273362850910494670e-01 1.589994415929588956e-01 9.439008176296365127e-02 2.102268449254988958e-02 1.273452720422633966e-02 8.810701962100334073e-02 1.291545307097752282e-01 2.181447390166388334e-01 2.061465593828040732e-01 2.694042903201616102e-01 2.156148897335790626e-01 7.321643390083433511e-02 1.573311709275543313e-01 9.251087513415362507e-02
4.116879408812986613e-02 4.669369519148594549e-02 4.423970541486704766e-02 4.030721111577931226e-02 5.908192603230047468e-02 1.045777661514805945e-01 3.290945308637514138e-02 1.005273479475604914e-01 4.488751626944856299e-02 7.544646161674021731e-03 5.461486522123750256e-03 8.285350847995438112e-03 1.631799457749008586e-02 2.451044639411357334e-02 3.294756276913222981e-02 6.008985534791121130e-02 1.342580649784510527e-01 1.404044396013834350e-01 6.891593736059764552e-02 2.430884383056828787e-02 1.058927058505786389e-01 1.937386354125212595e-01 2.505539216037929728e-01 2.594792960802704274e-01 2.297622705438051582e-01 1.990925304715463473e-01 2.949392087238419946e-01 5.706541357213133075e-02 2.059484980365324236e-01 1.112135412231416848e-01
1.018640877285694468e-01 7.967997668630970309e-02 3.889319622280595218e-02 5.498361278714387207e-02 4.543157031351300820e-03 1.519234787790215910e-02 7.624608964410052592e-02 6.070755692599644204e-02 5.968128801222158386e-02 2.926903194811800862e-02 1.239260996834961118e-02 4.508500646597999456e-03 4.348890972589839615e-03 9.612699845693944284e-03 1.577185214301264626e-02 7.356143280236841775e-02 8.084420348762345887e-02 1.046581165738503794e-01 1.900298351547080600e-02 3.452661608020726747e-02 1.175112697389829874e-01 2.568175632983195622e-01 3.198218971335934357e-01 3.347289276876019293e-01 2.776920195303408390e-01 2.690035702930523298e-01 2.510103534512562740e-01 2.066389189438493645e-01 1.247068361286985012e-02 8.796651722132576776e-03
4.044066865909062836e-02 1.118274135795137708e-01 1.961008785947205291e-01 8.407308337755246136e-03 1.131105572919276388e-02 1.448257573431660852e-02 4.580288418407285622e-02 5.724892270102351077e-02 3.913706488636108094e-02 2.992360353710069379e-02 9.111178609208648096e-03 2.087517349903080244e-01 3.115838145557378036e-01 5.527075026001639427e-03 5.691183688166519261e-03 3.408630761980981083e-02 1.351300893936371872e-02 4.801651444840075028e-03 2.423701002260018056e-01 1.235731838032725141e-02 4.497471103844454671e-02 2.418514223467578828e-01 3.089606117048367406e-01 3.281350392250190762e-01 2.433222656225395852e-01 1.145748653288500007e-01 1.877399392094866726e-01 1.279634872495895581e-01 2.511133971321732189e-02 1.116309542105647055e-02
5.391354918641469429e-03 8.606991310727457253e-03 5.241125442014547484e-03 4.949475476637750157e-03 7.891105919822798478e-03 4.495849741425497065e-03 2.301883670314815167e-02 2.956350677041343078e-02 2.705344738050360215e-02 8.615913436114192719e-03 4.513139944896401787e-03 1.437395915727320561e-01 2.432791027485952384e-01 5.411941832826431056e-03 9.310936568037041575e-03 5.808374663909392568e-03 1.015168012053225058e-02 3.037351378744548944e-03 5.814991754642609943e-03 2.786125299394432916e-02 1.433520210687798113e-01 2.738758959753394007e-01 2.966538043606827268e-01 2.886361518324473407e-01 2.279352345880018005e-01 1.711919296937318424e-01 1.687888461179583022e-01 1.285872443109389307e-01 3.870297249086719626e-02 4.953661326580863777e-01
9.254207555894507914e-03 1.080263740123026117e-02 7.574620975993383992e-03 6.954850239985949784e-03 7.900797909256558268e-03 2.945069175026222060e-03 1.221256909966054668e-02 1.277869620999268381e-02 3.738889569822375931e-03 2.944130171809319040e-03 2.464821831137788133e-01 2.166727617063615718e-01 1.192629193018998751e-01 5.501187242209723549e-02 1.183016858460065324e-01 3.513529068492877716e-01 5.623545485601700103e-03 1.190601413612804235e-02 1.169816032068216397e-02 5.314574801423925521e-02 1.466135469223145971e-01 2.141956832882940531e-01 8.783408201008878480e-02 1.363259849473836272e-01 1.828684605481054326e-01 1.071078086301789495e-01 1.000088630358008934e-01 9.771175930741465843e-02 2.858451546713868807e-01 3.108108824171991746e-01
7.463838005746091520e-03 1.469154472398722343e-02 3.978939158318355318e-01 3.412151784631617391e-01 3.139721102474675174e-01 3.248132946246097465e-03 2.454663226223646744e-03 1.597249691504924463e-01 2.266527056645097626e-01 3.904015904283690552e-02 5.726336971917852375e-02 9.083158397970780840e-02 8.385091109460927894e-02 2.614068566309324382e-01 4.051611521045061365e-03 3.064544857263722111e-02 5.507363854681066734e-02 7.398021633935347730e-02 5.137419364559082241e-02 3.920172859314798031e-02 2.805216273481258085e-02 1.012301654243078115e-02 3.958783791303852745e-03 8.887756647880768260e-03 3.352869088837785727e-02 1.779946865340214374e-02 2.497437178401801239e-02 4.153523166117598087e-01 5.372722893548068090e-02 5.013817812954451947e-02
1.588411058150270005e-02 2.428329428329682738e-02 4.543574827655890713e-01 2.647964467543654776e-01 4.361053336440283701e-01 3.296076457450158315e-01 2.763537134370204571e-03 5.720454415126464964e-02 5.406430766278193939e-02 2.340024580630365239e-02 5.781032006316422917e-02 1.053611849485110719e-01 1.107794703434569344e-01 5.939730063820002938e-03 5.876734842059543398e-03 1.498424982269926098e-02 5.590154366664738111e-02 1.062506451298501631e-01 1.226623694107320112e-01 1.082456465820356983e-01 2.334766291310055517e-02 8.281437649966753162e-03 1.021584832017824983e-02 2.418554594042279793e-02 3.873813036818277156e-02 1.768687922137342564e-02 4.784780333863701829e-01 1.959005872351169686e-01 7.331825102070572975e-02 7.034299224585197075e-02
1.997816399265746334e-02 4.387170634356885729e-03 2.562258659670212380e-01 1.079260181415315628e-01 1.385156369536045262e-01 3.061189286616001759e-01 4.065359280750338034e-01 4.696532005042869384e-02 2.667910573655919368e-02 3.044284649766148057e-02 5.522931997499005985e-02 9.329699689674461616e-02 8.361621983421343995e-02 3.957798146998425803e-01 9.113679586960420770e-03 2.123527203613771036e-02 4.210477902542808515e-02 9.917135208396773982e-02 1.278678588184444520e-01 1.108612746362078461e-01 5.656734429958912291e-02 6.713005879429427038e-03 3.496642132563596017e-01 1.106216533675216662e-02 3.951316795171898322e-02 2.871532307693180908e-02 3.946410859075652477e-02 3.353974617280358061e-01 5.877353220829777819e-02 5.310679813491809426e-02
1.095030614231524285e-02 4.388419088505514723e-03 2.738672917689737724e-03 5.598824039679530795e-01 7.520164458879472803e-03 5.873772321921459302e-03 4.365287549850704329e-01 1.854709305813760922e-01 2.713634774376956216e-01 3.469079306064026813e-01 3.252154280313450385e-02 3.891510986523982751e-02 5.088407868392578332e-02 9.759733393272271296e-02 6.189133432509841617e-03 1.661269357525384238e-02 1.049951178529529017e-02 4.888683760901651326e-02 4.909985504285753477e-02 3.915538250109512619e-02 4.150633726532586276e-02 1.414027362612075428e-02 1.045427533789688446e-01 1.695088492020010162e-01 2.676863640444399062e-02 2.222957492904926308e-02 7.173546111023637595e-02 8.316637633191617529e-02 6.826663063155977151e-02 5.966551472698995717e-02
3.909556842225251141e-03 1.553034863529843780e-03 3.114448559870723263e-03 6.431613475597385346e-03 4.522070897675268750e-03 3.657928437249042264e-01 1.769842843679489131e-01 1.293152469617711575e-01 4.055290899168665364e-01 9.232764518025262518e-03 1.068869108254389688e-01 3.962078959765387431e-02 5.848953110407163064e-02 1.064053046259451074e-01 4.391794379560169936e-01 1.464690970010941798e-02 4.673934458862446517e-01 2.214667256538158102e-01 3.248730176849692342e-01 8.278387210630176393e-03 1.754024362745174384e-02 2.244096121268542576e-01 1.150441562597939726e-01 5.321471173680641931e-01 1.228933483095460966e-01 3.737964545927724980e-01 6.787567762473369071e-02 1.184625921603244397e-01 5.560279178899943942e-01 9.479451154827119030e-02
3.961751368437637505e-03 3.182749660592382353e-03 2.110228212043373762e-03 5.226728377306291140e-01 5.456386828647581400e-01 2.158670400192290728e-01 1.456508077723505934e-01 1.520236485454823094e-01 1.698094510658315348e-01 6.739544661567681283e-01 1.979386394717741471e-01 1.983852591573879998e-01 1.592562450897196669e-01 1.607627758543359597e-01 4.028114215771584350e-01 2.720067290701601581e-01 1.953270811523196981e-01 1.243435905141846987e-01 1.097979544184232992e-01 8.291594320616343938e-02 6.636341946631088562e-02 9.688877662557797421e-02 1.474976708578900064e-01 3.432248973778747603e-01 5.849150219960481678e-01 2.630878044795337267e-01 4.039894991983600803e-01 2.812014897615564557e-01 2.909863767882265861e-01 1.920515499451538322e-01
5.379414536828892868e-03 2.806690262592709002e-03 2.167250219910522857e-03 3.774256186728272740e-03 3.966583532758079927e-03 5.321490062297623558e-01 5.390812606669643375e-03 4.687327319843791890e-03 2.341007948447575981e-01 1.699189523893407106e-01 6.376813592128038888e-02 1.479982712915340337e-01 3.712447436804723333e-01 3.384760655902777082e-01 2.656344118472550933e-02 1.978296751173480583e-02 2.214738601382507666e-01 2.688139893128943525e-01 1.244069853724530939e-01 5.565275004251207802e-02 5.406017733043388257e-02 8.428793974605645889e-02 1.277062651927071135e-01 3.884965690736634780e-01 3.909146506684152422e-01 9.229671040354725520e-02 1.025938062381911847e-01 1.324587237955184016e-01 4.324027491963754466e-01 8.849325163578447562e-02
7.257593659969684488e-03 6.279206267344095496e-03 1.865104948407708511e-03 6.041903254350763051e-03 7.864023631751581103e-03 1.465581162448086408e-02 1.227913005438423938e-02 5.876967777687134298e-01 2.324775699209413737e-01 1.351317115563722138e-01 4.107084957305334044e-02 5.258151949008197518e-02 5.626696590969522405e-02 1.917308982590673616e-01 2.187095376275408343e-01 9.207291463486261263e-02 7.785083243865130453e-02 8.605496647991456305e-02 1.186235785956907957e-01 6.944425181252450452e-02 4.932039922676611371e-02 7.343058680328502785e-02 8.351250200580964678e-02 1.388749190130356970e-01 4.310913952391478565e-01 6.778540859206341751e-02 9.843377497394957543e-02 1.616629750480672034e-01 1.956040177028121885e-01 3.883586581469333221e-01
3.990863374485356663e-03 9.901514868596672167e-03 2.833497233649279103e-03 2.921436354830427105e-03 1.413869513568782529e-02 1.484828602237572848e-02 1.273660121912492324e-02 4.140370041833985049e-01 3.187734420235515675e-01 2.963482586223334936e-01 1.213054097652922769e-01 6.110536855706773240e-02 3.664974819340038187e-02 5.742501121731870967e-02 2.616798947341484882e-01 6.850071843087338075e-02 1.876816633237307630e-01 1.931477479742793602e-02 3.895994357136343955e-02 2.668978894333606244e-01 6.893611639897401222e-02 9.645589782293922942e-02 8.395534409086523320e-02 9.201033486017075325e-02 1.216687531875056683e-01 9.309450567293303669e-02 1.096923675621381128e-01 1.355388573307393929e-01 1.832764029138437278e-01 4.506085234148067276e-01
