3.396661927148802440e-01 4.864660110653318270e-01 4.086056736872738515e-01 5.064311841321385010e-01 3.534593561166604614e-01 2.470894048961429917e-03 2.773633861366870583e-04 7.379298229899590748e-04 1.323795070217044859e-03 5.968140652116719815e-04 2.636918526821145983e-03 2.072331825086352053e-01 1.372993536362965838e-01 5.032644043979854764e-01 5.764611260980115337e-03 1.390816356645488139e-01 1.273853681604637453e-03 1.552509006806142983e-04 1.016215236363324313e-03 4.606692346544313255e-01 4.252181834498218738e-01 6.418210513229945235e-02 4.896263473443307479e-02 1.954732026355257557e-01 3.805439268367443728e-01 3.001202106420592375e-01 1.389786308572013018e-01 1.225786309373620014e-02 1.172500343558308816e-02 1.477774584943439620e-02
2.242008584328349652e-01 4.734552762174419338e-01 1.466800480840502706e-02 7.812774104585390456e-03 4.243218239702397643e-01 8.090580756085683639e-03 2.042960224027588929e-03 2.431011167740415591e-03 9.009015905687537979e-04 2.637000839274907839e-04 1.599771305043460809e-03 1.050779072237774114e-01 1.595702797925459548e-01 3.835947657369841446e-01 5.670260587921611452e-03 3.819890843770183952e-01 1.161064505556009228e-03 2.811455009479594440e-04 1.425283817209839357e-03 1.512282645289415427e-03 2.447471058075454953e-01 6.165253534945141362e-02 1.275218627532578863e-01 1.139610427666349485e-01 1.015441513500420084e-01 1.374325725359986927e-01 4.888951823553235737e-02 1.244681355933396905e-02 1.773331105035540201e-02 1.774785184935684379e-02
8.237349941743897855e-03 7.600399110708706829e-03 9.400707292491476685e-03 4.388000641932171021e-03 1.730730078625512813e-02 7.184848593145798726e-03 1.862961288115819736e-01 1.954895120073325276e-01 1.036416589777237537e-02 7.247334367473934336e-04 1.732000328509911797e-03 2.612173295661606061e-03 2.510058080316980404e-03 5.886006681355407909e-03 2.360363236399212750e-01 5.431416544529943380e-03 2.312433325893975457e-03 1.537851703222510190e-03 7.494361252338124953e-04 1.783126026521369631e-03 1.516403460271478487e-01 5.103834609300540032e-02 7.761409659150918239e-02 2.701037369563715970e-02 1.616381150682414183e-02 1.078676599447390971e-02 9.797754965842869757e-03 7.697109627251688679e-03 1.312661155409339253e-02 1.471310258815655692e-02
4.832777809121009899e-04 1.345839511719758297e-03 2.945088635009275851e-03 2.379030325895666650e-03 5.699776798024415794e-03 3.777940800664955634e-01 3.761395456077183397e-01 2.339298292433390491e-01 1.270993619895527393e-01 1.190356822932696649e-03 2.725175795123158540e-04 2.624118741565189400e-03 4.597364154706224011e-03 6.539228772292226058e-03 1.835348195313296626e-01 1.593172099103877248e-01 3.412706318138994943e-01 5.643392217694995390e-04 6.700728413241925684e-05 7.898894118356883810e-04 2.734268149334156406e-01 1.090948595108580665e-01 3.652340848354281022e-02 7.193991989135803400e-02 1.322865889997985184e-02 9.523104563185778512e-03 8.266414130799298182e-03 7.847902914799738047e-03 1.593847377856554698e-02 1.732149762421763758e-02
2.729885855706130991e-04 8.163605159472091342e-04 2.273708673404562300e-03 8.841727561465067544e-04 4.132297089244666398e-03 2.201322482726478513e-01 3.846851195700043968e-01 2.171270766373005201e-01 8.014057783610845087e-02 3.862289716516031056e-03 1.274712506547630341e-03 8.018713996254943355e-03 4.390419036186731239e-01 4.559885507541207583e-01 2.402036133647328375e-01 9.687293227535420659e-02 4.039604249881032991e-03 1.476717383303377757e-03 1.797156148868885592e-03 1.494612202838819289e-03 4.486466577660730426e-01 1.422756848463311852e-01 3.606493392597235337e-01 1.186885115867899743e-01 2.389807171951284157e-02 1.268231251926517020e-02 8.841299897699456817e-03 1.024234883872170154e-02 1.604528707147116415e-02 5.909922325554928940e-02
2.273953438609508521e-03 2.495243360366937967e-03 5.981603578626430023e-03 5.197051287916408004e-03 3.646842700718711753e-03 1.244180028318837283e-01 1.582956869697353941e-01 1.693344725084229840e-01 1.378819876603640804e-01 4.388567008907765486e-03 4.810701063329375290e-03 8.841714485245852698e-03 2.057774655844176737e-01 7.767714539096803872e-02 6.530251178191792683e-02 1.107142280361364944e-01 3.386012726927129044e-03 1.492887808430771734e-01 4.912416189612631712e-01 4.773182703208879094e-03 5.293599280580198359e-03 7.849920379004183754e-03 4.472763330208044952e-01 6.953245728983949159e-02 3.567397178322800205e-02 3.305791645164380538e-02 2.058005255178012652e-02 1.424174382508385309e-02 1.887090717364437592e-02 3.402794718761307374e-02
1.181322784562040679e-01 1.796709362502302010e-01 1.765086314141762480e-01 3.345782420398444191e-03 4.006033986314864737e-01 2.530428269046924427e-03 4.459914242317784480e-03 2.452364680134918283e-03 3.788897461700024838e-03 3.920390884228264552e-03 5.531489681684712695e-03 2.483668987140809081e-01 1.150831470023483960e-01 5.375371793623422850e-02 3.155560761343507298e-02 5.488029956077302568e-02 3.119335063344967351e-01 1.417930063829800635e-01 1.676447362203251079e-03 3.448521671478322562e-03 5.116243128229766013e-01 1.446005786099789081e-01 6.652483608604042864e-02 6.306559307012438165e-02 2.416778668992728904e-02 2.455438485925168571e-02 2.164857936609708780e-02 1.890999315901345165e-02 2.206869300168155801e-02 5.235340337703514590e-02
2.386904272506574221e-01 4.444492245192085411e-01 2.464665462628758130e-01 2.622475555721183460e-03 1.932170008467070776e-03 2.170875814417850928e-03 1.137780132158321524e-03 3.515835375686595689e-03 8.057130703557128376e-03 3.629743149341194686e-01 1.488192625397616042e-01 4.512971730706595297e-01 9.701908371758424798e-02 3.469777970327485306e-02 3.951072727025544545e-02 7.397921532150734947e-02 3.187716954410829175e-03 3.169989055515490001e-03 1.196885180177496150e-03 2.086139828445948870e-03 2.011424617019446082e-01 1.179554199363968964e-01 4.677947144235904131e-02 3.880814732255614963e-02 1.835366025744677998e-02 1.918863635775699961e-02 3.098505472500762137e-02 4.015577713562675649e-02 3.963192565393318378e-02 1.143361084664009375e-01
8.365154498235664177e-03 3.555478924822791931e-01 2.070325141631025878e-01 4.238511880353332262e-03 1.696124723190418383e-03 3.121033830432263234e-01 5.627771360212827610e-03 5.123668304078195408e-03 5.009886977636184291e-01 5.147200903033316566e-01 4.611825526364888295e-01 5.823977435552712099e-03 6.521341219726530317e-03 2.342679000934401283e-03 1.254883952160121552e-01 1.065183940059042517e-01 4.268124272737722213e-01 1.276857828713755770e-03 1.394866052670437921e-03 2.613780360731808305e-01 5.196964848758298117e-02 5.399524967795371611e-02 5.846209832152889085e-02 3.798496969453177968e-02 2.214974024854389489e-02 3.378905917192890490e-02 1.337483721785224511e-01 2.684729406466713209e-01 7.628068243088659273e-01 3.711250832606923789e-01
4.763774015128622447e-03 3.651952423564168090e-03 5.844845738097201836e-03 1.386235590166331588e-03 2.121106997863005973e-03 1.463286285687140920e-01 6.760683994830422872e-03 3.490282973513619269e-01 1.725105202873825350e-01 6.261184651180112803e-02 8.846473132022029257e-03 3.149369730889405375e-03 5.465643101043053328e-04 1.587332263749541847e-03 1.034611331746773883e-03 1.632745029154939864e-03 5.754190182458990797e-03 7.611946051467625811e-03 4.369312115892781678e-03 4.062592279456406219e-03 6.548343112592799886e-02 4.133013547864947124e-02 4.731995637132464794e-02 5.186413455080236129e-02 2.890011575895240839e-02 3.700009901664433332e-02 3.571692856723768239e-01 6.077213407545001278e-01 7.476111566563912181e-01 1.942977264234120871e-01
5.140755044348153946e-03 3.479646203358501833e-01 2.679517691159647927e-03 3.037255724915935971e-04 3.304555657894990908e-03 9.045607002344349667e-02 9.043209246816927283e-02 8.406899751385765729e-02 5.893589559277169487e-02 4.636372822652363723e-01 9.395176202556716066e-03 3.397627011718674928e-03 6.973385067968228615e-03 3.434151893730886043e-03 6.325389986978590924e-04 1.237523140074861354e-03 2.251131064484385678e-03 1.729874659377381857e-03 4.384302147031701180e-01 1.064188015130801135e-01 4.453974160139029248e-02 3.975686491925395361e-02 5.131496719839810650e-02 7.176921242929734657e-02 7.668246707936832163e-02 4.178780415015359573e-02 6.744256044360612268e-02 5.346834404152982917e-02 4.778874778805590473e-02 3.426296207061320376e-02
1.556233602294539997e-01 8.497611351465800267e-02 6.755202064941175782e-03 5.677419050075372189e-03 5.057746416070014496e-03 1.455740533900221345e-01 6.884301143690141345e-02 4.820893729080962670e-02 5.953932169718756384e-02 5.545290989871290432e-03 7.938778736878725206e-03 5.550350185809804944e-03 6.953113665889784634e-03 3.618887094997893551e-03 1.311539427114734009e-03 1.483233971716109521e-03 1.622610004686898463e-03 2.733396931423937026e-03 2.187206355182047535e-03 2.405594679458848972e-01 4.225226111767414056e-02 4.301693414809126120e-02 5.085353504178909134e-02 9.104002078778655749e-02 8.662910001401062654e-02 6.184556942957381009e-02 4.769250757930319079e-02 4.357351325575783973e-02 4.773148190380004791e-02 5.190803823738958378e-02
3.697138261004035559e-02 8.865959750607402268e-02 1.976485465754204141e-01 1.194790660784228117e-02 3.544445762833610125e-01 1.219677861742675673e-01 6.813664000840560786e-02 5.977690502925588067e-02 7.907414704948161066e-02 5.432843778018823233e-01 1.526357658633180070e-01 2.677481156949563373e-03 5.003975004893473563e-03 2.159802392140425329e-03 6.854391952718409415e-04 7.996379637369671438e-04 2.968125094065386833e-04 4.373445354349380244e-04 2.457298190258660510e-03 1.472268037770669722e-03 4.015022751599257866e-02 4.405047276170359627e-02 5.579789231144447609e-02 9.296945120656932571e-02 1.182235003661794015e-01 1.037102496569830556e-01 7.678459530922324139e-02 7.249613795315330844e-02 6.394584656034905945e-02 5.334919800465964812e-02
3.205038089780642974e-02 9.034587159501183962e-02 1.576424680974113923e-01 1.126831861397305234e-01 6.658408666246173890e-02 2.584859198951937054e-01 6.930602143995152724e-03 1.976931970455687512e-03 1.075931845501131578e-01 3.554967467161158912e-02 1.275091624032791970e-01 8.532172468781041956e-04 2.199739298229750391e-03 3.010553040940520085e-03 3.258015059613129059e-03 4.460944886282543556e-03 4.093668446340787206e-03 2.705811072245993282e-03 7.513912618234384888e-03 4.355855516166455554e-03 2.346158829405215179e-03 2.604271676832722315e-01 1.962245776837389932e-01 4.691903683235964517e-01 4.954845251831218461e-03 2.098046868356920336e-03 4.129950133108216577e-03 2.941211451002948094e-03 8.635904234736348217e-02 1.002383320924530308e-01
3.006026240404124222e-02 2.995215639154790582e-02 8.083584711699710879e-02 6.019298512338313589e-01 2.190823050788642812e-01 4.863573134024105904e-02 3.209593712869176184e-03 1.391248961750380601e-03 1.465504179422783991e-03 1.307338177238978050e-01 2.709972518751316284e-01 3.891112856202245344e-03 1.864183474894507558e-03 2.412218294620534827e-03 2.225542323414303209e-03 2.746025761511533547e-03 4.837580218374638863e-03 8.632106306464956344e-03 9.068531935866125382e-03 7.315869368619460494e-03 1.667051464614205305e-03 2.765046036026438947e-03 3.439810373160194328e-03 6.731748861891250282e-03 6.017719774578007136e-03 6.944702754105224959e-03 6.919350652847509019e-03 5.039908098483182608e-03 8.878580027788600393e-02 6.813049563051765123e-02
2.762032061538666206e-02 2.986152286576183867e-02 6.641969090755825422e-02 7.338394972899156543e-02 4.913033614744097277e-02 5.133517997727815585e-02 2.837011990025340435e-01 3.708134043260227514e-04 1.053590810423104575e-03 7.817721796251116823e-04 8.451479322714393859e-04 4.639114642485776883e-04 9.903862181561550338e-04 2.066137190597650952e-03 1.986220943034177136e-03 3.130052908249055313e-03 5.661128825263555056e-03 7.198942840036314655e-03 4.352531819641953029e-03 9.838286139199304767e-04 5.973762320246843449e-04 4.132798143197651680e-03 6.035796945831076177e-03 1.030884047178351991e-02 9.858111918993229736e-03 1.294342692587806959e-02 1.037498890465475034e-02 7.389305032003868831e-03 1.292582433505508610e-01 7.587355345470583878e-02
3.533954101849719198e-02 4.045290205344058421e-02 3.921306738570725509e-02 3.661297363291889095e-02 5.263825805372234629e-02 8.867780546096484806e-02 3.633637033755405914e-03 6.918193114499204821e-03 1.877339569585107166e-03 3.123178636885322584e-04 2.234689301180906430e-04 3.350470622017929709e-04 6.620353352997803992e-04 1.015263402131911076e-03 1.391755793871659978e-03 2.586344174887127319e-03 5.908353512389286251e-03 6.331370724895268171e-03 3.178839617847774822e-03 1.140608430342550644e-03 4.988181336504853014e-03 9.142423406690287566e-03 1.183412790902843223e-02 1.242833294183091561e-02 1.114727691166967835e-02 9.705415212806541708e-03 1.437914473842598871e-02 4.688559963841252599e-03 1.695071743193070635e-01 9.144742281948259333e-02
8.823606937964981189e-02 6.874185247611319660e-02 3.334439919596048074e-02 4.646077992498561654e-02 1.215419803191125723e-03 1.611731197283001061e-03 4.006026126919713659e-03 2.486226761952807507e-03 2.412590875482976092e-03 1.171969630629998444e-03 1.088047188852352999e-03 7.438082956650587246e-04 7.195113758797271270e-04 1.254308952598459084e-03 6.520628881537761292e-04 3.126937313287115640e-03 3.530335862320767640e-03 6.563275125162657507e-03 1.186678350873949508e-03 2.138116210216628628e-03 5.558537836577186544e-03 1.223041359651133760e-02 1.533087095617459081e-02 1.630932339439969750e-02 1.370893282426293922e-02 1.330227781932832171e-02 1.236534755550081945e-02 1.303758538926998688e-02 5.713879680724681318e-03 4.638082385932779626e-03
3.524396275558165648e-02 9.618464841525597997e-02 1.665496842081559126e-01 1.774920404088355802e-03 8.703454908860720415e-04 5.640265254904378630e-04 1.777774452878821444e-03 2.204703148456352811e-03 1.493437343833398188e-03 1.140678254643687868e-03 1.282359248187167492e-03 1.766337422485148023e-01 2.665216722699044749e-01 1.188984851620568037e-03 2.350507143865007416e-04 1.454108531637785407e-03 2.197484774755422126e-03 8.164181653498533454e-04 2.031447792385047690e-01 7.760498293565075249e-04 2.131031527529739320e-03 1.162663961740645693e-02 1.506392924621934547e-02 1.621998503500030053e-02 1.211447462282974619e-02 5.704792888167684560e-03 9.303725692951951565e-03 6.373642120546790107e-03 1.116340065060592891e-02 5.174680962233251247e-01
1.047059520797360890e-03 2.014696536454290560e-03 1.132909434903549891e-03 7.598995851795418369e-04 2.940608194035091967e-04 1.638926608436031560e-04 8.336044741016055727e-04 1.062600213221036663e-03 9.665533005246313173e-04 1.064071584011978518e-03 1.148378568852519372e-03 1.221383193810338108e-01 2.090692903330431951e-01 1.437772033972049487e-03 1.090424182184175726e-03 5.357575531855136592e-04 2.088698984739579753e-03 5.007937665369117664e-01 1.016293498992222469e-03 1.766465480491589708e-03 6.788068816952557219e-03 1.327075518757118121e-02 1.469968563824178287e-02 1.444378926672386723e-02 1.143335701636231591e-02 8.576348864520919393e-03 8.428062986050619682e-03 1.157327822640681105e-02 1.625069154218728232e-02 4.145168642278065363e-01
4.123357694770049564e-04 1.268820755481412819e-03 1.442439204863838788e-03 1.647742856393301543e-03 2.305891844572576389e-03 7.425498158795830863e-04 2.406507891094645125e-03 1.411065487863822233e-03 4.935090152133543876e-04 6.167170576158345456e-04 2.090361048476352401e-01 1.850864122633428255e-01 1.033433289948726685e-01 4.828605166823528999e-02 1.045345270118122200e-01 3.114581934020008713e-01 1.146237684782351737e-03 2.073864028664663007e-03 1.868928389862891054e-03 2.419073199926942939e-03 6.891961006073407670e-03 1.515810507528412079e-02 6.281937923155567205e-03 9.630852967663744782e-03 9.234257062437056449e-03 5.397397495625781694e-03 1.082814294690501167e-02 1.488036484195096390e-02 2.337238393023970129e-01 2.542154005037959297e-01
3.241379087612145582e-04 2.716688972087595404e-03 3.415402356322408406e-01 2.920497589779331715e-01 2.705138712093465014e-01 3.907093672045942601e-01 1.392006448570742285e-03 1.377616666279025126e-01 1.915591254953874500e-01 3.308416963255285392e-02 4.870935455120187912e-02 7.800018994653375171e-02 7.507735404193781326e-02 2.369757002294114734e-01 1.923008052334400841e-03 2.840771635818476176e-03 3.786794613598700072e-03 3.146107276801183954e-03 2.227032560402272213e-03 1.747227353250013077e-03 1.303773688107497239e-03 7.501523871454056011e-04 4.317912160048111292e-01 6.426190071704906363e-04 1.698115754078582387e-03 2.808550663456491070e-03 5.582377941658844128e-03 3.380786110732789118e-01 4.372568311961431281e-02 4.083467905778084134e-02
6.609379422514625145e-04 5.135859773331872928e-03 3.842017272168597453e-01 2.264611712612625283e-01 3.806673830314913354e-01 2.943385257591428217e-01 4.587319981795012214e-01 5.037520057713880395e-02 4.586328049322760392e-02 1.984952197728306195e-02 4.918480916618311882e-02 9.084916256169363324e-02 9.922598534564334993e-02 4.608942820229196546e-01 2.774901722634738263e-03 6.170079929712843358e-04 2.314520799167306582e-03 4.447402165309901657e-03 5.194268598643687722e-03 4.719680503202303146e-03 3.083495654274036758e-03 2.143659909365823544e-03 2.578455390196206405e-03 4.241416539161469400e-03 1.952775900478167202e-03 2.769247894280402189e-03 3.900416070192238571e-01 1.600651603079199514e-01 5.999499896761886775e-02 5.772716102622423018e-02
8.023545829110296894e-04 1.359569762927922369e-03 2.157868338848994705e-01 9.391855421813929961e-02 1.200004443496081874e-01 2.725038517845356223e-01 3.640268680844300775e-01 4.214373029733971959e-02 2.267572335753335541e-02 2.584254521390169992e-02 4.693854425445412315e-02 8.009599970545790149e-02 7.469042528864397457e-02 3.593316124773875408e-01 5.201289133278928258e-03 4.378477000593743347e-03 1.731521372536497065e-03 4.079865015793971393e-03 5.274476447441977731e-03 4.703022062202317360e-03 1.594078778816785530e-02 4.396701483160678769e-01 2.983119085407760496e-01 2.577697687949134179e-03 4.582779767498510425e-03 4.419764448444826917e-03 8.913899101435633632e-03 2.752325453236206254e-01 4.839435245378464340e-02 4.394563628799794813e-02
2.111019617928068526e-03 2.762711962345214094e-03 4.655366498177574419e-01 5.048433853446565589e-01 3.313204185011238683e-03 2.633089166358446899e-03 3.755909203794250972e-01 1.589543179719357935e-01 2.307625482731216482e-01 2.944684593010257201e-01 2.757956481333482743e-02 3.316973093477379453e-02 4.380470415171835302e-02 8.547420585582232722e-02 4.318199295186208042e-01 5.407218197005348760e-03 1.692599906035041624e-03 8.350530836062469361e-03 8.793626682783255849e-03 5.982944293513339090e-03 1.578402422486387471e-02 5.545356129785005139e-01 8.709925748857964833e-02 1.399322841662855310e-01 8.111498309849581728e-03 3.397510379428567845e-03 1.398296160227372256e-02 2.473776981780867815e-02 5.662845406975877682e-02 4.984113468271680197e-02
8.260815489804162418e-04 4.695283011942038565e-01 6.035384311353176878e-01 5.814265591695725287e-03 6.794374529140726482e-01 3.191450054733014352e-01 1.518953754546213675e-01 1.106452160043251420e-01 3.448422203397266683e-01 3.165883577529126497e-03 9.055746844477285951e-02 3.355448222519206991e-02 4.985043850316744213e-02 9.222073345068129702e-02 3.837834183173531866e-01 5.230131582503631110e-03 3.988457607202816613e-01 1.850885436550960550e-01 2.676201624437885007e-01 4.496947218904058241e-01 6.320435301298090759e-03 1.845104267582819979e-01 9.453629454595685599e-02 4.361725273272636927e-01 4.340184403343771979e-02 3.065800401038547007e-01 2.264020569486007578e-02 4.268042776937588240e-02 4.631112082750465930e-01 7.959423439163382241e-02
9.342063517163654842e-04 3.008786960733761048e-03 5.790380387264134621e-01 4.757193247878458431e-01 4.773022121211215052e-01 1.888703704427850405e-01 1.250027168215235018e-01 1.300249057851450840e-01 1.443766673443450388e-01 5.720399466253408560e-01 1.676725458511239553e-01 1.678198616702279711e-01 1.353949919300723725e-01 1.379835079014201382e-01 3.490424365291098785e-01 2.376419840093683677e-01 1.665486145960094477e-01 1.037702117469053442e-01 9.010940096753572437e-02 6.747521025241319526e-02 5.407156826350565521e-02 7.890766186005816751e-02 1.202087615927971698e-01 2.800739959895924835e-01 4.782996705698615569e-01 2.156369638711718717e-01 3.321026169194242206e-01 2.323830609358918942e-01 2.421677358410005421e-01 1.611894135326416011e-01
2.124938247869615881e-04 1.221234255568190170e-03 5.753325390628868385e-01 2.090496004214999724e-03 1.137517271196837555e-03 4.561105645252210294e-01 1.126795469146609462e-03 1.157590684363890652e-03 1.991427764318164373e-01 1.442976722284335656e-01 5.403277828273244515e-02 1.251750686793727252e-01 3.153421235125226652e-01 2.900995253434711652e-01 8.959558355775382524e-03 6.641091305173396978e-03 1.887848750043122359e-01 2.242580088211621470e-01 1.017969803642989057e-01 4.510372446857509321e-02 4.382300849373976098e-02 6.835537644710050487e-02 1.035400655547363269e-01 3.154633546059700810e-01 3.187256873666999279e-01 7.550940498500888221e-02 8.426084230753810855e-02 1.093437907836181805e-01 3.592607067859271419e-01 7.417544260035584258e-02
2.834320920518828462e-04 1.171131362541698653e-03 3.801685106899597316e-04 1.459870741894551916e-03 6.158366079608820808e-04 1.167880835916150582e-03 1.963820988274842839e-03 5.028878778113495818e-01 1.981118129648378468e-01 1.149186222039965677e-01 3.484158070170809141e-02 4.450450589089469111e-02 4.781289832466253942e-02 1.642353500691802193e-01 1.890702163630827992e-01 8.026122282779352135e-02 6.632695840864066827e-02 7.173679846448566266e-02 9.694960346078201896e-02 5.615330414263264985e-02 3.982257695389952723e-02 5.923560985397380990e-02 6.726839358736894092e-02 1.122431728757582736e-01 3.504387171779264065e-01 5.534907086881811489e-02 8.073457238819671533e-02 1.332932877561899820e-01 1.622642199263974461e-01 3.250548368067246452e-01
1.525124836047714284e-04 3.647811828731495690e-04 1.032271422867812405e-04 1.051939522511211841e-04 4.862800740768101829e-04 4.993350039598531184e-04 1.636445887755330012e-03 3.553694777920200498e-01 2.741132363052418142e-01 2.552126918978014913e-01 1.044758236986013528e-01 5.253489802164384298e-02 3.149505228004432361e-02 4.941492604397783317e-02 2.257322329737396216e-01 5.920744202754271712e-02 1.590164615514317037e-01 4.903085995864087110e-03 1.001028688741225151e-02 2.165440912241635152e-01 5.589540222111557405e-02 7.817249384449657945e-02 6.799733449085472448e-02 7.476505467844336839e-02 9.937505593445886132e-02 7.634560160909178994e-02 9.029126396174574909e-02 1.118123330891383216e-01 1.514696125633680224e-01 3.741942771730050188e-01
