4.694254561476597122e-03 6.813615977348255574e-03 5.128652472047126251e-03 6.437906567618352678e-03 4.862358533912861623e-03 1.060388860574583252e-02 1.046199962776891111e-02 2.815162891522406119e-02 5.078337568154603354e-02 2.275858260402722696e-02 1.604312720846047882e-02 1.229601975815115683e-01 7.681105269457867701e-02 8.054582406325382429e-03 6.880249569184521304e-03 8.185073431030003011e-02 5.462802016546547228e-03 7.754802899221906881e-03 6.989228106536046585e-03 2.813635972048881585e-03 2.609539573401176062e-03 3.758569474700377416e-02 2.956566132660558288e-02 1.142647615407005601e-01 3.067580325449679665e-03 1.728879125306738984e-01 8.174578435711545021e-02 7.144069732121189481e-03 6.749183174129685242e-03 8.394303953945468286e-03
1.256020313012257417e-01 7.851636524672141182e-03 1.251990080726949305e-02 1.019242063175898258e-02 7.079096334279381085e-03 3.479895124956777080e-02 1.798078854871749607e-02 2.218499970790224762e-02 1.307848857881164367e-02 1.023974743241864646e-02 1.061633547598156944e-02 6.316814568235500083e-02 9.055645219270093416e-02 6.419500539099498408e-03 6.667720102453045423e-03 4.271575693937775843e-03 5.340925254904119353e-03 1.436739098343277690e-02 1.074987795955695269e-02 3.877544398182692677e-03 1.421302129616165422e-01 3.588535745520776005e-02 7.650883313309739253e-02 6.607758653266383730e-02 5.830508218626846012e-02 7.789515272375473198e-02 2.831941631856889005e-02 7.172014565109556365e-03 1.013217586320752303e-02 1.005111373405714360e-02
4.357539578560017113e-02 4.286580480762699347e-02 8.136614005356450352e-02 6.616594778274519084e-02 1.404754253343122039e-01 1.569996413965053447e-02 1.054049748294975108e-01 1.103007597677953949e-01 5.098444717943154819e-02 1.430414379529609641e-02 3.868165468244845473e-02 2.882552151240368524e-02 1.065444261341366890e-02 1.691483146443664015e-02 3.214278968834132812e-03 1.371567456350272947e-02 7.717777163905310649e-03 1.310903144129276984e-02 4.307783058883717098e-02 8.670976787710216876e-03 8.985220712171097801e-02 2.964161386530425255e-02 4.601455276467951439e-02 1.600586894422124581e-02 9.494190973131063152e-03 6.263446163953986442e-03 5.593813472465675521e-03 4.382360894301625884e-03 7.443013372093161030e-03 8.307538182063070945e-03
1.798625728987713127e-02 5.047547106022554075e-02 1.107274923810229600e-01 8.944526359743047716e-02 4.083714521290632282e-02 6.929688301434021661e-03 8.648502425472938751e-03 5.423464458762949740e-03 7.260650753877977148e-02 1.825820029636030309e-02 1.082875255131280842e-02 2.161848870098964995e-02 9.766056905265357857e-03 1.123507218775865284e-02 1.035034342060568713e-01 9.124623201082650292e-02 3.765872796716755039e-03 5.065026092621230380e-03 3.530650900604342599e-03 3.193036045688176124e-03 1.792201493787134439e-03 5.965775283516294020e-02 2.034708986632360536e-02 3.964063657771065008e-02 7.671768271146620598e-03 5.523272483026801793e-03 4.736458498251444257e-03 4.478268019906052159e-03 9.059371293210265186e-03 9.806988340327560394e-03
1.037985467819933609e-02 3.156586935786913350e-02 8.807916839100131401e-02 3.415963852242488025e-02 2.358413814158314553e-02 1.217604794887724995e-01 9.869093113192554945e-03 1.170044490053304548e-01 4.557650457947731021e-02 4.392969961267382401e-02 4.817212955315369055e-02 4.686435176065687630e-02 8.313477607457809421e-03 1.233465186200615252e-02 1.353881767544070913e-01 5.521186130136596787e-02 1.433220162767178014e-02 5.208259453675530108e-03 8.306814433532800843e-03 4.153715840411869101e-03 3.270916751963523581e-03 7.741772661288975899e-02 2.543150268061065197e-03 6.226318923408479672e-02 1.373723255820116958e-02 7.357389395646649760e-03 5.106974574866356142e-03 5.885642833053445627e-03 9.173717119859476146e-03 3.361939521476527137e-02
1.361343400926785796e-02 1.430726476933327947e-02 5.592609626654673066e-02 4.082741964667283702e-02 1.857610308773297719e-02 7.075921885224806251e-02 8.895082345870805596e-02 9.390745224765234545e-02 7.908108793342934206e-02 6.412249388905412462e-02 4.630512463974016668e-02 3.182077150644641722e-02 1.178476420495737226e-01 4.413704548895046320e-02 3.672796868232262868e-02 6.193217848970295619e-02 8.308804482784095183e-03 8.164582415468910059e-02 4.694694338332952924e-03 1.277294477790828775e-02 1.782512865497597535e-02 1.123940584057295071e-02 3.647705250611930298e-03 3.657399368068925405e-02 2.036950293594926020e-02 1.918519173578168979e-02 1.197242114381303485e-02 8.227867989961857101e-03 1.082263868938771086e-02 1.940231392629255397e-02
6.788382016738941926e-02 1.011311253568286245e-01 1.019343869190224433e-01 1.295726341597230533e-02 6.284690239156039485e-03 1.227802491702641163e-02 2.148575112566571479e-02 1.196715266075715732e-02 1.209345347453633958e-02 1.319810410625472420e-02 9.667099116784172788e-03 5.578798777934885177e-03 6.659176182081238959e-02 3.146810683727013780e-02 1.819941548932105246e-02 3.063493233793697021e-02 4.627382374624292721e-03 7.663123182417802548e-02 7.449697365014308625e-03 1.042612312464413077e-02 6.483661361422875941e-03 7.807442523379506949e-02 3.632560774705993062e-02 3.408038716884302655e-02 1.380831566662102904e-02 1.423837446948121414e-02 1.254252115307583591e-02 1.078085045476519406e-02 1.227854835192647084e-02 2.912084270919112691e-02
4.187292459449380895e-03 8.034159741366909621e-03 4.028519666083921029e-03 7.768699626026520991e-03 1.099691522906823607e-02 1.228200033937504494e-02 1.077786775782332493e-02 1.006820988390966405e-02 7.956046337769561924e-03 5.093343693719549863e-03 7.974229118313573561e-02 8.248336160225988936e-03 5.634785319637232448e-02 2.058975753969648215e-02 2.315002062828324519e-02 4.167131644140539826e-02 8.032856962505455223e-03 9.440871350519497093e-03 8.249411554252288059e-03 7.057444171752756505e-03 1.124201721747386667e-01 6.638181051516121867e-02 2.667701659877502740e-02 2.233314213573554460e-02 1.062492098975087798e-02 1.097205535010351181e-02 1.684118871823920074e-02 1.900506037865752965e-02 1.817486019380667311e-02 5.264767298646887833e-02
8.633558919181530747e-03 5.651002148738036232e-03 3.266631062944655873e-03 1.873161752516945208e-02 1.349663453579777288e-02 5.665061535825899157e-03 1.811755730325956271e-02 8.694756164006445243e-03 7.427714384404668010e-03 8.262889131504863247e-03 6.086773408495611652e-03 8.715057664649878549e-03 1.756393209521777549e-02 1.373502238250244763e-02 7.441738849405739320e-02 6.208415100322817182e-02 6.400460646012971593e-03 1.607586419164466415e-02 1.575568599213813745e-02 3.849400050847842647e-03 3.017726382725005249e-02 3.146051597754630919e-02 3.400688811084858626e-02 2.219770749174963809e-02 1.295517729201492788e-02 1.800676199764779731e-02 6.351148595748029591e-02 1.143651192173633646e-01 5.768625275360924481e-03 2.446542553278624639e-03
1.447602320165272162e-02 9.490240612722239746e-03 1.493461774754843534e-02 1.384065326798582761e-02 1.472566189890492372e-02 9.230462355626786741e-02 1.866338851792764125e-02 8.208498840650725950e-03 9.452334698811346025e-02 3.401363301017141377e-02 1.019864895127174653e-02 9.696715805364949925e-03 2.034456878463786200e-02 2.397998198895255617e-02 1.190863693512879060e-02 1.277691907247997978e-02 6.218163571175464727e-02 6.113370104066474797e-02 2.651557364938996603e-02 1.590670970455553695e-02 3.899145106463423188e-02 2.461572477712698631e-02 2.798336800402147911e-02 3.065058807084544007e-02 1.704337617794065771e-02 2.032765185743174580e-02 3.554121156424753722e-03 4.706298109629059555e-03 6.137016468478531488e-03 8.498288266360747023e-02
1.988585059441763669e-02 1.014627085752626591e-02 1.581269625840960383e-02 1.191175088747043788e-02 2.245899543326893011e-02 5.796341695511682268e-02 5.609696262490360130e-02 5.109429366207201423e-02 3.483487610054300521e-02 7.817443071487718831e-03 8.128592088440243779e-02 1.320197986072940977e-01 2.707593371571692664e-01 1.326849090816739907e-01 2.431069059215478986e-02 4.749690184420637257e-02 8.832988066682560813e-02 2.434895996837885962e-02 7.772772262131243635e-03 6.497097862883152719e-02 2.715854841434896944e-02 2.407190606957397214e-02 3.079321778028835249e-02 4.292581471483268574e-02 4.574789858145739824e-02 2.391064538528613406e-02 3.539610844217803282e-02 2.609046966765790621e-02 2.364415359467285371e-02 1.705872422268573177e-02
1.004449126713214541e-01 5.473267013784943735e-02 2.210949847788903910e-02 1.573175973221649718e-02 1.406480843058495987e-02 9.109385591863156106e-02 4.387401501899799994e-02 3.046662182847506214e-02 3.621397256949453192e-02 1.382906643096880675e-02 2.485912473864944350e-02 1.609569321486512550e-01 2.801629727551407933e-01 1.447156917380023611e-01 5.197879923099439636e-02 5.854485483306703236e-02 6.459417023549969550e-02 3.799191049994191105e-02 1.275374911888823432e-02 1.485210442251464480e-01 2.607932561726785531e-02 2.636302542838821553e-02 3.094126306081649777e-02 5.510157805275825438e-02 5.220154616890261556e-02 3.699876519871364566e-02 2.822772610391279663e-02 2.513841209885972136e-02 2.698082821676567669e-02 2.866019019802435244e-02
2.364836470039254762e-02 5.563010724009115338e-02 1.216533476633127886e-01 1.778263799696046948e-02 1.189566068689814141e-02 7.525389313442504280e-02 4.339578034662568834e-02 3.842252550890069146e-02 4.924252321413587208e-02 7.519087428167150859e-03 9.269037179159195228e-02 5.305153123596902803e-02 2.084233287399073764e-01 8.930738912875618718e-02 2.807083059562495708e-02 3.250256282391129903e-02 1.199702764898307947e-02 1.758220662968448811e-02 2.467118791792728694e-02 1.051499345953113042e-02 2.504518407378212783e-02 2.728243226536094732e-02 3.401907858317011757e-02 5.625115000851919900e-02 7.103025850674078712e-02 6.257509346241420245e-02 4.596367606723329030e-02 4.246198503058878915e-02 3.659586165551280412e-02 2.977016951314729806e-02
2.023173389282041310e-02 5.558397741035110001e-02 8.594605940975852398e-02 5.899128046402943998e-02 3.464906915451308744e-02 1.522707384553687870e-01 2.210841415977504373e-02 1.215789172625010572e-02 6.807157199887610421e-02 2.192433512477264326e-02 7.762971117332005677e-02 8.662801125555645229e-03 9.496233668103852554e-02 1.289010126184629568e-01 1.377651698387618029e-01 1.865380116468617344e-01 1.680056483110356214e-01 1.091230987213458875e-01 2.982446869353419516e-01 1.402769698597408632e-01 1.632860504906847449e-02 1.630609808690672291e-01 1.206852710961518332e-01 1.132372978325683899e-02 2.048383181296224709e-02 1.691600703029709843e-02 4.231899673124205757e-02 1.674476649160545894e-02 4.958421957878059172e-02 5.611029690226263661e-02
1.904149311089584767e-02 1.840471649230621468e-02 4.407457718648998685e-02 2.787471701569080307e-02 1.136485006324362279e-01 2.867554002444108741e-02 1.116324230435405788e-02 1.964969022739146767e-02 1.485540949597743791e-02 8.393536751891632341e-02 3.102024365943710765e-03 4.223157565478987546e-02 8.524615177308476899e-02 1.084285248008112768e-01 9.812563594580432647e-02 1.188309623828990025e-01 2.033308641818581119e-01 3.525142729568532252e-01 3.600129762736470340e-01 2.828605633520715479e-01 1.533509359362289493e-02 1.828641584262026207e-02 1.574664649326003654e-02 3.942161443017885153e-02 4.857986696433488211e-02 2.463253644744000104e-01 2.428336490076642706e-01 5.506705588698384418e-02 5.068043928205844678e-02 3.807385238328365312e-02
1.768209402093214380e-02 1.867700331467483238e-02 3.648183251921856968e-02 3.852105613371175491e-02 2.504649004767727297e-02 3.030057127338639522e-02 4.004811039923484271e-03 9.752732834939709453e-03 2.172213938375301343e-02 7.750551339162036618e-03 7.957261213053753654e-03 6.259894537993949092e-03 4.838708992440145240e-02 9.799077717593335235e-02 9.139468231266234532e-02 1.400256660875650039e-01 2.435908104337631552e-01 2.977038527003388335e-01 1.730343094288635253e-01 3.777387373101492862e-02 2.251756674823230178e-02 1.534683416082437413e-01 2.219342078483188818e-01 3.679720468631717534e-01 3.418037222024196686e-01 4.402648531469368076e-01 3.471212905355373635e-01 1.058751763240519672e-01 7.312339757736412149e-02 4.230770100392861055e-02
2.279665190020651808e-02 2.579625863148033577e-02 2.423000477699623068e-02 2.189131040144427429e-02 3.192388354031752001e-02 5.631304339985615526e-02 5.921050883210784987e-02 1.898659774063881367e-01 9.251655348071695373e-02 1.568255501818161673e-02 1.150867648621195158e-02 1.765068026872151571e-02 3.457738866424951707e-02 5.089465649726569035e-02 6.714500776043148822e-02 1.201886269158647658e-01 2.610887018528162407e-01 2.649520035597986434e-01 1.264358782201588927e-01 4.351074888533224688e-02 1.860871477214974257e-01 3.346850439171675240e-01 4.256311626271342408e-01 4.305507971833219538e-01 3.729047608976082118e-01 3.168920915100174041e-01 4.591443953617742046e-01 8.302357718767905403e-02 9.512872235323101278e-02 5.093713104894980609e-02
5.703809198878258269e-02 4.449539379116741050e-02 2.153753691906456699e-02 3.007548373745359480e-02 7.304386060826205569e-03 2.948096369261890212e-02 1.568800733810163939e-01 1.268154403738702973e-01 1.246262388451576941e-01 6.181989925532896391e-02 2.431524037920394787e-02 6.496267158712600367e-03 6.267975496828423303e-03 1.462787668900510964e-02 3.284895251575108838e-02 1.501252595974069126e-01 1.594419535770338070e-01 1.933346443886668486e-01 3.399071094095660467e-02 6.012120237576881049e-02 2.052853857359783207e-01 4.396039343942222399e-01 5.365876323723935970e-01 5.456610694623545976e-01 4.404457614900359474e-01 4.144426585125410289e-01 3.756903010357204864e-01 3.019700360847889509e-01 1.572718596438284558e-02 1.073810302831631515e-02
2.280744953478654538e-02 6.281193309086066656e-02 1.093508100625678325e-01 1.363090711852020173e-02 2.296210818627457406e-02 3.109827252138881032e-02 9.852782686583401450e-02 1.235910445940946040e-01 8.481403325145280003e-02 6.552685400968559504e-02 1.640544575423191764e-02 1.141683404565227572e-01 3.163162503078137920e-03 7.198969165183998799e-03 1.184656636788639604e-02 6.894102208572429336e-02 2.648705834487989283e-02 8.821439497025376081e-03 1.250336775041963333e-01 2.160504814190562436e-02 7.929401303689247171e-02 4.189506257122287414e-01 5.257563066687330755e-01 5.400070345046306119e-01 3.851939379885692682e-01 1.738273386785041674e-01 2.750660443537599198e-01 1.871221993431615160e-01 1.681915593674629741e-02 6.554515703747479903e-03
9.121532604645436054e-03 1.344992078665657731e-02 8.444733637860668204e-03 8.937698667255045484e-03 1.732726358120537796e-02 9.939868688108111430e-03 5.129370707945378471e-02 6.646677795511361786e-02 6.128776572828498886e-02 1.435544028713531262e-02 5.746336454897999803e-03 7.847441189521463245e-02 1.333491510919980194e-01 6.424705917370909444e-03 1.602922624910416149e-02 1.006235542724242572e-02 1.780077035549892592e-02 5.510583308884260505e-03 1.037511615961906643e-02 4.907887136178464699e-02 2.558619356764352815e-01 4.817022383892030635e-01 5.140459969950805785e-01 4.789856710104356541e-01 3.586234428905684113e-01 2.557679244486929515e-01 2.420414582924042268e-01 1.713595917429742432e-01 2.428003704131364432e-02 9.392052690904807016e-03
1.988603358246115310e-02 1.828675021825177868e-02 9.263750205032292642e-03 6.568265033291519062e-03 8.393674368154132454e-03 4.494960983828221249e-03 2.671488382060814917e-02 2.388216163659904676e-02 6.758332342202136994e-03 3.796649674157029277e-03 2.382647937909509930e-03 1.201243958228727648e-01 6.622567659099398707e-02 3.000045871865626365e-02 6.283535340899773503e-02 2.792146320125909412e-03 9.671333572776703510e-03 2.215839851499508406e-02 2.142970459626302240e-02 9.602839076246201533e-02 2.620031374441300076e-01 3.784080270343094243e-01 1.534489181971098459e-01 2.260916695259420073e-01 2.851833531263173738e-01 1.575313131670155464e-01 1.149467720934478077e-01 1.031930091963682433e-01 1.243756536309806315e-01 1.356588281778763894e-01
1.614421225461203438e-02 1.861649602451942095e-02 3.266741639668775937e-03 2.307608597432260836e-03 1.916018944707797902e-03 2.196223393113807751e-03 3.418312650231255297e-03 8.898400702504963289e-02 1.258757802962904388e-03 2.144538183125278483e-02 3.163564329293624272e-02 5.017080430453589590e-02 4.657064961378136470e-02 1.421625559582208043e-01 5.593911964424785714e-03 5.091317431914443165e-02 9.449457071766451111e-02 1.371804648941876148e-01 9.397396218610311325e-02 7.076293049996569551e-02 5.003457934992489031e-02 1.784607327477956418e-02 6.909263705133899744e-03 1.474946202414071338e-02 5.231860614573846657e-02 1.729072147614842472e-02 1.871857526636800870e-02 9.054996861338081640e-03 2.389397258308666866e-02 2.236302294446722294e-02
3.427043125817231389e-02 2.891259243766875625e-02 3.912338214627103863e-03 1.352632021236617188e-01 2.772440524474281427e-03 1.549835357154443448e-03 2.588095710844592716e-03 3.136081616702616343e-02 2.973349592923781731e-02 1.287518294917419301e-02 3.234546082065060946e-02 5.871479289999889661e-02 6.009669879172196277e-02 5.763756199622872139e-03 6.265774122067816788e-03 2.939676282782633168e-02 1.077358559490027012e-01 2.011533496736848947e-01 2.280848029192927007e-01 1.974046898161795904e-01 4.176995280589765325e-02 9.280677667986778068e-03 1.150813870468236737e-02 2.814724898109746687e-02 6.175106561784056425e-02 1.795418605816634372e-02 8.074793384025037712e-03 8.843748865810360793e-02 3.347595882463005185e-02 3.230128768827784935e-02
4.269422750706259456e-02 5.963122747105200142e-03 1.372050998336490635e-01 5.637273041489248432e-02 7.109598957791392337e-02 1.571027216547102312e-01 1.982411007994597935e-03 2.554429613000983382e-02 1.495022854281233098e-02 1.704768070201916411e-02 3.084780883965178300e-02 5.163191939679129955e-02 4.495570974413032328e-02 3.725029166237453417e-03 9.591677804918740877e-03 4.259396328493980644e-02 8.250777918861997018e-02 1.898536256992617577e-01 2.384258510539966902e-01 2.014362730693737835e-01 1.002585781649395213e-01 6.599978515449456823e-03 5.147035272776755502e-03 1.076055688714432600e-02 5.533355659409480709e-02 3.046165306561657640e-02 3.188419078244000837e-02 8.643515499452846321e-03 2.742991224168463138e-02 2.484152214789244958e-02
2.344983624702225503e-02 8.072143287902814809e-03 3.397456116015737469e-03 3.409708229111642428e-03 7.149645259322654108e-03 4.894313433530379093e-03 2.272002743260267965e-03 9.929994809022550661e-02 1.503663713025432114e-01 1.921557415430337756e-01 1.809930276502402444e-02 2.139031557096750941e-02 2.699512172812489064e-02 5.066605533606620415e-02 4.166529045842920151e-03 1.329881280189316659e-02 1.421654021749878434e-02 6.014991602812905236e-02 7.649870247595989825e-02 6.259652169349176620e-02 6.066111078710689081e-02 1.106190243240071092e-02 4.784443376621252964e-02 7.730811303475859653e-02 1.011540391729555573e-02 2.324797540208766930e-02 6.220887704812171071e-02 4.130837540787311163e-02 3.133664823731194954e-02 2.743567990063917883e-02
8.379455848167436521e-03 3.305114620062447189e-03 3.522616514088370513e-03 5.899870888735608311e-03 3.301092261978867248e-03 1.632979168027153720e-03 9.576965022469891009e-02 7.024147212559506137e-02 2.254398016396499515e-03 8.617753430195874281e-03 5.776930356762071533e-02 2.105321978690005008e-02 3.089982020143804478e-02 5.404410978258485099e-02 4.047829691260988738e-03 7.118819611823947596e-03 6.869970277260569087e-03 1.128328384445543980e-01 5.863842999022049300e-03 8.945739978861553740e-03 1.744354571212384034e-02 1.069626535275683687e-01 5.158540980950526017e-02 1.501207512516701363e-02 2.611900653726418123e-02 5.905488273001473394e-03 2.850537088341748015e-02 4.541831251334062930e-02 3.128995634229037731e-02 4.256465009941381994e-02
8.491740531965965427e-03 6.773673285065274358e-03 3.295649115838564323e-03 2.393983026231041780e-03 2.286795073060466418e-03 1.153281558812764007e-01 7.958262028503042262e-02 8.396577394888216084e-02 9.254937535659267522e-02 3.598866439673208475e-03 1.058495930399967755e-01 9.609023814177396206e-02 7.697178017245606685e-02 7.676859949194028698e-02 3.592457979357647786e-03 4.422707821732557547e-03 1.013917339040032589e-01 6.351835517587151037e-02 5.505008825362533303e-02 4.089309006966191512e-02 3.225074705028528610e-02 4.566085535386117666e-02 6.478086416120529267e-02 1.397519777839492383e-01 1.882848117921696873e-02 1.056624631452091900e-01 1.720454757149410263e-02 1.222327186056711007e-01 1.270866314131284813e-01 8.389307667306462879e-02
1.153290635935624343e-02 5.975440700410551004e-03 3.388508492208926106e-03 4.582208271159030934e-03 4.122640699371871512e-03 2.298278126819822392e-03 8.145326015963700456e-03 6.924527794376885217e-03 1.276769751247615325e-01 9.290421223724840138e-02 3.383164767402080386e-02 7.134770287702976721e-02 5.030940580915643952e-03 5.159023228146664315e-03 1.486793650056936547e-02 1.574217079205049094e-02 1.155590968719099471e-01 1.379449110448619231e-01 6.238292845439737805e-02 2.733951147811046825e-02 2.607206127309460303e-02 3.958598491012660370e-02 5.674397947150907479e-02 1.529032666577063992e-01 1.586318240173660576e-02 3.634748235825778495e-02 4.516896908647453912e-02 5.729636786259300479e-02 1.832638987705385580e-01 3.734214749490655239e-02
1.550944877933979962e-02 1.334665801035971738e-02 4.037441954450532618e-03 1.364930628408374431e-02 1.546917634419306582e-02 2.902747767848226981e-02 1.945252343832106282e-02 2.825265184498684974e-03 1.285387078343945555e-01 7.524404415371417632e-02 2.239106630485119057e-02 2.548865555149378015e-02 2.765854440512744566e-02 9.852333020731962598e-02 1.157809168340235284e-01 4.954359330168010833e-02 4.103988166762836259e-02 4.425129042811763030e-02 5.846717126147556176e-02 3.338293627470159675e-02 2.342722484801915833e-02 3.451805326513203431e-02 3.737414839223940355e-02 5.591817425817334486e-02 2.413994458271483123e-02 2.809967126156592138e-02 4.353070369376269705e-02 6.963541035765222209e-02 7.831130401853894640e-02 1.522923846982000839e-01
8.451609375862177004e-03 2.093780071588751193e-02 6.216729213480614961e-03 6.553193647523027944e-03 3.101510206462258432e-02 3.251830758390644727e-02 2.154173436260365879e-02 1.809291365434632622e-03 1.712468544836623918e-01 1.622624628690819415e-01 6.654426179548965370e-02 3.321318655264154235e-02 1.976357871612804962e-02 3.103639685294658571e-02 1.410756832175757147e-01 3.685461388609719696e-02 9.930535801127642059e-02 2.332194776314435239e-02 3.048346789962992631e-02 8.131363860878440541e-03 3.296567877394383783e-02 4.596130920900289712e-02 3.883368296473466152e-02 3.871447790175316234e-02 5.033162380515730783e-02 3.993547876733052199e-02 4.923953521282718043e-02 5.898306963414472887e-02 7.265734162637840776e-02 3.759683782817394709e-02
