2.636502555560523708e-01 3.773891546568546307e-01 3.138425331386065498e-01 3.851057635349885433e-01 2.660961282426402841e-01 1.994419702652322490e-03 2.245721345795938110e-04 5.934512294184015333e-04 1.057585991259667440e-03 4.668741039141195400e-04 1.998788267447022468e-03 1.457469444268025272e-01 9.567882954771252113e-02 3.512353036431528075e-01 4.311010569838212743e-03 9.737624930713174864e-02 9.606809601884865523e-04 1.203968189865108556e-04 7.732503008464627165e-04 3.211491281012164301e-01 2.986656844913170294e-01 4.545459417293782473e-02 3.500092735312398950e-02 1.404075215960934320e-01 2.729563885963571246e-01 2.140870845662989908e-01 9.833404072833391851e-02 8.597163138858710668e-03 8.145355243702126144e-03 1.016042663085345819e-02
1.741507817800479474e-01 3.672432502960744083e-01 1.236181831773158248e-02 6.518649688581861293e-03 3.247940621848700582e-01 6.625733458029947273e-03 1.657701868629722760e-03 1.950786110059052727e-03 7.171020422059327113e-04 2.114649465118968751e-04 1.242637319257533382e-03 7.544659454103108676e-02 1.132390724612668403e-01 2.711924491687660033e-01 4.292302966920879745e-03 2.674368945322148083e-01 8.748166733979639582e-04 2.175225800261321543e-04 1.082412440481748559e-03 1.142172783598168449e-03 1.713539650329363173e-01 4.347541065727613535e-02 9.064354127884888257e-02 8.135566049028720992e-02 7.216043206320167658e-02 9.678236007541862751e-02 3.399457368064182777e-02 8.614756032651016762e-03 1.221408435742951486e-02 1.216119247059455934e-02
7.004666042734781529e-03 6.374275757315061783e-03 7.900987096997335452e-03 3.689399994763963367e-03 1.446915616482408705e-02 5.927371695747055309e-03 1.424149385204695473e-01 1.482129146306265799e-01 8.149130321647430134e-03 5.825312351798054905e-04 1.401582049760530507e-03 2.085298848142231112e-03 1.975841156676624681e-03 4.571722321726167694e-03 1.672057961909522994e-01 4.083107821344816694e-03 1.734663912391213583e-03 1.157416297231472595e-03 5.824994239473999663e-04 1.334996263835864149e-03 1.057780857525947721e-01 3.581020498844993127e-02 5.481012453189999106e-02 1.912032038453378990e-02 1.136789667673282142e-02 7.489243269936024516e-03 6.684266010650015931e-03 5.253230818004152487e-03 8.962087907388213703e-03 1.004829130894516025e-02
4.162091340352414145e-04 1.148049289889184000e-03 2.512571424775352381e-03 2.029471837467473547e-03 4.752818838453199898e-03 2.892402714084592041e-01 2.849095582913318547e-01 1.753589638537026429e-01 9.430769159256657819e-02 9.344055154753536140e-04 2.199068426012355207e-04 2.073676047082443404e-03 3.593336810529217020e-03 5.030851585754658566e-03 1.295784640617695105e-01 1.110507565164423754e-01 2.361277341544170960e-01 4.162224178163268385e-04 5.061884484825735468e-05 5.769463236676955660e-04 1.890878267148355940e-01 7.601605041158832066e-02 2.565914003702457133e-02 5.070739994946005941e-02 9.267704914251329029e-03 6.608167228068831910e-03 5.664546545133591383e-03 5.377115368858945144e-03 1.092004332626046563e-02 1.186799361160397435e-02
2.346292685911683556e-04 6.951305013848446332e-04 1.936160265700441170e-03 7.528559069807922019e-04 3.435807814175859034e-03 1.671545851650541870e-01 2.882982092126378793e-01 1.606465651451246257e-01 5.854180239741364061e-02 2.952977605017499067e-03 1.002526302617310879e-03 6.247347653133208424e-03 3.153161846150652758e-01 3.242881468406181300e-01 1.689259163713432155e-01 6.730756917227480318e-02 2.907869191009763120e-03 1.055669124899348641e-03 1.279139084896995567e-03 1.060550986345813133e-03 3.071556419099595314e-01 9.830928147299820841e-02 2.516833432308335783e-01 8.316817092868689087e-02 1.671706338223263519e-02 8.840775265687935563e-03 6.132562666921751587e-03 7.085291191259947621e-03 1.106927330814424376e-02 4.065912036364981857e-02
1.912595268967056533e-03 2.070284439384526085e-03 4.973731923698892880e-03 4.307593819129030416e-03 3.021192898917599446e-03 9.371424086711779844e-02 1.173728485593960036e-01 1.236432752475276897e-01 9.914696369694048217e-02 3.287167833202440329e-03 3.636641888728604083e-03 6.755773450036033252e-03 1.468985061955404292e-01 5.498011403140723452e-02 4.580009454888479131e-02 7.680447350761111791e-02 2.371546780181942905e-03 1.012510500056041235e-01 3.299080682414002319e-01 3.266235236833286634e-03 3.658287094803667604e-03 5.462643540261411662e-03 3.091848794439890913e-01 4.838994789846533945e-02 2.491540909062094425e-02 2.315045499527377745e-02 1.443543682504018141e-02 9.933029144401884017e-03 1.308435468452661884e-02 2.345125467217231557e-02
9.038551618640548735e-02 1.363903950177192959e-01 1.337982818903082904e-01 2.783997256138256732e-03 3.028988697283938603e-01 2.049187681835791443e-03 3.477761481530018337e-03 1.842941465678087521e-03 2.743250641380268803e-03 2.885909503107614467e-03 4.124042133493329744e-03 1.767153820320592761e-01 8.170971419271294556e-02 3.791131187896101123e-02 2.209506840223954272e-02 3.810028525725996790e-02 2.136703599394046971e-01 9.580832036221913206e-02 1.123026506735368352e-03 2.293786852624392879e-03 3.428197550820883399e-01 9.796711796642135206e-02 4.556236104048377172e-02 4.361398713653812792e-02 1.686212366099785337e-02 1.727719626163018440e-02 1.534622684395675618e-02 1.328056976028309764e-02 1.535084942864626927e-02 3.606051183767656348e-02
1.838309880979004940e-01 3.406104734642246279e-01 1.879016173341940266e-01 2.220653478433071756e-03 1.615191654888739571e-03 1.770363573327818438e-03 8.985879050305655260e-04 2.695639906537773776e-03 5.986890080465601983e-03 2.601534522034658070e-01 1.064261519998763034e-01 3.222630734362297300e-01 6.906463347391413043e-02 2.451002292250200124e-02 2.767830816652237791e-02 5.132936209656203952e-02 2.254064618436669564e-03 2.228582127892126796e-03 8.413417223066338912e-04 1.460614036118704434e-03 1.377984806492054681e-01 8.123042408617449361e-02 3.237643708124639252e-02 2.704523233526483911e-02 1.289437628839446882e-02 1.359000194393826001e-02 2.209343119925109497e-02 2.817272727636045346e-02 2.735553352758358925e-02 7.765180242720588766e-02
7.350434667454338634e-03 2.739350821956879622e-01 1.581013244850849875e-01 3.609081390917856774e-03 1.413437900879933179e-03 2.316252908811953781e-01 4.475130566676406227e-03 3.980844002425280338e-03 3.620630000602838572e-01 3.706123575346161325e-01 3.309401918332582904e-01 4.457379160756419489e-03 4.971310547535433277e-03 1.760926586130598381e-03 8.801213805138423385e-02 7.402351796063195988e-02 2.965859101920460539e-01 9.367281549662350012e-04 1.022675723115407630e-03 1.825302055518306099e-01 3.631739019069204349e-02 3.772668420088179375e-02 4.082798398914291166e-02 2.664353381432666909e-02 1.564777216481809743e-02 2.404046550594781881e-02 9.565422489430461250e-02 1.879592456588106419e-01 5.223843071668256011e-01 2.485221297677438768e-01
4.089205358977695062e-03 3.141986211008880765e-03 5.028349724944788761e-03 1.179682541078142400e-03 1.758049107358336223e-03 1.078968483368808184e-01 5.391227715494171895e-03 2.546482959361636156e-01 1.253621587511702662e-01 4.527322253412301850e-02 6.803701770669912975e-03 2.418346935397761889e-03 4.169262413372818907e-04 1.201362357969024955e-03 7.752630279450794040e-04 1.207135418479836743e-03 4.287734521183610668e-03 5.736391619326205310e-03 3.318851665621177366e-03 3.098505805193037775e-03 4.654639036514585104e-02 2.924760561458839350e-02 3.330669539234857451e-02 3.657776788745120689e-02 2.050233116582197632e-02 2.640007368749152858e-02 2.557217413288837005e-01 4.242872247368870142e-01 5.081922525379257705e-01 1.283426908248367637e-01
4.341032101503032418e-03 2.644073984224695750e-01 2.267655932731518255e-03 2.573563753905820433e-04 2.745121295877941611e-03 6.687919397027453083e-02 6.660331249316607527e-02 6.173270302450177549e-02 4.315245245023392046e-02 3.367545483605398071e-01 7.289363403714944380e-03 2.616255680439231058e-03 5.334078959400861616e-03 2.622644283388617624e-03 4.824972941152080711e-04 9.403849208134927844e-04 1.725580823834249296e-03 1.335895338446137356e-03 3.148895852918652816e-01 7.678523146416225964e-02 3.197067386045337328e-02 2.837731955091929090e-02 3.636432278018076475e-02 5.083373341046033139e-02 5.447895102836888825e-02 2.977613749526673154e-02 4.807762846439220250e-02 3.708373671589706294e-02 3.220589360039727289e-02 2.236977705837248087e-02
1.188877548708409809e-01 6.492855873833172642e-02 5.715902454052177069e-03 4.780921671692436523e-03 4.232028848420745643e-03 1.087363881324324016e-01 5.125917301996778253e-02 3.579099954473432404e-02 4.408598020352391678e-02 4.407164511516800144e-03 6.210924327236075522e-03 4.297975332458424391e-03 5.357819077373825872e-03 2.798845903555613468e-03 1.018226194528921730e-03 1.156021093041071507e-03 1.272709825168891673e-03 2.146937144987944197e-03 1.728326496201512468e-03 1.736352760758267944e-01 3.036632087930765667e-02 3.077011098841829148e-02 3.619275657201557334e-02 6.459084706703577261e-02 6.133640440638062075e-02 4.369296117896298570e-02 3.354441739635897340e-02 2.984233640741254176e-02 3.181485306685841868e-02 3.361167637665093966e-02
2.839476286588111381e-02 6.814177310422231404e-02 1.510583359263712455e-01 1.009162858560925559e-02 2.672913879508557189e-01 9.158800685815572662e-02 5.106035306414248576e-02 4.470850128083304204e-02 5.900478541948555450e-02 3.996333275240330218e-01 1.104636161962809643e-01 2.086040984677775458e-03 3.890316445442215665e-03 1.693408197040616875e-03 5.419288576736645173e-04 6.374420531059352309e-04 2.373120941811065652e-04 3.504492400084698229e-04 1.962082001690147563e-03 1.175037645847790265e-03 2.884483843907134290e-02 3.152897464852374987e-02 3.977838030295281074e-02 6.588120102193426031e-02 8.320810363128658405e-02 7.248383331395732987e-02 5.319966359987696874e-02 4.904402610216158226e-02 4.216329644712044772e-02 3.422980931223953971e-02
2.476435180031672997e-02 6.989445552673276274e-02 1.211880185345248218e-01 8.608306063949715259e-02 5.046554493893228022e-02 1.950954467059233810e-01 5.798378770937855954e-03 1.656005278750928697e-03 8.093711020609507811e-02 2.628550550271532837e-02 9.261450162092033089e-02 6.672996371107938049e-04 1.723482045363839994e-03 2.395606757303298407e-03 2.625085564823778986e-03 3.638838179161235468e-03 3.336408849003864516e-03 2.199926537123759584e-03 6.095158774899545398e-03 3.516941843289487710e-03 1.876240181076642768e-03 1.864371828517967511e-01 1.400519183046638194e-01 3.318894235680247551e-01 3.778263071760463478e-03 1.570018569186194118e-03 3.026345857981464250e-03 2.065699711777568143e-03 5.630915107337760434e-02 6.365576498005752482e-02
2.327107025106311955e-02 2.317981840953116726e-02 6.213876735011300556e-02 4.595536221945446531e-01 1.660276509814768708e-01 3.674193834138035630e-02 2.690895649931526572e-03 1.168360690314474435e-03 1.229674733408071081e-03 9.721538959945742742e-02 1.984421444563263803e-01 3.091924561794086312e-03 1.482517632426065763e-03 1.941362224404099765e-03 1.810601885740022567e-03 2.257820768446570925e-03 3.966720217210644404e-03 7.048356494639008117e-03 7.373644042714684599e-03 5.911594015977056533e-03 1.328539475550638256e-03 2.182189538188604103e-03 2.688311768580433324e-03 5.158798915657893287e-03 4.511278342262795872e-03 5.098881403920614390e-03 4.967147088169321552e-03 3.469881361586289736e-03 5.746631321038785795e-02 4.314979156878420014e-02
2.138775579020741821e-02 2.307407464944562919e-02 5.097355600821571603e-02 5.592707548735154771e-02 3.720317189236984484e-02 3.879816998385975796e-02 2.145495812835447880e-01 3.139022363385455942e-04 8.908834668935515727e-04 6.529214617653251876e-04 6.976695546848161360e-04 3.746388808032625746e-04 7.994040355610952794e-04 1.680183338078034775e-03 1.626626273123881524e-03 2.581084721188256232e-03 4.649950895776679312e-03 5.883269110197830026e-03 3.538502091727292655e-03 7.925941290386555012e-04 4.726454761037751640e-04 3.210756250929671513e-03 4.603161609332551141e-03 7.683619251477679865e-03 7.168520852464272189e-03 9.180777109574078318e-03 7.178465583087594894e-03 4.973442040600037882e-03 8.322998683779397888e-02 4.816220797244816915e-02
2.718361644559929777e-02 3.104533786184925440e-02 3.000183681926901769e-02 2.785644899613769557e-02 3.984836247758657274e-02 6.707882075892761253e-02 3.071906135981461450e-03 5.883053941361500103e-03 1.614398274990226732e-03 2.666516769261835290e-04 1.892012298048219613e-04 2.773003285226387444e-04 5.421441276168823854e-04 8.344167668475031829e-04 1.147250103653185910e-03 2.135366529665947907e-03 4.860235893302352304e-03 5.178470790861340947e-03 2.584109867834795578e-03 9.161530917911264119e-04 3.909518175482671644e-03 6.993323610414801245e-03 8.835470980646971395e-03 9.027364318550364433e-03 7.866734460506058860e-03 6.653415244282025361e-03 9.538881852296380096e-03 3.063478940091941046e-03 1.086032732695261099e-01 5.817383454046597818e-02
6.724066307371151519e-02 5.224704856664484642e-02 2.540776215147038872e-02 3.530998109896730380e-02 1.031609508383701844e-03 1.365605423857176124e-03 3.427659685028974952e-03 2.148998984072509732e-03 2.096759749288203654e-03 1.013561369569440001e-03 9.250988822880922609e-04 6.203150000002965016e-04 5.919249390609571072e-04 1.024389985162447829e-03 5.398580433885970167e-04 2.572117816269781868e-03 2.898528008242047278e-03 5.338302990292981796e-03 9.606672094694066735e-04 1.708751191279042191e-03 4.316195922845388749e-03 9.217613174671398374e-03 1.121793719405541484e-02 1.155096663512565798e-02 9.391302297757782649e-03 8.752214456712439916e-03 7.821820226472977686e-03 8.258188241250949413e-03 3.645529770806171278e-03 2.958159613138815897e-03
2.678716764194168792e-02 7.297299390337645686e-02 1.265469356321961281e-01 1.530852064584693360e-03 7.465165954495400638e-04 4.872596138826990465e-04 1.553304422453196700e-03 1.948604433665068964e-03 1.333541580229909845e-03 1.014173268380197130e-03 1.107313347977600471e-03 1.335530075411668072e-01 1.994523708818283225e-01 9.721257327873712630e-04 1.924507339155622908e-04 1.166009592049697865e-03 1.727120697488682653e-03 6.429323469966826115e-04 1.453190627212189445e-01 6.101709215466709444e-04 1.643227053585236000e-03 8.787809703687492549e-03 1.116230652221151913e-02 1.162893566288481298e-02 8.349265160903531630e-03 3.747781947188731470e-03 5.864364289050140108e-03 4.017250115059163573e-03 7.138536532364183132e-03 3.295269779005646771e-01
8.865380460159281301e-04 1.715720906802352614e-03 9.680424211113278958e-04 6.512153016600735669e-04 2.539732577718046094e-04 1.433321356441104213e-04 7.418305648838395376e-04 9.624760956207731050e-04 8.889400015626293221e-04 9.470013726071246744e-04 1.007753255852333581e-03 9.351718342695165831e-02 1.579625157975756700e-01 1.175346497804872483e-03 8.613735087930488379e-04 4.092448232793162617e-04 1.595206719889783907e-03 3.554570371716559429e-01 7.835005446284308041e-04 1.364483534045434496e-03 5.192940654624228144e-03 1.005818660352662298e-02 1.103845630536051323e-02 1.046369398980826620e-02 7.889445064909270805e-03 5.630719167014052937e-03 5.304820718242751754e-03 7.361809190002702348e-03 1.039978009730585518e-02 2.638093315448044041e-01
3.442219523621506449e-04 1.060186891808818704e-03 1.207743661856747848e-03 1.384665747554166991e-03 1.948725901387806953e-03 6.363147996863974167e-04 2.101644997613429534e-03 1.263723948538045001e-03 4.459102213115783211e-04 5.530317288903913468e-04 1.627791114060054833e-01 1.434148560518617721e-01 7.862463304940382758e-02 3.573401202141254784e-02 7.527926657033698343e-02 2.180892147798953740e-01 8.460203585259790408e-04 1.540753758341826575e-03 1.394001927870097126e-03 1.809981215100039996e-03 5.170333115273188611e-03 1.137881723586384002e-02 4.722563593047374164e-03 6.985108268232887579e-03 6.375131988853910241e-03 3.541679386732850005e-03 6.899788154401515460e-03 9.515250176222293105e-03 1.487923800091468796e-01 1.618342703717929876e-01
2.735929142035021448e-04 2.301952194883212770e-03 2.585653627534475474e-01 2.199761566474261743e-01 2.029012390501993002e-01 2.956486318220670761e-01 1.206316807615188729e-03 1.069656907318428385e-01 1.503510988355711286e-01 2.591025647942504437e-02 3.806760672178460814e-02 6.066976494688441218e-02 5.728977687627819643e-02 1.755087722827666508e-01 1.478087183854554518e-03 2.069284041592449330e-03 2.761457910178470067e-03 2.308765472743547816e-03 1.633084080186200703e-03 1.284949855739699227e-03 9.675809661146402224e-04 5.613319468349430063e-04 3.074150267677729920e-01 4.690461629022726528e-04 1.182817431754854161e-03 1.881128505640406855e-03 3.626161815263625847e-03 2.171030844218594102e-01 2.802894339692233935e-02 2.613339947665510588e-02
5.766394314552824099e-04 4.472594249643142839e-03 2.941763260110993872e-01 1.711790026875239235e-01 2.841834763073445846e-01 2.211543064379938306e-01 3.492395266019691635e-01 3.883651982902082411e-02 3.572558145418023440e-02 1.543349416773205640e-02 3.815489644120476781e-02 7.026790292097630231e-02 7.558239116729556506e-02 3.426428042986464084e-01 2.184570784882951429e-03 4.698176217300025284e-04 1.749176295103165501e-03 3.343378773003760109e-03 3.886636866934712123e-03 3.526132714127493215e-03 2.317405177811092051e-03 1.618489654772448149e-03 1.952675115405467154e-03 3.145371000584806179e-03 1.397941968186610078e-03 1.936489449276875257e-03 2.597205660903231239e-01 1.057742270200938139e-01 3.934864540322340759e-02 3.758853761877160166e-02
7.084752156842640371e-04 1.196219487937054144e-03 1.665979391712323621e-01 7.123338891396281680e-02 8.911086906484082248e-02 2.031610928876501632e-01 2.748902490253750108e-01 3.223004562111694837e-02 1.752062095583360735e-02 1.993221469314256783e-02 3.613436606072315677e-02 6.153720957829889732e-02 5.675288037742975272e-02 2.682506160109199844e-01 4.186426128262114507e-03 3.402293296678939472e-03 1.341796168562297935e-03 3.128645843615685766e-03 3.987341566895771794e-03 3.523636937716254601e-03 1.204216601136573646e-02 3.135595197494150388e-01 2.143466615073649495e-01 1.928157247480555801e-03 3.354689769054812563e-03 3.195463792702469153e-03 6.345465913296354996e-03 1.864371476795970983e-01 3.234421188977341932e-02 2.898933728915831926e-02
1.864467256668053859e-03 2.442452975076945306e-03 3.615448903457090801e-01 3.841385830739649787e-01 2.686749238906997479e-03 2.135609787540384153e-03 2.808800042290794385e-01 1.203246980544731976e-01 1.764080067129086271e-01 2.251619246704605337e-01 2.107099062897059560e-02 2.531669398626918213e-02 3.319564646351873261e-02 6.404612539907487967e-02 3.197695657342301545e-01 4.350443059069959706e-03 1.344473933678299498e-03 6.520776954631216787e-03 6.748611675669638141e-03 4.530369038923188693e-03 1.197246261836050658e-02 3.959165381461596800e-01 6.262739773446319991e-02 1.004954182428640097e-01 6.073709380334502660e-03 2.520264658799116746e-03 1.030358540626011461e-02 1.779836191719609551e-02 3.852147082872503514e-02 3.326152095416361892e-02
7.296821934572541744e-04 3.677875657526394337e-01 4.691289982399003966e-01 4.991458887014191097e-03 4.993425728453618762e-01 2.349460927415267242e-01 1.133637583247998210e-01 8.357061264481090157e-02 2.629759407784043046e-01 2.718404047190701653e-03 6.905840798325899033e-02 2.556615831996057742e-02 3.774917803775587610e-02 6.917046403072382721e-02 2.850610984392140668e-01 4.255830843489661307e-03 2.902294111747846794e-01 1.330291606532759963e-01 1.898297387733041686e-01 3.170622916482044862e-01 4.806912229982053357e-03 1.314071988071716379e-01 6.769946784091057657e-02 3.130209489596703643e-01 3.280979971948817103e-02 2.205608100081580536e-01 1.699806432263028730e-02 3.112325016687720464e-02 3.173616922483769032e-01 5.337803456447910710e-02
8.251712401021312968e-04 2.662419938087706543e-03 4.500118052259279855e-01 3.619870686533024906e-01 3.506613173845974374e-01 1.390651034112757867e-01 9.330038694260869847e-02 9.821167947703775269e-02 1.100986213569741246e-01 4.364858569729713755e-01 1.278672530453633660e-01 1.278642301807329795e-01 1.025216237712380934e-01 1.034917249852665283e-01 2.592332777693664436e-01 1.747478421365563639e-01 1.212074901340254585e-01 7.458681384166676587e-02 6.391474857186137115e-02 4.755194688317027074e-02 3.822510725325081044e-02 5.597484520422296023e-02 8.558655451586932861e-02 2.000125055931771534e-01 3.425818038559299561e-01 1.549169672378966911e-01 2.379209629368005119e-01 1.628085939476528465e-01 1.659633695482555238e-01 1.081309648907756438e-01
1.873469961129943539e-04 1.081278123134984167e-03 4.470399932129335285e-01 1.792579812949003778e-03 9.170950243879511183e-04 3.358221945810233589e-01 9.328903376045478545e-04 9.762042047856399904e-04 1.518689473614779351e-01 1.101102069252935522e-01 4.120727649424482664e-02 9.537159514624719836e-02 2.387565707392775571e-01 2.175653143509588272e-01 7.429141218751275123e-03 5.410273593819004551e-03 1.373767863182901172e-01 1.611710866311449053e-01 7.219635125014912946e-02 3.176992724124119011e-02 3.091955600835957774e-02 4.831588668882307730e-02 7.333527195957664779e-02 2.242792486742447300e-01 2.276336737180154057e-01 5.418293216131034318e-02 6.036861680049114554e-02 7.661424037172463730e-02 2.462369598056858011e-01 4.978739490141841778e-02
2.497973360231870387e-04 1.035478601855957265e-03 3.355409420339487345e-04 1.252342500475372555e-03 5.013612058089575224e-04 9.551093019487035549e-04 1.623166443751385352e-03 3.789963940218053495e-01 1.507109189393603943e-01 8.754022343464407108e-02 2.654285653192021976e-02 3.388773978284810584e-02 3.618765605872108909e-02 1.231594552105233636e-01 1.404164610990034923e-01 5.902000259403428206e-02 4.825982980011044032e-02 5.154643367722147596e-02 6.875655705887231961e-02 3.954152900289348987e-02 2.805903771827824092e-02 4.175475545967307495e-02 4.743729612603216073e-02 7.948595564538972480e-02 2.496470576320367341e-01 3.968223353065022940e-02 5.787165257430525872e-02 9.342155090566117703e-02 1.111613316572469812e-01 2.182091431659982372e-01
1.340375556247823939e-04 3.196312001751868814e-04 9.046976918225207542e-05 8.998215112869783344e-05 3.977327823010583848e-04 4.065684535052085393e-04 1.307951600515483166e-03 2.604975910591674215e-01 2.019714654579291280e-01 1.894656811222518999e-01 7.813208994226271409e-02 3.952059717978306796e-02 2.368579905585857862e-02 3.701873185467093735e-02 1.682308512859081728e-01 4.390204600173421706e-02 1.163124093725111524e-01 3.869615725312431937e-03 7.761309219087669103e-03 1.521471938812082869e-01 3.927509367531212270e-02 5.493362736175667893e-02 4.779310568333493964e-02 5.266504345963396450e-02 7.020922837783424852e-02 5.410135936019454944e-02 6.383298769439252340e-02 7.760687872706016621e-02 1.030851206659127717e-01 2.503746150903014556e-01
