6.140681378154969408e-03 8.980579683745489733e-03 7.878607056423753835e-03 1.002966438460054649e-02 7.623820637131966012e-03 1.671055576741019288e-02 1.644422276106219383e-02 4.418123107106303876e-02 7.996780429467510720e-02 3.634856475179469582e-02 1.714545711551716811e-02 4.204398544635881696e-01 2.510665606862044763e-01 8.515163945242827659e-03 9.801060499669516160e-03 2.606771274189261245e-01 7.368452896506175014e-03 1.256001705037248888e-02 1.109106728549967905e-02 3.810731206547145634e-03 3.026874545892775138e-03 6.816933977347149065e-02 5.270597513692351632e-02 2.089839100788102311e-01 2.355465285569716474e-03 3.133166784651488235e-01 1.436617566161363657e-01 1.272047900018959121e-02 1.209862096571367486e-02 1.515261477759473167e-02
4.789060807313664236e-01 1.053928361457160887e-02 1.907012119816771378e-02 1.553205900030274825e-02 1.083490475310160302e-02 4.854229644446929337e-02 2.304829201403837263e-02 2.853276890721035894e-02 1.849299982780923390e-02 1.576782374182937249e-02 1.132387767509939087e-02 2.449059582254144996e-01 3.329675913076450833e-01 6.717794479661220487e-03 9.317765957181875849e-03 5.986442066896411826e-03 7.256592187049835767e-03 2.305005420550056139e-02 1.693639976738884126e-02 4.974433466789856227e-03 2.853090532973541205e-01 6.387310922386058021e-02 1.336364997076356365e-01 1.179066289644506993e-01 1.033426056585871056e-01 1.374804768918950759e-01 4.845003769818898021e-02 1.258631406381759306e-02 1.797950435532157457e-02 1.806489686016878732e-02
5.898582370585879475e-02 5.860601279570909483e-02 1.240968824452057251e-01 1.001201288893150965e-01 2.141633939796542541e-01 2.184854011495679024e-02 4.126577433327990319e-01 4.400176788197285305e-01 6.929103998647280493e-02 2.092697701108323788e-02 5.617409987572022367e-02 3.717266338920324764e-02 1.361208657514514572e-02 2.005074840204829068e-02 3.837202892593349554e-03 1.624266815686905077e-02 1.066104349564635581e-02 2.119235946497016049e-02 6.854693571075548553e-02 1.110741093543304338e-02 1.793050534775603999e-01 5.196333523520114267e-02 7.910203654830867681e-02 2.767366221051629355e-02 1.652420667067838050e-02 1.095402178293226197e-02 9.723678748920050463e-03 7.727629007887646014e-03 1.316920420514164705e-02 1.495106715433316795e-02
2.727370492874042415e-02 7.576484828217520950e-02 1.665289088302681353e-01 1.334632875392095797e-01 5.534529023138363979e-02 8.590593488168336150e-03 6.870982689558748947e-03 4.713726297707914736e-01 2.862844314631921572e-01 2.590555836695875719e-02 1.655944476312341818e-02 3.288554030002232426e-02 1.483768203941229248e-02 9.948846671933880836e-03 3.512790336989475293e-01 2.767527972736131825e-01 4.542795808536795321e-03 8.268015621927768052e-03 5.744223764282230943e-03 4.791365598899495655e-03 2.122135036108512701e-03 1.196059298059796161e-01 3.736557477480935419e-02 7.191185816126091646e-02 1.336564052973402555e-02 9.797873461107897003e-03 8.331074618643711724e-03 7.939384741338442741e-03 1.594179992611113178e-02 1.766980795418837680e-02
1.574230663840112815e-02 4.720909619575675009e-02 1.314544970076932662e-01 5.091378490043587529e-02 2.941829871621981854e-02 4.457300908978967802e-01 6.654333226953955752e-03 3.829057848154662214e-01 1.760580805073040100e-01 5.987203113998999793e-02 7.450840962802406098e-02 6.367621759164734940e-02 9.366850905797799096e-03 7.723762827104760885e-03 4.135316234386512968e-01 1.572777745997469001e-01 1.375181837608600334e-02 7.769299542930963552e-03 1.236233105682538538e-02 6.946387861401812774e-03 4.656621007202137869e-03 2.003919428864293362e-01 2.643079523681726457e-03 1.209918411854740417e-01 2.395959876492933724e-02 1.292537870963815505e-02 8.870039307871467604e-03 1.040370819412819725e-02 1.619751551071023019e-02 6.121815860486536087e-02
1.567543208854136130e-02 1.588571876521802095e-02 7.108565255507681702e-02 5.681885154503582558e-02 2.258826016675512943e-02 2.575436084953844906e-01 3.128866755211034967e-01 3.348605633334981180e-01 3.091443576806675586e-01 9.287994949401340294e-02 7.262544841485220337e-02 3.841712809359196235e-02 4.409695780150851285e-01 1.366535172001613341e-01 1.057479351809741258e-01 1.754574473765393439e-01 7.722792636560013926e-03 2.511614960272175456e-01 6.476868939282393392e-03 2.206440804391179150e-02 2.611636072577642326e-02 1.498642696729878508e-02 3.579298331198760112e-03 7.305910024621987964e-02 3.574335764625258954e-02 3.355101397090910070e-02 2.055735566685644444e-02 1.445284717436545047e-02 1.903533625174842758e-02 3.549043433237775158e-02
2.245216481658962315e-01 3.597160169048929101e-01 3.798861180670196624e-01 1.781128360765448990e-02 8.525317216588905803e-03 1.427775416486799960e-02 2.199813998825037378e-02 1.273918466688249776e-02 1.533279325254129077e-02 1.791899051432027309e-02 1.382750915530526689e-02 5.718477527298261934e-03 2.280181756867944443e-01 9.020211881895778827e-02 4.802044043703423276e-02 8.634756406895095771e-02 4.414507433410481789e-03 2.517087648915479203e-01 1.077080979321470323e-02 1.466667010615194458e-02 6.553470415226182039e-03 2.150695873650390610e-01 8.584216357618194848e-02 6.641928305994168613e-02 2.433912155403456651e-02 2.478255350309903002e-02 2.127318258748631119e-02 1.893399613264774503e-02 2.208716076308803178e-02 5.462836130730058803e-02
4.728418952798718253e-03 8.514435505592754180e-03 4.955189822453160732e-03 1.063297870183887127e-02 1.619971380814356349e-02 1.828419572869411161e-02 1.640005976497357215e-02 1.564984522989055354e-02 1.272058477309212336e-02 7.168681875418242769e-03 2.878900614831004789e-01 8.968310169692570930e-03 1.877051633621198423e-01 6.312733342922913216e-02 6.531773042999662604e-02 1.218974615147404850e-01 9.101074850681952627e-03 1.457469898931032515e-02 1.283080784860936470e-02 9.079919618295210701e-03 3.136203143680747485e-01 1.504741214691044937e-01 5.143245810139838309e-02 3.983143830130456836e-02 1.857064239918267481e-02 1.932532464125504348e-02 2.948285657800195358e-02 3.806036004127472117e-02 3.902824616992168344e-02 1.187437225832448928e-01
1.255282639350203261e-02 8.159694643912281456e-03 4.763279860759696629e-03 2.745048247558943069e-02 1.769151871254369401e-02 7.492358570828772449e-03 2.435967729253478431e-02 1.100681920041283318e-02 9.308586476898878664e-03 9.222903865249716671e-03 8.244371201539439989e-03 1.088705980594388556e-02 2.369823916631369140e-02 1.538407353882045858e-02 2.374913142824184864e-01 2.195983811201029090e-01 8.885081905782556133e-03 2.685713719460845750e-02 2.640750051446361102e-02 4.374669698601880638e-03 8.496491776675374474e-02 6.663164823930060876e-02 6.359702784960019617e-02 3.889328608670526016e-02 2.233127297032343889e-02 3.408010488015168066e-02 1.269893032753695028e-01 2.629401832161282204e-01 4.801660895855833222e-03 2.580964208711611623e-03
2.098718916445572666e-02 1.360629905013588728e-02 2.163988077326643722e-02 2.005447605956495877e-02 1.747768386934755308e-02 3.484619308943572857e-01 1.609368471161554820e-02 6.862404037289944470e-03 3.045201168316561402e-01 1.129228481307956444e-01 1.580570279286146532e-02 1.535972887848730678e-02 3.250516874464015604e-02 3.528317315804029020e-02 1.688753185718979907e-02 1.848241893924286797e-02 9.801323247988064091e-02 1.005489746669109008e-01 4.005325740290421876e-02 1.766157658908506720e-02 1.047814529386221633e-01 5.036715000647588175e-02 5.198955594361830135e-02 5.441351240306190051e-02 2.951502461496768870e-02 3.778119972763924889e-02 2.057027314388288741e-03 3.843079055977395575e-03 5.182299580566533670e-03 2.162741307496172660e-01
1.755972820941725104e-02 9.139420804911627463e-03 2.034457659562336970e-02 1.717305922225592293e-02 2.168430742641678718e-02 2.019978308847891202e-01 1.724866382469965043e-01 1.524274855676704954e-01 9.705293672522351256e-02 8.024116627331562973e-03 1.256650967436298838e-01 2.086577439411693713e-01 4.311990042574029847e-01 2.137952390644977108e-01 3.965594391457835655e-02 7.752244245539874345e-02 1.423455552483556819e-01 3.897088504481717453e-02 9.226285045431579374e-03 2.077815709999480953e-01 7.167080340294988694e-02 5.024200038944103691e-02 5.993445870489617217e-02 8.145872883052776570e-02 8.534344648179123527e-02 4.585009115523325240e-02 7.224651051361896670e-02 5.939187264656443921e-02 5.442694495819938583e-02 3.981995842648550221e-02
3.113307559113703826e-01 1.828901487211004318e-01 1.671800220562149816e-02 1.628175054321638268e-02 1.260131948590983639e-02 2.935325921348449496e-01 1.157142028709462755e-01 7.519027542283379661e-02 9.403989307506563367e-02 1.568594354411139563e-02 3.806113520721515070e-02 2.480080891073074834e-01 4.439870858178996404e-01 2.302818617932271827e-01 8.334080759009877826e-02 9.348716454549305110e-02 1.024422892582057543e-01 6.019329900577694015e-02 1.477065869703757597e-02 4.453047119632221884e-01 6.625934784553491608e-02 5.903908392435747166e-02 6.693899852497062208e-02 1.187177694906611514e-01 1.129439385602546142e-01 8.013817075242113397e-02 6.120655294314059081e-02 5.603010508179055715e-02 6.038971896234159031e-02 6.508357929264242669e-02
6.020931177329968964e-02 1.553510989586445734e-01 3.807825436435769428e-01 1.096825320840168205e-02 7.120914148021099607e-03 2.285984129820210486e-01 1.181150067137052007e-01 9.958535783795069429e-02 1.265529764184643025e-01 7.840403672459049511e-03 2.998595095856252946e-01 7.963223378488164250e-02 3.329696972739523697e-01 1.409932125401202330e-01 4.398969423558050929e-02 5.030405687044282176e-02 1.851548153105485317e-02 2.713681484743482586e-02 3.089142125004085138e-02 1.155212114999460381e-02 7.940924642459702698e-02 7.144596453446319662e-02 8.627148413573422492e-02 1.485515170748579195e-01 1.956340568017219672e-01 1.848082402444050087e-01 1.374036465567974041e-01 1.245898883102321414e-01 9.462583490980716605e-02 7.291812045440147771e-02
4.786705222571269180e-02 1.377768164123043260e-01 2.538171317226722845e-01 1.862713087117631172e-01 1.108516563906430108e-01 4.413115845821723449e-01 1.416037883574766156e-02 1.181975740446162756e-02 1.825603331071972701e-01 5.654579683038826743e-02 2.281047696295048777e-01 1.298163027189713423e-02 1.521379092942469757e-01 2.017227226574017096e-01 2.117875209452605434e-01 2.809657492124337796e-01 2.527972854635275879e-01 1.640164401090747903e-01 4.479525024453363535e-01 2.096234888025056142e-01 1.739669776265508755e-02 4.948787378232398226e-01 3.733565008784279771e-01 9.533321615371138577e-03 2.233065516026893835e-02 2.100632536354067950e-02 5.764654706399113815e-02 1.845378209886668064e-02 1.526776224736442200e-01 1.468361433179151132e-01
4.303945793934148278e-02 4.334949807711052649e-02 1.211274191001235068e-01 8.817613486672528852e-03 3.345839984833303138e-01 7.913199024776572388e-02 9.409069059881911001e-03 2.689637567267856230e-02 1.798219854850263005e-02 2.259226692740664566e-01 4.011634202039196170e-03 6.379171541575436033e-02 1.343834340038442821e-01 1.675478819731300306e-01 1.490438092273840831e-01 1.773435016910475392e-01 3.025698325253425303e-01 5.238010697181387787e-01 5.360650218607769801e-01 4.274527159884817795e-01 1.847267272221597006e-02 1.946374436503587463e-02 1.724644811913660786e-02 5.453559238087180017e-02 7.886682657673849128e-02 4.054702211671968870e-01 4.075565572813913962e-01 8.096392771124100163e-02 1.776036634816616222e-01 1.061686286582975425e-01
3.765510856694936903e-02 4.121039146953850429e-02 9.609329653448503428e-02 1.076736307550212879e-01 7.207496140370270310e-02 8.253663676791224424e-02 5.136999616384065048e-03 1.435377741938991848e-02 2.964500791095024679e-02 1.067268376195805619e-02 1.105703712802713623e-02 9.641264537995911793e-03 7.459863783195899711e-02 1.500197471362227919e-01 1.390885804321161101e-01 2.111652568501553584e-01 3.646170035687483768e-01 4.444158050597685761e-01 2.592773577676241170e-01 5.746552980300943803e-02 3.493567547414062890e-02 2.420921603016958912e-01 3.535533188752865152e-01 5.975109367390695203e-01 5.634317756001689936e-01 7.360932006879270517e-01 5.935921705286735239e-01 1.689238418802931907e-01 2.791680168606918144e-01 1.259985509241244306e-01
4.573732556707531260e-02 5.320875994918886076e-02 5.362746431110292089e-02 5.203951892141904512e-02 8.054259527838691923e-02 1.687217763478489063e-01 8.333104847130740067e-02 2.773549740307739153e-01 1.351643847816144106e-01 2.315799691791235043e-02 1.717353156352333793e-02 2.667341260508781370e-02 5.258828360190842544e-02 7.742762238515879525e-02 1.018986309601683099e-01 1.821700320259380945e-01 3.918620089354648561e-01 3.987623901497467371e-01 1.915168830262294619e-01 6.676764780691633872e-02 2.902999166477709392e-01 5.290006546398293708e-01 6.824594830171771820e-01 7.056893114486664231e-01 6.242897405029479430e-01 5.412795027957902905e-01 8.055268944491269512e-01 1.406084001842660414e-01 4.154711762118979967e-01 1.769883891607937909e-01
1.099775038881047606e-01 8.692530929567704456e-02 4.637853751024877125e-02 7.449295874012110130e-02 8.009112424920493412e-03 4.044630428696674440e-02 2.247407825027973316e-01 1.822348314149154214e-01 1.789517804686582836e-01 8.960387812679848629e-02 3.271341477298368716e-02 8.762506174877619097e-03 8.569897344858613819e-03 2.216817650716651489e-02 5.000776766575612542e-02 2.310623905735486594e-01 2.428222148994014784e-01 2.868145066827512690e-01 5.051422122336502590e-02 9.030244996718822525e-02 3.228430854590964572e-01 7.033175192956462318e-01 8.766110833310494233e-01 9.149300109205845688e-01 7.588167586739409387e-01 7.336775584259780381e-01 6.852461583318198990e-01 5.432501887668567120e-01 2.410625193443948627e-02 1.589125237866526041e-02
4.971556273149435601e-02 1.385148571919560534e-01 2.619683991850101368e-01 1.453039978392731135e-02 3.212924894149030847e-02 4.523539151006127079e-02 1.421626494954987829e-01 1.760912577402210522e-01 1.205319809928524083e-01 9.369114368324779618e-02 1.968232490576575511e-02 2.843801022295441294e-01 2.939243978080826637e-03 8.388115792407942889e-03 1.838623619940184944e-02 1.097338015363774760e-01 4.194637827374887717e-02 1.353452572400539074e-02 4.717625453577872774e-01 3.328348282057624896e-02 1.269197623989066492e-01 6.782854578203594276e-01 8.644052336406957693e-01 9.106272696933050970e-01 6.687048125972393509e-01 3.114500739159134501e-01 5.056543475825042711e-01 3.470665946351991216e-01 3.129552123148636456e-02 1.235387223848994492e-02
1.061546415759167389e-02 1.339675018595735262e-02 8.860259225648797060e-03 1.084289588408213038e-02 2.519757587763501311e-02 1.433359367622730890e-02 7.343218315905053473e-02 9.391797487745513762e-02 8.627688904848557216e-02 2.040300480455498749e-02 5.137915777803009343e-03 1.688088111651798728e-01 2.915839903649292131e-01 5.800248525081153073e-03 2.346587145878420433e-02 1.610239738884525901e-02 2.946792199989682615e-02 8.734326022202459211e-03 1.636834970642190093e-02 7.727250080094533180e-02 4.155668553921239017e-01 7.893234423775654651e-01 8.523960969490852468e-01 8.161518413481668732e-01 6.313871862803692725e-01 4.653174060901402731e-01 4.524824367646330114e-01 3.048659753595939770e-01 2.744788184836532280e-02 9.770575125750602732e-03
3.003387499804375388e-02 2.699005528591513423e-02 1.368220317021029420e-02 9.668029846792963733e-03 1.231784183689536676e-02 6.515053158768030657e-03 3.680208489574066794e-02 3.246762028928530663e-02 8.855713537102830393e-03 4.848599215790547201e-03 1.683902474876338698e-03 2.219442152589882200e-01 1.314925231374252101e-01 7.227463198378533682e-02 1.863628255625328356e-01 4.624925879623403846e-03 1.649848825277371381e-02 3.755611812730780957e-02 3.602758527796039861e-02 1.603638208233162665e-01 4.378903232764289610e-01 6.373392503921521124e-01 2.609167600605187265e-01 3.943843118603398423e-01 5.125003256548743558e-01 2.919960700159003886e-01 2.190201474096052925e-01 1.798836637725145238e-01 5.559568808509386395e-01 5.073436083403604080e-01
2.427096125483280825e-02 2.739841570677122376e-02 3.979993040263064830e-03 2.701979910045736004e-03 2.167995202026492575e-03 3.186477376565586064e-03 4.499635716473847358e-03 2.050358158513678752e-01 1.422030359324042001e-03 4.160567501274088642e-02 5.408515378407970087e-02 8.176316727769931958e-02 9.043959663428770279e-02 3.234280279198627484e-01 6.292172428237654061e-03 8.574840475488806901e-02 1.627262278741499202e-01 2.341418559855845127e-01 1.589688105248781014e-01 1.196882765300626705e-01 8.521061263955399812e-02 3.069534286683518048e-02 1.194075872673809255e-02 2.586821798034966841e-02 9.429288779460016923e-02 3.213744939421865621e-02 2.986992677102255633e-02 1.010310086001596844e-02 9.597980013515719500e-02 7.856262391145793500e-02
5.086004822710400719e-02 3.848000575365706499e-02 4.098424465856689847e-03 2.695073646857051308e-01 2.488033504469905691e-03 1.913067142576699645e-03 2.922218915669829321e-03 5.651662285318308221e-02 4.803634930341077469e-02 2.066548902191226236e-02 4.872867562274146164e-02 9.169622275116466603e-02 1.221964117161360996e-01 4.294776479006346889e-03 7.499362804184639755e-03 4.966795091325614669e-02 1.793604093637700958e-01 3.317881118684118391e-01 3.732146527900202515e-01 3.254439336494026613e-01 7.039414843880366368e-02 1.592067646933457981e-02 1.990550109076352076e-02 4.881462777512364515e-02 1.090910809217411903e-01 3.232063758578782725e-02 1.249207330698791016e-02 3.927575923179862372e-01 1.243609185412860446e-01 1.119861809374423922e-01
6.295959934041621409e-02 7.894472736026010573e-03 3.154072902996109540e-01 1.076607123229199325e-01 1.278770589061131169e-01 2.859725683002974916e-01 2.111634768577233361e-03 4.242986487750136787e-02 2.359441792482416811e-02 2.710766774732061707e-02 4.776581759210361128e-02 8.117556629957006775e-02 9.213364044787751561e-02 3.305142039452071447e-03 1.377611928670494784e-02 7.069329944905416996e-02 1.350985864327274300e-01 3.076606390829025872e-01 3.835861195175406246e-01 3.268440844237076037e-01 1.671035261347077472e-01 9.823857013222973139e-03 7.080707046078975157e-03 1.533257081164444285e-02 8.839295080789348613e-02 5.303769267376196028e-02 4.805245880667438629e-02 9.133355616388654646e-03 1.108779036115410538e-01 8.572747060603869151e-02
3.473377169950551957e-02 1.059471176226555594e-02 4.064600602648931436e-03 3.721393395116007977e-03 8.135685909890815609e-03 5.490915397309247860e-03 2.242354093522762239e-03 1.643932677291072286e-01 2.485759423456614936e-01 3.213436069205156675e-01 2.974510836878504344e-02 3.335727268936253265e-02 5.219853097529546238e-02 1.191506527399392723e-01 4.934721817160947835e-03 2.151395759167558722e-02 2.151811923957841835e-02 9.138997578642742148e-02 1.164754919215020001e-01 1.011857296608232037e-01 8.769646861891161604e-02 1.162441142060121127e-02 1.745294487434947417e-01 3.311398991374849832e-01 1.580618104867346010e-02 3.948137467528791550e-02 1.065502664245519537e-01 6.077351933884494323e-02 1.316682658016240515e-01 1.003428954021293451e-01
1.241886975151543573e-02 4.853197161169036516e-03 5.118684154052927614e-03 8.486929422470812501e-03 4.566247909984919723e-03 3.460825658497760915e-01 1.616541973035569013e-01 1.153510650737757381e-01 1.974079078449584614e-03 7.722257112349065547e-03 9.571161512676688854e-02 3.282574493744214172e-02 5.575311157604279089e-02 1.233111339735061818e-01 3.999449215500989856e-03 7.667928646996445205e-03 5.278571693053989329e-03 3.368411228850439199e-01 4.132509170785324606e-03 7.641698845414875846e-03 1.407158350436260759e-02 3.471299663804083280e-01 1.744932664304215397e-01 9.076260678536739873e-03 2.224327611661241350e-02 7.931032313031848024e-03 2.755542697920047163e-02 3.134034160728815799e-02 1.128283241377526190e-02 1.542225915915696743e-01
1.258969563139611392e-02 9.955528950743253169e-03 4.789499205923595029e-03 3.455795395705325065e-03 3.168766575368660646e-03 2.012441355945217003e-01 1.350305373606827120e-01 1.405001003822924366e-01 1.566456167848481740e-01 3.381306083079212502e-03 1.736665318158933380e-01 1.639064826513118578e-01 1.554178589603291416e-01 1.953413407074664487e-01 3.879529316168355002e-03 2.922459051192607959e-03 2.736695570103600539e-01 1.641749328241304262e-01 1.447331867301902830e-01 1.110354400570654765e-01 8.830513941966237901e-02 1.289056201564965642e-01 2.049299341568782684e-01 5.128417705293417672e-01 9.158338753945026445e-03 4.328601366341590650e-01 7.428271432019720524e-03 4.502992606969535849e-01 4.572079486437804485e-01 2.978696382606283444e-01
1.705457186906265965e-02 8.764353141250309093e-03 4.922219393536919445e-03 6.626745856751714570e-03 5.735167851359945432e-03 3.076217077444315731e-03 1.036317583983567027e-02 7.728195399814829884e-03 2.108232130752842881e-01 1.516443656441224808e-01 5.363324787604020066e-02 1.222387070965652855e-01 2.153433363252900586e-03 2.598596587438046016e-03 8.747949769930865246e-03 7.113567584674575575e-03 3.124234768105588200e-01 3.728002479146337311e-01 1.729882319046850969e-01 7.532933239982789186e-02 6.840869840269767077e-02 1.044013826076352069e-01 1.623183129757237442e-01 4.821122765219500346e-03 5.318995104249544734e-03 1.326146852650958718e-01 1.498764440341097959e-01 1.919997159787548424e-01 7.013093363712346456e-03 1.302283208347002619e-01
2.289247652468424932e-02 1.952909534296765753e-02 5.847417492781639865e-03 1.972315183216582710e-02 2.253672179518358132e-02 4.197203618209163767e-02 2.789990573646593253e-02 3.127266161927184408e-03 2.082014209420635087e-01 1.192917205407068859e-01 3.494345811012368463e-02 4.334146495725858805e-02 5.465799025753785567e-02 2.240664203013675859e-01 2.883375369391948939e-01 1.334534072321890696e-01 1.314014675251702347e-01 1.583532795136158022e-01 2.159222314999764136e-01 1.179078811008992395e-01 6.397491582190333037e-02 8.664527672067713626e-02 9.709533558924718366e-02 1.710457851545087449e-01 5.332883792694592326e-03 9.177207662137126798e-02 1.361711337282424661e-01 2.243720429707326547e-01 2.658258829446264460e-01 5.474838480360196824e-01
1.251836233500657966e-02 3.075804762940834852e-02 9.072300208780021205e-03 9.612714650479643741e-03 4.587377627268219432e-02 4.813063780423625787e-02 3.198956844775035363e-02 2.189268879561256150e-03 2.830842603159282045e-01 2.654399906368219986e-01 1.082379749392489710e-01 5.328616358410496329e-02 3.463765216750353676e-02 6.244623641820506998e-02 3.087141911165378616e-01 9.279048520428692659e-02 3.347090119582823986e-01 1.687321764964869186e-02 3.145022752082026612e-02 4.406028163128974939e-03 9.595088138487267715e-02 1.210794851539120087e-01 1.027045964996572969e-01 1.182841116312620400e-01 1.648143333365129637e-01 1.313628927438806882e-01 1.586881448914351234e-01 1.968945404387824338e-01 2.581231259736821992e-01 7.980315893156838397e-03
