1.233344901008993910e-01 1.761238195102564352e-01 1.469979514263870246e-01 1.810041937810540902e-01 1.254808203074907202e-01 6.870973965167327625e-04 5.309526483615138048e-05 1.423156470606789722e-04 2.575287524675536305e-04 1.146318080458185373e-04 7.382006186012202154e-04 7.123821645530765967e-02 4.703839245166814564e-02 1.734675938866520883e-01 1.703534004254677377e-03 4.850763311655530846e-02 3.979384949169061472e-04 3.456709685433791406e-05 3.544345430787775746e-04 1.730226660907554503e-01 1.592004985671161554e-01 2.397674103468735302e-02 1.826294220477727229e-02 7.336264889747454165e-02 1.445128226331360011e-01 1.152080290098450588e-01 5.389992244898976492e-02 4.761938539067849668e-03 4.562109276770504040e-03 5.757172635003602289e-03
8.153945133527348843e-02 1.716338558999503661e-01 4.136031244528957929e-03 2.212549212236847307e-03 1.524613851009695986e-01 2.256575023530163308e-03 5.494105469946963501e-04 6.586265740303055404e-04 2.344605027260898982e-04 5.303899807902020451e-05 4.614512605256710612e-04 3.707456326767177845e-02 5.604774634832884045e-02 1.347551351859255508e-01 1.708207778695809871e-03 1.338817137133249957e-01 3.645258316474027285e-04 6.281404654661345893e-05 5.002142338829049240e-04 5.794741971659146326e-04 9.168614009904400841e-02 2.312466003483298893e-02 4.792425724114450503e-02 4.314539287340474205e-02 3.880900095624887497e-02 5.296664570728632643e-02 1.898634639171366614e-02 4.839908049271794514e-03 6.904056498172985064e-03 6.916554224734257350e-03
2.248960147203860147e-03 2.062487134819647201e-03 2.451880712197138535e-03 1.096295885668169831e-03 4.584787455517539377e-03 1.979700471683413718e-03 6.766846692037419009e-02 7.110015571177547011e-02 2.917529229981156384e-03 1.854012286386741784e-04 4.451620231892555605e-04 7.427325240135939808e-04 7.464636454463606909e-04 1.765763446830275092e-03 8.386706865663821897e-02 1.640123008729421974e-03 7.256463707582189778e-04 4.889259930818874202e-04 1.813327915792412601e-04 6.687450007739212865e-04 5.682488077657214115e-02 1.921789249132193136e-02 2.939011577091297372e-02 1.030870064594126105e-02 6.216803041046714551e-03 4.173768876428292363e-03 3.808720733067256451e-03 2.994806660717827269e-03 5.112413770854070359e-03 5.734923061233136894e-03
9.719506677668762079e-05 2.737325444765930445e-04 5.984366235351618046e-04 4.834906999075214737e-04 1.570324552846144193e-03 1.391920907611694791e-01 1.375753829051934440e-01 8.496058386890401048e-02 4.584473564510953281e-02 3.098278588128565371e-04 5.608304491777296339e-05 7.435773424494324579e-04 1.349351525649135916e-03 1.927244365458193054e-03 6.474505607953090491e-02 5.550550613832291869e-02 1.199377130825985127e-01 1.721747896253707406e-04 1.543297697818402258e-05 2.786058955860346606e-04 1.014862073705327106e-01 4.088793334154410680e-02 1.382443932223483343e-02 2.748810637407891541e-02 5.089454886428976428e-03 3.686516730039621128e-03 3.217469772083359630e-03 3.051139604262969110e-03 6.191601029507694601e-03 6.721796511153991897e-03
5.643471051800700802e-05 1.736308276978494982e-04 4.832953691945904946e-04 1.879559362961674815e-04 1.200021573245119459e-03 8.232292326344586852e-02 1.415091730829781680e-01 7.855837888548568293e-02 2.851268382323506739e-02 1.014732014048647405e-03 2.564093630950689084e-04 2.281444447306122357e-03 1.575650121685448768e-01 1.615207489452526457e-01 8.386315735104690750e-02 3.329321311659799026e-02 1.174600971235827476e-03 4.504139435465313109e-04 5.637601062771090306e-04 4.938152834065603599e-04 1.645730109669081287e-01 5.297161101528580912e-02 1.361997466857668149e-01 4.526374547553755484e-02 9.175276023992423938e-03 4.901827976148896183e-03 3.438171623695258482e-03 3.969401601009025539e-03 6.198671914428043918e-03 2.275141917209593315e-02
6.646649021735111674e-04 7.579177125789490679e-04 1.758459634433954784e-03 1.553202867255594434e-03 1.111513441016751284e-03 4.720421883541154467e-02 5.850632852510515014e-02 6.095201119737796158e-02 4.831579780744633956e-02 1.085219972793535076e-03 1.277126447112999792e-03 2.522350039450339722e-03 7.355697680815463657e-02 2.732173995573254285e-02 2.258513241766059443e-02 3.759934509425716387e-02 9.539692820648280240e-04 5.157199671928308637e-02 1.717814604435372594e-01 1.479736572108225753e-03 1.708732536546733391e-03 2.679147389522204634e-03 1.683169954343643193e-01 2.645673399458310648e-02 1.366222218645038976e-02 1.274403957127613791e-02 7.978241578185087113e-03 5.491204217283687100e-03 7.237234302566324801e-03 1.297224508688710719e-02
4.508538054452631422e-02 7.015009623928296356e-02 6.890944517318196849e-02 1.051969245932109350e-03 1.564303664600640298e-01 7.711236730662417074e-04 1.282970382060322212e-03 6.687655905792503101e-04 9.930102519090260905e-04 1.048653420856341181e-03 1.541548417578434077e-03 8.849780608686171057e-02 4.098439998827854702e-02 1.882311578576334118e-02 1.086247207159276966e-02 1.855900617029248439e-02 1.058690316095198258e-01 4.855788627790871143e-02 4.742612613454460081e-04 1.022576649673505398e-03 1.835719693089177817e-01 5.309514543618375909e-02 2.495936601304217864e-02 2.393966024057718814e-02 9.230758106538257748e-03 9.432610025520373268e-03 8.351974698878160061e-03 7.241807966723050848e-03 8.386601924378844775e-03 1.972795817795772871e-02
9.133213941119458501e-02 1.728662195580857597e-01 9.588792328859083169e-02 8.292329638791433354e-04 6.048887559386037461e-04 6.596135853364385815e-04 3.148798233751454135e-04 9.713161504058735827e-04 2.163961202628433833e-03 1.271480570946250110e-01 5.259952188151385821e-02 1.609060647165505009e-01 3.467642215163223990e-02 1.229608730555654256e-02 1.387024610856200761e-02 2.569987385614066686e-02 9.195506289615051551e-04 9.176189625847118447e-04 3.499256776343439906e-04 6.459632371586717650e-04 7.345293452052695238e-02 4.378872174891465519e-02 1.764045827641266828e-02 1.474990198504321642e-02 7.002579860029767116e-03 7.349432902233785439e-03 1.190093722540058394e-02 1.528884341783887796e-02 1.495488689587407688e-02 4.270215116281340234e-02
2.541744498197138786e-03 1.376214123006398726e-01 8.017332214192984807e-02 1.308388394761051060e-03 5.182070412088199060e-04 1.188434979684378362e-01 1.649051828346802511e-03 1.445619752626461571e-03 1.739481085553949424e-01 1.803959479625119044e-01 1.630373312397788432e-01 1.682929101556162460e-03 1.904453625363466919e-03 6.879056036081155788e-04 4.498503533339217458e-02 3.809712060068323053e-02 1.533794437082786899e-01 3.677341380252119058e-04 4.110596474579389023e-04 9.582033880050183638e-02 1.927071930664906244e-02 2.023866096591968658e-02 2.214617392343353613e-02 1.444839984666597583e-02 8.435933535776296219e-03 1.289639853352634452e-02 5.113795581509025800e-02 1.017300052842441127e-01 2.858275198751140667e-01 1.373022453467459825e-01
1.410109579690681843e-03 1.095945178073617129e-03 1.795423176758606000e-03 4.046518712258238642e-04 6.515504023756641273e-04 5.549339725389752093e-02 1.998536311072371830e-03 1.247058096780941649e-01 5.992538688618224280e-02 2.194822561371450806e-02 2.510646208439669663e-03 8.941962446347245753e-04 1.092349555385290437e-04 4.408425466711847658e-04 3.037889402413688524e-04 4.988533225432507370e-04 1.728098170743051169e-03 2.386549673039198988e-03 1.413999728459607941e-03 1.358946675948340035e-03 2.459447741281732547e-02 1.561923788335148680e-02 1.799420884503758616e-02 1.974340480232773115e-02 1.098788116152992801e-02 1.406555234185372615e-02 1.357191113286682349e-01 2.286515146410492139e-01 2.777939705799661319e-01 7.113941313840796421e-02
1.504105247075346666e-03 1.306620725946882888e-01 7.910815102385371960e-04 6.341385307690499871e-05 1.001184616179701028e-03 3.421657843106969132e-02 3.337144106011342981e-02 3.025876097021743677e-02 2.070434112778548122e-02 1.639498387119716349e-01 2.612262399517972268e-03 6.706542500178325206e-04 1.418839206966962313e-03 7.423105793541209243e-04 1.446796459672996312e-04 2.979262414363217882e-04 5.469524159323966694e-04 5.392226112847189239e-04 1.669756986659935716e-01 4.055237344800418503e-02 1.703479086839632811e-02 1.525671699576356885e-02 1.975700770881981538e-02 2.757378729771202061e-02 2.933573419311995278e-02 1.592891926438684200e-02 2.561798351477127117e-02 2.010054079359034629e-02 1.775492302454462212e-02 1.254421169470939894e-02
5.771521298082285534e-02 3.157148930942340476e-02 1.977494075765318712e-03 1.667550136327331000e-03 1.532511336191332441e-03 5.505352617435405049e-02 2.559897721249934990e-02 1.762034717225403543e-02 2.141270752643133560e-02 1.682802161001930273e-03 2.403913994374618380e-03 1.314224438368796679e-03 1.463191613514753945e-03 8.088142355778831947e-04 3.104379578948044879e-04 3.707873842797036247e-04 4.109948399094545159e-04 8.837988786156074448e-04 7.719184960221650918e-04 9.424748756855655385e-02 1.659185448025200446e-02 1.692676412018959825e-02 2.005686522581297954e-02 3.572623883237120018e-02 3.371502219098953396e-02 2.387567448263954589e-02 1.827120712743405748e-02 1.655847400953931042e-02 1.799130325988347254e-02 1.936719857815019652e-02
1.357393450133628603e-02 3.262799474695012025e-02 7.339778729990883988e-02 3.359854089261899313e-03 1.340519479901242095e-01 4.601191450070995365e-02 2.548273805985292600e-02 2.215764092728676402e-02 2.907298818288047912e-02 1.997921608371267810e-01 5.606721057513905371e-02 7.307011763291998809e-04 1.087695253946562197e-03 4.989112357050599564e-04 1.677546043397383480e-04 2.067363749401866801e-04 7.806984539182727594e-05 1.162636537163393017e-04 8.713899700266513173e-04 5.361639997824537481e-04 1.616653247940945046e-02 1.775550836101241411e-02 2.251752503123471277e-02 3.720681948882768875e-02 4.673712202864097054e-02 4.049669766086382017e-02 2.964631730509883351e-02 2.784662320712094630e-02 2.443678015915947549e-02 2.024283219213796753e-02
1.166710576652145795e-02 3.299717715022216363e-02 5.828224046355945376e-02 4.204071652213552807e-02 2.501441109795650430e-02 9.727682371728330057e-02 2.105145155288816634e-03 6.247232137040167107e-04 4.043533593943103577e-02 1.332635787837220184e-02 4.761548370665046742e-02 2.627167312930364044e-04 4.927211610683866023e-04 7.184773508787440548e-04 8.236086043225669022e-04 1.189330349015751357e-03 1.115279714851856582e-03 7.490374989885180716e-04 2.109681187708396972e-03 1.324677433666324221e-03 8.991646161701821911e-04 1.073917457640249096e-01 8.094085873307078904e-02 1.914049254402028222e-01 1.866277275582938584e-03 7.546517270885603210e-04 1.449302523814256262e-03 1.067757736879627103e-03 3.339937474202366724e-02 3.857110675709393699e-02
1.125096455045775622e-02 1.127390250848591541e-02 3.050252952172008425e-02 2.271416465952852404e-01 8.260214508047501736e-02 1.834924758223313232e-02 9.760123127147855501e-04 4.188322600755616768e-04 4.703284761760128459e-04 4.954600599072138400e-02 1.023850273215140966e-01 1.225606660749549871e-03 4.261585968891495380e-04 5.828154264375970221e-04 5.659532936894088456e-04 7.322200600032225575e-04 1.320965699544435733e-03 2.403317124599695445e-03 2.569493414711656459e-03 2.102170168176529987e-03 6.322264524920450822e-04 1.069256595642211318e-03 1.343479270617093692e-03 2.548378456393691951e-03 2.180841588403844514e-03 1.952632364524133036e-03 1.913266151906971432e-03 1.740321099980773629e-03 3.422672874022180539e-02 2.616704871530656923e-02
1.064909583356941393e-02 1.160768997272798933e-02 2.563085672281719199e-02 2.805896596840429247e-02 1.861148954657205340e-02 1.943630840794391412e-02 1.079066191374355166e-01 1.022526843144528643e-04 3.202510549146932021e-04 2.574892518945221280e-04 2.789781126422293499e-04 1.469199981916918948e-04 2.304498132981093895e-04 5.029074035243550180e-04 5.042954044154070690e-04 8.266510036833717200e-04 1.533628128760700657e-03 1.994036627572053164e-03 1.230103880245029830e-03 2.822644204531832355e-04 1.725630525536132973e-04 1.202096803962385751e-03 1.768089144772052668e-03 2.965157457463772107e-03 2.758893203287663722e-03 3.527379363763529039e-03 2.765147602115410400e-03 2.399847753129446919e-03 4.929998033504912058e-02 2.886154934177390108e-02
1.398621283419423759e-02 1.618676675413390637e-02 1.543470052870440229e-02 1.416757742875153665e-02 2.004264793373892323e-02 3.373249549614637521e-02 1.083077835277185090e-03 1.955086568490224490e-03 4.577432928807905681e-04 7.533491959010983759e-05 5.332789063339110646e-05 7.858958279745226802e-05 1.567750974899286486e-04 2.490157449305904660e-04 3.526683257909472174e-04 6.750380042251520043e-04 1.586763186166945507e-03 1.744382851237026664e-03 8.961996880541749175e-04 3.267934244845917637e-04 1.435686443957845350e-03 2.642759110293712264e-03 3.435025159703319984e-03 3.518070240844001304e-03 3.048069427048064051e-03 2.567097896164371399e-03 3.689551858806458789e-03 1.412737430785760643e-03 6.402959825755477619e-02 3.449920357638276008e-02
3.541762988429249942e-02 2.796057731388094242e-02 1.332335629969681572e-02 1.820191322219833277e-02 3.900689152207358740e-04 4.813520461264298193e-04 1.043110557094583876e-03 6.079276585405402099e-04 6.120881900858778091e-04 2.927788657002097544e-04 3.436550893010834030e-04 2.554274205086211618e-04 2.446383093112304758e-04 4.124529567388216314e-04 1.646191363337987600e-04 8.031071626412743161e-04 9.370788304261807710e-04 2.028962531983003262e-03 3.712642350857506181e-04 6.718296645934972947e-04 1.592733286409482975e-03 3.510491968892370546e-03 4.405400198126810385e-03 4.542093864784459839e-03 3.663831160618722521e-03 3.406117319228276364e-03 3.051569969940447040e-03 3.530219975181740286e-03 1.953686599211568436e-03 1.593155540728173570e-03
1.394472842618786970e-02 3.853100742517320820e-02 6.625205838463421593e-02 6.206867534697585497e-04 2.641576521859666346e-04 1.347912552976014634e-04 4.336765244065676219e-04 5.502531415044594138e-04 3.808019013081083361e-04 2.888903042390118391e-04 4.422691304594363482e-04 6.913677584638255880e-02 1.039801273678066101e-01 4.096268376375850648e-04 5.839504172393353173e-05 3.610749127914098053e-04 7.356858194766314378e-04 2.806635861473273500e-04 8.185786946156015098e-02 2.396534626522323519e-04 5.889471554202663217e-04 3.201217130117760875e-03 4.131355412929778662e-03 4.377203301166478558e-03 3.202615452828524046e-03 1.472067845773578207e-03 2.353610460833802445e-03 1.613027131078766498e-03 3.908833459981488241e-03 1.950908752708756244e-01
3.523316968824623794e-04 7.102543301970973191e-04 4.024683267037869176e-04 2.677336951308965083e-04 7.474359137221489569e-05 4.166357433841616530e-05 2.118910900485296896e-04 2.710640790441031368e-04 2.479398901393250684e-04 3.742670309457961234e-04 4.253035541886460136e-04 4.810488519186909007e-02 8.173040643483772683e-02 5.042169999669039162e-04 3.449081003630566225e-04 1.586278118648314908e-04 6.997828073760858306e-04 1.944280406309528697e-01 3.500742854152843119e-04 5.352737153417964954e-04 1.806616147161380775e-03 3.504451588350273889e-03 3.851562233661337022e-03 3.778075776287224269e-03 2.983737868800285815e-03 2.230342331049273673e-03 2.185494068163233369e-03 3.626942260916551572e-03 5.804457637808835974e-03 1.574161916019611029e-01
9.846161657615267447e-05 4.118518896434867791e-04 5.112301908809360534e-04 6.138922068657238747e-04 8.903147964020619335e-04 2.862551628808300422e-04 8.963324119620045584e-04 5.035169666776986852e-04 1.801116947027769910e-04 2.346211074738396309e-04 8.266502073975900977e-02 7.333210204230801443e-02 4.043784015771040991e-02 1.844662387634648029e-02 3.898506704226115810e-02 1.133228889596523126e-01 3.781048978078988096e-04 6.868742823191217178e-04 6.217177961219281851e-04 6.217582014200769393e-04 1.753753157673295033e-03 4.310481964062166590e-03 1.749774305536925352e-03 2.681997974089441253e-03 2.378811298862419394e-03 1.413817223131889639e-03 3.568084601183701791e-03 5.131401212491939687e-03 8.936039139172252677e-02 9.718088460212162549e-02
7.704334513478770699e-05 9.331862588496502844e-04 1.346092762780410346e-01 1.170989579606671466e-01 1.103641232740898703e-01 1.590195615725612799e-01 5.655450134042320229e-04 5.488351765054001047e-02 7.562520877510672812e-02 1.310886842760193571e-02 1.936273206298211660e-02 3.106015670534445841e-02 2.947430995880716970e-02 9.046725047056279612e-02 6.442052824848608231e-04 8.181952162518785687e-04 1.039474490827597616e-03 7.508243501010634620e-04 5.507011263982185094e-04 4.391883401799935192e-04 3.230616906850629919e-04 2.110248382217957161e-04 1.633407751594027346e-01 1.761601749567152876e-04 4.318441495078159794e-04 9.584239850239102253e-04 1.978072164679701723e-03 1.295514397615713797e-01 1.675711287483441086e-02 1.563844607770321915e-02
1.572795309301865303e-04 1.802881931005439510e-03 1.518355222613158029e-01 9.093861433590383347e-02 1.553960842166886569e-01 1.199815704778403880e-01 1.853820336913089284e-01 2.017007679407975540e-02 1.821652653270163305e-02 7.908115300033413328e-03 1.964332665288803445e-02 3.635901081289793363e-02 3.922847041299528520e-02 1.776674713281379547e-01 9.409926776597443785e-04 1.396253606552350524e-04 5.435478374295608277e-04 1.086494847633401100e-03 1.317932950445062888e-03 1.213333201722950876e-03 1.003091271457027438e-03 7.329215018190303249e-04 8.525842600780205154e-04 1.367980686209431486e-03 4.885576101256522896e-04 9.403017236803050752e-04 1.485243407752784850e-01 6.077728803773757571e-02 2.272915844489839521e-02 2.179908247167569937e-02
1.890236958991129345e-04 4.874547173054028047e-04 8.536308933894218298e-02 3.777198833551318607e-02 4.900695415103766689e-02 1.112068980521560002e-01 1.475481131296915993e-01 1.696230091106049748e-02 9.072582026465447064e-03 1.036210937076840512e-02 1.885615481948106978e-02 3.222995251223567670e-02 2.972907643301422181e-02 1.398690447342543219e-01 1.790641583667615258e-03 1.384444443446318377e-03 4.146285517163657915e-04 1.018300168980244488e-03 1.366294795953728377e-03 1.228271443334897619e-03 5.550555783841074932e-03 1.668437263939510362e-01 1.116862486704903734e-01 8.474502728310370856e-04 1.408913997831020854e-03 1.484704962652170319e-03 3.097531056021057307e-03 1.031313952773134507e-01 1.805603579399129091e-02 1.630365683408438807e-02
7.069124160043614626e-04 1.006887467552756207e-03 1.840358221085895141e-01 2.033338896436350796e-01 1.386691212073302504e-03 1.131898978692054370e-03 1.526228241032229205e-01 6.427104968712624156e-02 9.292290425397843612e-02 1.188548055479508730e-01 1.115042633049367557e-02 1.342897663425880392e-02 1.755757096704336009e-02 3.358664637893944704e-02 1.662166005369072608e-01 1.830024710483016360e-03 5.773589469375458834e-04 2.920047830254114858e-03 3.158436809542026873e-03 2.093666097911652414e-03 5.610823982451175126e-03 2.096935923865262397e-01 3.240344922798542998e-02 5.192262907402779570e-02 2.632751270595617542e-03 1.061469797051002454e-03 4.560012880743225319e-03 8.217273595649617068e-03 2.074386397175380370e-02 1.811371967923891893e-02
2.783019918465425100e-04 1.806718009365437805e-01 2.386118665914800929e-01 2.373166999951331711e-03 2.772697516301814158e-01 1.302383643582539774e-01 6.175213509719953281e-02 4.478177684684710169e-02 1.390964234687573076e-01 1.388058549519934071e-03 3.667510375219090735e-02 1.360604637542477124e-02 2.001377633577922782e-02 3.633292241104531251e-02 1.482403495112501746e-01 1.783191648440466846e-03 1.532708009091932055e-01 7.206822460291520405e-02 1.054286013778048120e-01 1.769867092406436637e-01 2.258578961905823891e-03 7.022708226715870805e-02 3.544530547099925682e-02 1.626677063759782160e-01 1.395565137904996970e-02 1.136284467293160044e-01 7.347472446108923097e-03 1.380154912847420673e-02 1.682727707894934033e-01 2.865494764084430823e-02
3.171244550160820042e-04 1.114440476067956719e-03 2.289150116747384334e-01 1.916951031696740582e-01 1.947842453947471741e-01 7.706419831142917454e-02 5.081151532961225570e-02 5.261483490930007195e-02 5.823267063162769486e-02 2.313030574817772078e-01 6.790018610174190783e-02 6.807681780247973324e-02 5.438203723546895102e-02 5.436617806135968928e-02 1.348002920678407213e-01 8.998602445564980734e-02 6.406781073466234766e-02 4.045014115150078610e-02 3.552892050905924470e-02 2.663123679321910062e-02 2.108857845794338132e-02 3.043050151041065340e-02 4.589309336478596818e-02 1.060073253053424869e-01 1.794830685587774366e-01 8.024835644157742032e-02 1.226773547690876293e-01 8.524832684775171532e-02 8.807620695739935834e-02 5.807519260129256899e-02
4.894056481511986813e-05 4.506657453000404833e-04 2.274727962272803938e-01 8.564319950024940802e-04 4.780053796797684076e-04 1.860985294718656147e-01 4.808059189746721859e-04 5.040373610756776436e-04 8.032423021402063101e-02 5.834845702010534041e-02 2.187970751874797684e-02 5.077850732053261484e-02 1.266444643368390965e-01 1.142785658398729337e-01 3.098169562104899095e-03 2.251679695409425277e-03 7.263648072775881481e-02 8.743306627492777872e-02 4.014414101044488925e-02 1.784901515016036264e-02 1.723939486276731756e-02 2.673768264532693992e-02 4.030752140845408893e-02 1.213348392190627401e-01 1.207907944764313596e-01 2.823457249623156223e-02 3.116076809356524771e-02 4.014868761882429277e-02 1.308105578364510968e-01 2.676067040690096113e-02
6.553726172954461903e-05 4.155097431284627326e-04 1.425029427545945770e-04 5.696489719494941600e-04 2.296124828191191544e-04 4.398559623371607065e-04 8.132914779534533480e-04 2.033921006877194015e-01 7.987936395260883393e-02 4.644850217538746412e-02 1.410269848775216189e-02 1.803982012310929167e-02 1.918990410597987487e-02 6.471266957067482728e-02 7.304229696488988288e-02 3.042648716679794904e-02 2.552453909344839719e-02 2.796660955514806979e-02 3.824095758422556973e-02 2.229320675939365157e-02 1.582931772051172914e-02 2.355865083563495055e-02 2.678188546543024476e-02 4.389880601890613909e-02 1.341706205918109795e-01 2.079540233842907052e-02 2.989410468142574342e-02 4.899283206276488362e-02 5.914242580526154341e-02 1.174405934197186585e-01
3.669130005246751676e-05 8.878575550270133157e-05 2.652827443051458561e-05 2.822709067465761115e-05 1.352541441077565875e-04 1.383240487400871335e-04 6.518802398048027238e-04 1.428531613177857484e-01 1.096651298907455191e-01 1.020607264040054446e-01 4.175616270554420584e-02 2.096742081888547729e-02 1.250023105439608366e-02 1.944934569841128696e-02 8.793451615938763233e-02 2.284190598158477095e-02 6.202639657010228236e-02 1.738764745494533357e-03 3.695354337216519985e-03 8.617973215639013196e-02 2.225810209410498258e-02 3.113751817715476947e-02 2.709675579678349350e-02 2.934119141081914864e-02 3.828960618605008887e-02 2.892389489943189562e-02 3.375099624333936787e-02 4.156371852568893632e-02 5.593415807613375673e-02 1.372546693226031900e-01
