25.358817216162 25.3605141826075 25.3622093485075 25.3639027138483 25.3655942786166 25.3672840427987 25.3689720063814 25.3706581693507 25.3723425316937 25.2785826326207 25.1771262900148 25.074732979557 25.0686799304253 25.2478026840932 25.4269257302763 25.6060490686615 25.6500275119364 25.6500275119364 25.6500275119364 25.6500275119364 25.6500275119364 25.6500275119364 25.6500275119364 25.7126043664695 25.8220748440032 25.9324666506036 26.0437782831865 25.9379386902389 25.8280886090425 25.717319609444
25.1845444058011 25.1862411017118 25.1879359973642 25.1896290927442 25.191320387839 25.1930098826343 25.1946975771171 25.1963834712741 25.198067565091 25.1491156550545 25.0962057042469 25.042359028982 25.07040265987 25.2495235630914 25.4286447588143 25.6077662467248 25.6500275119364 25.6500275119364 25.6500275119364 25.6500275119364 25.6500275119364 25.6500275119364 25.6500275119364 25.6852367139002 25.7461582148647 25.8080008054034 25.870762982771 25.8109436565724 25.7496429823068 25.6874236283462
25.0102715587595 25.0119679841409 25.0136626095508 25.0153554349759 25.0170464604021 25.0187356858162 25.0204231112047 25.0221087365541 25.023792561851 25.0205855501018 25.016221000404 25.0109199696254 25.0721250964983 25.251244149588 25.4303634951651 25.6094831329152 25.6500275119364 25.6500275119364 25.6500275119364 25.6500275119364 25.6500275119364 25.6500275119364 25.6500275119364 25.6569461696487 25.6693196849653 25.6826140503802 25.6966997925869 25.6848674777251 25.67211521941 25.6584445200892
25.0070573268182 25.0070573268182 25.0070573268182 25.0070573268182 25.0070573268182 24.9820426814744 24.9374771648433 24.8938502933301 24.8511605652172 24.8511992789808 24.852879236191 24.8545573935954 24.9230236646873 25.1038154257119 25.2846056793633 25.4653944253142 25.5373405746949 25.5783330264483 25.6183961536476 25.6425235656622 25.6043145817947 25.5670304166586 25.5306695682674 25.5175250778315 25.5191798365427 25.5208327952612 25.522483953974 25.5241333126682 25.5257808713302 25.5274266299466
25.0070573268182 25.0070573268182 25.0070573268182 25.0070573268182 25.0070573268182 24.9543224584184 24.8612139598925 24.7690438623569 24.6778106644342 24.6769239342579 24.6786036235325 24.6802815132882 24.7504693680577 24.9312590125051 25.1120471498514 25.2928337797701 25.4019381125074 25.4914751491461 25.5800831027652 25.6322915489303 25.545537256594 25.4597075424752 25.3748009049271 25.3432460081274 25.344900502921 25.3465531980093 25.3482040933787 25.3498531890163 25.3515004849089 25.3531459810434
25.0070573268182 25.0070573268182 25.0070573268182 25.0070573268182 25.0070573268182 24.925662045587 24.7840115550335 24.6432992213609 24.5035235435321 24.5026485529181 24.5043279742625 24.5060055963748 24.577914742054 24.7587022702433 24.9394882916047 25.1202728058109 25.2674648042518 25.405545435734 25.5426972257134 25.6211333484451 25.4858347377354 25.3514604647462 25.2180090281718 25.16896690188 25.1706211327615 25.1722735642245 25.1739241962558 25.1755730288423 25.1772200619708 25.1788652956282
24.9561499890076 24.9601917221647 24.9750414545631 24.988946975729 25.0019097865807 24.9098098050063 24.7417820981825 24.5728158893087 24.4029126797104 24.3998011484332 24.398121995014 24.3964446405399 24.4632900668534 24.6328344897439 24.8033123018733 24.9747220017942 25.1470620880356 25.3203310591046 25.4945274134842 25.5923985208975 25.4196742312745 25.2460234648721 25.0714477232721 25.0048778680291 25.002184200039 25.0004107133915 24.9996442626112 25.0012928321519 25.0029396025214 25.0045845737069
24.7818769586403 24.794832885289 24.8582234994464 24.9206701478196 24.9821743309866 24.9368820542158 24.8173980573628 24.6969758025622 24.5757572871357 24.5740766029916 24.5723977174919 24.5707206306502 24.6192355059653 24.7402353184839 24.8621682776586 24.9850328823817 25.1088276315223 25.233551023927 25.3592015584196 25.4277141950512 25.3035356766413 25.1784309222288 25.0524014330553 24.973677027902 24.9224384763486 24.8721198667358 24.8253642924498 24.8270125989497 24.8286591065657 24.8303038152844
24.6076038916236 24.630417772045 24.7423482786113 24.8533350648236 24.9633796309199 24.9648943644788 24.8939530878604 24.8220737973791 24.7500325100938 24.7483520941509 24.7466734765657 24.7449966573514 24.774247922307 24.8467041142992 24.9200932103818 24.9944137097872 25.0696641117251 25.1458429153818 25.2229486199207 25.2639558895914 25.1883221524365 25.111762420038 25.0342781932973 24.9415544165994 24.8417719711971 24.7429092283509 24.6510842857767 24.6527323292414 24.6543785741087 24.6560230203663
24.4333307879621 24.4669461419079 24.6274155517865 24.7869414867232 24.9455254466162 24.9938464962704 24.971446950404 24.9481096347415 24.9243077696535 24.9226276219067 24.9209492722305 24.9192727206382 24.9283275536151 24.9522411146722 24.9770873372719 25.0028647209869 25.0295717653666 25.0572069699375 25.0857688342029 25.101123368566 25.0740334229612 25.0460177228542 25.0170777688066 24.9085102690455 24.7601849192553 24.6127790326534 24.4768042425973 24.4784520230316 24.4800980051558 24.4817421889569
24.4691166357378 24.4989960650399 24.6481907937125 24.7983293435932 24.949410214494 25.0070573268182 25.0070573268182 25.0070573268182 25.0078249807817 25.0328379786725 25.0569161529993 25.0800610037835 25.0814746376099 25.05684655707 25.0331508955431 25.0103861529412 25.0070573268182 25.0070573268182 25.0070573268182 25.0070573268182 25.0070573268182 25.0070573268182 25.0070573268182 24.899391647019 24.7380439876514 24.5757765266138 24.4256501204832 24.4240026030741 24.4223568836877 24.4207129623375
24.6433898126724 24.6640616930914 24.7647158015972 24.8663134859051 24.968853246168 25.0070573268182 25.0070573268182 25.0070573268182 25.0100006937614 25.0835539070867 25.1561725401459 25.2278580926207 25.2336894119972 25.1605206789452 25.088284122394 25.0169782425956 25.0070573268182 25.0070573268182 25.0070573268182 25.0070573268182 25.0070573268182 25.0070573268182 25.0070573268182 24.9308792007317 24.8180761625087 24.7043535619759 24.5999302366604 24.5982829822707 24.5966375256172 24.5949938667127
24.8176630262349 24.8281839672559 24.8802984445598 24.9333562522784 24.9873558909047 25.0070573268182 25.0070573268182 25.0070573268182 25.0131125069789 25.1352049469673 25.2563630499701 25.3765883153289 25.3849721144665 25.2632637177342 25.1424872550077 25.0226412268801 25.0070573268182 25.0070573268182 25.0070573268182 25.0070573268182 25.0070573268182 25.0070573268182 25.0070573268182 24.963288164446 24.8990287580381 24.8338500286631 24.7742103893276 24.7725633979527 24.7709182040266 24.7692748075627
24.9919362764217 24.9913631280251 24.9949389628387 24.9994578826979 25.0049183884355 25.0070573268182 25.0070573268182 25.0070573268182 25.0171601817358 25.1877908598702 25.3574874442811 25.5262514339707 25.5353229826934 25.3650759108585 25.1957605305527 25.0273753427089 25.0070573268182 25.0070573268182 25.0070573268182 25.0070573268182 25.0070573268182 25.0070573268182 25.0070573268182 24.9966183032703 24.9809015396017 24.9642656922915 24.9484905784814 24.9468438501156 24.9451989189121 24.9435557848834
25.0070573268182 25.017974294722 25.0612447310183 25.103574124162 25.1449639729938 25.1577616313956 25.1560774347218 25.1543950346433 25.1622278490992 25.2995725214843 25.4378534281289 25.577069069756 25.5828370768077 25.44175646314 25.2997456124599 25.1568060241369 25.1065961219266 25.0689617771578 25.0322549742123 25.0070573268182 25.0070573268182 25.0070573268182 25.0070573268182 25.0070573268182 25.0070573268182 25.0070573268182 25.0070573268182 25.0070573268182 25.0070573268182 25.0070573268182
25.0070573268182 25.0309542332117 25.1227616055063 25.2136281796948 25.303555454278 25.3320363042417 25.3303523765927 25.3286702452523 25.3340366770819 25.4228416637839 25.5125826412031 25.603258110402 25.6051884514526 25.5126484955986 25.4191785449149 25.3247800984314 25.2369246499101 25.1507510584754 25.0655047674811 25.0070573268182 25.0070573268182 25.0070573268182 25.0070573268182 25.0070573268182 25.0070573268182 25.0070573268182 25.0070573268182 25.0070573268182 25.0070573268182 25.0070573268182
25.0070573268182 25.0448766003198 25.1852199206551 25.3246226879129 25.4630864002543 25.5063110136686 25.5046273550392 25.5029454924312 25.5049098083477 25.5451760977478 25.5863781343401 25.6285144195274 25.6284715691838 25.5844712826912 25.5395412435343 25.493682950403 25.3663257531258 25.2316139032232 25.0978291123956 25.0070573268182 25.0070573268182 25.0070573268182 25.0070573268182 25.0070573268182 25.0070573268182 25.0070573268182 25.0070573268182 25.0070573268182 25.0070573268182 25.0070573268182
25.0382166085381 25.0941614890511 25.2715590197296 25.4489586418168 25.6263603550137 25.6805857596721 25.6789023700568 25.677220776176 25.6748474815576 25.6665760617831 25.6592401456941 25.6528382350329 25.6500275119364 25.6500275119364 25.6500275119364 25.6500275119364 25.4888628582452 25.3122633307942 25.1347381994652 25.0135597911091 25.0105217595762 25.0084081373949 25.0072174260944 25.0070573268182 25.0070573268182 25.0070573268182 25.0070573268182 25.0070573268182 25.0070573268182 25.0070573268182
25.1780229236335 25.2701732414273 25.4475691973168 25.6249672443144 25.8023673821193 25.8548605422458 25.853177421639 25.8514960964803 25.8438499353551 25.7870417942809 25.7311689134027 25.6762297948032 25.6500275119364 25.6500275119364 25.6500275119364 25.6500275119364 25.5321728746003 25.4041135861542 25.2751289349012 25.1714805425419 25.1199039249963 25.0692514761906 25.0195216979943 25.0070573268182 25.0070573268182 25.0070573268182 25.0070573268182 25.0070573268182 25.0070573268182 25.0070573268182
25.3187722662069 25.4461847343623 25.6235791157721 25.8009755879887 25.978374150711 26.0291353613854 26.0274525097824 26.0257714533401 26.0119174083709 25.9065735336179 25.8021646755895 25.698689336708 25.6500275119364 25.6500275119364 25.6500275119364 25.6500275119364 25.5764102250809 25.4968901875676 25.4164450283017 25.3284772874747 25.2283630717158 25.1291727841036 25.0309049268464 25.0070573268182 25.0070573268182 25.0070573268182 25.0070573268182 25.0070573268182 25.0070573268182 25.0070573268182
25.460464395598 25.6221959678657 25.7995887751041 25.9769836728482 26.1543806607969 26.2034102170858 26.2017276344807 26.2000468467496 26.1790501392189 26.0251715181544 25.8722276703615 25.7202170986017 25.6500275119364 25.6500275119364 25.6500275119364 25.6500275119364 25.6215746730894 25.5905928986906 25.5586862435755 25.4845502617198 25.3358994352946 25.1881722964395 25.0413673477034 25.0070573268182 25.0070573268182 25.0070573268182 25.0070573268182 25.0070573268182 25.0070573268182 25.0070573268182
25.5276919003902 25.6987028412769 25.8529367668474 26.0081109076336 26.1642237662314 26.2083102847681 26.2099925983805 26.2116731174053 26.1919955837182 26.0362423873733 25.8795540742492 25.7219321418714 25.6500275119364 25.6500275119364 25.6500275119364 25.6500275119364 25.6500275119364 25.6500275119364 25.6500275119364 25.5908698026954 25.4282270658777 25.2646620967888 25.1001763931814 25.0617376768434 25.0600876678443 25.0584394536722 25.0542357709348 25.0392807838703 25.0252426411118 25.0121198451017
25.5294306087445 25.6843415450696 25.7900399139621 25.8966782531057 26.0042550654363 26.0340353559633 26.035717400588 26.0373976509124 26.0232837043129 25.9160669678819 25.8079153581174 25.6988303722066 25.6500275119364 25.6500275119364 25.6500275119364 25.6500275119364 25.6500275119364 25.6500275119364 25.6500275119364 25.6075149787931 25.493410831171 25.3783846915605 25.262438057374 25.236017403527 25.2343676583511 25.2327197077151 25.2189662201366 25.1554736019673 25.0928975893542 25.0312366850788
25.5311690208145 25.6690386150451 25.7262024143867 25.7843059390332 25.8433476922599 25.859760390613 25.8614421662556 25.8631221478849 25.8555064388699 25.7968251751159 25.7372092814576 25.6766602547417 25.6500275119364 25.6500275119364 25.6500275119364 25.6500275119364 25.6500275119364 25.6500275119364 25.6500275119364 25.6250838353363 25.5595172894895 25.4930289919193 25.4256204396983 25.4102971666609 25.408647685303 25.4069999981979 25.3827802986248 25.270751036564 25.1596381413267 25.0494401160339
25.5329071366143 25.6527942915722 25.6614245082374 25.6709942052791 25.6815018863119 25.6854853887231 25.6871668953889 25.6888466083283 25.6886635488086 25.6785167707485 25.6674356061949 25.6554215516553 25.6500275119364 25.6500275119364 25.6500275119364 25.6500275119364 25.6500275119364 25.6500275119364 25.6500275119364 25.6435761365394 25.6265462053009 25.608594762586 25.5897233051281 25.5845769662392 25.5829277486939 25.5812803251147 25.5456782403819 25.3851133213901 25.2254645305056 25.0667303711905
25.5346449561583 25.6500275119364 25.6500275119364 25.6500275119364 25.6500275119364 25.6500275119364 25.6500275119364 25.6500275119364 25.6500275119364 25.6500275119364 25.6500275119364 25.6500275119364 25.6500275119364 25.6500275119364 25.6500275119364 25.6500275119364 25.6500275119364 25.6500275119364 25.6500275119364 25.6500275119364 25.6500275119364 25.6500275119364 25.6500275119364 25.6500275119364 25.6500275119364 25.6500275119364 25.6102065371777 25.4311258887297 25.2520449525206 25.0729637288635
25.5363824794614 25.6500275119364 25.6500275119364 25.6500275119364 25.6500275119364 25.6500275119364 25.6500275119364 25.6500275119364 25.6500275119364 25.6500275119364 25.6500275119364 25.6500275119364 25.6500275119364 25.6500275119364 25.6500275119364 25.6500275119364 25.6500275119364 25.6500275119364 25.6500275119364 25.6500275119364 25.6500275119364 25.6500275119364 25.6500275119364 25.6500275119364 25.6500275119364 25.6500275119364 25.6085169213961 25.4294381157366 25.25035902233 25.0712796414895
25.5381197065375 25.6500275119364 25.6500275119364 25.6500275119364 25.6500275119364 25.6500275119364 25.6500275119364 25.6500275119364 25.6500275119364 25.6500275119364 25.6500275119364 25.6500275119364 25.6500275119364 25.6500275119364 25.6500275119364 25.6500275119364 25.6500275119364 25.6500275119364 25.6500275119364 25.6500275119364 25.6500275119364 25.6500275119364 25.6500275119364 25.6500275119364 25.6500275119364 25.6500275119364 25.6068275936763 25.4277506304914 25.2486733795731 25.0695958412349
25.5398566374015 25.6527504982836 25.6591769226661 25.6646645506378 25.6692148775392 25.6645702470333 25.6585291745342 25.6534245021028 25.6500275119364 25.6500275119364 25.6500275119364 25.6500275119364 25.6500275119364 25.6500275119364 25.6500275119364 25.6500275119364 25.6500275119364 25.6500275119364 25.6500275119364 25.6500275119364 25.6500275119364 25.6500275119364 25.6500275119364 25.6500275119364 25.6500275119364 25.6500275119364 25.6051385540043 25.4260634329798 25.2469880242359 25.0679123280859
25.5415932720678 25.671963390818 25.7269203087925 25.7809386752096 25.8340199850706 25.7997842813889 25.7452122758217 25.6915764262536 25.6500275119364 25.6500275119364 25.6500275119364 25.6500275119364 25.6500275119364 25.6500275119364 25.6500275119364 25.6500275119364 25.6500275119364 25.6500275119364 25.6500275119364 25.6500275119364 25.6500275119364 25.6500275119364 25.6500275119364 25.6114152582842 25.5668737024579 25.5232485580392 25.4683066805634 25.3777545799718 25.2853729638388 25.1911648234272
