1.880460023874308160e-03 2.757230170587610715e-03 2.442794744114635229e-03 3.135119777480939885e-03 2.419072456530469220e-03 5.365027265703823170e-03 5.365432933334439089e-03 1.464239224863156733e-02 2.678412194751372127e-02 1.210765697590474900e-02 5.626954796630139442e-03 1.286613831648353735e-03 7.549688743381107684e-04 2.806003647710930953e-03 3.246468598334387428e-03 7.074660421491647116e-04 2.512522254937615829e-03 4.468636672788240706e-03 4.110215615504865354e-03 1.460470146312557727e-03 1.321178006152915960e-03 2.183995145425741621e-02 1.699146962897283772e-02 7.282841089492740226e-04 1.176256384408562797e-03 9.835516277409764307e-04 4.756009114959690309e-02 4.383802724791735321e-03 4.265005768346170206e-03 5.459510063483259332e-03
1.503548542104101359e-03 3.306833584847440784e-03 5.986397862507892437e-03 4.933852754313807452e-03 3.463787600106997804e-03 1.564536544147589192e-02 7.512428293288036033e-03 9.600232507813657654e-03 6.339722733952144612e-03 5.408479351721652562e-03 3.799275745537414751e-03 7.379313868594648655e-04 9.768407059562828846e-04 2.234008699797248362e-03 3.119214979437691469e-03 1.993445914355783735e-03 2.502601737748762385e-03 8.390921686193703391e-03 6.495949064403095698e-03 1.989498417110385862e-03 8.153691032839874070e-04 2.122676960349602349e-02 4.530002814151243284e-02 3.921102839166464710e-02 3.397242560103903852e-02 4.636224219977312655e-02 1.683854651473423725e-02 4.491332302009394713e-03 6.487713443358776762e-03 6.573279577179380259e-03
1.840009241408787841e-02 1.849181521440769471e-02 3.910528300990847445e-02 3.183536090975172539e-02 6.756049718672779703e-02 6.933657470062176004e-03 1.306927309281697954e-03 1.425505662042741246e-03 2.330904491102759463e-02 7.068680851633169296e-03 1.875477878222758799e-02 1.229980713776750861e-02 4.489616862220931898e-03 6.603373034570018778e-03 1.270880855529484335e-03 5.346039938015616916e-03 3.668694931502471633e-03 7.758105367174539420e-03 2.676098781804020499e-02 4.574119102481180414e-03 5.328194967906299236e-04 1.799509137634578565e-02 2.868131504836534881e-02 1.000263204314901129e-02 5.951059095250801033e-03 3.937844118899706293e-03 3.528736979219981775e-03 2.803866380813590641e-03 4.828324623783479021e-03 5.461902758734302199e-03
8.631144714312314475e-03 2.446105853493850055e-02 5.368813216375933201e-02 4.337417117759008456e-02 1.768059441018599368e-02 2.752802608745170531e-03 2.208830260562396047e-03 1.564398349421295981e-03 9.741756241016337383e-04 9.093063686154763403e-03 5.634429996598953362e-03 1.105738863103076716e-02 4.974931518016542133e-03 3.314814223815976298e-03 1.081779789879924649e-03 8.347458389808606058e-04 1.788234607508414542e-03 3.009564033753618986e-03 2.187198405143144734e-03 1.904342665832708037e-03 9.773668074843466606e-04 3.676652143736724304e-02 1.264628880480395470e-02 2.509155343747904165e-02 4.880354741074912316e-03 3.527894566891388167e-03 3.035872773546481867e-03 2.898877817114142198e-03 5.925208872037327282e-03 6.479060805197238773e-03
5.015100065679185815e-03 1.541732642897610667e-02 4.303042228935347741e-02 1.667408788044300039e-02 9.455372278676529851e-03 1.389394328777967050e-03 2.162665773867956075e-03 1.272114579404508500e-03 2.437039781228120608e-02 2.089045459508460240e-02 2.546094489169053662e-02 2.140506647323862574e-02 3.688469391477039363e-03 3.743506510542300453e-03 2.129856194246670248e-03 2.980623576494107960e-02 6.363910074707685750e-03 2.767830095920636221e-03 4.516924103139628201e-03 2.627957755210443870e-03 1.949143976882032701e-03 5.562422829168682959e-04 1.570490325367699487e-03 3.962681724068949779e-02 8.790249641692834265e-03 4.730629414805161657e-03 3.297994040007010564e-03 3.832416386121527060e-03 6.026528144831591778e-03 2.227713777545285018e-02
5.902392046097302419e-03 6.015546209170132691e-03 2.342094843186396519e-02 1.875908694741262525e-02 7.395294214837598405e-03 8.014717830628532731e-04 9.944019973369658434e-04 1.121938712357673992e-03 1.070361949652971637e-03 3.247285795631625616e-02 2.480513984841630631e-02 1.483639385932475872e-02 2.433446717236144308e-03 2.375531042447212235e-02 2.012725364309707332e-02 3.436577943874946639e-02 3.916581713247704530e-03 7.037704859186598482e-04 2.298045827718493000e-03 7.998991315545557132e-03 9.697707102562796652e-03 6.173790559231017577e-03 2.072991588677890878e-03 2.341615889005990020e-02 1.310391185110411708e-02 1.239662551539930969e-02 7.767717709393330908e-03 5.377120959641744531e-03 7.127805447429151967e-03 1.287223567895562359e-02
3.505451522674894044e-02 1.292524227753311192e-03 1.172232250148549275e-03 5.944091174980147864e-03 2.848471257170246459e-03 4.779218375020012448e-03 7.368561331474118153e-03 4.264016686080664316e-03 5.153655106576337207e-03 6.032515060528427335e-03 4.664963272016348084e-03 2.405812998130207186e-03 3.635776588565715894e-02 1.741485930651361091e-02 1.027919909281841022e-02 1.763824312775133865e-02 2.285530709018172325e-03 7.273075367297789562e-04 3.730673602266748080e-03 5.131694548424727519e-03 3.075430212668629759e-03 9.278335785940075358e-04 2.294284169760978792e-02 2.190872604159386713e-02 8.918675419040995520e-03 9.216022232850352644e-03 8.133242568167640268e-03 7.038841516879351494e-03 8.084114337654574323e-03 1.929591488412624525e-02
1.780439857557898587e-03 3.247125291246332184e-03 1.632822162013357293e-03 3.532642611818059223e-03 5.453286649535865095e-03 6.196509363765184859e-03 5.555116539692428468e-03 5.295193094143653065e-03 4.263263169190460895e-03 2.398693667424004437e-03 9.685267390474107700e-04 3.883055104832520109e-03 3.098946432822710303e-02 1.151222605861855659e-02 1.316633757111189580e-02 2.414911157342026007e-02 4.310963780227841657e-03 5.108064974153655145e-03 4.502354642283895418e-03 3.467915663718020014e-03 1.533728019405533431e-03 4.011713569811017899e-02 1.665324672803514608e-02 1.422700931716952381e-02 6.803257181828523646e-03 7.033476490880537051e-03 1.049385586625780319e-02 1.214387035476651930e-02 1.184660629496521109e-02 3.537908604195430518e-02
4.059668367038842679e-03 2.675820271485497039e-03 1.573045426806814412e-03 9.181869956102879649e-03 5.984608764271057667e-03 2.555635006350058611e-03 8.259422582116791173e-03 3.723985803021731111e-03 3.160975889371882026e-03 3.135125897289670407e-03 2.809981019866160390e-03 4.072957414323129070e-03 9.427245154562413978e-03 7.489933452750219961e-03 4.252764269398896790e-02 3.609592358214088609e-02 3.757589837724812677e-03 9.623734783731295248e-03 9.493549824306885335e-03 1.928843526823769035e-03 1.792387042269512690e-02 1.902050023631784298e-02 2.124314499028153586e-02 1.403754892725241760e-02 8.226081969578804068e-03 1.146216067412292317e-02 3.980980037280393985e-02 9.206503035525613046e-04 2.774491640542831473e-03 1.405448362760701366e-03
6.775785285821099742e-03 4.462278584917159056e-03 7.154847695506441271e-03 6.776797215405956296e-03 6.547853529606788292e-03 1.537187123593735045e-03 8.320312639861457069e-03 3.497582267873792540e-03 1.293103118584897852e-03 1.809776675720250333e-02 5.409324285996948423e-03 5.209641392085057228e-03 1.112341042932203129e-02 1.339907518734687226e-02 6.800030286912817599e-03 7.478751735093964494e-03 3.685157178573394976e-02 3.645427731911320135e-02 1.567508572648924903e-02 9.215151518024640095e-03 2.323140231132204275e-02 1.496241598068447261e-02 1.740619912513766826e-02 1.926385612507677467e-02 1.074073218686247624e-02 1.285015088757763060e-02 2.006967047091916864e-03 2.714697319020931490e-03 3.045153757176575007e-03 7.877807126007487773e-04
6.208512354950661977e-03 3.263778141033992809e-03 7.350997566140813656e-03 5.814062105358933433e-03 8.156977004848563542e-03 3.038653832052064588e-02 2.934641883340135052e-02 2.684877634502796234e-02 1.826665937920717367e-02 3.262519709154020845e-03 4.324493398936152255e-02 7.153398321989035136e-02 1.494183204605638304e-01 7.479740886614141826e-02 1.395886461313491575e-02 2.775923153582116401e-02 5.188678135201595099e-02 1.432880440570106009e-02 3.648175356094136412e-03 3.725085351539424161e-02 1.590471219951441681e-02 1.454107182875589120e-02 1.902630614749622334e-02 2.679091781164217451e-02 2.866684248656745093e-02 1.505323892030318612e-02 2.244322033446684295e-02 1.707035346717940966e-02 1.579009071415232376e-02 1.173141742513739150e-02
1.859258499108527212e-03 2.614892949952171350e-02 7.395475043439941193e-03 5.466571897672686982e-03 5.497511281093690055e-03 2.018441127830704947e-03 2.286793179077170959e-02 1.604207749815296513e-02 1.913485285797760643e-02 6.930946639303491551e-03 1.298827533421721345e-02 8.630635756875001952e-02 1.562557928950546737e-01 8.135859644444913552e-02 2.939235032453486537e-02 3.326485412478303455e-02 3.692091325849709837e-02 2.182701668892742322e-02 5.798508604134545302e-03 2.115917078111555129e-03 1.519799354299622950e-02 1.581863886162137786e-02 1.894322297009951722e-02 3.414405712383258851e-02 3.261351990499806314e-02 2.329958633116152242e-02 1.795384550215869957e-02 1.652002991621346131e-02 1.833072359627850242e-02 2.012261440892236172e-02
1.141527752189952158e-02 2.622791624716860545e-02 2.929083293161366570e-03 4.658670317963792620e-03 3.561573830102511638e-03 3.827755054157131603e-02 2.208538053424441774e-02 2.018622503504630822e-02 2.599487716560340556e-02 3.629213298600767433e-03 9.279262878759069562e-04 2.763848374654155615e-02 1.171685782759496058e-01 5.000376262491956769e-02 1.562331984229284494e-02 1.796078981202458777e-02 6.683913508108438664e-03 9.891523887373996488e-03 1.134508577841288404e-02 4.880919719396201520e-03 1.437110553765150525e-02 1.596566152098434499e-02 2.033357825502483951e-02 3.446832723237210766e-02 4.431894082305211369e-02 3.947958893371372735e-02 2.937554564699730933e-02 2.806467735553628759e-02 2.506015994671774438e-02 2.110969861652357837e-02
9.909552313228481638e-03 2.663380060451522174e-02 2.556870698274375537e-03 2.815110802984550561e-02 1.703925629894242552e-02 2.194011422082418113e-03 7.501063724756860951e-03 5.887043391152141716e-03 3.569638500457768260e-02 1.170306554080957628e-02 6.877558703628338516e-04 4.532132439046199918e-03 5.378127958601047753e-02 7.179292263085063075e-02 7.536026181824354020e-02 1.000634915274467712e-01 9.118944318896529677e-02 6.014528986184521087e-02 1.667779320848897240e-01 7.948668971921232784e-02 7.329230077637337477e-03 2.596349684780742059e-03 2.257436900350182248e-03 5.946183657140053161e-03 1.265632999247384011e-02 1.081216304162284543e-02 2.786163442274312493e-02 1.150711841926953770e-02 3.418988446333170311e-02 4.013224944445614034e-02
9.522449499828156833e-03 9.117418623366161171e-03 2.188191103900370693e-02 7.769309414556920326e-03 2.046704665988454373e-03 1.407871036678690416e-02 3.530750695039404103e-03 9.924071946747079626e-03 6.951092293200307644e-03 7.307152846123209609e-04 1.454520892223971082e-03 2.254534606540445699e-02 4.811057842961251330e-02 6.028050592797293966e-02 5.363046653193442870e-02 6.373660611775494589e-02 1.103815575307430796e-01 1.942874289215836825e-01 2.012429114116126572e-01 1.607949712391544550e-01 6.995554742455568561e-03 7.442658570243748488e-03 6.775435517495157628e-03 2.155620458292542910e-02 3.136505123405866624e-02 1.621695908307868861e-01 1.635788505397398340e-01 3.847714066185929649e-02 3.471335283428457485e-02 2.689467532942558040e-02
9.051188583086492226e-03 9.577927490498782184e-03 1.875916496729825370e-02 1.938158812867204692e-02 1.252675077209302115e-02 1.514020277129850267e-02 1.954129999887995080e-03 4.983763038198290446e-03 1.036854734660649403e-02 3.745742397156419119e-03 3.920136579150891587e-03 3.478860207882346605e-03 2.718101342023153053e-02 5.444613910081726876e-02 5.012752409705011070e-02 7.572210844615687164e-02 1.332625453724594344e-01 1.650598735091649838e-01 9.712579449653667429e-02 2.158747647772102721e-02 1.331278119252412261e-02 9.394542228592635269e-02 1.408225164057012035e-01 2.382700004072665911e-01 2.247028758962556216e-01 2.942426421564671712e-01 2.363807315320488878e-01 7.242031899095043024e-02 4.931714214028103810e-02 2.913589706282110336e-02
1.193358301514362702e-02 1.356213847244718343e-02 1.267340341137530163e-02 1.141765403761236218e-02 1.658887831569174146e-02 2.947474491940114960e-02 2.987743616650945233e-02 9.756364041715379076e-02 4.804527584262347634e-02 8.287903551186187948e-03 6.201188793045549208e-03 9.755924471065421932e-03 1.932672317241710541e-02 2.826761592562574213e-02 3.698193063381743223e-02 6.558041144383018606e-02 1.439247632571045987e-01 1.476962996874109924e-01 7.121391723023685894e-02 2.499191297750007548e-02 1.113691355781265130e-01 2.086864384762120439e-01 2.764090306200345237e-01 2.847715168184329904e-01 2.495184874969638977e-01 2.148968762038134805e-01 3.166380880209750948e-01 5.680322237813805603e-02 2.964333165166159814e-03 3.422382305399344210e-02
3.048567576145501043e-02 2.382334790824483170e-02 1.139970403488249628e-02 1.580065902875844169e-02 3.604883064304661988e-03 1.489163004566628097e-02 8.025280072564107414e-02 6.553579562390227098e-02 6.509075764815296095e-02 3.270320679007740483e-02 1.202113277439943555e-02 3.251040109328171696e-03 3.180465477820516168e-03 8.124812979615973763e-03 1.820631314558027181e-02 8.293507090567878159e-02 8.878871540158435327e-02 1.054061548646435809e-01 1.869180592903113211e-02 3.378936687808701406e-02 1.243117385573211248e-01 2.786183320224957516e-01 3.555709178195788911e-01 3.678861351819203707e-01 2.995878514015721250e-01 2.857443766508478977e-01 2.631055824128598619e-01 2.066600759048121683e-01 1.062900449595200088e-02 7.206814463159212127e-03
1.238786808583012405e-02 3.394093944936547175e-02 1.745320530520159128e-03 6.040075585301942114e-03 1.201163547554459296e-02 1.628083638354760679e-02 5.127155478383389753e-02 6.396487898282518514e-02 4.374835325394989954e-02 3.420673331115786642e-02 7.201049070810182536e-03 7.096759877719090778e-04 1.085814888605992224e-03 3.081015187780591306e-03 6.732614239660435207e-03 3.976152506517244278e-02 1.540240259748080695e-02 4.992072376932522697e-03 1.698375174289228464e-03 1.252772945825729629e-02 4.860275773822139017e-02 2.636686664065813201e-01 3.396988995717191706e-01 3.570584144664452619e-01 2.607719810498867474e-01 1.210184193800384056e-01 1.964723327943976028e-01 1.335090324146016028e-01 1.198157257897037448e-02 4.663997718255919606e-03
4.882304080083417833e-03 6.245253021668367710e-03 3.889352749782119638e-03 4.081686903938046979e-03 9.494669302118506279e-03 5.371540650047367665e-03 2.715155798486825964e-02 3.444759347109670883e-02 3.120207990018326535e-02 7.404742801185983624e-03 1.874098805084425815e-03 4.809888043218735459e-04 8.913356791654625201e-04 2.591641593613488656e-03 8.935929152732266512e-03 5.859416134000074161e-03 1.082425326291824516e-02 3.234454622632651054e-03 6.145661545235480208e-03 2.941139183522723313e-02 1.588346852954075628e-01 3.008898487430802793e-01 3.232333112280839083e-01 3.105543155481023665e-01 2.419398169793184616e-01 1.797422683402311594e-01 1.760833125096694374e-01 1.176146553561128599e-01 1.053950041033023879e-02 3.708106452068104814e-03
1.136859643916300622e-02 1.032514045400288218e-02 5.272179204608398902e-03 3.762896060353950519e-03 4.832234056786935752e-03 2.523521116759123127e-03 1.386129173590452263e-02 1.195023073672087273e-02 3.264085971846461716e-03 1.915813147563205079e-03 7.944447709824405948e-04 8.583412471278428074e-04 3.415665052354041609e-02 1.654496062284781591e-02 5.070690640612680834e-04 1.710913818460761075e-03 6.182502280783501794e-03 1.420820581519893766e-02 1.377797249813032116e-02 6.151922380306766580e-02 1.654093607060501681e-01 2.353416473633376804e-01 9.404713789097945975e-02 1.440489774739893702e-01 1.917806528783755349e-01 1.117006108487600818e-01 8.508182658734524118e-02 7.145183111922219499e-02 3.429023893877501325e-03 3.255660521743814883e-03
9.274396813675324022e-03 1.055849509925517807e-02 1.550764193179054399e-03 1.068727839738661638e-03 8.724129490557101406e-04 1.261243399389797275e-03 1.782342384650081445e-03 4.492893278423932212e-04 6.034942570643541705e-04 1.148081462959816244e-02 1.642163470108706780e-02 2.608151874526256145e-02 2.459953422793219671e-02 1.271631222233133001e-03 2.434577406516621415e-03 3.188006414560465296e-02 6.181278193213474159e-02 9.013442345019274937e-02 6.200600530434247776e-02 4.637508950458466700e-02 3.195801996630102948e-02 1.109994376963912774e-02 4.185283303652384199e-03 9.307452869850466742e-03 3.499161670213210562e-02 1.223265707692052645e-02 1.150696432205934074e-02 5.364513674399961664e-03 1.578434344314225482e-02 1.485426114916134355e-02
1.917157020265444420e-02 1.457509943406988008e-02 1.638565077543550821e-03 7.528799581527728614e-04 1.128834849335763829e-03 8.045918103796646402e-04 1.210451568057835554e-03 1.709313715175750717e-02 1.580581393011381772e-02 6.942126523023831562e-03 1.747265769261160603e-02 3.175520630939714095e-02 3.254275018043896461e-02 2.424033841432695138e-03 2.793079980127129158e-03 1.851483867989691529e-02 6.879156723589226197e-02 1.298791119010948569e-01 1.487975171098414595e-01 1.286558467435807152e-01 2.671074080791961680e-02 5.822038050506591830e-03 7.087244398286693912e-03 1.784700376889130496e-02 4.079653193470523381e-02 1.234195597843429533e-02 4.770440372354368616e-03 2.690378769834927790e-03 2.183874094187840745e-02 2.122359031769473561e-02
2.341124323789686712e-02 2.946416005716198227e-03 8.555938551705966413e-04 3.124345082832008166e-02 4.041122828259847283e-02 7.127482656874472222e-04 9.805008952366853821e-04 1.403362104822993874e-02 7.938347792574160927e-03 9.104471117886163770e-03 1.670202226094820094e-02 2.827873963357524847e-02 2.498930723926743105e-02 2.013771293810116131e-03 5.592239864103338946e-03 2.596828403433112248e-02 5.138103192813290448e-02 1.205021089660542888e-01 1.542889419735748446e-01 1.312263113237805978e-01 6.454990184361188155e-02 4.129032996975402769e-03 2.890820879420859160e-03 6.254558090660585282e-03 3.333012326605502840e-02 2.046359810360836792e-02 1.858037661163829818e-02 5.103285995828429206e-03 1.739065224112778391e-02 1.589597426047003464e-02
1.263642358141923473e-02 3.873532615080636007e-03 1.612611204300979685e-03 1.633384511085235209e-03 3.760557353637472046e-03 2.531335632466386563e-03 1.137112314855972476e-03 5.508252571494882954e-02 6.510973118408386372e-04 8.321910540905076009e-04 9.890077818453616235e-03 1.178637893000742537e-02 1.500159421864326499e-02 2.846343216069754933e-02 2.327283860158177193e-03 7.824963471472486803e-03 8.118681906017685343e-03 3.555891590113177680e-02 4.670779955295669555e-02 4.081830733804136385e-02 3.423337314925072039e-02 5.994841932505843261e-03 2.826967617077319819e-02 1.731411425999706405e-03 5.989626185945795718e-03 1.518183189056513012e-02 4.097031887325025545e-02 2.695894083627366905e-02 1.928490652786017667e-02 1.700394855721889392e-02
4.502368628742279243e-03 1.770557634356593807e-03 1.929218364980410166e-03 3.332206308386710149e-03 1.854191029641131389e-03 9.022022944422665273e-04 5.460913655462375227e-02 3.903685966637751581e-02 9.575711079178639328e-04 3.305313173792165382e-03 3.052398078733977935e-02 1.122377510247056336e-02 1.658900151480216870e-02 2.988156671619936894e-02 1.907483223186948922e-03 2.772805930126720150e-03 2.553066832583543878e-03 1.611485469791748863e-03 2.897517051583889565e-03 5.091945399609906428e-03 9.518405313762311887e-03 3.060113242747607327e-03 2.976200975128594564e-02 5.892528366032898611e-03 8.494897398114556464e-03 3.041229024556822182e-03 1.055363571751262615e-02 1.280103005818983807e-02 1.000090642972209683e-02 2.467727815082181725e-02
4.562284278146058053e-03 3.629671331872254183e-03 1.805814329994572887e-03 1.352700333832351385e-03 1.280284741644818064e-03 5.260879938258089267e-04 4.536775119485295105e-02 4.682446909208663743e-02 5.073210568150290228e-02 1.638058545407435106e-03 6.278962582973670768e-04 8.044969853127453786e-04 4.153865436192476224e-02 7.643484709173249724e-04 1.691011142447452998e-03 1.072831562506123063e-03 1.004476594351334882e-03 3.383195213139808533e-02 3.112228436038726176e-02 2.470462156442008658e-02 1.949868892515151109e-02 2.721842394914461907e-02 3.682189499144630784e-02 4.456068275233339253e-03 4.342604269732214771e-03 2.928509118260329194e-03 6.092706830814587950e-03 3.698552625998355933e-03 5.279531988652663710e-03 4.439096216169825804e-02
6.196222047750198254e-03 3.202950248067109804e-03 1.857241076621656212e-03 2.589830603568625197e-03 2.317598053066066439e-03 1.269949864473252348e-03 4.342351993061188339e-03 3.346081737614215682e-03 5.705899242357839697e-04 5.036987813416752419e-02 1.795720386542750541e-02 3.835386525592161810e-02 1.516367945996262897e-03 1.369817731978781794e-03 3.739574305444956070e-03 3.361544848732230927e-03 1.502963426852767497e-03 3.179776041295732502e-03 3.542421000668148634e-02 1.653656274162428053e-02 1.585960923457907512e-02 2.381219270683094733e-02 3.290691445363804618e-02 6.832262313866552077e-03 4.768523884455906289e-03 2.125903344601944717e-02 2.561734500711288290e-02 3.064980354888441338e-02 1.151346161415879067e-02 1.893962542707822855e-02
8.353184402305645004e-03 7.168715600908572017e-03 2.217752504878341743e-03 7.730745012596143551e-03 9.153723268570218910e-03 1.693780213036671228e-02 1.100051108942979618e-02 1.203086865535751707e-03 5.219574707453483861e-04 4.021195135591263542e-02 1.220236890499977467e-02 1.402738632816763996e-02 1.468597125836849406e-02 8.296582556228308900e-04 1.247320280047238984e-03 2.430874871677935964e-02 2.103306417214883400e-02 2.352930190482919667e-02 3.323150155797159611e-02 2.028342995342880678e-02 1.430286516635376898e-02 2.097632750064817517e-02 2.229000245810831837e-02 3.293528931357357636e-02 1.092108537699301198e-02 1.654427146666808193e-02 2.510015462745631906e-02 3.867268642417169555e-02 4.170811479622295315e-02 7.578952901621303570e-03
4.627054305120109970e-03 1.139248751601067665e-02 3.460958145093847183e-03 3.763533169331605491e-03 1.852526588126744353e-02 1.945988061101937630e-02 1.277757746929178949e-02 8.648066797465332311e-04 6.731424160255098862e-04 8.380050932889372955e-04 3.736149314413669126e-02 1.860752028096090277e-02 1.045520295520710810e-02 1.506081052761445126e-02 1.438837466110863550e-03 1.835961441685670520e-02 1.585215735607550412e-03 8.881745261591651036e-03 1.751332453508778683e-02 4.739311382989210182e-03 2.013441674498155087e-02 2.800412372397903527e-02 2.360782629582761777e-02 2.335651019675183057e-02 3.016360353902464500e-02 2.354714708290631120e-02 2.848449379425386022e-02 3.380425765889408241e-02 3.992353935277147270e-02 8.445285618944796749e-03
