22.340521282394 22.421905745604 22.5192025790605 22.6174448008411 22.7166309083011 22.7642569092631 22.7642569092631 22.7642569092631 22.7642569092631 22.5970306233001 22.4179087490672 22.238786581375 22.1212867241449 22.1212867241449 22.1212867241449 22.1212867241449 22.1212867241449 22.1212867241449 22.1212867241449 22.1212867241449 22.1212867241449 22.1212867241449 22.1212867241449 22.1617882447027 22.2314437212182 22.3001781577232 22.3679930569889 22.4763457309607 22.586195812157 22.6969648117556
22.4729839626363 22.5911888927468 22.6399407533104 22.6896377566566 22.7402784004808 22.7642569092631 22.7642569092631 22.7642569092631 22.7642569092631 22.5953023426036 22.4161823187736 22.2370620014986 22.1212867241449 22.1212867241449 22.1212867241449 22.1212867241449 22.1212867241449 22.1212867241449 22.1212867241449 22.1212867241449 22.1212867241449 22.1212867241449 22.1212867241449 22.1908582710248 22.3090608735061 22.4263426754562 22.542705179306 22.6033407646271 22.6646414388927 22.7268607928533
22.6063922810185 22.7595271690605 22.7597350472874 22.760887822773 22.7629839935536 22.7642569092631 22.7642569092631 22.7642569092631 22.7642569092631 22.5935743556663 22.4144561819247 22.2353377147528 22.1212867241449 22.1212867241449 22.1212867241449 22.1212867241449 22.1212867241449 22.1212867241449 22.1212867241449 22.1212867241449 22.1212867241449 22.1212867241449 22.1212867241449 22.220850899671 22.3875996375122 22.5534278142838 22.7175846286126 22.7294169434745 22.7421692017895 22.7558399011104
22.4804017356771 22.5948944123448 22.5965887675177 22.5982813229926 22.5999720787562 22.626675680138 22.6729283530685 22.7182405811294 22.762613866024 22.5918466624738 22.4127303385063 22.2336137211232 22.136953848072 22.178329501256 22.2187734221369 22.2582871125672 22.2654228679045 22.2637555096171 22.2620899512294 22.2604261927547 22.2587642342059 22.2571040755968 22.2554457169404 22.3396792433203 22.4809714081287 22.6231862725841 22.7637458148675 22.7286803022115 22.6945326939646 22.6613014880064
22.3485909514608 22.4206212214388 22.4223153063802 22.4240075919105 22.4256980780165 22.4801216330836 22.5749170188255 22.668772204112 22.7616886903067 22.5901192630119 22.4110047885044 22.2318900205955 22.1559277638272 22.245847566507 22.3348358792046 22.4228942034321 22.4397000821498 22.4380329897891 22.436367697041 22.4347042039187 22.4330425104356 22.4313826166049 22.4297245224399 22.4855241961202 22.5782687706195 22.6719358050238 22.7622513211525 22.678639349684 22.5959450439172 22.5141669020724
22.2158346585243 22.2463479938727 22.2480418085881 22.2497338241793 22.2514240406329 22.3345077391665 22.4778448478575 22.6202420004896 22.7617006980862 22.5883921572663 22.4092795319043 22.230166613155 22.1758348667078 22.3142978289017 22.4518295434164 22.588431511424 22.6139773329751 22.6123105065358 22.6106454794219 22.6089822516469 22.607320823224 22.6056611941668 22.6040033644879 22.6304467094245 22.6746446840838 22.7197648789239 22.7598376477738 22.6276802077003 22.4964401946388 22.3661161071494
22.1721940619555 22.1681523287984 22.1533025964001 22.1393970752341 22.1264342643824 22.2185342459568 22.3865619527806 22.5555281616545 22.7254313712527 22.5608157248334 22.3924013246951 22.2230508300584 22.1932413124649 22.3723529681719 22.5514649163089 22.7305771565617 22.7642569092631 22.7642569092631 22.7642569092631 22.7642569092631 22.7642569092631 22.7642569092631 22.7642569092631 22.762077450474 22.7593837824839 22.7576102958364 22.7492686764817 22.5733877225031 22.3965872049555 22.2188686255549
22.3464670923228 22.3335111656741 22.2701205515167 22.2076739031435 22.1461697199766 22.1914619967473 22.3109459936004 22.4313682484009 22.5524462674915 22.4335133680645 22.3136431164275 22.1928370136087 22.1949622852279 22.3740720923749 22.5531821919379 22.7322925836024 22.7642569092631 22.7642569092631 22.7642569092631 22.7642569092631 22.7642569092631 22.7642569092631 22.7642569092631 22.7308766103469 22.6796380587936 22.6293194491807 22.5758498532128 22.448515822661 22.3202624675106 22.1910912891367
22.5207401593396 22.4979262789181 22.3859957723519 22.2750089861396 22.1649644200432 22.1634496864843 22.2343909631027 22.306270253584 22.3775370244563 22.3071470400951 22.2358199471626 22.1635572463468 22.1966829652608 22.3757909241625 22.5548991754656 22.7340077188557 22.7642569092631 22.7642569092631 22.7642569092631 22.7642569092631 22.7642569092631 22.7642569092631 22.7642569092631 22.6987539990443 22.5989715536421 22.5001088107958 22.4033500472298 22.3245619500342 22.2448547671925 22.1642299997397
22.695013263001 22.6613979090552 22.5009284991766 22.3414025642399 22.1828186043469 22.1344975546927 22.1568971005592 22.1802344162217 22.2035645612446 22.1817165024237 22.1589315786521 22.1352112902782 22.1984033525779 22.3775094635484 22.556615866906 22.7357225623367 22.7642569092631 22.7642569092631 22.7642569092631 22.7642569092631 22.7642569092631 22.7642569092631 22.7642569092631 22.6657098514905 22.5173845017002 22.3699786150983 22.2317690243654 22.2015258707085 22.1703638703407 22.1382845239569
22.6592274152253 22.6293479859232 22.4801532572506 22.3300147073699 22.1789338364692 22.1212867241449 22.1212867241449 22.1212867241449 22.1220543781084 22.1470673759993 22.171145550326 22.1942904011102 22.2745407579852 22.4290169407992 22.5844258349986 22.7407659401818 22.7642569092631 22.7642569092631 22.7642569092631 22.7642569092631 22.7642569092631 22.7642569092631 22.7642569092631 22.6565912294639 22.4952435700964 22.3329761090587 22.1828497029282 22.1812021855191 22.1795564661327 22.1779125447825
22.4849542382907 22.4642823578717 22.3636282493659 22.262030565058 22.1594908047951 22.1212867241449 22.1212867241449 22.1212867241449 22.1242300910882 22.1977833044135 22.2704019374727 22.3420874899475 22.4284753343013 22.5344090173003 22.6412751691584 22.7490722898139 22.7642569092631 22.7642569092631 22.7642569092631 22.7642569092631 22.7642569092631 22.7642569092631 22.7642569092631 22.6880787831767 22.5752757449536 22.4615531444209 22.3571298191054 22.3554825647156 22.3538371080621 22.3521934491577
22.3106810247282 22.3001600837072 22.2480456064033 22.1949877986847 22.1409881600584 22.1212867241449 22.1212867241449 22.1212867241449 22.1273419043056 22.249434344294 22.3705924472969 22.4908177126557 22.5814775460262 22.6388697183564 22.697194117037 22.756449242346 22.7642569092631 22.7642569092631 22.7642569092631 22.7642569092631 22.7642569092631 22.7642569092631 22.7642569092631 22.720487746891 22.6562283404831 22.5910496111081 22.5314099717725 22.5297629803977 22.5281177864716 22.5264743900077
22.1364077745414 22.136980922938 22.1334050881245 22.1288861682652 22.1234256625276 22.1212867241449 22.1212867241449 22.1212867241449 22.1313895790626 22.3020202571969 22.4717168416078 22.6404808312974 22.7335476308502 22.7423992814038 22.7521829158168 22.7628970347071 22.7642569092631 22.7642569092631 22.7642569092631 22.7642569092631 22.7642569092631 22.7642569092631 22.7642569092631 22.7538178857152 22.7381011220467 22.7214652747364 22.7056901609263 22.7040434325606 22.7023985013571 22.7007553673284
21.9621344877365 21.9856616029935 22.0738938585074 22.1602422311745 22.244709718663 22.2443368837399 22.2014532335685 22.1595082242381 22.1335865093729 22.3126822129966 22.4917782101928 22.6708745006475 22.7642569092631 22.7642569092631 22.7642569092631 22.7642569092631 22.7315187482362 22.6955488368528 22.6605046705499 22.6369678630422 22.6386269061594 22.6402841524942 22.641939602033 22.6674053102726 22.7018820564285 22.7354381614148 22.7642569092631 22.7642569092631 22.7642569092631 22.7642569092631
21.7878611643183 21.8373478860955 22.0226537434334 22.2060762083046 22.3876182776969 22.3857570780296 22.2943360517626 22.203853422076 22.1353125247355 22.3144063823707 22.4935005335643 22.672594978002 22.7642569092631 22.7642569092631 22.7642569092631 22.7642569092631 22.6875696598819 22.6030602359641 22.5194763160308 22.4626894499597 22.4643482280694 22.4660052096834 22.4676603947886 22.5282976233113 22.6113147709551 22.6934115170065 22.7642569092631 22.7642569092631 22.7642569092631 22.7642569092631
21.6135878042923 21.6909189898316 21.9732964730839 22.2537910542133 22.5324057295288 22.5262388688008 22.3862814544568 22.2472621924501 22.1370382462255 22.3161302581868 22.4952225636915 22.6743151624263 22.7642569092631 22.7642569092631 22.7642569092631 22.7642569092631 22.6426931102375 22.5096451619884 22.3775224766455 22.2884110003708 22.2900695134779 22.2917262303767 22.2933811510532 22.3901103703901 22.521666931211 22.6523033299995 22.7642569092631 22.7642569092631 22.7642569092631 22.7642569092631
21.51731867039 21.612325670379 21.9590211265823 22.3066595737179 22.6552395130379 22.6469327721051 22.4755636288904 22.3032577843539 22.1628901469924 22.3271154764154 22.4932103109639 22.6611716537945 22.7454446779348 22.7471154971248 22.7487845204862 22.7504517480055 22.5909525259785 22.4160166343232 22.240153342908 22.1212867241449 22.1212867241449 22.1212867241449 22.1212867241449 22.2532661100546 22.4329383026241 22.6121133660744 22.7642569092631 22.7642569092631 22.7642569092631 22.7642569092631
21.6915921036161 21.7760070171094 22.0741632357484 22.3732621999977 22.673302411447 22.6791405150486 22.5563097436472 22.4325425148744 22.3283445996367 22.3954943732661 22.4645131653149 22.5353979796202 22.5711680183247 22.5728385705144 22.5745073271623 22.5761742882552 22.4599848164437 22.3335888979406 22.2062658210356 22.1212867241449 22.1212867241449 22.1212867241449 22.1212867241449 22.2549635666569 22.4340562579533 22.6131492380523 22.7642569092631 22.7642569092631 22.7642569092631 22.7642569092631
21.8658655734349 21.9387458049789 22.1883637741891 22.4389242437047 22.6904257154548 22.7122865694335 22.637993181954 22.5627635810338 22.491928760338 22.4620049537352 22.4339496788815 22.407759940294 22.3968913221857 22.3985616073802 22.40023009732 22.4018967919918 22.3299444045266 22.2520874711089 22.1733036206304 22.1212867241449 22.1212867241449 22.1212867241449 22.1212867241449 22.2566607341424 22.4357515804938 22.6148427156335 22.7642569092631 22.7642569092631 22.7642569092631 22.7642569092631
22.0401390798411 22.1005422744139 22.3016229820766 22.5036459447579 22.7066096647266 22.7463706958618 22.7206137046646 22.6939207439403 22.6536431063437 22.5266476945635 22.4015203278983 22.2782580115441 22.2226145895235 22.2242846077281 22.2259528309651 22.2276192592211 22.2008310536352 22.1715121174899 22.141266505607 22.1212867241449 22.1212867241449 22.1212867241449 22.1212867241449 22.2583576125249 22.4374466142455 22.6165359047403 22.7642569092631 22.7642569092631 22.7642569092631 22.7642569092631
22.0104420975476 22.0865969294781 22.2673671465072 22.4481358646734 22.6289030836498 22.6795694969767 22.681251810589 22.6829323296139 22.6662742597621 22.5321737255649 22.3962050459083 22.2583712155435 22.1942356279464 22.1925658767262 22.1908979201869 22.1892317583418 22.1875673912042 22.1859048187877 22.1842440411054 22.1825850581704 22.1809278699963 22.1792724765959 22.1776188779827 22.3029332981828 22.4659559594802 22.6298984515558 22.7616996458581 22.7483892832724 22.7359939701269 22.7245122088499
21.8037332111707 21.9140599441721 22.0948280473775 22.2755946519925 22.45635975769 22.5052945681718 22.5069766127966 22.5086568631209 22.5048501944154 22.4678210043829 22.4289241554823 22.3881626417864 22.368512433639 22.3668429493978 22.3651752595507 22.3635093641112 22.3618452630921 22.3601829565072 22.3585224443694 22.3568637266923 22.3552068034887 22.3535516747723 22.3518983405564 22.4406917783336 22.5551754189909 22.670578650929 22.7521495777675 22.6903013211149 22.629367875439 22.5693477435086
21.5979666128641 21.7415226263288 21.9222886160299 22.1030531074132 22.2838161001516 22.3310196028215 22.3327013784641 22.3343813600934 22.3452950997506 22.4053352797184 22.4635082873748 22.5198171161127 22.5427892758395 22.5411200585723 22.5394526354125 22.5377870063728 22.5361231714669 22.5344611307082 22.5328008841099 22.5311424316851 22.5294857734473 22.5278309094096 22.5261778395853 22.5775306007263 22.6434762082232 22.7103411675213 22.7416831025289 22.6312979390277 22.5218273480574 22.4132698327264
21.393142062026 21.5689849759686 21.7497488524847 21.9305112309558 22.1112721110543 22.1567446009317 22.1584261075974 22.1601058205368 22.1876084986153 22.3447160749254 22.4999569654449 22.6533341628879 22.7170661545425 22.715397204244 22.7137300477656 22.7120646851209 22.7104011163231 22.7087393413854 22.7070793603212 22.7054211731436 22.7037647798661 22.7021101805018 22.7004573750639 22.7134500001221 22.7308585616854 22.7491862355881 22.7303004541306 22.5713793707464 22.4133726214641 22.2562787097324
21.3629339832486 21.5420070396537 21.7210803919858 21.9001540399311 22.0792279831756 22.1212867241449 22.1212867241449 22.1212867241449 22.1525565177459 22.3316319327756 22.5107076412197 22.6897836427652 22.7642569092631 22.7642569092631 22.7642569092631 22.7642569092631 22.7642569092631 22.7642569092631 22.7642569092631 22.7642569092631 22.7642569092631 22.7642569092631 22.7642569092631 22.7642569092631 22.7642569092631 22.7642569092631 22.7244359345044 22.5453552860565 22.3662743498473 22.1871931261903
21.3646715065517 21.5437427205388 21.7228142304385 21.9018860359368 22.08095813672 22.1212867241449 22.1212867241449 22.1212867241449 22.1542793013011 22.3333528737975 22.5124267396945 22.691500898678 22.7642569092631 22.7642569092631 22.7642569092631 22.7642569092631 22.7642569092631 22.7642569092631 22.7642569092631 22.7642569092631 22.7642569092631 22.7642569092631 22.7642569092631 22.7642569092631 22.7642569092631 22.7642569092631 22.7227463187228 22.5436675130634 22.3645884196568 22.1855090388162
21.3664087336278 21.5454781055109 21.7245477732922 21.9036177366577 22.0826879952932 22.1212867241449 22.1212867241449 22.1212867241449 22.1560017911416 22.3350735214189 22.5141455450827 22.6932178618184 22.7642569092631 22.7642569092631 22.7642569092631 22.7642569092631 22.7642569092631 22.7642569092631 22.7642569092631 22.7642569092631 22.7642569092631 22.7642569092631 22.7642569092631 22.7642569092631 22.7642569092631 22.7642569092631 22.7210569910031 22.5419800278181 22.3629027768999 22.1838252385617
21.3681456644918 21.5472131945849 21.7262810205617 21.9053491421082 22.0844175589107 22.1212867241449 22.1212867241449 22.1212867241449 22.1569512096781 22.3327847395124 22.5095504764976 22.6872469248443 22.7584957404825 22.7613491818044 22.7632731060425 22.7642569092631 22.7642569092631 22.7642569092631 22.7642569092631 22.7642569092631 22.7642569092631 22.7642569092631 22.7642569092631 22.7642569092631 22.7642569092631 22.7642569092631 22.719367951331 22.5402928303066 22.3612174215626 22.1821417254127
21.3698822991581 21.5489479877749 21.7280139722611 21.9070802523027 22.0861468275858 22.1212867241449 22.1212867241449 22.1212867241449 22.1482936154176 22.2755936394052 22.4038256274801 22.5329880841923 22.6144492288829 22.6658347707365 22.7162910377713 22.7642569092631 22.7642569092631 22.7642569092631 22.7642569092631 22.7642569092631 22.7642569092631 22.7642569092631 22.7642569092631 22.7642569092631 22.7642569092631 22.7642569092631 22.7291278865369 22.5934939361888 22.4569459805027 22.3194855152736
