25.7370931028173 25.7259874106872 25.6269954113307 25.5270598242093 25.426182151981 25.3768663868368 25.3751784232541 25.3734922602848 25.3718078979418 25.3701253362392 25.3684445751901 25.3667656148079 25.4007415778737 25.5033289565942 25.6068505953937 25.7113049914135 25.7370931028173 25.7370931028173 25.7370931028173 25.7370931028173 25.7370931028173 25.7370931028173 25.7370931028173 25.7370931028173 25.7370931028173 25.7370931028173 25.7370931028173 25.7370931028173 25.7370931028173 25.7370931028173
25.7370931028173 25.73097734444 25.680530588224 25.6291404894978 25.5768085505789 25.5511405470012 25.5494528525184 25.5477669583614 25.5460828645445 25.5444005710804 25.5427200779828 25.5410413852652 25.5588446880361 25.6128852128855 25.6678597551527 25.7237668123191 25.7370931028173 25.7370931028173 25.7370931028173 25.7370931028173 25.7370931028173 25.7370931028173 25.7370931028173 25.7370931028173 25.7370931028173 25.7370931028173 25.7370931028173 25.7370931028173 25.7370931028173 25.7370931028173
25.7370931028173 25.7369121856972 25.7350096820604 25.7321640811498 25.728376884943 25.7254147438193 25.7237273184308 25.7220416930814 25.7203578677845 25.7186758425537 25.7169956174025 25.7153171923444 25.7160139343209 25.7215085960359 25.7279370325256 25.7352977416109 25.7370931028173 25.7370931028173 25.7370931028173 25.7370931028173 25.7370931028173 25.7370931028173 25.7370931028173 25.7370931028173 25.7370931028173 25.7370931028173 25.7370931028173 25.7370931028173 25.7370931028173 25.7370931028173
25.7370931028173 25.7370931028173 25.7370931028173 25.7370931028173 25.7370931028173 25.7370931028173 25.7370931028173 25.7370931028173 25.7370931028173 25.7370931028173 25.7370931028173 25.7370931028173 25.7370931028173 25.7370931028173 25.7370931028173 25.7370931028173 25.7370931028173 25.7370931028173 25.7370931028173 25.7370931028173 25.7370931028173 25.7370931028173 25.7370931028173 25.7147985595975 25.6786250799332 25.6433722109087 25.6100606392506 25.6467755106008 25.6825706775097 25.7174476420843
25.7370931028173 25.7370931028173 25.7370931028173 25.7370931028173 25.7370931028173 25.7370931028173 25.7370931028173 25.7370931028173 25.7370931028173 25.7370931028173 25.7370931028173 25.7370931028173 25.7370931028173 25.7370931028173 25.7370931028173 25.7370931028173 25.7370931028173 25.7370931028173 25.7370931028173 25.7370931028173 25.7370931028173 25.7370931028173 25.7370931028173 25.6846629369705 25.599943452739 25.5161443397069 25.4372752723702 25.5225363394764 25.6068779411357 25.690301579115
25.7370931028173 25.7370931028173 25.7370931028173 25.7370931028173 25.7370931028173 25.7370931028173 25.7370931028173 25.7370931028173 25.7370931028173 25.7370931028173 25.7370931028173 25.7370931028173 25.7370931028173 25.7370931028173 25.7370931028173 25.7370931028173 25.7370931028173 25.7370931028173 25.7370931028173 25.7370931028173 25.7370931028173 25.7370931028173 25.7370931028173 25.6536051276194 25.5203406289809 25.3879962621185 25.265409048626 25.3992153212861 25.5321023674761 25.6640716886229
25.7370931028173 25.7370931028173 25.7370931028173 25.7370931028173 25.7370931028173 25.7370931028173 25.7370931028173 25.7370931028173 25.7370931028173 25.7370931028173 25.7370931028173 25.7370931028173 25.7370931028173 25.7370931028173 25.7370931028173 25.7370931028173 25.7370931028173 25.7370931028173 25.7370931028173 25.7370931028173 25.7370931028173 25.7370931028173 25.7370931028173 25.6216253664996 25.4398168433611 25.2589282125928 25.0942850220665 25.2734631151266 25.4535571734131 25.6345656951848
25.7370931028173 25.7370931028173 25.7370931028173 25.7370931028173 25.7370931028173 25.7370931028173 25.7370931028173 25.7370931028173 25.7370931028173 25.7370931028173 25.7370931028173 25.7370931028173 25.7370931028173 25.7370931028173 25.7370931028173 25.7370931028173 25.7370931028173 25.7370931028173 25.7370931028173 25.7370931028173 25.7370931028173 25.7370931028173 25.7370931028173 25.5887238885518 25.3583723305661 25.1289404255632 24.9191439050127 25.0497745485644 25.1813209189468 25.3137815147581
25.7370931028173 25.7370931028173 25.7370931028173 25.7370931028173 25.7370931028173 25.7370931028173 25.7370931028173 25.7370931028173 25.7370931028173 25.7370931028173 25.7370931028173 25.7370931028173 25.7370931028173 25.7370931028173 25.7370931028173 25.7370931028173 25.7370931028173 25.7370931028173 25.7370931028173 25.7370931028173 25.7370931028173 25.7370931028173 25.7370931028173 25.5549009287007 25.2760073252683 24.998033135448 24.7430836976495 24.8251678817744 24.9081675543509 24.9920812143189
25.7370931028173 25.7370931028173 25.7370931028173 25.7370931028173 25.7370931028173 25.7370931028173 25.7370931028173 25.7370931028173 25.7370931028173 25.7370931028173 25.7370931028173 25.7370931028173 25.7370931028173 25.7370931028173 25.7370931028173 25.7370931028173 25.7370931028173 25.7370931028173 25.7370931028173 25.7370931028173 25.7370931028173 25.7370931028173 25.7370931028173 25.5201567218567 25.192722062124 24.8662065766496 24.566104634155 24.5996433486806 24.6340973132969 24.6694650272826
25.7370931028173 25.7370931028173 25.7370931028173 25.7370931028173 25.7370931028173 25.7370931028173 25.7370931028173 25.7370931028173 25.7378607567808 25.7628737546717 25.7869519289984 25.8100967797826 25.811510413609 25.7868823330691 25.7631866715422 25.7404219289404 25.7370931028173 25.7370931028173 25.7370931028173 25.7370931028173 25.7370931028173 25.7370931028173 25.7370931028173 25.509338329784 25.1688832082473 24.8275079961249 24.5140985164696 24.5291042819693 24.5431950357213 24.5563722781072
25.7370931028173 25.7370931028173 25.7370931028173 25.7370931028173 25.7370931028173 25.7370931028173 25.7370931028173 25.7370931028173 25.7400364697606 25.8135896830859 25.8862083161451 25.9578938686199 25.9637251879964 25.8905564549444 25.8183198983931 25.7470140185948 25.7370931028173 25.7370931028173 25.7370931028173 25.7370931028173 25.7370931028173 25.7370931028173 25.7370931028173 25.5391264026807 25.2472177497474 24.9543892456031 24.6929145897539 24.7564638459572 24.8190983287396 24.8808195381418
25.7370931028173 25.7370931028173 25.7370931028173 25.7370931028173 25.7370931028173 25.7370931028173 25.7370931028173 25.7370931028173 25.743148282978 25.8652407229664 25.9863988259693 26.1066240913281 26.1150078904657 25.9932994937334 25.8725230310068 25.7526770028792 25.7370931028173 25.7370931028173 25.7370931028173 25.7370931028173 25.7370931028173 25.7370931028173 25.7370931028173 25.5698361747949 25.3264730008212 25.0821902149938 24.8726488167255 24.9847405745657 25.0959177972929 25.206181984609
25.7370931028173 25.7370931028173 25.7370931028173 25.7370931028173 25.7370931028173 25.7370931028173 25.7370931028173 25.7370931028173 25.7471959577349 25.9178266358693 26.0875232202802 26.2562872099698 26.2653587586925 26.0951116868577 25.9257963065519 25.757411118708 25.7370931028173 25.7370931028173 25.7370931028173 25.7370931028173 25.7370931028173 25.7370931028173 25.7370931028173 25.6014674112204 25.4066487268168 25.2109106698984 25.0533009632691 25.2139342339314 25.3736532077729 25.5324593841533
25.5779408664089 25.6014679816658 25.6897002371797 25.7760486098469 25.8605160973354 25.8877974073947 25.8861132107209 25.8844308106425 25.8922636250983 26.0296082974834 26.1678892041281 26.3071048457551 26.3128728528068 26.1717922391391 26.029781388459 25.8868418001361 25.8038937368988 25.7302894807467 25.6585385114982 25.6098040565964 25.6114630997136 25.6131203460483 25.6147757955872 25.5133562225665 25.3687328945036 25.2231886364119 25.1115208875382 25.2589025069595 25.4072005576362 25.5564135399317
25.4036675429907 25.4531542647679 25.6384601221058 25.8218825869769 26.0034246563693 26.0620720802409 26.0603881525918 26.0587060212514 26.064072453081 26.152877439783 26.2426184172022 26.3332938864011 26.3352242274518 26.2426842715978 26.1492143209141 26.0548158744306 25.890273176528 25.7195901611755 25.5507599502479 25.4355256435139 25.4371844216236 25.4388414032376 25.4404965883428 25.3725502115676 25.2764691311943 25.1794673603839 25.1066994370339 25.2055380910114 25.3052929376726 25.4059624777216
25.2293941829647 25.306725368504 25.5891028517563 25.8695974328857 26.1482121082012 26.2363467896677 26.2346631310384 26.2329812684303 26.2349455843468 26.2752118737469 26.3164139103393 26.3585501955265 26.3585073451829 26.3145070586903 26.2695770195335 26.2237187264021 25.9747977300992 25.7070379319476 25.4411304557771 25.2612471939249 25.262905707032 25.2645624239309 25.2662173446074 25.232664923768 25.1851251024599 25.1366648302879 25.1009602292573 25.1512569064682 25.2024695378092 25.2545966243239
25.1331250490624 25.2252426192138 25.5621478978436 25.9009367712012 26.241606242403 26.3553593023881 26.3647628329161 26.3732281608603 26.3800632879355 26.3800632879355 26.3800632879355 26.3800632879355 26.3800632879355 26.3800632879355 26.3800632879355 26.3800632879355 26.0577339805531 25.704534925651 25.3494846629931 25.1077795918555 25.1030833122123 25.0993132378426 25.0964678702886 25.0946549107071 25.0947005737127 25.0947808117907 25.0943034982884 25.0960591871568 25.0987305916188 25.1023162130576
25.3073984822885 25.3748555115918 25.6146857348272 25.8563990624611 26.0999924982879 26.2150229315973 26.2729627199279 26.3299645498959 26.3800632879355 26.3800632879355 26.3800632879355 26.3800632879355 26.3800632879355 26.3800632879355 26.3800632879355 26.3800632879355 26.1443540132633 25.888235436371 25.6302661338651 25.4399788658755 25.3867442652116 25.3344356289224 25.2830514588906 25.2689344915401 25.2672836910402 25.2656346862281 25.2639874771167 25.2623420637192 25.2606984460491 25.2590566241191
25.4816719521073 25.5225838417177 25.665340985206 25.8099807427988 25.9565001189694 26.0756245409106 26.1820995994706 26.2876369438721 26.3800632879355 26.3800632879355 26.3800632879355 26.3800632879355 26.3800632879355 26.3800632879355 26.3800632879355 26.3800632879355 26.2328287142245 26.0737886391979 25.9128983206662 25.7712541698874 25.6694822359966 25.5686360256008 25.4687140409207 25.443214108844 25.4415635721832 25.4399148309228 25.4382678850763 25.436622734657 25.4349793796778 25.4333378201518
25.6559454585135 25.6684280904195 25.7141141293013 25.7616822920291 25.8111295837561 25.9371638909489 26.0921732324187 26.2462451039161 26.3800632879355 26.3800632879355 26.3800632879355 26.3800632879355 26.3800632879355 26.3800632879355 26.3800632879355 26.3800632879355 26.3231576102415 26.261194061444 26.1973807512137 26.1016057396978 25.9512974601224 25.8019146631778 25.6534558514266 25.6174937626133 25.6158434897859 25.6141950120722 25.6125483294856 25.6109034420389 25.6092603497454 25.6076190526185
25.7370931028173 25.7451625911483 25.7700093907803 25.7939162708674 25.8168847284996 25.9347440755485 26.0893652502384 26.2449242395617 26.3800632879355 26.3800632879355 26.3800632879355 26.3800632879355 26.3800632879355 26.3800632879355 26.3800632879355 26.3800632879355 26.3800632879355 26.3800632879355 26.3800632879355 26.3084371430484 26.1129078814246 25.9183002720381 25.7246128177646 25.6824127527921 25.6840627617913 25.6857109759633 25.6873573952956 25.6890020197745 25.6906448493875 25.6922858841206
25.7370931028173 25.7612607520356 25.8346412646572 25.9070821026836 25.9785847628655 26.0747889418112 26.180874119979 26.2878968686007 26.3800632879355 26.3800632879355 26.3800632879355 26.3800632879355 26.3800632879355 26.3800632879355 26.3800632879355 26.3800632879355 26.3800632879355 26.3800632879355 26.3800632879355 26.288384614773 26.0443204518459 25.8011777009018 25.5589548651557 25.5081330261085 25.5097827712845 25.5114307219204 25.5130768780033 25.51472123952 25.5163638064572 25.5180045788022
25.7370931028173 25.7783002507698 25.9002134895677 26.0211872987023 26.1412231745847 26.2138961959643 26.2714463647981 26.3299338599244 26.3800632879355 26.3800632879355 26.3800632879355 26.3800632879355 26.3800632879355 26.3800632879355 26.3800632879355 26.3800632879355 26.3800632879355 26.3800632879355 26.3800632879355 26.2674089866859 25.9748109092473 25.6831340035554 25.3923767731647 25.3338532629746 25.3355027443325 25.3371504314376 25.3387963242765 25.3404404228361 25.3420827271031 25.3437232370649
25.7370931028173 25.7962808469965 25.9667258254101 26.1362316190746 26.3047997240616 26.352066077353 26.3610822237879 26.371035452372 26.3800632879355 26.3800632879355 26.3800632879355 26.3800632879355 26.3800632879355 26.3800632879355 26.3800632879355 26.3800632879355 26.3800632879355 26.3800632879355 26.3800632879355 26.2455104945448 25.9043794891343 25.5641694152502 25.2248787767886 25.1595734633964 25.1612226809416 25.1628701045208 25.1645157341211 25.1661595697286 25.1678016113309 25.1694418589143
25.7370931028173 25.8007836034443 25.9798569557764 26.1589306037217 26.3380045469662 26.3800632879355 26.3800632879355 26.3800632879355 26.3800632879355 26.3800632879355 26.3800632879355 26.3800632879355 26.3800632879355 26.3800632879355 26.3800632879355 26.3800632879355 26.3800632879355 26.3800632879355 26.3800632879355 26.2615817781785 25.9664359204476 25.6694469403036 25.3706178311611 25.2625095217094 25.2002545269161 25.1398372779126 25.0941229176991 25.0941229176991 25.0941229176991 25.0941229176991
25.7370931028173 25.8025192843294 25.9815907942291 26.1606625997274 26.3397347005106 26.3800632879355 26.3800632879355 26.3800632879355 26.3800632879355 26.3800632879355 26.3800632879355 26.3800632879355 26.3800632879355 26.3800632879355 26.3800632879355 26.3800632879355 26.3800632879355 26.3800632879355 26.3800632879355 26.2988537148211 26.1007808245365 25.9008652922912 25.6991101108205 25.5306720369655 25.3713468976932 25.2138590253569 25.0941229176991 25.0941229176991 25.0941229176991 25.0941229176991
25.7370931028173 25.8042546693015 25.9833243370828 26.1623943004483 26.3414645590838 26.3800632879355 26.3800632879355 26.3800632879355 26.3800632879355 26.3800632879355 26.3800632879355 26.3800632879355 26.3800632879355 26.3800632879355 26.3800632879355 26.3800632879355 26.3800632879355 26.3800632879355 26.3800632879355 26.337971706774 26.2369698104922 26.1341257526677 26.0294425253561 25.7969971146197 25.5406038038029 25.286047281103 25.0941229176991 25.0941229176991 25.0941229176991 25.0941229176991
25.7595507262768 25.8286787317457 25.999632532346 26.1715272174522 26.3443612914234 26.3800632879355 26.3800632879355 26.3800632879355 26.3800632879355 26.3800632879355 26.3800632879355 26.3800632879355 26.3800632879355 26.3800632879355 26.3800632879355 26.3800511884603 26.3799818117428 26.3800632879355 26.3800632879355 26.3789352825598 26.375002407344 26.369227850968 26.3616146048086 26.0614852240747 25.7080257141414 25.356402513541 25.0941229176991 25.0941229176991 25.0941229176991 25.0941229176991
25.9045072058696 25.9854747382425 26.1078964738579 26.2312588488243 26.3555603678406 26.3800632879355 26.3800632879355 26.3800632879355 26.3800632879355 26.3800632879355 26.3800632879355 26.3800632879355 26.3800632879355 26.3800632879355 26.3800632879355 26.3785006720099 26.3298984689853 26.2822210551064 26.2354669351027 26.2104749550793 26.2121300236338 26.2137832997095 26.2154347832935 25.9510371549695 25.6390817810014 25.3262076257988 25.0941229176991 25.0941229176991 25.0941229176991 25.0941229176991
