3.803372630624934914e+01 5.752881407728570906e+01 4.976294092589412799e+01 6.260656797402059226e+01 4.716501716334054350e+01 1.040252468470807798e+02 1.042434751102084931e+02 2.855773005849081869e+02 5.277857176395339138e+02 2.389354302614253811e+02 1.126925704136940851e+02 2.607550628694728445e+01 1.566200689480466579e+01 6.116635539329185178e+01 7.519092570696561495e+01 1.758602620514778181e+01 6.698219157307970306e+01 1.276453724837646178e+02 1.269930608171875832e+02 4.862712546016935988e+01 3.942127444793085544e+01 5.781575878111454792e+00 4.543357694598184615e+00 1.839317185644006614e+01 3.639192802755091094e+01 2.928832826003979761e+01 1.396071902815991805e+01 1.247519128092401619e+00 1.203511663302226697e+00 1.536982244913001505e+00
2.814699588982393408e+01 6.399189628487832238e+01 1.149634599871183411e+02 9.301423982064059715e+01 6.451015262841551134e+01 2.920947554805150048e+02 1.424564206316418336e+02 1.818158244248022015e+02 1.218281485895194152e+02 1.054621163133863320e+02 7.753090211807068499e+01 1.565978170614321030e+01 2.154716200802371517e+01 5.125076900711013650e+01 7.461003364346865396e+01 5.053626807727091119e+01 6.770842398730550826e+01 2.427861394812392746e+02 2.030815562000486239e+02 6.725441330670267348e+01 2.451567333415949079e+01 5.631624018807483978e+00 1.212294048001728086e+01 1.104612748018911361e+01 1.006807945795681647e+01 1.403741956883697029e+01 5.220650307586651273e+00 1.327656073378802093e+00 1.865904591240290511e+00 1.852835385117809430e+00
3.270631149260624397e+02 3.415307285775541004e+02 7.227391670283459462e+02 5.794233520425228789e+02 1.247753217809297439e+03 1.293031527409401065e+02 2.504063210431399256e+01 2.763713274303837863e+01 4.649035960023943517e+02 1.449892698679906573e+02 4.048894854108477261e+02 2.819812029766491150e+02 1.082273647172704614e+02 1.636638451199781343e+02 3.229878438244036687e+01 1.417358597858501525e+02 1.029196753239549622e+02 2.329072168722738354e+02 8.672434079977424517e+02 1.604886610840135575e+02 1.588798793115338981e+01 4.780211644038515395e+00 7.585350727538610727e+00 2.773506118930372466e+00 1.744758873302642677e+00 1.231338383579438700e+00 1.173930517168491505e+00 8.815443470087899192e-01 1.429632798876272037e+00 1.552256914619404293e+00
1.559593165588221950e+02 4.573687049548977370e+02 9.989459162395598923e+02 7.958988954824023949e+02 3.340898257625349856e+02 5.217253365746479687e+01 4.240245910090078496e+01 2.881624253944348624e+01 1.806095975790967856e+01 1.705601370920943509e+02 1.116853337709307539e+02 2.293499763316078202e+02 1.079215262196481717e+02 7.568683790547439116e+01 2.328642646295703145e+01 1.863922138415949092e+01 4.170831204070665876e+01 8.445093016262545405e+01 6.582177684920640104e+01 6.145479044481385245e+01 2.936093763560171510e+01 1.051988126759144038e+01 3.441038607523465132e+00 6.995505389431350807e+00 1.388598772672982262e+00 1.096181444244235914e+00 1.008876970055558875e+00 8.968067160940813576e-01 1.689830122147593983e+00 1.765409039447503714e+00
9.344024499639630221e+01 2.989596038256116231e+02 8.313987786222975274e+02 3.220432900381587160e+02 1.860374884139886547e+02 2.711001137307023257e+01 4.156959392352126059e+01 2.319416925711362154e+01 1.072940152913767697e+01 3.724954296153346149e+02 4.650855865734802705e+02 4.017102189251083928e+02 6.116968103538900436e+01 5.386727089185090733e+01 2.670255898791321769e+01 1.046416800174883299e+01 1.189121607854645930e+02 7.246724568001641842e+01 1.250342427209380247e+02 7.650546749978110483e+01 5.596192475214232331e+01 1.653018188611783401e+01 3.846436496051130405e+01 1.113409302485716879e+01 2.378274796103161837e+00 1.392187874727494945e+00 1.038078290154501149e+00 1.128456937793247850e+00 1.636018128004375738e+00 5.783792403592505238e+00
9.727421778475031999e+01 1.063887955813394512e+02 4.757540237940914949e+02 3.800539917466699080e+02 1.510365968433572448e+02 1.597342331863858256e+01 1.909380404392626929e+01 2.015123120397092293e+01 1.856864783161790911e+01 5.495605154112779474e+02 4.222947845513451171e+02 2.210672882850838619e+02 2.575535972306482080e+01 8.286262277256897235e+00 6.682116192148953360e+00 1.159438134974376844e+01 6.339242583588833213e+01 1.720326923094631510e+01 5.856377347863354998e+01 2.122583695411112785e+02 2.762548167307958238e+02 1.755947142449451519e+02 4.681428719798258697e+01 6.404827500146867969e+00 3.407099896316555743e+00 3.494299648904743538e+00 2.337028254658168436e+00 1.512462884831259569e+00 1.842411805800272306e+00 3.189683756654470237e+00
1.364437870655382490e+01 2.276564069587707451e+01 2.413409641977154507e+01 1.226905037013607966e+02 5.898335715143790026e+01 9.621820120672634857e+01 1.416966871660400784e+02 7.873990793585826964e+01 9.131131595901095466e+01 1.027492340392102790e+02 7.679554252647598389e+01 3.096006336266847114e+01 1.290526621594502288e+01 5.329685053201151490e+00 2.979011317085895616e+00 5.654314468575098118e+00 3.446079650455079957e+01 1.677076905393490236e+01 8.848694308233092443e+01 1.259185338687253477e+02 6.210451357639320946e+01 1.594797649982535503e+01 6.703428539009196108e+00 5.580149196783688481e+00 2.233008097754061616e+00 2.498055634171324257e+00 2.351411970361668047e+00 1.914457044233766947e+00 2.054781791534198376e+00 4.696919636719187885e+00
2.791726791161131160e+01 5.313265154032416149e+01 3.143205232242859637e+01 6.865402113066556922e+01 1.066246152040701531e+02 1.191713883706018748e+02 1.039979662399989309e+02 9.691610104639039491e+01 7.718652262366809680e+01 4.215823928184984482e+01 1.659905093204997684e+01 5.035576756008868671e+01 1.079099309876524515e+01 3.720982132989220759e+00 3.961202660510523721e+00 7.630001391451402881e+00 6.550613092486699429e+01 1.087028086884243692e+02 9.949227119048391899e+01 7.426258810551502165e+01 2.172108429338813096e+01 1.090666550437977023e+01 3.916693806355829199e+00 3.222429832527859972e+00 1.610061244334090702e+00 1.804788487942712738e+00 2.956833273874384549e+00 3.534676789617990700e+00 3.370087483094459380e+00 9.559927830190215303e+00
7.066069646026016926e+01 4.739692387720918276e+01 2.833246224538870806e+01 1.679998755767988996e+02 1.119328991331686041e+02 4.760308169390272326e+01 1.527976720503067440e+02 6.852962797129086425e+01 5.783445808439160629e+01 5.592485577294260679e+01 4.905940214685009693e+01 6.386230238389910596e+01 1.394385454690740573e+02 9.284522864848895551e+01 1.412011492821472380e+01 1.319806946097282463e+01 5.946555478443887921e+01 1.884522727715029191e+02 1.949838515258863367e+02 3.441500372000217567e+01 5.786158094922905448e+00 4.741470685352419778e+00 4.742708137297678483e+00 3.042321944270227174e+00 1.838728509356791108e+00 2.973650271659534550e+00 1.171451582485741838e+01 2.265322090430796464e+01 6.316715265226361709e+01 3.027310951080118429e+01
1.145646887618287479e+02 7.510237420654536322e+01 1.225851915765032913e+02 1.178636742741379351e+02 1.075462624023382290e+02 2.154562687534699705e+01 1.004642400681416206e+02 4.317492057589397803e+01 1.844796732932435646e+01 6.799754665019930755e+00 9.837835479543971928e+01 9.497664614128095195e+01 1.995907238383044842e+02 2.144841154373337702e+02 1.019790027765128286e+02 1.112664325741316418e+02 6.168028107505224398e+02 6.701224682905698273e+02 2.846419768611038421e+02 1.352222572596469945e+02 7.058387445184298059e+00 3.535083113848156877e+00 3.813092581732161257e+00 4.132871825931153431e+00 2.322666681502123076e+00 3.106357341506099434e+00 3.033523330266691431e+01 5.033237109074170235e+01 6.090188532112503594e+01 1.559277258679651368e+01
9.597454148495482684e+01 5.016988439199310790e+01 1.142792633560271867e+02 9.995575469695735649e+01 1.322420490270786786e+02 1.243350560454574705e+01 1.059957388952163271e+01 9.390093217419190452e+00 6.017883682274457691e+00 5.326510580733018685e+01 8.249049145502574447e+02 1.361261517830885623e+03 2.766789693015945431e+03 1.329090732339041324e+03 2.396326690658944756e+02 4.568102542113563800e+02 8.680256694707568386e+02 2.498167395563534683e+02 6.269126384901501581e+01 1.324613404798186522e+01 4.713973860687163508e+00 3.419047431114786484e+00 4.232491307411989645e+00 5.884273731762370119e+00 6.300495092109484219e+00 3.487641244392508000e+00 5.666900186788602412e+00 4.412263030841515388e+00 3.859048721558273609e+00 2.709790824732917880e+00
1.809711717537523867e+01 1.066193449550028660e+01 9.528038557474546622e+01 9.547718865980476721e+01 7.683931662522680028e+01 1.814380176614623252e+01 7.221856073779441942e+00 4.754357406739909919e+00 6.037879232933068607e+00 1.113027113826109655e+02 2.653639673846935239e+02 1.704836699493574770e+03 2.977450638920188339e+03 1.485907135042172513e+03 5.191028642980455743e+02 5.637037664299982680e+02 6.240005937018685245e+02 3.743932388540973761e+02 9.434614865291169394e+01 2.741949899377543431e+01 4.162016656653181101e+00 3.791002870202111019e+00 4.403354540457840471e+00 7.888283160779488767e+00 7.558980619205067697e+00 5.441438875263126640e+00 4.215584532605078927e+00 3.737522210205943551e+00 3.920701800560993711e+00 4.125855704786067335e+00
3.530234012137709154e+00 9.141272191180130235e+00 2.254999398382726383e+01 6.497638724459692128e+01 4.353948132937428284e+01 1.422105539930768714e+01 7.506615580907190832e+00 6.487262173299582102e+00 8.462061821899469649e+00 5.985890857197918535e+01 1.951451789417665594e+01 5.796157245904228148e+02 2.344470452775412923e+03 9.476644921521652805e+02 2.833624344643911854e+02 3.117007920538675307e+02 1.130378802103634399e+02 1.643029304361872391e+02 1.863236269172487596e+02 7.018440164201808784e+01 4.782993698323954490e+00 4.352098204699232475e+00 5.324641688221014135e+00 9.149965546573357145e+00 1.197390040761467134e+01 1.130957893961123339e+01 8.425726479029641780e+00 7.539271078169671014e+00 5.677114872492099451e+00 4.361657034145563827e+00
2.839363511343126589e+00 8.205774550817263702e+00 1.515363053136151450e+01 1.121590304645621217e+01 6.773714181628651687e+00 2.768759399782230446e+01 1.004363232550318514e+02 9.210901327244187087e+01 1.278393559748678854e+01 3.878140636162763499e+00 1.534265777080064908e+01 1.006376283988723799e+02 1.130503170649768208e+03 1.417251390117022083e+03 1.415564915037080027e+03 1.796258998611659081e+03 1.551336666515016987e+03 9.697813777352353100e+02 2.564152329157607710e+03 1.175502581970408301e+03 9.813127899013369415e+01 2.873582731284506764e+01 2.177556657523541972e+01 5.440529568960825202e+01 1.244658496878256528e+02 1.158392123423018631e+02 3.192266821662008738e+02 1.063147319608108745e+02 8.580295965569550987e+00 8.401193847714313989e+00
2.595174247175437987e+00 2.636510726584468056e+00 7.393466612890471801e+00 5.637839093664158696e+01 2.094926139186124914e+01 5.081516661037865035e+00 6.947894499973953941e+01 2.138398854584147273e+02 1.540632062929580002e+02 1.585740363747440895e+01 3.384104351101949248e+01 5.360217830835460973e+02 1.091230320830203709e+03 1.273296074552194796e+03 1.066527119435026407e+03 1.201105813854158896e+03 1.924123797314127842e+03 3.136865265549892683e+03 3.040933331575941338e+03 2.332108585077000953e+03 9.984484758398505733e+01 1.046219294471119099e+02 9.275943128225389955e+01 2.852338560086490702e+02 3.991440946095117397e+02 2.010111412077136038e+03 2.013567487774022311e+03 4.174953439880490578e+02 9.461159892242736902e+00 5.767562577352398634e+00
2.318963238000631311e+00 2.572758315421432407e+00 6.022059526466997603e+00 6.825150062311678312e+00 4.650364930746036407e+00 5.449405873629164176e+00 3.980883325943658946e+01 1.169024366262156889e+02 2.542375546819607166e+02 9.349902411381542322e+01 9.929379529095021439e+01 8.913473836749784596e+01 6.737188115219921656e+02 1.253268079993717492e+03 1.081491515026999650e+03 1.536409635540344880e+03 2.435651247877437527e+03 2.736064206549303890e+03 1.483242316893123416e+03 3.111657427985679192e+02 1.851090359686544389e+02 1.260210735783935434e+03 1.816328189311721189e+03 2.963596949011219294e+03 2.692923882223169585e+03 3.437965406881917716e+03 2.767745779431119445e+03 8.143314708139920413e+02 1.423615163170452291e+01 6.492564270967994489e+00
2.889957944690741520e+00 3.424522453203577399e+00 3.461217231972514519e+00 3.401033987970712769e+00 5.372516254236861855e+00 1.150103530614511627e+01 6.843434243711162708e+02 2.350090909687335625e+03 1.189812883214565318e+03 2.125462443553690548e+02 1.661515357895623879e+02 2.745087613341289057e+02 5.336918534437379549e+02 7.168291986822595163e+02 8.668563703961215197e+02 1.434052339428129471e+03 2.762238618246925398e+03 2.530545377072559859e+03 1.107851354809493614e+03 3.598852441036901837e+02 1.512283150959773138e+03 2.671611797337166536e+03 3.336782953096565507e+03 3.300319281255376154e+03 2.818208088946739736e+03 2.400200933616051771e+03 3.579800433541806342e+03 6.379270081041938738e+02 2.059082035092240304e+01 8.713197080703814379e+00
7.101801772237276822e+00 5.744303629831752467e+00 3.080274832168703902e+00 5.029612081312309968e+00 6.894363831419769895e+01 3.564710582217653609e+02 2.002925273169365937e+03 1.661531888881461782e+03 1.690946314309774607e+03 8.880814584764245865e+02 3.462610049429239893e+02 1.010208270928655736e+02 9.786450581418370120e+01 2.275984709097935195e+02 4.660735373939002670e+02 1.975815220405692344e+03 1.814488108458354645e+03 1.886803642201414732e+03 2.974063271723975390e+02 4.880587783449128665e+02 1.660522498322468664e+03 3.445552361051782100e+03 4.097265521439800978e+03 4.073746183308813215e+03 3.281217441829891868e+03 3.138106025919615149e+03 2.953192168949642564e+03 2.345121505223852637e+03 1.042038660140837578e+02 6.880813273183721890e+01
3.187673121716417590e+00 9.133633912390717313e+00 1.772370786595978842e+01 1.309017853111294585e+02 3.152095031962588791e+02 4.614022440285815492e+02 1.480779313308968085e+03 1.890972190475305069e+03 1.345269042060489255e+03 1.075706521680460810e+03 2.347810253769433189e+02 2.408556158511134981e+01 3.550137495664577614e+01 9.059859202681762724e+01 1.788241993345708352e+02 9.688400051694602553e+02 3.269042770114055543e+02 9.370058317602399711e+01 2.834072791868060648e+01 1.894681058597145125e+02 6.796185073849808305e+02 3.405730261659869939e+03 4.086552397713174287e+03 4.054957942892602659e+03 2.848770222030197601e+03 1.286522898826897062e+03 2.062594987702720118e+03 1.418095566767321543e+03 1.279512623708698698e+02 5.054229927750211004e+01
8.154266210580439633e+01 1.111054897415197047e+02 8.042269574047912783e+01 1.092521863240507116e+02 2.855791811206597686e+02 1.722955908652202197e+02 9.152188526755822977e+02 1.221067344616487162e+03 1.170358978290591949e+03 2.764110680735798269e+02 6.984424181376449781e+01 1.487422817774034201e+01 2.483216279294898854e+01 6.649581915649491748e+01 2.405656265417550799e+02 1.486397711581853969e+02 2.423098480095758589e+02 6.435200577034731850e+01 1.087661424460428918e+02 4.688319189765174997e+02 2.338865219357443493e+03 4.124992030433637410e+03 4.154659234943436786e+03 3.692863098792391611e+03 2.676140536378085926e+03 1.869669257087080041e+03 1.757579198095756055e+03 1.184794596080297879e+03 1.067282602334967265e+02 3.801137263772601216e+01
2.390583823437638387e+02 2.364100319975762829e+02 1.356513316639646121e+02 1.102557253328066622e+02 1.640285753707281060e+02 9.400513306109316147e+01 5.593726398849714769e+02 5.231385269481911564e+02 1.501293862535726475e+02 7.886875531103378023e+01 2.638050681785199814e+01 2.042009742195708100e+01 1.157682952715989089e+01 5.945147703427545949e+00 1.436327120737985119e+01 4.522218996042720107e+01 1.446408875819936952e+02 2.972374927876047082e+02 2.590094243693159797e+02 1.052479805893696494e+03 2.625801809125205182e+03 3.512585812827152040e+03 1.330549432154134138e+03 1.827335033247869433e+03 2.166602041786781228e+03 1.141631432486599124e+03 8.144996490644234655e+02 6.692668442298247555e+02 2.454210756117558034e+01 2.219175136484177102e+01
2.009740606691450466e+02 2.504694899455204222e+02 4.176735692223837759e+01 3.304759815739913620e+01 3.137327874845835396e+01 5.041897988125911922e+01 7.567875808854867614e+01 1.994851941786221516e+01 2.701400852697410215e+01 4.080610878219438575e+00 5.173276639102273755e+00 7.638527484180084315e+00 8.038264761730713914e+00 2.679211685886994587e+01 7.068554076370017469e+01 8.571152001043533346e+02 1.472565350387994840e+03 1.931571186710730672e+03 1.203086368887890558e+03 8.279247946224994621e+02 5.309399297481169242e+02 1.735032396992085069e+02 6.167549289688874126e+01 1.204394308081624985e+02 3.969931722856157421e+02 1.236978363354990336e+02 1.077926083786094580e+02 3.632999189257748185e+01 4.120859123969236038e+00 3.366793863402542719e+00
4.417001585201419402e+02 3.648016096314412948e+02 4.415157362397861363e+01 2.149464693305576191e+01 3.587778976369789063e+01 2.990278603129559087e+01 4.832020422877533150e+01 5.416479378256047639e+00 4.730658279136039646e+00 1.982207466920915540e+00 4.557841463507967816e+00 8.373356420809075829e+00 1.059638858501437753e+01 5.333999187164834410e+01 8.176461849127480264e+01 4.783012893419588636e+02 1.582759589240232799e+03 2.698354070836318897e+03 2.811508336312785104e+03 2.238769765819004988e+03 4.315541716236883758e+02 8.765406873077752437e+01 9.908569875254541159e+01 2.237002278075250388e+02 4.640675434039478091e+02 1.283184790734854914e+02 4.694368985605684941e+01 1.744894525603488944e+01 5.403753642733340357e+00 4.818706158158120090e+00
5.817699605018766533e+02 7.879894701821876879e+01 2.399638095222004708e+01 8.723592324050468250e+00 1.111810393199390745e+01 2.575098408094561364e+01 3.450275166741280231e+01 4.018435391229918885e+00 2.280687687310772205e+00 2.551595754299451624e+00 4.384300945887242840e+00 7.275262565432377926e+00 7.824984118908119513e+00 4.044535572097311160e+01 1.471535773548149280e+02 6.637374215824670500e+02 1.173962998577701683e+03 2.489044921241114480e+03 2.901057185327716525e+03 2.258979883203542613e+03 1.019479761183587698e+03 5.342369466188327465e+01 3.462268003405309713e+01 7.082041230433654277e+01 3.905236674305757560e+02 2.231513225221544019e+02 1.949413712413724795e+02 3.589385839258768840e+01 5.070059031936678728e+00 3.770190617110223297e+00
3.466678244487920892e+02 1.128869806467003514e+02 4.719901998606023596e+01 4.793471095881174904e+01 1.183990325770731999e+02 8.512110085930322612e+01 3.638825164645521681e+01 1.542972061221629154e+01 2.367369758410363545e+01 2.978518267089697957e+01 2.688824686287154542e+00 2.946414396315555351e+00 4.358439933454574700e+00 9.209119803615141819e+00 5.210831029543355442e+01 1.994725954267365182e+02 1.861549667697474604e+02 7.421083428466558871e+02 8.921620953143552697e+02 7.086626990521916696e+02 5.375632998973876511e+02 6.331108874029990830e+01 8.973668343146451676e+00 1.704161330449258926e+01 7.440631902261435471e+01 1.818302681743444396e+02 4.792842723749280367e+02 2.616898545655145654e+02 6.325069618411707673e+00 4.570622346436444161e+00
1.256863197633035725e+02 5.237873656994399596e+01 5.995914496642963343e+01 1.099188731199514422e+02 6.666496994592131387e+01 3.135626182288508090e+01 1.487129540543521067e+01 1.081089902151174620e+01 3.501411267941586658e+01 1.308447594936365590e+02 8.622071096231014309e+00 2.890005095988736450e+00 4.634168316235223628e+00 9.479431009229310590e+00 4.211751973597544918e+01 7.099501224797523946e+01 4.571369354993812806e+01 2.134478618869514222e+01 3.187021064360453693e+01 5.445135314245488445e+01 8.942112515806752526e+01 1.900514706232009843e+01 9.206053184314672677e+00 4.607213033542284109e+01 1.110528179441937482e+02 3.897211164614562762e+01 1.314783151626483573e+02 1.417099091744760813e+02 4.873428323540964868e+01 7.163071608568369442e+00
1.274885042135089179e+02 1.075230852731518496e+02 5.615300757528077469e+01 4.480628673785837179e+01 4.632174464512915790e+01 1.823580551277798634e+01 1.242409358990193624e+01 1.317048789949702936e+01 1.486796139035130793e+01 5.726875499945865045e+01 1.564094583269720928e+01 1.442743215574796700e+01 1.290816901331968580e+01 1.500588151037331031e+01 4.079529979938151740e+01 2.702689265431467192e+01 1.778401461399780814e+01 1.040102048306294158e+01 8.968580668466550776e+00 6.704496897081098084e+00 5.154083421402910759e+00 7.293047199277230774e+00 1.126492445501765971e+01 2.766148411895172288e+01 4.791137980766777105e+01 2.269485130685845320e+01 3.559526870281553101e+01 2.275010146085843488e+01 2.218173330276701449e+01 1.383154749331865929e+01
1.727993423196260494e+02 9.472343275353799186e+01 5.776013585543326201e+01 8.601197715872493177e+01 8.394361901818005833e+01 4.775606728931941802e+01 1.682402155841338356e+02 1.320498790125900257e+02 2.000471386559420495e+01 1.400106365255240704e+01 4.829264454868940071e+00 1.075748411039268326e+01 3.026868483619004024e+01 3.141841016277598442e+01 9.187013481375183233e+01 6.574249684426945350e+01 2.029712620305751258e+01 2.361276617365437502e+01 1.071739699097639331e+01 4.580845713095484051e+00 4.085890006153365839e+00 6.127119346922925480e+00 9.365871809216228527e+00 2.883122317561766224e+01 2.926047223571204725e+01 6.934065560187580246e+00 7.616011341534747459e+00 9.531984705143099035e+00 3.026284188629145433e+01 6.107207943337664702e+00
2.318385476171653181e+02 2.109422292798497836e+02 6.858557329971176841e+01 2.557213595429300597e+02 3.291288240271884433e+02 6.491227082180819252e+02 4.509940345096065926e+02 5.317338566873537786e+01 1.966174734871744079e+01 1.096810566538462339e+01 3.135021474415326637e+00 3.802446601199986898e+00 4.522939859048037192e+00 1.716458501880730481e+01 2.055424669208214183e+01 8.918079972677148248e+00 8.533911086476846819e+00 1.016115362612735495e+01 1.365269456495132516e+01 7.245815090032410311e+00 3.916935954904535055e+00 5.299294914180457283e+00 5.930100189991080128e+00 9.919942560704667400e+00 3.094998647990350804e+01 4.833939282175381713e+00 6.917245274366907282e+00 1.123800068021600929e+01 1.338809845552379940e+01 2.634905254437740041e+01
1.265076461738913309e+02 3.309723613570360499e+02 1.058414787115027309e+02 1.231564877594829852e+02 6.546084981203598545e+02 7.197921756936698330e+02 4.950844312779003076e+02 3.521988032103676147e+01 2.534000999245219532e+01 2.311831131494495395e+01 9.191259553532963977e+00 4.421018401402232456e+00 2.723153858051296172e+00 4.579226801970868621e+00 2.120676337105713927e+01 6.009321583320963889e+00 2.083872452931374397e+01 1.225249337986808484e+02 2.110840532785371124e+02 2.839897112447114580e+01 5.502977779459274466e+00 6.948478622036843078e+00 5.897655517297442529e+00 6.486357540485759188e+00 8.609279426484096831e+00 6.574409285851321449e+00 7.671713413833684214e+00 9.382217173565839730e+00 1.254122741095035565e+01 3.053331551766011032e+01
