2.322374496847199460e-02 3.432423061764169198e-02 2.989123538697120025e-02 3.769914279200766577e-02 2.867526791277735104e-02 6.300445192668734096e-02 6.282098069418755315e-02 1.708849869650531095e-01 3.108537910861633446e-01 1.401952564606674945e-01 6.489011056848076331e-02 1.481611785403535303e-02 8.725735373813750875e-03 3.275883794485245221e-02 3.823827619862570082e-02 8.399274817650244362e-03 2.940499867324923577e-02 5.120384006023483148e-02 4.602588672098793104e-02 1.609374493804043363e-02 1.293111540960352468e-02 1.968038870245691560e-03 5.509736732152609867e-02 5.916796807000752022e-03 1.053305615628218062e-02 8.114749551723865473e-03 3.714980641555564855e-03 1.378717814592739059e-02 1.336757765992187090e-02 1.676126044405448767e-02
1.826675561658066410e-02 4.063001537064873242e-02 7.289291591854851760e-02 5.971390792097334282e-02 4.157099779695356406e-02 1.858610910375164960e-01 8.824779322512453505e-02 1.121963297655010766e-01 7.340159188058860418e-02 6.317640408898186899e-02 4.466344137182173823e-02 8.762501761142243648e-03 1.169732309812476258e-02 2.682324998004545838e-02 3.761585643509009896e-02 2.409090547753024378e-02 2.959939614618508144e-02 9.625697440140153216e-02 7.203172064591181756e-02 2.147067210774425070e-02 7.537201594362342646e-03 1.774547682060378028e-03 3.758403788829365114e-03 3.264054225840752957e-03 2.630175364785988963e-03 3.427046828991473990e-03 5.242577947907146180e-02 1.389856428104269646e-02 2.015802213917437108e-02 2.010862031823700685e-02
2.199616876794745768e-01 2.246414959711655057e-01 4.754887076441986493e-01 3.877946462515002302e-01 8.204372102264084754e-01 8.329072401647470703e-02 1.540256021280789374e-02 1.660768341175310886e-02 2.676368886058241303e-01 8.264844330875635581e-02 2.234758758423993352e-01 1.500533437272514037e-01 5.555914356424832695e-02 8.127483250936169690e-02 1.561497914667310180e-02 6.549674931053213467e-02 4.371346566112012388e-02 8.876781212907550178e-02 2.925927596189458191e-01 4.814252726696650192e-02 4.522641324443102580e-03 1.346012436504517591e-03 2.075939684557147683e-03 2.996170760974213587e-02 1.791141147171231018e-02 1.204971354636923987e-02 1.088031938426857817e-02 8.713840539960234985e-03 1.486106050686510430e-02 1.663563280870197433e-02
1.026345102907015999e-01 2.954033255616490550e-01 6.491800385359325354e-01 5.253839545683833823e-01 2.131675539590047463e-01 3.278705917094903305e-02 2.575953058090736311e-02 1.744156490370669596e-02 1.074146076991261238e-02 1.021415703646581380e-01 6.637083450001944607e-02 1.325724593604507007e-01 6.031170900741075064e-02 3.999244676130140480e-02 1.177516593352044907e-02 8.936238024618268355e-03 1.855655159276575067e-02 3.445682936491900605e-02 2.413718026628194901e-02 2.038863061510646016e-02 9.069153575944054538e-03 3.128737695437876481e-03 3.823466235507889249e-02 1.927036936228281126e-03 1.471565010176711236e-02 1.099134010899084982e-02 9.450655827597064310e-03 8.960897790783508773e-03 1.768990096130540826e-02 1.923737986290779273e-02
5.908567301423780366e-02 1.842490598298311411e-01 5.154959140165726872e-01 1.997590637971987382e-01 1.125950280622982635e-01 1.634886604597586904e-02 2.501177276923876799e-02 1.393707410919490380e-02 6.540197604835358211e-03 2.314692749880068179e-01 2.947413805554964794e-01 2.498960252286322459e-01 3.686858667864396227e-02 3.021826909258307561e-02 1.404734744648583264e-02 5.195391035291823008e-03 5.535422865271646259e-02 3.165113783625061322e-02 5.044509250134133344e-02 2.883545356886619421e-02 1.976721299118383221e-02 5.497630485703459101e-03 1.179656169013321501e-02 3.313877987216589521e-03 2.631113554600432100e-02 1.472501828262383870e-02 1.024671080867109278e-02 1.183442899629059096e-02 1.806468364139835608e-02 1.895989329550015366e-03
5.873199063633043060e-02 6.168876964352724979e-02 2.770129236308307985e-01 2.220424492272832229e-01 8.726266342205446502e-02 9.368301023387355306e-03 1.145350001351009422e-02 1.230249391921383467e-02 1.168871511373671505e-02 3.568835736387120372e-01 2.824515233785592772e-01 1.472748276411713908e-01 1.667743924292388463e-02 5.451796450597934038e-03 4.113075767036586047e-03 6.689021468262900533e-03 3.091596512579553729e-02 8.068301339651213350e-03 2.600964910663798590e-02 8.965299819567357220e-02 1.082866432610841562e-01 6.316921862776422869e-02 1.531743589036474798e-02 2.050875795139715536e-03 3.909258850798656704e-02 3.859693378234679839e-02 2.412841854053453597e-02 1.660785943985486346e-02 2.090608331864402328e-02 3.769913624901186783e-02
8.167665668899943415e-03 1.295676183902832145e-02 1.371934578186274553e-02 6.960653891082971279e-02 3.333007253789514734e-02 5.549214737974552530e-02 8.455820975464932443e-02 4.841851037083262643e-02 5.813103593680477021e-02 6.778889392825060423e-02 5.231519927871148418e-02 2.135270641140738640e-02 8.928281497171057512e-03 3.986768918445420321e-03 3.302241497027860739e-02 3.545375422360837626e-03 1.749641113114553878e-02 8.326227396809597614e-03 4.252770599578663269e-02 5.823521614441170419e-02 2.662754609717930820e-02 6.692664666468121221e-03 2.789791023019731753e-03 2.436431822749673265e-03 2.706229229084176208e-02 2.871099387245506368e-02 2.526695212969330348e-02 2.177152680336314969e-02 2.375167608800109881e-02 1.733962024466357242e-03
1.764777769721798811e-02 3.233079080208483419e-02 1.894286840660035567e-02 4.088805351014176276e-02 6.302483792145537056e-02 7.131389733851631330e-02 6.356627079490881349e-02 6.030236583822694285e-02 4.826545321620885620e-02 2.698795927084432500e-02 1.085739912877927739e-02 3.358092316892712786e-02 7.337389165157059620e-03 3.790672491209957223e-02 4.277141395034247950e-02 5.016357581560601693e-03 3.513100431911756610e-02 5.684966932656114469e-02 5.010925421476512820e-02 3.552672200509796735e-02 9.560329598363266276e-03 4.785606612654554233e-03 4.750016713968469029e-02 4.140831866341487116e-02 2.075954534406938140e-02 2.143327572006319820e-02 3.198522496350214572e-02 3.696409096854789272e-02 3.528854262018886467e-02 3.394261033933349599e-03
4.716591599847286959e-02 3.115959462485584988e-02 1.819722174803053982e-02 1.056312667023303203e-01 6.839589679935662025e-02 2.906819373017703254e-02 9.372739959271361720e-02 4.229762456948011479e-02 3.518220034317769834e-02 3.465153654929198357e-02 3.092235132650211771e-02 4.094855151522786008e-02 9.178186846028643653e-02 6.249577226420353210e-02 9.221843227135061161e-03 8.130453939588160039e-03 3.403032489796073423e-02 1.047698898453051919e-01 1.036627467769466737e-01 1.716438606303351613e-02 3.024082524385207117e-03 2.928852984750806090e-03 3.278551279191173427e-03 3.956831055670755048e-02 2.391256383354967499e-02 3.490303609189676637e-02 4.035515969892415448e-03 7.602054441910607516e-03 2.241095236392981124e-02 1.127791084603519019e-02
7.877881443931684935e-02 5.195413478109103811e-02 8.239081065992624742e-02 7.742402278714648201e-02 6.732817335803899239e-02 1.329398843109946132e-02 6.120644176821767035e-02 2.613697032060018771e-02 1.083476948535337138e-02 4.083091006953557152e-03 6.004085902576680039e-02 5.918482140332027158e-02 1.249773531652074582e-01 1.336856786649109619e-01 6.277151500237646009e-02 6.853506057045535838e-02 3.714222316915348210e-01 3.884089892752554118e-01 1.558110520843274116e-01 6.905626902920816712e-02 4.428989721662980605e-03 4.264427032891088959e-02 4.662362040207135294e-02 2.425213733952354470e-03 2.843204340475022351e-02 3.630230856237504078e-02 1.139952599368528399e-02 1.800246204933720479e-02 2.469919468997077219e-02 6.742661436412760584e-03
6.582670301195767126e-02 3.500894523825385379e-02 7.757168474154822746e-02 6.657527782996039423e-02 8.346073893707593727e-02 7.643175458176465834e-03 6.332908165048604932e-03 5.477347072631561821e-03 3.370030053302090160e-03 3.038099847103684081e-02 4.820868430543292504e-01 8.159404109633824342e-01 1.682625785489514136e+00 8.194322261703730348e-01 1.491161419215823736e-01 2.913825619186221627e-01 5.459942431163842258e-01 1.513387321741505864e-01 3.591973170548845573e-02 7.628066755899529788e-03 3.808094148091197440e-03 4.210461584294382387e-02 3.447927451583179641e-03 3.156335491741075940e-03 3.095766519234988134e-03 3.996148469030733758e-02 2.744433753004228531e-03 2.504084919717136388e-03 4.432004344266466528e-02 3.247244981581288992e-02
1.404352868284469182e-02 8.261009839737491062e-03 6.381678710656525644e-02 6.309503928640786130e-02 4.856612417218579558e-02 1.098705698976196361e-02 4.172154569775523604e-03 2.638822368194829095e-03 3.213537216796179784e-03 6.037551782839817305e-02 1.481891905101113682e-01 9.811866663776758202e-01 1.755215597776506931e+00 8.964803701489705290e-01 3.179093579631039335e-01 3.551425302275654228e-01 3.919137874418134881e-01 2.302554499010660838e-01 5.621434944445881376e-02 1.697508153421944249e-02 4.757073237548280209e-02 4.599276211663723413e-02 3.213773986273339538e-03 3.920739160011529542e-03 3.894719848209255483e-03 2.716665963930404732e-03 2.367475285520464004e-03 4.664480339839154749e-02 4.866338191222754905e-02 2.640161555738243428e-03
3.942847040384701851e-02 8.631349879411536613e-03 1.487993356047489016e-02 4.211048785884012602e-02 2.723497366512506526e-02 8.505496984231997529e-03 4.259569940618368293e-03 3.467063429724219145e-03 4.344972648317685891e-03 3.112601117451127899e-02 1.037979979237300607e-02 3.120422750586898109e-01 1.309167879230818121e+00 5.536159274205794123e-01 1.714162807544984957e-01 1.958848639862326990e-01 7.190874824558396439e-02 1.049134507551297835e-01 1.186537792701808786e-01 4.660832468630959208e-02 3.576460966209598063e-03 3.297623660741252904e-03 3.699723728874637109e-03 5.257484479932721805e-03 6.846871649809294948e-03 6.367289838318545593e-03 5.200104407362098578e-03 5.332363697697684903e-03 4.080823432771879013e-03 2.801806922156408093e-03
3.467581019068401160e-02 1.098160546485710785e-02 1.148359768642892402e-02 7.233060097806926110e-03 4.246543405157293324e-03 1.633076879761001868e-02 5.559181770564516206e-02 4.740159980586834687e-02 6.192905961463907039e-03 3.996384744060739458e-02 7.684268735323533141e-03 5.096461473882992615e-02 5.992498185224970353e-01 7.988616364047111951e-01 8.382893790270127266e-01 1.115393540246894410e+00 9.953413623866147475e-01 6.424469230802329900e-01 1.745118251414557342e+00 8.036159948784206142e-01 6.559314578758465575e-02 1.881017643932285030e-02 1.410738202662929069e-02 3.547400193791418882e-02 8.283893295217932551e-02 7.799589050762385789e-02 2.135253847240096703e-01 6.891963023906172436e-02 5.327562666133554663e-03 4.926998168302730401e-03
3.296933775853587434e-02 3.100047448620577017e-02 6.617852075814751635e-03 3.437817000188943262e-02 1.235455489016271807e-02 2.846549014440960881e-03 3.711482276633015776e-02 1.080607745402724085e-01 7.427016654891316350e-02 7.604049815298625364e-03 1.617749239625843397e-02 2.533348023683307804e-01 5.378992399092815679e-01 6.747654528630856463e-01 6.018363783226075014e-01 7.185508614285380791e-01 1.215301512259585603e+00 2.084888560055858431e+00 2.105043085252916502e+00 1.637860705265439032e+00 6.949696633565612125e-02 7.220457433722775320e-02 6.460778431711479419e-02 2.031948738659578868e-01 2.940335206936997570e-01 1.513450365733376213e+00 1.516036201015455775e+00 3.015424659335316226e-01 6.480231373669443837e-03 3.734911922526074676e-03
3.087435925423031788e-02 3.195420281413540592e-02 7.044823238014255411e-03 4.948697952670643926e-03 2.718182156041961013e-03 2.864981193806201507e-03 2.037585985597404475e-02 5.805290832075794827e-02 1.203771460605949778e-01 4.292788877266293102e-02 4.445632439227324012e-02 3.923907355544033193e-02 3.058639236444053999e-01 6.127395496580539946e-01 5.652028458556960233e-01 8.582582163067292713e-01 1.473096935377441907e+00 1.773352211198571338e+00 1.013762643285762488e+00 2.187686340572113641e-01 1.313406667903440350e-01 9.042616954230395798e-01 1.325547923380647752e+00 2.229996293696760112e+00 2.111325780715077371e+00 2.780997057314877008e+00 2.239453881206658448e+00 6.318535468565631419e-01 1.051860481591400907e-02 4.629168879418189657e-03
3.760746465832005142e-02 4.215602062043263126e-02 4.030911810570869669e-02 3.723536651926247915e-02 2.920455186185577558e-03 5.682331248553422302e-03 3.349573342273700072e-01 1.129409522698331170e+00 5.505701479310952662e-01 9.431182094143078509e-02 7.022282752637865055e-02 1.104029780718479431e-01 2.186789199314468912e-01 3.198801953888316674e-01 4.199035907394838563e-01 7.494440343679414918e-01 1.598453058502047552e+00 1.586258711692576373e+00 7.404256823837293000e-01 2.518771741697847788e-01 1.091325342285700328e+00 1.991673803197610670e+00 2.568160965985927024e+00 2.646088490322707987e+00 2.349368412156321195e+00 2.054563861277598935e+00 3.065263794414692544e+00 5.270704283059641782e-01 1.653737744155294592e-02 6.813378387030625573e-03
7.073660154207202407e-03 6.403171750826787932e-03 3.604718239552282683e-02 3.444943643305172377e-03 3.479108831513031547e-02 1.652808525218463775e-01 9.285713099293405604e-01 7.603940829709135985e-01 7.460924200410173901e-01 3.727670062478646296e-01 1.366540317047854336e-01 3.706107601465166018e-02 3.626350344666354197e-02 9.243149454804455711e-02 2.079349403780991756e-01 9.533332760425741181e-01 9.880404440321592929e-01 1.129958368276665848e+00 1.937542613140445791e-01 3.391904710033592507e-01 1.209722462666117382e+00 2.630401158195352362e+00 3.253374667196414993e+00 3.385717627824132769e+00 2.819678374896924300e+00 2.761582838912854498e+00 2.602721799550133053e+00 2.034791311954438520e+00 8.927743484657434114e-02 5.801076596297548293e-02
3.619172643049362037e-02 4.965793619889138748e-03 8.915030384540433353e-03 6.223001714935330608e-02 1.341166149390337625e-01 1.916417104628080348e-01 6.051255835228332991e-01 7.580739456286652578e-01 5.193563893083061878e-01 4.030872023010039773e-01 8.429132365179393960e-02 8.277313848612355418e-03 1.256723866176358978e-02 3.526019354440478731e-02 7.649038145484704510e-02 4.488989604058835070e-01 1.683649831338678293e-01 5.269208102019465323e-02 1.738199112349052278e-02 1.253260280484060907e-01 4.797116829559002205e-01 2.564784373969219100e+00 3.250903979375211250e+00 3.405220200504490258e+00 2.495176969545529477e+00 1.165417878180050826e+00 1.907691299229002935e+00 1.291637997930892956e+00 1.155628736098625597e-01 4.475516066971099716e-02
4.308075280925981881e-02 5.564079656958747372e-02 3.644837456153265931e-02 4.578717037077251195e-02 1.086690201161325114e-01 6.274332162527151979e-02 3.233238548303516424e-01 4.188655493516095230e-01 3.854493553486804114e-01 9.034035405486742776e-02 2.259482030839730926e-02 4.782235012415378753e-03 8.385072499809090307e-03 2.462819164857162416e-02 9.726947848163361443e-02 6.507407751794357098e-02 1.165273470599310357e-01 3.375487052281533895e-02 6.245555988389500657e-02 2.947819374078894383e-01 1.594728908689407199e+00 3.019935119673375912e+00 3.238247862880562433e+00 3.066741904068915225e+00 2.352166991250300043e+00 1.725363088797025712e+00 1.676239134349355009e+00 1.116270707315574651e+00 9.976961280458084003e-02 3.496146237421340203e-02
1.193874717107003131e-01 1.103688638065382366e-01 5.705037766805402810e-02 4.140069197406887752e-02 5.420391794666400143e-02 2.925292650964858923e-02 1.668073411007197637e-01 1.497106015443861737e-01 4.098708655164347986e-02 2.213274678114124025e-02 7.627107697884487336e-03 6.096321685552108169e-03 3.691677582927351767e-03 2.082279471251827739e-03 5.492346513337111914e-03 1.882878087144681037e-02 6.625762928846640198e-02 1.482868203485149527e-01 1.402978036543851559e-01 6.206893626511522655e-01 1.692353435287894614e+00 2.437775621729083131e+00 9.855187558575384532e-01 1.470046725881434702e+00 1.891596942372466561e+00 1.068484421808717721e+00 7.951403283119111709e-01 6.536867464496224356e-01 2.668387320089677522e-02 2.458321886156123945e-02
9.796558522676233893e-02 1.138503750312202523e-01 1.681594293677291657e-02 1.170006705379369669e-02 9.677540957099637492e-03 1.451608828060993277e-02 2.071135158766546427e-02 5.183095304580815840e-03 6.775604600129880861e-03 1.079526335607688264e-03 1.451238904865518545e-03 2.208862693649208189e-03 2.492379438606936223e-03 9.100216957171617521e-03 2.633414018586957908e-02 3.501254286968216167e-01 6.631407760648402316e-01 9.431494955762635968e-01 6.333322320085684742e-01 4.694339406927054981e-01 3.292736380601880564e-01 1.163204119950289051e-01 4.473541310026685897e-02 9.668111300182782863e-02 3.482638087384177239e-01 1.168603818157501056e-01 1.061325587945042975e-01 3.608503678732276343e-02 4.640053259461084795e-02 4.354085963936446535e-02
2.089160131530611586e-01 1.619919781011023019e-01 1.737462172155513490e-02 7.524749919433700897e-03 1.111151988049826136e-02 8.702391413404965068e-03 1.358541885584085319e-02 1.468578284277424198e-03 1.305191805771497952e-03 2.276112638625555143e-02 1.398001365414345111e-03 2.541339266157574377e-03 3.343972042979516824e-03 1.863316086078173339e-02 3.178093636988029574e-02 2.059825958787745159e-01 7.447348826659058174e-01 1.366405120430602693e+00 1.521599471953723359e+00 1.295779129711892574e+00 2.712202636672917944e-01 5.963357413472126362e-02 7.359622552730175904e-02 1.823134325636607544e-01 4.045817644956866688e-01 1.188965892452741591e-01 4.458719619593173172e-02 1.689947869261394092e-02 7.882730153917877694e-03 7.315816791290031054e-03
2.640873611381795438e-01 3.388374820506522694e-02 9.247576648623249268e-03 3.043458053097810190e-03 3.470464781085342166e-03 7.625867279002633212e-03 9.927799493794164584e-03 4.577509670355554144e-02 2.625976195165750579e-02 3.005348053808409511e-02 5.247863983454768150e-02 2.349378303132520444e-03 2.565923897567908788e-03 1.435020413346107561e-02 5.832059975068356467e-02 2.924008058471549987e-01 5.601721901830001293e-01 1.271259877010307626e+00 1.576822571778944360e+00 1.316562682508979565e+00 6.493393721375354533e-01 3.700152584599206151e-02 2.620630243220099451e-02 5.745213391310448336e-02 3.313471372032494311e-01 2.005753590047010260e-01 1.786491926761812621e-01 3.321853590862101219e-02 6.165121785607861719e-03 4.640509035017627987e-02
1.475626272691604735e-01 4.606454002369173711e-02 1.769655449822703230e-02 1.653301900090554596e-02 3.669385844378350581e-02 2.507450104777115413e-02 1.048888373932923765e-02 4.333926621646575460e-03 6.584478697939002978e-03 8.878666664658632288e-03 3.195154176435787557e-02 3.564278567848284257e-02 1.471437626788160789e-03 3.304307983330664108e-03 2.105934914424678964e-02 8.962571547389637516e-02 8.929292045026786251e-02 3.758747344858489603e-01 4.757687705355972407e-01 4.066758664155040726e-01 3.404046207262155788e-01 4.378758895876611046e-02 6.764886546069184131e-03 1.343614158327732094e-02 5.975039306806144424e-02 1.515264654881004758e-01 4.051242461532277850e-01 2.256631895084569850e-01 7.103713296579338560e-03 5.457918499370762594e-03
5.287105429335924728e-02 2.117088027633378181e-02 2.245629112534978239e-02 3.788439348089359809e-02 2.063455227631467298e-02 9.220763923961445424e-03 4.219079574401527789e-03 2.950759566962975981e-03 9.368720514485635170e-03 3.663598114218585139e-02 2.728191317731637477e-03 3.422191311535027064e-02 1.576567392710320932e-03 3.417835215510263858e-03 1.707397444037203615e-02 3.190760585122742049e-02 2.169698787887854030e-02 1.063302274909265314e-02 1.661850061537355552e-02 3.031457644999052334e-02 5.447128105626115185e-02 1.260661174265973600e-02 6.624608081318365815e-03 3.448150433356991090e-02 8.451727448393002440e-02 3.041848410824705626e-02 1.050879040843854251e-01 1.170998968878623203e-01 4.079920820676726650e-02 6.035053476304838745e-03
5.360241826348514232e-02 4.338757778450935687e-02 2.101756230678263407e-02 1.536778399197993687e-02 1.423407273348093263e-02 5.324894177242450906e-03 3.513622490989747656e-03 3.592732063899843273e-03 3.979878186491483776e-03 1.586853603378236485e-02 4.671701955912629760e-03 4.400322719304478741e-03 4.255811465752805216e-03 5.506485358570939632e-03 1.684586151690457140e-02 1.236756709661870034e-02 8.561942359389115159e-03 5.236555104541874665e-03 4.712406490994730697e-03 3.697799991260138086e-03 3.036615989954672377e-03 4.583489008997788244e-03 7.567297867705183485e-03 1.967195513473426680e-02 3.531446251224951843e-02 1.722852562362090292e-02 2.764890708591557014e-02 1.854325934847189661e-02 1.860000204525689635e-02 1.176309467755480911e-02
7.287740018791659391e-02 3.829651491755692305e-02 2.161282661075109371e-02 2.940074542939172253e-02 2.575802147569028477e-02 1.397325258898344386e-02 4.766946720035784846e-02 3.601542762092770772e-02 5.326105912621596598e-03 3.962665331749701259e-03 1.413732152351258355e-03 3.229714897500769732e-03 9.759866876728627919e-03 1.155181229020629634e-02 3.793727281252634587e-02 3.004605639725534821e-02 9.764851534288208901e-03 1.190052715363563128e-02 5.634726981321102994e-03 2.840782936750509222e-03 2.639393528997051319e-03 4.092540704177819767e-03 5.748633451483279103e-03 1.914273859125961014e-02 2.070697584338574912e-02 5.191864229903179855e-03 5.920325630142207231e-03 7.768704812676912284e-03 2.558874315681997774e-02 5.244571425586781917e-03
9.805564920599711687e-02 8.553618960464964838e-02 2.578967038389665817e-02 8.774120930558669540e-02 1.018499430605926542e-01 1.924734164803933723e-01 1.291349973980848165e-01 1.463132742820743258e-02 5.276306630471716205e-03 3.134965507310040304e-03 3.732786882929714500e-02 1.297367940944352174e-03 1.603862905884719621e-03 6.814274731115258117e-03 8.552980891423927687e-03 4.111385617475056715e-03 4.162452991364229936e-03 5.303260081717916900e-03 7.447028045608660579e-03 4.395983610753158993e-03 3.573869394113358966e-02 3.307971738017235260e-03 3.304894397469118877e-03 6.115752361325485498e-03 2.101462642471463999e-02 3.580333872131987501e-03 5.437567162996285661e-03 9.255708016659541446e-03 1.153589686347510773e-02 2.298904086812398467e-02
5.330150522625822646e-02 1.335200597672848710e-01 3.980468062755578712e-02 4.252144696774113469e-02 2.063396096394788937e-01 2.189906727145712051e-01 1.461179386347187248e-01 1.006532160655233474e-02 7.134899664360079205e-03 6.997226896835696472e-03 2.896144499532430847e-03 1.670350491843911435e-03 3.266765601610914505e-02 1.931063274234757305e-03 9.211880856839077536e-03 2.881585560848388874e-03 1.080456164232079276e-02 6.952854056961393914e-02 1.273790926440780957e-01 1.920477219802871685e-02 3.757394326327970560e-03 4.800697758531188852e-03 3.615458084329795964e-03 4.342889326849312323e-03 6.299003935258703883e-03 5.241336719061750332e-03 6.497646635823473016e-03 8.242822309852609192e-03 1.151444469928917733e-02 2.842699176560256960e-02
