4.445229274512144113e-03 6.471501991761127379e-03 5.619871189672640682e-03 7.083509823629687008e-03 5.332705345023396222e-03 1.161756875239352768e-02 1.140057686669159777e-02 3.055875204283665936e-02 5.520666132386949088e-02 2.474517579049584359e-02 1.150717789775981478e-02 2.615349097757916665e-03 1.519053178495717582e-03 5.580007806034388215e-03 6.420092833254539659e-03 1.397679432419057788e-03 4.934315625909301700e-03 8.677983094849147858e-03 7.929059154658805314e-03 2.804404476717909864e-03 2.208331863304581477e-03 2.873502187110516318e-02 2.216830219342606073e-02 9.177209511479846081e-04 1.702231514982502835e-03 1.274900408356044327e-03 5.942649990699316875e-02 5.200820452603178122e-03 4.887833509787841563e-03 6.047304705946620479e-03
3.471181697158530824e-03 7.503319844987548295e-03 1.350901245080518738e-02 1.094776588739631434e-02 7.599049698589379134e-03 3.386594188434191577e-02 1.600434245361553182e-02 1.974341514047915636e-02 1.276785422339605722e-02 1.092385302591479881e-02 7.860374032037473202e-03 1.545497411200687926e-03 2.041294153155713727e-03 4.581336565358310603e-03 6.258384530378430059e-03 3.955784287428947346e-03 4.872718214812160956e-03 1.591815966070429106e-02 1.205615810885426326e-02 3.630234996087497619e-03 1.261597407381448389e-03 2.662502069234171098e-02 5.557133906448609439e-02 4.877226464084312429e-02 4.241538428181058917e-02 5.616268848621128185e-02 1.975743608931630757e-02 5.092421144315574869e-03 7.216298362981682368e-03 7.191226939292095707e-03
4.197152079694006777e-02 4.103813587381644618e-02 8.689654978142932751e-02 7.010073482822033741e-02 1.499217497190308002e-01 1.522351650219431161e-02 2.829760239912559611e-03 2.983502102293245778e-03 4.765940035454045015e-02 1.475195500694737212e-02 4.042080391792661487e-02 2.718265045598398238e-02 9.947332100695545354e-03 1.424255035969071437e-02 2.646123784405046784e-03 1.083405686804985064e-02 7.183779919389746138e-03 1.463653766019499744e-02 4.859729834958380346e-02 8.036814031213142945e-03 7.451613615523086437e-04 2.141800525272558736e-02 3.252333409660917996e-02 1.130622673038580647e-02 6.694581105767113613e-03 4.413399886414931181e-03 3.909134149866829756e-03 3.093919556666149037e-03 5.250994425995056218e-03 5.936772649086076437e-03
1.946855031927710589e-02 5.357791888005150605e-02 1.177496950040825829e-01 9.436028499710413797e-02 3.912505717366540625e-02 6.023509980424742935e-03 4.754798133380836941e-03 3.128952757901157580e-03 1.891454691680596574e-03 1.801394999114971571e-02 1.179274940131700734e-02 2.388982420982802002e-02 1.079831258525869309e-02 7.049937296918688465e-03 2.008486963750166776e-03 1.479114257195628199e-03 3.038657771124652577e-03 5.612085886762381570e-03 3.962559200191398227e-03 3.350462577459333187e-03 1.482444066159427191e-03 4.873038212428034560e-02 1.520239562439103242e-02 2.922330392187795500e-02 5.422136434477586864e-03 3.978747864457305577e-03 3.392294876091338923e-03 3.208594609025780704e-03 6.395598035274969312e-03 7.038042948814091093e-03
1.129110593024602524e-02 3.381311881362151356e-02 9.414062796475695938e-02 3.645681921273635773e-02 2.106241593488357780e-02 3.048260671553067614e-03 4.607004512167833798e-03 2.527813129790282970e-03 7.592057543748317872e-02 4.093755892459833429e-02 5.214647848300849042e-02 4.558764765681799780e-02 6.730703783550455628e-03 5.422446842114908225e-03 2.444895196216246257e-03 6.585399992665445790e-02 9.128573065273964254e-03 5.174319336034612603e-03 8.271879614248465670e-03 4.675198861586070051e-03 3.153613905257882967e-03 8.543224278129847148e-04 1.815777489549940272e-03 4.895456972119804906e-02 9.782064100795238512e-03 5.330788601994736545e-03 3.695857428436521812e-03 4.278362433847398075e-03 6.575172184600247202e-03 2.453378707477626985e-02
1.131450904988832301e-02 1.154924886692552423e-02 5.167224593601446592e-02 4.129533460569129871e-02 1.641478071920332224e-02 1.739149340313069555e-03 2.081377651045703599e-03 2.193531064191360860e-03 2.015059020217146134e-03 6.247009175371370793e-02 4.996347473600164235e-02 2.701897220043497291e-02 3.078360213356882112e-03 6.004930310312205088e-02 4.558632328165510006e-02 7.413066650168677330e-02 5.079582875518094676e-03 1.306638066617702397e-03 4.201548986695182418e-03 1.428454577788343220e-02 1.710482709920358932e-02 9.931762639506137511e-03 2.401408216053799258e-03 2.945344464179228475e-02 1.468951943861251594e-02 1.405306833082802659e-02 8.762992236959664394e-03 6.048585413184884296e-03 7.823020294442858957e-03 1.432591774725740230e-02
1.025495771469605299e-01 2.470672711338217208e-03 2.603425629764130958e-03 1.315841250023974326e-02 6.290888856575657315e-03 1.029860398761434440e-02 1.529987293473346679e-02 8.562260928654141789e-03 9.979096364400920696e-03 1.192776977966429966e-02 9.400951510763757082e-03 3.969250307699069037e-03 1.017263374978340518e-01 3.962961394578776858e-02 2.076604720473151575e-02 3.671710801808571872e-02 2.882834467493601040e-03 1.349302163497901556e-03 6.818937408138199194e-03 9.204836242981673938e-03 4.177523428948704508e-03 9.762757105940911371e-04 3.390676816228575807e-02 2.671531544000529945e-02 1.006640830902116174e-02 1.052928985164778425e-02 9.256225841974856025e-03 8.053819103301058935e-03 9.187037476099498695e-03 2.221405021880432790e-02
3.522357619689530858e-03 6.408517788082155817e-03 3.715577500405356330e-03 7.944169141428931991e-03 1.205443824764457564e-02 1.329713115878847739e-02 1.153109781205573746e-02 1.065887391525268887e-02 8.407526367366377137e-03 4.825858659455158593e-03 1.984509467656654473e-03 6.257824103910625269e-03 8.374509570983726392e-02 2.771501883615706124e-02 2.821185105983607319e-02 5.176814095105935348e-02 6.020480031838106733e-03 9.554264555577805795e-03 8.336876323056663027e-03 5.873292214529952406e-03 1.569276423432887802e-03 6.029264162329503463e-02 2.055193421665656855e-02 1.612573573481238670e-02 7.680821486984395520e-03 8.160881119509862114e-03 1.267580830647657350e-02 1.600986270801907363e-02 1.605944841294065784e-02 4.775542110765497450e-02
9.541283394563587761e-03 6.224284372240337579e-03 3.602956874356780595e-03 2.060111621631205425e-02 1.318031919314794319e-02 5.463659585524581128e-03 1.724564017479456729e-02 7.564733315060419294e-03 6.223131867851422472e-03 6.261231868015214308e-03 5.684266860951918583e-03 7.611594121749184691e-03 1.661542752123307265e-02 1.065145374076069233e-02 1.023167584531352731e-01 9.295666910496030999e-02 5.943173390520443619e-03 1.793597288353473290e-02 1.761324762039358227e-02 2.919643704316703461e-03 3.482634486097094945e-02 2.713226683162126354e-02 2.573733022719124422e-02 1.586500434957312244e-02 9.248845363254180538e-03 1.432718230994227057e-02 5.405066472419672169e-02 1.095512562871217826e-03 3.317960287542057879e-03 1.718171967947447563e-03
1.614587386973111854e-02 1.047245250993544124e-02 1.654489747662789279e-02 1.517062162844800763e-02 1.305752987152149561e-02 2.520540450734070227e-03 1.145328598698868924e-02 4.756050385493440502e-03 1.946090328544273097e-03 4.946470786173433332e-02 1.094857927003195334e-02 1.075042225941172033e-02 2.277875868408481275e-02 2.445651236084038505e-02 1.156279172218555376e-02 1.246937512624224018e-02 6.633115178871185069e-02 6.850473319717809151e-02 2.748174000834162356e-02 1.217880073728173917e-02 4.390249890826780632e-02 2.088565470580005384e-02 2.133625182827323177e-02 2.239174778397054824e-02 1.226003927166359128e-02 1.584208739002882643e-02 1.500063143830517205e-03 2.696173051419591734e-03 3.502451432770885276e-03 9.558227335821655509e-04
1.340603303681555530e-02 6.973980613629597938e-03 1.544250456892799252e-02 1.298099110531480624e-02 1.624287334105131014e-02 9.245505417924869407e-02 7.783441878175789697e-02 6.784696418410687824e-02 4.259819358589589378e-02 5.572487905830902574e-03 8.755872058059317731e-02 1.458238554191380598e-01 3.013611915760454618e-01 1.488354279762303389e-01 2.748346920556071077e-02 5.335079686166462054e-02 9.870072261083848164e-02 2.730454739445391590e-02 6.534304655196866707e-03 9.022236385993508134e-02 3.074930563195172467e-02 2.130032667611592850e-02 2.508924625158968219e-02 3.403692555801869635e-02 3.578715363192720711e-02 1.929513306007266463e-02 3.041761044662269139e-02 2.436982092705048536e-02 2.180785890821979045e-02 1.560235402122767470e-02
2.427783883891760763e-03 8.669868317461815188e-02 1.252067445289574595e-02 1.220317070712951743e-02 9.437264437885232310e-03 2.128591951404662074e-03 5.274014629486487027e-02 3.390987322635558715e-02 4.198033426268021895e-02 1.110034816716797337e-02 2.671440117135318384e-02 1.726166588827804382e-01 3.088335999678868404e-01 1.616185564685264919e-01 5.900066750151347628e-02 6.674216017452265504e-02 7.368557233375971904e-02 4.362279210477734009e-02 1.078721376489216732e-02 3.034418576662023352e-03 2.908775810574536214e-02 2.564324231448797398e-02 2.876906887768420490e-02 5.076210475169203040e-02 4.817046890820127908e-02 3.407419626667392010e-02 2.589616402139225185e-02 2.320668408477812722e-02 2.449009840162488794e-02 2.583314979248155230e-02
2.812521484935987665e-02 7.263724415019473524e-02 2.871987742811950729e-03 8.156444719738809024e-03 5.316997203787646002e-03 1.057775189267672056e-01 5.426051516221715859e-02 4.542659549155875914e-02 5.730628767117955380e-02 5.651312093764663917e-03 1.856248132799249041e-03 5.523911416755612758e-02 2.307693313673629953e-01 9.989212563720782645e-02 3.185282367971258716e-02 3.721706026912031950e-02 1.378382913100245806e-02 2.028271566560019626e-02 2.318297595669693845e-02 8.675329197961288707e-03 3.559121892763321415e-02 3.173688091449591853e-02 3.797139451680640876e-02 6.480194641038983239e-02 8.457484582367907899e-02 7.915876208737143704e-02 5.828735159011189104e-02 5.208782862720568591e-02 3.887853511049901845e-02 2.936602717822172151e-02
2.203163808281334568e-02 6.357718733747169670e-02 1.864982167127588516e-03 8.650233064597367960e-02 5.160965494337228787e-02 3.172320844932846953e-03 1.061087427274254313e-02 8.881139541250450409e-03 8.401784979076354354e-02 2.538353700160232707e-02 1.373384295832142049e-03 8.968495142455151781e-03 1.049958345341368282e-01 1.444724256243938298e-01 1.570499661416350223e-01 2.155951234214381063e-01 1.947649748338626252e-01 1.263616999296892085e-01 3.451155590722129185e-01 1.610724114847718047e-01 1.325067321033026810e-02 3.806876596202351647e-03 2.814509357710817325e-03 7.017400540088597136e-03 1.612742650170914324e-02 1.490382213050873289e-02 4.025255001240640729e-02 1.273254859822943452e-02 6.358832335331110475e-02 6.009005383562554536e-02
1.992691403808712070e-02 2.014661081229547970e-02 5.637695938409105489e-02 6.611849575722959262e-03 2.399590170808420415e-03 3.689942370251045323e-02 7.122641146311633684e-03 2.042884325363439335e-02 1.369339241646740264e-02 1.393023448621467843e-03 2.930002443826174290e-03 4.530936243070037700e-02 9.520391705078934397e-02 1.220486291001270096e-01 1.115893067756005275e-01 1.364634519947088009e-01 2.336971648831344672e-01 4.048660855235138856e-01 4.146083061642197309e-01 3.294649443768390418e-01 1.405659969076352746e-02 1.462374879968605934e-02 1.279712029004471605e-02 3.970159599456848931e-02 5.623150576794906652e-02 2.835257375844528194e-01 2.801053751607570086e-01 5.514581552586209079e-02 7.405380440894469840e-02 4.365296881559389830e-02
1.757843884515514904e-02 1.933059123982381819e-02 4.504417156438058484e-02 5.043443716186894743e-02 3.374029864983427857e-02 3.858043779258282097e-02 3.928370419466918270e-03 1.100522386099715179e-02 2.277324354246439836e-02 8.099199385032769191e-03 8.283798723669206360e-03 7.086399379908099073e-03 5.462381231129100068e-02 1.113643438131252383e-01 1.047050403030658078e-01 1.612275256366902665e-01 2.795141006193826994e-01 3.416620616062647775e-01 1.998688575268605105e-01 4.412345185030681211e-02 2.633127742372858363e-02 1.791560591381603784e-01 2.569650077243738062e-01 4.256264659728737909e-01 3.932715113530722562e-01 5.039820956750113989e-01 3.995112565543844085e-01 1.128584693967447650e-01 1.157362614080628543e-01 5.172915490597441990e-02
2.146251479450798916e-02 2.514070746691070973e-02 2.530557382275074041e-02 2.449364417805221031e-02 3.781567391199313483e-02 7.906727965512601319e-02 6.442949122113367233e-02 2.148645589187263838e-01 1.049122962527844483e-01 1.789260302753879761e-02 1.321293044574229324e-02 2.031547452506568888e-02 3.982097865012861754e-02 5.861010566729601967e-02 7.713389332096542983e-02 1.378243599542986197e-01 2.981396038478479338e-01 3.049498072558173845e-01 1.471901164868653633e-01 5.108202371716546314e-02 2.167894629597895695e-01 3.857955168662936529e-01 4.863021738737786093e-01 4.923206137880606348e-01 4.269125125237462903e-01 3.630210305388710812e-01 5.293939852508734445e-01 9.186364046498313174e-02 2.891476407291922873e-03 7.263598675697914564e-02
5.153591063366794178e-02 4.107257340312393812e-02 2.192150273992215029e-02 3.511520438128121202e-02 6.272442370870217818e-03 3.161739580634768260e-02 1.758975031562678981e-01 1.429330741569376229e-01 1.407574975319506594e-01 7.059759451407342234e-02 2.583810019510021302e-02 6.906373713951111278e-03 6.696810380284531385e-03 1.707385027504058905e-02 3.795663675612462318e-02 1.724818283980410205e-01 1.828396014383442125e-01 2.178931969968874172e-01 3.867162722063875041e-02 6.880025911398562899e-02 2.388326758596186206e-01 5.056242139651343503e-01 6.129224818167606781e-01 6.257291157834471429e-01 5.086547036527766519e-01 4.802611852868121645e-01 4.380214620357486544e-01 3.472700144961958779e-01 1.540876386181983665e-02 1.015577568702613967e-02
2.285310721341587276e-02 6.420472907569110821e-02 1.655388219134218842e-03 1.145082263872592050e-02 2.538740329886531033e-02 3.584229340379349593e-02 1.129451704420997987e-01 1.404414293509778644e-01 9.658703669944274095e-02 7.520217923321959042e-02 1.579719431480268790e-02 1.543428698908179712e-03 2.318078514095430614e-03 6.421686768765616504e-03 1.364885362344048919e-02 7.895874586286770469e-02 3.047503426919742631e-02 9.957362865393559748e-03 3.394953563388993477e-03 2.470409937285837632e-02 9.171348589613950719e-02 4.774978109197004494e-01 5.932679890250078802e-01 6.129635033921687626e-01 4.419286199015631800e-01 2.011161473543414124e-01 3.200307123200888393e-01 2.196816872549721966e-01 1.981109089263220421e-02 7.821256135856404640e-03
7.904074364974689876e-03 1.019302483542872811e-02 6.836535425007434982e-03 8.500736098609512972e-03 2.010964368338321109e-02 1.153236532301489189e-02 5.939797331221426807e-02 7.647234842510346187e-02 7.072687069389606285e-02 1.670556262641355316e-02 4.201933642232352946e-03 8.874137080606204261e-04 1.534555561643167034e-03 4.412561486099583069e-03 1.703607877530634307e-02 1.115909621401254583e-02 2.064683698555266900e-02 6.212592592100408054e-03 1.181712780085317216e-02 5.582353846731959862e-02 2.932320990004337324e-01 5.444801386412507771e-01 5.752778812865516622e-01 5.410279228419400122e-01 4.105423999396001777e-01 2.965906499192886292e-01 2.836460159182685459e-01 1.911288157011259425e-01 1.720956958105087503e-02 6.126657385364607175e-03
2.174945736792665771e-02 2.000154122236921794e-02 1.038797401273872621e-02 7.533746398312682335e-03 9.871680088774733089e-03 5.301542604986555010e-03 3.021228003897671183e-02 2.692643232337006698e-02 7.416812942259135358e-03 4.056049546688033323e-03 1.407232818876287105e-03 1.123206037282486417e-03 6.044162006698042267e-02 3.187621718297047047e-02 9.306642881583994777e-04 3.071872127267021371e-03 1.109907045626198907e-02 2.570154831171304888e-02 2.507925644940570825e-02 1.120383726240345296e-01 2.999395639100366218e-01 4.285316876418308607e-01 1.724242254350046299e-01 2.564938433149689390e-01 3.279401119214788718e-01 1.837611780597727673e-01 1.359902240463600753e-01 1.117013173378433588e-01 4.094666892489880021e-03 3.701644748158437574e-03
1.754905470400603545e-02 2.027507914479698831e-02 3.021647459756555010e-03 2.108282020174397260e-03 1.741857070749013286e-03 2.603938317238315998e-03 3.722341479156810254e-03 9.283980579848998514e-04 1.204086334261133141e-03 1.955767192680096106e-02 2.546737269566352879e-02 3.846782031551841674e-02 4.151329476111520478e-02 1.584080738298531982e-03 4.404152558984189385e-03 5.582145086849475690e-02 1.074763124534705017e-01 1.574936580634830330e-01 1.088751891280992923e-01 8.227115753035317558e-02 5.742278251248823101e-02 2.032224055173459387e-02 7.782002290901529964e-03 1.664201746710969321e-02 5.987655146848681192e-02 2.013388184994820140e-02 1.850580854456974206e-02 6.250263815264978616e-03 3.828037595094587603e-02 3.130457208468384600e-02
3.764428275220806780e-02 2.907084143786502900e-02 3.161038183871560034e-03 1.365314186230570312e-03 2.000737974821235280e-03 1.561314465949899602e-03 2.415099209913602104e-03 2.631997651129629190e-02 2.249168491588881061e-02 9.682113360789350656e-03 2.283036457380254944e-02 4.294077593756971678e-02 5.599043098230102600e-02 3.244250380553019390e-03 5.312628118195088060e-03 3.297713611640613190e-02 1.210120224525821075e-01 2.281047482450443142e-01 2.614223484110795304e-01 2.281842018280607065e-01 4.810764276729934119e-02 1.063482211526360806e-02 1.303001804648179149e-02 3.160779197482526531e-02 7.000089034775186514e-02 2.054657981584476212e-02 7.871780009181773494e-03 2.962134334638000851e-03 5.019218307109606786e-02 4.500778078216050720e-02
4.740716151221785468e-02 6.041621358958436383e-03 1.682217014552063288e-03 4.923987751014867464e-02 5.839488395230432727e-02 1.351856398886057669e-03 1.742385257763607274e-03 1.972282036594149440e-02 1.102924328495597309e-02 1.266064875262489300e-02 2.228384654924792790e-02 3.782697470742398677e-02 4.212976994487110938e-02 2.512749964376365542e-03 9.890646193583535820e-03 4.793146961815525353e-02 9.315649920987172095e-02 2.161232968897584816e-01 2.736243223993344298e-01 2.322710195770761044e-01 1.151016033856892273e-01 6.580967683337728483e-03 4.626940779639497452e-03 9.931280801269221775e-03 5.695592679976584083e-02 3.399271726043740643e-02 3.058873678292968468e-02 5.741828227842724758e-03 4.512147980796325092e-02 3.453361193931602652e-02
2.654958612672648696e-02 8.231306940857789980e-03 3.211020406460984855e-03 2.979158304080581875e-03 6.535744595068613758e-03 4.457349704257952509e-03 1.844780546737475463e-03 7.617282124965210621e-02 1.120028398566034686e-03 1.470815595043956266e-03 1.382937924696336050e-02 1.547994836092774634e-02 2.382879545737239327e-02 5.294757295035650013e-02 3.596736323640158627e-03 1.492761361709963285e-02 1.518326063514109994e-02 6.545465032203232059e-02 8.447704685744558684e-02 7.280884444474082506e-02 6.082973147083227394e-02 7.802214513720868820e-03 7.347412614466491965e-02 2.313612702788927795e-03 1.021753046046826145e-02 2.548373486848719283e-02 6.839779831086389983e-02 3.827282570260730210e-02 5.376878788795101671e-02 4.038459802920565250e-02
9.519639722364459794e-03 3.781556051349575787e-03 4.052307706830404754e-03 6.804367407810369209e-03 3.666620322831027311e-03 1.639845312123112747e-03 7.436457341500483931e-02 5.341744902343731338e-02 1.659698887055452996e-03 6.469002665403073525e-03 4.446611900683912488e-02 1.521859086281928883e-02 2.543875919087049825e-02 5.485782328255758844e-02 2.927615374996366156e-03 5.358883253953332371e-03 3.753198612647401684e-03 1.887901249642933051e-03 3.014257056773194873e-03 5.537018845596384034e-03 9.872710481449860700e-03 2.257667928476766485e-03 7.402880546401426065e-02 5.957540614246873735e-03 1.452350987269060943e-02 5.152488858447010732e-03 1.774363632177497138e-02 1.973947487230730963e-02 6.962959552715172577e-03 6.199291770319605849e-02
9.652164817204413050e-03 7.758371833628788412e-03 3.792168072024852937e-03 2.770875693021537627e-03 2.544429630738289684e-03 9.534027885718190671e-04 6.212108026599574839e-02 6.506775605465317525e-02 7.293103779115331364e-02 2.832455612570995013e-03 8.012884324702955127e-04 7.618220942243580235e-04 7.089586635388135660e-02 9.497121790915542122e-04 2.838525731073323136e-03 2.041909536705905151e-03 1.461451673080125602e-03 7.114082161440803131e-02 6.336435492469941200e-02 4.873102236074829119e-02 3.843638878932741781e-02 5.567767135716938237e-02 8.787650547556366543e-02 3.390356761687592958e-03 6.068365438023663391e-03 2.960799975397718393e-03 4.782326750110763372e-03 3.162202886896464497e-03 3.170033383687412189e-03 1.197199655400031926e-01
1.307738593460064727e-02 6.831070849485053331e-03 3.897729987812638928e-03 5.313728088986454691e-03 4.605099095199471221e-03 2.496129064493395142e-03 8.523909363972284256e-03 6.436272887229700125e-03 9.490461334284321961e-04 7.057121181942185850e-02 2.491616805279338667e-02 5.666977137296966283e-02 1.728515357294497720e-03 1.990359363806791255e-03 6.397757723618430377e-03 4.971057604713670711e-03 1.669308008735743455e-03 2.091641172207055893e-03 7.574185808964040145e-02 3.311704511992969585e-02 2.994366936995505185e-02 4.550375869038006393e-02 7.045295995116226950e-02 3.324366099912851036e-03 3.578679732587914785e-03 5.612178873503759907e-02 6.284300422530778030e-02 7.943603687025112270e-02 4.326333669054636261e-03 5.241849896561681654e-02
1.756382910875601416e-02 1.522781392481505763e-02 4.629712448535097322e-03 1.580081221386800405e-02 1.807398448941788249e-02 3.399301497857059456e-02 2.288864854258228915e-02 2.596181201031690783e-03 9.353682209858086519e-04 5.542799307618272164e-02 1.621553048432332680e-02 2.007727208094402943e-02 2.491356812029123236e-02 1.090975763023090996e-03 1.435204212142673474e-03 5.645518085181296802e-02 5.631910473367535835e-02 6.866762567922485294e-02 9.461127943505706628e-02 5.194290143906564461e-02 2.817176821887801969e-02 3.814490925767223539e-02 4.273088500346425289e-02 7.433443115486566832e-02 3.645286403136847007e-03 3.891736010470750462e-02 5.708824657551066217e-02 9.289184636549741025e-02 1.087275106111121187e-01 3.857602013211252744e-03
9.648932182125636442e-03 2.406625364571610137e-02 7.174162686535782638e-03 7.638262906704565425e-03 3.642605850559899744e-02 3.827921608038651474e-02 2.551404883663152545e-02 1.751356952335547147e-03 1.235729491779539481e-03 1.188474049898914555e-03 4.933475079782712047e-02 2.432228762228635932e-02 1.568399901833560442e-02 2.791265929549403835e-02 1.610862551216228275e-03 4.044560566057247425e-02 1.917121142827161485e-03 1.230685807618806665e-02 2.298450508393004924e-02 3.225023021471852547e-03 4.246980828244911743e-02 5.358949477237215375e-02 4.545449067857822156e-02 5.176175537497602896e-02 7.124393721667889035e-02 5.614215525924863559e-02 6.716529008650704013e-02 8.288633969891626152e-02 1.082552707079653953e-01 5.019657346961612504e-03
