1.978929066043993990e-01 1.106878064424710490e-04 2.582367295245596717e-01 1.287249718093890470e-04 2.509184268841102572e-01 2.209124982917718598e-04 2.184414083155797705e-04 5.895826827961514948e-04 1.071709198999855773e-03 4.866800809937555077e-04 2.288166239169331590e-04 1.354984875605496353e-01 8.050297936340011784e-02 1.097521478422399310e-04 1.235517463850978890e-04 8.340061296500289600e-02 9.049584436236776468e-05 1.551716092493320371e-04 1.379146159221917971e-04 2.053295025885755187e-01 1.628690817134642310e-01 2.333022828175539826e-02 1.787549720651988513e-02 7.066272415464060208e-02 1.365079346415777051e-01 1.068457320765019147e-01 4.937015352921754474e-02 4.453290619894158080e-03 4.316495148988211579e-03 5.510670290821218301e-03
1.530415317561342192e-01 1.323255758354413732e-04 2.419679763268259135e-04 1.991438253986898134e-04 1.403437367861951729e-04 6.346747839145003723e-04 3.039480472959658203e-04 3.793001274055757851e-04 2.475506696250511819e-04 2.091878322764744651e-04 1.481908085365822255e-04 7.937832922818673087e-02 1.072226799994187435e-01 2.508624303006364853e-01 1.143479359552551883e-04 2.376048974563321481e-01 8.766482149906738635e-05 2.826403011939365630e-04 2.113275033994339316e-04 6.287913936333262019e-05 1.003818281455904071e-01 2.232330733623179991e-02 4.642010675221516780e-02 4.085630008134742697e-02 3.583210926681461295e-02 4.782192618762411834e-02 1.695383144140834297e-02 4.465233520375535940e-03 6.468515704923344725e-03 6.592439754379602473e-03
7.710090786851382834e-04 7.427766247484386426e-04 1.573407872415859797e-03 1.270075425851187496e-03 2.718735466267181451e-03 2.794674843321181797e-04 1.356610988283561414e-01 1.463909774224537996e-01 9.177709855520942974e-04 2.736457921873871810e-04 7.188449772298007197e-04 4.624872251925283401e-04 1.656250637845229658e-04 2.418221079204735998e-04 1.521273605683148289e-01 1.903266674775838858e-04 1.263811077706805718e-04 2.573872353883437797e-04 8.570365110913124316e-04 1.422819280980435830e-04 6.428241707711022934e-02 1.855105017616957494e-02 2.815389724889119996e-02 9.823960100530510636e-03 5.856173733315612334e-03 3.885859865506919360e-03 3.463928685398039772e-03 2.777689961872801313e-03 4.777144594196341965e-03 5.474571131139120521e-03
3.564205666259413503e-04 9.625909675571634426e-04 2.115690346245667486e-03 1.695463384995877978e-03 7.031087521219819142e-04 2.738821077208484223e-01 2.320632462783851768e-01 1.572504720653649657e-01 9.649972444618200307e-02 3.452023296089290916e-04 2.177321438426225953e-04 4.244184851012079837e-04 1.879675713365450346e-04 1.240960309278281415e-04 1.133407198891546036e-01 8.882851896001489611e-02 1.952143840167784028e-01 1.014610035200818054e-04 7.191889223310616230e-05 6.098452291159646714e-05 1.233289185556084994e-01 4.242001076124495701e-02 1.328544681926988394e-02 2.564817387736567644e-02 4.781610745287040790e-03 3.522302817924190775e-03 3.013771922704179280e-03 2.882923811287222641e-03 5.812350592045328543e-03 6.470862001347617298e-03
2.054640931433361259e-04 6.005445579349987135e-04 1.672211922882208207e-03 6.476643904012045804e-04 3.742008632013521280e-04 1.474973336080398489e-01 2.281731228183209170e-01 1.281794442427099667e-01 5.928277077524602562e-02 8.136982970600864506e-04 1.009616897912607621e-03 8.582741021165034203e-04 1.246016872139510368e-04 1.004677057528107376e-04 1.351161526681690928e-01 5.132284964378033831e-02 1.700375224386923765e-04 9.681615828156533391e-05 1.553601845732486425e-04 8.781612895567552518e-05 5.843689450674347099e-05 7.015455808482289057e-02 1.570337494766896047e-01 4.309108695031711733e-02 8.614378662076812437e-03 4.692424064175615070e-03 3.250871144873419914e-03 3.809487658067543456e-03 5.927678409554035244e-03 2.239892747160530939e-02
2.040255408976075866e-04 2.020415190042113246e-04 9.041417922120420763e-04 7.226800231470492317e-04 2.872663578089395923e-04 8.602990472598651128e-02 1.047921211128760438e-01 1.123941082053326046e-01 1.040016948199704167e-01 1.282783618659326689e-03 1.010622656799962590e-03 5.371720472551305128e-04 1.451769599659777921e-01 4.508563059041357374e-02 3.497957342333118252e-02 5.818560939931397002e-02 9.741906274884765929e-05 8.393176523466004679e-02 8.163220984468395425e-05 2.772670640689588921e-04 3.264518430123971486e-04 1.866131835974783903e-04 2.007941185562730213e-01 2.601217821473310321e-02 1.290994394373468426e-02 1.228194728360316665e-02 7.617211063608986601e-03 5.330730310028296108e-03 6.990769851276562238e-03 1.298223963590331223e-02
7.416706597350924968e-02 1.204458864177090360e-01 1.273723166349312597e-01 2.283482198514311578e-04 1.092808889377477497e-04 1.852888487646313104e-04 2.910724892896285831e-04 1.714552049090452344e-04 2.094360657370165435e-04 2.498231207199346285e-04 1.958441603929422586e-04 1.825886952570920929e-01 7.533692605518943486e-02 2.995911832197250407e-02 1.604033280351416235e-02 2.900699017831347842e-02 1.741719862274807851e-01 8.398253170340527762e-02 1.368186740401779243e-04 1.845152065051775729e-04 8.206058165448270009e-05 7.370992494370437464e-02 3.000136975932436723e-02 2.366008775804380806e-02 8.821229924400385974e-03 9.125438071925895400e-03 7.940933047230890052e-03 7.020520626828698901e-03 8.134692144874640721e-03 1.998469285966728015e-02
1.539591262686005324e-01 1.121822700494067503e-04 1.698160074455819235e-01 1.407316041031853677e-04 2.146851280137631593e-04 2.437983391458757565e-04 2.205298420227531876e-04 2.117678985348280245e-04 1.728744938401095919e-04 2.400693634787772202e-01 9.537149824875933157e-02 2.911304857592286743e-01 6.207922084511863225e-02 2.097659497074201226e-02 2.181096025012111556e-02 4.089429534088745433e-02 1.234804255906448692e-04 1.957120248814474468e-04 1.702768960421796303e-04 1.190677974124236798e-04 1.059513622512298497e-01 5.170359361539870330e-02 1.800142023949232936e-02 1.416291033235298966e-02 6.691722119999585563e-03 7.051940341552796060e-03 1.088066639486862455e-02 1.403343604154522195e-02 1.437018384497141567e-02 4.363591707190174473e-02
1.709167308460033058e-04 2.579722387991198462e-01 1.538312336529977786e-01 3.728485862124304912e-04 2.407422881945244311e-04 2.539151815953433200e-01 3.315319282433910951e-04 1.491102930328360473e-04 1.252464962350852498e-04 1.264432083825035359e-04 2.758119660313219645e-01 1.535240017456762380e-04 3.372680421003890357e-04 2.202252481861758206e-04 7.919452569637737416e-02 7.344411050356255966e-02 1.261775187187817629e-04 3.765491835709119462e-04 3.651485006913258915e-04 1.764920433049658732e-01 2.888058390441131801e-02 2.299504888895962176e-02 2.231570029176972378e-02 1.381799406114678046e-02 8.011381158282187415e-03 1.234536042149633056e-02 4.642934696608366774e-02 9.645742366723709937e-02 6.560399151138391694e-05 1.468382883869386868e-01
2.900478667413860026e-04 1.880304261244347566e-04 3.015611939779141298e-04 2.803338127760912906e-04 2.443686107029694929e-04 1.162359692925818144e-01 2.213286672819912107e-04 2.349360852305100722e-01 9.983306825096258108e-02 3.713225303275014683e-02 2.172683901855849129e-04 2.134184706002181320e-04 4.588402089814915810e-04 5.096137662982701873e-04 2.484365317822441531e-04 2.754732356518386290e-04 1.449717254457916866e-03 1.468476029012712831e-03 5.760580756291353932e-04 2.500663205180143249e-04 3.592553825787463823e-02 1.749482132960322039e-02 1.831183737813827511e-02 1.933972585366408592e-02 1.056003192551330759e-02 1.361461349018653830e-02 1.284544411444290823e-01 2.283359732635495687e-01 7.331733644020997718e-05 7.995048038919494449e-02
2.405308266081062664e-04 2.705251042448720833e-01 2.825063017032801113e-04 2.412294603223212532e-04 3.061584889574777021e-04 6.720575728937075444e-02 5.705154341346664604e-02 5.012591810067113657e-02 3.172283961306175681e-02 1.073591650880355134e-04 1.706265098011060201e-03 2.865530533047013460e-03 6.039962108581457476e-03 3.087348832735901244e-03 5.880781056677731591e-04 1.174674208723026393e-03 2.155871475892749863e-03 5.866609284802767367e-04 1.375840068425934434e-04 7.118868886142998287e-02 2.481792527232799805e-02 1.759880186071571817e-02 2.124036726303999215e-02 2.905746983603046257e-02 3.057889672924172381e-02 1.651294946856382562e-02 2.616294497264323032e-02 2.165750222652810392e-02 2.001385780126598360e-02 1.478000542246194274e-02
9.812061330839190465e-02 5.770633879718590348e-02 2.274523572625838052e-04 2.255101334049370004e-04 1.769854053730819719e-04 9.722469980395911926e-02 3.816522936298406138e-02 2.469945492110439678e-02 3.077844198670507542e-02 2.072672085333344190e-04 5.112157580953157745e-04 3.378454402568378725e-03 6.173178188712356157e-03 3.294096035791985524e-03 1.223457540254864126e-03 1.405352313486077061e-03 1.556383020435013432e-03 9.209196294147881622e-04 2.270564431357067071e-04 1.539299714231725791e-01 2.314452574496501935e-02 2.084936172842417890e-02 2.391145282079758239e-02 4.263607812548735054e-02 4.067745965774494793e-02 2.895836535259348893e-02 2.221270724420939396e-02 2.055431902053344792e-02 2.239871791645458091e-02 2.439993855193742234e-02
1.881667588718842835e-02 4.855674470566721801e-02 1.209211223175687966e-01 1.497423855050828161e-04 2.340679495664018117e-01 7.525970414525753882e-02 3.879382250703285878e-02 3.263724908302816086e-02 4.140684266637148503e-02 1.020652267270016677e-04 9.894587560484099931e-02 1.074019237172936080e-03 4.586232375383758782e-03 1.996445175001259481e-03 6.390302968012503103e-04 7.481233192790788218e-04 2.814692991304201526e-04 4.209308127224043188e-04 4.879041689152906051e-04 1.850251281608512736e-04 2.794875640053799681e-02 2.541210814215688965e-02 3.101971805113222513e-02 5.363069667165813736e-02 7.070180612215641591e-02 6.687596008312654550e-02 4.987368026037062446e-02 4.597342423366949232e-02 3.542774501204472987e-02 2.765575930769426788e-02
1.484310810880477838e-02 4.267869115893380139e-02 7.995040591163456167e-02 5.966907851090434700e-02 3.609621013580979754e-02 1.444843992242136610e-01 1.878166549908049667e-04 1.517903035347992191e-04 5.979565650100568397e-02 1.862083116388470183e-02 7.542680951626391794e-02 1.728087799499178183e-04 2.069006570510826485e-03 2.825559611832303628e-03 3.042210114054261314e-03 4.126316964942869196e-03 3.841387670996845253e-03 2.576854875092109837e-03 7.255397927374703307e-03 3.481115270653461786e-03 2.936715207992701519e-04 1.771869137749567669e-01 1.350852701733559202e-01 1.681498015235610970e-04 3.978092083435337762e-04 3.763745527317890072e-04 1.037174857310500234e-03 3.382435762501892289e-04 5.775262964954816503e-02 5.642620836609607560e-02
1.361427777239243228e-02 1.372813953156982493e-02 3.874779748844687371e-02 1.176167141051564027e-04 1.091622849127620587e-01 2.593522571574218699e-02 1.242195849350303551e-04 3.485179114292278365e-04 2.289657436754032418e-04 7.505913454118079420e-02 1.624549928605254490e-01 8.420163856576164205e-04 1.801506914349893570e-03 2.305892969614281585e-03 2.098913801141742783e-03 2.548433813374466426e-03 4.537540287420474203e-03 8.198742872660000000e-03 8.728899323754297709e-03 7.191637101189688429e-03 3.177153648448013327e-04 3.420586754669346745e-04 3.093817414713181122e-04 9.913180063027989247e-04 1.444895975101645339e-03 7.453298335045806765e-03 7.507536173353814360e-03 1.511736328425553099e-03 6.658067714770271595e-02 4.034888181475246305e-02
1.219866946532858348e-02 1.340158963425417890e-02 3.131429634328599526e-02 3.515943709445695092e-02 2.358241574456001327e-02 2.710344372704770119e-02 1.936707412940081585e-01 1.881058611532482002e-04 3.875530278486508020e-04 1.398130637793047249e-04 1.450137538146817795e-04 1.258075875085884335e-04 9.821765045065207304e-04 2.021310645640700312e-03 1.912001304536162759e-03 2.953614317246722187e-03 5.367077796143987153e-03 6.886890974948644065e-03 4.213080484663298333e-03 9.712415365794570482e-04 6.066085425532586305e-04 4.315124971216946319e-03 6.462579672081066560e-03 1.103132083035086863e-02 1.041819746777570763e-02 1.356122717529526650e-02 1.089175161277707374e-02 3.117250836551526197e-03 1.025699009022586206e-01 4.671377673079359777e-02
1.516366689766546899e-02 1.776242876999682002e-02 1.780914813237400793e-02 1.717336903967418144e-02 2.641840650094047158e-02 5.550713439798345139e-02 1.086181252793110312e-03 3.656303323206326790e-03 1.797664616564150462e-03 3.062073630503052771e-04 2.247803769766319303e-04 3.430854419816547519e-04 6.778008965965108979e-04 1.019038672918937041e-03 1.364201151342686645e-03 2.470433067237294469e-03 5.649561878288101094e-03 6.111161673629904832e-03 3.102304878820552961e-03 1.132362664401031843e-03 5.083679127438070315e-03 9.551621860150221605e-03 1.268757702819546702e-02 1.321123546807538573e-02 1.162140286129788661e-02 9.962524838503530877e-03 1.461252696701409101e-02 2.552858408323482528e-03 1.497822309230871229e-01 6.403982736201907500e-02
3.723869724074264920e-02 2.967386349542927917e-02 1.567761973811353932e-02 2.488445861668997505e-02 1.003040043035489660e-04 5.085747885127488285e-04 2.884366297904060114e-03 2.379817707770790977e-03 2.366861951975302893e-03 1.176508805119723866e-03 4.237251624268144161e-04 1.106171786058467209e-04 1.079352303167314551e-04 2.848378358272691288e-04 6.518057022358807575e-04 3.033157403695287135e-03 3.424516321913606727e-03 4.341844202300840228e-03 8.144582606841068969e-04 1.533549642031677325e-03 5.690829723921238606e-03 1.283912707510147071e-02 1.653585917430427932e-02 1.733314663038435302e-02 1.419817559921075778e-02 1.341175062444097468e-02 1.220425694846275985e-02 9.676670305769033420e-03 4.294237543812058438e-04 2.831015000550440972e-04
1.705547548113340445e-02 4.774297731464320627e-02 8.981668951584563521e-02 1.880223051023980545e-04 4.012887060613262919e-04 5.598937052626814809e-04 1.763581374668400214e-03 2.183362170611032136e-03 1.489815039753911337e-03 1.159035730616344434e-03 2.421442885974734111e-04 9.834622503087148138e-02 1.486579347018711916e-01 1.060337717320339015e-04 2.375840957374256851e-04 1.442152702589700542e-03 5.894095825574255246e-04 2.032518209756311147e-04 1.656889752305282792e-01 5.560057430058814709e-04 2.172571979451505889e-03 1.188472966865612886e-02 1.548210652845418561e-02 1.659851279383375844e-02 1.231574941344329432e-02 5.742380523306011425e-03 9.287083886636422064e-03 6.372274814208051495e-03 5.743937179046911803e-04 3.890759559134125967e-01
1.470922397813741525e-04 1.820459096384360366e-04 1.175316488865912521e-04 1.397059123418479621e-04 3.138030571400403433e-04 1.741887505140648021e-04 8.743961343536730928e-04 1.094126622957750875e-03 9.856432911363767480e-04 2.356469167076370459e-04 5.988085733042267409e-05 5.830172299316829787e-02 1.009773482073752643e-01 7.201403871567831950e-05 2.999080893390475419e-04 2.110210923496392047e-04 4.106198465433650636e-04 1.293636978269802431e-04 2.568624820437267748e-04 1.262576786356679488e-03 6.878232968419959424e-03 1.321856330873697957e-02 1.443092892728551832e-02 1.426995929624112064e-02 1.140999553528618086e-02 8.638383893710119277e-03 8.549928943981549220e-03 5.758998109251636799e-03 5.183410737726482174e-04 3.015025887191587484e-01
4.207889348979452029e-04 3.664430070572320111e-04 1.808903079217630500e-04 1.237339044940003981e-04 1.518112972211988116e-04 7.706305766556634999e-05 4.163607518800596283e-04 3.504428255824160328e-04 9.191392085146045865e-05 5.189070763315762973e-05 9.688278335935994467e-02 7.654441492896639498e-02 4.551811968406127562e-02 2.504827704037121405e-02 6.451861451286006188e-02 2.152815977525330826e-01 2.263563155850911940e-04 5.444725883157082707e-04 5.506022777359985583e-04 2.534853253626916884e-03 6.940568897668666221e-03 1.011229046147502086e-02 4.137404919292722583e-03 6.580534896495965867e-03 9.079023928607174096e-03 5.449983702556069134e-03 4.240616565245409510e-03 3.481973760836074884e-03 1.981371417467325258e-01 1.807787496180215947e-01
3.370083131961886251e-04 3.676984415587481857e-04 2.039098832845124831e-01 1.508369287995569297e-01 1.327352837343064307e-01 3.733863675629928657e-05 4.981636270445964567e-05 7.072405043370795508e-02 9.097937320879961876e-02 1.420403744633600557e-02 1.857374834974673955e-02 2.820184762023262778e-02 3.131385016324395726e-02 1.121988872113758445e-01 7.839287528638024481e-05 1.105033369223561070e-03 2.213248670870262679e-03 3.356225811665497841e-03 2.395725722953582007e-03 1.858896862760464272e-03 1.321528718306033126e-03 4.744189932288625424e-04 1.834669752471195469e-04 4.219950777364444390e-04 1.654469989587043595e-03 6.021109885519612031e-04 5.874066882578437903e-04 2.975656649088214145e-01 3.416387207222668088e-02 2.795777070269220982e-02
6.878929625034294493e-04 5.043839606901170426e-04 2.101571212437399194e-01 9.671223055349786879e-02 1.516507824842083241e-01 1.200451395189045672e-01 3.281121900268720915e-05 1.963844701660477643e-02 1.642267452277886008e-02 7.097534438805094652e-03 1.680292981718770062e-02 3.173050299713058714e-02 4.234572346753033567e-02 5.123263689798961574e-05 9.313811122250166932e-05 6.396851424533553983e-04 2.448771130350286315e-03 4.795044943707799448e-03 5.695829445761938122e-03 5.146948687364170071e-03 1.120812407353939319e-03 2.548594996284499615e-04 3.199559618364982197e-04 8.201262479188280597e-04 1.931736645068685186e-03 6.012920590083062865e-04 3.575006458201727688e-01 1.387294417822640402e-01 4.384430858999949221e-02 3.942568508831482965e-02
8.228167845530785134e-04 1.001741634357500749e-04 1.108198084867528938e-01 3.861269548552381803e-02 4.681483956819454395e-02 1.038548960163307305e-01 1.334181254147907558e-01 1.485114171052282633e-02 8.130385673245893452e-03 9.367983236722221552e-03 1.654769927325775228e-02 2.818309340517463624e-02 3.195157744709890835e-02 1.771816531591476895e-01 1.699672227936914351e-04 9.046039516530957622e-04 1.843728581062387649e-03 4.467286287711732910e-03 5.896184719422071022e-03 5.226392515825565264e-03 2.711350382237180667e-03 1.615214964226474017e-04 2.306760500698447902e-01 2.622261482230030510e-04 1.558924002385730879e-03 9.638489806949796564e-04 8.956272733828762010e-04 2.511144711452720224e-01 3.863013754102219421e-02 2.976315821674905063e-02
4.368547797034697325e-04 1.300255885837334853e-04 2.106820627764315612e-01 2.083067104386242818e-01 1.012182818388118429e-04 6.596723685167232224e-05 1.419392992073326143e-01 5.792380601518952454e-02 8.626820861998515944e-02 1.117705120777394701e-01 1.035935673426617055e-02 1.162566494152486932e-02 1.811579721001541771e-02 4.102828665089720134e-02 6.030765348044486349e-05 2.720474797584625367e-04 2.923689781150749269e-04 1.326774917352030675e-03 1.796381741295756873e-03 1.630905493475846976e-03 1.445300208292818597e-03 1.954345409061843716e-04 6.018503641901777612e-02 1.141930936457901252e-01 2.755714723106231288e-04 6.944641320121129353e-04 1.893406011871562149e-03 1.094496710918816361e-03 4.525782132173813976e-02 3.431302369999140317e-02
1.552222282590937812e-04 5.924183798220361737e-05 6.326186236464838948e-05 1.057783632221215991e-04 5.677826702429147638e-05 1.265065185292435501e-01 5.808332250865408386e-02 4.070029367401988007e-02 1.282155618511814921e-01 8.246185266750185369e-05 3.338074099215095070e-02 1.145308806246928685e-02 1.935309522410968291e-02 4.242489891394064794e-02 2.008122186032200163e-01 9.654675541336321730e-05 2.425878816788444303e-01 1.185706000275338068e-01 1.844877255527407334e-01 1.231843959484175857e-04 2.316600870495709626e-04 1.223069223104819581e-01 6.079170900651234555e-02 3.064643762625545720e-01 3.834702065707971562e-04 2.468561414509081453e-01 4.793071338756909119e-04 5.531556124716626322e-04 3.402399263443868227e-01 5.239171330637708290e-02
1.572930185659860152e-04 1.215381666447800616e-04 5.919922062345575007e-05 1.938808528554275545e-01 1.930102046981271025e-01 7.355048711867413769e-02 4.850884742423475227e-02 4.956510372680009852e-02 5.446006058360870761e-02 2.160479965905729716e-01 6.056891492126482285e-02 5.718803968018744410e-02 5.394426859265867569e-02 6.720099810187914191e-02 1.946197398509435517e-01 1.363626302463313289e-01 9.441785734367297289e-02 5.780144831440599262e-02 5.193563613244366051e-02 4.013832014324554553e-02 3.165669299436556922e-02 4.583586609320537686e-02 7.228772499791784323e-02 1.797732490127652294e-01 3.144414476013823734e-01 1.500904374221317117e-01 2.394298240987595139e-01 1.546335040304953612e-01 1.561731062154401717e-01 1.011865087127921392e-01
2.129903460621644716e-04 1.070093731258924116e-04 6.084575948003400226e-05 8.259684795124106306e-05 7.130369931136335199e-05 1.925578212410858636e-01 1.188378801250235619e-04 8.426909870126885371e-05 7.329729760531909777e-02 5.283367523443047165e-02 1.870553262031848449e-02 4.264997907903138319e-02 1.265831903056804930e-01 1.407907207312998343e-01 1.066678402697179281e-04 8.968107103749179071e-05 1.078105149206271957e-01 1.312768264200769863e-01 6.208562049827832940e-02 2.727662234702899965e-02 2.466424381785486605e-02 3.747904723793027415e-02 5.801865970060697542e-02 1.832071542938136510e-01 1.905085622102017928e-01 4.606081096099726158e-02 5.164137971629059048e-02 6.587632069072471563e-02 2.112663000824415716e-01 4.425719120437529575e-02
2.863973890550388659e-04 2.388393093759986368e-04 7.234037353642505978e-05 2.457637321060629184e-04 2.799601636113556880e-04 5.040510659820045172e-04 3.206167512303930182e-04 2.012577885731592353e-01 7.255401514939008312e-02 4.162607810764389765e-02 1.219897388896231186e-02 1.512963958465058170e-02 1.897349961999530987e-02 7.708543974162421208e-02 9.825985721158056463e-02 4.506135140907156778e-02 4.535359099760297857e-02 5.580324964989871045e-02 7.757125079635605880e-02 4.277382256899418117e-02 2.320228526778526923e-02 3.141646038815900516e-02 3.519391717654426349e-02 6.121885168073870620e-02 1.984353435908544072e-01 3.195583510133146593e-02 4.691684684070802219e-02 7.701779780958815935e-02 9.086086832123699275e-02 1.861943639453730592e-01
1.589685692012145636e-04 3.806754047489822922e-04 1.128401813874934555e-04 1.193768680661547686e-04 5.655068398747365062e-04 5.806082313435726979e-04 3.758185096123646085e-04 1.429373247522132129e-01 1.016065507364180831e-01 9.472065243618031649e-02 3.840611521740307233e-02 1.879187413570539839e-02 1.211252929235159641e-02 2.162997160449799811e-02 1.058873341870409518e-01 3.156172712843187400e-02 1.162447279800693234e-01 2.557979938385079540e-04 5.104970536470431353e-04 1.788433195971627088e-01 3.493313093327279212e-02 4.408026435251492792e-02 3.738941063618300004e-02 4.246902530259746150e-02 5.825842365899387698e-02 4.574136663990899243e-02 5.461920394002642287e-02 6.760896952696116013e-02 8.845793555115152862e-02 2.228282939219341507e-01
