2.708802962480696053e+01 2.083033854148746400e+01 3.230008496226057702e+01 1.990000241681296700e+01 2.916019919649413339e+01 2.990512158514076191e+01 2.832341965652817706e+01 7.789851582558628706e+01 1.438776634578831874e+02 6.486097123602054637e+01 3.319627333037977479e+01 1.777339522400038163e+01 1.130043153839210568e+01 1.958115143192406293e+01 2.359660050039789780e+01 1.296233644847714217e+01 1.964237080913722977e+01 3.356623082738560981e+01 3.394326117883562688e+01 4.475981691175705635e+01 3.829682005624497521e+01 5.680929595246768216e+00 4.430299395884253144e+00 1.801064536844511110e+01 3.582369258034212578e+01 2.893305563246783407e+01 1.379082365499955287e+01 1.234335238805385648e+00 1.197577170717234907e+00 1.537183820788943445e+00
1.762917937285820003e+01 2.237607987089725725e+01 3.441375563763357803e+01 2.907585771358670002e+01 1.880184900351060406e+01 8.705462649224520533e+01 4.128590610504151925e+01 5.310259073269632779e+01 3.474435206685546973e+01 2.932509959844462344e+01 2.287621220342519734e+01 9.326617078838221886e+00 1.363350480578957935e+01 3.330262995033284312e+01 2.423378174887764658e+01 3.618802003024900671e+01 1.982129546160794931e+01 6.443481170868993502e+01 5.463665745185282674e+01 1.861313555217763493e+01 2.352649641296446958e+01 5.618805573234928907e+00 1.198701021310159831e+01 1.097995679870802377e+01 1.006770416667686163e+01 1.409197543314493117e+01 5.233071954539144421e+00 1.325988550446558278e+00 1.869388184749689152e+00 1.859372473605392928e+00
9.267323732631491850e+01 9.768490483432373139e+01 2.011469459784871674e+02 1.636007067644468975e+02 3.572894868119550438e+02 4.249598732454948902e+01 1.582173097899149283e+01 1.690733666326693196e+01 1.393006868708799857e+02 4.001121280562219340e+01 1.098577471769440166e+02 7.781466117995300635e+01 3.198880546852096174e+01 5.194592544619486318e+01 2.217847908976169435e+01 4.592752236570261459e+01 3.075056352570142693e+01 6.337588143264899543e+01 2.277272087234279638e+02 4.324516207430538373e+01 1.522810012054258522e+01 4.825728202322867588e+00 7.598419750244454818e+00 2.771188937625538973e+00 1.743014254292024612e+00 1.229259616254831267e+00 1.175214771416237980e+00 8.821734982951007220e-01 1.436765100810102336e+00 1.557591292523549109e+00
4.281040069460325270e+01 1.281746638523748061e+02 2.814302130291297317e+02 2.273930398233893584e+02 9.848879011600530475e+01 3.165438154125376258e+01 3.134050624082969350e+01 1.965877696127076391e+01 1.099607348205849888e+01 4.770245869022065222e+01 3.035150056854103440e+01 6.146031487568978946e+01 3.260783827577409255e+01 2.702569862845579252e+01 1.648790729943328159e+01 1.450434446567817304e+01 3.238331094242904840e+01 2.306124583449583554e+01 1.732126330402414283e+01 1.643620864452758212e+01 2.699664648242544374e+01 1.028083809050405506e+01 3.467720374007409401e+00 7.086113826515314074e+00 1.392293347499224287e+00 1.089671613027098251e+00 1.006179979059129925e+00 8.957792635963273131e-01 1.701871608657603119e+00 1.770250820524548407e+00
2.545635861059975369e+01 8.324142828337870981e+01 2.323697136305835897e+02 9.009545240469259397e+01 5.564655037261135817e+01 1.861001377797855483e+01 3.208010795518391944e+01 1.805033512368057558e+01 6.776667513844472523e+00 1.050541447050021020e+02 1.269814333623094456e+02 1.107506546588874130e+02 1.966731287133885075e+01 3.868907311283485484e+01 2.069774445727442114e+01 8.486781187552688621e+00 3.584952470704266148e+01 2.006664736524556503e+01 3.340735366726802624e+01 2.038366038894339738e+01 1.509517638304102505e+01 1.437183263137304401e+01 3.603787015011739214e+01 1.127195486010211845e+01 2.388823797800162740e+00 1.388494529555067025e+00 1.038847070802404460e+00 1.126490765454725818e+00 1.642812477393998716e+00 5.767470722366898173e+00
2.857354120670076725e+01 3.201507567240732044e+01 1.377282316998460487e+02 1.071621377119664373e+02 4.404260138904994903e+01 1.069015018247133675e+01 1.335153021803341034e+01 1.409153615692705941e+01 1.151533650791272478e+01 1.536950168532048338e+02 1.191160642356612698e+02 6.496142541108403634e+01 1.682255282934715979e+01 6.359736067865220832e+00 5.443650673229946335e+00 9.444230187209011973e+00 2.002419289976792882e+01 1.332810567755919351e+01 1.601167414348260110e+01 5.593871268340798508e+01 7.391616562147012814e+01 5.046010974031784002e+01 4.299796337022185355e+01 6.405097192879491530e+00 3.418794532862591495e+00 3.488652613217257947e+00 2.344382100787876233e+00 1.510046695762190083e+00 1.849458795852245263e+00 3.169506260458759606e+00
1.007688733999388297e+01 1.582456404838918651e+01 1.574038717392001985e+01 3.658385625126442164e+01 1.654865659287223423e+01 2.826966453113832145e+01 4.356165200970960427e+01 2.403973400925638870e+01 2.828081047415398430e+01 3.104886492172224166e+01 2.529971048336532391e+01 2.007096240293883582e+01 9.243407425746926975e+00 4.302326225899662404e+00 2.535105355366004787e+00 4.600321105224576712e+00 2.685973533981948691e+01 1.239068417832484670e+01 2.413997057926899714e+01 3.430339087650525443e+01 1.751556617304765240e+01 1.322423557632569313e+01 6.079536852718076645e+00 5.543012845271801048e+00 2.233898026757438871e+00 2.496923914708430114e+00 2.366129549311453140e+00 1.909568380649258046e+00 2.046723320041775374e+00 4.622043230102751643e+00
2.050647798769831454e+01 3.890156514924782982e+01 2.183892384131073783e+01 2.129284752177775886e+01 3.050798177258074517e+01 3.426042059106077886e+01 3.003878245281232040e+01 2.693027627276750025e+01 2.282104101396683760e+01 2.810418797599125895e+01 1.171896600801489718e+01 3.651127189210663460e+01 7.897630133090895121e+00 2.823781589173407269e+00 3.198757889058676085e+00 6.093331935792091869e+00 1.990114160662099962e+01 3.133613996017130177e+01 2.771461598367223900e+01 2.114184439582666997e+01 1.783591631884026185e+01 1.002808445985821528e+01 3.867219044596478028e+00 3.241657036015257898e+00 1.623170050098987183e+00 1.818007184300389545e+00 2.999644891216118214e+00 3.411993165171204989e+00 3.233697351518191265e+00 8.996000390037812267e+00
2.880848197403267363e+01 3.136784010732839079e+01 1.851512493009323279e+01 5.100305825018776318e+01 3.263392419799760091e+01 2.878087898949841872e+01 4.854343873639996332e+01 2.152237717918393756e+01 1.952434163449981597e+01 1.957802221057963976e+01 3.653394389411949561e+01 2.237326969995501358e+01 4.370957936723477388e+01 2.686749061406464989e+01 1.047731274091760234e+01 9.046301651445729064e+00 1.658722202027830406e+01 5.110112064907323770e+01 5.396748522890938915e+01 2.396387762897292717e+01 4.650571394163983463e+00 4.513967085566217285e+00 4.752136936719223215e+00 3.097553291948240695e+00 1.874214365252502512e+00 3.023475400334252772e+00 1.201092477989376484e+01 2.164717689091357045e+01 1.968514082214412397e+01 2.754642058913365332e+01
3.760301197294610631e+01 2.548981878278187807e+01 4.085301077815543636e+01 3.367328772284618310e+01 3.174776431761087281e+01 1.355001105075655587e+01 3.494466784842539653e+01 2.910826462590069852e+01 1.355041630944339737e+01 4.907853172913417161e+00 3.098784740718014774e+01 2.902045267972988896e+01 5.598851376499059995e+01 6.049711806766781308e+01 2.874703143687945328e+01 3.131248281877622119e+01 1.711223432415235663e+02 1.834793317520017126e+02 8.007750708392603656e+01 3.945455859081530292e+01 5.804633769534203402e+00 3.403894975614658591e+00 3.850335893144784194e+00 4.240955982442948802e+00 2.395713642137205834e+00 3.188549711400396891e+00 3.100367615496929830e+01 4.772243654380765321e+01 1.897048487697756869e+01 1.405089412442788444e+01
3.182641116940146020e+01 3.105851111109570084e+01 3.444888603501186708e+01 2.742123578040340348e+01 3.904579542253095070e+01 8.296743296903951403e+00 7.933078130115953641e+00 7.167776099269255852e+00 4.923168517432864988e+00 3.975150689360164336e+01 2.391497584581760805e+02 3.877273201543811183e+02 7.874039857642561628e+02 3.745388695141719495e+02 6.679172334787301679e+01 1.276063340613127650e+02 2.422764465827439153e+02 6.900410112369074511e+01 1.780044406610042884e+01 9.512035381229175357e+00 3.862871433025555135e+00 3.248608794886721718e+00 4.184389962268040719e+00 5.890726035256450999e+00 6.346820433636481518e+00 3.513016893572999955e+00 5.684867013487910015e+00 4.212443810525852150e+00 3.627326406774483925e+00 2.506296684301017041e+00
1.340091601595679549e+01 7.348533029036746100e+00 3.218038570660881703e+01 3.086466349820151578e+01 2.546087369193341132e+01 1.314734494984266888e+01 6.016650537223302564e+00 4.119893758682080076e+00 5.050884917223318560e+00 3.361706594431446149e+01 7.712684821641099120e+01 4.894566591988335063e+02 8.520641074466504961e+02 4.203960243681090674e+02 1.446018970104775860e+02 1.563099838063452012e+02 1.719077649199907114e+02 1.017294354290900458e+02 2.652595726235507811e+01 2.079944460871881518e+01 3.527037913602712571e+00 3.460030809267868435e+00 4.109112490423876274e+00 7.393683809089421466e+00 7.077244195986896358e+00 5.091275852357577847e+00 3.944073301412622357e+00 3.489077072586729500e+00 3.689609336513369087e+00 3.881737916630256358e+00
3.042185079376910295e+00 7.326810454895494651e+00 1.664395148234403621e+01 2.602555368220474463e+01 3.141969994020878687e+01 1.087819441337775217e+01 6.051621151798054932e+00 5.344303464267921910e+00 7.019397193987693129e+00 1.769511222466410771e+01 1.401733805800251886e+01 1.656495047379801804e+02 6.657123453082774631e+02 2.676065042857974277e+02 7.917486428626426687e+01 8.659211347846897411e+01 3.111230079650972868e+01 4.468548387594721305e+01 5.162140753144534244e+01 1.955095435382840208e+01 3.447450322935228684e+00 3.622155704934623799e+00 4.579299822492686189e+00 7.666061058549838769e+00 9.797029499708566291e+00 8.779149900191622891e+00 6.538573266242212689e+00 5.974012346728425626e+00 4.919373352552597112e+00 3.965662735308756126e+00
2.573824928751430985e+00 7.320227345226335558e+00 1.289475660725233830e+01 9.331630748165416378e+00 5.600535841865658782e+00 2.255046983622253265e+01 3.255825301444846076e+01 2.693896269415002109e+01 1.026216844635803760e+01 3.264740806874215640e+00 1.191258095543283169e+01 2.914728830427558037e+01 3.200191963304370688e+02 3.992436745425184199e+02 3.952693019533592746e+02 4.983241705999168971e+02 4.263919751408358252e+02 2.646031652433088084e+02 6.941910309739602098e+02 3.141240991746328177e+02 2.706540853825449489e+01 2.178217638477077855e+01 1.647767866786325897e+01 3.955358612909417104e+01 3.487020803923860512e+01 3.056266521585116891e+01 8.258485203298933186e+01 2.783279414151316189e+01 6.605381019760100614e+00 7.355122085745016136e+00
2.391610606331499245e+00 2.418994665631980290e+00 6.636650406238176814e+00 4.994712072245538081e+01 1.841956405727765045e+01 4.224840185881704180e+00 2.082763165245514969e+01 5.869142460719093890e+01 4.310047675953637736e+01 1.278618989687366536e+01 2.658972331658685562e+01 1.520307364698890069e+02 3.048392554817465339e+02 3.552302754013419417e+02 2.963260984436080321e+02 3.323647361571676697e+02 5.297200192618632855e+02 8.591762503633353845e+02 8.260625442854800440e+02 6.228513181650159822e+02 2.714977872994952435e+01 2.882393882061378321e+01 2.639214933247754047e+01 7.798155167059425708e+01 1.061362604777839636e+02 5.154721321577757180e+02 5.102605592042673379e+02 1.052989949412473436e+02 6.657650922105280422e+00 4.892162899511902197e+00
2.172325774636760354e+00 2.401567205707526131e+00 5.489715868520857356e+00 6.123520024562562725e+00 4.147779917317068410e+00 4.495193361341016214e+00 2.798660001646078754e+01 3.108296814413742482e+01 6.824979517264883100e+01 2.564405919014156154e+01 2.746244551686515933e+01 2.474299172860724738e+01 1.856263387618264460e+02 3.440637740733836836e+02 2.953597249599197312e+02 4.183775493153598291e+02 6.642518271390381415e+02 7.443612747537480345e+02 4.001899001808046137e+02 8.274506017987152973e+01 4.879839279496807336e+01 3.308433142362683839e+02 4.782383056219147761e+02 7.720456537393679355e+02 6.953217048564333709e+02 8.826809348153738028e+02 6.941284749155153122e+02 2.022161372450490830e+02 9.555880916969931249e+00 5.335352257498206185e+00
2.752329298566467131e+00 3.231788538266023192e+00 3.196345658338710649e+00 3.046000406608805999e+00 4.532993009883631075e+00 8.408624239327085803e+00 1.780255607552136325e+02 6.173656834660439472e+02 3.119776306870552958e+02 5.560992276835433756e+01 4.373518410843558968e+01 7.333085347514173691e+01 1.438168126096264814e+02 1.928871554693448331e+02 2.333398394611540141e+02 3.857211165457081847e+02 7.470869041273832636e+02 6.808814121904529202e+02 2.953977713756900698e+02 9.507499848024336586e+01 3.999378885466170459e+02 7.103940157896767005e+02 8.957802372263045072e+02 8.750331819168512766e+02 7.322621457849543276e+02 6.123834568805907566e+02 8.884884296805075792e+02 1.562833139162063389e+02 1.239736987773028432e+01 6.461012616143676723e+00
6.819216340371403007e+00 5.462929320068724337e+00 2.747010683796300867e+00 4.108070032952049644e+00 1.773911843255625342e+01 9.007253045943474490e+01 5.142211808247768658e+02 4.349270201145439501e+02 4.458703451123625996e+02 2.311406649786302694e+02 9.095823852557242617e+01 2.754240660395950613e+01 2.680443422922932228e+01 6.135035173747156279e+01 1.233325033324796323e+02 5.220992204625662225e+02 4.826987626758496503e+02 5.020163674598538250e+02 7.889635972954548038e+01 1.291048091595333460e+02 4.393205880889144623e+02 9.209296998656773212e+02 1.105691661594940342e+03 1.077744108784771470e+03 8.380790942421801901e+02 7.810851129301316860e+02 7.145857567761493101e+02 5.646851643392645883e+02 2.744569899745753716e+01 1.849026586889431911e+01
2.834853463863022505e+00 7.978383245532103984e+00 1.474524512581352553e+01 3.407150898521363303e+01 7.864132070195515212e+01 1.155663795679955967e+02 3.758726253483817459e+02 4.880775750695177067e+02 3.495705744964238875e+02 2.784678476424950304e+02 6.225894355368548361e+01 1.964604966765813288e+01 2.898195112233876714e+01 2.515545080256829280e+01 4.734430107154415168e+01 2.565764310195967255e+02 8.664238411659820827e+01 2.478918272305217840e+01 1.826463463748262228e+01 5.003248026088548528e+01 1.798220427189518205e+02 9.122297003743900632e+02 1.103591343280276305e+03 1.071237436220339305e+03 7.272862512213132504e+02 3.193968739281820035e+02 5.013891541923599675e+02 3.415768548829046267e+02 3.548339995124544544e+01 3.537938371887670996e+01
2.179568105274723777e+01 2.986066517361570050e+01 2.118633570686480283e+01 2.805542031167274075e+01 7.089814387883578206e+01 4.300747165859033316e+01 2.305119205777252773e+02 3.115192578650047608e+02 2.999159439870724668e+02 7.203984981119259601e+01 1.924176548676167187e+01 1.321373590441240609e+01 2.201708020120131692e+01 1.909657813935873349e+01 6.463952772854294437e+01 3.972925194785373293e+01 6.416258175724161106e+01 1.689938115336376256e+01 2.856406780190894779e+01 1.239396129962423032e+02 6.195068196962296270e+02 1.098231730490584141e+03 1.107996264947819782e+03 9.622386470126563154e+02 6.766927981515643751e+02 4.603736918742638409e+02 4.245473222159484976e+02 2.872581429683024226e+02 3.207891805896613846e+01 2.757372742771116947e+01
6.210213454401391431e+01 6.181554358426693341e+01 3.579345846420858379e+01 2.935043659258881021e+01 4.221215617249183794e+01 2.369208056766039761e+01 1.401975519291793262e+02 1.340464984715742389e+02 3.878004253874535578e+01 2.079864666613566015e+01 2.346850384449410143e+01 1.933266472951522275e+01 1.071843152910404484e+01 5.066233181784202344e+00 1.102154654391834043e+01 3.215203382514474129e+01 3.857861466176221654e+01 7.824859127149856874e+01 6.802896817283107112e+01 2.767150098336187511e+02 6.909989214613965487e+02 9.191943751326089114e+02 3.453492034080911139e+02 4.650505263727109195e+02 5.400005152015803560e+02 2.790184586910987150e+02 1.992454947152857301e+02 1.655530336047772551e+02 1.543863335957460592e+01 1.652658723927295625e+01
5.314540442570111622e+01 6.815828969769317780e+01 3.351476809090237907e+01 2.883252986659092443e+01 2.764420725888232155e+01 1.331584901147483357e+01 1.929637660943352984e+01 1.667563740155598140e+01 2.367138688610272723e+01 3.767289333069969715e+00 5.012846802052934869e+00 7.612023647946873695e+00 7.662247302280897898e+00 2.407617325416364906e+01 2.053965157853589574e+01 2.279293180244627592e+02 3.917193108913485275e+02 5.090443876903882483e+02 3.166736277873408767e+02 2.167442069456121203e+02 1.381871992531541196e+02 4.475375934812114309e+01 1.583531394032776163e+01 3.064873600936839892e+01 9.916026834086920871e+01 3.180828066559988443e+01 2.885506676647704438e+01 2.263853429242007209e+01 2.836939582467541410e+00 2.616859030333462677e+00
1.210668094205511807e+02 1.041235547347575192e+02 3.784787126302833826e+01 2.107487610369675224e+01 3.537522138417250517e+01 2.851447810257919002e+01 1.279397029871434022e+01 5.195210958875824403e+00 4.715849714055001307e+00 1.972268645801389386e+00 4.584040067664702178e+00 8.415968948424612961e+00 9.993431616852383570e+00 4.636390332005712622e+01 2.373011228226009095e+01 1.230114007227791006e+02 4.112054346189830198e+02 7.032084417736648447e+02 7.335808842163239660e+02 5.807785494792923373e+02 1.130647384558677118e+02 2.400005552322569358e+01 2.720848610205127471e+01 5.993606263693820324e+01 1.181160163465692250e+02 3.382085859391665394e+01 2.729584530897900407e+01 1.098458739847885290e+01 3.956951143210249100e+00 3.753077284495940802e+00
1.660835379111064753e+02 2.347034992785494367e+01 2.147069893675077523e+01 8.723688565409084106e+00 1.113605158947023099e+01 2.546906654953322757e+01 3.419564303441838859e+01 3.991554856109636340e+00 2.271493507194964234e+00 2.528270595926816799e+00 4.377031903184758654e+00 7.305902691029383611e+00 7.343107271210745246e+00 3.522721659397044647e+01 4.207567460369961054e+01 1.696855506650882432e+02 2.958530736551904852e+02 6.321503344627999468e+02 7.422240033090633915e+02 5.793344113896214367e+02 2.659964348294118395e+02 3.507395040014353782e+01 2.293115249403364686e+01 2.026760635814833478e+01 1.043308034562532498e+02 6.138565164992556333e+01 5.631505518495464457e+01 1.953056344134120792e+01 3.259276033020398256e+00 2.901325815064214275e+00
1.026423899713746550e+02 3.418181244426654075e+01 4.521681460215231141e+01 4.746774038909262572e+01 3.296527555637371165e+01 2.323661491554936021e+01 3.625838105905752684e+01 1.543664274365952593e+01 2.333818396834411502e+01 2.917308485320978662e+01 2.637314715783454666e+00 2.966493203894992270e+00 4.138141875432590489e+00 8.119905249670614111e+00 4.071589533801737559e+01 5.401205111626830302e+01 4.699873331090799411e+01 1.900282890092197761e+02 2.289503354401686011e+02 1.824092788989921985e+02 1.444039616240133341e+02 1.955606744956791587e+01 6.501226203771114598e+00 1.053436862024114085e+01 2.620911729768038256e+01 5.317307210058879718e+01 1.420903819854969470e+02 8.634604400634005117e+01 3.934451380397057108e+00 3.383209387924821065e+00
3.743303571585452971e+01 1.579003324034311007e+01 1.790496755691286523e+01 3.236881593646698718e+01 1.873508336176573863e+01 3.086351347431563141e+01 1.477095410960808053e+01 1.079035136197009237e+01 3.464317760140660596e+01 3.380113627116362807e+01 8.517301553933812386e+00 2.944728780123201162e+00 4.537001582518631615e+00 8.629389171702030126e+00 3.533655729236338061e+01 2.305606806102956341e+01 3.503116648743520045e+01 1.599388410000235083e+01 2.294567129565695396e+01 3.794516208438586347e+01 2.615679121533103313e+01 1.418586318941903102e+01 7.071777656141159163e+00 3.248808934753813560e+01 5.925355020681985252e+01 2.289739152599910099e+01 5.079280523571821959e+01 6.279427064534547753e+01 3.213153122145249085e+01 5.421218293738109040e+00
3.797375743221482480e+01 3.165844992991589990e+01 1.607052819044219660e+01 4.391734826370041844e+01 4.569446864545669484e+01 1.801492270161067211e+01 1.226792438444044642e+01 1.298110471040359748e+01 1.463310671083353576e+01 5.625898292301201309e+01 1.554406732247185552e+01 1.488116472457254069e+01 1.261781696691130605e+01 1.298523198032929393e+01 3.242177500209993468e+01 2.117414790854051887e+01 1.446519981514258824e+01 8.822119775741075642e+00 7.546362921076544161e+00 5.522764890990997877e+00 4.280257998753809190e+00 6.135822674065288140e+00 9.153995592522823799e+00 2.097960026594059002e+01 3.549415863709491248e+01 1.589922643204003450e+01 2.416721430934459391e+01 1.626856449948702021e+01 1.655697055507392434e+01 1.087507057521426113e+01
5.157799700035680246e+01 2.792185716083793423e+01 1.652672636634350312e+01 2.402353613322913262e+01 2.293000020853822463e+01 4.616226140077645113e+01 4.351065344625898490e+01 3.363408543958449570e+01 1.983426933933689540e+01 1.388732271874825663e+01 4.867001674854538606e+00 1.110203818183446600e+01 2.954388136434611667e+01 2.725266908712448455e+01 3.291244989154722589e+01 2.394908786069262518e+01 1.642207167216659514e+01 1.914126613500633312e+01 8.560758048315534552e+00 3.713673287755448804e+00 3.510583051607881089e+00 5.418442877222246601e+00 8.080356246476744886e+00 2.378696561668667542e+01 2.366327932196310968e+01 5.504775743258969456e+00 6.034214874539745033e+00 7.548728258310884343e+00 2.411885186230629330e+01 4.939506380096934990e+00
6.905661790924902732e+01 6.205488727237039370e+01 1.943017802169277530e+01 6.994816019968779131e+01 8.791605552858463568e+01 1.701646452963118747e+02 1.165528459447127432e+02 5.162765414950229825e+01 1.957119332692639091e+01 1.094455994944140365e+01 3.154929078536966358e+00 3.917592984862098948e+00 4.440450385065046746e+00 1.513345360699603326e+01 1.696329896557593386e+01 7.013420756065247730e+00 5.816696620888117231e+00 6.200238217939137542e+00 8.245073052219982657e+00 4.652478049430127882e+00 3.202491543355330705e+00 4.727707456455258139e+00 5.324827933124641532e+00 8.569203842982661357e+00 2.613516818875696401e+01 4.008224696477066473e+00 5.696518304662019361e+00 9.080858161954738605e+00 1.070293139192690468e+01 2.130713745859936026e+01
3.667294847433593930e+01 9.462516896407692002e+01 2.937600355251674245e+01 3.320294174629679418e+01 1.726306300474776094e+02 1.868330188177062325e+02 1.269224685427180930e+02 3.460888509165565097e+01 2.552557356425917590e+01 2.314552612412544619e+01 9.172981013698827013e+00 4.434010564086744210e+00 2.689813962256274227e+00 4.322238163507726050e+00 1.933018448760168084e+01 5.033664452727606431e+00 1.383199898987534482e+01 3.751186370470657749e+01 6.582055269531295494e+01 1.745872443674783980e+01 4.359757994841112705e+00 6.074225559106770866e+00 5.292056179305335561e+00 5.669282079011093600e+00 7.356124937092690885e+00 5.478725450352955662e+00 6.315890123284793489e+00 7.641663646664326848e+00 1.003455388527657632e+01 2.467602801482889419e+01
