3.210236946675273373e-01 4.568686690452876120e-01 3.816040302109638960e-01 4.700187424515894219e-01 3.258954524411678544e-01 5.195475926566295310e-02 3.844073995671765803e-02 1.039463542640445132e-01 1.890017389620106680e-01 8.481936421385131986e-02 5.315232199804188068e-02 1.919211006573627032e-01 1.271280906805247191e-01 4.641495440865862632e-01 5.735427059698487012e-02 1.303876599618534748e-01 5.441978838575302069e-01 3.907462760369357496e-02 2.941653657353274220e-02 4.118187797483839896e-01 3.832877685417087621e-01 5.836159372459054362e-02 4.494634055740375639e-02 1.793928740518880294e-01 3.463543221178966292e-01 2.709953693165570443e-01 1.247025247758114380e-01 1.098018980921443635e-02 1.048257786237763445e-02 1.318303608096994990e-02
2.095270700374908257e-01 4.400116058850093714e-01 1.324987555917850890e-01 8.340334372130318863e-02 3.920524379707003293e-01 1.612561885972864095e-01 6.551454903036975363e-02 8.183330608559519215e-02 4.942448608871150700e-02 3.879930379714485733e-02 3.544362162382778958e-02 9.746789107586086021e-02 1.478758898624300266e-01 3.540267607595384280e-01 5.628790450778858867e-02 3.572675058273854787e-01 2.877804535906883926e-02 7.102926039269502612e-02 4.504953705593928159e-02 1.758703219641592763e-02 2.204673630534119688e-01 5.598025236718562336e-02 1.167790518973672170e-01 1.042952677398904238e-01 9.215552962447773333e-02 1.237330151559258573e-01 4.374738011557118000e-02 1.112600161908811926e-02 1.583137565991081172e-02 1.582381982666623832e-02
1.851919169489681938e-01 1.867873689920822589e-01 3.543634491498138805e-01 2.681412800172781052e-01 6.160466908581289092e-01 9.535139929813933601e-02 1.731462207714352108e-01 1.821625254970093977e-01 2.298318868535600690e-01 5.406710641524646588e-02 1.413528807885370830e-01 1.028470533665680336e-01 4.805922882121465428e-02 8.422429122334079699e-02 2.171615610041055522e-01 7.025481098403452140e-02 3.798284534618099478e-02 5.623578068017343751e-02 1.748831180228714588e-01 3.650647805245667982e-02 1.386567265144438288e-01 4.633344986340275778e-02 7.091275469115085328e-02 2.465009065727542109e-02 1.462663762044494678e-02 9.680937216387054678e-03 8.739100252408689082e-03 6.863753648273769083e-03 1.170114331661402905e-02 1.311211246840538608e-02
6.494055107654778114e-02 1.888853406638294208e-01 4.139474589046717723e-01 3.358275026265511443e-01 1.658507629317247378e-01 3.499023457856789143e-01 3.485020501964229411e-01 2.172238935076767907e-01 1.184672349024261245e-01 6.848225771756503988e-02 4.040121777373942291e-02 9.230108100305392527e-02 6.234083806649641513e-02 6.215096644643425261e-02 1.681858977761206408e-01 1.451634188694831684e-01 3.093322557534831652e-01 2.203401293854550039e-02 1.456798422690203099e-02 4.501508609529858984e-01 2.485779460287076970e-01 9.899881832543652727e-02 3.336081023160848702e-02 6.575685980902871985e-02 1.202184176303057635e-02 8.612118889612664988e-03 7.448307208283282480e-03 7.057074089892423352e-03 1.430122385704627949e-02 1.551248720109446068e-02
3.727475619195576295e-02 1.169486534688935764e-01 3.268443623514689089e-01 1.270096291173164471e-01 9.442638368886691058e-02 2.033025456588124780e-01 3.552970086686756401e-01 2.008460679099876578e-01 7.437791455952925956e-02 1.614266059112571816e-01 1.803038848659093141e-01 1.931866201251904169e-01 4.054440625390195452e-01 4.188788311042007106e-01 2.199758518010564712e-01 9.111754693889664858e-02 8.162758664340671877e-02 4.069249136371785175e-02 4.071519897911303476e-02 2.529004197916100843e-02 4.055139598117476485e-01 1.288466507909318826e-01 3.293961219585317957e-01 1.087059950632052324e-01 2.186319346618306736e-02 1.160254699296508867e-02 8.090298448776829174e-03 9.333011446832004121e-03 1.455519915681576480e-02 5.338195687467287703e-02
5.135121379039103012e-02 5.503482017569786416e-02 2.114787063362945640e-01 1.727360624001654521e-01 7.740144320646649700e-02 1.147753164934922077e-01 1.458084703125018811e-01 1.561086548431461773e-01 1.274500506736365169e-01 2.393768051934565821e-01 1.940874342413981823e-01 1.379344676638850353e-01 1.896556511147599322e-01 7.134704669300477586e-02 6.001092069614111929e-02 1.051885130158979192e-01 5.640905727409418757e-01 1.416835900606839560e-01 4.387699681666160090e-01 7.642823453375412190e-02 8.978709377417516679e-02 7.668231530663666140e-02 4.075856643901848986e-01 6.376480711161089387e-02 3.285405924451603038e-02 3.060236918412023721e-02 1.913848601188764681e-02 1.315989824504568313e-02 1.731882279977779368e-02 3.102346686933244238e-02
1.125659522471533086e-01 1.706461759191006122e-01 1.689422161046463811e-01 8.213928752118365706e-02 3.789381847574851414e-01 5.020683448956889117e-02 7.838121301002150265e-02 4.443450681495512977e-02 5.839922582093661635e-02 6.501838882244533047e-02 6.460604926272736637e-02 2.292057395449601520e-01 1.063010810770205067e-01 4.944957219192473719e-02 2.917119178145260311e-02 5.392972035167185874e-02 3.074908784211748958e-01 1.381960439928862638e-01 3.497186720302423307e-02 5.137602593949759655e-02 4.560604889603375178e-01 1.301174632044483082e-01 6.045861203817234908e-02 5.786034902724173506e-02 2.239041090689988106e-02 2.298734853806138831e-02 2.046003768256114339e-02 1.771915010086082612e-02 2.049204725091170742e-02 4.817517721865949287e-02
2.380981624249485507e-01 4.391827285735727671e-01 2.375627325094424314e-01 4.688921057240553747e-01 6.441535224725994380e-02 5.810635052025585334e-02 5.987706555725112734e-02 7.416465759389237467e-02 9.021167007312780317e-02 3.349265657728767165e-01 1.390039651723011804e-01 4.241893550647425348e-01 9.126654131085355781e-02 3.185520316772275790e-02 3.628041965676619129e-02 7.016231705137393471e-02 5.378995488356085319e-01 7.446874452767145158e-02 3.611989421780840287e-02 3.138274389566049483e-02 1.809543619626940436e-01 1.067276320519754823e-01 4.258280300111848271e-02 3.558626448108363066e-02 1.697094760758090931e-02 1.789839992377919090e-02 2.912480468263458147e-02 3.733218132139814321e-02 3.643760149780181368e-02 1.040014569567853375e-01
5.575470503849883075e-01 3.585009229237907658e-01 2.027967410695698525e-01 1.170381708349998995e-01 6.590712313398103261e-02 2.907604824726162107e-01 1.161583328972876916e-01 4.837561256040838753e-01 4.683655977786084779e-01 4.749274806120621362e-01 4.313826450289323655e-01 5.415115669134467069e-01 1.125071312281272634e-01 4.603165032562424319e-02 1.146694593562338493e-01 1.000845387152288768e-01 4.019942329609629827e-01 9.493216382762001415e-02 6.637500063244773651e-02 2.369458790320172759e-01 4.720392896621188744e-02 4.914560825210742556e-02 5.335153873409353986e-02 3.483290149426826465e-02 2.043876908766353862e-02 3.138121388793344013e-02 1.248548290829929741e-01 2.474516537615605860e-01 6.944293898586892944e-01 3.337631880675328566e-01
1.375938325748308766e-01 9.156490497728889122e-02 9.641880043557854441e-02 5.664498598149168840e-02 5.439063230488579148e-02 1.377694523510198388e-01 9.549909445881235581e-02 3.290373380129818504e-01 1.610350868726060647e-01 5.774840023520373677e-02 1.011798718090466953e-01 6.593843404313518008e-02 1.003046930923751218e-01 8.474425851552599975e-02 4.129512115000850969e-02 4.834433976217163836e-02 2.451879927158097383e-01 2.649637795750054425e-01 1.129029587109431909e-01 6.145589845077623070e-02 5.998255689886607123e-02 3.783470514039826565e-02 4.330448645354861154e-02 4.757482031431098379e-02 2.661525977377225682e-02 3.421104494992243533e-02 3.311700655111065594e-01 5.560188425860180805e-01 6.747786121069248022e-01 1.729204546833061629e-01
7.209321088305997716e-02 3.374127584112419642e-01 6.487701846692256469e-02 4.260739513898863934e-02 7.274919236599103334e-02 8.594007134187681141e-02 8.495629049460542981e-02 7.824305172502293848e-02 5.437358012182523515e-02 4.268438974572432709e-01 3.299684259206870363e-01 4.855522212218686962e-01 9.926975896714524961e-01 4.806371329500833678e-01 8.702872833382679918e-02 1.689665209373628074e-01 3.159564018496471283e-01 9.448476294847490964e-02 4.039940884995252279e-01 9.835203712566226164e-02 4.108770903326744439e-02 3.659089515558573702e-02 4.712265677684183973e-02 6.591374435877306315e-02 7.051990367603969134e-02 3.848247683318035267e-02 6.212539570230322244e-02 4.864857196960755553e-02 4.291982437323519500e-02 3.035359214539636030e-02
1.508421494339776681e-01 8.289841092400938860e-02 1.205633232620059309e-01 1.170664666172212265e-01 9.465417281811111527e-02 1.403574608680176472e-01 6.515340773508865313e-02 4.517599666527771785e-02 5.532166724131165614e-02 6.430367388608645984e-02 1.264359585340263936e-01 5.834513688406015586e-01 1.020432057527028924e+00 5.202699791342415558e-01 1.843589791003743539e-01 2.052799517446236011e-01 2.265669454446461173e-01 1.447477999184442754e-01 4.610219435069392441e-02 2.240018241787720132e-01 3.926594249031498812e-02 3.976430732093526321e-02 4.691039303401573629e-02 8.383645698583686023e-02 7.966018912779057604e-02 5.679882353103805903e-02 4.371705842351516352e-02 3.957560136697854669e-02 4.294470561533895309e-02 4.628346339504374463e-02
3.600606957759577148e-02 8.701755479079573141e-02 1.993866912338000397e-01 5.381009478481909580e-01 3.588174688549189417e-01 1.187672139736003774e-01 6.539599829510651940e-02 5.675529742780076325e-02 7.461462723754198889e-02 5.072830907054510785e-01 1.411416149391746810e-01 1.887069103973715578e-01 7.525318434063613671e-01 3.183632967778114997e-01 9.874381341441024196e-02 1.129371913109540326e-01 4.156588051196498379e-02 6.086877110389202900e-02 8.365871049951029148e-02 4.711816267753464738e-01 3.745142746617383112e-02 4.089071627455376223e-02 5.169902109102485210e-02 8.587519863037265666e-02 1.088076576364302994e-01 9.514781882743360286e-02 7.019896785212825785e-02 6.582734579641659478e-02 5.765440337742926136e-02 4.784041440675347590e-02
3.130428985721520063e-02 8.874898558829052986e-02 1.563272283799262974e-01 1.116766055327483992e-01 6.586609445327509804e-02 2.546756663510918450e-01 9.194872805232631729e-02 5.028401368998566129e-02 1.032441692726443483e-01 3.353491951859759179e-02 1.183202179083416572e-01 3.281687240686365775e-02 3.406334590052461087e-01 4.553821709738176127e-01 4.803405818170893293e-01 6.424312290532502301e-01 5.753506659034471893e-01 3.724492820320279840e-01 1.056939319987985737e+00 4.945504494880009760e-01 5.128869039987266065e-02 2.426292076034261558e-01 1.825958245739608965e-01 4.346733871796345516e-01 7.336851012019496299e-02 5.469670404957353849e-02 1.404125823169931897e-01 5.302567474825391203e-02 7.808959964711598145e-02 9.036869778226888639e-02
2.913153156335625271e-02 2.913350688502160113e-02 7.880616121339609204e-02 5.873575631547205411e-01 2.137551530037258840e-01 4.782407218628770273e-02 5.579118915785210575e-01 9.605844587532602619e-02 5.014983287189037076e-02 1.239906620359724765e-01 2.533553089189457541e-01 1.617493747900020651e-01 3.059935465961759471e-01 3.844895920794774713e-01 3.440207069741667567e-01 4.121019600845727271e-01 6.998182079183736803e-01 1.205564261213653232e+00 1.223119032689066188e+00 9.568695540190856885e-01 4.791640439271079716e-02 5.551130172187162398e-02 5.489510524341407322e-02 1.504516066727678014e-01 1.964358666928122110e-01 8.752582003883009332e-01 8.741804486166936394e-01 1.918275585608591738e-01 8.064098353458457047e-02 6.176893845878683731e-02
2.643800669569211503e-02 2.864381795563168687e-02 6.414050967766453393e-02 7.115431312185616086e-02 4.781553785353258312e-02 5.043776023517017315e-02 2.811416471952495333e-01 4.746710831282932586e-02 7.494704746171509946e-02 2.886807259453821189e-02 2.976836903114322280e-02 2.442704854955858595e-02 1.746854155021307364e-01 3.500342462991614667e-01 3.231821735997192357e-01 4.907299828345726977e-01 8.456532776355984993e-01 1.023507534342371184e+00 5.889330143833665376e-01 1.278152925720619781e-01 7.668239961189057818e-02 5.268435158585775824e-01 7.695429476707835725e-01 1.293301451207427899e+00 1.221630017632959087e+00 1.603112799283570311e+00 1.287185767970221217e+00 3.870107123169851948e-01 1.183133501604305554e-01 6.939183339184162858e-02
3.335588443922800350e-02 3.825630627734834255e-02 3.743003514364930118e-02 3.524237089245477184e-02 5.094980497153797638e-02 8.573348984355430580e-02 2.150742934835693787e-01 6.888262388705002071e-01 3.245959554322601637e-01 5.526514248492029463e-02 4.084448860203970799e-02 6.377450165954129391e-02 1.256319829401759125e-01 1.832933030238813599e-01 2.398999368350457906e-01 4.268496497598432415e-01 9.149149843100636836e-01 9.153958866615052870e-01 4.309670012584045917e-01 1.473343064905880961e-01 6.358015975029560618e-01 1.155538634475060888e+00 1.485693560611278663e+00 1.530386276832290449e+00 1.356453468064241052e+00 1.182366938025787295e+00 1.761935163365179635e+00 3.163523248306774338e-01 1.632140172289647251e-01 8.824181660564006657e-02
8.230100168070456079e-02 6.422238363455246013e-02 3.147280821382841820e-02 4.426791068048667455e-02 2.512629437298967428e-02 1.031919145121679704e-01 5.510517367417739898e-01 4.454645262221321733e-01 4.364635697483414400e-01 2.176628308331622907e-01 8.436931893183505227e-02 2.609196731230347538e-02 2.533816393515215398e-02 6.023510646706337762e-02 1.188296114704547879e-01 5.422390268646795075e-01 5.650253021802991160e-01 6.654226162827138191e-01 1.151571898646978620e-01 2.022949721807525969e-01 7.040269706123829518e-01 1.524952764609178946e+00 1.883354831332086698e+00 1.959305709369162152e+00 1.628503861818218823e+00 1.591955676424555488e+00 1.499951901956025457e+00 1.199853831715664176e+00 1.208083786815579569e-01 6.868307313235045841e-01
3.270702912670750417e-02 8.945480027451058191e-02 1.560758457616701067e-01 4.276541842069783717e-02 8.015628382985255651e-02 1.107060884013734425e-01 3.491651753997740970e-01 4.364626324288811143e-01 2.987459709294648658e-01 2.517938622686577421e-01 6.062011927298691788e-02 1.698482510283426949e-01 2.587520278669563356e-01 3.399195387556581960e-02 5.462726565162388109e-02 2.565084527879169518e-01 1.060930390376243204e-01 3.423216187945400668e-02 1.887507973397543337e-01 7.465996079861630941e-02 2.789490278799620637e-01 1.487375678411523294e+00 1.883955315962285937e+00 1.970650427792090653e+00 1.440570580901021414e+00 6.721212883587328601e-01 1.098204506006640102e+00 7.481948744814911345e-01 1.668499614351553750e-01 4.978927130599294371e-01
2.919965259427714441e-02 4.088087975199232449e-02 2.627369712125294382e-02 2.951355309849160169e-02 6.190170187240973121e-02 3.556747320067433354e-02 1.829614064367780790e-01 2.364853315903185094e-01 2.175243446358655075e-01 6.181073151749129357e-02 4.570394216643237084e-01 1.172901259215198555e-01 2.026178933970286811e-01 4.923803659695987767e-01 7.712727955270125280e-02 3.961490564562716171e-02 7.737622424214753158e-02 4.623475901741559979e-01 4.107714107415956495e-02 1.749754366471048539e-01 9.265786338779089526e-01 1.754478318777997314e+00 1.883156166778024554e+00 1.779130156636935745e+00 1.360916586439406162e+00 9.956770842175235448e-01 9.655037614139558855e-01 6.735765169333444158e-01 1.338296318282790609e-01 3.825979976756869183e-01
7.104407660311881645e-02 7.032365578556958041e-02 4.048192570198202306e-02 3.240332993651977994e-02 4.284343564831278456e-02 2.019918190957769449e-02 1.052682369427442866e-01 8.996655054217121694e-02 2.518018082545622760e-02 1.728923905259655697e-02 1.998493007174231284e-01 1.773096749010855122e-01 9.950161922677158710e-02 4.600109194507540078e-02 9.855537571283967679e-02 2.856661810992642270e-01 4.367836273155698001e-02 9.485705955292264568e-02 8.945775537879027683e-02 3.607281366952255763e-01 9.860187136449302114e-01 1.454076474903847283e+00 5.900423899618252310e-01 8.759724017391352646e-01 1.098586907164488702e+00 6.176211527049481065e-01 4.899384295520595733e-01 4.273530323576972823e-01 2.146179520158186527e-01 2.333744038297651535e-01
5.779291127777399367e-02 8.003263169550811629e-02 3.161295062715218651e-01 2.700449803514911040e-01 2.501188805705871765e-01 3.627270248453643986e-01 1.812030891633732710e-02 1.293318644843693133e-01 1.805869247526956656e-01 3.113134235609281431e-02 4.591801865836404178e-02 7.354731493856686564e-02 7.016776665719319517e-02 2.194722925575646189e-01 2.613935488919283401e-02 2.128363068757514187e-01 3.914034778695797967e-01 5.416646444531234561e-01 3.648427391404388542e-01 2.719102665509736672e-01 1.922698290257955356e-01 7.019371628487117154e-02 4.030170391379096495e-01 5.832990954640832754e-02 2.038117103543713726e-01 7.904792678847817611e-02 8.626231965702117754e-02 3.107521966110401435e-01 4.013157033042038385e-02 3.745757835619401011e-02
1.214405012888229718e-01 1.198058258671641507e-01 3.575322032583843068e-01 2.095778766430460571e-01 3.508332123644676281e-01 2.721143712625154198e-01 4.264704651781563438e-01 4.709187655708623604e-02 4.303949909273176860e-02 1.859552958906793632e-02 4.601955065178582605e-02 8.491765139600208900e-02 9.227994500827799151e-02 4.254794537371225371e-01 3.386001119015125821e-02 1.167451178173478932e-01 4.217378940669148646e-01 7.754731541962565089e-01 8.664274082806547872e-01 7.440921100834221313e-01 1.685967696353403156e-01 4.589312665837613076e-02 6.579515836570544451e-02 1.461334970480317741e-01 2.773582231104962936e-01 8.118605410361741381e-02 3.613796017028241270e-01 1.477899622052308848e-01 5.518388709972394529e-02 5.296988176152774702e-02
1.523418873899848314e-01 2.610027304796161407e-02 2.019865054209592503e-01 8.707603532291971482e-02 1.104488931082407560e-01 2.513558541535697022e-01 3.373558334071554143e-01 3.923028678867567648e-02 2.120102099456112887e-02 2.414379623583603335e-02 4.381867697748611373e-02 7.475682165380503896e-02 6.941768029636977144e-02 3.315420423532590144e-01 6.263707625048371697e-02 1.852341374415147901e-01 3.153686313142662900e-01 7.167757929953173512e-01 8.926640910543511831e-01 7.526750196124419867e-01 4.467494204780533273e-01 4.120923426354875518e-01 2.840431138901029495e-01 5.086583164728725182e-01 2.977478666118387185e-01 1.646512530118311446e-01 1.465151789186622255e-01 2.555468074534460454e-01 4.462357043864396272e-02 4.032896336340317106e-02
9.382210880277180864e-02 3.956980361187260875e-02 4.383874395445249150e-01 4.692166522997464617e-01 3.395541370185655577e-02 2.402088467819148837e-02 3.470791447841110600e-01 1.474953628775709791e-01 2.155788756238590786e-01 2.750980544386004700e-01 2.576013433573327849e-02 3.094734962049715959e-02 4.075465413417279220e-02 7.908592856205781674e-02 3.967596504661817236e-01 8.183465092724576118e-02 5.854156947584900073e-02 2.530424314710801870e-01 3.088337447495407284e-01 2.574135142869256043e-01 2.733306204343286527e-01 5.217852139722722882e-01 8.333345505224544481e-02 1.363375425219695292e-01 5.519709001966518480e-01 1.402111313315203833e-01 3.192415766976434144e-01 2.524592797861037186e-01 5.240899439080728972e-02 4.576708094713340114e-02
3.400039662637657778e-02 4.484501121877358942e-01 5.689763032608610160e-01 4.629885126755745040e-02 6.248024268201556319e-01 2.936825097512686944e-01 1.402955715337303733e-01 1.026079102652807246e-01 3.218947907815135623e-01 3.128581266870072985e-02 8.457565823626812807e-02 3.136254659772422237e-02 4.650419051280470228e-02 8.627927263273518776e-02 3.585789030072002448e-01 5.719559305545494909e-02 3.714725736830317704e-01 1.722286213011129108e-01 2.487422932418270061e-01 4.189861839644422048e-01 6.387849430440552256e-02 1.734979313359592823e-01 8.963404780270987915e-02 4.175137902238208465e-01 2.852184251792537206e-01 2.944664010011475708e-01 1.768120580680759280e-01 2.637328166034814680e-01 4.286911408632541609e-01 7.308788428390719516e-02
3.497490034818978577e-02 3.876584032912207961e-02 5.461532161498553473e-01 4.422504244185284650e-01 4.385504209922831964e-01 1.736080370937091999e-01 1.155063013297614183e-01 1.207874101900471009e-01 1.348680624897183877e-01 5.340691389972094250e-01 1.566245597625600117e-01 1.571815846150689255e-01 1.266565247887052881e-01 1.292144711341557395e-01 3.448908551978959736e-01 2.337997957134435034e-01 1.619858725193342730e-01 9.717596531552508132e-02 8.401223586232720031e-02 6.284851068861341261e-02 5.044792579843631469e-02 7.390610353282185685e-02 1.131451649778337093e-01 2.643799889068237374e-01 4.524693651407319384e-01 2.041854259058676901e-01 3.132326690261186819e-01 2.165804309039968678e-01 2.237742673948524830e-01 1.478757812079419809e-01
4.192059919995905215e-02 2.873061821423168044e-02 5.472359647146556316e-01 2.663725115239270330e-02 1.867343088609529564e-02 4.201901818375081143e-01 3.022016719655939640e-02 2.365731370618101223e-02 1.856980172727201728e-01 1.344622253776263932e-01 5.040844549611157854e-02 1.172703207227964450e-01 2.951176887828251827e-01 2.727010871316814522e-01 1.205743491229217534e-01 5.766122368307092794e-01 1.835710140830537629e-01 2.101985406048800242e-01 9.492113905070413693e-02 4.198709169351930170e-02 4.081127639433687615e-02 6.378624386043203753e-02 9.683254177208287794e-02 2.957298873673079309e-01 2.996878667412034014e-01 7.114272276126583361e-02 7.924339294393717426e-02 1.017738522558508385e-01 3.314996162854585426e-01 6.798356651884850110e-02
5.626988125558760045e-02 5.684884421141433997e-02 6.223756761947286664e-01 5.901173249091386935e-02 5.850533041970229498e-02 1.101863380208026738e-01 7.799542941965699472e-02 4.677135555603689765e-01 1.845066381698847180e-01 1.069683385162567280e-01 3.246700142643026837e-02 4.166350645473747283e-02 4.475386541609801400e-02 1.535881186198601311e-01 1.828734282331943017e-01 7.724649398003760603e-02 6.421307972828566024e-02 6.716576016836413310e-02 9.042787335452824593e-02 5.225060025238862510e-02 3.700416062028528269e-02 5.505663000220899217e-02 6.255499010562781681e-02 1.047424425145475624e-01 3.283973470278768736e-01 5.202344757647479195e-02 7.583633909132928008e-02 1.239779506091632233e-01 1.495951987514648751e-01 2.976993088008287880e-01
3.035930173577016528e-02 8.177760924099169992e-02 2.427032554063941749e-02 2.611813265143371476e-02 1.155567325253955974e-01 1.225238426641716005e-01 8.662502470584232395e-02 3.271940280441988924e-01 2.521546234393650665e-01 2.352485610221816958e-01 9.655242793117453648e-02 4.875876856355954719e-02 2.934807959134095451e-02 4.623106700175887152e-02 2.105830548542292346e-01 5.503253184972384943e-02 1.476848001864196902e-01 7.222341367466615647e-02 1.327182352471429072e-01 2.003423490321033507e-01 5.165320523643812667e-02 7.224820391865713343e-02 6.286506222865134719e-02 6.933803925593799711e-02 9.248233458216385816e-02 7.122513726512844090e-02 8.424078275685240036e-02 1.037555504472807144e-01 1.397683574662085815e-01 3.441152450842648314e-01
