2.364302790044773769e-02 3.501514369978404873e-02 2.837137424936271232e-02 3.593843701787948625e-02 2.748411796883918831e-02 6.059437768634184235e-02 6.043744271215847896e-02 1.642542112756638362e-01 2.985431532106407326e-01 1.345147012853812329e-01 7.895816705453370665e-02 2.052273425975281451e-01 1.284231294181852334e-01 3.985899021135271003e-02 3.887825090513297166e-02 1.369534930969786846e-01 3.042171251567320905e-02 4.759165763354728657e-02 4.282470412351829098e-02 1.598026491219121589e-02 1.379751544100026733e-02 6.180951007910651801e-02 4.881353725891082046e-02 1.896691015160677507e-01 1.401595044493276349e-02 2.906345300388882835e-01 1.386225645055698674e-01 1.225679165514630131e-02 1.172499714295551464e-02 1.477774575428836973e-02
1.989086668361518262e-01 4.187771956395176104e-02 7.072511220513980068e-02 5.793500077523012354e-02 4.044454861905783655e-02 1.911625630289866262e-01 9.590343827424482881e-02 1.208050035623167012e-01 7.521235453269885241e-02 6.115121241082113052e-02 5.280712065722985987e-02 1.042536391311254113e-01 1.495475527643148894e-01 3.185750587418577362e-02 3.792826063683498589e-02 2.440273756512468389e-02 3.032348527727332307e-02 8.952597974982359763e-02 6.712890783829997265e-02 2.189468191457471027e-02 2.339374963843397770e-01 5.933660121995176784e-02 1.270587814359085410e-01 1.102810640328394098e-01 9.802781596261878061e-02 1.323855896904437279e-01 4.873931794833918224e-02 1.244556925835582639e-02 1.773330062664923296e-02 1.774785172347530249e-02
2.291774761408122418e-01 2.359302449144118907e-01 4.715451821739913840e-01 3.842410240829000623e-01 8.141710447829678676e-01 8.754102717687414770e-02 1.751684674637088435e-01 1.850375280807534661e-01 2.915682874063785235e-01 8.334787457663515864e-02 2.206903234152333693e-01 1.551195082925131141e-01 5.739458308899725303e-02 8.866710845405430252e-02 1.707741978088588020e-02 7.315830712442752959e-02 4.449942444692399357e-02 8.272174904632034753e-02 2.735456516249374914e-01 4.958734872270796623e-02 1.486906700095326772e-01 4.930508573276864981e-02 7.694697768768650470e-02 2.690051564897284753e-02 1.609320841602724858e-02 1.076409517279816423e-02 9.784005886410077416e-03 7.696880214634859926e-03 1.312660733639520877e-02 1.471310229489874132e-02
1.003706698968516581e-01 2.930891031997301388e-01 6.433804298139040867e-01 5.207099847809437687e-01 2.243212637547903343e-01 3.681124878862056249e-02 3.914579995274427432e-02 2.543861668230988290e-02 1.233531649037972466e-01 1.052517737449778223e-01 6.383811156628473038e-02 1.256315145084565266e-01 5.707554367121832339e-02 5.241540765909324939e-02 1.733693974274518601e-01 1.549760045240195505e-01 2.068521038435307616e-02 3.252682727632890541e-02 2.280137951937879701e-02 1.994914844438056001e-02 9.996007016254908339e-03 1.006824342829432534e-01 3.442348508247124877e-02 6.724491138171895255e-02 1.309503678092927351e-02 9.521411933097117392e-03 8.266332971761967269e-03 7.847880909864612259e-03 1.593844220875015663e-02 1.732146762201662929e-02
5.794710582840374713e-02 1.829435040058052797e-01 5.113320117322175395e-01 1.983714695198126876e-01 1.244201189642107352e-01 1.998224658707817014e-01 4.252783129870664480e-02 1.969112885745240848e-01 7.767453395081057310e-02 2.470059674693858842e-01 2.851728581217897740e-01 2.546920408282589143e-01 4.163678057959226825e-02 5.122196446944501935e-02 2.288225236043635868e-01 9.483739299798259192e-02 7.252589655076302488e-02 3.213586378076120631e-02 5.132534198814577009e-02 2.756862997719164432e-02 2.023766691223452541e-02 1.330481327798611058e-01 1.374818473424648836e-02 1.068888914544690871e-01 2.359296931400257924e-02 1.267793050051846740e-02 8.841176494551111070e-03 1.024202783273234739e-02 1.604422377746592826e-02 5.909578376603395744e-02
6.732448595046672257e-02 7.214757452945436134e-02 2.998712538879666489e-01 2.286990328848022558e-01 9.736673264972921238e-02 1.158810907237893678e-01 1.478631304585977246e-01 1.584119797222506287e-01 1.353106513532145727e-01 3.714986622649740222e-01 2.751447134252657523e-01 1.629960343446539006e-01 1.950968772277932028e-01 7.408073538743645270e-02 6.260992355374855878e-02 1.074970745833359748e-01 4.220854197326201485e-02 1.436909219355897993e-01 2.837332660282659499e-02 8.691218919893305139e-02 1.129338233482567455e-01 6.860929290714823381e-02 1.942909166281992644e-02 6.357172300709980350e-02 3.520632318965462304e-02 3.304229088624424659e-02 2.057274891775542555e-02 1.422624600743426469e-02 1.882624102292344490e-02 3.395666349169421117e-02
1.075830688349266595e-01 1.622050977230125035e-01 1.638074249901215473e-01 7.151684918734745044e-02 3.451839502429214501e-02 6.352377067075158645e-02 1.067707623141613410e-01 6.104438881662105354e-02 6.703825041884289848e-02 7.366698403269789086e-02 5.428166650392263898e-02 2.658834202636838409e-02 1.108442795055634422e-01 5.310650965759521058e-02 3.119267049203066841e-02 5.346356256515841232e-02 2.385757101729018767e-02 1.368166013008508819e-01 4.636253328895074965e-02 6.438555337390487743e-02 3.495088138633505731e-02 1.394706825274268647e-01 6.445771891185175795e-02 5.989145210115638662e-02 2.399115754800194150e-02 2.449499643004524746e-02 2.139517798349384672e-02 1.853062966100104889e-02 2.126145333657913222e-02 5.076546258270420858e-02
1.959948886242995555e-02 3.733588920905168279e-02 2.012839787103697098e-02 4.103336775523827584e-02 6.090052421704940377e-02 6.957503433435505147e-02 6.264051036927352489e-02 5.991875545711468354e-02 4.826868436189566541e-02 2.850699388106776866e-02 1.328393681262385329e-01 4.010429461515924165e-02 9.342350988924076616e-02 3.454489766922909377e-02 3.935396770575635972e-02 7.192993658980557925e-02 4.256007942382527415e-02 5.797336740211091188e-02 5.102244611088251058e-02 4.008154537130537154e-02 1.964490782340906350e-01 1.157600288405571665e-01 4.644505461314911432e-02 3.864554189125363887e-02 1.823384148825605081e-02 1.868964480686177015e-02 2.852574566177395327e-02 3.266036678327274845e-02 3.165194676446041883e-02 9.283748926813678581e-02
4.400934155591603586e-02 2.915596060186654431e-02 1.709468904073353779e-02 9.965389208776409546e-02 6.914689494694148397e-02 2.975837802013769212e-02 9.739999265011953233e-02 4.624380698720932659e-02 3.967938631443390651e-02 4.148727278266318985e-02 3.282813627412337065e-02 4.493443276621880700e-02 9.334624025514506873e-02 6.764732663710101845e-02 1.254172480942920553e-01 1.058617616551400797e-01 3.589073267045698318e-02 9.976869733518217709e-02 9.839916065948639545e-02 2.008520661481028383e-02 5.141681835757334201e-02 5.372640870678994235e-02 5.825534528334777584e-02 3.791613446344072047e-02 2.199857957387576710e-02 3.044599517277755268e-02 1.071128474241214434e-01 1.965066264873842616e-01 2.899399509888073156e-02 1.349493199208835065e-02
7.313169761625598619e-02 4.817125211785684702e-02 7.605851835511463765e-02 7.186661735505604776e-02 7.086588505425303608e-02 1.451661237679612027e-01 8.209054179025931930e-02 3.636483943829184329e-02 1.554252526879105201e-01 5.595518158665938047e-02 5.877678918819054243e-02 5.655497021303722283e-02 1.186141582209594980e-01 1.332611953479633238e-01 6.461075008232725070e-02 7.019297746101284263e-02 3.601389433634953896e-01 3.652141594696902138e-01 1.524798419969893015e-01 7.986501715281932312e-02 6.499532538264213288e-02 4.127123284100463890e-02 4.725788724107723993e-02 5.176261991460535256e-02 2.868200251727928002e-02 3.412749881439790245e-02 1.514002475811138983e-02 2.301104079656779086e-02 3.066253589941055069e-02 1.529891617997010955e-01
8.149380142028336826e-02 4.223617094482165490e-02 7.655295413095170032e-02 6.171349284304045169e-02 9.836061783991041640e-02 9.017406275568543017e-02 8.841813461530420581e-02 8.161195206810586966e-02 5.641046710253604102e-02 3.728279190025202833e-02 4.675256365398138270e-01 7.744988265243286651e-01 1.587114882521140302e+00 7.705842472555430867e-01 1.399055677719153734e-01 2.727942121027853162e-01 5.088347104266395249e-01 1.405915593410791142e-01 3.895213557796280146e-02 1.058064625838268658e-01 4.451026761595512637e-02 3.971511077398300060e-02 5.124045034491089834e-02 7.160474611735705153e-02 7.626492435460201225e-02 3.985723677131843001e-02 5.911876229907758740e-02 4.466087691179026348e-02 4.150460617568982324e-02 3.081567355529201205e-02
1.527923357888802403e-01 8.323411016888847269e-02 8.729563215846519730e-02 7.063697772322063972e-02 5.927984188168890223e-02 1.400997369445996787e-01 6.810333357459089076e-02 4.780212290834865568e-02 5.746560560115293592e-02 6.793408605964734726e-02 1.420228437210169781e-01 9.336082881757332697e-01 1.643072132823404363e+00 8.345857356133444815e-01 2.945305357865837248e-01 3.271999285857423723e-01 3.602163647127801793e-01 2.115527234461487271e-01 6.123056564716379546e-02 2.390466018233836087e-01 4.222282912933314480e-02 4.294364945491071367e-02 5.072092454279886892e-02 9.071562130270965918e-02 8.621885720669256181e-02 6.130624019619848597e-02 4.700529913061154974e-02 4.287295946849459249e-02 4.715460157904938221e-02 5.144988587503946526e-02
3.620559163902192096e-02 8.504951367618376890e-02 1.858895372623179387e-01 6.634188894940826198e-02 3.762871333446722588e-02 1.130370900139525403e-01 6.555410457687645132e-02 5.950804490071330555e-02 7.685756842863239457e-02 3.529249866635718325e-02 1.486237311938153893e-01 3.005018589310888277e-01 1.218098677753657100e+00 5.105789302889667258e-01 1.568389958326029954e-01 1.778025738207427153e-01 6.524922361474813637e-02 9.532370806203568914e-02 1.204887204685965302e-01 4.839205603205280759e-02 4.014927608568222978e-02 4.396271401957221880e-02 5.512126445458136875e-02 9.175736250100052782e-02 1.166694982820532661e-01 1.035003803178092263e-01 7.666506293024433205e-02 7.234353023023863682e-02 6.379629677316193959e-02 5.324756822443790089e-02
3.119015487081945592e-02 8.545029496017918225e-02 1.319744036710316093e-01 9.006118485905191540e-02 5.186703141102202985e-02 2.688940082518799513e-02 6.795938135930265633e-02 5.423098413105186671e-02 1.045220230014043683e-01 3.418445618618641546e-02 1.230721045536913860e-01 4.888861429364046995e-02 5.546766031369927408e-01 7.300505699004162796e-01 7.579731985731263944e-01 9.983910940036719861e-01 8.921250168872147945e-01 5.773284046449447260e-01 1.572343914669456888e+00 7.320021463589464483e-01 7.269709084801301291e-02 2.600410865846806141e-01 1.933701968044179709e-01 4.696257136239816166e-02 9.435552542120489994e-02 8.316639093736799548e-02 2.192192495623193071e-01 8.108111092421446675e-02 8.636978241036183390e-02 1.002340552460011663e-01
2.916271788273945911e-02 2.811228686938576499e-02 6.736327742794470663e-02 8.794307226163508573e-02 1.700234078090128165e-01 4.262431096418577148e-02 3.629305676995640828e-02 1.025178934827757488e-01 7.365617685936240444e-02 1.297626640792887698e-01 1.593093204190369414e-02 2.388120711865369117e-01 4.955560656169449296e-01 6.150874985899181802e-01 5.434042709073061417e-01 6.428529200755741524e-01 1.088230361695593951e+00 1.870714761572799034e+00 1.893384469486716570e+00 1.478336881819928506e+00 7.171819047014693638e-02 8.128154968885173415e-02 7.161147182771412933e-02 2.002374235193308261e-01 2.694793249031211535e-01 1.391067972616942150e+00 1.398730878493265273e+00 3.023484571693870748e-01 8.883774113577314058e-02 6.814791753416910014e-02
2.689216400760727210e-02 2.831462162549916450e-02 5.548050677279083021e-02 5.852618817996903255e-02 3.802406845844556738e-02 4.584153966515512602e-02 1.988762095926243159e-02 5.268145443293696661e-02 1.134295596072494305e-01 4.078812853582430148e-02 4.244492218152538798e-02 3.602533318570348003e-02 2.807714190380989905e-01 5.585053086322545601e-01 5.117421923657292648e-01 7.716594171200816810e-01 1.323884700696624561e+00 1.595024726741308685e+00 9.131054167592955739e-01 1.976346683563181272e-01 1.192148529200244278e-01 8.242589562666869929e-01 1.212696280538117621e+00 2.043450008724398081e+00 1.935283908188692781e+00 2.549233891568738475e+00 2.054520850161438261e+00 6.095221813437052827e-01 1.293746322602465082e-01 7.590200744123740129e-02
3.464181730209285603e-02 3.900250152130961545e-02 3.665739728769711742e-02 3.320221713479944853e-02 4.845932424858247212e-02 8.545340762565215020e-02 3.112251887844292852e-01 1.022814195316125385e+00 4.982814209599349953e-01 8.558949921670630512e-02 6.389476499790207320e-02 1.010595062684961354e-01 2.002975230595100409e-01 2.916776890314141113e-01 3.811661788606044987e-01 6.774263226060839305e-01 1.442099396331839589e+00 1.430970139756318815e+00 6.682235219499821355e-01 2.278209703007402775e-01 9.923044966966115821e-01 1.820560657931795889e+00 2.361116401477362015e+00 2.433657625256801627e+00 2.155434382348491162e+00 1.879399878400809021e+00 2.802673944624678892e+00 4.972081806862740927e-01 1.698228890303543626e-01 9.153101122779708221e-02
8.705047263276811942e-02 6.745081316220200018e-02 3.255185590445187904e-02 4.552809692989007173e-02 3.432677566684662340e-02 1.551449836402938320e-01 8.461774114267097691e-01 6.866384466937744957e-01 6.731653595061424245e-01 3.372886785646191932e-01 1.293266267295202498e-01 3.543625717869702818e-02 3.470074212757619236e-02 8.438222010888005165e-02 1.894085409683898269e-01 8.679113536622601321e-01 8.961397760608662555e-01 1.023023551729601799e+00 1.752063711419264425e-01 3.071592088421119526e-01 1.102637734294158900e+00 2.414651393954585501e+00 3.010572542890664671e+00 3.128716001008536640e+00 2.590929335368839848e+00 2.526548325403106698e+00 2.376119411629407097e+00 1.881368762589832988e+00 9.005683644252232556e-02 6.018611145882562380e-02
3.504165061696617317e-02 9.561955091275010921e-02 1.661050052772963803e-01 6.383297826006731346e-02 1.246698182497346097e-01 1.734832859288518159e-01 5.461690996009516130e-01 6.819445624556470520e-01 4.661158987363919759e-01 3.626165051764689284e-01 8.381393273540117816e-02 1.746653438954126614e-01 1.474221638625025990e-02 3.693775623119184559e-02 7.006338056170691164e-02 4.124988009436547642e-01 1.542335949221355362e-01 4.815313374349132480e-02 1.585429078740142189e-02 1.142502731441207287e-01 4.385077298841429383e-01 2.352530373521549478e+00 2.994244002404328420e+00 3.127889282441532970e+00 2.281195361445691461e+00 1.062955616937014014e+00 1.737102632424170068e+00 1.177903080956764548e+00 1.056489077832112045e-01 4.098677954008852348e-02
4.480736381541365609e-02 6.171601716918644065e-02 3.994605173056194058e-02 4.589187091514135286e-02 9.886620537662066388e-02 5.672650454597036318e-02 2.909867271573062242e-01 3.750592389328458731e-01 3.438362748723160500e-01 8.092199948545451826e-02 2.603516341666235745e-02 1.193888583111842594e-01 2.062012290127435143e-01 2.999626222721547136e-02 9.350315989013362195e-02 6.149152238604916471e-02 1.078373507482995597e-01 3.114302034698819555e-02 5.742178555392590811e-02 2.703309196273232518e-01 1.461798663635500706e+00 2.769102416084304075e+00 2.971564110799143954e+00 2.804678783931079611e+00 2.144293664225986884e+00 1.569012433232002346e+00 1.522530342957681526e+00 1.044359204456250634e+00 1.200246871624122413e-01 4.489228503464617881e-02
1.143357214642866382e-01 1.044605440558622200e-01 5.342674115588896822e-02 3.833468999780932640e-02 4.962130116284679121e-02 2.653084551133339658e-02 1.533030410412410116e-01 1.364487599980209465e-01 3.769175611818878502e-02 2.067495222719643519e-02 9.887978462962956558e-03 1.818065697194747310e-01 1.024216422486241007e-01 4.804231406449792352e-02 1.041347951807068406e-01 1.799759273033976412e-02 6.197212265962906419e-02 1.381833280353709781e-01 1.302748189509481125e-01 5.742294379243304547e-01 1.560517865888890965e+00 2.242204088960851216e+00 9.044830123174317782e-01 1.343533672713405513e+00 1.721491698018668304e+00 9.693616387025520975e-01 7.206009041820945482e-01 6.150890766521922570e-01 2.265535008380510362e-01 2.469534655628725928e-01
9.301476220421626973e-02 1.067286380641409710e-01 1.715275664564477193e-02 1.206216863586604196e-02 1.002344154848022924e-02 1.322277947796088315e-02 1.946562419576207403e-02 1.347023267071432440e-01 6.558807006826091607e-03 3.228169605196664488e-02 4.765226214657608539e-02 7.583866593489008157e-02 7.201104180666162424e-02 2.281876003605275427e-01 2.989830803691228417e-02 3.358748352182818753e-01 6.220579681665270311e-01 8.812455154994937034e-01 5.896683373486335533e-01 4.355528879642547313e-01 3.042569173751709100e-01 1.070981962847643437e-01 4.102674913039318361e-02 8.819257479732821314e-02 3.162157000872332646e-01 1.057741158232968492e-01 1.058359486936735205e-01 4.391139560973941064e-02 4.333692771747399419e-02 4.059391334726530909e-02
1.934568667524809715e-01 1.554186835712942361e-01 1.885839798097048089e-02 2.075472783711763969e-01 1.298383032987091186e-02 8.534114327881319947e-03 1.359599012429937859e-02 4.763336694599437648e-02 4.484096990986052161e-02 1.943272672613273119e-02 4.887782965423287385e-02 8.895390141027770259e-02 9.278705734454834042e-02 2.543468120331902199e-02 3.413029553620525874e-02 1.919948311558123955e-01 6.909902231511881876e-01 1.262793239118866317e+00 1.401406298098598402e+00 1.190671902648651637e+00 2.488008831529459619e-01 5.461674122497266193e-02 6.722693151225092589e-02 1.657934898194776130e-01 3.664719209221078966e-01 1.074854436180937012e-01 4.440822165642716729e-02 1.563392408413839252e-01 5.937032900404014268e-02 5.751173484586644125e-02
2.403691364090077276e-01 3.209571895784867068e-02 2.074847094065278563e-01 8.632906021905767391e-02 1.107303262753238232e-01 2.443302878018645541e-01 1.013182574901887525e-02 3.897127057762313218e-02 2.261020463392378332e-02 2.581663596547918715e-02 4.679216575187095800e-02 7.848543856592050949e-02 6.934963675102966130e-02 1.740080714770102233e-02 5.627293360818431261e-02 2.701437192474751559e-01 5.151550928839385701e-01 1.164630933736491514e+00 1.441584003471197972e+00 1.202670992683694262e+00 5.930716343373974020e-01 3.622063200186345644e-02 2.704178138504013257e-02 5.773925830098135953e-02 3.138464180983354113e-01 1.815294260314066210e-01 1.757065001560966788e-01 4.054695933921324824e-02 4.787663053887340758e-02 4.364920029427076659e-02
1.329392732887654804e-01 4.345406988463412779e-02 1.742247108249937726e-02 1.711543337846817975e-02 3.795854464917817334e-02 2.592177028126825544e-02 1.116221239205916760e-02 1.523608011237949644e-01 2.290561177190974240e-01 2.926310636623409844e-01 2.757940269393518301e-02 3.261533951102266182e-02 4.160018475090451751e-02 7.941579664447023790e-02 2.207459966708591459e-02 8.211207654558472235e-02 8.386444315050008147e-02 3.514475796998109969e-01 4.437104010765103301e-01 3.701962519673009933e-01 3.331898770125280573e-01 5.259565442819280623e-02 7.985327487244846256e-02 1.295679051442029106e-01 5.773623032611831241e-02 1.390986421897411895e-01 3.748463233308741982e-01 2.349700977210498198e-01 5.436822610574729153e-02 4.801255959565114279e-02
4.757284666952900365e-02 1.891051313492377386e-02 2.006263353097091293e-02 3.425016197365676751e-02 1.950072305145244406e-02 9.103109793712689177e-03 1.485641888913704078e-01 1.078760236692535984e-01 1.038817312836533800e-02 4.005698789931932957e-02 8.815064045821699446e-02 3.214270105272926115e-02 4.761802016667141674e-02 8.454122347138759430e-02 1.979757361067050955e-02 3.607767982714454869e-02 3.013215527557745396e-02 1.823638774256899908e-01 2.448432837788960814e-02 3.964387022733113081e-02 7.596676606607433158e-02 1.778132370928832140e-01 8.670204176469106794e-02 6.540785360518447389e-02 1.267661799469382289e-01 3.334050813683620690e-02 1.498565182501543913e-01 2.335713747212125879e-01 1.378455677453447048e-01 7.692431514898824541e-02
4.822547964283890876e-02 3.875124463943555031e-02 1.877344384157542470e-02 1.389518094557765787e-02 1.347795823407803122e-02 1.809835134619497410e-01 1.234297441239841087e-01 1.290007763854075507e-01 1.412824358511123868e-01 1.710521297771339100e-02 1.615335665149509325e-01 1.468695689586318465e-01 1.187357198840277850e-01 1.202536749635619018e-01 1.855022117068997473e-02 1.895551772433977378e-02 1.634964855068856415e-01 1.026073482773166012e-01 8.925068991782719729e-02 6.665793143780084085e-02 5.305928124080312724e-02 7.611441566585416818e-02 1.107177027219306276e-01 2.427352379779423308e-01 9.984300542694132807e-02 1.844893120210422954e-01 8.373236264505926063e-02 2.258743359273621687e-01 2.374589103287690905e-01 1.581541824397555140e-01
6.554387617565989033e-02 3.419562416792683995e-02 1.930570225859301950e-02 2.659311086437668448e-02 2.435855536768566018e-02 1.335985668666275772e-02 4.582393812631024854e-02 3.612532341205956787e-02 1.946984792583331958e-01 1.415129040652828851e-01 5.159471514667361702e-02 1.090625999487751935e-01 1.835423275388292294e-02 2.009436709243452718e-02 6.132066671762818194e-02 6.074447920315974997e-02 1.863366110650712670e-01 2.228542628400994041e-01 1.011548884126428349e-01 4.456673295351214203e-02 4.289042765298828330e-02 6.593200800118866056e-02 9.701662616675001127e-02 2.815575102322075418e-01 1.029942774047905851e-01 6.838613752498751142e-02 8.161793189798838277e-02 1.076049000580033277e-01 3.560264565100917378e-01 7.358608032278557420e-02
8.817792962389506273e-02 7.638121096978094104e-02 2.305044208063553035e-02 7.943036573995185257e-02 9.438445044094953551e-02 1.778777795625319791e-01 1.181488170507884183e-01 1.471855747785418347e-02 1.964531216827684335e-01 1.147625525349489223e-01 3.416560570513092060e-02 3.898683022671119158e-02 4.269037861709118475e-02 1.542059457066067840e-01 1.839512045440245547e-01 7.990115065510411396e-02 6.622252942135084530e-02 7.159485145426489061e-02 9.497797389015172342e-02 5.448478987315097388e-02 3.850966599970333942e-02 5.726352424633154858e-02 6.366429378317634002e-02 1.027639634798510754e-01 3.219711718218349339e-01 5.222354977053027952e-02 7.928890667143972948e-02 1.319963333563077268e-01 1.612009788831378909e-01 3.231533831209242313e-01
4.807470520332463026e-02 1.196801313007825329e-01 3.583600369772716593e-02 3.880307515872305490e-02 1.919138356872966689e-01 2.041154476810975171e-01 1.358985688441647077e-01 1.015245501730582638e-02 2.714105229582145506e-01 2.550650429152694354e-01 1.038321483563610231e-01 5.154297542996804510e-02 3.077974352027028349e-02 4.872222328941996222e-02 2.235887939346729025e-01 5.898140921340085108e-02 1.593909655261544767e-01 1.005039468068368164e-01 1.491891735927586560e-01 3.160540974191214381e-02 5.410359621961312315e-02 7.599676838858886174e-02 6.545462314855107766e-02 7.075091360281149377e-02 9.422348521642834318e-02 7.360701942628238015e-02 8.897354985627083102e-02 1.108591597419901625e-01 1.505918282439723532e-01 3.722553503985743806e-01
