6.395602421044601726e+01 9.050090551042265474e+01 7.723353934583464309e+01 9.818494862417506397e+01 7.002335878561181914e+01 1.507118342745134214e+02 1.413964136980126796e+02 3.722489753702892585e+02 6.776994746882024856e+02 3.146154189940344850e+02 1.633100925348663850e+02 4.127407097210911502e+01 2.595571023517065612e+01 9.881213939534892177e+01 1.237524091604834240e+02 3.118901182291911311e+01 1.355764476921682729e+02 2.711535854807963801e+02 2.892802027553515813e+02 1.264941661545650078e+02 1.227024783158891523e+02 1.797721659768463098e+01 1.397409146124972246e+01 5.609871792975535953e+01 1.102454580141118328e+02 8.772930526242882365e+01 4.111986280744072531e+01 3.712342947940734383e+00 3.590458458692125987e+00 4.564331971230406459e+00
4.162797838105774417e+01 8.708022313098661016e+01 1.548258184585001800e+02 1.197217373067467463e+02 8.390411209343392329e+01 3.841090815338350239e+02 1.932216596491928726e+02 2.304076310110017971e+02 1.514306568484833520e+02 1.301601161207433961e+02 1.022399586233468511e+02 2.149401331334495779e+01 3.105110931828792431e+01 7.650090858657566173e+01 1.136385826319770871e+02 8.524573349798350819e+01 1.249355172376867102e+02 4.671171486080670547e+02 4.118680913182138283e+02 1.484734987556896897e+02 7.085466496842552431e+01 1.713536723876279666e+01 3.607759420405646722e+01 3.222133585953154977e+01 2.876260450819115633e+01 3.914175963465294927e+01 1.412179942743425798e+01 3.715618777577017529e+00 5.377899917680379005e+00 5.471341494046605192e+00
4.780361631055973248e+02 4.488129964055016217e+02 9.255889718099767833e+02 7.267288445031953188e+02 1.615474806118646029e+03 1.736232420179179030e+02 3.668195495241393189e+01 3.898630811654616224e+01 6.413844818408462061e+02 1.933047960208398308e+02 5.460964082956107859e+02 3.868603437551939805e+02 1.529186040435259315e+02 2.483347313731527493e+02 5.089558466493095779e+01 2.527387770060914534e+02 1.962011961033322791e+02 4.658043694522908140e+02 1.825365087415919788e+03 3.660103319481157200e+02 4.620023318710843796e+01 1.409003535363545012e+01 2.161792004522141752e+01 7.650407786633627083e+00 4.653329161329347485e+00 3.160004881140488386e+00 2.869432288506451822e+00 2.303684736592239268e+00 3.968357421916338890e+00 4.545198627439859251e+00
2.229334260705901443e+02 5.813396016196891196e+02 1.245841227045140158e+03 9.779378506368304897e+02 4.329042626570810626e+02 7.155631473775575557e+01 6.883449837413110117e+01 4.318374403260138195e+01 2.538499814461969351e+01 2.222330425166205430e+02 1.420302722784239791e+02 2.967916232878108076e+02 1.460507106877262800e+02 1.146330693173420769e+02 3.709561095634911965e+01 3.358121068042508739e+01 7.887572229547372160e+01 1.623796938601747684e+02 1.339305542674946139e+02 1.320049693525227212e+02 7.565343839340181376e+01 3.127497079011184056e+01 1.031591139060468976e+01 2.014839763906893211e+01 3.821543667101026109e+00 2.869976469920954010e+00 2.496961968733368842e+00 2.386245205363864752e+00 4.804868372282886213e+00 5.335148221894765896e+00
1.404913193570801582e+02 3.907258549447088853e+02 1.050585527401847685e+03 4.085301777996961619e+02 2.594293235838399596e+02 4.175509365949406515e+01 6.983393790460573314e+01 3.947444025821461366e+01 1.563432473478920670e+01 5.007414967904542777e+02 5.894667355126646271e+02 5.333517924305535871e+02 8.667838546384928122e+01 8.741062651778739223e+01 4.655535202899786640e+01 1.977310249318049529e+01 2.380081362585308398e+02 1.438469810598384697e+02 2.563595689948689369e+02 1.534665702631449165e+02 1.141059818929788605e+02 3.604233849608870344e+01 9.711701932881604193e+01 3.440236679628677052e+01 6.960457863444947435e+00 3.839148152376954837e+00 2.695648131907131706e+00 3.145435897470301612e+00 4.863902321148466434e+00 1.825510387606688312e+01
1.583545976488572080e+02 1.512392126417791758e+02 6.534997971186442101e+02 5.211136322853237743e+02 2.240205120123310678e+02 2.447503393969707375e+01 2.979038896276410853e+01 3.164648985750790189e+01 2.691060416461149174e+01 7.447273233119800580e+02 5.478824622518558272e+02 3.031386458736590157e+02 3.860581256497683711e+01 1.432301327897439513e+01 1.228419024158488959e+01 2.204887705036610512e+01 1.250550974667799551e+02 3.259892143514649376e+01 1.117311819928690682e+02 3.937267065531980847e+02 5.303484872472532743e+02 3.671614847065681602e+02 1.135325168781190541e+02 1.969682732447754958e+01 1.049613067141454437e+01 1.004293207030975310e+01 6.267029618569504024e+00 4.354488110257513256e+00 5.662595583562218593e+00 1.037858721738739831e+01
2.276743061313556282e+01 3.499976180123533709e+01 3.569754191003330845e+01 1.789825644531306921e+02 8.717828277583248564e+01 1.432723296732690130e+02 2.113347600875147805e+02 1.187120156061179728e+02 1.337867427341737141e+02 1.468873091452632877e+02 1.079582138311730830e+02 4.691064717261407679e+01 2.145384128505550336e+01 1.020798216011921689e+01 6.120784759741392911e+00 1.108668538292769057e+01 6.522712186023994718e+01 3.020393193253402586e+01 1.575323131759955118e+02 2.230018637398784449e+02 1.150741210424137080e+02 3.274572217330930357e+01 1.598207869427496952e+01 1.738365979395874206e+01 7.189318241208015436e+00 7.441779711496044669e+00 6.471510724817886029e+00 5.664460678421811224e+00 6.485512629947900010e+00 1.564707763880521618e+01
4.531835620741666304e+01 8.424059325359237960e+01 4.839738760061128886e+01 1.038544757112383934e+02 1.551996064644467310e+02 1.696603134223305744e+02 1.479663238005071833e+02 1.390261872784644481e+02 1.170624960663311640e+02 6.615277332227475426e+01 2.700463046551547208e+01 8.436191439322386998e+01 1.848544514624055068e+01 6.775196555410447630e+00 7.815724073002067840e+00 1.482576167506713105e+01 1.170232252045342136e+02 1.820787617285912461e+02 1.670842970107763676e+02 1.315894930111222720e+02 4.386766623080405481e+01 2.604363685530675809e+01 1.094038147219420587e+01 1.028938843434808348e+01 5.364953971087862428e+00 5.638436411406299698e+00 8.662242753899999315e+00 1.011347914307505924e+01 9.034289998893125784e+00 2.587062563274405846e+01
1.056743444183145471e+02 6.809536729948823108e+01 4.095663054010888260e+01 2.405024328986854414e+02 1.603292512147151285e+02 6.755463469682628386e+01 2.211170051294558050e+02 1.002379900292178831e+02 9.155707707894802638e+01 9.291656664957585576e+01 8.437377997478736802e+01 1.096833929335339803e+02 2.385135283394053545e+02 1.634414900112576561e+02 2.570601011314558448e+01 2.189045476833644699e+01 8.997354610838871736e+01 2.748399661776992389e+02 2.934432479182543148e+02 5.733275775317169831e+01 1.116150192067680003e+01 1.145267194857917659e+01 1.259441004180290946e+01 8.881201363768365553e+00 5.875047376425137635e+00 9.001463872956986023e+00 3.258892686735421051e+01 5.576553315256427368e+01 1.511160160327243887e+02 7.482690908050312828e+01
1.673518163852599514e+02 1.042553286196977069e+02 1.725836339638140657e+02 1.625416364945197358e+02 1.534083313481742721e+02 3.124916789289126129e+01 1.542599561237784371e+02 6.688897598584043180e+01 3.149611133907254512e+01 1.147960336192728192e+01 1.606163711669266263e+02 1.431661410153244560e+02 2.963998626035306074e+02 3.246446690029129059e+02 1.620054708502989911e+02 1.657762349006941633e+02 8.724526855603221520e+02 9.409516131028588006e+02 4.290986175911690452e+02 2.293297491093898941e+02 1.392215134585840985e+01 8.503034542174473742e+00 9.524101539856339116e+00 1.072420205359274448e+01 6.466165597065373305e+00 8.679067062712851666e+00 8.161265418558886608e+01 1.209759859875184702e+02 1.435636162977126560e+02 3.807047075512760159e+01
1.455777968834159424e+02 7.065030899294649203e+01 1.622559575993078624e+02 1.376947557342728601e+02 1.928131349890828119e+02 1.890909202710981774e+01 1.776819467901305316e+01 1.618931003265055679e+01 1.138571934536140162e+01 9.470418530104140586e+01 1.324226788265655159e+03 1.958373729576154119e+03 3.873218778362582270e+03 1.891575113988053545e+03 3.551239197652913617e+02 6.422778980610438566e+02 1.177071825805108119e+03 3.431014133839200895e+02 9.406059594744080243e+01 2.277071719280388962e+01 9.184174839159819470e+00 7.900255437732623065e+00 9.840212769357425060e+00 1.386946533628694311e+01 1.547204369740472885e+01 8.881752637000428052e+00 1.455023952756528161e+01 1.062856920712153652e+01 9.229820252004905967e+00 6.809074082296376673e+00
3.025661391459032856e+01 1.630731971596778251e+01 1.424084949278925478e+02 1.362819831604675187e+02 1.145217570890320644e+02 2.932303415174046535e+01 1.371544969964548777e+01 9.651130950399078756e+00 1.203789445150287740e+01 1.993754917896611971e+02 4.186932705137331823e+02 2.364261070814231061e+03 4.004699840020108240e+03 2.033906457491510309e+03 7.565786583223402886e+02 8.102831808257415105e+02 8.845344628040305679e+02 5.502250784271550401e+02 1.553864315039583346e+02 5.113770899712531559e+01 8.688334630264689551e+00 8.558521855001886891e+00 9.751207150507607224e+00 1.738247028850308951e+01 1.700991553667176248e+01 1.283151923869677447e+01 1.053092773290759254e+01 9.342035628583225559e+00 9.566524060606209190e+00 1.047221801754438175e+01
6.735339157112322894e+00 1.558673646086305631e+01 3.602449393628954510e+01 9.980309865458704621e+01 6.898751689380061691e+01 2.401956762098517117e+01 1.373732387637959462e+01 1.263159870504558313e+01 1.692976627158525815e+01 1.181311165733644657e+02 3.341610045134545004e+01 8.501731464864766394e+02 3.246621295865511001e+03 1.305540658522775175e+03 4.010909524730242310e+02 4.408522347789056539e+02 1.596236563580185361e+02 2.322345366092442305e+02 2.713889671177915943e+02 1.074195992299174804e+02 8.254864692358786726e+00 8.829281180707486243e+00 1.083236197390456823e+01 1.816336100766341843e+01 2.349855461724961003e+01 2.148616366446081116e+01 1.629169236524781894e+01 1.499718864434281329e+01 1.201349666600979127e+01 1.005580606707670377e+01
5.657713701566425613e+00 1.518977665142398692e+01 2.496254748883798413e+01 1.786221439769395758e+01 1.084692764722692360e+01 4.840600893624507961e+01 1.811784484176527030e+02 1.683811653738082441e+02 2.455001099618043625e+01 7.967363525420850578e+00 2.845356344671260374e+01 1.572447166667475358e+02 1.630591569064103169e+03 1.992843242718751299e+03 2.015892819693212459e+03 2.546784740252317533e+03 2.142940753328376104e+03 1.291655010063842838e+03 3.380726381007045802e+03 1.620413391309873077e+03 1.508413393276147758e+02 5.395275643113146202e+01 3.995145914229541262e+01 9.615591000821760304e+01 1.959783246522453908e+02 1.701614284631849046e+02 4.697811992802353984e+02 1.696081079249698291e+02 1.612255505827902624e+01 1.874442455489250392e+01
5.234486699043483071e+00 4.966029101089490361e+00 1.266713390897598224e+01 9.460164045895983520e+01 3.548804059236903186e+01 9.253801942308660600e+00 1.245763607948802161e+02 3.759873403157874918e+02 2.826994735213938839e+02 3.103774243534589061e+01 6.407201325371354983e+01 8.758880581501072129e+02 1.612435417014219638e+03 1.791775719902330820e+03 1.466956737466518916e+03 1.618746418265405737e+03 2.508943226229002903e+03 3.977248069150489755e+03 3.877112802227327848e+03 3.142669835324469204e+03 1.462947677613754536e+02 1.615247000282162730e+02 1.333429264836873926e+02 3.973531402793853999e+02 5.254748439239598383e+02 2.587942094374972385e+03 2.652799277441477898e+03 6.027447895455146636e+02 1.639338102657394813e+01 1.259008744542795810e+01
4.890817679480772284e+00 5.067136318365013103e+00 1.064100966054872721e+01 1.173819887235327108e+01 8.103613376474552155e+00 1.013781917866610982e+01 6.678999131524065547e+01 1.840361513821695212e+02 4.034863072018240473e+02 1.625863188559270327e+02 1.767517690050281942e+02 1.435555552075618664e+02 1.002277359415885599e+03 1.801363434232087457e+03 1.523267539444897466e+03 2.083279800830860040e+03 3.136450156412201522e+03 3.456675154067102085e+03 1.908375261442982492e+03 4.228984843153200472e+02 2.558416078340532067e+02 1.703027876298169303e+03 2.343094174355795076e+03 3.766018292446389751e+03 3.348377272370208175e+03 4.232771988290571244e+03 3.510959134407808051e+03 1.120762189214755836e+03 2.426115928062882432e+01 1.426611754894784312e+01
6.293748683600117744e+00 7.037383899443552693e+00 7.138566432916934268e+00 7.010996654656079130e+00 1.093237897775298784e+01 2.014329911326213818e+01 1.069331786405377898e+03 3.448980317393222776e+03 1.765515690436827299e+03 3.371013160587857556e+02 2.865981893643796639e+02 4.631416010636664851e+02 8.442549032085305498e+02 1.079441557879583115e+03 1.230506902198425223e+03 1.943539198979846788e+03 3.572606829592475606e+03 3.302687685800513464e+03 1.517147409119286522e+03 5.118943220068902065e+02 2.020049735991028683e+03 3.347121526269841524e+03 4.052309572070409558e+03 3.995451832063668007e+03 3.422531793076193026e+03 2.939522266183443662e+03 4.516488224262991935e+03 8.576169616465905392e+02 3.209515264549186497e+01 1.735452271186016304e+01
1.662920231831615681e+01 1.282737975296973687e+01 6.701928663176106582e+00 1.022458065402170035e+01 1.311041725533188753e+02 5.827252902633061922e+02 2.950455442822450095e+03 2.320339075680233236e+03 2.393072412115636780e+03 1.346218612645736584e+03 5.732950827715213791e+02 1.767460523842959788e+02 1.669408138445977272e+02 3.701413908583647299e+02 6.903612766757858026e+02 2.789525544410067596e+03 2.457437697783418116e+03 2.630616795329894558e+03 4.337716649947419683e+02 7.067078637204900815e+02 2.172398180752228200e+03 4.231456293957095113e+03 4.911806146175383219e+03 4.916206331057426723e+03 4.052854926963498201e+03 3.949856428478411544e+03 3.839582065200820580e+03 3.195147496265050449e+03 1.598576888612798257e+02 1.316956787752045557e+02
7.151229100838817132e+00 1.972782991059980162e+01 3.735164861937730763e+01 2.555480403906408355e+02 5.794823259168208551e+02 7.448918416780700227e+02 2.221453943726068246e+03 2.681797141562016350e+03 1.938787544108835846e+03 1.647716066805908213e+03 4.028878746000535784e+02 4.726449138360733571e+01 7.003698473510976896e+01 1.620244741758854730e+02 2.793229540371303301e+02 1.452178669963996981e+03 4.767958823561318695e+02 1.449393661123463346e+02 4.467850665681238809e+01 2.777459820588505863e+02 8.777047357429107706e+02 4.159710304799799815e+03 4.894190050097344283e+03 4.913727027468870801e+03 3.537982233993805494e+03 1.636664433373856809e+03 2.691909802258047421e+03 1.932405466798540601e+03 1.904657054474260462e+02 9.318992153966050296e+01
1.690454855583749918e+02 2.212378276901180811e+02 1.592596733154308026e+02 2.077555747471039638e+02 5.290510263782055063e+02 2.918771245958030818e+02 1.463672371587309499e+03 1.857155545270681614e+03 1.808485828585094168e+03 4.642737439285926371e+02 1.320129029455012812e+02 3.262336504400053627e+01 5.480932023309232903e+01 1.315823794628011285e+02 4.249125543476169469e+02 2.552066743431886948e+02 4.152775397314140946e+02 1.150411740910128771e+02 1.819463146636845181e+02 6.787812241167839602e+02 3.008060472681914689e+03 5.115700149856463213e+03 5.099727275148638910e+03 4.596533372606158082e+03 3.409399894580338696e+03 2.444793784438905277e+03 2.379097679694662475e+03 1.676296490746618929e+03 1.642086166816962987e+02 7.161034637211071185e+01
4.753867507437749396e+02 4.563183330112660769e+02 2.694737588323599766e+02 2.240601000649347156e+02 3.352101211610490736e+02 1.777868113160263306e+02 1.014481799241210638e+03 9.069077761191290392e+02 2.715730092218927894e+02 1.564686932066727252e+02 6.099172524248979244e+01 5.138544168085371666e+01 2.728906400835806068e+01 1.244722625428191165e+01 2.658012605042933529e+01 7.751522188683119907e+01 2.350625255403752192e+02 4.762487407400691382e+02 4.026289181800777897e+02 1.507218898901960983e+03 3.499502575228264504e+03 4.599213311395435085e+03 1.746659183302821930e+03 2.423426158372194550e+03 2.914359292538068075e+03 1.570911124180226125e+03 1.165092924845455173e+03 1.007820539840194328e+03 3.990434529384896223e+01 4.352139756353719235e+01
3.847517545723364947e+02 4.692162078254888229e+02 8.332056746858958718e+01 7.323694889867417146e+01 7.190334390481444871e+01 1.082203656934782430e+02 1.597854428132230851e+02 4.215751563447506101e+01 6.223059724931562187e+01 1.067451240691424630e+01 1.507728968171932138e+01 2.240025066220793093e+01 1.950091586318785630e+01 6.024359725218432970e+01 1.332654768403637604e+02 1.451771056749113313e+03 2.256285327322863850e+03 2.831536422679610041e+03 1.712567427076037120e+03 1.172030360496396497e+03 7.478613228619540223e+02 2.523658709324868141e+02 9.008549934152718208e+01 1.697751299633296185e+02 5.562399154347812100e+02 1.771128736276391464e+02 1.658856974642084197e+02 5.922698480506636542e+01 7.097252800611146384e+00 6.665579534124276506e+00
8.478534865184653881e+02 6.897882303740757379e+02 9.455742679068677603e+01 5.775851321165436048e+01 1.039369406335681560e+02 8.329055403254685075e+01 1.401623595936046911e+02 1.657726444031673552e+01 1.451238084280459084e+01 6.231467410087126346e+00 1.464110745640643607e+01 2.701243724271635926e+01 2.509413446916860480e+01 1.132722398842823850e+02 1.460978307314715607e+02 7.732075203635064327e+02 2.307691714698063151e+03 3.748257257105383360e+03 3.828587068972166890e+03 3.146788149472616169e+03 6.548064012577111725e+02 1.461262036174867944e+02 1.659949594585311559e+02 3.219214648817845728e+02 6.478056781854277233e+02 1.772469696674073703e+02 7.045629035001795160e+01 2.803001202309804185e+01 9.624309504048984110e+00 9.302498482726974771e+00
1.129622191062488127e+03 1.503102160730265382e+02 5.401861015769974728e+01 2.465241587279082580e+01 3.472235175273659280e+01 8.174938140961435806e+01 1.136726012382154352e+02 1.288959900392306324e+01 7.160080296372031583e+00 8.249191757287263727e+00 1.455271123491727359e+01 2.444554603026281114e+01 1.902765421544708602e+01 8.748006258049429107e+01 2.752485600679674462e+02 1.136794842585216884e+03 1.802443606563759204e+03 3.574041012856775524e+03 4.023639137351795853e+03 3.194085400024848241e+03 1.545319827518945203e+03 8.813633169297750669e+01 5.774429937440989136e+01 1.011895003250474474e+02 5.298538357205343345e+02 2.875318290011916815e+02 2.546166781022985219e+02 4.879624897364856650e+01 7.775921449730359925e+00 7.040409926113790462e+00
7.294909980238123808e+02 2.329354109877670567e+02 1.216960546685039191e+02 1.403439221181053824e+02 3.760482750415047803e+02 2.799121153589767346e+02 1.193303100844866833e+02 4.984129199552401701e+01 7.551115243966874857e+01 9.853437261902547561e+01 9.164237452822678875e+00 1.031656992807847573e+01 1.142376467291835596e+01 2.040651945954892099e+01 1.006166309227648696e+02 3.627257185922073859e+02 3.115316317738706857e+02 1.173058944348655132e+03 1.351650643900952900e+03 1.071115554948710496e+03 8.536170573038718885e+02 1.067443338304244662e+02 1.538511044301799302e+01 2.484516542310056053e+01 1.020170555393123948e+02 2.326416360683360836e+02 6.120272931070429649e+02 3.419497511986322706e+02 9.176134384390849164e+00 7.973774941908683189e+00
2.903532716736605153e+02 1.184296135130339707e+02 1.579590216467021833e+02 3.211297557845075517e+02 2.102189681426123684e+02 1.030100377776495861e+02 4.869041867284562386e+01 3.495243856954347450e+01 1.120308931865579183e+02 4.350193917365142511e+02 2.949408167066240338e+01 1.000467131811469201e+01 1.275173862283331339e+01 2.125132910695703004e+01 8.612925909695556470e+01 1.406121899761798204e+02 8.696799337379212602e+01 3.943473260862526786e+01 5.674989384418967120e+01 9.462965441462651484e+01 1.577501748610167169e+02 3.384286334240113092e+01 1.570319979908498098e+01 6.977891381195472320e+01 1.597964705837542851e+02 5.138709060287804675e+01 1.704003010876812141e+02 1.860968768457242390e+02 6.957795292228628625e+01 1.193145369142117040e+01
3.336957679015507665e+02 2.737481136963783683e+02 1.571755703891319627e+02 1.364398749314516692e+02 1.521946824310150532e+02 5.995899912318901670e+01 4.067422821425203949e+01 4.257358355121797899e+01 4.759001120444024480e+01 1.904629390951557752e+02 5.324847386076228872e+01 4.346196191122450614e+01 3.131734262527713497e+01 3.029269899481514017e+01 7.705518333262580200e+01 5.026188047648715695e+01 3.330406647972497325e+01 1.989091749901809791e+01 1.718510662491457452e+01 1.299578948625802433e+01 9.960119243443999792e+00 1.349191028336154652e+01 1.855403137866170837e+01 4.109636710553362349e+01 7.034137524785342066e+01 3.290987623934925210e+01 5.219792802776308349e+01 3.216304706581166073e+01 3.222956498694445315e+01 2.158551725584415948e+01
4.560090133548559379e+02 2.447170929305245011e+02 1.616471693814625610e+02 2.639313743235048833e+02 2.638221939305865931e+02 1.525967750223938424e+02 5.491851597905650806e+02 4.267751945473045794e+02 6.405664696118464008e+01 4.657926778401609624e+01 1.656764240953900824e+01 3.221349552931405213e+01 7.191644632290606864e+01 6.292834878725935255e+01 1.740303241314768457e+02 1.223294288824122731e+02 3.740183469628095736e+01 4.274564997100227259e+01 1.927086697633626500e+01 8.476219083900717877e+00 7.722409374948492555e+00 1.125758295278293986e+01 1.575521709530189085e+01 4.406270795828154974e+01 4.442204275844009942e+01 1.053814477171341224e+01 1.195611179309277183e+01 1.400935149648968547e+01 4.316318590523287924e+01 9.053464886307173387e+00
6.063810390149365048e+02 5.400649676327942643e+02 1.860840055939893887e+02 7.502431582381659609e+02 9.605587669957503749e+02 1.891966802219949159e+03 1.389740807800458242e+03 1.732327725943196697e+02 6.349496014188862603e+01 3.672982924096804425e+01 1.081049845259813580e+01 1.191162947391980254e+01 1.103368468211079545e+01 3.434628229187094206e+01 3.880998697979120493e+01 1.592532854425967059e+01 1.316523155352776797e+01 1.389163161463412521e+01 1.853099149176774318e+01 1.032399936018172326e+01 6.638387787228158032e+00 9.330213475802452194e+00 1.000201532831670903e+01 1.557181126758340106e+01 4.818406514139884678e+01 7.449509057221060715e+00 1.068452392980100285e+01 1.614988806612251437e+01 1.812915303858132887e+01 3.695391954145021174e+01
3.474121476719024031e+02 8.932689241861741039e+02 2.998855780479109399e+02 3.767161420059077273e+02 1.960463476105310065e+03 2.152007324423211685e+03 1.585186626714664044e+03 1.249994749097317595e+02 9.020379762874094354e+01 8.432837602109904651e+01 3.422498614470115541e+01 1.670676907298330960e+01 8.030832100523550565e+00 1.061098413539539109e+01 4.640017054842666511e+01 1.184842737387192457e+01 3.346004086516590803e+01 1.706226088707751387e+02 2.902649336207921920e+02 4.081293882232073145e+01 9.471981207043940643e+00 1.261338652922388093e+01 1.062678514026502086e+01 1.093883974460995034e+01 1.430993873246132964e+01 1.055189067239876977e+01 1.216863199706095067e+01 1.418079204372327418e+01 1.749039140754081956e+01 4.406210925378321974e+01
