8.408835545411285500e-03 1.247328847489450818e-02 1.093799172683340877e-02 1.389882498132025482e-02 1.061999110967799809e-02 2.335178433671099979e-02 2.317024030328276515e-02 6.272791854665994704e-02 1.138146648755464369e-01 5.116600397708134101e-02 2.364148332738708058e-02 5.371186689485400213e-03 3.130518026213626424e-03 1.156661099707333336e-02 1.331021719981895744e-02 2.885558742523295327e-03 9.990825364188245586e-03 1.717846250526914795e-02 1.524588022436638296e-02 5.265252937549586357e-03 4.723600633274043122e-03 6.078582052646756828e-02 4.782468510659425992e-02 2.586519871929559167e-03 4.304393751187646049e-03 3.569474757216408931e-03 1.348937613652998191e-01 1.224211673276809700e-02 1.172489052451522289e-02 1.477774384338004406e-02
6.761449082663580946e-03 1.514328721115607013e-02 2.725757880378699288e-02 2.233361728154965170e-02 1.558798499219673887e-02 6.975786163144206964e-02 3.307281791738478360e-02 4.170037993900992807e-02 2.715964001234439859e-02 2.301484715594646208e-02 1.611111603313603036e-02 3.123750281954783964e-03 4.118717392345533704e-03 9.333947233008565991e-03 1.293082991970758572e-02 8.211287162319644978e-03 9.979911289290065157e-03 3.202857282095827873e-02 2.365315131249269565e-02 6.965050302106076674e-03 2.804093843589708195e-03 5.777487993910213060e-02 1.243176531882288771e-01 1.079593253070110226e-01 9.379443107866988760e-02 1.287191962926626521e-01 4.716195895477631739e-02 1.242879471067762608e-02 1.773312483476386509e-02 1.774784923242871820e-02
8.349686360600541701e-02 8.592816114104943892e-02 1.816591585135571563e-01 1.478068425124567931e-01 3.135095522098253484e-01 3.187296081164065625e-02 5.903080869119253782e-03 6.318370971800850965e-03 1.012800013063012150e-01 3.040260761941188800e-02 8.032431624923724867e-02 5.286023207744586228e-02 1.928583231226937283e-02 2.800276394350107584e-02 5.329059861964931429e-03 2.223659593411434626e-02 1.467081130265890376e-02 2.940335616168904265e-02 9.560534886676336219e-02 1.553428888687723684e-02 1.761898626266618232e-03 4.789012336210115434e-02 7.671275775465472013e-02 2.683804574820383010e-02 1.605875112770686897e-02 1.074046836191662989e-02 9.770354849900613620e-03 7.693927864019360109e-03 1.312654103891671906e-02 1.471310104569401034e-02
3.885236306678041540e-02 1.121757737429669999e-01 2.462560278444965167e-01 1.989602166527812410e-01 8.112484212655256266e-02 1.252675803177037001e-02 9.898558946584954527e-03 6.880904322530741885e-03 4.216151568929646896e-03 3.895495172924977323e-02 2.404242147354167941e-02 4.718986822054076213e-02 2.120391957965021834e-02 1.401232028763844256e-02 4.496266499277565970e-03 3.446650129879305548e-03 7.138619196697022079e-03 1.163731841851599336e-02 8.060564727535314208e-03 6.725643451979216106e-03 3.360843594888524802e-03 9.881069372034603782e-02 3.390627501441051406e-02 6.714930004312516520e-02 1.309188594540539041e-02 9.521229988940079977e-03 8.266253804315993464e-03 7.847856064275812379e-03 1.593843034403600450e-02 1.732146560903882054e-02
2.237588171334525117e-02 6.965789078222599240e-02 1.944515844558520890e-01 7.535954427061970773e-02 4.274774770385200012e-02 6.238946757525975530e-03 9.595679036768266570e-03 5.561881976322705264e-03 7.430377624104354817e-02 8.936290388096058968e-02 1.082550724338197934e-01 9.056915493371690828e-02 1.534069161591925315e-02 1.527810338406999577e-02 8.561202137953471958e-03 9.000298666880779397e-02 2.542432349199278893e-02 1.099061206862088011e-02 1.735149219557663436e-02 9.788394587493271654e-03 7.065579740303178785e-03 1.970000387876733733e-03 5.276763590398554984e-03 1.066811693991089605e-01 2.358618087936851029e-02 1.267778868555493113e-02 8.841162371463305927e-03 1.024200495266633544e-02 1.604416870430246111e-02 5.909561490049362875e-02
2.574222967603233617e-02 2.641368324452201405e-02 1.041770450488894439e-01 8.345212448236380420e-02 3.290667964897169701e-02 3.549908550675796685e-03 4.371855884705842452e-03 4.886525327563301206e-03 4.635994872333725272e-03 1.388940707044077627e-01 1.052298717884611046e-01 6.168332717953971256e-02 9.823337780459804117e-03 7.169043581761361250e-02 6.075571779280010409e-02 1.039007977554203127e-01 1.579017263592732284e-02 2.871630351770797403e-03 9.194307190573553987e-03 3.134874271973507598e-02 3.711304601772503348e-02 2.281458240346324537e-02 7.174749730693640373e-03 6.344869595366638138e-02 3.519323303277540477e-02 3.304080023334002997e-02 2.057120175148310220e-02 1.422495529236257952e-02 1.882422568952295608e-02 3.395396143231606961e-02
1.067349809787473958e-01 5.567799896181356567e-03 5.118576733978666589e-03 2.594780512582202381e-02 1.243108746153847796e-02 2.082631567626530220e-02 3.205839411931445115e-02 1.853846646983008800e-02 2.240777398121171493e-02 2.585278168714848571e-02 1.975500434801737842e-02 9.899684989781443178e-03 1.096477212248045396e-01 5.247576069584179020e-02 3.096494292157826039e-02 5.317337160395885221e-02 9.262629582390172200e-03 3.022828158234414260e-03 1.537841163168602795e-02 2.090116018216051780e-02 1.184941879732228330e-02 3.387745000673466223e-03 6.370209509945909399e-02 5.971667595526009703e-02 2.398059959332600813e-02 2.446748064170509163e-02 2.134592281527468438e-02 1.848154460540655034e-02 2.123118620189656108e-02 5.072541302740993241e-02
7.520730031471615021e-03 1.370909622597107566e-02 6.966090001560900150e-03 1.502928047074274243e-02 2.314263832484747194e-02 2.635152340534650112e-02 2.374637789357877254e-02 2.275892090169966825e-02 1.843041529589760363e-02 1.023350732355790202e-02 4.086891184892038793e-03 1.588251188113972562e-02 9.309645339548257292e-02 3.442450248780567351e-02 3.923170093087915977e-02 7.180774303655571011e-02 1.700602819028750046e-02 2.049984943532841969e-02 1.792222040669862529e-02 1.354955304610061528e-02 5.618385613651711089e-03 1.127068610364781176e-01 4.578576751128941164e-02 3.852950229031842921e-02 1.822259619958343721e-02 1.863656991606831362e-02 2.752181210093967642e-02 3.182227340478515493e-02 3.102425244787487130e-02 9.266574784061411274e-02
1.707438576129976723e-02 1.124341206309954246e-02 6.578163465757727243e-03 3.820536072920566184e-02 2.477539047813456449e-02 1.062949047188256092e-02 3.474928682818523989e-02 1.585748646780551011e-02 1.359196268474909507e-02 1.331399540784943859e-02 1.180208750488026363e-02 1.680836454229415328e-02 3.823959100118414639e-02 2.945713355094628505e-02 1.252908579583833226e-01 1.057123825080795998e-01 1.449392530821760200e-02 3.741747763892390444e-02 3.666698052402850294e-02 7.247703811163974837e-03 5.057881153695091558e-02 5.279457698579366476e-02 5.791189135072870309e-02 3.782499338817945506e-02 2.198297988910684689e-02 3.035861948298399990e-02 1.045109445070918769e-01 2.991896115897424869e-03 9.024891743390882001e-03 4.584144186800718189e-03
2.843310261620036333e-02 1.865216299662150745e-02 2.948181992076575123e-02 2.762784719302648767e-02 2.628906050470843428e-02 6.144504449542395781e-03 3.351903601785148623e-02 1.433937896510359931e-02 5.427085866923046266e-03 5.511029866421134071e-02 2.267775982158886858e-02 2.168098396057891591e-02 4.550476682995691080e-02 5.295735570471012815e-02 2.618189238508851144e-02 2.829415963282155139e-02 1.394389783030452745e-01 1.378371112320126435e-01 5.864458105514867153e-02 3.348394355003726786e-02 6.473644481176729637e-02 4.111655929077719790e-02 4.712143080035879894e-02 5.168628665591878252e-02 2.865700605909320131e-02 3.406434670130339959e-02 6.336552616579074759e-03 8.697800214892421888e-03 9.815074000630317000e-03 2.550018210512649663e-03
2.611379063965292915e-02 1.369621910915790920e-02 3.024864784172098114e-02 2.363764482729803496e-02 3.244489936296628130e-02 8.812048783001340257e-02 8.649409599550676730e-02 8.040780147075729523e-02 5.556766170048726972e-02 1.345713387529253249e-02 1.793726166405961442e-01 2.943651997531858688e-01 6.039362230064986292e-01 2.944015145447181903e-01 5.365754349362619746e-02 1.045989368046179591e-01 1.939968662068683181e-01 5.330431485175496364e-02 1.343523941277475695e-02 1.040204283429063126e-01 4.387570795647068034e-02 3.959949307148440123e-02 5.113463108540403090e-02 7.149508343581539860e-02 7.617992275634608013e-02 3.982243673957024804e-02 5.905189865105203717e-02 4.458788632293159138e-02 4.101301904627198402e-02 3.041196774433474123e-02
7.673150327979369467e-03 7.926533964067700166e-02 3.031728635616085313e-02 2.240959311359639466e-02 2.167842733068898672e-02 7.757583334859532651e-03 6.694567406464500825e-02 4.750103683955872458e-02 5.728524107558140288e-02 2.785012253700890408e-02 5.290467242432286138e-02 3.478637266586447341e-01 6.205840802757982555e-01 3.170921096117124693e-01 1.126371807457860613e-01 1.255609014772711141e-01 1.380416699460758900e-01 8.094995561857305788e-02 2.120552797895817326e-02 7.508273752560291198e-03 4.157309563926527007e-02 4.274715643997906850e-02 5.054115278824625190e-02 9.049237257199119200e-02 8.610103971919860766e-02 6.126587274664100496e-02 4.698224617159209998e-02 4.284111443626383020e-02 4.711151287632626972e-02 5.140278928720398710e-02
3.494877219475499286e-02 8.021960177754061672e-02 1.182228359777167184e-02 1.891015060231459460e-02 1.399174786961283022e-02 1.109669445531279441e-01 6.440526815233196811e-02 5.921867611359513117e-02 7.668983037245510892e-02 1.425072332223854474e-02 3.689584089558992693e-03 1.092200554476075169e-01 4.578568397780798938e-01 1.930829088855765541e-01 5.972350019522321141e-02 6.808733407780032110e-02 2.504353329317868943e-02 3.663198310142826847e-02 4.155577075500137274e-02 1.744733825595883026e-02 3.903060545426881300e-02 4.287163718713661587e-02 5.396664887247257236e-02 9.092221102417601120e-02 1.164998899809320809e-01 1.034227546517571539e-01 7.661563037227421546e-02 7.229926054719787443e-02 6.376699319174961023e-02 5.322592781284291724e-02
3.056256275812486989e-02 8.211862918581978865e-02 1.032961374424860163e-02 8.368214018319007630e-02 4.975646334570368867e-02 8.571749438945879679e-03 2.925545394925611192e-02 2.300543494937356756e-02 1.037924504470764536e-01 3.378956115260425136e-02 2.678576461390920482e-03 1.758727901734211466e-02 2.071939862368764596e-01 2.748066085791088242e-01 2.876367428415457228e-01 3.816561594836920812e-01 3.427276712311421170e-01 2.225364300359263803e-01 6.081595148459980615e-01 2.854339070268570033e-01 2.565331737840241544e-02 8.810935978299539242e-03 7.472577016834285914e-03 1.946371347786529649e-02 4.139325491626897474e-02 3.534061777187714332e-02 9.064089039189288100e-02 3.596228489650021148e-02 8.632315889345074100e-02 1.001902372928375196e-01
2.875050277755603761e-02 2.744771577518311662e-02 6.517311127422947825e-02 3.033468486360620803e-02 7.952217202169620594e-03 4.081759188899108937e-02 1.401289891405219784e-02 3.932530366613173900e-02 2.728762206484188976e-02 2.825836606522539630e-03 5.593627561547142441e-03 8.640616386499509749e-02 1.835023366587618943e-01 2.294974975272285611e-01 2.043523805300355989e-01 2.435454035615554902e-01 4.151673474104538020e-01 7.183805460781944596e-01 7.323549179895949557e-01 5.760311431184784725e-01 2.461060569314614532e-02 2.569946795976645049e-02 2.294517995146263742e-02 7.246087542476110921e-02 1.051776264207744671e-01 5.425111895639919135e-01 5.445442392284757238e-01 1.238280650801544397e-01 8.870326776959679138e-02 6.805390763049998237e-02
2.669571113889499317e-02 2.807227072842104557e-02 5.483249642271903479e-02 5.647461214837752597e-02 3.638955862620156523e-02 4.380205533093589620e-02 7.691364717471062609e-03 1.965405023200759299e-02 4.053683833809816617e-02 1.447265024395822872e-02 1.497348893891937635e-02 1.319976874899438275e-02 1.028442553223786193e-01 2.063760256761135170e-01 1.907409586881154417e-01 2.897022920181653860e-01 5.014238861705737627e-01 6.100542028418667329e-01 3.530494275033344564e-01 7.714209507910638197e-02 4.660291604461767184e-02 3.220767983143391633e-01 4.726531752973555101e-01 7.984634068295297649e-01 7.571922892012183937e-01 9.963437829550459979e-01 8.019070484366918050e-01 2.409015228304283163e-01 1.289905593242751114e-01 7.567936543693504214e-02
3.447314577861737561e-02 3.879272843382387814e-02 3.639013833572827400e-02 3.293561389089619262e-02 4.807623678631237768e-02 8.510674507770310537e-02 1.174211600895253976e-01 3.801281000868347859e-01 1.848419859879832650e-01 3.158849691089510303e-02 2.341796929123741641e-02 3.666861758774630359e-02 7.260698748145588688e-02 1.067009007977475499e-01 1.405616311242300631e-01 2.515291934808274177e-01 5.420204469957353721e-01 5.458061688321292904e-01 2.586199263546508087e-01 8.909684201578471630e-02 3.879590809546916153e-01 7.106139813619714030e-01 9.203560664052545803e-01 9.520918882021001117e-01 8.450849175085396459e-01 7.364517948495596933e-01 1.096401401948809085e+00 1.949816980336191163e-01 9.736971125811184902e-03 9.123303093929480134e-02
8.667902255071834039e-02 6.693854782728062003e-02 3.223206322985164990e-02 4.507965398757471376e-02 1.399400960316249734e-02 5.860808088217946132e-02 3.133243241630431775e-01 2.525770966644562687e-01 2.473017597182062821e-01 1.233300914988622460e-01 4.500309032914930063e-02 1.213409579315447365e-02 1.188402106921392434e-02 3.056218582574111650e-02 6.913261819284816090e-02 3.190524028748273899e-01 3.346900603890301529e-01 3.892799626996234497e-01 6.778483887253511364e-02 1.201565449245529937e-01 4.311902772406204232e-01 9.435175383890126444e-01 1.176533978290668081e+00 1.228417040799524518e+00 1.020186998593842320e+00 9.934718852016058976e-01 9.315969577923718381e-01 7.315187561419751461e-01 3.707258998069996869e-02 2.504678384782060840e-02
3.489570261389698946e-02 9.471775376879749964e-02 6.290805905890067828e-03 2.272638375970403857e-02 4.593445909077159550e-02 6.267457774276709304e-02 1.972818037200460006e-01 2.458802184545091640e-01 1.678475492430800409e-01 1.301801774494606712e-01 2.724151176926599416e-02 2.672349725606062727e-03 4.081445082138790079e-03 1.160191816946705770e-02 2.544940393688329208e-02 1.512143098550388365e-01 5.742307051345122565e-02 1.824085938108620936e-02 6.097074815131983683e-03 4.433952100113502243e-02 1.703345229474144962e-01 9.150845425188812721e-01 1.167566774000786678e+00 1.226819669278508940e+00 8.989641168268500682e-01 4.197316051084452604e-01 6.850239110604762205e-01 4.656060143371958948e-01 4.179139382305100542e-02 1.627339554320400561e-02
1.808133574100524027e-02 2.288900944105596788e-02 1.425703027998504596e-02 1.513257405094403998e-02 3.513242811107579466e-02 2.006174754086267539e-02 1.027558398811757451e-01 1.320990654729145841e-01 1.209695893501352426e-01 2.848801885396342118e-02 7.158552095311906255e-03 1.791843229328897013e-03 3.297002397402003931e-03 9.603991175815241796e-03 3.352072204584252701e-02 2.204981356269013204e-02 3.996677829865130649e-02 1.171711556793170357e-02 2.187317778328615181e-02 1.037570586149916541e-01 5.629890937124730765e-01 1.071210301050786740e+00 1.155344328929874376e+00 1.099026439361991070e+00 8.460116040153845551e-01 6.219755061725532608e-01 6.045281465743364002e-01 4.038825115981548031e-01 3.619718646105498511e-02 1.273940283578925588e-02
4.208798819426833038e-02 3.794644376562783528e-02 1.916914969839389471e-02 1.355790853788851197e-02 1.727952136795769811e-02 9.174216419403887282e-03 5.179339983147335236e-02 4.592463086960262009e-02 1.279704996505979034e-02 7.362836724454428945e-03 2.962306289782095509e-03 3.108543860552312205e-03 9.492815727191332431e-02 4.593632139875641895e-02 1.894368009942873354e-03 6.394800351454002149e-03 2.270175624856581031e-02 5.126732969452992006e-02 4.890046166082979984e-02 2.175430445036516391e-01 5.955026959295642852e-01 8.627547010670049143e-01 3.509564099003321114e-01 5.266246630945606855e-01 6.805499193760091714e-01 3.857779559367177091e-01 2.878384163818587527e-01 2.410471515997876235e-01 1.128717712047335592e-02 1.067383489751093026e-02
3.401568039000324450e-02 3.852143872758087562e-02 5.583683751944893379e-03 3.801113593905838632e-03 3.066893453366349893e-03 4.521033558150616694e-03 6.564938592327818935e-03 1.692448687109848228e-03 2.306880380534180857e-03 3.222318916046035264e-02 4.589009766177540306e-02 7.267092186601796511e-02 6.837760286260967380e-02 4.607383463315644148e-03 9.078318627823135645e-03 1.187845908031177899e-01 2.260506000242976099e-01 3.236649345780081011e-01 2.188417782315605908e-01 1.634915341941069744e-01 1.155838211972577412e-01 4.119271746349352503e-02 1.594154037169804444e-02 3.456347011945318237e-02 1.250796992556138243e-01 4.219519749130755393e-02 3.862094058281252684e-02 1.752901798255351862e-02 4.212226430743117034e-02 3.965047081308620269e-02
7.047071296014746633e-02 5.351625339660059932e-02 5.892918479777588779e-03 2.650680721645081242e-03 3.911916187363876675e-03 2.857404570020912870e-03 4.411867909645927031e-03 4.725162415167756536e-02 4.432233833322816313e-02 1.939032401682908371e-02 4.863729209510939816e-02 8.815290878360516891e-02 9.024696950944642582e-02 8.813475823505055248e-03 1.046307659427445427e-02 6.910465115763797517e-02 2.506563586280412537e-01 4.622663171127418535e-01 5.179337696425513338e-01 4.458612943791505634e-01 9.472588944499357733e-02 2.111353041074753162e-02 2.627001756443680600e-02 6.500901256918233118e-02 1.446577163568736057e-01 4.265100005092489766e-02 1.616232572369796089e-02 8.821936407676315289e-03 5.883011637096759172e-02 5.725327944467844404e-02
8.707360772526392956e-02 1.099178296510120931e-02 3.097515076604271875e-03 8.371295918191150320e-02 1.072598638110778269e-01 2.529958682333932965e-03 3.497174879052435473e-03 3.862225289125562760e-02 2.212085698584054239e-02 2.529751697841042118e-02 4.628539866413883264e-02 7.820149612682918139e-02 6.915433794645892140e-02 7.262113007116716666e-03 2.081661286350459938e-02 9.744551881337398802e-02 1.870357967567029545e-01 4.259989607548638202e-01 5.314723240300551765e-01 4.489165602882296824e-01 2.254028508740711367e-01 1.452569538203858646e-02 1.036990131274833152e-02 2.228496344552835517e-02 1.179499817438365711e-01 7.130821335222779778e-02 6.395733818125461101e-02 1.700105816076301346e-02 4.746304146240673538e-02 4.348474474896944081e-02
4.792823222619690959e-02 1.474419631479069459e-02 5.887884299867041267e-03 5.781254367185888025e-03 1.313641011507203464e-02 8.905327890165438964e-03 3.977012989879786901e-03 1.510403608075757687e-01 2.353935899134998802e-03 3.018307727056103711e-03 2.727334567803271076e-02 3.245042103673249911e-02 4.143008248895557050e-02 7.914059618995837597e-02 8.582792777973909798e-03 2.958956350999323442e-02 2.956633060493758791e-02 1.251486491370363829e-01 1.594466959658922545e-01 1.379589677832695482e-01 1.178272071925605680e-01 2.044198058390857622e-02 7.845777527602859625e-02 6.031374300775744525e-03 2.120606398366419593e-02 5.350444393341315108e-02 1.437980460744076872e-01 9.310948006170723101e-02 5.344660270373197131e-02 4.725996530265898915e-02
1.713962915818676574e-02 6.761583568834994562e-03 7.108032512052220309e-03 1.199698793765228630e-02 6.611799741461831838e-03 3.189566985513233970e-03 1.477988407405012028e-01 1.069566520489310946e-01 3.466042512165075883e-03 1.221866548141084183e-02 8.407982715193289269e-02 3.086570079635883590e-02 4.579238445066598218e-02 8.311508075387724626e-02 7.036866587703966350e-03 1.051292396713998135e-02 9.087614598987173165e-03 5.466224927387706989e-03 9.488034198507307171e-03 1.654119400812837856e-02 3.131941494511094465e-02 1.004730987329463532e-02 8.175610044363798568e-02 2.001590848465439193e-02 2.995839658765053759e-02 1.075025550309344560e-02 3.734975614065941946e-02 4.490746592130280546e-02 3.316999434305360067e-02 6.904987934600080590e-02
1.737274077515654422e-02 1.385663745938046573e-02 6.651698709629433499e-03 4.869947967254783551e-03 4.565904397259305282e-03 1.857462123306470331e-03 1.228104018344113729e-01 1.283234974844206233e-01 1.404506635247947388e-01 5.912789478446891372e-03 2.190974120471075870e-03 2.771557862412619196e-03 1.146695434871825015e-01 2.749932090205876693e-03 6.290142473689037082e-03 4.065918999035039554e-03 3.575070788866009479e-03 9.171131920874613097e-02 8.281629714536292708e-02 6.528977061278666560e-02 5.196779488145426840e-02 7.312581085091257593e-02 9.980119592611234880e-02 1.485046136842759976e-02 1.497594315657190325e-02 9.959137274603478696e-03 2.056721699233385672e-02 1.255134920088002773e-02 1.750241074558115534e-02 1.242285607344306153e-01
2.359891243130645549e-02 1.222213693633970866e-02 6.839212269684060569e-03 9.322844987879073952e-03 8.264828258513896159e-03 4.553742727105482974e-03 1.572984732944946590e-02 1.223246632790717624e-02 2.047473961338920102e-03 1.389992851089667525e-01 4.944944767473276326e-02 1.054710647297342485e-01 5.347895260962218927e-03 4.992468182122896531e-03 1.393724257033261346e-02 1.247824063776507494e-02 5.270908501450281836e-03 1.054776915969456684e-02 9.422796961573581820e-02 4.361369728892651454e-02 4.199701388255264178e-02 6.330952027442192376e-02 8.791193566164486051e-02 2.232726795526894514e-02 1.588808282363201457e-02 5.854270004519084025e-02 7.105737960679539555e-02 8.524578846442233682e-02 3.792330122505672974e-02 5.300788134553872238e-02
3.172834254004913701e-02 2.728158960617061563e-02 8.158439389998953239e-03 2.783088981837440745e-02 3.265354140935591842e-02 6.109331930234249836e-02 4.035600770924560599e-02 4.501894353843332447e-03 1.896508799483311459e-03 1.108605363549822753e-01 3.357129790008592241e-02 3.855357534017622712e-02 4.053402348774624853e-02 2.983487797430227698e-03 4.500774219492995748e-03 6.872328628965118646e-02 5.816154565247411146e-02 6.376923570937348407e-02 8.841858822957393560e-02 5.339687071532175922e-02 3.760980115414330055e-02 5.511841376887666177e-02 5.859688892358236312e-02 8.782084479065460636e-02 3.513188354915652845e-02 4.535313013540712146e-02 6.951544290230549095e-02 1.074212092632071819e-01 1.163032868301446116e-01 2.516031660893248631e-02
1.727564446073508522e-02 4.269727554812667580e-02 1.266606720610041412e-02 1.358023054561292853e-02 6.636286300547979133e-02 7.012888070353723302e-02 4.647506881765102460e-02 3.176338018262773143e-03 2.439389005708432132e-03 2.906600435485131532e-03 1.021964132714625884e-01 5.099900605432262923e-02 2.879622227698363027e-02 4.176809775673816227e-02 5.164561668269902761e-03 5.168585156235901146e-02 5.567285315976481033e-03 3.050867544387438068e-02 5.832903005976933231e-02 1.514666466814441545e-02 5.301981325871975986e-02 7.368704525256139504e-02 6.210748074900063198e-02 6.226443350617992534e-02 8.156448944491490050e-02 6.451353672365753300e-02 7.887996400511559925e-02 9.396202769306588598e-02 1.115429358104260138e-01 2.835123888894586913e-02
