26.1404805893169 26.2107593603967 26.2090641944967 26.2073708291559 26.2056792643876 26.1627800746857 26.0830407846447 26.0042423781071 25.9263833526633 25.8258035702922 25.7226664666372 25.6185941957972 25.5848945061242 25.6874818848447 25.7910035236441 25.895457919664 25.9212460310678 25.9212460310678 25.9212460310678 25.9212460310678 25.9212460310678 25.9212460310678 25.9212460310678 26.0243244061587 26.2034503602078 26.3825766033133 26.561703135162 26.564216216186 26.564216216186 26.564216216186
26.2729432695592 26.3850324412924 26.38333754564 26.38164445026 26.3799531551652 26.3104203363682 26.1821372127541 26.0547947281896 25.9283913806055 25.8706118275671 25.816021383662 25.7604960156795 25.7429976162866 25.797038141136 25.8520126834032 25.9079197405696 25.9212460310678 25.9212460310678 25.9212460310678 25.9212460310678 25.9212460310678 25.9212460310678 25.9212460310678 26.0260267799114 26.2051508833573 26.3842752758461 26.5633999570634 26.564216216186 26.564216216186 26.564216216186
26.4063515879413 26.5593055588633 26.5576109334534 26.5559181080283 26.5542270826021 26.4571200212241 26.280294054345 26.10440848208 25.9294618026993 25.9163569940879 25.9103122192387 25.9033327634022 25.9001668625714 25.9056615242863 25.9120899607761 25.9194506698614 25.9212460310678 25.9212460310678 25.9212460310678 25.9212460310678 25.9212460310678 25.9212460310678 25.9212460310678 26.0277288643062 26.206851117464 26.3859736596505 26.564216216186 26.564216216186 26.564216216186 26.564216216186
26.4105331731054 26.564216216186 26.564216216186 26.564216216186 26.564216216186 26.4652981396981 26.2861829925392 26.1070675507068 25.9279518145153 25.9212460310678 25.9212460310678 25.9212460310678 25.9212460310678 25.9212460310678 25.9212460310678 25.9212460310678 25.9212460310678 25.9212460310678 25.9212460310678 25.9212460310678 25.9212460310678 25.9212460310678 25.9212460310678 26.0071361161383 26.1500830396579 26.2939508628318 26.4366726582237 26.4383220169178 26.4399695755798 26.4416153341962
26.4122772170572 26.564216216186 26.564216216186 26.564216216186 26.564216216186 26.4635633425409 26.2844500447844 26.1053364523686 25.9262225656077 25.9212460310678 25.9212460310678 25.9212460310678 25.9212460310678 25.9212460310678 25.9212460310678 25.9212460310678 25.9212460310678 25.9212460310678 25.9212460310678 25.9212460310678 25.9212460310678 25.9212460310678 25.9212460310678 25.9787019992341 26.073101068527 26.1684207980195 26.2623927976283 26.264041893266 26.2656891891585 26.267334685293
26.4140209644635 26.564216216186 26.564216216186 26.564216216186 26.564216216186 26.4618288403571 26.2827173916883 26.1036056483747 25.9244936107308 25.9212460310678 25.9212460310678 25.9212460310678 25.9212460310678 25.9212460310678 25.9212460310678 25.9212460310678 25.9212460310678 25.9212460310678 25.9212460310678 25.9212460310678 25.9212460310678 25.9212460310678 25.9212460310678 25.949345406291 25.9951976118318 26.0419702381349 26.0881129005054 26.0897617330919 26.0914087662204 26.0930539998778
26.376610788897 26.5150042216935 26.5166977661881 26.5183895118456 26.520079458652 26.4245200847826 26.2581787270235 26.0908970683234 25.9226766099941 25.9212460310678 25.9212460310678 25.9212460310678 25.9212460310678 25.9212460310678 25.9212460310678 25.9212460310678 25.9212460310678 25.9212460310678 25.9212460310678 25.9212460310678 25.9212460310678 25.9212460310678 25.9212460310678 25.9212460310678 25.9212460310678 25.9212460310678 25.9212460310678 25.9212460310678 25.9212460310678 25.9212460310678
26.2437073553686 26.3407309208237 26.3424241951029 26.344115670832 26.3458053479969 26.2773179539826 26.1595200371265 26.0407820637191 25.9212460310678 25.9212460310678 25.9212460310678 25.9212460310678 25.9212460310678 25.9212460310678 25.9212460310678 25.9212460310678 25.9212460310678 25.9212460310678 25.9212460310678 25.9212460310678 25.9212460310678 25.9212460310678 25.9212460310678 25.9212460310678 25.9212460310678 25.9212460310678 25.9212460310678 25.9212460310678 25.9212460310678 25.9212460310678
26.1098588390758 26.1664575833101 26.1681505873791 26.1698417931847 26.1715312007138 26.131055847613 26.0618003819297 25.9916051040662 25.9212460310678 25.9212460310678 25.9212460310678 25.9212460310678 25.9212460310678 25.9212460310678 25.9212460310678 25.9212460310678 25.9212460310678 25.9212460310678 25.9212460310678 25.9212460310678 25.9212460310678 25.9212460310678 25.9212460310678 25.9212460310678 25.9212460310678 25.9212460310678 25.9212460310678 25.9212460310678 25.9212460310678 25.9212460310678
25.9750654808207 25.9921842091571 25.9938769430214 25.9955678789094 25.9972570168076 25.9857335261545 25.9650195221664 25.9433659503517 25.9212460310678 25.9212460310678 25.9212460310678 25.9212460310678 25.9212460310678 25.9212460310678 25.9212460310678 25.9212460310678 25.9212460310678 25.9212460310678 25.9212460310678 25.9212460310678 25.9212460310678 25.9212460310678 25.9212460310678 25.9212460310678 25.9212460310678 25.9212460310678 25.9212460310678 25.9212460310678 25.9212460310678 25.9212460310678
25.9212460310678 25.9212460310678 25.9212460310678 25.9212460310678 25.9212460310678 25.9212460310678 25.9212460310678 25.9212460310678 25.9212460310678 25.9212460310678 25.9212460310678 25.9212460310678 25.9212460310678 25.9212460310678 25.9212460310678 25.9212460310678 25.9212460310678 25.9212460310678 25.9212460310678 25.9212460310678 25.9212460310678 25.9212460310678 25.9212460310678 25.9212460310678 25.9212460310678 25.9212460310678 25.9212460310678 25.9212460310678 25.9212460310678 25.9212460310678
25.9212460310678 25.9212460310678 25.9212460310678 25.9212460310678 25.9212460310678 25.9212460310678 25.9212460310678 25.9212460310678 25.9212460310678 25.9212460310678 25.9212460310678 25.9212460310678 25.9212460310678 25.9212460310678 25.9212460310678 25.9212460310678 25.9212460310678 25.9212460310678 25.9212460310678 25.9212460310678 25.9212460310678 25.9212460310678 25.9212460310678 25.9212460310678 25.9212460310678 25.9212460310678 25.9212460310678 25.9212460310678 25.9212460310678 25.9212460310678
25.9212460310678 25.9212460310678 25.9212460310678 25.9212460310678 25.9212460310678 25.9212460310678 25.9212460310678 25.9212460310678 25.9212460310678 25.9212460310678 25.9212460310678 25.9212460310678 25.9212460310678 25.9212460310678 25.9212460310678 25.9212460310678 25.9212460310678 25.9212460310678 25.9212460310678 25.9212460310678 25.9212460310678 25.9212460310678 25.9212460310678 25.9212460310678 25.9212460310678 25.9212460310678 25.9212460310678 25.9212460310678 25.9212460310678 25.9212460310678
25.9212460310678 25.9212460310678 25.9212460310678 25.9212460310678 25.9212460310678 25.9212460310678 25.9212460310678 25.9212460310678 25.9212460310678 25.9212460310678 25.9212460310678 25.9212460310678 25.9212460310678 25.9212460310678 25.9212460310678 25.9212460310678 25.9212460310678 25.9212460310678 25.9212460310678 25.9212460310678 25.9212460310678 25.9212460310678 25.9212460310678 25.9212460310678 25.9212460310678 25.9212460310678 25.9212460310678 25.9212460310678 25.9212460310678 25.9212460310678
26.0803982674762 26.0677881201231 26.0228263009054 25.978807321382 25.9357296827254 25.9212460310678 25.9212460310678 25.9212460310678 25.9212460310678 25.9212460310678 25.9212460310678 25.9212460310678 25.9212460310678 25.9212460310678 25.9212460310678 25.9212460310678 25.9212460310678 25.9212460310678 25.9212460310678 25.9212460310678 25.9212460310678 25.9212460310678 25.9212460310678 25.9212460310678 25.9212460310678 25.9212460310678 25.9212460310678 25.9212460310678 25.9212460310678 25.9212460310678
26.2546715908944 26.2290817755107 26.1355832904675 26.0430273997848 25.9514126049757 25.9212460310678 25.9212460310678 25.9212460310678 25.9212460310678 25.9212460310678 25.9212460310678 25.9212460310678 25.9212460310678 25.9212460310678 25.9212460310678 25.9212460310678 25.9212460310678 25.9212460310678 25.9212460310678 25.9212460310678 25.9212460310678 25.9212460310678 25.9212460310678 25.9212460310678 25.9212460310678 25.9212460310678 25.9212460310678 25.9212460310678 25.9212460310678 25.9212460310678
26.4289449509204 26.3894330388827 26.2473988759657 26.1063070620942 25.9661560991201 25.9212460310678 25.9212460310678 25.9212460310678 25.9212460310678 25.9212460310678 25.9212460310678 25.9212460310678 25.9212460310678 25.9212460310678 25.9212460310678 25.9212460310678 25.9212460310678 25.9212460310678 25.9212460310678 25.9212460310678 25.9212460310678 25.9212460310678 25.9212460310678 25.9212460310678 25.9212460310678 25.9212460310678 25.9212460310678 25.9212460310678 25.9212460310678 25.9212460310678
26.564216216186 26.5173112470666 26.3480133215418 26.1777744964935 26.0065962703703 25.9518042788035 25.9501208891882 25.9484392953074 25.9467594971752 25.9450814948044 25.9434052882086 25.9417308774018 25.9373995819787 25.9311903681182 25.9259124606031 25.921564361097 25.9212460310678 25.9212460310678 25.9212460310678 25.9212460310678 25.9212460310678 25.9212460310678 25.9212460310678 25.9212460310678 25.9212460310678 25.9212460310678 25.9212460310678 25.9212460310678 25.9212460310678 25.9212460310678
26.564216216186 26.5296416527124 26.408881389963 26.2871804727113 26.1645403990668 26.1260790613772 26.1243959407704 26.1227146156117 26.1210350859144 26.1193573516917 26.1176814129572 26.1160072697243 26.0865303506112 26.0317837105337 25.9779681343848 25.9250821241682 25.9212460310678 25.9212460310678 25.9212460310678 25.9212460310678 25.9212460310678 25.9212460310678 25.9212460310678 25.9212460310678 25.9212460310678 25.9212460310678 25.9212460310678 25.9212460310678 25.9212460310678 25.9212460310678
26.564216216186 26.5429143577779 26.4706907699775 26.3975267726785 26.3234238636508 26.3003538805168 26.2986710289138 26.2969899724715 26.2953107112038 26.2936332451238 26.2919575742453 26.2902836985811 26.2347301255814 26.1314470469737 26.0290947898956 25.9276718566904 25.9212460310678 25.9212460310678 25.9212460310678 25.9212460310678 25.9212460310678 25.9212460310678 25.9212460310678 25.9212460310678 25.9212460310678 25.9212460310678 25.9212460310678 25.9212460310678 25.9212460310678 25.9212460310678
26.564216216186 26.5571291218463 26.5334412214221 26.5088131564849 26.4832464244649 26.4746287362172 26.4729461536121 26.471265365881 26.4695863730377 26.4679091750953 26.4662337720672 26.4645601639667 26.381999144485 26.2301806147805 26.0792926642245 25.9293337954998 25.9212460310678 25.9212460310678 25.9212460310678 25.9212460310678 25.9212460310678 25.9212460310678 25.9212460310678 25.9212460310678 25.9212460310678 25.9212460310678 25.9212460310678 25.9212460310678 25.9212460310678 25.9212460310678
26.564216216186 26.564216216186 26.564216216186 26.564216216186 26.564216216186 26.564216216186 26.564216216186 26.564216216186 26.564216216186 26.564216216186 26.564216216186 26.564216216186 26.4775667920391 26.3180821138265 26.1576683090777 25.9963268754124 25.9698882280195 25.9506701544524 25.9323785153174 25.9212460310678 25.9212460310678 25.9212460310678 25.9212460310678 25.9212460310678 25.9212460310678 25.9212460310678 25.9212460310678 25.9212460310678 25.9212460310678 25.9212460310678
26.564216216186 26.564216216186 26.564216216186 26.564216216186 26.564216216186 26.564216216186 26.564216216186 26.564216216186 26.564216216186 26.564216216186 26.564216216186 26.564216216186 26.5030022116085 26.3920549650571 26.2801788340572 26.1673753158882 26.0971481665733 26.0293940706006 25.9625661677722 25.9212460310678 25.9212460310678 25.9212460310678 25.9212460310678 25.9212460310678 25.9212460310678 25.9212460310678 25.9212460310678 25.9212460310678 25.9212460310678 25.9212460310678
26.564216216186 26.564216216186 26.564216216186 26.564216216186 26.564216216186 26.564216216186 26.564216216186 26.564216216186 26.564216216186 26.564216216186 26.564216216186 26.564216216186 26.5293682960881 26.4669574938904 26.4036180493144 26.339351459299 26.2234817537856 26.1071926224608 25.99182944301 25.9212460310678 25.9212460310678 25.9212460310678 25.9212460310678 25.9212460310678 25.9212460310678 25.9212460310678 25.9212460310678 25.9212460310678 25.9212460310678 25.9212460310678
26.564216216186 26.564216216186 26.564216216186 26.564216216186 26.564216216186 26.564216216186 26.564216216186 26.564216216186 26.564216216186 26.564216216186 26.564216216186 26.564216216186 26.5566648079094 26.5427894630113 26.5279857177869 26.5122550688355 26.3488892261869 26.1840660463102 26.020168577055 25.9212460310678 25.9212460310678 25.9212460310678 25.9212460310678 25.9212460310678 25.9212460310678 25.9212460310678 25.9212460310678 25.9212460310678 25.9212460310678 25.9212460310678
26.564216216186 26.564216216186 26.564216216186 26.564216216186 26.564216216186 26.564216216186 26.564216216186 26.564216216186 26.564216216186 26.564216216186 26.564216216186 26.564216216186 26.564216216186 26.564216216186 26.564216216186 26.564216216186 26.3862752745539 26.2071975209981 26.02811947654 25.9212460310678 25.9212460310678 25.9212460310678 25.9212460310678 25.9212460310678 25.9212460310678 25.9212460310678 25.9212460310678 25.9212460310678 25.9212460310678 25.9212460310678
26.564216216186 26.564216216186 26.564216216186 26.564216216186 26.564216216186 26.564216216186 26.564216216186 26.564216216186 26.564216216186 26.564216216186 26.564216216186 26.564216216186 26.564216216186 26.564216216186 26.564216216186 26.5636428513695 26.3845672316634 26.2054913207553 26.0264151189585 25.9212460310678 25.9212460310678 25.9212460310678 25.9212460310678 25.9212460310678 25.9212460310678 25.9212460310678 25.9212460310678 25.9212460310678 25.9212460310678 25.9212460310678
26.564216216186 26.564216216186 26.564216216186 26.564216216186 26.564216216186 26.564216216186 26.564216216186 26.564216216186 26.564216216186 26.564216216186 26.564216216186 26.564216216186 26.564216216186 26.564216216186 26.564216216186 26.5619332573627 26.3828594799757 26.2037854114002 26.024711051951 25.9212460310678 25.9212460310678 25.9212460310678 25.9212460310678 25.9212460310678 25.9212460310678 25.9212460310678 25.9212460310678 25.9212460310678 25.9212460310678 25.9212460310678
26.564216216186 26.564216216186 26.564216216186 26.564216216186 26.564216216186 26.564216216186 26.564216216186 26.564216216186 26.564216216186 26.564216216186 26.564216216186 26.564216216186 26.564216216186 26.564216216186 26.564216216186 26.560223954858 26.3811520194758 26.2020797929197 26.0230072755036 25.9212460310678 25.9212460310678 25.9212460310678 25.9212460310678 25.9212460310678 25.9212460310678 25.9212460310678 25.9212460310678 25.9212460310678 25.9212460310678 25.9212460310678
26.564216216186 26.564216216186 26.564216216186 26.564216216186 26.564216216186 26.564216216186 26.564216216186 26.564216216186 26.564216216186 26.564216216186 26.564216216186 26.564216216186 26.564216216186 26.564216216186 26.564216216186 26.5585149438413 26.3794448501502 26.2003744652993 26.0213037896024 25.9212460310678 25.9212460310678 25.9212460310678 25.9212460310678 25.9212460310678 25.9212460310678 25.9212460310678 25.9212460310678 25.9212460310678 25.9212460310678 25.9212460310678
