3.302498344877826120e-01 4.825582058578239408e-01 4.067715625744475205e-01 5.019560454156457574e-01 3.505289947510242254e-01 7.276130092101129598e-01 6.606915725669811890e-01 2.059742661030039904e-02 2.929857030235241341e-02 3.839314061871276773e-02 7.720044398245828887e-01 1.972442939085070901e-01 1.275875845738103920e-01 5.024233481443265426e-01 6.199422377242592708e-01 1.466540103030989084e-01 5.510293919768487481e-01 8.148784566239632501e-03 3.499128045177306995e-03 4.018428517163582514e-01 3.779370612343053715e-01 5.674636571819148545e-02 4.361001138902745322e-02 1.784174973370913353e-01 3.588072662636230814e-01 2.908481698643685109e-01 1.378299302819450678e-01 1.222325064213596046e-02 1.174373721597227020e-02 1.485478839983678766e-02
2.205748171037007210e-01 4.768267997668441671e-01 8.377916261403338671e-01 6.296218618329323391e-01 4.325677050895910813e-01 5.383489667114275956e-02 2.080758503201023818e-02 1.736360289946610111e-02 6.906521273735640731e-01 6.149989407688970511e-01 4.824945876311605986e-01 1.032285642667973430e-01 1.520157253368539241e-01 3.889953160695823198e-01 5.646052859170253013e-01 4.024624043305227161e-01 5.098196641443969446e-01 2.016987688900519909e-02 4.973903137844807622e-03 4.767653018934705500e-01 2.153944097837716676e-01 5.425006394549457961e-02 1.129831260236064117e-01 1.039996558451486142e-01 9.614025481972827969e-02 1.341742468011687395e-01 4.892764065441730648e-02 1.248266926421381755e-02 1.781490072571574254e-02 1.785601375950008132e-02
2.700830262800767156e-02 3.875738189374228204e-02 7.850736741696143217e-02 5.519056631083585351e-02 9.221144705888636994e-02 1.907480629762929591e-02 1.848292535038996709e-01 1.940100466048536032e-01 4.703438868761828512e-02 1.347586066858677545e-02 3.039119539777829573e-02 3.985524080644760325e-02 6.966916102200431116e-01 5.442931221146392329e-02 2.321250400234227407e-01 3.481224611606331676e-02 7.789914712953521780e-01 1.922057126691417706e-02 3.094664366292441265e-02 6.861884766780726973e-03 1.349866899733352665e-01 4.474767603045470138e-02 6.837754964673305180e-02 2.459725403985429937e-02 1.535155261629277644e-02 1.059477405343040891e-02 9.874879928711435481e-03 7.755255278660523437e-03 1.322131320111484369e-02 1.481493060914606738e-02
1.132739798680282468e-02 3.046318579740152008e-02 2.948810350347713313e-02 2.373958615543436332e-02 2.026387404102582626e-02 3.787500491701263905e-01 3.737898574077315739e-01 2.302550239777209906e-01 1.237280064369957050e-01 7.461168064014822750e-03 6.132640772486562808e-01 2.836682430439613212e-02 6.857633890142976751e-01 5.535172610784808711e-01 1.730271899861102747e-01 1.470145919212769436e-01 3.210667806683051295e-01 6.265726093090401294e-01 4.873266318701631183e-01 4.499194031759592427e-01 2.494845152492894402e-01 9.699300550693895628e-02 3.263856744625452666e-02 6.612149759774682556e-02 1.257575667333430368e-02 9.323558295121225220e-03 8.293913088306310161e-03 7.862124632684141037e-03 1.594252192246286073e-02 1.730085482112910314e-02
7.164237286880669187e-01 5.505050640621632352e-02 4.636217289321067220e-02 8.927011556571875714e-03 1.378638400190062771e-02 2.215696978991752164e-01 3.833417257229584374e-01 2.137853801761471773e-01 7.780664936315916103e-02 2.059784832198858703e-02 1.641996028653205930e-02 4.285625811598820639e-02 4.147504780286028203e-01 4.322299958358631899e-01 2.272255003326246470e-01 9.262687816836778776e-02 2.765308070663398746e-02 6.177831377213603981e-01 1.575166369182070050e-02 5.761693198070207966e-01 4.112628289947112825e-01 1.284432817592291720e-01 3.280052905029788302e-01 1.101352579146259586e-01 2.272406404834395599e-02 1.233729572799719017e-02 8.778414123703245572e-03 1.014155116616481493e-02 1.584195853480504373e-02 5.818653098304334137e-02
8.309678931507477051e-01 7.947971816467850337e-01 5.088838153134526976e-02 3.246090168544418786e-02 3.243575790798802760e-02 1.310818319145878874e-01 1.669279151613409229e-01 1.752387917051167199e-01 1.449821883351364027e-01 1.097812549196277021e-01 5.137654393905988215e-02 2.970659110362575822e-02 1.860438059610629857e-01 7.146115217681986431e-02 6.106315093223738805e-02 1.086016604138995006e-01 5.939474582145460868e-01 1.530800357292952663e-01 4.846287176321614765e-01 2.595825512325259862e-02 1.726022552827879628e-02 1.569153728530827199e-02 4.125480004127832223e-01 6.504158081247000955e-02 3.392208434299052305e-02 3.194144808306168676e-02 2.018241914280146168e-02 1.390698415877427742e-02 1.834433070354584902e-02 3.292761498318888536e-02
1.374524906880151831e-01 2.135912225739377279e-01 2.071949000377754924e-01 5.112695389185985262e-02 4.852564330812085824e-01 8.054023218613390878e-01 1.042251748600804967e-01 6.792880417785924774e-01 7.643728170383584652e-01 7.898794875689358896e-01 5.478863491840889610e-01 2.271396123992969196e-01 1.033514551642222834e-01 4.900621350161679657e-02 2.948582200778894491e-02 5.612534167010140712e-02 3.303403666152081031e-01 1.540750177552929479e-01 7.498503845166057946e-01 2.639171422881839493e-02 4.861075330081677248e-01 1.342628436938620717e-01 6.202173458103404230e-02 5.931553344738282885e-02 2.295214950297322018e-02 2.354245911639945774e-02 2.093746799117613550e-02 1.817974193080549444e-02 2.108189211102702576e-02 4.967927988268024814e-02
2.896103050826258629e-01 5.485932743032421177e-01 2.924401119407710192e-01 5.901857506409455834e-01 8.915893585473817495e-01 9.706915889101671580e-01 8.447013780823519058e-01 8.054110660942078725e-01 6.956397418365426466e-01 3.766632254399008839e-01 1.453725510651027730e-01 4.224148394929128081e-01 9.026270484161071084e-02 3.199262272570293358e-02 3.706194015117222212e-02 7.201172290236497464e-02 5.709852744501938693e-01 8.944890609931809289e-01 7.842298260332142279e-01 5.972146758979195447e-01 1.901090764314747050e-01 1.086937858485903935e-01 4.304894042900329204e-02 3.592137752162036235e-02 1.713422614183822065e-02 1.806884758127393770e-02 2.940605582204196614e-02 3.792232798554425605e-02 3.723309954240415498e-02 1.068591125194831293e-01
7.074145185894695764e-01 4.710068465992315323e-01 2.648048326281927656e-01 2.460879025557713984e-01 9.476764378488111706e-01 3.934236200218237944e-01 1.341904278237205095e-01 5.805745921124298992e-01 5.275736831535107196e-01 5.152345793916186523e-01 4.432635570891272914e-01 5.387803316541327492e-01 3.437700254181370180e-02 7.406484028984513523e-01 1.179254899271967860e-01 1.017916489261623120e-01 4.206095899087878842e-01 3.749447552854685839e-02 3.353632840461503312e-02 2.516555420708722068e-01 4.853405313641168811e-02 4.906586175128883898e-02 5.295794937907732230e-02 3.454681915299389477e-02 2.029284949015437711e-02 3.117939148839975194e-02 1.242098750377233218e-01 2.487521972563879191e-01 7.045908687464254028e-01 3.415886540523317416e-01
1.101573508139322977e+00 7.159050886662742252e-01 1.114129839217725682e+00 1.017521456589068229e+00 8.920673966516893261e-01 1.723254144185857595e-01 8.183741154710125754e-01 3.631131743123449107e-01 1.701308799825017870e-01 5.983750148068545105e-02 7.966956971452292535e-01 6.656137579168533991e-01 2.498395086163646486e-02 2.024244266009471091e-02 7.207749338960828256e-01 7.221238215414924611e-01 3.262305950657490988e-02 2.770277902939294670e-02 1.345663859676424039e-02 9.957178906286541162e-03 5.882438004558084715e-02 3.693808972685735936e-02 4.212445648243499235e-02 4.629677472918789644e-02 2.595384122412001948e-02 3.340533346780061308e-02 3.239822226304746033e-01 5.521471803517311594e-01 6.792689703412685409e-01 1.761784916391984646e-01
9.168236554327591215e-01 4.728626339143109925e-01 1.052071937009602554e+00 8.893237594086564890e-01 1.948917826104112627e-01 1.048310663906784068e-01 9.186437905328026510e-02 8.307557910515554755e-02 5.505484348568411707e-02 4.286803812700248351e-01 8.333677453061205664e-02 6.517708759025253595e-02 7.676979071494609286e-02 4.694535121965245222e-02 1.218855761040650749e-02 2.285868367357785091e-02 3.051984605033092324e-02 1.345251934843826915e-02 3.982095966878341775e-01 9.708318963080932174e-02 3.978950664668795545e-02 3.532838018591537288e-02 4.537427788529529993e-02 6.350535594641068537e-02 6.807988924824937005e-02 3.719002202489735814e-02 6.013700831746257580e-02 4.790444132796315563e-02 4.298058186019923510e-02 3.083524794278797929e-02
1.767781635954889796e-01 1.025356254187710092e-01 8.938884427974893576e-01 8.633270463598059496e-01 6.827960296565059872e-01 1.582143326671318906e-01 6.625878963432549340e-02 4.445759711502056399e-02 5.424133496424604628e-02 8.590252811204495131e-01 2.766761228171824016e-02 3.689187365168469790e-02 6.005138514489963275e-02 3.110792255116018659e-02 1.122951481640716877e-02 1.531446416729648902e-02 1.683374929689846963e-02 2.335226359291343173e-02 6.684059223444978048e-01 2.216107943203285968e-01 3.815750542723592847e-02 3.852153293764516012e-02 4.541820427451759984e-02 8.118779063535452867e-02 7.718567650991886575e-02 5.500845290021916245e-02 4.233117359401827179e-02 3.903022315931272551e-02 4.305160910374319916e-02 4.707695110125087457e-02
3.578516790232537381e-02 9.071145155022640461e-02 2.160155903620540885e-01 6.058010136868319240e-01 3.993577331881845160e-01 1.291724518534524691e-01 6.767693696190056618e-02 5.848324969397877132e-02 7.379800269202144158e-02 4.883920227866588859e-01 1.375140876771127063e-01 1.544657987735033843e-02 5.255246614353036028e-02 1.895650009652857446e-02 6.005931670741910741e-03 8.427226548715969698e-03 6.621996419472606643e-01 8.742931926133684292e-03 1.454830569837655893e-02 4.685828860165516807e-01 3.674633687922880532e-02 4.004619749589168748e-02 5.039788819142886067e-02 8.398886651937333137e-02 1.065691756009775754e-01 9.304139711147413339e-02 6.848409219373709222e-02 6.517884092909413674e-02 5.792920046899487085e-02 4.856555856538218724e-02
2.950116700824349791e-02 8.434439500962710723e-02 1.495197902778749588e-01 1.074677939318452319e-01 6.356113068210519912e-02 2.513627611632480163e-01 8.480280079837160256e-01 7.407308601528171943e-01 9.882580448232630710e-02 3.125313822796928903e-02 1.127915828873727599e-01 6.109249691259450721e-01 2.391086500877707272e-02 2.703973891523558243e-02 2.925333443572740791e-02 4.823964774116253074e-02 4.335905622684536193e-02 2.802907855742374499e-02 8.005862909468500210e-02 5.797883838180101224e-02 6.645486552147620296e-01 2.415813028089791037e-01 1.801840325300710643e-01 4.279143372326041916e-01 8.568909537913164121e-01 7.247734524134920031e-01 2.076111944801677794e-02 7.343052750587170108e-01 7.814691813586369107e-02 9.145672399363527494e-02
2.772356726457574430e-02 2.778349915756422178e-02 7.469589603225466889e-02 5.523178277822611282e-01 1.997381406160435580e-01 4.579327694259451714e-02 5.619991891434925613e-01 6.279064909036809194e-02 1.793329961014182572e-02 1.173223236291514038e-01 2.476695210946100456e-01 2.695253183132374775e-02 2.651287169673465643e-02 2.229216794001914748e-02 2.046919434144867794e-02 2.516320791548840724e-02 4.355692217533110172e-02 7.630037014918758520e-02 7.882386546935667149e-02 9.938304761543642618e-02 6.419530577371150848e-01 7.158956778645622077e-01 5.918121545777643711e-01 2.597078330847357036e-02 3.028522979654719310e-02 1.053905103948581667e-01 9.872194078216903201e-02 2.365255224373951498e-02 8.133987807653783597e-02 6.282817718256940298e-02
2.571169334989848593e-02 2.786781173914252077e-02 6.178296677014639970e-02 6.746311205565050373e-02 4.460553218023518424e-02 4.681724478663855382e-02 2.587040656426261021e-01 6.914406563831207997e-01 8.743529681820620680e-03 5.979369977908165490e-01 6.633938194193305105e-01 5.370313706232856532e-01 1.270065947371079931e-02 1.971799160621766703e-02 1.870885053433255299e-02 2.916252893956861394e-02 5.153289630813830124e-02 6.398519602490911062e-02 3.782981775379219702e-02 1.036850534589898835e-02 8.354804808336148414e-03 6.327974967727997835e-02 7.820356175693692069e-02 9.917772346666381411e-02 7.995449585779695889e-02 1.055458771651125865e-01 8.515696811412229450e-02 3.261855245457797453e-02 1.208020612010917566e-01 7.148731103456722191e-02
3.338791640510640341e-02 3.821739031040689155e-02 3.648533029494465535e-02 3.356581302051944021e-02 4.714595292049912623e-02 7.795416713047605139e-02 1.985236497267977435e-02 5.387223892294110833e-02 3.257051660585882219e-02 7.497105201708326692e-03 8.571716001716260872e-03 1.353952054616582371e-02 1.864887085357775504e-02 1.614416502359211983e-02 1.346538783619897865e-02 2.458974980504224223e-02 5.450929791349200942e-02 5.663372803583827803e-02 2.763599575625786189e-02 9.661668518326867530e-03 4.136690396242050094e-02 7.433627614083904156e-02 9.440410086974768133e-02 9.912709025995179724e-02 8.996677139541069124e-02 7.968202870174274921e-02 1.197154226179080322e-01 3.408644103261639774e-02 1.710507845602028953e-01 9.291379325570536807e-02
8.448229082818826952e-02 6.551263321286718289e-02 3.105484863437614484e-02 4.235236340878585637e-02 4.865154745724269425e-01 1.095889852984966925e-02 2.995300197402056899e-02 2.302005229448776322e-02 2.259905738403887934e-02 1.135663422634332169e-02 8.910334740588207736e-03 6.308033380505386756e-01 6.149079936712114058e-01 1.063529181442350070e-02 1.269766489034510060e-02 3.036763831961189833e-02 4.166593322818069184e-02 5.400184586186645291e-02 9.634972701888322097e-03 1.424381954097087184e-02 4.569629856199076273e-02 9.783734401067266384e-02 1.194319855290086607e-01 1.278592771128550798e-01 1.100746378572621531e-01 1.097011183606247664e-01 1.044911760621943658e-01 1.256923979212788978e-01 8.916822069778900239e-01 7.354224419989204842e-01
3.409463396023085235e-02 9.309408846679627370e-02 1.587664950613979775e-01 1.215526628979739752e-02 1.386148781952471071e-02 1.031111274429971809e-02 1.773430652061484467e-02 2.220063336587785666e-02 1.522672865395515579e-02 1.783473483864266018e-02 8.461982815356382942e-03 1.712873126233698251e-01 2.665720024977791258e-01 6.258889597849204289e-01 8.575683318827943824e-03 1.439755948288722054e-02 1.053270234253170755e-02 6.011827257189343854e-01 1.900199594747803700e-01 7.721213994000582573e-03 1.818997423440678329e-02 9.712669065443915728e-02 1.232559452031001257e-01 1.322797438689837513e-01 9.933022761700506520e-02 4.705522383429631972e-02 7.746485590258959941e-02 1.056274893381524277e-01 5.354165081199456500e-02 5.352414099434210648e-01
7.180405858180555212e-01 1.256031151873997914e-02 6.374577686732524340e-01 7.906373822002203955e-01 9.428689010215108787e-03 2.697532701158684813e-03 1.365521660933717400e-02 1.174560990408444854e-02 1.657679281464942769e-02 7.494364884103889811e-03 4.558804268781904145e-01 1.178520817028984036e-01 2.080300067609982817e-01 5.067937388135376198e-01 1.394446157865675100e-02 2.798102571924971586e-03 8.711404374410498114e-03 4.751980617056696388e-01 7.705433250238472587e-01 1.803431300895964873e-02 6.028777581547962311e-02 1.159517283894063444e-01 1.264784145259634507e-01 1.223815807548168932e-01 9.550352272435802536e-02 7.079816125988380726e-02 6.912462259095727979e-02 8.478220491649521295e-02 9.369310146623327507e-01 4.089992128708221375e-01
1.309449197329267192e-02 1.891578994902312280e-02 9.701291021961509775e-03 8.492607746527295817e-03 9.575773871894462108e-03 6.050625276364485217e-01 1.543646009979138256e-02 9.450346204132110614e-03 2.736511135196020676e-03 5.048769869173271863e-01 2.041997874884423081e-01 1.805072729785826280e-01 1.021021239579644885e-01 4.783839799024178913e-02 1.025943138360542045e-01 2.961953934961720214e-01 4.027362768761387490e-03 1.182219790811060017e-02 1.092928142099691170e-02 3.513887700912123047e-02 6.341018455119788733e-02 1.055078941483012095e-01 4.399344340141408266e-02 6.677628795614225232e-02 7.850108562748063512e-02 6.830607261494253679e-02 6.369224686167682115e-02 8.074941080423166107e-02 2.281165475581725666e-01 2.482034714968882894e-01
3.290283392210275291e-03 8.231812776741677731e-03 3.195813860003141604e-01 2.751606169534632218e-01 2.593283261060511102e-01 3.806425591709344802e-01 5.351332790205030054e-01 1.339176005024954874e-01 1.867054184709078801e-01 3.234174110130099561e-02 4.782266348754012769e-02 7.529525165368745887e-02 7.245453072866799016e-02 2.317806956241762195e-01 5.193369577061978104e-01 2.912497930872065544e-02 2.459517871604685602e-02 3.094877191115535595e-02 2.143629052043460534e-02 1.653026326020215833e-02 1.957155097006473693e-02 1.739281000770604921e-02 4.428553011416218599e-01 1.176230302005322817e-02 1.463219754461274683e-02 1.185814119461848538e-02 8.953984243366037710e-01 3.269539332284202571e-01 4.205032337811378390e-02 3.922770468773847941e-02
1.024658045637121678e-02 1.674975607840327105e-02 3.631100096613664174e-01 2.157977381730590838e-01 3.687773955385487690e-01 2.907185922933327449e-01 4.536335694944843011e-01 4.976270735831014869e-02 4.392689963098403427e-02 1.898451850347030248e-02 4.697008280841356159e-02 8.678712404767893740e-02 9.519732963159308059e-02 4.466684614260198471e-01 5.830572860453430151e-01 1.427748822475190076e-02 2.330254155871363392e-02 4.371545975826011260e-02 4.991938893006998140e-02 4.439189288232991276e-02 2.089333695498476334e-02 7.072350587175285641e-01 8.441422011528674219e-01 3.752796156173166670e-02 3.246817712331401956e-02 1.178874412998582102e-02 3.755813416387430714e-01 1.532995012226433529e-01 5.681904854754659534e-02 5.441355887463526081e-02
1.268620848578761937e-02 5.636260179323219210e-01 2.054239249927655164e-01 9.303525333773063344e-02 1.242080095457117062e-01 2.824008900029480462e-01 3.648437017510726688e-01 4.074184840147411502e-02 2.161684544625363386e-02 2.459695780528392897e-02 4.461491947408071507e-02 7.621459684231533804e-02 7.127833698501921667e-02 3.439070935942826757e-01 1.427394618965970897e-02 2.305803518323288823e-02 1.735773840306272311e-02 3.990787061844233014e-02 5.034143870877080817e-02 4.374637960447399360e-02 6.629281945876702720e-02 4.324485752704133601e-01 3.004205550318310158e-01 5.392106413704479406e-01 6.850747840030470270e-02 3.176380073060906112e-02 2.232531018483688290e-02 2.585673918660386095e-01 4.508507016245511673e-02 4.061509711220614299e-02
1.049131942375512196e-02 7.673001720995891936e-03 4.588000939935673594e-01 5.271906292944436023e-01 1.332321411796933974e+00 9.277601621826522260e-01 3.789285043408291975e-01 1.529325147060168755e-01 2.283159703030471499e-01 2.910584000088446421e-01 2.714687234614513930e-02 3.165822454421904353e-02 4.206688356597750728e-02 8.294768401082343312e-02 4.307339343775419271e-01 3.257679957464941489e-02 1.771627878006653070e-02 2.889630563045462661e-02 2.873081241456110213e-02 3.888805116944665102e-02 5.585362413729857978e-02 5.268217827779659856e-01 8.590082505101308274e-02 1.496367866814759806e-01 6.097737124349230653e-01 9.526841564966956333e-02 4.778314959413518248e-02 4.953970500872923594e-02 5.179156227124278450e-02 4.509185676704240836e-02
5.805324462610891162e-03 4.346504556815766196e-01 6.048947894833307526e-01 1.225094785035290901e+00 7.516395348470563675e-01 3.405784113022715109e-01 1.533608647839001804e-01 1.063229346918328905e-01 3.402422852272758980e-01 1.288832891561819460e+00 8.958964512136391445e-02 3.321670957191833612e-02 5.078921434282212405e-02 9.729658151498564445e-02 4.146166995906513386e-01 6.867950075294880774e-01 4.024627214843483070e-01 1.732873546528993780e-01 2.433766545795409408e-01 4.132307226853516591e-01 7.298322599777304909e-01 1.736656879127350672e-01 9.142193544259968885e-02 4.436005441268671134e-01 1.015814804688214057e+00 3.148318542635924477e-01 5.234436647841991114e-02 7.856271535511598347e-02 4.202899906809955954e-01 7.134784774978354671e-02
8.526640572187851180e-03 9.956564705300458007e-01 5.969736738302932055e-01 4.966424940447926040e-01 5.136645631492247066e-01 1.902411564730124849e-01 1.237775308198545560e-01 1.266805864220752476e-01 1.442122775599993523e-01 5.641344017752530915e-01 1.665657157249741671e-01 1.729554128148118042e-01 1.447072317401777997e-01 1.616325180899863267e-01 4.331077027373170241e-01 2.848423510350826526e-01 1.785069573557510059e-01 9.886175823663988227e-02 8.275581269565614184e-02 6.172900536971014096e-02 4.975721151404253334e-02 7.337880439218676110e-02 1.138972581687621305e-01 2.738124176106079832e-01 4.703640815353700155e-01 2.123224772575763308e-01 3.118828040508813682e-01 2.135261538590048080e-01 2.198022700547430930e-01 1.445262126111481749e-01
9.576801599613247312e-03 8.681101744528061381e-01 5.829129267931498770e-01 8.961518262622494291e-01 8.378264425892116840e-01 4.550003923585007604e-01 4.453938462078217003e-03 1.230416957531828892e+00 1.915370096735370120e-01 1.368770892106441761e-01 5.227443524399329189e-02 1.295281897303483254e-01 3.408548352418991900e-01 3.419145641805964031e-01 9.893400407009279585e-01 6.969247635396177420e-01 2.004631816188774396e-01 2.138694405094251350e-01 9.347547079815334004e-02 4.086015204159299669e-02 3.987743953391546803e-02 6.270987792683103967e-02 9.616488606442417930e-02 2.956081393394002776e-01 3.005342382908506305e-01 7.117327086558788984e-02 7.859666774044726800e-02 1.004577372415330905e-01 3.260502070687048559e-01 6.652010609562680754e-02
6.541672293749726912e-03 1.193652398292700638e-02 6.552260348348001306e-01 1.771861564207625681e-02 1.168441011348745825e-02 9.953050094643648565e-03 9.759962222412363331e-03 4.883332562451538350e-01 1.904435880434555695e-01 1.088323861616165428e-01 3.341814666076527163e-02 4.581184532547866867e-02 5.138703140358486660e-02 1.876250938475382546e-01 2.214846400223132450e-01 9.104822475266834136e-02 6.946559553916030472e-02 6.793627939968903406e-02 8.875079619579928636e-02 5.073764441514294621e-02 3.605212061700523857e-02 5.382399591850683951e-02 6.146706464808483761e-02 1.034631065744399669e-01 3.254174566440252159e-01 5.158218395119833904e-02 7.508605678953672591e-02 1.224371370638202838e-01 1.471882372763780589e-01 2.914623739441435379e-01
1.581701203736650407e-03 1.101813771530275876e-02 1.022881993234300291e+00 1.242930887189924061e+00 1.210138541458018538e-02 6.211956631429862638e-03 6.257602880720684879e-03 3.460632455059971524e-01 2.649870567944960231e-01 2.464907304367395802e-01 1.012128489522276104e-01 5.218463364006834665e-02 3.330305825277651149e-02 5.232414065652031543e-02 2.352320832949307550e-01 5.966308377666804108e-02 1.520118676864815055e-01 1.366834742801691614e-02 2.264003449673434101e-02 1.943583185507571642e-01 5.030188045598720653e-02 7.050536556931903676e-02 6.149485528479167046e-02 6.805714650734420723e-02 9.087117319078470701e-02 6.997965850760987094e-02 8.268870803661233782e-02 1.017843481730263400e-01 1.368858958245342261e-01 3.361844114987147525e-01
