4.690322936154288878e-03 6.857014152157331691e-03 5.937357894518880720e-03 7.462191087573427639e-03 5.602037654498581883e-03 1.220447006786575320e-02 1.200621022362270696e-02 3.226134732834645691e-02 5.842263033302719233e-02 2.612755147448811086e-02 1.211768394111293473e-02 2.746523425409470517e-03 1.596900729518914951e-03 5.916437236925303246e-03 6.866525318029651284e-03 1.508003171750260229e-03 5.356827477921290853e-03 9.459981469588013558e-03 8.670156478059513894e-03 3.074021831871849748e-03 2.426118118210097204e-03 3.455747316953472915e-04 2.066754802319891240e-02 1.020207783282191466e-03 1.912908141533859992e-03 1.448490783076006143e-03 6.458407173598774021e-04 4.959572300045236685e-03 4.683188377580652095e-03 5.824114634400208608e-03
3.699453958813367360e-03 8.057071872882206470e-03 1.448169177134761218e-02 1.171616996272384879e-02 8.118730678411572796e-03 3.621692590684744140e-02 1.717189236403285357e-02 2.125034795301893736e-02 1.378840901848190151e-02 1.172165706715815048e-02 8.379744871055560748e-03 1.637046684139934014e-03 2.158485100347801600e-03 4.876732936878420271e-03 6.706642551341268285e-03 4.267644088825957131e-03 5.286577004986477146e-03 1.734502771615002714e-02 1.318353376827101874e-02 3.985799648810628426e-03 1.395474603613303718e-03 3.069198976710330539e-04 6.306338616170294783e-04 5.405068038329025352e-04 4.559034922391745127e-04 5.835367401606169919e-04 1.886915849950636381e-02 4.878413140052209260e-03 6.935322294381068842e-03 6.934686830166579379e-03
4.520860743715465757e-02 4.469129212592105188e-02 9.461308848990487852e-02 7.630857912944871702e-02 1.631565155541130629e-01 1.659676657231583946e-02 3.095393081125063367e-03 3.274665037503628629e-03 5.251386475062324449e-02 1.607878205167802277e-02 4.358416352690878959e-02 2.901680139903541761e-02 1.057224901874721790e-02 1.521547330275861698e-02 2.840220100039006663e-03 1.168365186883670720e-02 7.787304016624534315e-03 1.594188638476424016e-02 5.316562347713547909e-02 8.845914052127170496e-03 8.305168263718232941e-04 2.357804312491210174e-04 3.514851201438782039e-04 1.072762208748068852e-02 6.374814065150853810e-03 4.221650495188996981e-03 3.760347374765032630e-03 2.979565416943966323e-03 5.063283640665513716e-03 5.732380107938681024e-03
2.110519858803026894e-02 5.877041319814996917e-02 1.291533525467935262e-01 1.034927682192708087e-01 4.290880764675222836e-02 6.604033382876734262e-03 5.212309176471651567e-03 3.431519937130206831e-03 2.076554019842034252e-03 1.957763822198082052e-02 1.268382995971624461e-02 2.545581983998375375e-02 1.146140606753764252e-02 7.517354963446342200e-03 2.150858499916758447e-03 1.590417403131224802e-03 3.287667055798560410e-03 6.109375017588742317e-03 4.338862975359295687e-03 3.695714463895461224e-03 1.658881237479309725e-03 5.559753100779820647e-04 1.446220858121803794e-02 3.133812126467085644e-04 5.180307073986114424e-03 3.808550078910156577e-03 3.257493130560206937e-03 3.080889794821408192e-03 6.141265226647587769e-03 6.759083059084276465e-03
1.230511343002262115e-02 3.728628067207533092e-02 1.038056754975015261e-01 4.019783716642269522e-02 2.322276580776685279e-02 3.354197335642780664e-03 5.052751277108776320e-03 2.764103344898954408e-03 1.251173383959521901e-03 4.425265417936831425e-02 5.587493171367050038e-02 4.842410968676581773e-02 7.127362554855964927e-03 5.766754874706910006e-03 2.611159497513752901e-03 9.295424956353372410e-04 9.861373661590129569e-03 5.633879683541351616e-03 9.072530587608769459e-03 5.172501231365482684e-03 3.543280169190823024e-03 9.748738885460622641e-04 2.104388747162374076e-03 5.495463535953737247e-04 9.367711423280820904e-03 5.094648940869285492e-03 3.528631172882259678e-03 4.082300150443263394e-03 6.270397782244759022e-03 2.644627262984169469e-04
1.238522972201630372e-02 1.279073686417061401e-02 5.722439107905111927e-02 4.573077339921259588e-02 1.817733975721508993e-02 1.919568957278941848e-03 2.283385424305944301e-03 2.390895485405604252e-03 2.181126538967394397e-03 6.714388221751531327e-02 5.333375049909559046e-02 2.864745713577560374e-02 3.255694090575999341e-03 9.477187983015087280e-04 6.866754307335709703e-04 1.061843348946142412e-03 5.487877122367518408e-03 1.425059018614029159e-03 4.624155106697462950e-03 1.588559763834936772e-02 1.934772029380500691e-02 1.142155684315833419e-02 2.808046016800333500e-03 3.446233991791122471e-04 1.410143876934091128e-02 1.340657447781378950e-02 8.314235919894429408e-03 5.734800354793626737e-03 7.411961234350012383e-03 1.356361003636327549e-02
1.729821971178080973e-03 2.727568442914815160e-03 2.876546466293001397e-03 1.455034535504157005e-02 6.961513670980051804e-03 1.135656376621329774e-02 1.674531232313831303e-02 9.289236282076779663e-03 1.071645619638790341e-02 1.274702952576734633e-02 9.999686321125952904e-03 4.202488833562660620e-03 1.721878077926917126e-03 6.414361726605898213e-04 1.930912804144900921e-02 5.354787874094767445e-04 3.121447287145693791e-03 1.476499690560289547e-03 7.539458662423340757e-03 1.029830708581742915e-02 4.757426376094673996e-03 1.131360386200856109e-03 4.351788951823501624e-04 3.244839179458405181e-04 9.684198960318621263e-03 1.002374181264042118e-02 8.723535919930518190e-03 7.587348458541613369e-03 8.650953944950561664e-03 2.091408801161695474e-02
3.780073269844355308e-03 6.934539110294134050e-03 4.032295201784087679e-03 8.645867075887880837e-03 1.315704165006754793e-02 1.448973399721252900e-02 1.249195041842461260e-02 1.146604158226819173e-02 8.969287695806675564e-03 5.134679617244074928e-03 2.105756021041171704e-03 6.621129518249696533e-03 1.409277875706557628e-03 2.581151213579327072e-02 2.634566772693260756e-02 7.968777402776958943e-04 6.558360615124447096e-03 1.050281149803885747e-02 9.247502163470327011e-03 6.582800830523583696e-03 1.786591140561342213e-03 8.252513424469303405e-04 2.004025397734881739e-02 1.564951013538168692e-02 7.373954193113320746e-03 7.749999604906071884e-03 1.191495629637371288e-02 1.505181021375945685e-02 1.509957294403615688e-02 5.698833211151108254e-04
1.005719568441822837e-02 6.601726615943219641e-03 3.843620509366272534e-03 2.209949905688005090e-02 1.421506788390944527e-02 5.892308903827852586e-03 1.851777324122680368e-02 8.080723272196638218e-03 6.605867409267415606e-03 6.642145754510532518e-03 6.025107330250695746e-03 8.061263225031208013e-03 1.765308224370444601e-02 1.141458356018631298e-02 1.675369224050533455e-03 1.504270666823396673e-03 6.520617138341185115e-03 1.982359936234336789e-02 1.960972748016425252e-02 3.278119078923866052e-03 5.077974560580865221e-04 3.807244226170252875e-04 3.464906796777443955e-04 1.537128415714111157e-02 8.861956811095243747e-03 1.357616407744337804e-02 5.872850715000828715e-04 1.245859879316489616e-03 3.780509647578950139e-03 1.961521562549466569e-03
1.676355961765437289e-02 1.090566545437715237e-02 1.734851244826040445e-02 1.603186820445685196e-02 1.391573871151779995e-02 2.691705210200390913e-03 1.219872514116717398e-02 5.048017693577381421e-03 2.056978944545690465e-03 7.827336184989373705e-04 1.160343251149409741e-02 1.140634813280864100e-02 2.430092238421992928e-02 2.637418572819661550e-02 1.259372931312768319e-02 1.370790508440534669e-02 7.334747985874248699e-02 7.614896687117447827e-02 3.071012751599334206e-02 1.370033617459466210e-02 6.564392772569629204e-04 2.025582171229427936e-02 2.076477289018900316e-02 2.946174256558738310e-04 1.172441690305672628e-02 1.498142519353880785e-02 1.695291962566301651e-03 3.055702329399003284e-03 3.979914917323157733e-03 1.088749525584220643e-03
1.384156194539367182e-02 7.209098956359873828e-03 1.608459204223488398e-02 1.361007962050843692e-02 1.716578784407276834e-02 1.549297780616215158e-03 1.270538676215274623e-03 1.072479562480025761e-03 6.484214518375073415e-04 5.886295321561886215e-03 9.287019679184425891e-02 1.552682045311934711e-01 3.232125358758474176e-01 1.614181544223697862e-01 3.011435627367449464e-02 5.902993416594631143e-02 1.096918027434822251e-01 3.045221172702482909e-02 7.313588335029408936e-03 1.461428290050928664e-03 4.811000504251395802e-04 2.064024154065429578e-02 3.623859582378891097e-04 4.747211210600688677e-04 4.807393995463605076e-04 1.823244229016940041e-02 3.738786434622471495e-04 3.093017273812421510e-04 2.042677183937455926e-02 1.461059242056862023e-02
2.511107030010657857e-03 1.473571531873800987e-03 1.302867566990178333e-02 1.276514271287197688e-02 9.926110040735701412e-03 2.240918605710815869e-03 8.456815826897253916e-04 5.235438489046931885e-04 6.221959994429892811e-04 1.170597356550486662e-02 2.837871402732435738e-02 1.846951443671563942e-01 3.332537539027298212e-01 1.761031829158496431e-01 6.488248726864284666e-02 7.403677148774746863e-02 8.201579089133026468e-02 4.867879629058922963e-02 1.206882512273101116e-02 3.407659188011114004e-03 2.811094497088136718e-02 2.480953470476848083e-02 4.585460200425639597e-04 7.900310354013682099e-04 7.312211927001625736e-04 5.011987272739251188e-04 3.689534392192448395e-04 2.178733794046686795e-02 2.300677584184149249e-02 3.696461938650846346e-04
2.602003736944280554e-02 1.209294028520767643e-03 2.986750070125046216e-03 8.514207797394757193e-03 5.573048772059763928e-03 1.730709767106001313e-03 8.536229341103303801e-04 6.836765276001051297e-04 8.235754169696995466e-04 5.955188888223298012e-03 1.975066622869449742e-03 5.938104657630058347e-02 2.504686425370912239e-01 1.093553767219194450e-01 3.515569419058563877e-02 4.139577989510331846e-02 1.537003247115378314e-02 2.265605171894446990e-02 2.594092571334571939e-02 9.731532946385455449e-03 6.417174766237738505e-04 5.630635151759359140e-04 6.618528896055884047e-04 1.114538091746906500e-03 1.433821383256427082e-03 1.315357113784622637e-03 9.461319249644075963e-04 8.308763517375207606e-04 6.068826235007235932e-04 4.456332988077120472e-04
2.038932066365735374e-02 1.035241337773093028e-03 1.939128872866465120e-03 1.437408002427483390e-03 8.570109630146608088e-04 3.313393121406498984e-03 1.106637949290040744e-02 9.251302893762490542e-03 1.167717054279533099e-03 2.326752398752265916e-02 1.463914151627392036e-03 9.686438495366423568e-03 1.146219631220114499e-01 1.588994486185867916e-01 1.739679683961215806e-01 2.403885790231171660e-01 2.175539549246626458e-01 1.412991188195357461e-01 3.863040905273639747e-01 1.805137737295749445e-01 1.488308317591114510e-02 4.286711314927817672e-03 3.178476606351549223e-03 7.901444930731089944e-03 1.805173780772681424e-02 1.658093846318725931e-02 4.456781061870499633e-02 1.419655890767139439e-02 1.068680101250637452e-03 9.574611059531524474e-04
1.852092042860149432e-02 1.870044218327261004e-02 9.185021766023452380e-04 6.929948721208091522e-03 2.516174628823911706e-03 5.815488039012524065e-04 7.461914143690009590e-03 2.139493213609844346e-02 1.434726558784626960e-02 1.475222680717779011e-03 3.135749690156114725e-03 4.909448854161193448e-02 1.042128551212228582e-01 1.345010039201242624e-01 1.237406653636176634e-01 1.521823070114479703e-01 2.610256676874216919e-01 4.526555773630816515e-01 4.639748198411375313e-01 3.689967129547495617e-01 1.575954953158593269e-02 1.641862384451660273e-02 1.439475461718477123e-02 4.451466428896112826e-02 6.269908008028492186e-02 3.143826579042029445e-01 3.092909842121345787e-01 6.130519007628408568e-02 1.302183049495125172e-03 7.312485186317604653e-04
1.642222928556316339e-02 1.805248314128061332e-02 7.233192233724211910e-04 7.990707914565047497e-04 5.242326215413745929e-04 5.908305403394299715e-04 4.140409934698810815e-03 1.160551975821304260e-02 2.404580886732725353e-02 8.627044879209183267e-03 8.902817985968855541e-03 7.700877539073872416e-03 5.991112934494517706e-02 1.229023410388434823e-01 1.161911971256548159e-01 1.797899253805534392e-01 3.121051960586296858e-01 3.818426346360717094e-01 2.235820152566623809e-01 4.938832265034533153e-02 2.948011946367721375e-02 2.007083129863923843e-01 2.881948830154945629e-01 4.757224856092369669e-01 4.373423351168298501e-01 5.578906445923708102e-01 4.408092057528275043e-01 1.251492364302241866e-01 2.093401800220693904e-03 9.077973839578066390e-04
2.018467113145953548e-02 2.364533114225848137e-02 2.366453314540273994e-02 2.279441015098227288e-02 5.644498696817418400e-04 1.171882696407446859e-03 6.831900821522628175e-02 2.282073341787197451e-01 1.116611435884268810e-01 1.916741371124969576e-02 1.425460703255558917e-02 2.212947736117897718e-02 4.374727411215532935e-02 6.477233891855632697e-02 8.568190193011274158e-02 1.537704106866604192e-01 3.328983214078219399e-01 3.407293981026740526e-01 1.646007012818326842e-01 5.714186062058893012e-02 2.423501056670560316e-01 4.311266567909664005e-01 5.434518725553469931e-01 5.483050070946376975e-01 4.735383233904528755e-01 4.013713461315374098e-01 5.846353267351971361e-01 1.017651401175926618e-01 3.213655723876094640e-03 1.327987597628494960e-03
8.247073979950243511e-04 6.503743021974821032e-04 2.058701886946330897e-02 5.239618159936514259e-04 6.689987952961341452e-03 3.370109255722381070e-02 1.878038405277814016e-01 1.529000816818105735e-01 1.509137382416709527e-01 7.600193977471740581e-02 2.795962238276162790e-02 7.535371348393388700e-03 7.364890538629381353e-03 1.889019695008608071e-02 4.220615958890604202e-02 1.926246675161635558e-01 2.042226979268978448e-01 2.434323692842096931e-01 4.323492195727330484e-02 7.691772307965774602e-02 2.665826934199460041e-01 5.634912473615942829e-01 6.821263644703252638e-01 6.941791359421527474e-01 5.627923034703541383e-01 5.311334613331094578e-01 4.849907191864195055e-01 3.845405295146027136e-01 1.706506066906012323e-02 1.124979635498660549e-02
2.158310138949939491e-02 9.843372349539359235e-04 1.807983949750419789e-03 1.245669287790085455e-02 2.754483278531073831e-02 3.876969379747299133e-02 1.217926790055167408e-01 1.510245755111976340e-01 1.036672882350239133e-01 8.097532901277779138e-02 1.708892645681708150e-02 1.679658714488792021e-03 2.540069864811847836e-03 7.083621707933354314e-03 1.514600965399229976e-02 8.807218679324099742e-02 3.401734464795616586e-02 1.112041792850308047e-02 3.794615332988925376e-03 2.762188126259254584e-02 1.024446315351456582e-01 5.328189782685669451e-01 6.613698315145339901e-01 6.826548897138857708e-01 4.921423634468620745e-01 2.244021622450734776e-01 3.579028981514397745e-01 2.456570575640641962e-01 2.215166621682449627e-02 8.744561054456404317e-03
8.703801999332039588e-03 1.124665716240876370e-02 7.542176386864040197e-03 9.376573226929450083e-03 2.217653979957419016e-02 1.265557669029774950e-02 6.472241077198079284e-02 8.269941245330510171e-02 7.601069261668144672e-02 1.800805057863170966e-02 4.545198418120271339e-03 9.634709039476630496e-04 1.676035148969582528e-03 4.855371215500351757e-03 1.887310810359862923e-02 1.243726819997721146e-02 2.304011550196022676e-02 6.939010713552301243e-03 1.321089196752585349e-02 6.244832707386913095e-02 3.279481952865632710e-01 6.086719878176938270e-01 6.427124107530164387e-01 6.052350470891324496e-01 4.605849030141120348e-01 3.337938552675407955e-01 3.201463443891627847e-01 2.157065119372270079e-01 1.942106267565116284e-02 6.913403543966289803e-03
2.407887470532434071e-02 2.220065442344046694e-02 1.157888227104591702e-02 8.431191365261056850e-03 1.109158539058289344e-02 5.914198839076316959e-03 3.332073031299657290e-02 2.934465659304545671e-02 7.997017368681471131e-03 4.380637025237332782e-03 1.522288412413677541e-03 1.217914767403382656e-03 7.282806176117353949e-04 4.009409323444580058e-04 1.031016961126754623e-03 3.426954840318466571e-03 1.240115431760276804e-02 2.875305156913592758e-02 2.809152391843948438e-02 1.256401714472355213e-01 3.365641293032582970e-01 4.809012194253950989e-01 1.934205946366723827e-01 2.886712641580861383e-01 3.706655448390786534e-01 2.085162598968700876e-01 1.547752949906386344e-01 1.271221553537240645e-01 4.659617646270796006e-03 4.212043495950477251e-03
1.940002191467810402e-02 2.247669478049757127e-02 3.377222352309036148e-03 2.374929790914140186e-03 1.977780489039935880e-03 2.934861415750500413e-03 4.139139205360599198e-03 1.018268669935549651e-03 1.303809603327907339e-03 2.093810701038375231e-04 2.811784652944481909e-04 4.368057102018094336e-04 4.889583877484939608e-04 1.743671979138780928e-03 4.883958220183023599e-03 6.233917570185428664e-02 1.202383812788985068e-01 1.764575358088965040e-01 1.221551074394480602e-01 9.242730312177818708e-02 6.455467428514696793e-02 2.284236769625097585e-02 8.737886744477634318e-03 1.875512627506744842e-02 6.779325533027633077e-02 2.288571577783930083e-02 2.109018503820460355e-02 7.120597788897389466e-03 8.090280764259828858e-04 3.016085280887997530e-02
4.130915424861661411e-02 3.198530384615824035e-02 3.517185119203198457e-03 1.536009332019735996e-03 2.276260995930334298e-03 1.765027454331716955e-03 2.694634785235982578e-03 2.838210536153010200e-04 2.360050363599443669e-04 8.928450926958278466e-03 2.523925581169062524e-04 4.860252757798983305e-04 6.575519599409325499e-04 3.582181914437090105e-03 5.902387677623521789e-03 3.684761632616251337e-02 1.354952254896271691e-01 2.558118977078828737e-01 2.935338723356095136e-01 2.562969631631815126e-01 5.395750070143802424e-02 1.189951905628413957e-02 1.453011223645696987e-02 3.530434670707382344e-02 7.841791439535214514e-02 2.307858375311686028e-02 8.856293393382952406e-03 3.326030490072046965e-03 1.040197742293426028e-03 9.355346847212692857e-04
5.174333443313226810e-02 6.617530881177720141e-03 1.864479132165258388e-03 6.172929491845887545e-04 7.062410554330688641e-04 1.533380704591828011e-03 1.951664675172162626e-03 1.836050851910944748e-02 1.019443387137469390e-02 1.171708899167218584e-02 2.064954815551073991e-02 4.251429367440672327e-04 4.914239471676232511e-04 2.783598927349239908e-03 1.101275993437562592e-02 5.361090355866668378e-02 1.044475874177144825e-01 2.427569445763432809e-01 3.079925870387809073e-01 2.614396734250232779e-01 1.290743142435758495e-01 7.344743890417998813e-03 5.134412933700049225e-03 1.102113512693760761e-02 6.330819833465484159e-02 3.784240363506738425e-02 3.407194191211450340e-02 6.374190998853251043e-03 9.140614300538448325e-04 3.247218003444805878e-02
2.886254417034319480e-02 8.974987585094603218e-03 3.547889942672059586e-03 3.344109735824363737e-03 7.475454642516549814e-03 5.078781755725032994e-03 2.076953683290983128e-03 8.365571242677780680e-04 1.233172508059081612e-03 1.619879000155961465e-03 1.286689517569203009e-02 1.442566452169550401e-02 2.751792831092083474e-04 6.451443159630310771e-04 4.014764930422519071e-03 1.671952426932368785e-02 1.705473386542184777e-02 7.373395309756840266e-02 9.543623788739558078e-02 8.219158261342796035e-02 6.824534133201470842e-02 8.690632712200401302e-03 1.316424718295129605e-03 2.553959375496379827e-03 1.128452611795812896e-02 2.815923659677561225e-02 7.553669549405256367e-02 4.208045650298129770e-02 1.035307007790542150e-03 7.618576721206113444e-04
1.034236496313688421e-02 4.120412568279202721e-03 4.475666044358618881e-03 7.637651532000753855e-03 4.197378144285160081e-03 1.870052635883214442e-03 8.497378905092233675e-04 5.873421817492871988e-04 1.830331642646891794e-03 7.135409918906046416e-03 4.876902437113255764e-04 1.419854601927588583e-02 2.929283423143100068e-04 6.671453528506962084e-04 3.270534087153463988e-03 6.005326654385105198e-03 4.218820848633760348e-03 2.129191585462445781e-03 3.410120142066081980e-03 6.260610277294811898e-03 1.110000143497367857e-02 2.521989046469127246e-03 1.293472060766788674e-03 6.592045798928646699e-03 1.604655768292542403e-02 5.684644951016361129e-03 1.953344106572914296e-02 2.162406136400823672e-02 7.591186472486511488e-03 1.136940889909700096e-03
1.048609906691474851e-02 8.454642853640477809e-03 4.188992735019171285e-03 3.110741928044476537e-03 2.913362812387463793e-03 1.087122564743901645e-03 7.095752401740360905e-04 7.151647908372639603e-04 7.775482401476336344e-04 3.124249618864008600e-03 8.849931445832228240e-04 8.427597756580161147e-04 8.168393290728973802e-04 1.057240091406292347e-03 3.171074417549426747e-03 2.288280244096932078e-03 1.642789332997755640e-03 1.038377626825851691e-03 9.603428671036940648e-04 7.629419308538433865e-04 6.188251585700424440e-04 9.196865764791106127e-04 1.486039332462511060e-03 3.775185161956690592e-03 6.732065154603830356e-03 3.272350750541261344e-03 5.264519800957321791e-03 3.463962159227958627e-03 3.455889727199699078e-03 2.195902745632102946e-03
1.420691673143082909e-02 7.445047965168550760e-03 4.306262144603853134e-03 5.966522643719565644e-03 5.273934161189776024e-03 2.845899836105567418e-03 9.604354958397898212e-03 7.166670018719799133e-03 1.046620277252423986e-03 7.640968027519688720e-04 2.733353029320359940e-04 6.285625842838075787e-04 1.917505570830405201e-03 2.215781397753040574e-03 7.147483402207372924e-03 5.571041939039211507e-03 1.876481133729057931e-03 2.359111855067634426e-03 1.148361224510116747e-03 5.154902127857293164e-04 4.730671669152714562e-04 7.294003194654485097e-04 1.145302665218237651e-03 3.724073823203946469e-03 3.985800821953538499e-03 9.884030565800226795e-04 1.126711825873749455e-03 1.451713472319272977e-03 4.716227227748460635e-03 9.698242817033871695e-04
1.909848914182644616e-02 1.661413528608477949e-02 5.118976851200463321e-03 1.775038935154583247e-02 2.070113952752630077e-02 3.876315799875595935e-02 2.580815405614916153e-02 2.894105480660639010e-03 1.033009504308147423e-03 6.009561417014385983e-04 1.510729251605136443e-02 2.229706830819505560e-04 2.876459778379450026e-04 1.214502678372659811e-03 1.603299172869633625e-03 7.572164437043944155e-04 7.899066649353156258e-04 1.016179225340856302e-03 1.464078795225664349e-03 8.058365885126512508e-04 2.696390674783189639e-02 5.910680782799887598e-04 6.629541371555322613e-04 1.203470957390194137e-03 4.075530187775570218e-03 6.809908610812411651e-04 1.023723393473775951e-03 1.712045301154185937e-03 2.086999512345222643e-03 4.185194967154639081e-03
1.055711683656045466e-02 2.642591047014739014e-02 7.971378698102028759e-03 8.603742589298198074e-03 4.169326673363429187e-02 4.377163028046018173e-02 2.901412481343260824e-02 1.980575357692943017e-03 1.389804040759533028e-03 1.330035594559367696e-03 5.524385665323223961e-04 2.762095842871112859e-04 1.469773609617082769e-02 3.487445750878971238e-04 1.792405049720098434e-03 5.585819921026712260e-04 2.143036136811389113e-03 1.380694585344705017e-02 2.586484414805146140e-02 3.633664600497044442e-03 7.031504704283731647e-04 8.867462525761096552e-04 7.516889946557346516e-04 8.897048940251428215e-04 1.274905209377754723e-03 1.040633000460186803e-03 1.277017489581370969e-03 1.602151617094150528e-03 2.187315093047611722e-03 5.423782377715239550e-03
