2.270646034579667516e-01 3.269923894341074666e-01 2.755298914102218277e-01 3.398824215710147256e-01 2.373010839511384140e-01 4.923476737681353188e-01 4.467559452787729923e-01 1.991824257986461386e-02 2.848266241902256204e-02 3.669286212636772154e-02 5.342569563251720055e-01 1.384315270578980184e-01 9.044323970675129110e-02 3.566401466118646613e-01 4.404394064680641208e-01 1.042521841169959662e-01 3.949512718663934496e-01 9.728135800819642104e-03 4.917704029834954992e-03 2.956751782674298390e-01 2.736317191908047564e-01 4.047205334082749906e-02 3.066516349788205031e-02 1.219826724248860988e-01 2.364419757266674194e-01 1.850703802002134635e-01 8.489047800113597164e-02 7.403841452386008409e-03 6.997606920289414952e-03 8.707932632384904684e-03
1.478445223337722103e-01 3.119990280088907331e-01 5.481428580026318498e-01 4.119312325689962195e-01 2.830217929346122707e-01 5.326923245291307479e-02 2.105171276099389657e-02 1.602696162822124862e-02 7.567949033185061500e-03 4.071071627739269450e-01 3.299408438407212540e-01 7.232376285950947725e-02 1.081795601240881782e-01 2.770530880987758238e-01 4.020161564387670916e-01 2.861762782232704083e-01 3.657303826736872376e-01 2.327622974773024128e-02 7.168539156892615900e-03 3.517797132890609357e-01 1.562147945554690220e-01 3.871806807370802017e-02 7.940989564250880428e-02 7.073663633637533588e-02 6.259473066489752713e-02 8.382399437951654209e-02 2.941511926145410141e-02 7.431032464984417898e-03 1.050351688043458902e-02 1.042606451557741634e-02
3.062948049635297321e-02 3.937988330236995294e-02 8.057946984849650995e-02 5.839929413765725802e-02 1.031611243870988182e-01 1.837519382148567609e-02 1.163387692506214488e-01 1.210701932267257419e-01 4.030755475231454638e-02 1.239321043985263347e-02 3.532865735869730045e-02 4.396721250593881025e-02 4.983798754475411985e-01 5.705018332795610408e-02 1.656429926091866622e-01 3.650546436592946170e-02 5.591999088361082615e-01 2.218781798577465492e-02 4.058410317912398285e-02 8.502252202181963953e-03 9.804386816557005002e-02 3.195130436424074155e-02 4.802643530547650447e-02 1.663528496716574351e-02 9.873394086548666418e-03 6.498809317962844778e-03 5.798917337674497526e-03 4.539538850249363183e-03 7.714919573415048720e-03 8.617066128664549116e-03
1.312807265426913471e-02 3.466079869682182901e-02 4.533389865730121093e-02 3.652851141845072508e-02 2.359735705949987314e-02 2.388633063919284316e-01 2.354072512371569448e-01 1.448522452846524866e-01 7.776702412520840324e-02 9.736140574727688082e-03 4.149429840101787614e-01 3.209785855751831618e-02 4.889185748603215309e-01 3.911905613813380644e-01 1.211395253496571206e-01 1.018419009484113485e-01 2.237793194177177813e-01 4.409911231071654281e-01 3.463346219535922144e-01 3.214223618084915968e-01 1.756806753647554564e-01 6.739145247628215707e-02 2.238286609120825402e-02 4.395551325272748638e-02 8.014516031953425323e-03 5.707398576687744245e-03 4.890660729240018864e-03 4.626143157299158169e-03 9.362743305541963018e-03 1.014031019733935106e-02
4.669454873080319812e-01 5.070588378351511410e-02 5.470816682289277727e-02 1.387222614801534269e-02 1.496626681670522319e-02 1.400526356326824429e-01 2.421513072746978856e-01 1.349862477209460287e-01 4.913197045325137097e-02 2.539462460667927385e-02 2.452984990610933974e-02 4.972287075165585102e-02 2.941105593554674269e-01 3.011335479334275034e-01 1.554048227773099367e-01 6.217241893905587485e-02 2.676788901569124302e-02 4.181480972593731860e-01 1.628609531234349872e-02 3.941658935414447673e-01 2.785610097060076118e-01 8.619927334754456938e-02 2.181206418679670356e-01 7.167852823528488015e-02 1.436494800651046989e-02 7.582452659133369355e-03 5.253902887464973435e-03 6.055847926384337783e-03 9.440370863712556349e-03 3.460079442997826549e-02
5.384833164337796685e-01 4.998788052459559594e-01 4.747796225940555809e-02 2.910722678562093976e-02 2.396958147290359498e-02 8.184798849941449239e-02 1.048891804452918713e-01 1.108990449234768250e-01 9.177768655872949044e-02 1.067856342020399307e-01 5.579019528112310472e-02 3.303126437905731100e-02 1.310750498871348091e-01 4.902430366939742462e-02 4.078342556092741378e-02 7.060170284026123788e-02 3.851289646209232753e-01 9.966688809986877506e-02 3.169074336270197856e-01 2.583604491420673707e-02 1.838282415294301142e-02 1.545817792983896280e-02 2.658771699475042660e-01 4.143267560095846569e-02 2.127053877103713547e-02 1.971776563902777682e-02 1.227231435588985523e-02 8.438641242482910684e-03 1.111206694354129922e-02 1.991216879551291341e-02
8.802843137112187355e-02 1.328863264582926529e-01 1.279337847739454304e-01 3.145402278185626538e-02 2.879092659389060338e-01 4.825528824150934204e-01 6.645264518438773194e-02 4.318433201510520902e-01 4.884199834388619488e-01 5.203909776141419918e-01 3.718601853509302946e-01 1.585947580020196646e-01 7.243000025837659228e-02 3.325224943641769126e-02 1.936415167045545810e-02 3.567133586099343473e-02 2.087574756265478670e-01 9.745361523697786132e-02 4.746401140097583071e-01 2.424866591332900875e-02 3.067517238743873720e-01 8.449552705175000789e-02 3.893031847506487481e-02 3.711567675561526503e-02 1.430964222371223886e-02 1.462199502260301542e-02 1.295397259279041161e-02 1.122495211059604432e-02 1.299955094233560399e-02 3.061464617278885497e-02
1.937376631943719396e-01 3.581383409674060436e-01 1.869500947883593334e-01 3.656030653049936463e-01 5.379608580882575541e-01 4.896339218602503707e-02 5.360180382152508471e-01 5.293001182042557096e-01 4.588283621593467476e-01 2.540633210154162325e-01 1.001455466315536863e-01 2.968493258342521646e-01 6.356991407868406441e-02 2.202394848055998569e-02 2.493381404628682366e-02 4.733460690324903242e-02 3.737973586560384698e-01 5.857067126415226310e-01 5.136195569273057648e-01 3.908567293225986838e-01 1.239797547832186125e-01 7.065148560501995079e-02 2.789279741567567486e-02 2.317762760788111276e-02 1.100119209404189224e-02 1.154152928836659972e-02 1.868073244883560260e-02 2.387778222245756643e-02 2.324838885076926584e-02 6.620087465893433054e-02
4.978724689436996309e-01 3.201399629603316477e-01 1.690863646892750149e-01 8.498778455214769934e-02 5.647660818111460701e-01 2.483063323635786857e-01 9.785987707958918036e-02 3.935992837263505573e-01 3.590777012891630537e-01 3.555520891911683745e-01 3.097986445400068289e-01 3.805310004731202178e-01 3.569019324398194776e-02 5.171735709888178878e-01 8.125526748501928076e-02 6.918797770722005802e-02 2.851373832768284711e-01 3.780819054886663810e-02 3.425000497148818907e-02 1.702107846000189828e-01 3.270051347460684044e-02 3.293553352296594433e-02 3.541777494513938945e-02 2.298468240270885865e-02 1.341910941695350842e-02 2.049163073984640315e-02 8.107978684655541002e-02 1.598258137744593410e-01 4.456157659608109278e-01 2.127160684019035464e-01
8.136733183503924716e-01 5.145155969768964166e-01 1.484345202892293769e-01 9.193216345804601508e-02 5.573697572617150042e-01 1.134512298312738421e-01 5.683357516527191011e-01 2.546206177465045739e-01 1.193982298056617958e-01 4.222353373891180733e-02 5.640560897071483781e-01 4.721573568257748654e-01 2.784058770975903624e-02 2.362675569420797511e-02 5.086115807671047762e-01 5.073866410827656548e-01 4.287911397761929450e-02 3.855706965747642684e-02 1.771231658337228329e-02 1.160514743853694256e-02 4.093118731950212696e-02 2.559559067688149669e-02 2.906688626056868480e-02 3.175150352988036218e-02 1.767323788463103992e-02 2.259152572009075904e-02 2.173890290298826355e-01 3.619780706558047290e-01 4.350590725980887363e-01 1.102354047685338845e-01
6.895159750892254635e-01 3.471140830452560944e-01 7.325169994840141641e-01 5.999223364786557822e-01 1.194897131685930536e-01 7.218239499876627496e-02 6.571563115442884129e-02 5.992193718330508095e-02 3.939024337277611393e-02 3.040698106405472778e-01 7.060634235476730136e-02 8.804223655808390836e-02 1.259236930485412298e-01 7.114914925829636527e-02 1.667327283125718748e-02 3.168823000887223407e-02 4.708500393725318506e-02 1.797698103798544417e-02 2.842120913886421740e-01 6.916638710584266381e-02 2.823863830486844639e-02 2.497394147281116125e-02 3.194265796359842258e-02 4.444077345160791365e-02 4.732120897943265653e-02 2.568805833917222475e-02 4.123459134303691237e-02 3.190316600446206630e-02 2.779984563572209313e-02 1.936542861927685252e-02
1.331457205503578378e-01 7.634659297564387603e-02 6.515252741091273059e-01 6.205448901126081607e-01 4.854110610408816640e-01 1.130754237771682408e-01 4.862978932545480859e-02 3.297935709773180263e-02 3.965705349112898237e-02 1.404254127734085728e-02 2.267009497300443918e-02 6.579895268930228969e-02 1.119121877552329419e-01 5.795050805789524889e-02 2.089685056172032804e-02 2.627493340699826180e-02 2.895990592699060340e-02 3.053254142851830402e-02 4.768643459152579478e-01 1.579559179195964003e-01 2.710875845423084754e-02 2.727108440241578918e-02 3.201861890242541780e-02 5.695201960798441931e-02 5.386526401557338584e-02 3.823714846987949501e-02 2.926554586727060994e-02 2.615403542620051494e-02 2.794748306022425133e-02 2.959876723853875971e-02
2.732298752101038411e-02 6.871102046222586635e-02 1.618689632704299053e-01 4.496841354895597109e-01 2.947390245121060959e-01 9.589634518055001333e-02 5.114934968453866554e-02 4.454394991193653952e-02 5.539309439418794306e-02 3.571893759608681940e-01 9.895481590699761743e-02 2.475750859745387555e-02 9.160339004076892278e-02 3.560646526633150927e-02 1.122600404867309977e-02 1.448232136236585893e-02 4.707293883758358888e-01 1.204257206007099471e-02 1.825952180795951604e-02 3.334603705290759557e-01 2.608206796898675586e-02 2.833776475381471691e-02 3.550619176310006869e-02 5.856267452982544947e-02 7.403454867902753422e-02 6.444238679975643203e-02 4.767125160258750549e-02 4.391498004739769617e-02 3.773409273167768752e-02 3.055586416065660810e-02
2.265888175498415730e-02 6.479653672877984383e-02 1.151186191052693958e-01 8.285467429540109563e-02 4.904734459967701604e-02 1.941260718481093439e-01 6.602227134731106784e-01 5.793522925139250601e-01 7.707606755651658093e-02 2.377132279122234210e-02 8.391399941052486711e-02 4.449352625836903163e-01 4.189501377795842169e-02 5.122225065523330900e-02 5.488962349638892152e-02 8.283138988150322291e-02 7.453563768755996910e-02 4.831307999512635121e-02 1.354691454991812094e-01 8.380844943378668033e-02 4.709256003909105259e-01 1.707984936605411452e-01 1.268678425410707244e-01 2.979692412114396394e-01 1.504244409549537580e-02 5.040216005433111324e-01 2.667191924991912932e-02 4.967345219705672221e-01 5.102725277068753673e-02 5.753379269009160912e-02
2.096985849546708150e-02 2.108460309815431491e-02 5.721592356663889045e-02 4.267639713154700587e-01 1.555284926038552618e-01 3.579003774165981366e-02 4.407656203880402912e-01 6.906222654131607963e-02 2.141740070281604458e-02 9.017011575520883504e-02 1.856759431019639472e-01 3.525882307142462480e-02 4.295621073213207186e-02 4.274225973764158443e-02 3.882895448087969603e-02 4.721339040937667930e-02 8.122204802307063376e-02 1.415428594046864441e-01 1.454674667814337408e-01 1.520341243398094511e-01 4.545988546084372417e-01 5.059558745565939653e-01 4.170461987897294831e-01 2.644170529715320767e-02 3.128135264290000939e-02 1.150108992283781356e-01 1.390115269030466338e-01 3.056432232391238096e-02 5.214055772614164391e-02 3.903439114505877910e-02
1.909764421731229705e-02 2.081147253779305067e-02 4.674623393305598479e-02 5.175149063728714388e-02 3.469504353014917636e-02 3.668905844167039132e-02 2.043624080964389633e-01 5.468191208761449262e-01 1.352424718664644275e-02 4.603754826396541100e-01 4.977421094566495396e-01 3.921543618765693795e-01 2.204029803798533346e-02 3.829821634778035611e-02 3.592114864062419255e-02 5.534643863957401655e-02 9.691902719581707570e-02 1.192696696631501546e-01 6.987405383714805074e-02 1.736829845689701751e-02 1.253297669145466212e-02 9.171609520981664765e-02 1.190808312906919963e-01 1.648795971053593767e-01 1.389651334305155583e-01 1.788446232191180651e-01 1.408644531730081917e-01 4.646433656406029344e-02 7.515243828464004960e-02 4.356162334063584662e-02
2.424251717630718922e-02 2.799112199449776267e-02 2.729164320952834344e-02 2.562528155747807040e-02 3.681457144510165425e-02 6.154157108735301002e-02 3.248912371396610321e-02 9.584689856766537286e-02 5.385905284289314171e-02 1.113180552430701256e-02 1.133994431583970619e-02 1.745688776598838809e-02 2.573741208656428817e-02 2.608381413261721266e-02 2.618928026007235135e-02 4.720408758163685548e-02 1.034558166727355399e-01 1.060433172155580972e-01 5.107326671543573060e-02 1.768752096135736349e-02 7.564824250860872901e-02 1.358887806303734069e-01 1.725264944732058658e-01 1.749325338207874114e-01 1.517658715644976675e-01 1.288896762386562700e-01 1.865475142391417318e-01 4.294930676341424808e-02 1.033635797246299226e-01 5.556428336059928558e-02
6.003218379309459979e-02 4.712977064193584614e-02 2.297984666702558576e-02 3.218024927496791060e-02 3.802171801845153909e-01 1.708355099910750102e-02 6.238608417371072773e-02 4.960322390984846924e-02 4.875853566927577237e-02 2.403997049733565608e-02 1.380109847031749278e-02 4.602077682970910910e-01 4.421191641176445697e-01 1.362948211266033945e-02 1.904102693552001818e-02 5.859420089947882382e-02 7.165022120223146773e-02 8.922388498212788233e-02 1.579272253596962841e-02 2.501598819300482682e-02 8.340092499481779886e-02 1.784241411706948555e-01 2.176215143538514363e-01 2.221564391028637842e-01 1.798432808897161006e-01 1.690142044528659404e-01 1.530322946588639488e-01 1.547810640387495273e-01 5.233916087077084001e-01 4.315432624218628055e-01
2.410279744912948233e-02 6.682334130574268949e-02 1.149680100908938712e-01 1.147940146555286554e-02 1.328854627150470938e-02 1.689148672793441483e-02 3.780976731618155423e-02 4.745619732857231376e-02 3.258511398288753413e-02 3.155862386933478564e-02 1.152134694360322856e-02 1.244202183637343195e-01 1.906422718126192239e-01 4.424278389651443155e-01 1.066290294203828780e-02 2.682328224743292175e-02 1.510683799429450927e-02 4.138523916330143493e-01 1.305346212550283214e-01 1.133934778203082687e-02 3.201631134048665145e-02 1.694762868455542415e-01 2.131628276614679351e-01 2.200172029375238314e-01 1.575490967495208339e-01 7.117264549192540979e-02 1.126831535387169542e-01 1.182673624864946232e-01 4.474496787017074456e-02 3.138748135343771839e-01
5.048821785997910094e-01 1.355159584629974170e-02 4.551238810799352330e-01 6.167092630511098947e-03 8.416338176202832477e-03 4.737549366929293126e-03 2.418398527963389402e-02 2.501043869283500753e-02 2.928126263240558858e-02 1.060450832141706518e-02 3.338779881774980862e-01 8.532653607471168966e-02 1.480577881344604663e-01 3.527592822155077301e-01 1.611566195691436706e-02 4.423086893495391074e-03 1.142752652358400116e-02 3.163289406085591504e-01 5.124985101697384637e-01 2.561159222373702790e-02 1.025188742572106515e-01 1.940364669357260985e-01 2.082624787137580258e-01 1.952774050680005091e-01 1.469702586330462191e-01 1.052243744140756720e-01 9.993639663560474617e-02 9.701266457549553857e-02 5.494791412022201893e-01 2.398559999994415159e-01
1.602469740510501298e-02 2.137242282482410341e-02 8.644411339126370497e-03 7.544529245184520595e-03 8.470462417905035013e-03 4.391857933454767493e-01 2.067873383735045409e-02 1.404099711771553648e-02 4.010565973104634856e-03 3.670053999825129698e-01 1.479875343920923347e-01 1.303217274437730722e-01 7.223840234616688005e-02 3.276343305618874269e-02 6.809741002423190526e-02 1.907122478180138525e-01 5.397358400562291339e-03 1.470326325806352828e-02 1.379726019129205901e-02 4.917384927147860213e-02 1.040293021268745566e-01 1.612030829872025672e-01 6.589047107914618173e-02 9.772671602839372307e-02 1.171933389990780089e-01 8.400604966232017023e-02 7.166309932562653362e-02 8.092518389011905955e-02 1.337470285757040023e-01 1.455163769976904609e-01
6.244653591083462740e-03 1.170545149550770644e-02 2.293727169010270350e-01 1.959886993470777994e-01 1.832850311521959652e-01 2.695999443821929242e-01 3.811034157476461681e-01 9.582611055028991687e-02 1.341719687715917375e-01 2.326596693508390518e-02 3.444044919600869337e-02 5.419294305130945011e-02 5.112375514744570137e-02 1.579447600472601576e-01 3.421445538496244998e-01 3.489818531645316746e-02 3.928522651796804294e-02 5.271079263494096723e-02 3.629463018708709021e-02 2.756242684345566046e-02 2.605910329523771288e-02 1.792268895248287988e-02 2.724442416600948436e-01 1.237254523615812125e-02 2.161638465543691198e-02 1.271521165486896691e-02 5.296376990959090758e-01 1.933621340878339812e-01 2.487073161748156250e-02 2.319416131801078224e-02
1.681549702626966916e-02 2.201337370647041269e-02 2.630619897412597163e-01 1.527816329636888515e-01 2.553067837505729742e-01 2.019095589250408385e-01 3.188986063374200097e-01 3.538889372971619485e-02 3.154163141499483763e-02 1.363723160953651467e-02 3.373430292692040228e-02 6.228217414426930054e-02 6.732294054985228648e-02 3.079832285216135279e-01 3.922116499199389539e-01 1.848679347941597009e-02 4.124161315053669757e-02 7.718607794687486201e-02 8.785228974635106436e-02 7.682890060518644815e-02 2.620704208478930736e-02 4.509929961360967243e-01 5.326199835850133901e-01 3.675110332889155312e-02 3.875227118762849393e-02 1.309610980788738534e-02 2.297408984818865574e-01 9.374727892297245180e-02 3.475454458095993127e-02 3.327993849853815023e-02
2.119734210930521515e-02 4.251631974210590137e-01 1.497872399245533670e-01 6.543117232573927855e-02 8.422158429132536872e-02 1.923876693232809132e-01 2.531419353521840998e-01 2.879280818280235271e-02 1.551354818079705121e-02 1.763749006901292257e-02 3.196497736319563188e-02 5.455102645673927386e-02 5.053083497631408183e-02 2.399264772290726211e-01 1.506900336109506452e-02 2.933826986947798629e-02 3.169538925790257866e-02 7.292192878281029966e-02 9.175713622925946167e-02 7.832571784161652950e-02 7.848850832533525723e-02 2.826871041879741031e-01 1.939888309356216922e-01 3.458178391001351382e-01 6.796221767312064788e-02 3.271607262320078841e-02 2.401982809335070912e-02 1.632777705446105954e-01 2.846542214008825761e-02 2.564242088431957153e-02
1.508162661531836993e-02 8.888819612651654295e-03 3.350123689659550985e-01 3.673784913207741587e-01 8.842250364557068254e-01 6.198832670459770711e-01 2.594898251512333665e-01 1.073388728864736602e-01 1.635860982545841724e-01 2.083452903143934998e-01 1.941217532930320303e-02 2.261018030985042712e-02 2.990471279564405060e-02 5.856064892687172507e-02 3.021119579868584148e-01 3.272177356665108283e-02 1.908409898647637354e-02 3.818790944710898777e-02 4.125233500895845312e-02 4.862200877210128697e-02 6.127655003567081260e-02 3.529253169690252379e-01 5.674625804337864871e-02 9.847613200877357309e-02 4.005875352147657553e-01 8.613299821810387058e-02 5.364753442070171324e-02 4.920981326713701198e-02 3.374746957938164205e-02 2.937482047059723073e-02
4.440912762503701657e-03 3.259629482101725206e-01 4.318547449301897712e-01 8.507247071297142638e-01 4.965402719677841636e-01 2.267097829893962857e-01 1.047489210655967590e-01 7.452665026775587287e-02 2.437042883736823817e-01 9.222613790820423096e-01 6.403591425405517901e-02 2.370827583459564000e-02 3.612866563007601645e-02 6.891743538048510087e-02 2.925709184490949966e-01 4.831301479310166069e-01 2.829052490994145019e-01 1.216622283049739600e-01 1.705526628582898219e-01 2.878194732642454512e-01 5.022235636349725585e-01 1.180696028563754940e-01 6.142390307651220821e-02 2.968897771513139272e-01 6.781073479621357869e-01 2.096003675703003444e-01 4.844773203108636989e-02 7.085808058033868373e-02 2.775247106646393513e-01 4.710827366628852347e-02
6.504351838084986188e-03 9.722851516340939859e-03 4.239488708467637479e-01 3.441294151234282062e-01 3.390993631906235595e-01 1.266657529713906827e-01 8.456814813218217763e-02 8.882715936668031387e-02 1.032950249439170964e-01 4.036746560483885360e-01 1.190520434732808275e-01 1.234502640867959494e-01 1.029578088768821342e-01 1.145461036006379801e-01 3.058053457178266932e-01 2.004957117400171240e-01 1.255217775751840126e-01 6.943093913514855609e-02 5.800522481275049297e-02 4.306841474582449175e-02 3.443462510019981715e-02 5.037434029045993050e-02 7.758984217706056674e-02 1.853299683960221989e-01 3.163187633125876808e-01 1.418135897479215479e-01 2.069572259695922345e-01 1.412670648982562449e-01 1.451907137698136285e-01 9.545392046318371126e-02
6.933839453237177625e-03 6.467583506726668485e-01 4.129161938672748500e-01 6.217745273452330856e-01 5.532166115341226043e-01 3.031213167791215191e-01 5.430524054330758583e-03 8.630946960037827465e-01 1.371792070172856981e-01 9.793487281316939908e-02 3.735885070970551558e-02 9.245140702534603017e-02 2.425156076186760490e-01 2.423110813695344423e-01 6.985030170296065988e-01 4.905160666180134466e-01 1.409544632032166400e-01 1.502031432150493506e-01 6.552040244910481426e-02 2.855503480203174307e-02 2.775673814335036932e-02 4.347710775595658994e-02 6.642145436883509224e-02 2.023096707489768220e-01 2.035418922755820592e-01 4.769831449694766218e-02 5.217513039984472689e-02 6.649436209532412489e-02 2.155453814769328347e-01 4.396873672110476750e-02
9.273654955071243544e-03 1.383127551452538462e-02 4.728825543272109355e-01 1.627994364069910299e-02 1.064706174919802587e-02 1.453688958948541436e-02 1.262602921956728491e-02 3.412646623064318208e-01 1.357718582267884722e-01 7.760639377686759377e-02 2.382688771287806706e-02 3.264552578407973332e-02 3.652260200825512004e-02 1.329130605015977906e-01 1.563578788042599144e-01 6.409007058014593028e-02 4.884626108537354350e-02 4.771482252264685336e-02 6.222115757284214094e-02 3.553194569670801300e-02 2.525834517521385186e-02 3.771519258243410250e-02 4.307422927463216283e-02 7.160448987843166802e-02 2.219639807141702281e-01 3.468923794156997947e-02 4.989820482049828893e-02 8.112402705211187171e-02 9.740688087807514162e-02 1.928570552020656970e-01
3.234277017719125458e-03 1.471515843041701528e-02 7.263017343010954585e-01 5.042096856355809432e-03 1.137102780696943975e-02 1.183490312323817045e-02 9.716063162811412399e-03 2.306150573418444261e-01 1.781674267845187454e-01 1.672570775968371115e-01 6.929525633833111264e-02 3.603067310545603197e-02 2.310105811490049607e-02 3.641716196359721242e-02 1.642433995682320569e-01 4.179012164898709275e-02 1.067051319472247795e-01 1.536567743726629034e-02 2.612462263362967663e-02 1.367041490276944271e-01 3.538345024317065407e-02 4.959994921958382763e-02 4.326461054144468271e-02 4.742519656975430209e-02 6.260120234684315998e-02 4.766376524743572846e-02 5.574352375472582666e-02 6.818549835427099859e-02 9.123682945314488812e-02 2.232440443140823183e-01
