2.678905420210684696e+01 3.993798980434626600e+01 3.472566103328135512e+01 4.386296158145451329e+01 3.313474603235600568e+01 7.271744483364949474e+01 7.128192068426585593e+01 1.895315731242339439e+02 3.441281726437700854e+02 1.577416897125287676e+02 7.493115772775705352e+01 1.718438111441844640e+01 1.016704591872127850e+01 3.865612979196713894e+01 4.615062173548733426e+01 1.045163304594585085e+01 3.823047346520330336e+01 6.959934580456564390e+01 6.590970062003735563e+01 2.411493464799065123e+01 1.935619435558622570e+01 2.805666881811648139e+00 2.175134937630437637e+00 8.631951395769085877e+00 1.665754619762358857e+01 1.304802980619282948e+01 6.039600974096725139e+00 5.349946694586591445e-01 5.090598077560174461e-01 6.378765417364716805e-01
2.073303321598162796e+01 4.483237389272204609e+01 8.025613350591439143e+01 6.310613547024676251e+01 4.422321430887281224e+01 2.008683694528434103e+02 9.871380041907187319e+01 1.190187806880566654e+02 7.766387411751288994e+01 6.647669911884133853e+01 5.058976346445927419e+01 1.019251841638658540e+01 1.373021577710392727e+01 3.194311924576845740e+01 4.538787919894254941e+01 2.994106342053994751e+01 3.847159897969101650e+01 1.312289876757213278e+02 1.039868426863937714e+02 3.271597105953212292e+01 1.168573314909814265e+01 2.624502552362486085e+00 5.510697492800038511e+00 4.864220069693549142e+00 4.271159468051146213e+00 5.721193282501682020e+00 2.039261204411397355e+00 5.298545754895380711e-01 7.569861509521522702e-01 7.606637493390306926e-01
2.480217597772823410e+02 2.387396940578503006e+02 4.956964891025546649e+02 3.912945691915808197e+02 8.627934606247505371e+02 9.107527248383367180e+01 1.819678643040021981e+01 1.936066026269097406e+01 3.155875723285994354e+02 9.533632204048203107e+01 2.638222841490335213e+02 1.805086485350501277e+02 6.744567042254581679e+01 1.003193000548356508e+02 1.942329888306532837e+01 8.341238367445545521e+01 5.804807565519259072e+01 1.245323661136071394e+02 4.369726258824039178e+02 7.629568975762732919e+01 7.326896448374871085e+00 2.131437122521282035e+00 3.259182431118236689e+00 1.140091300519773476e+00 6.816799958945263249e-01 4.554928013554215283e-01 4.099244474170347097e-01 3.256626955001957757e-01 5.548133670013131180e-01 6.296962769213784172e-01
1.155668488503067977e+02 3.086100921807737905e+02 6.647128554969796141e+02 5.236445510561725314e+02 2.287261111625545880e+02 3.692669059080949268e+01 3.092244144180375542e+01 2.068549482031503928e+01 1.252101258111744286e+01 1.124187796956027512e+02 7.189471226463166431e+01 1.480117484598898727e+02 7.018017217605905955e+01 4.818970379154505679e+01 1.443399483098664504e+01 1.122475869260887116e+01 2.415882174905575397e+01 4.674466261872112227e+01 3.467031460234208851e+01 3.079488892721115079e+01 1.419367104667165513e+01 4.892808928173919547e+00 1.535395006872714685e+00 2.963056329405059586e+00 5.534050877577273431e-01 4.093741611192217578e-01 3.524399585330855733e-01 3.347649358956698573e-01 6.700574637134981693e-01 7.404077188947149057e-01
6.942908151524258642e+01 2.030184240583965050e+02 5.511250406391579872e+02 2.141146135814010449e+02 1.314170381375818693e+02 1.973440435327862374e+01 3.014942669515705376e+01 1.673512973909989299e+01 7.651072082967440124e+00 2.547704353367057593e+02 3.060071827961709232e+02 2.717653955600351878e+02 4.204804548219543392e+01 3.583697315005873207e+01 1.714258769520179015e+01 6.466814017239951085e+00 7.105870571232402710e+01 4.184286816898563188e+01 6.957339670630209127e+01 4.095412473736131176e+01 2.886008105803708190e+01 8.191098169943167306e+00 1.826415768855551036e+01 4.996563740458460856e+00 9.977426838946092946e-01 5.435639779445274877e-01 3.770226161623532191e-01 4.392068395143018944e-01 6.792089785058328388e-01 2.549957985361149593e+00
7.088522787277126724e+01 7.441238408515918934e+01 3.269479958087728733e+02 2.609832132320473193e+02 1.071893969361749157e+02 1.140766362700090752e+01 1.373565730037912402e+01 1.457453415501131033e+01 1.334971060517865560e+01 3.837682336644052157e+02 2.886986353930993232e+02 1.569091310908206083e+02 1.858685456564048621e+01 5.738958094194680726e+00 4.426896725033008018e+00 7.324822966343480957e+00 3.898090605338730086e+01 1.033143717835947939e+01 3.426796086390079665e+01 1.205842128821551000e+02 1.512511252611667771e+02 9.231018878290112184e+01 2.353562520276474146e+01 3.028708250345351516e+00 1.497164460337224945e+00 1.419637220789272680e+00 8.780193123981236969e-01 6.113001689015743478e-01 7.973432586708621983e-01 1.472274583661671077e+00
9.842333959888014405e+00 1.596058272990479665e+01 1.686491350206319595e+01 8.539528185422557272e+01 4.104902178573367166e+01 6.753761206457426169e+01 1.008569412482879670e+02 5.679770488727476874e+01 6.623891320954143680e+01 7.455583322601229668e+01 5.583940095523598757e+01 2.332943050924331629e+01 9.614932680231786932e+00 3.802428242276577386e+00 2.025555662074842722e+00 3.647493048514920844e+00 2.177274837347308889e+01 1.043602369484254666e+01 5.408956152362753045e+01 7.525214018170484565e+01 3.582970650905522803e+01 8.833261857588709631e+00 3.541934667140560489e+00 2.765411195243264952e+00 1.024571619574805581e+00 1.053670014186590231e+00 9.117886287618492958e-01 8.021239854923096768e-01 9.247994859451205141e-01 2.260354599473193726e+00
2.046045156776608209e+01 3.816306883155915841e+01 2.239420167145372886e+01 4.848818189036785498e+01 7.419752269317754667e+01 8.234371838734618620e+01 7.258056968807301246e+01 6.852410315781892791e+01 5.550770459329266515e+01 3.064514403627555339e+01 1.216724505627398401e+01 3.715411890265654904e+01 7.901797711623743226e+00 2.649353436780740978e+00 2.733873657105629906e+00 5.090180911247591311e+00 4.280603777235881324e+01 6.969992004868097979e+01 6.248853772908982762e+01 4.549253402220747944e+01 1.281448253937729120e+01 6.171144530893901248e+00 2.116676834382275274e+00 1.650233108885586608e+00 7.756198846575550476e-01 8.131300760414024165e-01 1.247862317056571024e+00 1.596484595565168751e+00 1.621872790075510995e+00 4.886403286143909064e+00
5.231698727426161355e+01 3.428212195795236283e+01 2.026806270098750318e+01 1.178417365801993668e+02 7.727566805862323918e+01 3.268877307916923769e+01 1.068007099539216824e+02 4.830190922701135037e+01 4.091019529835317314e+01 3.988652039347429934e+01 3.519450814988734066e+01 4.599582648534464369e+01 1.001152430214960702e+02 6.584622875111129758e+01 9.869873802302855381e+00 9.072587251143348297e+00 4.006441628589340098e+01 1.241999130578376906e+02 1.254975526024994110e+02 2.154489938025061946e+01 3.483297637662122526e+00 2.736690842060079731e+00 2.616711384141266361e+00 1.607029025023016588e+00 9.276654474269557804e-01 1.422909583954998780e+00 5.323037306482773623e+00 1.093092073415480669e+01 3.223055249979495329e+01 1.628824107164400914e+01
8.502948859323423392e+01 5.418418472838443734e+01 8.742580455277185081e+01 8.140808543465902858e+01 7.386207639019238513e+01 1.485838207121960508e+01 7.000681976967149467e+01 3.009635658439965411e+01 1.281118947984808898e+01 4.750721994824226080e+00 6.894596809284377059e+01 6.660521795794859656e+01 1.402201988257388052e+02 1.512819206662248916e+02 7.204041896865152239e+01 7.853687706933246204e+01 4.270519662553162448e+02 4.528492248671803964e+02 1.872250450958497936e+02 8.620575730158874705e+01 4.327440641191216741e+00 2.078544636343838903e+00 2.144084842958128068e+00 2.247864800192908241e+00 1.222899606451524956e+00 1.570102709565742494e+00 1.473627014042536487e+01 2.579725704991565749e+01 3.278904560987936634e+01 8.790480478009971677e+00
7.132496715692430200e+01 3.646380800022673441e+01 8.188170818901824077e+01 6.902816445339473717e+01 9.170202548364609640e+01 8.582180059355241752e+00 7.297824255208370303e+00 6.423848776167059071e+00 4.075115935292657809e+00 3.624076062179484836e+01 5.625228794289350844e+02 9.282007869133169606e+02 1.897899187293483237e+03 9.258402187920432880e+02 1.690746246437067271e+02 3.248106878156367543e+02 6.007439749895933119e+02 1.710732238885130414e+02 4.225516075846484654e+01 8.687854839660420936e+00 2.988951620640770468e+00 2.089819536900467067e+00 2.486631044949198621e+00 3.377487814389435350e+00 3.539993041196327184e+00 1.902948429899573579e+00 2.997450076967143495e+00 2.438183649019885380e+00 2.216153467452365966e+00 1.612409426579830551e+00
1.331314103750330702e+01 7.818254094972220791e+00 6.901504856151385070e+01 6.703591323585925466e+01 5.360536109242836744e+01 1.246947734455056889e+01 4.898898939592493562e+00 3.172944706412888394e+00 3.955675088633721082e+00 7.328804995013534551e+01 1.753031296489512272e+02 1.128079564163302393e+03 1.971972593029137897e+03 1.007693844229817614e+03 3.612267365931957102e+02 3.989404967912159918e+02 4.397759847692150856e+02 2.624618432389370355e+02 6.550430401357419896e+01 1.877683602667615048e+01 2.787418358978814847e+00 2.477742451014193215e+00 2.802474669128649509e+00 4.955917009933044959e+00 4.700508861748757816e+00 3.325157943573863850e+00 2.531202522824552936e+00 2.301447386117394522e+00 2.466179555948671442e+00 2.645498214650462199e+00
2.562774032906408817e+00 6.612721650331817358e+00 1.620608875486928468e+01 4.613324222237444872e+01 3.039346763988461220e+01 9.719337700240155087e+00 5.010100833429867784e+00 4.214580096010795529e+00 5.342485264874338391e+00 3.803527122993864396e+01 1.246122408604432152e+01 3.714216224078047617e+02 1.524478505762509485e+03 6.316497869414735078e+02 1.940993053580332059e+02 2.179870030968191941e+02 7.955266889676323672e+01 1.161198078862494185e+02 1.329332664932322245e+02 5.001200253940876905e+01 3.369914934380333627e+00 3.025898504107339626e+00 3.646219438394350476e+00 6.245011199389758794e+00 8.169054750442803936e+00 7.665236624766938789e+00 5.663542439197595257e+00 5.121799573229792735e+00 3.879453662690297566e+00 2.981014447782444954e+00
2.028472912299791986e+00 5.841041015880865217e+00 1.077457203243486283e+01 7.918128279027257577e+00 4.720611228967073636e+00 1.879387286591616402e+01 6.586190944979746575e+01 5.810336111716539875e+01 7.749278604266785386e+00 2.372043524573939965e+00 9.448357667215024236e+00 6.226327399408046404e+01 7.129729613959058270e+02 9.257089144448733578e+02 9.542866569961472578e+02 1.242700877991561583e+03 1.077794930250335938e+03 6.699253683891856781e+02 1.782480125136018160e+03 8.441327314073710113e+02 7.245842463603902672e+01 2.115003940301618712e+01 1.593168747934935681e+01 4.000981827905770416e+01 9.231357653190642054e+01 8.511700503560366826e+01 2.344055151017796561e+02 7.889498280103036620e+01 6.289820850517357620e+00 6.048653106664122703e+00
1.829549110298153369e+00 1.844820839410066471e+00 5.156775243194257285e+00 3.896722255407883040e+01 1.426629738184179175e+01 3.374543700422059977e+00 4.473651089310821760e+01 1.330298834329587692e+02 9.258040016203307232e+01 9.526733328906409781e+00 2.029679347562521485e+01 3.204313814978571600e+02 6.636848207227101284e+02 8.050979818946993873e+02 6.965326741775056689e+02 7.967019255463028458e+02 1.281202822004937843e+03 2.090918104425220463e+03 2.071848716642950876e+03 1.667188435892604957e+03 7.461380098441857456e+01 7.898346235671812110e+01 6.878159546993532558e+01 2.093419699803012577e+02 2.845486997321072522e+02 1.417064719298719410e+03 1.446572310232215614e+03 3.165028690497315438e+02 7.324974220750700482e+00 4.381920690174043287e+00
1.608063435977734157e+00 1.763171483284098340e+00 4.106917907851524774e+00 4.599086073808984487e+00 3.077459259299581085e+00 3.524227744589484512e+00 2.506516182254996039e+01 7.153142179432306591e+01 1.511255812153879674e+02 5.506634542249933872e+01 5.783522349340006485e+01 5.124321739158255440e+01 3.929132361700752085e+02 7.627320732827123493e+02 6.845028813513711157e+02 9.999742436436808930e+02 1.586516784503389317e+03 1.804798049352547650e+03 1.013969397194301337e+03 2.239120651080345397e+02 1.352529998963730122e+02 9.134867543062173354e+02 1.281171231067463395e+03 2.082644405854157412e+03 1.875186303403286274e+03 2.392598466117224234e+03 1.982092962568843632e+03 6.160564238502413446e+02 1.150263906579745488e+01 5.192380700258016901e+00
1.964899683151926313e+00 2.291307650279844843e+00 2.302425254819277178e+00 2.229111538206915544e+00 3.443900772567916935e+00 7.213889844008777530e+00 4.200012280398257758e+02 1.408039014352750655e+03 6.948725953316270534e+02 1.219708423429085542e+02 9.348493550342323033e+01 1.509249744479921276e+02 2.970407258325752764e+02 4.184733944586440657e+02 5.285822267934513548e+02 9.077090968454335780e+02 1.775728620663042875e+03 1.690699147253033061e+03 7.833362828030344645e+02 2.655230659882161035e+02 1.088804917839177051e+03 1.854792718375757886e+03 2.277472192215348969e+03 2.269116696200454953e+03 1.961757057441688175e+03 1.697474516191574821e+03 2.608032246992231194e+03 4.863732216228639800e+02 1.711173968400477463e+01 7.287104778591571019e+00
4.747391118342370042e+00 3.761828503025970161e+00 1.997816160150633458e+00 3.197714498918506010e+00 4.258539039284057992e+01 2.153970703854277247e+02 1.188268195580609472e+03 9.647369231721036158e+02 9.572228015209860814e+02 4.924534879838726624e+02 1.870921284453872317e+02 5.293417090634979161e+01 5.189026201153515672e+01 1.273014787372405863e+02 2.734236105328302529e+02 1.208320868852322519e+03 1.172417918319414184e+03 1.289106779203153565e+03 2.148807596332791832e+02 3.625818748315676885e+02 1.184136785067403480e+03 2.374489587783159095e+03 2.802289823814499414e+03 2.837176145568696484e+03 2.355988566414692741e+03 2.310642463337464505e+03 2.244572835983847654e+03 1.843438456365334787e+03 8.810545754639004201e+01 5.975371164847981476e+01
2.137041116014702258e+00 5.962541098107274173e+00 1.125113771737804313e+01 8.020671178909553589e+01 1.851469311962876816e+02 2.631678398380257704e+02 8.243713050211031259e+02 1.024402191268967727e+03 7.087449734471492775e+02 5.604675685479066942e+02 1.207839026125510031e+02 1.219963077664063178e+01 1.835434846913875617e+01 4.939418414885209074e+01 1.023690568141619650e+02 5.795939326964288512e+02 2.072845567617353026e+02 6.278707706827748325e+01 1.997132161807642703e+01 1.380645678231833529e+02 4.699327716005284401e+02 2.298023184309728094e+03 2.760024724571432671e+03 2.820330710020321931e+03 2.061749570087214579e+03 9.670902281681758268e+02 1.604017217464963778e+03 1.137832760232525516e+03 1.086339889711468487e+02 4.508198521277862625e+01
5.455323933170194550e+01 7.184779638690315551e+01 4.977372344512767199e+01 6.426343999837617105e+01 1.586490167559474287e+02 9.214972535959377353e+01 4.747359728596037485e+02 6.124090399477706796e+02 5.686470399805734814e+02 1.347205879728013542e+02 3.409534762304254940e+01 7.260447992064868572e+00 1.247791605456288799e+01 3.524202239362752209e+01 1.339852059672038820e+02 8.664797616140467085e+01 1.493390182469752006e+02 4.181808304490262174e+01 7.426088331952352917e+01 3.306127095864335388e+02 1.575415316396347635e+03 2.765458919382625936e+03 2.822046070484079792e+03 2.607755005235825593e+03 1.981736666834147400e+03 1.452458407893199592e+03 1.430314796104863490e+03 9.936656725743501966e+02 9.418532915913363013e+01 3.471462595776517190e+01
1.587848474605709441e+02 1.505034491658944660e+02 8.148395278338131220e+01 6.198182928552085258e+01 8.564667512179920550e+01 4.683349357924359424e+01 2.685445598002594352e+02 2.412161621102069944e+02 6.680719971859733164e+01 3.577107382924221213e+01 1.217409189275697479e+01 9.573853443008800923e+00 5.634248429597263907e+00 3.053713012479363442e+00 7.757648434610040944e+00 2.557609552060020519e+01 8.632895951611855878e+01 1.866294332779412741e+02 1.705144740431965147e+02 7.158250254080016930e+02 1.767362453053873423e+03 2.402129620031140348e+03 9.359976560422328475e+02 1.344432389749974391e+03 1.675418330930598131e+03 9.309403307510481227e+02 7.002221966288404928e+02 5.938401714331724861e+02 2.268321594438859989e+01 2.069080893292001377e+01
1.311789156807383563e+02 1.565031911658543322e+02 2.447944016222651697e+01 1.803090667708693928e+01 1.581512126579778332e+01 2.420386088382396039e+01 3.495904327914375642e+01 8.836132786389278237e+00 1.155111979975218084e+01 1.794074826197891603e+00 2.334440263018660922e+00 3.532318413916682331e+00 3.877829123306381298e+00 1.365657607176074784e+01 3.792561074264953902e+01 4.820028579131226820e+02 8.702838381177584779e+02 1.195937483483426149e+03 7.742526254606254952e+02 5.516997582669351914e+02 3.658688312185004179e+02 1.258374049526241549e+02 4.629570291162926310e+01 9.236090645963739121e+01 3.168171712097348518e+02 1.042139795100677304e+02 9.784687752589582033e+01 3.401831816185943325e+01 3.902658669930202606e+00 3.192442778806227288e+00
2.806184163877233573e+02 2.228921436608421232e+02 2.539547154488322889e+01 1.157858517062587644e+01 1.800229003918289195e+01 1.439169770352545541e+01 2.251880263385316283e+01 2.437575899975684024e+00 2.070049025161120770e+00 8.911807828248849983e-01 2.102791342930191654e+00 3.959475376511679912e+00 5.238263604117332939e+00 2.794776731093172017e+01 4.524518695899845966e+01 2.784441559916456868e+02 9.626051645393636136e+02 1.697931757134359032e+03 1.806641080920545392e+03 1.513152632299478228e+03 3.121162737211571994e+02 6.646216777683866894e+01 7.851080254372919853e+01 1.765476769718771095e+02 3.709113245093984119e+02 1.048646651591349155e+02 4.134544200055561447e+01 1.602133694732393110e+01 5.053559994700086655e+00 4.536359860150451340e+00
3.578249031260261859e+02 4.678933389423766442e+01 1.349997162063217360e+01 4.630346619392669005e+00 5.539697661976224374e+00 1.239514599194634492e+01 1.618391540735993672e+01 1.832135554453166559e+00 1.017516943175943656e+00 1.169457337891830928e+00 2.061366683049495663e+00 3.504246147391904209e+00 3.949466943999285551e+00 2.171049087407866551e+01 8.367345654102504682e+01 3.981292555446266306e+02 7.320880941730645191e+02 1.609162279572499301e+03 1.914246512817709799e+03 1.555440311149431182e+03 7.478845102041599375e+02 4.109669902507166483e+01 2.781698910114564072e+01 5.624435857672536798e+01 3.061296654071210241e+02 1.713343708552466751e+02 1.534682969435936570e+02 2.938721143650799306e+01 4.503050552336308243e+00 3.458262073571836126e+00
2.051508109694846098e+02 6.478463596405455860e+01 2.590096490916577920e+01 2.502381922122882685e+01 5.845521103816336961e+01 4.089206823442810190e+01 1.714474160688402549e+01 7.109386350342480121e+00 1.073211413204373699e+01 1.387343448877913588e+01 1.284118890151472625e+00 1.439928159163962773e+00 2.238020145811618455e+00 5.048558489758606882e+00 3.034548399106351013e+01 1.227002822260406276e+02 1.185789941889987915e+02 4.880158572881589407e+02 6.040462538520007456e+02 4.986598428580286964e+02 3.983261522466768838e+02 4.907146963042436028e+01 7.227445816328422978e+00 1.370801256494096521e+01 5.828470521108376090e+01 1.368490813816584364e+02 3.627701546242018367e+02 2.043878896276912656e+02 5.338646240869149295e+00 4.028444766666932964e+00
7.387378743708080719e+01 2.986194793131079805e+01 3.273573212563655233e+01 5.716704097420921471e+01 3.282832146826953590e+01 1.505163256904086211e+01 7.010573188857926574e+00 4.990359026138769138e+00 1.592781450560634937e+01 6.116699827865743089e+01 4.132483596305574380e+00 1.417016520774339039e+00 2.390437698573717906e+00 5.226978659759813794e+00 2.469229338006325136e+01 4.395887437038295076e+01 2.928561188682230920e+01 1.410123528690759898e+01 2.164419824087094568e+01 3.825028177061944490e+01 6.561741095378032185e+01 1.448930744000872295e+01 7.254010526076483778e+00 3.666190069599887380e+01 8.780052217833279826e+01 2.958337717267482603e+01 9.950732376619794195e+01 1.100737794422697675e+02 4.033348993808179728e+01 6.177254331110157537e+00
7.491471468029465086e+01 6.127642452842824383e+01 3.064408075634987583e+01 2.329145297630385869e+01 2.279780950326569666e+01 8.752141366241666276e+00 5.855816895037825986e+00 6.078235474200061716e+00 6.765244020871214126e+00 2.677857520120297607e+01 7.498283837567171872e+00 7.075474305159170640e+00 6.662873117108363274e+00 8.279331977082634353e+00 2.393053017276393035e+01 1.674189637882261650e+01 1.139648550108365122e+01 6.873235720231573254e+00 6.092349673844559277e+00 4.681864713236413067e+00 3.710686519260559812e+00 5.399350817683261639e+00 8.557503770049089908e+00 2.136815511102737375e+01 3.751427146997378514e+01 1.796895791214125992e+01 2.870984748144076093e+01 1.843105935180551924e+01 1.851528171048220628e+01 1.192977401503278045e+01
1.015153775373155156e+02 5.396070242849734910e+01 3.150710819812135810e+01 4.468899125274445083e+01 4.129077180703421135e+01 2.291648637007754630e+01 7.928127623837397664e+01 6.092832683643089808e+01 9.105068497311723519e+00 6.548465269718109383e+00 2.315682899547157447e+00 5.276759848290380361e+00 1.563441049593033583e+01 1.734535755135145507e+01 5.392128396907322951e+01 4.073822778516574772e+01 1.301096556640246504e+01 1.560820486694637133e+01 7.282084654139114654e+00 3.178556777927413979e+00 2.881325501120889587e+00 4.389530382186276114e+00 6.812782394583081214e+00 2.163644300882458538e+01 2.263974140709129657e+01 5.507167634192844829e+00 6.193298954688781777e+00 7.854193854585984624e+00 2.504162215856919715e+01 5.218096737413100428e+00
1.363711865471077260e+02 1.203273632809788154e+02 3.747981202104654130e+01 1.331795102626499840e+02 1.623767724839460982e+02 3.126673963141925583e+02 2.133898773202834036e+02 2.464068827398993733e+01 8.992527899989344320e+00 5.151185410269615517e+00 1.508555371419000757e+00 1.870656913073920791e+00 2.342576418833798080e+00 9.495470439225448089e+00 1.208189478428043984e+01 5.530842164129644800e+00 5.472599719548107089e+00 6.632049238978550143e+00 9.093104114746001443e+00 4.979499001795780089e+00 2.701297110130375323e+00 3.658145009355417532e+00 4.098765691309606218e+00 7.182858466594122859e+00 2.348589511657483797e+01 3.814438824235587333e+00 5.626390706565050692e+00 9.180378278649801160e+00 1.077073975982843201e+01 2.195006494380136175e+01
7.505122857799952385e+01 1.907551428897740777e+02 5.871001847838428489e+01 6.547784617901808701e+01 3.319530849664021162e+02 3.589190111331824937e+02 2.442509301048888517e+02 1.715463858784286444e+01 1.226608163459167145e+01 1.147389496398386122e+01 4.668666725580343346e+00 2.294124983695073894e+00 1.483031021249899606e+00 2.653761193312911715e+00 1.302816327296518928e+01 3.891401523076686964e+00 1.405999073499175367e+01 8.457245204588001286e+01 1.490598030307747024e+02 2.078666544724143961e+01 4.060678953626269738e+00 5.124021158638504936e+00 4.346312172128650175e+00 4.975129003192991561e+00 6.885897346689803911e+00 5.454157038305620375e+00 6.550629022324959472e+00 8.087646784174886250e+00 1.055522077898321243e+01 2.651515494170596554e+01
