3.383520124857470890e-01 4.889292055010503457e-01 4.144350118007873451e-01 5.142070822976131383e-01 3.610850638214769814e-01 7.530278987718187489e-01 6.864583431579696082e-01 3.644651203666508105e-02 5.357562204705532127e-02 6.501480973008719189e-02 8.435134753696640342e-01 2.213229587923014607e-01 1.461495139847220348e-01 5.786504555332980804e-01 7.175891545686290396e-01 1.705356301716410561e-01 6.442056629237986609e-01 1.771285381806541118e-02 9.159219430494462688e-03 4.769405679426726996e-01 4.439850071817404431e-01 6.600399796839437339e-02 5.023437988992209002e-02 1.990942661497717425e-01 3.824812235000855654e-01 2.978868791977300479e-01 1.363383215738081522e-01 1.200273096424948546e-02 1.146319475259759829e-02 1.442547494844797877e-02
2.213912601587142981e-01 4.714009234475158849e-01 8.306369243118154611e-01 6.260734164630294973e-01 4.314390291394475385e-01 9.224228836044089108e-02 3.710093484273142145e-02 2.927118440593701881e-02 1.429937201787937970e-02 6.345788370542126966e-01 5.145346897673879205e-01 1.132852787869228078e-01 1.709626257237194802e-01 4.425859161061918012e-01 6.495952350361573480e-01 4.679707960560488544e-01 5.976612808556365231e-01 4.211554749575822931e-02 1.351462058343875020e-02 5.707655256598174187e-01 2.553109989562524218e-01 6.368437288777238636e-02 1.314045015051650278e-01 1.164177332817224464e-01 1.020911928623075698e-01 1.361212693495083004e-01 4.775737786174655275e-02 1.215212052262527355e-02 1.730706187855785352e-02 1.731498773114353157e-02
5.380399495266786902e-02 6.998353146041173811e-02 1.435498695106404154e-01 1.048199760463427860e-01 1.877390880437134757e-01 3.254023178435286323e-02 1.810302985354143301e-01 1.900939327589931116e-01 7.569399417163398536e-02 2.015031415484022648e-02 5.571659446412464967e-02 6.979068575676092290e-02 7.691224328649228781e-01 9.718104091326741634e-02 2.653282077172231523e-01 6.573881679809052969e-02 9.154275576114709878e-01 4.032431775803830415e-02 7.539300967507851781e-02 1.549871123127190796e-02 1.614607187599305660e-01 5.304232517107294181e-02 8.036046187213424785e-02 2.767377598880588901e-02 1.625153359801152775e-02 1.065576567824231928e-02 9.526889730486725119e-03 7.491021692687793027e-03 1.278740083360831691e-02 1.434606770626078130e-02
2.317345163935863664e-02 6.294990577071300775e-02 8.698135072621102082e-02 7.010872786146066238e-02 4.308589239678830424e-02 3.678469304895181091e-01 3.666125228307040573e-01 2.280609303584901215e-01 1.237270325038148516e-01 1.558707615332217619e-02 8.484033146935439709e-03 5.120073998304550122e-02 7.541765049220374717e-01 6.134033532186633497e-01 1.931722874113380728e-01 1.652487458965697098e-01 3.645457865060010016e-01 7.194164063098801298e-01 5.660574867861793980e-01 5.270299046422117772e-01 2.900943421865281313e-01 1.119981139594677932e-01 3.744018920482051344e-02 7.320054144985879696e-02 1.326931299212557799e-02 9.431144842336102591e-03 8.095859334246597802e-03 7.689922567850704035e-03 1.562695954254774561e-02 1.699098447906980530e-02
7.045033729429033276e-01 8.694406914854377333e-02 9.949403160409750480e-02 2.641476536980958897e-02 2.671058943718376821e-02 2.152771009969116633e-01 3.771128337232370620e-01 2.128910200786918450e-01 7.843772961940348454e-02 4.137197236985556970e-02 3.859667938601466647e-02 7.954869161258018573e-02 4.550743229881941687e-01 4.724986523681911632e-01 2.473827964534798807e-01 1.004087462775637568e-01 4.873648812470523367e-02 6.825792389740373833e-01 3.007849156873739285e-02 6.493078207933018486e-01 4.609652682595972717e-01 1.433146538277104143e-01 3.644767919431346481e-01 1.196055945099593898e-01 2.389931369361347410e-02 1.260303220800293098e-02 8.739037842965346678e-03 1.012798019742792814e-02 1.587217538751279841e-02 5.847057271376816801e-02
8.113994567796098956e-01 7.601634270459985965e-01 8.247404272606159714e-02 5.060647185699283790e-02 3.996330678728166053e-02 1.254027299818765706e-01 1.632668369842889267e-01 1.752239418490428025e-01 1.470045195317650488e-01 1.931876585838998017e-01 1.002752761767999601e-01 5.796147647745951426e-02 2.038343209787887023e-01 7.719042930849535911e-02 6.505337843567578215e-02 1.142806978549712055e-01 6.285330553974323164e-01 1.636821016518399952e-01 5.235729733501143235e-01 4.932544830151460585e-02 3.598015613019085734e-02 2.985653108236661218e-02 4.457300645490821500e-01 6.943703744046750281e-02 3.557338403535459381e-02 3.292247903293517297e-02 2.046763696863739684e-02 1.418266500759848316e-02 1.881398447539182547e-02 3.395069448495863923e-02
1.317580882807016796e-01 2.003108982191586507e-01 1.925209075660567759e-01 4.657760542418856731e-02 4.301176853118294785e-01 7.324106054365372431e-01 1.133693422496145492e-01 6.808331333747814629e-01 7.813668373810626067e-01 8.231254926555515716e-01 5.831029128090238212e-01 2.472658682017077059e-01 1.131647677979329136e-01 5.255652909282291368e-02 3.101707969479742394e-02 5.804559510295671798e-02 3.427916112055038877e-01 1.612135961593306743e-01 7.909146760776493146e-01 4.690749278858038357e-02 5.150417104672572188e-01 1.421074097443886242e-01 6.561294320261476520e-02 6.253529315884825968e-02 2.404792149910081264e-02 2.448407131693404459e-02 2.160079156627616598e-02 1.892194063089528214e-02 2.214016909500243421e-02 5.264490500926088945e-02
2.866238190950980980e-01 5.310714888565649661e-01 2.775634224889819701e-01 5.265634263281990801e-01 7.748043731801954603e-01 6.121242248626043714e-02 8.211143644505852768e-01 8.232114623782660345e-01 7.226472274290652864e-01 3.974438504546097262e-01 1.559613178814519274e-01 4.609839252624186035e-01 9.911403089847081738e-02 3.473181055769965914e-02 3.977669463609968814e-02 7.645048841047197286e-02 6.081466095638626834e-01 9.586979927660314038e-01 8.458236917395580701e-01 6.471722147620753152e-01 2.059725644122888666e-01 1.178055772880196028e-01 4.670342470663070567e-02 3.885153610149855857e-02 1.841964650655660354e-02 1.929296821841640364e-02 3.118409864397485992e-02 4.037518887094003472e-02 3.978982499837994957e-02 1.145356674479457854e-01
7.331429481791769120e-01 4.720953442045803250e-01 2.502127699716432674e-01 1.026975854540075755e-01 5.357518901564596592e-02 3.647842821351942044e-01 1.573267652097189995e-01 6.057258906878215665e-01 5.585038718676916814e-01 5.516625342561671808e-01 4.800325784259686368e-01 5.900504104980407449e-01 6.149461208716454352e-02 8.155152895830551918e-01 1.286486304141426507e-01 1.108915787391868968e-01 4.597980340844342040e-01 6.924283983828191658e-02 6.336900222603218669e-02 2.792987752246917643e-01 5.391194811528049469e-02 5.460451451473213175e-02 5.908293869280451666e-02 3.844789165028694028e-02 2.246313625012493626e-02 3.432974156748493100e-02 1.360511078283939412e-01 2.716462054497503775e-01 7.668874131079534973e-01 3.703006896664648995e-01
1.213258729355804810e+00 7.663162210935765550e-01 2.242578779947483336e-01 1.293827110801782365e-01 8.159252523170443805e-01 1.670669381885245275e-01 8.607703328299649570e-01 3.889486992715283087e-01 1.838655794459261028e-01 6.506348926062749394e-02 8.711161473618440620e-01 7.319023347671843593e-01 4.904892685212870751e-02 4.217787536970388912e-02 8.075532838288130844e-01 1.705624826882008033e-02 6.707868492392397852e-02 7.460603161974073416e-02 3.414529687190612228e-02 2.177573495287917979e-02 6.715870615552749223e-02 4.229569354577696755e-02 4.842432037160029207e-02 5.315048938328709172e-02 2.968031143016348211e-02 3.808207065575760358e-02 3.680704980716008601e-01 6.194923097207668539e-01 7.528749063413375797e-01 1.930499331321152146e-01
1.039527279812428651e+00 5.230209124081373062e-01 1.100784599948678721e+00 8.991688544205035383e-01 1.838263477248074929e-01 1.087215312798916200e-01 9.933875203623498962e-02 9.090455672086089622e-02 6.009985449912603334e-02 4.663491673305159013e-01 1.260908978454886864e-01 1.622914709042273806e-01 2.437625406734217903e-01 1.350287698820907822e-01 2.519534303009342280e-02 4.900895615720741311e-02 7.217663420622852377e-02 3.407561681285536243e-02 4.619382447438851735e-01 1.124357839276317605e-01 4.622440729809825649e-02 4.116705078582849620e-02 5.309937213581415738e-02 7.434722094991541574e-02 7.959962172795186086e-02 4.347169830834606008e-02 7.023913651523565338e-02 5.490104455002806083e-02 4.834685501996096452e-02 3.410707541876866616e-02
2.018005623123266534e-01 1.155681715180416069e-01 9.837156407281409942e-01 9.350751934476708715e-01 7.317095559268449456e-01 1.706354434238640805e-01 7.337259998422770990e-02 4.980950447026603889e-02 6.004381996517149656e-02 2.402492849157877169e-02 4.026384893230840895e-02 1.285845978206852647e-01 2.222296335694176617e-01 1.153192345716708422e-01 4.164019045101027827e-02 4.707282219516396166e-02 5.198017081493660346e-02 5.364883344445418867e-02 7.746316592481801155e-01 2.567778076912622942e-01 4.434550402940228009e-02 4.489248639438779553e-02 5.304101341834624450e-02 9.491553428306573337e-02 9.032080819266298521e-02 6.450799588507505344e-02 4.974552724470343579e-02 4.502246883301072589e-02 4.874680575656129000e-02 5.239706399163037570e-02
4.165169336223875640e-02 1.045122965711946517e-01 2.455722383557663591e-01 6.806142149482172776e-01 4.460651416652919865e-01 1.451611759725628115e-01 7.738352703418181766e-02 6.736018461584422634e-02 8.385604116059847124e-02 5.478351919626576194e-01 1.539769982387850789e-01 4.754299845813385328e-02 1.803440274783059682e-01 7.080636452180558149e-02 2.224471072757668033e-02 2.573638096230182817e-02 9.524044508391154434e-03 2.110937734319978665e-02 3.326222327590817179e-02 5.431301220889563908e-01 4.271382642999266288e-02 4.666880106919939208e-02 5.880213794187244547e-02 9.761540420299238963e-02 1.238296022921494544e-01 1.084305775899804397e-01 8.084164203271436422e-02 7.576466740120002541e-02 6.607046864392232544e-02 5.442225719770096837e-02
3.472977372007306218e-02 9.902854238558123079e-02 1.754620134023948674e-01 1.259768002936391962e-01 7.451155781612264772e-02 2.949229142007280813e-01 1.001821913638287320e+00 8.780088760529731751e-01 1.169668661824690148e-01 3.663380091376877701e-02 1.312270529901027050e-01 7.092217078411413578e-01 8.286012936369915871e-02 1.017066780134060766e-01 1.080747518396264206e-01 1.454809957438039925e-01 1.315379526764225426e-01 8.586443279587645250e-02 2.611641491364043999e-01 1.570344541094655932e-01 7.723265540127831619e-01 2.814485584322909406e-01 2.100950676754648749e-01 4.969198797488092456e-01 2.599918839943748949e-02 1.633476919310672751e-02 4.761561988991377253e-02 8.608204544621429477e-01 8.976758416959529363e-02 1.031941227336101302e-01
3.175975449834667064e-02 3.188127449763595439e-02 8.662627506997204463e-02 6.470464313131498724e-01 2.362853569319587344e-01 5.437108603836267318e-02 6.671480896604431443e-01 1.082856975643006203e-01 3.350929616809784906e-02 1.382535558863852154e-01 2.880448837319919964e-01 6.358854058736079784e-02 8.236970724857267667e-02 8.407398999037191123e-02 7.599612836751168388e-02 9.192808453659671863e-02 1.582531395123228657e-01 2.762596311480004507e-01 2.844033370363251989e-01 2.883931498472894206e-01 7.479683667904299949e-01 8.376085771787560308e-01 6.948034047180485784e-01 5.065507881973809606e-02 5.628950405746548091e-02 2.112383180542056760e-01 2.579745541427874711e-01 6.352757543124211426e-02 9.228947414859023368e-02 7.026675013336519671e-02
2.857098704186560034e-02 3.110678322633682324e-02 7.024212405442770146e-02 7.818604055270511610e-02 5.266309840368344625e-02 5.567082096508683270e-02 3.077820163441202794e-01 1.829419476454013579e-02 2.103198817037246759e-02 7.008027501493827582e-01 7.637865778726335986e-01 6.095819682807913642e-01 4.199268367396008506e-02 7.450891578786794645e-02 6.991641264603379313e-02 1.078144463613224247e-01 1.891146033524450099e-01 2.331159020727701925e-01 1.368008086491183939e-01 3.364079056814655438e-02 2.409227373515999970e-02 1.775831243816970439e-01 2.366618723619026698e-01 3.402715948842037763e-01 2.952783527034835154e-01 3.864096546096837947e-01 3.095322141168775354e-01 1.014539235786166005e-01 1.338428999402720976e-01 7.847260258992069804e-02
3.605968855068507339e-02 4.156312798480784471e-02 4.072524106877836725e-02 3.853047527846453768e-02 5.573430231992190786e-02 9.320354824549997863e-02 5.030394920515510876e-02 1.489177090389359470e-01 8.359918080170389287e-02 1.920445026568113125e-02 1.924014674604963837e-02 3.008708389055714943e-02 4.589484726553966221e-02 4.854622631806051331e-02 5.073000245440612010e-02 9.212611569699205583e-02 2.021458588790379929e-01 2.074934355558313293e-01 1.001040650440270935e-01 3.491078092751601081e-02 1.520704983229650142e-01 2.782541873285758194e-01 3.598413910636956148e-01 3.715757988285076641e-01 3.285283338305222678e-01 2.846298241774843918e-01 4.217608583312974502e-01 9.447622397582718101e-02 1.850174734665612775e-01 1.000431203692609683e-01
8.928748954305076868e-02 6.991883810725223192e-02 3.415862016460793210e-02 4.816990158438041320e-02 5.736843739059775960e-01 2.977055478390785992e-02 1.138053363042224042e-01 9.037407897544683100e-02 8.845472253731084811e-02 4.370576760859112148e-02 2.389786883693342801e-02 6.958828889606207824e-01 6.755533092310997967e-01 2.383708925745603446e-02 3.510346863284089652e-02 1.150493103959097652e-01 1.381963511081271134e-01 1.712242570414449216e-01 3.038521676760696372e-02 4.922269244874766941e-02 1.687879574740031585e-01 3.688079684673289949e-01 4.592461741372864115e-01 4.788016839912556111e-01 3.962348325850726938e-01 3.833251532062482148e-01 3.576650273287361737e-01 3.500016218583712480e-01 9.410866841611471578e-01 7.761121462024915818e-01
3.600860262276876778e-02 9.942299384913673432e-02 1.712801451678301334e-01 1.874638187325676497e-02 2.304068794443219978e-02 2.960678908951232258e-02 6.883072979685153636e-02 8.573969397066238951e-02 5.848767420059718114e-02 5.510285213327062448e-02 1.922867199886873352e-02 1.867115277478720858e-01 2.897950697581432866e-01 6.855859464459940211e-01 1.921401072545610156e-02 5.391074770308274672e-02 2.901925889052731425e-02 6.742639799430498737e-01 2.140653277604020188e-01 2.208758991234946109e-02 6.557450253409227714e-02 3.526357413766820770e-01 4.505596844733837925e-01 4.749571530206123104e-01 3.487626622134671894e-01 1.628073109084489378e-01 2.656124110631822854e-01 2.641402594982647511e-01 9.188086323450141146e-02 5.678238494243196266e-01
7.583964833189179577e-01 2.205481137623043972e-02 6.802040676701310851e-01 1.037070721780020133e-02 1.495333208104598563e-02 8.389336060115295396e-03 4.250127194176481216e-02 4.481791225507468501e-02 5.046317144206401151e-02 1.758043156490701406e-02 4.951947871830248982e-01 1.269634075295232867e-01 2.238093612862990800e-01 5.474247753027707830e-01 2.913408785493105946e-02 8.943540164056195535e-03 2.224899358328952248e-02 5.204786805696579588e-01 8.474791949629785215e-01 5.079573180937257959e-02 2.127730423594169640e-01 4.064012420577703399e-01 4.402716606664397458e-01 4.225508924769587615e-01 3.281168795425226659e-01 2.428153823360094110e-01 2.373883756377486998e-01 2.195802746035467878e-01 1.000593553972589200e+00 4.367285081105432010e-01
2.791575904318081142e-02 3.578777967497626805e-02 1.464757586653282415e-02 1.256481693531310076e-02 1.417942805855677488e-02 6.568597305954688714e-01 3.449639281416379266e-02 2.371265624278801748e-02 6.678253813731148750e-03 5.400729384707859682e-01 2.179528386041954813e-01 1.923766729101842043e-01 1.088673198853723767e-01 5.104255205003014467e-02 1.094314051597099213e-01 3.157609989851304366e-01 1.101459940414020733e-02 2.938700812090124653e-02 2.760842649024398965e-02 1.007754809377983535e-01 2.208154086370634483e-01 3.397303922359800055e-01 1.390805519439082816e-01 2.115634710427510279e-01 2.640818885247723791e-01 1.891136703812092423e-01 1.629545836845600892e-01 1.785614402691663161e-01 2.452235478699095750e-01 2.667737543787523369e-01
1.180371053316353440e-02 2.054216966049272897e-02 3.439113650719983761e-01 2.945056597974823331e-01 2.759952222601811944e-01 4.040313823834241758e-01 5.671753739596896438e-01 1.417116292607469297e-01 1.972731205266697874e-01 3.419674822871685699e-02 5.060751897083961420e-02 7.982718270055282062e-02 7.696044807752867867e-02 2.462994592300804531e-01 5.516301500189042528e-01 7.087729079939274202e-02 8.445034745620409733e-02 1.142212288828722278e-01 7.846387981008409729e-02 5.947420060227096017e-02 5.410287632759380044e-02 3.512265375323900957e-02 4.565714671386306156e-01 2.517218742698080700e-02 4.886334350158182127e-02 2.772226947475486120e-02 9.696446791941863985e-01 3.542334755138230595e-01 4.559458939826015189e-02 4.254384861373192162e-02
3.024601957891673298e-02 3.722236673534586038e-02 3.919757299079168478e-01 2.286952372184128390e-01 3.838993573644940982e-01 3.026614653757920825e-01 4.749932067316731121e-01 5.243550463772739256e-02 4.651458151516248141e-02 2.012031191632857041e-02 4.982391439836898750e-02 9.213654254705896940e-02 1.014316901299625595e-01 4.781317997669701780e-01 6.264776642831662024e-01 3.709760252943151981e-02 8.785150133601292433e-02 1.643411670700311578e-01 1.870502147856456243e-01 1.638500960807754980e-01 5.298444375707396514e-02 7.592703892165442170e-01 8.956071793792139690e-01 7.248447841932588454e-02 8.245696389210273314e-02 2.797274386711573815e-02 4.112355249826860071e-01 1.682022563600835408e-01 6.250058393385468647e-02 5.997281932155688888e-02
3.804033403577332384e-02 6.350382308507768192e-01 2.223545022654735137e-01 9.527162542853553906e-02 1.225920852765846336e-01 2.795427046712163355e-01 3.769517230032063959e-01 4.275392284556536054e-02 2.290619015620122198e-02 2.608238091104868317e-02 4.739920186284734410e-02 8.111682002175356343e-02 7.625790955056432896e-02 3.708920203771306490e-01 2.660578472608942160e-02 5.708947408953750358e-02 6.632596055810061064e-02 1.530662798546511827e-01 1.939080089059051493e-01 1.668340258843720447e-01 1.559698741875267802e-01 4.787882788798790701e-01 3.289909304800975320e-01 5.913039352590686581e-01 1.364976573199093435e-01 6.730724538237062293e-02 5.051743785329710495e-02 2.885927634399817476e-01 5.050801444810648633e-02 4.566082092554681754e-02
2.654227465244793360e-02 1.474279388629144531e-02 4.961684673509280663e-01 5.296534128519030382e-01 2.076417392445165100e-02 8.947137870351473676e-01 3.874152096622766051e-01 1.600289388395518264e-01 2.327510638654469166e-01 2.971797718570081681e-01 2.787211377340631513e-02 3.378052878499011868e-02 4.522036674046991944e-02 9.021779234872265296e-02 4.744063079448974651e-01 5.801692560347435079e-02 3.484552364717954931e-02 7.410122888162669341e-02 8.244473779479152831e-02 9.556133201533852095e-02 1.189323481228471702e-01 6.022328837507493482e-01 9.720112866812459507e-02 1.691626168432005528e-01 6.900082276365483436e-01 1.669118851329790543e-01 1.120450738656776357e-01 9.988802349091979726e-02 5.925196138214647301e-02 5.183354885890663344e-02
7.997495590032717427e-03 4.925828223461493627e-01 6.397025492054251306e-01 1.227954901868269388e+00 7.215943025202204986e-01 3.274296327423259489e-01 1.566612315006778167e-01 1.111744907053084791e-01 3.476841380910627999e-01 1.050895408462801037e-02 9.238625549801601777e-02 3.545830702451118616e-02 5.467311997277254920e-02 1.060912189419447316e-01 4.583475802469773042e-01 7.706939082572501487e-01 4.575368325511321999e-01 1.997585558440806985e-01 2.846289152988689675e-01 4.861763452382378281e-01 8.531340037415711119e-01 2.015761406766352071e-01 1.052989157852035201e-01 5.097084120186339273e-01 1.165130791713938185e+00 3.604532187806776533e-01 9.430589173990625018e-02 1.380274868962165502e-01 4.853363927607228789e-01 8.284178638314140808e-02
1.125135325886946445e-02 1.598750783349115953e-02 6.288362427540843402e-01 5.096266603156984765e-01 5.101024873301824858e-01 1.909878612088298233e-01 1.250887220190789184e-01 1.305903613796612905e-01 1.456051238329570674e-01 5.773302077623923001e-01 1.723267777284054336e-01 1.847127194820272211e-01 1.558244946041139611e-01 1.763517985304948466e-01 4.791384256514568674e-01 3.198138014880999025e-01 2.030563880657465237e-01 1.140167336632733064e-01 9.682375140755182519e-02 7.269322239635503391e-02 5.834325001254682397e-02 8.565817871138924067e-02 1.323622550724262159e-01 3.170890659697889191e-01 5.422191230785787797e-01 2.436088604715666572e-01 3.567795071071555024e-01 2.453412369698718121e-01 2.538427647339804860e-01 1.678033980833369132e-01
1.228685699939000876e-02 9.774230883169163775e-01 6.142787172397741191e-01 9.254279028233219906e-01 8.381131035290486642e-01 4.587848426197707052e-01 7.139646437764235812e-03 5.920106932511146926e-03 2.006770556397942107e-01 1.455176696309287143e-01 5.568933263852426929e-02 1.383534793803356533e-01 3.671031470563199117e-01 3.731086781640864380e-01 1.094565495757842122e+00 7.825019360642762045e-01 2.280425194896822383e-01 2.466937726598844582e-01 1.093836977739379990e-01 4.815589580740711750e-02 4.689800398473219223e-02 7.359436451639904397e-02 1.126499997249101603e-01 3.446641711048564205e-01 3.479221023310600236e-01 8.181360714384444677e-02 8.990881722309820856e-02 1.154458957684354470e-01 3.766880212604168388e-01 7.723845908864128418e-02
1.640992875883467289e-02 2.322363111998518997e-02 7.037810496421068596e-01 2.632748822355895219e-02 1.836353530487471949e-02 2.585868885667581829e-02 1.688108358736116477e-02 5.049038930556258853e-01 1.994418696921226308e-01 1.157910140232646518e-01 3.560961784950923692e-02 4.888805877768152147e-02 5.530264980478753756e-02 2.046920393596598498e-01 2.450462689843246333e-01 1.022521890936655548e-01 7.903406608257307342e-02 7.838100440088094367e-02 1.038810502068813202e-01 5.985725173911543573e-02 4.253834516896051743e-02 6.351597507677519960e-02 7.258140722982489579e-02 1.214382614004645977e-01 3.783818309879509734e-01 5.940593790395178042e-02 8.587566728813542105e-02 1.407053799540339267e-01 1.701594229330447294e-01 3.385306587152506763e-01
6.014402702349283189e-03 2.523995127934991478e-02 1.082857150063337270e+00 8.521586356147334979e-03 2.151859036201807587e-02 2.255219001832463321e-02 1.786739577848367802e-02 3.533299623643981757e-01 2.726557814626535681e-01 2.545099404060317538e-01 1.049088124449147758e-01 5.436228073666088401e-02 3.507043854016105716e-02 5.595672287834124042e-02 2.559274430954874835e-01 6.610900308699114991e-02 1.712454091160660885e-01 2.807263877655074430e-02 4.859955513459811305e-02 2.293314446940263596e-01 5.936008506155762698e-02 8.321181223887001710e-02 7.259417472152239481e-02 8.004141881217755050e-02 1.062161149483772105e-01 8.126450513667245190e-02 9.549622312434774551e-02 1.177853694786052396e-01 1.590420132704549183e-01 3.914519416738635460e-01
