1.142784693603433530e-02 1.681879762458383942e-02 1.469453866412162406e-02 1.860404705889380159e-02 1.417117193269626547e-02 3.117567876986709202e-02 3.105730265762337433e-02 8.441853088061115895e-02 1.537326301528874062e-01 6.924631533557507046e-02 3.207752726678443633e-02 7.312797067713530316e-03 4.268463925545197026e-03 1.573484558767086414e-02 1.807056699875674716e-02 3.911320186039265838e-03 1.355967028243844179e-02 2.337132299361623089e-02 2.079107160910782792e-02 7.202516458790032827e-03 5.785494513708004487e-03 8.393669576203615073e-04 6.476225728699383771e-04 2.496966377002602516e-03 4.564344315840055191e-03 3.370892861524130146e-03 1.465632151462707960e-03 1.267684942058664192e-04 1.176779762487351093e-04 1.428731865925286857e-04
9.021091456303309553e-03 1.999933392985835112e-02 3.596501582413805936e-02 2.945733221889602904e-02 2.054526692077424110e-02 9.212640715546005499e-02 4.388006063992077460e-02 5.565471185436530327e-02 3.644076730317809265e-02 3.106240262546296899e-02 2.187692285095148292e-02 4.272704555299398910e-03 5.655332608032016123e-03 1.276967463682141674e-02 1.763227061913943614e-02 1.115645642728910203e-02 1.356921678094841037e-02 4.364170377812887081e-02 3.228939840959809543e-02 9.532097437358055814e-03 3.348876659416057111e-03 7.481639940495026907e-04 1.550086561193311004e-03 1.316761399909401227e-03 1.082990884261474411e-03 1.352833759495618423e-03 4.484709725281499923e-04 1.171786817619498004e-04 1.683270289547881009e-04 1.688668175869572209e-04
1.096258068414067421e-01 1.119721401820281542e-01 2.367690702057271834e-01 1.927515992063429939e-01 4.086791649293256556e-01 4.162222495483085261e-02 7.735366624090146345e-03 8.322086182918308345e-03 1.340537480011125826e-01 4.071452245644571755e-02 1.088356732171041896e-01 7.246954655073578611e-02 2.661739742504670714e-02 3.848168409129986561e-02 7.291414678855084527e-03 3.026676216453241114e-02 1.997685830431511142e-02 4.010838576598316912e-02 1.305858561007829932e-01 2.126105925164628249e-02 1.996340052782791252e-03 5.737349982383838868e-04 8.597854177157546272e-04 2.855593594559393059e-04 1.576170529427833823e-04 9.686633603348846031e-05 8.048661806531447888e-05 6.661608327446799671e-05 1.178948123476839189e-04 1.377207449586925281e-04
5.099802645240614912e-02 1.462500285925107668e-01 3.211053105683520648e-01 2.595311535921440149e-01 1.057208898739703251e-01 1.635260737031715705e-02 1.296661503160250091e-02 8.783432846077991393e-03 5.420177167495618918e-03 5.060745889761168737e-02 3.243700343710406025e-02 6.437803256453442091e-02 2.910024928496223601e-02 1.912369515695132652e-02 5.566566836802155568e-03 4.183843699256099662e-03 8.591484620723403159e-03 1.575990880832912194e-02 1.092241289669519146e-02 9.124484162622452377e-03 4.042152013313346330e-03 1.354167938354252894e-03 4.123139991758775422e-04 7.507150438009670829e-04 1.291435850893740515e-04 8.753576148487271090e-05 6.940410102913053831e-05 6.944320751441199115e-05 1.465987575396045402e-04 1.688118403180541478e-04
2.934046560362417802e-02 9.079842091174072927e-02 2.536358646533828920e-01 9.830738099464517155e-02 5.570246876523335389e-02 8.146245926095902964e-03 1.258433345833908507e-02 7.071830537272980749e-03 3.329185328720636779e-03 1.157320642195787258e-01 1.452962303391918675e-01 1.227175887156901624e-01 1.802326233768131170e-02 1.466098337195263258e-02 6.749639885599098381e-03 2.467805436607000986e-03 2.603776067197331387e-02 1.472560850594379495e-02 2.324875972813456038e-02 1.312246550109810728e-02 8.893112438354978944e-03 2.414691216531733575e-03 5.120848670256574961e-03 1.313483200623668341e-03 2.424866102987668004e-04 1.216196054865543568e-04 7.790019829560288866e-05 9.582175472525701143e-05 1.570972009833134105e-04 6.182615004727054281e-04
2.913887936042477284e-02 3.029752387824448737e-02 1.358990723915309284e-01 1.088966353016092709e-01 4.291734424439086482e-02 4.641383831944870426e-03 5.744199623393651984e-03 6.247203058020232500e-03 5.985202835888272892e-03 1.796889240614929495e-01 1.406059332376698445e-01 7.321285756737139216e-02 8.259746662460314137e-03 2.427234424390639286e-03 1.793108105825145376e-03 2.861183895883560695e-03 1.473757798987360493e-02 3.810300686841815165e-03 1.218489104998535591e-02 4.151213721886148206e-02 4.946808772957313194e-02 2.850473219710109030e-02 6.829117710760558915e-03 8.220162146919697804e-04 3.770773472887221619e-04 3.302956360918380373e-04 1.893281246615364925e-04 1.398935113125868721e-04 1.946409705991367545e-04 3.787977207661927140e-04
4.038556002733289726e-03 6.333883941831241690e-03 6.699575768785425225e-03 3.397426685854283701e-02 1.627005932021411208e-02 2.731491010241273928e-02 4.223935168045932914e-02 2.456113725853928051e-02 2.988629598150050262e-02 3.437044248649647610e-02 2.631097054255174955e-02 1.073571122373373314e-02 4.361089898909060319e-03 1.643180100989001394e-03 8.371109589498663050e-04 1.444449500605148691e-03 8.434596112707110072e-03 3.985719161255783446e-03 2.021752556022042915e-02 2.740786943484022423e-02 1.233771074067745513e-02 2.842913750061624653e-03 1.060437065924861285e-03 7.733732963722943785e-04 2.670294243465412575e-04 2.543241566865470918e-04 2.043122091145540197e-04 1.916705099533657351e-04 2.360266085926395201e-04 6.105460600149447336e-04
8.771154947319996509e-03 1.590443103180899653e-02 9.291161973393051096e-03 2.000314815326268217e-02 3.073253970381059283e-02 3.496400270170273161e-02 3.154239812818360189e-02 3.030669159157536180e-02 2.462898912775645516e-02 1.365284127321130317e-02 5.466063617338616162e-03 1.686826717948531826e-02 3.569931896566056785e-03 1.154534070254140858e-03 1.146801114515644607e-03 2.062853763357715489e-03 1.699637003806405908e-02 2.724864339385480241e-02 2.382876139497592388e-02 1.675013317337674390e-02 4.447085085393405815e-03 2.015843944574925890e-03 6.519329094714210572e-04 4.795953042358192409e-04 2.122501251831563035e-04 2.082585616432512860e-04 3.003879210791304431e-04 4.082816212378117117e-04 4.403978690897751677e-04 1.394571202382770747e-03
2.353379670461433482e-02 1.543985840266830917e-02 8.992585177794231582e-03 5.198886780312745454e-02 3.354129514577398885e-02 1.429377540354784953e-02 4.652651364729321060e-02 2.119635922542539158e-02 1.786334926139461141e-02 1.749448437939762208e-02 1.554927033868727312e-02 2.054282030090177208e-02 4.459314837802514503e-02 2.857169583777605104e-02 4.171350350716421067e-03 3.771475717044535554e-03 1.645766289780483532e-02 5.018723581895944558e-02 4.929710528032413275e-02 8.106982612172842356e-03 1.236546623382208309e-03 9.182154455726761980e-04 8.313565297471437214e-04 4.849308669425026570e-04 2.658819944865942414e-04 3.856374935858334816e-04 1.371853760120795868e-03 2.990465635708964079e-03 9.264092808625643688e-03 4.878914956422902502e-03
3.947530703370948774e-02 2.590997063942583611e-02 4.092164685925478440e-02 3.823908275763390763e-02 3.317304931260794953e-02 6.565181028067417976e-03 3.049474459683710476e-02 1.310146881345425687e-02 5.485206776824787939e-03 2.054301784420905531e-03 3.007769381525957075e-02 2.951012331596936100e-02 6.204510088679526802e-02 6.595414393993688507e-02 3.082265825343644475e-02 3.339248365059342000e-02 1.794171575450139722e-01 1.863166635396907855e-01 7.440979257780647171e-02 3.279901954847371653e-02 1.561245150042361949e-03 7.136754441806861422e-04 7.000787434288996327e-04 7.030245975347598547e-04 3.660015901343621346e-04 4.472022964734045339e-04 4.007212460833493341e-03 7.417348288043461302e-03 9.855714543836286562e-03 2.741321211957835520e-03
3.289244203580244524e-02 1.740291106687678196e-02 3.848440205584738316e-02 3.279995143759003445e-02 4.107003673863485194e-02 3.770821767083804184e-03 3.148032384564064881e-03 2.732276873287003971e-03 1.690276302979491210e-03 1.516655066791383621e-02 2.391715663103312073e-01 4.020908218982499616e-01 8.254188959074642007e-01 3.999544906462785820e-01 7.241785741026737777e-02 1.402850502676338262e-01 2.613676314657845112e-01 7.224556133859702522e-02 1.713656186821051891e-02 3.387585928626165796e-03 1.115891081992598840e-03 7.477382022770657187e-04 8.526164338314350197e-04 1.120289733702610393e-03 1.134612898640504361e-03 5.853180488235367211e-04 8.847227945456628828e-04 7.499984529583019269e-04 7.049862501342681184e-04 5.262502019609548208e-04
6.046794690406212536e-03 3.593364082013112814e-03 3.156021037847925315e-02 3.104069507725595867e-02 2.385040004263647498e-02 5.404424425053516376e-03 2.061022763245830280e-03 1.303016077930998617e-03 1.583581693148606575e-03 2.964397837151207249e-02 7.227062565568560804e-02 4.750545140032196301e-01 8.458111286215146407e-01 4.303618076033241535e-01 1.521370521333773040e-01 1.688229247591557791e-01 1.860594653174123536e-01 1.094716694288394299e-01 2.679936100479010652e-02 7.519057793633366488e-03 1.087413937876358355e-03 9.425931614038787938e-04 1.036040466009138404e-03 1.797569941709045542e-03 1.673157216422573642e-03 1.151950008852598668e-03 8.526611502821570534e-04 7.843408971040448201e-04 8.511549738521286207e-04 9.163894058077270326e-04
1.146753127200510680e-03 2.982788553890741105e-03 7.313701081050652877e-03 2.071441232570895088e-02 1.338926257192873774e-02 4.174277894266649122e-03 2.084917214995492696e-03 1.689983572662805134e-03 2.059450851187847632e-03 1.470940375099736783e-02 4.892606864651349516e-03 1.488169616949045482e-01 6.211497103257037633e-01 2.615031827249551521e-01 8.070089450620826499e-02 9.179317932416625192e-02 3.377793429194005104e-02 4.945187177892937380e-02 5.614361171087833835e-02 2.090197963809071330e-02 1.375559990345285536e-03 1.215336271012204018e-03 1.442925686737646417e-03 2.451687316554702293e-03 3.189758956282364930e-03 2.959014418031467343e-03 2.155977938731270128e-03 1.927845735055595030e-03 1.451118794158677778e-03 1.090460793892808608e-03
8.970047260032682108e-04 2.591944792259030621e-03 4.837395660341076500e-03 3.543710457779441353e-03 2.082140439844095726e-03 7.984570684189236378e-03 2.694058673908797386e-02 2.273473289297527761e-02 2.877064108131682785e-03 8.817731738507112544e-04 3.546403242233762618e-03 2.388285741695420072e-02 2.795760454900049763e-01 3.711248079101587272e-01 3.886218318632118640e-01 5.158797498686299443e-01 4.625381450751153700e-01 2.998940482553664189e-01 8.184350129065941504e-01 3.789825415040993795e-01 3.102472890463699520e-02 8.908573757064238915e-03 6.660749816376412315e-03 1.679137424296310924e-02 3.929836816616286144e-02 3.705314831238351592e-02 1.016033964866122769e-01 3.262606692507850903e-02 2.502599726611238074e-03 2.300017595258049136e-03
7.871781184447577224e-04 7.919659491901237958e-04 2.225132549481741683e-03 1.669238651076056928e-02 6.015324638559653783e-03 1.382829694667924662e-03 1.789034267470153428e-02 5.163981688477266296e-02 3.451621186038916073e-02 3.512781593631153325e-03 7.435846998246525667e-03 1.181908440844907926e-01 2.496649924032790790e-01 3.123507199969641768e-01 2.781713118605187440e-01 3.316006671613396795e-01 5.632233624860756294e-01 9.707100736809193275e-01 9.855531667633555815e-01 7.721096907510718310e-01 3.290385176578673743e-02 3.428595300256478962e-02 3.058222473062242874e-02 9.651072509357577767e-02 1.401440584501407183e-01 7.236052482240474815e-01 7.268165766731775612e-01 1.439362313271897453e-01 3.078069872489382075e-03 1.762543663854857032e-03
6.659397620152002293e-04 7.240661937398589973e-04 1.693406490954477324e-03 1.881802702507924790e-03 1.234515764278507934e-03 1.381705582699464850e-03 9.763178088258054471e-03 2.762167960125469501e-02 5.703008564529369467e-02 2.025159939696277722e-02 2.083433737319756104e-02 1.824930066848223092e-02 1.416069505651468829e-01 2.837815964861207796e-01 2.619435301571948482e-01 3.974943783862098234e-01 6.842317461930911282e-01 8.273032083888466337e-01 4.756440644448046151e-01 1.033362089438032705e-01 6.227586019618841506e-02 4.295925753036691219e-01 6.296748668914498026e-01 1.063540894997147657e+00 1.009724562976025863e+00 1.331155748904779834e+00 1.072881806136205096e+00 3.024415537870170367e-01 5.043462962702668743e-03 2.211731739730467619e-03
7.807061561736442640e-04 8.967839293884192608e-04 8.950011273244722326e-04 8.564272481998969327e-04 1.297141479899596543e-03 2.712309174962191857e-03 1.591660469933776079e-01 5.343038389125878140e-01 2.598856319809500492e-01 4.434201112930078598e-02 3.281181897338394937e-02 5.124622655262029564e-02 1.011515362141431618e-01 1.481928418286052596e-01 1.947277365106945268e-01 3.477514114476280560e-01 7.438348311826517012e-01 7.425344615787148328e-01 3.486940320502499580e-01 1.192660094784537828e-01 5.181446728718103190e-01 9.474745893765790239e-01 1.225292211613587590e+00 1.267867432093812141e+00 1.127537576766959981e+00 9.854109009683635900e-01 1.471032035679436190e+00 2.536443033242598011e-01 7.976959642255665797e-03 3.289209525975355687e-03
1.798836798878275002e-03 1.397862438173718596e-03 7.401867035729732015e-04 1.172120857644703106e-03 1.527996327073863000e-02 7.778309930062177191e-02 4.355571435711363959e-01 3.555353091280530897e-01 3.481992804771331662e-01 1.737774198104177770e-01 6.346820247363949008e-02 1.712576072374929342e-02 1.672908534098752412e-02 4.280416688173302453e-02 9.645744870335182242e-02 4.437181825821593373e-01 4.613436866784406121e-01 5.309931289089976358e-01 9.148255858191089995e-02 1.607978265419801600e-01 5.755877535530453670e-01 1.257042620882454553e+00 1.564708767747771123e+00 1.634747238790777768e+00 1.361349101132099504e+00 1.331459491674150453e+00 1.254031329597845579e+00 9.839237822393180899e-01 4.332741905777410391e-02 2.825706075780595739e-02
7.925993941644768337e-04 2.158319492184865903e-03 3.986083209696890568e-03 2.776929882488431839e-02 6.204264179132684687e-02 8.824129129824982709e-02 2.780789710397568726e-01 3.470953680119862605e-01 2.372141760602957949e-01 1.837871011248067843e-01 3.840293337945082514e-02 3.761177239654760109e-03 5.721221957503430135e-03 1.617387143644371389e-02 3.532015476752201066e-02 2.089846881782500554e-01 7.879656176405669399e-02 2.481915541830543442e-02 8.223190211415504908e-03 5.939414146182474263e-02 2.276988514182665402e-01 1.221125489661321506e+00 1.555508483048699375e+00 1.633941405522312262e+00 1.198514455491736852e+00 5.607912638608004707e-01 9.176939718888773578e-01 6.233502439509595039e-01 5.590735963152462795e-02 2.175119863313251800e-02
1.977858604024222700e-02 2.530153970480231856e-02 1.687887427466314844e-02 2.095248618179017600e-02 4.913144857769717599e-02 2.819945918094324266e-02 1.448917155959414671e-01 1.868786010309731460e-01 1.715185995805312558e-01 4.025690190292430248e-02 1.007807566248166559e-02 2.130514418232450427e-03 3.755022799893144130e-03 1.116798546744390830e-02 4.464807695605089999e-02 3.024445662356715914e-02 5.453579534905989706e-02 1.589072358789876682e-02 2.947131079328771386e-02 1.390841890788252211e-01 7.532435221988704743e-01 1.430479069798795244e+00 1.540029424373200007e+00 1.463434028392632813e+00 1.126261915766003208e+00 8.283625352643837481e-01 8.057891339524743124e-01 5.380469641878515841e-01 4.818085154969930367e-02 1.694614679742185298e-02
5.630302788435269379e-02 5.134021064143595020e-02 2.615364244798656229e-02 1.866819713058741337e-02 2.401974979335703281e-02 1.283965331574655339e-02 7.288328909696720204e-02 6.499282455415764104e-02 1.773094451627955231e-02 9.613452295187971050e-03 3.321610993867532557e-03 2.659233588368128953e-03 1.626722717087693846e-03 9.324940263176783629e-04 2.499605907418676019e-03 8.702824034415518675e-03 3.081038170648739416e-02 6.932066114008557378e-02 6.581985879918912652e-02 2.916591371796535270e-01 7.969431382896831062e-01 1.152261537854848417e+00 4.677982524389671104e-01 7.005054366312969405e-01 9.041039442035427864e-01 5.121397413774024798e-01 3.819572349659017263e-01 3.110469038991831026e-01 1.136007997010489087e-02 1.019831251919117894e-02
4.583789332079138412e-02 5.251404660249973932e-02 7.637043031729403436e-03 5.221451350299683575e-03 4.235229754167808142e-03 6.285557961927275457e-03 8.912810257733116276e-03 2.215154122176452543e-03 2.843474294929910270e-03 4.544910624261760544e-04 6.116211158321339415e-04 9.514881670267533306e-04 1.087989104778192126e-03 4.045079131297326346e-03 1.190247257203584479e-02 1.606827458757782434e-01 3.056320766077411100e-01 4.368817767522375495e-01 2.945833081335765824e-01 2.193942417736541306e-01 1.548037536344601950e-01 5.505756824702497110e-02 2.127349084156899411e-02 4.601314819916473009e-02 1.661426028884189221e-01 5.594994467835504720e-02 5.109744304859192843e-02 1.717448582573137886e-02 1.962436128005748490e-03 1.605992370743930878e-03
9.672096232631265111e-02 7.415761854735655745e-02 7.841907812540408612e-03 3.342989127285603268e-03 4.851908054197394231e-03 3.763900693500017106e-03 5.776449394734456400e-03 6.140992813736942044e-04 5.145126261237911161e-04 2.273709292921238432e-04 5.517780051972094721e-04 1.060164990576865918e-03 1.458852024173900794e-03 8.246975822871748310e-03 1.423577388080231321e-02 9.329881498148138996e-02 3.388382783993834635e-01 6.248677241892649503e-01 6.991001244863375153e-01 6.001690830103160179e-01 1.271863610677250178e-01 2.828429346244623263e-02 3.514557496147134585e-02 8.686449890365777193e-02 1.929173237083524062e-01 5.677930956573391114e-02 2.144253507615048390e-02 8.058816882016813649e-03 2.551752026033771940e-03 2.308960294968850652e-03
1.215779580655206582e-01 1.544748254058433447e-02 4.147410317452074856e-03 1.342677640462030652e-03 1.509794106183837614e-03 3.288478821811359476e-03 4.200075003763905149e-03 4.654930913770542896e-04 2.535927023301994985e-04 2.974143164553813448e-04 5.361419613585189032e-04 9.269337306720127050e-04 1.084273838204073172e-03 6.324612058095017801e-03 2.594781908402435389e-02 1.311760021198920267e-01 2.525220267954932929e-01 5.759880032837860764e-01 7.184576848917045844e-01 6.055919368465526587e-01 3.032859425230605144e-01 1.752782645000101197e-02 1.253573814753855889e-02 2.741657431505235831e-02 1.579552038470721231e-01 9.542217905335620420e-02 8.529330888541721001e-02 1.598413144944260678e-02 2.295698560676386925e-03 1.740048746489476252e-03
6.772068839252877448e-02 2.090908682204946356e-02 7.894223374708318752e-03 7.245008700327688032e-03 1.595658583587333465e-02 1.083400252083485497e-02 4.437715559130776463e-03 1.796639561799569587e-03 2.673049172839173787e-03 3.509774923025662206e-03 3.302258874437748962e-04 3.744205429123083004e-04 6.036134363461971531e-04 1.449062797651584199e-03 9.283556658780006340e-03 3.973585076082447598e-02 3.987391654543718383e-02 1.691571960777545069e-01 2.155900544252368767e-01 1.861433355430867909e-01 1.585513975664912256e-01 2.072029524711872100e-02 3.238769098039943634e-03 6.416528381966353847e-03 2.848014825549800844e-02 7.198651685940413159e-02 1.929537263031949057e-01 1.085572634672044706e-01 2.671759171112960719e-03 1.969371719341588174e-03
2.424790710629936424e-02 9.597940751851172583e-03 9.996435023563177147e-03 1.657201121503518171e-02 8.969429574167762931e-03 3.985381955471588647e-03 1.810977433223160326e-03 1.258050721566589605e-03 3.969556003548164319e-03 1.546780750410511884e-02 1.061088933468890688e-03 3.670613797995018134e-04 6.437693369958381179e-04 1.495771506203980115e-03 7.507921498924472782e-03 1.410529169568910425e-02 9.685146086656397715e-03 4.790983829242360936e-03 7.544553631789709808e-03 1.388422573730875922e-02 2.529890927213323051e-02 5.925125985097113093e-03 3.142813138918728894e-03 1.636536594456314275e-02 4.015963767872936241e-02 1.444376606376715499e-02 5.006756953115845676e-02 5.635681867545917767e-02 1.988458791830780698e-02 2.983482519904021284e-03
2.458035980557664313e-02 1.966908952521800868e-02 9.353876879711699871e-03 6.726311713546709141e-03 6.193593828602350637e-03 2.304028960564804412e-03 1.508870562700019438e-03 1.531780251631731241e-03 1.686495747948550845e-03 6.769367781436570926e-03 1.927436084767541764e-03 1.838816660708896943e-03 1.804879809975771902e-03 2.401559991263423066e-03 7.380364267954389081e-03 5.447650998746579425e-03 3.811004643243669915e-03 2.354764745915822674e-03 2.135922250991174626e-03 1.688630546055775242e-03 1.398064301738632205e-03 2.126770168206682573e-03 3.532371021539423752e-03 9.220394845516000776e-03 1.666039870986667573e-02 8.183542647076151588e-03 1.324763465876533861e-02 8.952579766780491971e-03 9.072150381519939952e-03 5.806864351769508610e-03
3.339549379445293925e-02 1.734983599279595057e-02 9.616146958872045028e-03 1.287328792057688270e-02 1.120922240571922690e-02 6.043549016795061492e-03 2.046216423502106654e-02 1.535358736882752942e-02 2.259241558574793998e-03 1.648601434204890982e-03 5.936012801915279899e-04 1.371158336216846173e-03 4.239856192815760066e-03 5.036601238283191714e-03 1.662166821056809338e-02 1.323791304134700961e-02 4.346737259971743608e-03 5.349859119568417011e-03 2.553115955334629011e-03 1.136268702792689669e-03 1.057716223163917028e-03 1.656035478448509473e-03 2.642431301658707335e-03 8.872112816840006799e-03 9.704661677738002715e-03 2.459195957532838567e-03 2.837514365534006891e-03 3.751285403258666513e-03 1.245869919314482321e-02 2.582683185475473202e-03
4.486577601747897270e-02 3.870466561605036271e-02 1.145886194843478631e-02 3.840554523670425963e-02 4.428702276206202687e-02 8.313643549376277531e-02 5.539292762358873773e-02 6.235948428187114943e-03 2.238542665274298807e-03 1.303770066430370638e-03 3.881000227414744489e-04 4.873623074968187795e-04 6.365010362366498942e-04 2.772438632871411426e-03 3.744649971124872426e-03 1.809249182919178255e-03 1.847114894744956255e-03 2.365650784266300731e-03 3.345597661903705958e-03 1.803338390694894438e-03 9.689409406090793977e-04 1.323073777483893369e-03 1.491259157668526226e-03 2.800372197933885185e-03 9.779221082456797734e-03 1.689671955667275145e-03 2.600183235927661356e-03 4.459818611991878991e-03 5.596989572000711684e-03 1.128293829139965718e-02
2.421351023227806543e-02 6.017241287051829091e-02 1.765027913354082906e-02 1.866222524905783442e-02 8.999892256860986262e-02 9.508102515580298120e-02 6.317963933287470968e-02 4.330356063182195202e-03 3.057273401992745623e-03 2.935604252814621312e-03 1.222849903574538570e-03 6.130282891622861833e-04 4.135485375937916048e-04 7.868350300738646743e-04 4.083064495970236199e-03 1.284377585144909914e-03 4.865016528461652695e-03 3.151458448885040287e-02 5.828468677695394784e-02 8.056636899642082017e-03 1.543769535376601516e-03 1.958739464285378078e-03 1.663638479438267568e-03 2.025001191485856049e-03 2.980954911264055169e-03 2.512108884458413936e-03 3.150552073989835132e-03 4.017629855387612296e-03 5.628402199968142103e-03 1.400073748580456419e-02
