2.008637131948886712e+00 7.236954325518747677e-03 6.333532947449075148e-03 8.041815188729838082e-03 2.481506861624472648e+00 1.332272803714519040e-02 1.307947859977019733e-02 3.505643342730199730e-02 6.329851454930472687e-02 2.844571299051815161e-02 1.325163019527517312e-02 1.290119054148858302e+00 7.634391740368822177e-01 6.368062369711909379e-03 7.258685168292347903e-03 7.844606191654398542e-01 5.395215541466023140e-03 9.216078311229685197e-03 8.156199074789167308e-03 2.805504004097000414e-03 1.453805641345356170e+00 2.105719770117494838e-01 1.631400833793099636e-01 6.490183358651639978e-01 1.257329393701009490e+00 9.865939985969541803e-01 4.569671709415402128e-01 4.057437443310499270e-02 3.869309818083592478e-02 4.858130492424043989e-02
1.550578963124369158e+00 8.561676523433389349e-03 1.547341381907414888e-02 1.258687460907231999e-02 8.768509774563809644e-03 3.917799807244576327e-02 1.853150954140484613e-02 2.285246794820994243e-02 1.475070011854840574e-02 1.248946326078016408e-02 8.882666676318189819e-03 7.649323603003712613e-01 1.030633055966098999e+00 5.078768772777202470e-03 6.934391075172265800e-03 4.379084532080348632e-03 5.286474674975536608e-03 1.679084311587199924e-02 1.233277945534758807e-02 3.616504214033802386e-03 8.782649054848208348e-01 1.971282380433026504e-01 4.136618848199827836e-01 3.667261320976767935e-01 3.235057949268232425e-01 4.342699083094719859e-01 1.548807000565677883e-01 4.028726724650009972e-02 5.762041053360255488e-02 5.796237562764620932e-02
4.850836800994910714e-02 4.774234768941916507e-02 1.010908036112711517e-01 8.155358823833108728e-02 1.744331265088324701e-01 1.774298515492235204e-02 1.347377887046524947e+00 1.433614626543525894e+00 5.535240351915401286e-02 1.673376771115001049e-02 4.472344431642077955e-02 2.933381293797639525e-02 1.059947203348618125e-02 1.530639987917582073e-02 1.459140088206911434e+00 1.184217290962913741e-02 7.719484689032925749e-03 1.531009180182023831e-02 4.936554678563290222e-02 7.964067872332152714e-03 5.510338256418161329e-01 1.602049187451134449e-01 2.448158233860519561e-01 8.610223362261906765e-02 5.179303043618496694e-02 3.469122118074579458e-02 3.122823227640482771e-02 2.481426560200956574e-02 4.228498457403126465e-02 4.800574503773449853e-02
2.242597061542334069e-02 6.192062136148883400e-02 1.360952516530714029e-01 1.090664220510756122e-01 4.522792677856667110e-02 6.992115308792812636e-03 2.292637709183975137e+00 1.534158084808955325e+00 9.288992405042658662e-01 2.072375434408637099e-02 1.324153624882440025e-02 2.618164919518668754e-02 1.168647007815083218e-02 7.680269242822871170e-03 1.085462358974543351e+00 8.443613079473811789e-01 1.818160443719390118e+00 6.005443043281245841e-03 4.149678565212691281e-03 3.441078901584547663e-03 1.069546706363073252e+00 3.685685119022205081e-01 1.156088065106159052e-01 2.241803152284588818e-01 4.207459464186501241e-02 3.122189933773257889e-02 2.692129220324362276e-02 2.557419919969108890e-02 5.119542224965437094e-02 5.657856527838706767e-02
1.293656963683651601e-02 3.868821569212212846e-02 1.077252864718831193e-01 4.172225755671953723e-02 2.410624091943539340e-02 1.464774046806626373e+00 2.239550945391074244e+00 1.244036801944649273e+00 5.691505256877499308e-01 4.783290370155088289e-02 5.966995087995615593e-02 5.105540037196440450e-02 7.453448514417557701e-03 6.029045993399351731e-03 1.290473819556300139e+00 4.871886056055318992e-01 1.016877979380653198e-02 5.699956272823450409e-03 8.998205571123761570e-03 5.019868070615237862e-03 3.348359504952807403e-03 6.179382371244681593e-01 1.377013124527334043e+00 3.779566527235852513e-01 7.583387990159738690e-02 4.147912022377683861e-02 2.885942041232706159e-02 3.362739596980521967e-02 5.201510906576835291e-02 1.953251868820811699e-01
1.286644195951575607e-02 1.304657750358141285e-02 5.838086595391052402e-02 4.666282268229937635e-02 1.854943830421325324e-02 8.477852608471111440e-01 1.022104873677716519e+00 1.085787490484342754e+00 9.955555245417107013e-01 7.403976777062255821e-02 5.819878492299813966e-02 3.090845269739055101e-02 1.395473070089020773e+00 4.315560814928383060e-01 3.333297573617381437e-01 5.517664077679400592e-01 5.770651498191779402e-03 7.790431989244688271e-01 4.738864502143356160e-03 1.599293529975109526e-02 1.884543260696433173e-02 1.075804851759431385e-02 2.553404373697581563e-03 2.288646100478308187e-01 1.137292862276520766e-01 1.083594714362527411e-01 6.730053729710794297e-02 4.687157939428603787e-02 6.115470468908015128e-02 1.129516513733016814e-01
7.331024345865932990e-01 1.186888647410450748e+00 1.254446244580165404e+00 1.467129859966712427e-02 7.021097435204979274e-03 1.166992352274635533e-02 1.775385945370193397e-02 1.015415908821301096e-02 1.207237291248582436e-02 1.424708900315605972e-02 1.107477746346243082e-02 1.749428690637604866e+00 7.213086655175163786e-01 2.858074066087531451e-01 1.524322261642531151e-01 2.745080997381622590e-01 1.639156708473332724e+00 7.860880838661448156e-01 7.921244093478158402e-03 1.066403008390386445e-02 4.747542545574122766e-03 6.646962687242827794e-01 2.663027225154748212e-01 2.086683277568996964e-01 7.776683343783116764e-02 8.041462935046420069e-02 6.992577240832123509e-02 6.154111442676644256e-02 7.097894149248601403e-02 1.735479484334967182e-01
1.519429562325219418e+00 7.019439337483784555e-03 1.668801633323587108e+00 8.789470091038193225e-03 1.339622561889094142e-02 1.499214208770771606e-02 1.326172320069706791e-02 1.247989447962806128e-02 1.000370266295836849e-02 2.297715427154957801e+00 9.131204039783039628e-01 7.212602263192812412e-03 5.935750392740315462e-01 1.992707943045615715e-01 2.058459625758064238e-01 3.834390430029886998e-01 6.957272985784957592e-03 1.102447084543958788e-02 9.598716011396047493e-03 6.724270136612380336e-03 9.653331888009781814e-01 4.645644963369094937e-01 1.592309085773138677e-01 1.245167513595702435e-01 5.881273971370094139e-02 6.194468104154484539e-02 9.546197292479813301e-02 1.222557737360780855e-01 1.243133361140599802e-01 3.748602671145075949e-01
1.030453558928935698e-02 6.711581880815099127e-03 1.505823829545360759e+00 2.262704863851517506e-02 1.459193653064817624e-02 2.453050887100614474e+00 1.965611803188920675e-02 8.743906850076088588e-03 7.278012994708095776e-03 7.271501427976687602e-03 6.551419332250747914e-03 8.705470916651296409e-03 1.896346496466162421e-02 1.222570969554220149e-02 7.425823663694577359e-01 6.828533590977579060e-01 6.871650135414738431e-03 2.060649850047185927e-02 2.009418831145707435e-02 1.621879273422853540e+00 2.621752953415105170e-01 2.058788607742977894e-01 1.967413269356063366e-01 1.211256241639470932e-01 7.020120194263121394e-02 1.080931807575346293e-01 4.058183608716756652e-01 8.351875154421296577e-01 3.537358648858221488e-03 1.248307455570980995e+00
1.709586086161867663e-02 1.111390821143275892e-02 1.781215364260169826e-02 1.653922523657084392e-02 1.439819848424499921e-02 1.115810226864448751e+00 1.293855509729569669e-02 2.252358056107140794e+00 9.562731181648566059e-01 3.554762644088685919e-01 1.246676492177340584e-02 1.218211078175502823e-02 2.583429382665006907e-02 2.798261082347879361e-02 1.334422855527789449e-02 1.451497314611293991e-02 7.665899961506622562e-02 7.831460963103767381e-02 3.103505304103981385e-02 1.358518375039749482e-02 3.249535928499909243e-01 1.560845245666521164e-01 1.609360071916386414e-01 1.690542826252632302e-01 9.225835459680212236e-02 1.188104209736211003e-01 1.118438372402640102e+00 2.831731891770534679e-03 3.824434344873622101e-03 6.729377906113510610e-01
1.416435639868137558e-02 7.385492068299496712e-03 1.656597593962909343e-02 1.407887701551626021e-02 1.778487274537035936e-02 6.420901333717222714e-01 5.452209236442597806e-01 4.791751615394092001e-01 3.032711011173173654e-01 6.244627404037471873e-03 9.832423248179079922e-02 1.639492437581588358e-01 3.402527653082116910e-01 1.695096288387564765e-01 3.156855965818954751e-02 6.182569188377113473e-02 1.135631068865141230e-01 3.107202224670919596e-02 7.342326420610111558e-03 6.518893059415826752e-01 2.243981162202903501e-01 1.569924500498683095e-01 1.867648398174746593e-01 2.540196145669363914e-01 2.668273660154764082e-01 1.437449653798597571e-01 2.269627440033254451e-01 1.854698738559026061e-01 1.692591792438070675e-01 1.234634476614823173e-01
9.662348427631737291e-01 5.682976401890518225e-01 1.345189401237380060e-02 1.318352267028490357e-02 1.023965385741909366e-02 9.261295391308603797e-01 3.635283583321455847e-01 2.352368605513898425e-01 2.930515482477874523e-01 1.213448764481921301e-02 2.953812906331652888e-02 1.929058703329787905e-01 3.478391375963836296e-01 1.829524675791369681e-01 6.712990671005061860e-02 7.633670089742217169e-02 8.401546500618822799e-02 4.947684497942902992e-02 1.215749960720794928e-02 1.414826625849029629e+00 2.101186794159947135e-01 1.868626132761085079e-01 2.114484095806807851e-01 3.742886659999952181e-01 3.554707434036396552e-01 2.518122805770001138e-01 1.920335447403027085e-01 1.754785515166415455e-01 1.888572861704034267e-01 2.031761937216524094e-01
1.861765190960868455e-01 4.808046149770657252e-01 1.182587521914858719e+00 8.771466917220038101e-03 2.232758981148041943e+00 7.145467796611028044e-01 3.681843116796362225e-01 3.096020709601452481e-01 3.924705183242016004e-01 6.020419047338928728e-03 9.284248158905037407e-01 6.129789143955578778e-02 2.589659994322817127e-01 1.122961444753831639e-01 3.587726684215141598e-02 4.200598804839915379e-02 1.557950853475492670e-02 2.294179981772392560e-02 2.622090467533781666e-02 9.810364755975971296e-03 2.547874206517731221e-01 2.288520154845470334e-01 2.758634045474942509e-01 4.727055756857973523e-01 6.187166209128049932e-01 5.809323865261378783e-01 4.297923707951483152e-01 3.912728363261247511e-01 2.978343037022917472e-01 2.295743462863844009e-01
1.475001021340140439e-01 4.247833625869941176e-01 7.838387526286277884e-01 5.763459024954767917e-01 3.435221574613173123e-01 1.367525228925889014e+00 1.100625239588758422e-02 9.063167918957854702e-03 5.642717060220359127e-01 1.745357916899327178e-01 7.023330684517871125e-01 9.874304790364387199e-03 1.172932287464961004e-01 1.611569534900793021e-01 1.749992914135253819e-01 2.399572750283379130e-01 2.181735617989601916e-01 1.425199909247858443e-01 3.915914099275911164e-01 1.837781669692993836e-01 1.519536120259551773e-02 1.603855811282278498e+00 1.208489257436480502e+00 8.181743698722409794e-03 1.896624297720061678e-02 1.763130211459790556e-02 4.781460367064065825e-02 1.525825505483131145e-02 4.839861168413726600e-01 4.669859833568727470e-01
1.343277046068206693e-01 1.353449283369987100e-01 3.773311966263574457e-01 6.963499587974242809e-03 1.037729070559841205e+00 2.451935437882141189e-01 7.303665131944248046e-03 2.071098504066224560e-02 1.373849490069698961e-02 7.001961562639826830e-01 1.507822412751202545e+00 4.869831648636800681e-02 1.036939082379141619e-01 1.333719838682605185e-01 1.223289485351493761e-01 1.500364080031315328e-01 2.597460259152556961e-01 4.550261473966465964e-01 4.707288349519390125e-01 3.775451558165228150e-01 1.624611230247939922e-02 1.703924383139192658e-02 1.502011964985953615e-02 4.716832143801230615e-02 6.764153083031898550e-02 3.442420191530970452e-01 3.424363911015157469e-01 6.779961014533650299e-02 5.646421095961728920e-01 3.386262719645424246e-01
1.193289118610196820e-01 1.306378181773460712e-01 3.025358662278017641e-01 3.367743627513328786e-01 2.240354618611982984e-01 2.560546569521696680e-01 1.821040106696947047e+00 1.111506571323675127e-02 2.290546545782513183e-02 8.248531880573676395e-03 8.540215036561825054e-03 7.391887512974325974e-03 5.760843394500755887e-02 1.186426386512327985e-01 1.126236776422853830e-01 1.750209357158270251e-01 3.081284904558710402e-01 3.823223973883412286e-01 2.267307432560176916e-01 5.068812965732688580e-02 3.061153512973539825e-02 2.106721444875429006e-01 3.054464649092942241e-01 5.139334397334660576e-01 4.824248443251236140e-01 6.258544595412744993e-01 5.009132950018493347e-01 1.419124488104364645e-01 8.877495755342743600e-01 4.013586795770990312e-01
1.469029452712336814e-01 1.710480289918146213e-01 1.706743839767996540e-01 1.637987313462435923e-01 2.508981754963160449e-01 5.240965759451126083e-01 6.456419219915128516e-02 2.155067657860912089e-01 1.052204238273103110e-01 1.802158457339914088e-02 1.333162599893843517e-02 2.050929212854155428e-02 4.056693650093216169e-02 6.076265458302626543e-02 8.130205049275797402e-02 1.475749313396902684e-01 3.256699463322010879e-01 3.395761293353225518e-01 1.667348896296818317e-01 5.879145147371390295e-02 2.533420792637733343e-01 4.574770209615727223e-01 5.847404672875703424e-01 6.036038090933675271e-01 5.332389881562782374e-01 4.602437054835557539e-01 6.789132633250383186e-01 1.180046107842016856e-01 1.322069789795540684e+00 5.634338107644225602e-01
3.564319116797712850e-01 2.819637673995339933e-01 1.488205745496364862e-01 2.359406134345353179e-01 6.160612398923226256e-03 3.102071528040588680e-02 1.735647027961646494e-01 1.414886146166017267e-01 1.394392627226951897e-01 6.987703163852945765e-02 2.546091409968292973e-02 6.747331701969400651e-03 6.597891361071436464e-03 1.725347510928550848e-02 3.927490638390096489e-02 1.824944503039769572e-01 1.981052394591820143e-01 2.414878689985539284e-01 4.373406590877750716e-02 7.928539660485904583e-02 2.804533678202154601e-01 6.043448322562701147e-01 7.448574747048151146e-01 7.781031714936916810e-01 6.463284258092603096e-01 6.208796503072796513e-01 5.735198325984867118e-01 4.546274257077952408e-01 2.016918285208495892e-02 1.329168830728704939e-02
1.604347069376989565e-01 4.470659695852625126e-01 8.400232446343900428e-01 1.139230425078841327e-02 2.466468319129313386e-02 3.461805280204869467e-02 1.092758932148137352e-01 1.358147803135927312e-01 9.317347778256705737e-02 7.258980396892665554e-02 1.521787645735368094e-02 9.147141236031299805e-01 1.380209658955343865e+00 6.486218253345278975e-03 1.425031736839389544e-02 8.506372842306803017e-02 3.352323465258564422e-02 1.116204438778064904e-02 1.521283416450115000e+00 2.869516558221580152e-02 1.087111845420396794e-01 5.770553874860944177e-01 7.301514208579569232e-01 7.717673448344604115e-01 5.686294862499835512e-01 2.638481487740963471e-01 4.257546407085061602e-01 2.922046618333768997e-01 2.634638340219745689e-02 1.039925972011229889e-02
8.427461568138148312e-03 1.059143243885393715e-02 6.936284376815005440e-03 8.396751264573992096e-03 1.928212486577799561e-02 1.093224235422560892e-02 5.604840721032238599e-02 7.173871587885333190e-02 6.596272771032864191e-02 1.563602479984811666e-02 3.943741665973977094e-03 5.452444996065110017e-01 9.395221944225574662e-01 4.447532514744407389e-03 1.791904529920786832e-02 1.222607317937174018e-02 2.302550935138904242e-02 7.035733119137826952e-03 1.357963838062500005e-02 6.525295326585725530e-02 3.503069475142090994e-01 6.638370883192989957e-01 7.149477269076238706e-01 6.882291432957272637e-01 5.345972492114818841e-01 3.943456410743898521e-01 3.828660245175799504e-01 2.579473981498054957e-01 2.322227233742414285e-02 2.683375473528937238e+00
2.337874649513210779e-02 2.085662381351833031e-02 1.051416506144997424e-02 7.376651016431136527e-03 9.320356445005298363e-03 4.913226869574591725e-03 2.767747528196420198e-02 2.434715581023730313e-02 6.632787712489490381e-03 3.662496825590233658e-03 9.143437091891428725e-01 7.195320637227530236e-01 4.240780956235766785e-01 2.304947028282297306e-01 5.869612208505519124e-01 1.937932429885556473e+00 1.253977401494011171e-02 2.939079069614038142e-02 2.900880013603336985e-02 1.316146884017960206e-01 3.605807533068530191e-01 5.262494998078501851e-01 2.158826775676996323e-01 3.293756494151780512e-01 4.317987382267486351e-01 2.473976312359837948e-01 1.859455624799127016e-01 1.527126221620968005e-01 1.752931649244156009e+00 1.599024071813159420e+00
1.868142224771783544e-02 2.094775263347880070e-02 1.838997309129283497e+00 1.357145982051056965e+00 1.192418653570575637e+00 2.398549747414877205e-03 3.368772197930522145e-03 6.651454522967603644e-01 8.687059024642980187e-01 1.349636941510090893e-01 1.756676948573555608e-01 2.654863943092606871e-01 2.917933408739394885e-01 1.030827947564904257e+00 4.664811794359260272e-03 6.252505008326815494e-02 1.218776756262052868e-01 1.803386983920464426e-01 1.258030881838562709e-01 9.651254591344807232e-02 6.911168948979537485e-02 2.503305253745506664e-02 9.785285849497036420e-03 2.146216953153775100e-02 7.917480275587780725e-02 2.722934726014336615e-02 2.544128921685773551e-02 2.627205777594060265e+00 3.014229159307901806e-01 2.465784374563996240e-01
3.902612508800164248e-02 2.937969578554145561e-02 3.140754884683445800e-03 8.744568294405992148e-01 1.365652924861749273e+00 1.091187056149252044e+00 2.206792578150389497e-03 1.838998301532679402e-01 1.557791308802916330e-01 6.707000170583192478e-02 1.582117838397207044e-01 2.977419956970002168e-01 3.942420686417446585e-01 3.227597680428975768e-03 5.578843967265158590e-03 3.650536177274874006e-02 1.353949623911693823e-01 2.574531436724709632e-01 2.974808463227439081e-01 2.641024648861610702e-01 5.738639148920966770e-02 1.303844637512140137e-02 1.637590132132449999e-02 4.053496560735690701e-02 9.144421310171144124e-02 2.731278902045957899e-02 3.184647917852561072e+00 1.234243308809473305e+00 3.893812011633414616e-01 3.495734542771425923e-01
4.781326130603429786e-02 5.970808221263685517e-03 1.013322563362122342e+00 3.508890437943988361e-01 4.227183561666871814e-01 9.444176531640533501e-01 1.228079753030124621e+00 1.384447855513660508e-01 7.660761020459450066e-02 8.801968763223383396e-02 1.550730332008959378e-01 2.634846835469696891e-01 2.971469838922567441e-01 1.635698720807312156e+00 1.027463874522856202e-02 5.228454742779519576e-02 1.026184052166903005e-01 2.400490293873663306e-01 3.065008660353120140e-01 2.651926318034932284e-01 1.360391201194882382e-01 8.026916465533929373e-03 2.127620838721881125e+00 1.264720141915192525e-02 7.333405855519845029e-02 4.424141001636493209e-02 4.021619208309041432e-02 2.251076351040713242e+00 3.450216522981166545e-01 2.650477913681376640e-01
2.604371574534336542e-02 7.944038054909622476e-03 3.111125907471687380e-03 2.893196896858291414e-03 6.353510572132218051e-03 4.252074588679603112e-03 1.303779563548739917e+00 5.373684310278944443e-01 8.070273335150126570e-01 1.043758933876866246e+00 9.658314203470301507e-02 1.082511544946475890e-01 1.682754914036132254e-01 3.798098172219200874e-01 3.689003770782471429e-03 1.599739735753717348e-02 1.643012939204463799e-02 7.147277495191178831e-02 9.305189726960569341e-02 8.191096455840497781e-02 7.115023282505120172e-02 9.454098289876162325e-03 5.494752951567685173e-01 1.042220656903090958e+00 1.293448947026697160e-02 3.236547917775142724e-02 8.735689895909093394e-02 4.951330991529442893e-02 4.063304559164365726e-01 3.067246210525399475e-01
9.294676686955886252e-03 3.635151820858102071e-03 3.917275005837111621e-03 6.605732488846569571e-03 3.570936104648073876e-03 1.151113499833538389e+00 5.333256948955327204e-01 3.771955415125560762e-01 1.197375956142862519e+00 5.777690267270627761e-03 3.107989450475833193e-01 1.065228208461140580e-01 1.797034293268419958e-01 3.930554487202579383e-01 1.856335382169530313e+00 5.710148343759661321e-03 4.037080038524531837e-03 1.066875835337047551e+00 1.640855104477705328e+00 6.177864333813143718e-03 1.139361349714218888e-02 1.099259550107567263e+00 5.502869833549546286e-01 2.781047018607076371e+00 1.808588882706884532e-02 2.243790048921151747e+00 2.238061818250497437e-02 2.526209412907891305e-02 9.021773117150884772e-03 4.689404474968723591e-01
9.421573417951108545e-03 7.458403936345548574e-03 3.666016475343209478e-03 1.772379166777300785e+00 1.748288725803099464e+00 6.693113823195356860e-01 4.454511349892472660e-01 4.593932749173476049e-01 5.085816271839002090e-01 2.529940458003841937e-03 5.639341156308608216e-01 5.318894343841107375e-01 5.008894501924084919e-01 6.225860225163006856e-01 1.799050762639014200e+00 1.257500600945793856e+00 8.598559646398886702e-01 5.200277216009885350e-01 4.618719008799540005e-01 3.553176893704248496e-01 2.815791875409427991e-01 4.096810617916750719e-01 6.492399161728557022e-01 1.621025004702065786e+00 2.845726024493781647e+00 1.362987289476893515e+00 2.177785372332286418e+00 1.398363930694731083e+00 1.405130940167005349e+00 9.056399221511800546e-01
1.276162913783149104e-02 6.567360402540950610e-03 3.768290796521535022e-03 5.158911443114783113e-03 4.485092739605098071e-03 1.752432304458712231e+00 7.931897437370098725e-03 5.826227603039385583e-03 6.844839537873999014e-01 4.926028381818581270e-01 1.741580985831328587e-01 3.966717060514968196e-01 1.175339286392529381e+00 1.304332432410544751e+00 6.543538462928672611e-03 5.299203359603481267e-03 9.817069309515227271e-01 1.180937115670080972e+00 5.520780146712973568e-01 2.412343577600055688e-01 2.186619025980187092e-01 3.330982631522917958e-01 5.169573993331433304e-01 1.641589322534201756e+00 1.717523765990950579e+00 4.177588271896112149e-01 4.698116741174972466e-01 5.959177797200991833e-01 1.900401587968163719e+00 3.961169901373898239e-01
1.716202910285219430e-02 1.465691424420352378e-02 4.480066099102653597e-03 1.534968439995217961e-02 1.760980477862904986e-02 3.250478727468436579e-02 2.134197241807846840e-02 1.862985042203161079e+00 6.764155603805661610e-01 3.876795982283119946e-01 1.135048238529903775e-01 1.406711979050170314e-01 1.761476706454830898e-01 7.141304156745407195e-01 9.083211263550148296e-01 4.154701788855821309e-01 4.129372189147838546e-01 5.017859493337712973e-01 6.893670452566351692e-01 3.779211351640427985e-01 2.050184581321091715e-01 2.776384880346192685e-01 3.110780865831153097e-01 5.450477126689912133e-01 1.781832780241354275e+00 2.893604750333960141e-01 4.268080488653301918e-01 6.965268586468987833e-01 8.173801496018000545e-01 1.666236812653483668e+00
9.515877427415287901e-03 2.333234972158833992e-02 6.981659251885879644e-03 7.449642872736399017e-03 3.556933677343677297e-02 3.698961280142064323e-02 2.431084633646813514e-02 1.302619653840362712e+00 9.286610023598731445e-01 8.690437376819594162e-01 3.536874814989713345e-01 1.736797759870612468e-01 1.121450398834629575e-01 2.004014921767519608e-01 9.817336164686435440e-01 2.926749108425432122e-01 1.061653412058682910e+00 1.350896594987550069e-02 2.568610438619816153e-02 1.577192615963140199e+00 3.081167415974980228e-01 3.888020028826589813e-01 3.297914849323748121e-01 3.774856546827902726e-01 5.224542034888458586e-01 4.138201464322498468e-01 4.971405081163526862e-01 6.145070626166351246e-01 8.029185754171923595e-01 2.019371325333273681e+00
