9.181296253724635301e-03 1.351274428663173932e-02 1.181672338815272991e-02 1.497184590327514490e-02 1.140858970331403051e-02 2.506490807711971372e-02 2.489947808833069612e-02 6.749032122293749381e-02 1.225820570169825624e-01 5.562628041781220167e-02 2.600471125105919407e-02 5.989410920380934360e-03 3.535146094525424675e-03 1.316654316967347770e-02 1.527148219319506353e-02 3.336846750870943630e-03 1.159831660188000678e-02 2.000622277451821057e-02 1.782260759039751979e-02 6.177648256542116537e-03 5.482836610207972305e-03 6.305808426438662406e-02 4.924305202005236498e-02 2.259620950771722148e-03 3.855875487374286689e-03 2.979713511153457388e-03 1.377891842574939085e-03 1.200519043613368364e-02 1.165094852491034387e-02 1.463272896185849846e-02
7.271345175750924469e-03 1.614532709306257599e-02 2.903387689577423617e-02 2.377348807046072293e-02 1.657824676589404397e-02 7.420279533528935378e-02 3.522446525275271800e-02 4.450038146354075297e-02 2.903132909316150090e-02 2.480350837894764252e-02 1.755057301554372590e-02 3.447807107346851675e-03 4.606644681641685821e-03 1.055334038493371471e-02 1.478037249961039988e-02 9.485946723504262018e-03 1.158516268457982293e-02 3.732349482520674888e-02 2.769212365299938972e-02 8.192434926559933120e-03 3.255468889021547428e-03 6.003595606436126775e-02 1.845328189563573201e-03 1.355492687521313994e-03 9.706725274870646675e-04 1.258648612202518512e-03 4.559172899261091511e-02 1.210123270217011021e-02 1.756721096600348531e-02 1.755453728176415915e-02
8.873584818691351850e-02 9.076129069264704530e-02 1.918922726144342561e-01 1.561751372282279560e-01 3.311788007581574211e-01 3.368939211200772110e-02 6.246872656461430022e-03 6.700359599877065905e-03 1.076165257570752681e-01 3.251498966233853927e-02 8.670700607598953724e-02 5.774276199099022400e-02 2.135202851685144912e-02 3.143088822200854754e-02 6.064883261244827933e-03 2.565040696843746970e-02 1.702351842925326625e-02 3.427347121576723721e-02 1.120738156361419935e-01 1.831551454724824474e-02 1.851352988982603830e-03 4.919259396555371311e-02 7.788021657585159074e-02 2.715496305774511149e-02 1.599968322131604601e-02 1.056997835712531440e-02 9.469289517113788079e-03 7.593383774069191114e-03 1.296440351950939492e-02 1.453731482471286307e-02
4.131746663729485985e-02 1.186667088435313933e-01 2.605161923849383943e-01 2.105230020197059460e-01 8.579461765201983059e-02 1.324836728223990380e-02 1.046985769888460899e-02 7.061179117270845705e-03 4.337929861713696843e-03 4.039032090180302847e-02 2.584697433855850587e-02 5.130619078801024191e-02 2.331263872967217349e-02 1.552118306239838770e-02 4.575271778304299160e-03 3.481200056149893595e-03 7.199572220699739303e-03 1.329289293711641458e-02 9.282336725301893604e-03 7.803375557670105822e-03 3.551950220871918744e-03 1.313015027954925759e-03 3.467270319654627841e-02 6.877598002018098233e-02 1.310553727728205192e-02 9.608666554886303654e-03 8.203555398278439270e-03 7.800707974580544345e-03 1.586723550098132277e-02 1.726811097232215653e-02
2.379693022555826043e-02 7.376385023474710256e-02 2.060138984986377153e-01 7.984966230747311822e-02 4.526745835385383165e-02 6.603731079838797736e-03 1.014960215521501855e-02 5.671261976067891800e-03 2.652160526290538688e-03 9.227376990648558652e-02 1.158795490280769280e-01 9.800534846726273452e-02 1.445147206591763933e-02 1.395582413086914400e-02 6.581244181870874246e-03 2.468171183667434467e-03 2.146091488349921236e-02 1.225118426655880111e-02 1.953820726555788312e-02 1.112159771292614736e-02 7.539038000741906179e-03 2.097119400454764554e-03 5.072391366402306812e-03 1.515247046154067929e-03 2.357798337197714381e-02 1.278701469821670773e-02 8.831583366757217099e-03 1.026499363567288763e-02 1.613269730401721905e-02 5.960989087249892598e-02
2.365738743772890368e-02 2.464343168174343637e-02 1.105237279841924242e-01 8.855883428211329400e-02 3.491031773414997319e-02 3.762550198071146212e-03 4.625735395603852371e-03 4.993775779889334313e-03 4.743887818660611974e-03 1.430342062028162053e-01 1.122038157332349573e-01 5.856908184908522774e-02 8.160110542101030665e-03 3.245112600613445347e-03 5.787726839550251523e-02 3.600301194977352168e-03 1.331710386229331168e-02 3.132761913287670716e-03 1.013539255633008965e-02 3.488430944517709881e-02 4.167874902686891786e-02 2.560978032103069374e-02 7.383226051697349204e-03 6.404441275279303125e-02 3.509187924788876450e-02 3.328382074129650203e-02 2.061136200193776358e-02 1.432241691469229514e-02 1.902534438453216264e-02 3.451076099576783768e-02
3.277904288952143350e-03 5.153537818795556232e-03 5.450547230958055663e-03 2.763922390181396127e-02 1.323646616633576342e-02 2.213338197978182223e-02 3.396628935632297480e-02 1.958234786845149122e-02 2.359871829884048477e-02 2.732470228555500952e-02 2.100397338748442519e-02 8.598376680247057924e-03 4.531765856899647692e-03 4.992664938139138725e-02 2.921563925274092352e-02 5.036226225141132024e-02 7.521559870543821635e-03 3.255102715794612554e-03 1.670404003725670800e-02 2.289485357027013293e-02 1.035142838675814393e-02 2.929215402856020448e-03 6.279568386613418318e-02 6.016772599644600039e-02 2.416487882077686736e-02 2.459515853744924721e-02 2.139575424172675613e-02 1.866150955876799342e-02 2.105441973159714181e-02 5.076189868681718620e-02
7.111465127887129679e-03 1.291530080581921279e-02 7.543075865879233545e-03 1.623758460087346839e-02 2.494265624517670588e-02 2.827444354389182721e-02 2.533633424428943792e-02 2.415954810423734736e-02 1.947180288885361904e-02 1.085918147272043124e-02 4.364356473709170639e-03 1.350875378811817323e-02 3.751099091398576134e-03 3.315963016548786890e-02 3.775837042883292693e-02 2.429743788280455501e-03 1.524702507659457008e-02 2.252947373731504707e-02 1.989775265782547584e-02 1.504751916657959612e-02 5.027851576318225629e-03 3.625311704275091355e-03 4.545714054563430168e-02 3.911753136360975741e-02 1.858147134834102140e-02 1.856889657522117071e-02 2.741372498130473581e-02 3.198392919017051944e-02 3.122303806598112491e-02 1.580954632653437967e-03
1.919784729773041029e-02 1.257824272325067973e-02 7.311155388618598844e-03 4.219612440846520068e-02 2.719082725011287560e-02 1.154555922527443837e-02 3.736318658781417196e-02 1.690730814801369788e-02 1.439433447198562761e-02 1.417992038164888474e-02 1.265352977371286478e-02 1.644605388594306411e-02 3.756602182925467687e-02 2.661671056293806598e-02 3.951986443700481084e-03 3.416734998886243081e-03 1.370973568417492919e-02 4.204060172056843514e-02 4.156296988372921997e-02 8.122272199346325730e-03 5.129013768680991403e-02 5.330690781143852808e-02 5.834184642367859497e-02 3.859758538792090743e-02 2.250709712921913908e-02 3.082171603101517207e-02 1.676135230112028428e-03 2.932317702527426680e-03 8.639978687622817607e-03 4.362171400380591285e-03
3.260732573105781101e-02 2.136535363097242374e-02 3.360883020051522868e-02 3.125975959782377467e-02 2.701191523314368237e-02 5.319556134506780304e-03 2.456469442186283089e-02 1.116801082716193522e-02 4.769643890947181109e-03 5.379161962563581978e-02 2.447348120730783588e-02 2.361197716042880146e-02 5.002523381861191665e-02 5.407838776302306694e-02 2.569344822652119137e-02 2.827980947142214041e-02 1.523940590685887442e-01 1.582933556113240714e-01 6.325778768670997643e-02 3.561023730719981018e-02 6.715729779355913975e-02 4.239411282604693687e-02 4.799393623388802099e-02 5.199389562944378013e-02 2.876267581025228684e-02 3.438090338177003658e-02 6.110957060154775453e-03 8.771211783575070392e-03 1.108720058136262662e-02 2.861779070395816839e-03
2.731091964462371499e-02 1.443261205347475679e-02 3.180909991810539766e-02 2.699960002402023579e-02 3.367850528833016971e-02 3.837815258429069440e-03 3.881775562248095373e-03 3.732975758417867492e-03 5.362192960763594030e-02 1.428895096255676164e-02 1.960661912758824288e-01 3.243892789642255359e-01 6.719559618376732546e-01 3.316920980000745423e-01 6.120258390065674847e-02 1.208173211543611125e-01 2.252258324234529541e-01 6.206298181495066568e-02 1.467774988023681434e-02 3.879273034222919560e-03 4.597669387418594489e-02 4.109608977043567590e-02 5.113222008526514817e-02 6.899307372058990917e-02 7.242633095871629789e-02 3.920732849945275655e-02 6.149434425545249883e-02 4.650564604744422681e-02 4.224392398790063896e-02 3.088462715236506284e-02
6.249414848673350356e-03 3.634878474405191587e-03 2.612501257746395467e-02 2.563447972291674204e-02 1.966529930939519416e-02 5.625046415733986165e-03 6.533580972022892674e-02 4.615303178169409548e-02 5.610146360192568016e-02 2.788800980658446074e-02 5.905412033705631503e-02 3.903509226539588761e-01 7.016559512878991489e-01 3.621679355457824712e-01 1.298982213818002385e-01 1.462005054618892297e-01 1.612029030935560603e-01 9.466229687940797000e-02 2.312737020582565986e-02 8.073241413314329040e-03 4.377937813159916980e-02 4.459737551905787467e-02 5.050656502672146164e-02 5.109419872932695339e-03 3.702152588758524793e-03 6.016649722327199051e-02 4.858771854367978371e-02 4.447266204633600062e-02 4.823474620775653615e-02 5.205521390919925356e-02
3.443225258764209817e-02 4.151791431815626821e-03 6.075785993876996541e-03 1.858711829136462657e-02 1.205059146654236663e-02 4.747569938947040005e-03 2.879089157805392925e-03 5.964787220204086082e-02 2.622188688343313027e-03 1.358120678202085277e-02 4.186867092454905209e-03 1.247656232327579995e-01 5.257531130359311966e-01 2.234239139405773955e-01 6.956915097244653623e-02 7.978010686121761452e-02 2.937967727640310167e-02 4.299345943835527345e-02 4.878948827646318459e-02 2.026449745342401298e-02 4.148473690554004001e-02 4.519250869981923657e-02 5.452943688102261655e-02 3.366872535571265208e-03 3.520560609997889709e-03 3.819949680178834697e-03 3.447590159640954912e-03 7.518147171940470219e-02 6.282942001076881333e-02 5.174120933720426085e-02
3.025622115214036956e-02 5.992610082491240178e-03 5.190133535854516561e-03 3.220336951846432261e-03 5.147587328543921925e-02 7.697883248984021751e-03 2.579801114210811958e-02 2.059795281870909975e-02 2.712123371165016568e-03 3.505076523655011045e-02 3.101007755317685376e-03 2.045710542165920728e-02 2.416379910774197060e-01 3.220228663478932329e-01 3.380502148030419263e-01 4.491379966808681790e-01 4.033307621555688449e-01 2.618946889088885621e-01 7.157234984105075304e-01 3.356729034374841825e-01 2.993741978945549734e-02 9.913460138027591767e-03 7.304840331983475377e-03 1.681869654494083308e-02 3.480676550136030389e-02 3.282576833328724325e-02 9.486251974055373570e-02 3.473660287240933758e-02 4.762498262911368449e-03 4.763425803642551762e-03
2.886888636011515283e-02 2.742031226427048968e-02 4.493414108194955861e-03 2.516131396494453512e-02 7.839681057714627602e-03 4.304158961274673345e-02 1.616313707275765510e-02 4.273466834638089962e-02 2.947501073835245844e-02 3.038123449078298198e-03 6.487823566491887455e-03 1.005497213453183658e-01 2.139594716223606197e-01 2.688780198395558374e-01 2.401927106850126337e-01 2.867557014322953957e-01 4.889045292593074410e-01 8.459932309275082218e-01 8.623371212793063956e-01 6.781927728814447498e-01 2.899593088037136918e-02 3.030446685712183397e-02 2.709530697331965360e-02 8.550956074390123063e-02 1.239640024086918757e-01 6.385913321998781811e-01 6.396483077640890968e-01 1.262896847901651964e-01 4.863508884742264587e-03 6.647838444665471469e-02
2.735486798341064951e-02 2.863163018460198814e-02 5.615945850758648911e-02 5.817168725425513748e-02 3.826603521818511267e-02 4.618321763836966826e-02 8.788768613028959814e-03 2.289128772147975416e-02 4.725265764057055839e-02 1.685520418785282221e-02 1.741112763645802711e-02 1.530842698089144270e-02 1.194297572943683466e-01 2.408892388559272235e-01 2.235710137131825537e-01 3.407153786198460210e-01 5.902102943184421857e-01 7.182740408200379845e-01 4.156479470632876150e-01 9.081885769951106302e-02 5.491587103754171778e-02 3.799524941207008122e-01 5.583698648181550928e-01 9.408626153508110601e-01 8.890070414594837267e-01 1.166089956982688580e+00 9.355094448955130204e-01 2.633358313505664294e-01 7.741790736556238874e-03 7.728466762526695066e-02
3.519855373460932524e-02 3.972749626278677254e-02 3.756275535689869438e-02 3.434199924275770782e-02 5.050310597300260163e-02 2.761853992724448096e-03 1.349276822006202081e-01 4.434788719374189725e-01 2.157974418637049752e-01 3.678461109444931820e-02 2.718256160516628606e-02 4.238222247092003625e-02 8.397012958441646413e-02 1.240782447183913229e-01 1.642876566460542975e-01 2.953881128128637013e-01 6.375342438230027220e-01 6.423216151659617568e-01 3.043766571099976170e-01 1.048851903078847625e-01 4.572374582526820275e-01 8.384900674103082929e-01 1.087033505488364193e+00 1.119359738404553051e+00 9.880750375338464009e-01 8.573276524099000540e-01 1.272242927720393491e+00 2.193195634312744835e-01 9.266864386909021839e-03 4.126422431350420909e-03
8.752514839087764675e-02 6.793281527996894442e-02 3.305045431417388824e-02 4.699783235456354846e-02 1.576305130162420493e-02 6.715881179659302647e-02 3.611402049938812198e-01 2.951025117817344112e-01 2.891601535590154204e-01 1.436016919331258024e-01 5.214728469775888053e-02 1.397941672100788332e-02 1.368950350137447189e-02 3.539991094540455296e-02 8.053743425763780495e-02 3.738072827062559611e-01 3.930755775017826248e-01 4.576992636382354318e-01 7.974740876778278753e-02 1.414392094985871817e-01 5.081312653946730151e-01 1.112800145558547005e+00 1.388159660153683639e+00 1.439948782062432375e+00 1.187560997824712139e+00 1.151123265185920452e+00 1.076785343122476535e+00 8.451970567912350241e-01 3.723800137567433860e-02 2.429433238816917917e-02
3.500148726353610740e-02 6.095965393088389160e-03 6.196937661465461850e-03 2.583472837680402673e-02 5.314052103387442716e-02 7.290981262400028640e-02 2.296794254021719273e-01 2.865720479923229425e-01 1.957283549890896368e-01 1.511575973450210719e-01 3.147484949961440459e-02 3.071185520303216024e-03 4.686905306788304720e-03 1.337712427588179723e-02 2.947962769530627913e-02 1.759953421299863541e-01 6.701562264965996163e-02 2.132759998705367754e-02 7.139584643154534005e-03 5.196377322648233071e-02 1.996343975265030546e-01 1.072358449117918777e+00 1.367647941127455136e+00 1.431959180740856485e+00 1.045285961830651811e+00 4.866496468423318067e-01 7.929370696212745262e-01 5.387412066011786349e-01 4.832769065679299453e-02 1.880809237762564798e-02
1.757995844143310157e-02 2.249963245773507758e-02 1.403108813676498534e-02 1.737412371175503165e-02 4.065636413300226237e-02 2.327777992723690376e-02 1.193200762974395562e-01 1.535518996996551588e-01 1.406639795992958297e-01 3.298210372349134889e-02 8.247675560165972086e-03 1.741300514993633555e-03 3.211064763544855399e-03 9.578977705707177395e-03 3.843751694402643831e-02 2.547534966812482066e-02 4.630961451266101675e-02 1.361132370985839758e-02 2.547040524899549241e-02 1.209690641368759700e-01 6.558710111833975231e-01 1.246774363900467364e+00 1.343313433718172023e+00 1.276796946108504249e+00 9.821826497535710576e-01 7.217127145829635992e-01 7.012924925305407120e-01 4.683869822371098390e-01 4.196822826066534673e-02 1.476488301648217101e-02
4.686940198888470133e-02 4.277962876534381620e-02 2.177091338928196021e-02 1.551550824431513140e-02 1.992506525696250558e-02 1.060929104458854452e-02 5.996022891459260734e-02 5.323922849556639303e-02 1.481618249696598291e-02 8.421899889144090004e-03 2.941429436763261587e-03 2.300904246629386501e-03 1.399660545900902877e-03 4.626366172091330581e-02 2.158768095951900650e-03 7.332216155733629025e-03 2.611251747854676647e-02 5.915265442445227784e-02 5.658996853168112018e-02 2.521051154571152808e-01 6.892282000152050170e-01 9.971150016127431348e-01 4.050306181717159837e-01 6.086811479458892338e-01 7.884943208316620433e-01 4.480268412436807512e-01 3.349399028447609394e-01 2.799297075551194780e-01 1.292603316154312260e-02 1.219335753544905504e-02
3.821309396941606484e-02 4.382728097897646558e-02 6.365656900349491061e-03 4.344603850666895264e-03 3.516695594565286132e-03 5.198052383191551287e-03 7.548848492495861297e-03 1.944880884919879521e-03 2.642961880712086688e-03 3.316504494344362647e-02 4.568178203345570759e-02 8.947717862940097631e-04 9.402902177756177274e-04 3.508854062844425897e-03 1.032902936733805406e-02 1.359288207793324654e-01 2.596178565362760038e-01 3.730189249065155588e-01 2.530514103423242567e-01 1.893066547402510180e-01 1.336199799812448630e-01 4.754191007700261234e-02 1.837303194757888142e-02 3.993745667689033857e-02 1.450666281196099083e-01 4.912497827680116502e-02 4.509926515873225600e-02 2.012617982550279558e-02 4.457629106532010749e-02 4.194808430872479232e-02
8.083016867226597291e-02 6.198714884857656204e-02 6.538220060615977484e-03 2.778788266730705149e-03 4.020496219912434756e-03 3.108809561578464425e-03 5.029225138330881487e-03 4.851701237463253158e-02 4.565682718612329438e-02 1.989644350196585754e-02 4.632629242895060923e-02 1.063115935224915633e-03 1.205038678725141917e-03 6.890566079766151028e-03 1.203165546584653717e-02 7.972689223061882324e-02 2.904707531575649870e-01 5.378269801554543816e-01 6.047472179253746694e-01 5.211951621404519175e-01 1.105146338106118425e-01 2.458892121727001417e-02 3.055599714505615253e-02 7.576558067962538279e-02 1.689854062498396814e-01 4.993833599508270410e-02 1.894262013443622286e-02 1.012481053221807835e-02 6.241958627786595160e-02 6.067552355837720068e-02
1.016711366547715656e-01 1.289822965195963275e-02 3.456788900516399865e-03 1.114783764180515575e-03 1.248456646725169730e-03 2.712267546675941037e-03 3.701309463227098022e-03 3.926424837647572719e-02 2.256562788933085678e-02 2.593007081132295624e-02 4.501403532441794475e-02 1.095710032821173904e-03 1.056253563226949290e-03 5.834008799570150443e-03 2.209108529536398663e-02 1.132662254298490712e-01 2.185037331079134615e-01 4.998106467187216628e-01 6.258301098588847644e-01 5.291648416099988816e-01 2.651445633182387684e-01 1.532712706035376134e-02 1.095854723303929697e-02 2.400434928217827849e-02 1.386218545174432160e-01 8.392734479230212763e-02 7.529266191959330112e-02 1.958939660209925437e-02 5.048425367933796065e-02 4.616268240452085087e-02
5.649324452482311354e-02 1.740515773369598340e-02 6.573219995972814575e-03 6.008231170494066076e-03 1.316771684694294058e-02 8.923936837850181963e-03 3.735753757496523483e-03 1.544316959622938409e-03 2.353261402758344192e-03 3.258693943079803059e-03 2.726675152456731893e-02 3.158986581501813107e-02 4.064638914784409612e-02 1.490031036219420643e-03 7.960255816007191787e-03 3.464443319271373611e-02 3.480195276013105243e-02 1.479077973294563586e-01 1.890443754114153052e-01 1.636723996749877286e-01 1.394680218033629848e-01 1.822236401172974002e-02 2.843804664031925923e-03 5.632172191111402271e-03 2.500851297045539323e-02 6.323712596787588180e-02 1.699017859660353624e-01 1.087089810451715016e-01 5.689047417721637689e-02 5.017584533741625136e-02
2.021658567107309859e-02 7.985172544631527827e-03 8.320963688587427326e-03 1.373915304013025550e-02 7.398502120675154274e-03 3.281765113730149720e-03 1.489625913561043067e-03 1.033451333839648101e-03 3.257105054058776275e-03 1.291081637107613887e-02 1.033000663446526730e-03 3.025878523930824321e-02 4.484770400673147167e-02 1.544117391056353764e-03 6.451110916630909548e-03 1.233265356889985502e-02 8.475539733902642467e-03 4.200871634215926423e-03 7.562048067887646927e-03 1.557879984022992811e-02 3.317285460223019095e-02 7.046570188424873191e-03 3.318214790948030048e-03 1.440538302720828848e-02 3.530768638362267314e-02 1.269453119555228118e-02 4.404204930696798553e-02 5.247709884765893590e-02 2.878446840083935532e-02 7.163846163114553911e-02
2.049244355911178372e-02 1.636411011500820897e-02 7.785865466026400949e-03 5.576396117496036295e-03 5.108792578007929734e-03 1.897277512642517143e-03 1.241100674116163687e-03 1.258237454890450985e-03 1.383733524833576827e-03 5.801397153226665535e-03 1.760209145104974469e-03 1.925835006705459845e-03 1.770466288301464786e-03 2.240674784157561158e-03 6.340880766792223594e-03 4.762133869932701387e-03 3.334257878459452075e-03 2.066118897047134091e-03 2.905817490349335563e-03 6.670491276103435174e-02 5.443357453682649838e-02 7.383673721200804951e-02 5.824113286550516508e-03 8.176439011167999441e-03 1.678399643193801902e-02 8.219240000121896469e-03 1.331397427094729857e-02 7.932767857954501137e-03 1.174601119240416963e-02 7.716235925195187063e-03
2.783937774357383294e-02 1.443434790310096222e-02 8.003983333179729570e-03 1.067228025583433562e-02 9.245698524184480654e-03 4.976585578522438671e-03 1.683070708947169772e-02 1.261163462784526540e-02 1.853704310603755028e-03 1.483864688961089020e-03 4.901661531453475884e-02 1.497154924046916347e-03 4.216727060386524749e-03 4.664517629710627361e-03 1.429111599385894660e-02 1.157798224574054305e-02 3.803737294334709560e-03 4.695181377180701263e-03 3.398405454912707506e-03 4.431362651038628364e-02 4.373249629192864363e-02 6.462800343515687218e-02 8.169992435961420663e-03 1.212456715727422765e-02 1.200644347280775508e-02 5.946567462194648351e-02 4.928135067337175920e-03 5.077961430147315963e-03 1.310511314363242176e-02 5.287394368720248206e-02
3.740644467710638188e-02 3.220618070337738503e-02 9.535561950782419499e-03 3.182881554225869269e-02 3.651930129008348208e-02 6.844313168352166021e-02 4.555486988773759655e-02 5.121883828644285819e-03 1.836751412205478266e-03 1.174113813652090648e-03 3.283201651339882204e-02 3.862132974179130485e-02 4.138636282045735082e-02 3.367776983570641008e-03 4.622975676547538132e-03 1.949756291382743426e-03 1.928699467369950332e-03 2.074428449479104233e-03 3.742009213721363223e-03 4.486615006475265857e-03 3.928378769961612949e-02 5.699745006320597329e-02 5.978925162873724442e-02 8.142193224309665286e-03 2.165970292337055653e-02 4.455211349812511490e-02 6.541078430028912649e-02 9.464383308840373238e-03 5.840144061932730883e-03 1.174432965015962879e-02
2.019650875903486117e-02 5.011549256988678813e-02 1.466449895694750538e-02 1.543488413786866034e-02 7.409439955756041973e-02 7.817058281917103890e-02 5.190300587509091151e-02 3.554513089645877991e-03 2.508036573897521899e-03 2.519358268717093903e-03 1.458152706740282935e-03 5.122964225640292552e-02 2.944455685923403482e-02 4.305295697599272747e-02 5.202390556608862612e-03 5.321665075913211557e-02 5.040448606935910708e-03 2.747503687596163091e-02 5.132342829900210512e-02 1.439798804402193412e-02 5.553584035751205766e-02 7.703326655595138517e-02 6.409138295400861052e-02 6.255911490761761895e-02 6.324007076703797373e-03 6.403527315090282168e-02 7.541212038759563530e-02 8.640454582357681712e-03 5.025210182549293830e-03 1.236782552085478534e-02
