6.232305283145372216e-03 9.175137973437339292e-03 8.058124668756900394e-03 1.026994299439546766e-02 7.815728338853087168e-03 1.713763179043384030e-02 1.685759984757699559e-02 4.527319112243211735e-02 8.191038138518484668e-02 3.698051619312743565e-02 1.731357424294027378e-02 4.131067262605055412e-01 2.450192758681446203e-01 8.430232495693433525e-03 9.656406299258991910e-03 2.509755397505545327e-01 7.214902332937523505e-03 1.229247818527514149e-02 1.084647295628058013e-02 3.725056888942074925e-03 2.965515694971744380e-03 6.571129914729689769e-02 5.084696032937116583e-02 2.016603238533732356e-01 2.322793567631956709e-03 3.059166609586616015e-01 1.420072340561010504e-01 1.261752145087580157e-02 1.204259484423538668e-02 1.513625450403223091e-02
4.819318346220763383e-01 1.094165093564491813e-02 1.980186199655879775e-02 1.613121377910962592e-02 1.125526897999736507e-02 5.041342078374346641e-02 2.392087443652068934e-02 2.959292489634014756e-02 1.916683254668343633e-02 1.618755181893936218e-02 1.151910468304140865e-02 2.423659573272698986e-01 3.275127558601820255e-01 6.692240321354711412e-03 9.214254216601816191e-03 5.876479514712590682e-03 7.108869246833635427e-03 2.256485293007898588e-02 1.656107358466081189e-02 4.859706342667664304e-03 2.745243550834655655e-01 6.150849857976138646e-02 1.288103651266411520e-01 1.136650473085004109e-01 1.000587042019462913e-01 1.345655301903398993e-01 4.818342200127297831e-02 1.254025406748267464e-02 1.794594857122175716e-02 1.806374821964031735e-02
6.135932345391496845e-02 6.162152088802502065e-02 1.304710643708964224e-01 1.052541617066030388e-01 2.251277696218320079e-01 2.295661568903266392e-02 4.240353957207911861e-01 4.518131821079883204e-01 7.262187550503598765e-02 2.169822926223550705e-02 5.755872570566510082e-02 3.781053892107301417e-02 1.377704935518513779e-02 2.009837016931433767e-02 3.808597571017013125e-03 1.596282733401231321e-02 1.044953544741988871e-02 2.075154017148967897e-02 6.701880210003784144e-02 1.084420714021554384e-02 1.724010985695473008e-01 4.998856646586488650e-02 7.617677566796923760e-02 2.664841997106767724e-02 1.599612675208300638e-02 1.075149451776877610e-02 9.732148263515198738e-03 7.734331608998986328e-03 1.318084239055565543e-02 1.496467777398672976e-02
2.838017249055768687e-02 7.961345171773694107e-02 1.749896372160889280e-01 1.402453527698547531e-01 5.815822846253809048e-02 9.025135422460282136e-03 7.215434427278000912e-03 4.842696673175437283e-01 2.940003847761165634e-01 2.690432491468026238e-02 1.700444784580738486e-02 3.352098685477018780e-02 1.506012709475569242e-02 1.003656996512437664e-02 3.455204331340873125e-01 2.708307094134025927e-01 4.514251718058118548e-03 8.191433605181762043e-03 5.672293641792843823e-03 4.716049414710218358e-03 2.085439976976681976e-03 1.154236620843708261e-01 3.601296782411810699e-02 6.938426901822616899e-02 1.298656863818726213e-02 9.636265800802158721e-03 8.318007901779469332e-03 7.914046555356754609e-03 1.586556919008928757e-02 1.755763930100241385e-02
1.638254432584200504e-02 4.955968719116469329e-02 1.380010838213009405e-01 5.344985755706370412e-02 3.088394470567253081e-02 4.579085238825006399e-01 6.984857564671660690e-03 3.933288877566663011e-01 1.808456399238715928e-01 6.222467892029361763e-02 7.662618593599869465e-02 6.500035210690714715e-02 9.526824345590812620e-03 7.840036860160532958e-03 4.110978431366744124e-01 1.563637913036945437e-01 1.388745351184821064e-02 7.810408860419787089e-03 1.236757341271406060e-02 6.915625175699859073e-03 4.618022783841062642e-03 1.946524753492407389e-01 2.601908132029251246e-03 1.173057617113125450e-01 2.339963162780595712e-02 1.273658959899609359e-02 8.824639702118320522e-03 1.031316169287570944e-02 1.599919601252381557e-02 6.025362385433760681e-02
1.631432766994360753e-02 1.666011230997514053e-02 7.455166383772816874e-02 5.958983266210925861e-02 2.369009702397405215e-02 2.643784280602288206e-01 3.212775829562498076e-01 3.439420872355980485e-01 3.176266261518976841e-01 9.660055885914810292e-02 7.480052975161828599e-02 3.927281583518864305e-02 4.402618688475093967e-01 1.366977797076400214e-01 1.060888434001707598e-01 1.766850047690396719e-01 7.910449295384857152e-03 2.513691574615649627e-01 6.565435369489066621e-03 2.223445751631344253e-02 2.617764489614599066e-02 1.493846652972555950e-02 3.547553371433507380e-03 7.130755668692133342e-02 3.508909608292776899e-02 3.313104013936209874e-02 2.041506527218445513e-02 1.427410947129379402e-02 1.869920304701176705e-02 3.468021432940583682e-02
2.275525675176156004e-01 3.671823391090269229e-01 3.880244925511516230e-01 1.859423969714003866e-02 8.905353903209449473e-03 1.492742210892514937e-02 2.302455759789303821e-02 1.334799678604755430e-02 1.608234919078335018e-02 1.862580529835588042e-02 1.424812121531849989e-02 5.851010530350969109e-03 2.280036722763758572e-01 9.054288462059546794e-02 4.843126089822098745e-02 8.756304968408099021e-02 4.560261446030333676e-03 2.540519287849723473e-01 1.101862969354540020e-02 1.491453621677346457e-02 6.627981712701450610e-03 2.125951986156152107e-01 8.435776306679741710e-02 6.526374675224379251e-02 2.399391355607256165e-02 2.450924900221754937e-02 2.109490713788907471e-02 1.865026769035202023e-02 2.161646299782670616e-02 5.313067967901363708e-02
4.790978812965815750e-03 8.679030784428640871e-03 5.066360045418983465e-03 1.090414668401258266e-02 1.666179495279142969e-02 1.886861435130520945e-02 1.698181462323409760e-02 1.625487801001416349e-02 1.324876236807958491e-02 7.408983483014447945e-03 2.895076478184958058e-01 9.160605216022759192e-03 1.872970378302202810e-01 6.303541247851375540e-02 6.533992589946101270e-02 1.222817290321266959e-01 9.268692575635905512e-03 1.475618335077715816e-02 1.291037047524960617e-02 9.084966719678073954e-03 3.074330235490787544e-01 1.470283317800065159e-01 5.007675843222784973e-02 3.879291485045004845e-02 1.812804304986692996e-02 1.890210800391411289e-02 2.887899361100093251e-02 3.722294373882174129e-02 3.810577540664976393e-02 1.157242224394827990e-01
1.248651281979530278e-02 8.142710936836269203e-03 4.774020408255365625e-03 2.763867612894555653e-02 1.789807839098595671e-02 7.624316219868143563e-03 2.493558937837171696e-02 1.132587830330193321e-02 9.621037600302535797e-03 9.481328622960576158e-03 8.438412011732761633e-03 1.110284897875845125e-02 2.407751618223886309e-02 1.557405146472524635e-02 2.352496926605176231e-01 2.172269967818619141e-01 8.909991657591197559e-03 2.679638541369564961e-02 2.621894366486035577e-02 4.326631019380677672e-03 8.243823285730256245e-02 6.456107543512622227e-02 6.152129286911955930e-02 3.763861399900286092e-02 2.163965672752044336e-02 3.305921452377441616e-02 1.232788262620363451e-01 2.556008822002019953e-01 4.754773484408589962e-03 2.560714998503976075e-03
2.065518813956074284e-02 1.339985409522169782e-02 2.136908038220378114e-02 1.988647764306200605e-02 1.742440360713989889e-02 3.430148679198922190e-01 1.630554007208849521e-02 7.002499540227948016e-03 3.060598998977753782e-01 1.131765980095534585e-01 1.613365626165879849e-02 1.564075068448329484e-02 3.293885865006505875e-02 3.547363962194752252e-02 1.684916335313228417e-02 1.830325396557978823e-02 9.680206299906783662e-02 9.915411100365581487e-02 3.944935073525508706e-02 1.738002228775074876e-02 1.011550278246080709e-01 4.859508018717496186e-02 5.012816313377688182e-02 5.247805634051394552e-02 2.848357521699036027e-02 3.648121593311073885e-02 2.023159372933751223e-03 3.782011933227454568e-03 5.117471162966027998e-03 2.115134393810049751e-01
1.726265745373045668e-02 8.984534097222336702e-03 2.001233137809726309e-02 1.692454432995655136e-02 2.144933248897173267e-02 1.971402219522812027e-01 1.697425481428004035e-01 1.511069716170435895e-01 9.679505541011487746e-02 8.156352433484455322e-03 1.274881324637504032e-01 2.112259842713757885e-01 4.342193821813603583e-01 2.133672607066842142e-01 3.922069155801924389e-02 7.598709120211839807e-02 1.394824071728120174e-01 3.824477350354218985e-02 9.071329793923398749e-03 2.007191567731470561e-01 6.917797562502478459e-02 4.845671972062764316e-02 5.776447490664033541e-02 7.850669434750834341e-02 8.226867454600836349e-02 4.420653718132249582e-02 6.965607139390674052e-02 5.728047293600277423e-02 5.271144713837421641e-02 3.887441603605311380e-02
2.991015551254148086e-01 1.757015117239647539e-01 1.643359962890651033e-02 1.601449047208746909e-02 1.241718528355536567e-02 2.846771590127772922e-01 1.129209799337193287e-01 7.380502196111313196e-02 9.278382807746490823e-02 1.576947443827735051e-02 3.818747712546796680e-02 2.482798799503007081e-01 4.426075101331036210e-01 2.281654513680098362e-01 8.210489654391453507e-02 9.161817791883927753e-02 1.004417022165503826e-01 5.910836707630590103e-02 1.452949040311425286e-02 4.303031993980278580e-01 6.397971112087660894e-02 5.696571316186539724e-02 6.454190928095182578e-02 1.143916759447115572e-01 1.087501825081690771e-01 7.710113175985190692e-02 5.884633203832465020e-02 5.395270091638761784e-02 5.831379663971002214e-02 6.311291852104865263e-02
5.784954245855060406e-02 1.492360158166934070e-01 3.657001960657064177e-01 1.076870449525065346e-02 6.994338461685765257e-03 2.204308190650114130e-01 1.142977343351711250e-01 9.670390106957130194e-02 1.232898966064388258e-01 7.783244920541351405e-03 2.915514583549823069e-01 7.878472215197626638e-02 3.285931578796403851e-01 1.387563178899334226e-01 4.321913406292523380e-02 4.938606585438962138e-02 1.819160678061329528e-02 2.668876271134803385e-02 3.041431873262390173e-02 1.138043401763185955e-02 7.671860571393816774e-02 6.898384714056285394e-02 8.324639568131358969e-02 1.431029029441520661e-01 1.880642280849410541e-01 1.772963722836429779e-01 1.316325783668778060e-01 1.197508026695814354e-01 9.119892647620542192e-02 7.043461630175219812e-02
4.599207164328887598e-02 1.323362918158397517e-01 2.435632121348016987e-01 1.786008359613296403e-01 1.062740355089106803e-01 4.232845329445916738e-01 1.388308111055920613e-02 1.159599826788514955e-02 1.754406922208727460e-01 5.431256500589087821e-02 2.190128027878809891e-01 1.268897700707711379e-02 1.486427505165091034e-01 1.972897681100569678e-01 2.077328942306378712e-01 2.767920168321656993e-01 2.491773265354045863e-01 1.616660022473724589e-01 4.415506914887022960e-01 2.066008888725208159e-01 1.713514840333394199e-02 4.782131553498126797e-01 3.606352759735929059e-01 9.345737009979942014e-03 2.179947272892469867e-02 2.042842102261973117e-02 5.592531567328604125e-02 1.799867613787767273e-02 1.470567241514273982e-01 1.417260191749937503e-01
4.142211872252017646e-02 4.169656884886435710e-02 1.163598990592606824e-01 8.646063116994423536e-03 3.207455080170005246e-01 7.584493689964641461e-02 9.212468308706697057e-03 2.633561219110221174e-02 1.760628455904615641e-02 2.166329675131530574e-01 3.921241026711672593e-03 6.236707656258122512e-02 1.313917409368292044e-01 1.639697302992976224e-01 1.462687382260441926e-01 1.747930793467996347e-01 2.983490191159064997e-01 5.164390755366033980e-01 5.284856466910903272e-01 4.211924632303936100e-01 1.817508012118020100e-02 1.912202567964933764e-02 1.691870301702890628e-02 5.337512509765753727e-02 7.700649587476966762e-02 3.951090034151230612e-01 3.967652637476311028e-01 7.914368947903586970e-02 1.712448026609368346e-01 1.025411514631258125e-01
3.635390167400597006e-02 3.974489413414473982e-02 9.248355846809791503e-02 1.034429030927733612e-01 6.911900685871931460e-02 7.910665721256744665e-02 5.028110365789564135e-03 1.404770861497188494e-02 2.900873229782102020e-02 1.044656458087605579e-02 1.082939927412656517e-02 9.457160510213627469e-03 7.319840615880418566e-02 1.471840645390304902e-01 1.366440193960230809e-01 2.079888967580369175e-01 3.592776242640179918e-01 4.379682220227945066e-01 2.555567759354381296e-01 5.659652419974653403e-02 3.431236892937970795e-02 2.371354144300820144e-01 3.454106494632918634e-01 5.836636911026418240e-01 5.508014346377438919e-01 7.201018736783670882e-01 5.811728203013075689e-01 1.656957380574070882e-01 2.695064145204380535e-01 1.217217158082240236e-01
4.437489584348362770e-02 5.153131357048396088e-02 5.175709933902737647e-02 5.007015680315189676e-02 7.727227275526379890e-02 1.617149667756681286e-01 8.154200407029174591e-02 2.713087684489081663e-01 1.321913880158787635e-01 2.268272697342738065e-02 1.685425226933146350e-02 2.625393264448986144e-02 5.179079232260905274e-02 7.615937819500309680e-02 1.002201423793870894e-01 1.793154263237497492e-01 3.858608642709153713e-01 3.927983434538547813e-01 1.887299491736485479e-01 6.572469447826248534e-02 2.846245674231661082e-01 5.166986469841655660e-01 6.642194380659431907e-01 6.882945361314050103e-01 6.110121398203807175e-01 5.311485424462785154e-01 7.917549195449129495e-01 1.382692412091509615e-01 4.014701474885099541e-01 1.710523625107010781e-01
1.073121668869295720e-01 8.458864498614585004e-02 4.490096026280757102e-02 7.180637026675704138e-02 7.853693769402642424e-03 3.960651964252301371e-02 2.199493591305743123e-01 1.782537561805007109e-01 1.749969054909538690e-01 8.784727531415542634e-02 3.217484344887212161e-02 8.654588422944324913e-03 8.470586481140691959e-03 2.186061916133455463e-02 4.923644233384701779e-02 2.272817927637879043e-01 2.389218785493524566e-01 2.823682953927864614e-01 4.976493780471061973e-02 8.884422107717568351e-02 3.160228351129345525e-01 6.852134560551366160e-01 8.503241027566179611e-01 8.914021342811173643e-01 7.435224415309920065e-01 7.215434304781591646e-01 6.749470955246293924e-01 5.350796507139993219e-01 2.374344824902085982e-02 1.565193088800235707e-02
4.869466849274644432e-02 1.351127344933571728e-01 2.543449473178961417e-01 1.432886107540030235e-02 3.157474902530656158e-02 4.440134782041102457e-02 1.394876065317100511e-01 1.727063424958323046e-01 1.181999763191335512e-01 9.211167110009438330e-02 1.941014458713890764e-02 2.759602118828938799e-01 2.910637681764708263e-03 8.285542594218511109e-03 1.811408058781668884e-02 1.078222821237574541e-01 4.120983119270564543e-02 1.330222282080061741e-02 4.554374952854171044e-01 3.272059553711115232e-02 1.244184594669469346e-01 6.631062373558797018e-01 8.428848581634114101e-01 8.894868852242456825e-01 6.549250769654524351e-01 3.056740421461301427e-01 4.969276954390134948e-01 3.410857232885136092e-01 3.075701211423826492e-02 1.214161046082998761e-02
1.063958301519438154e-02 1.335146957449290239e-02 8.795227197883923737e-03 1.072294409059881132e-02 2.483165081838142885e-02 1.411037361233308945e-02 7.226835181936948349e-02 9.239903713562416798e-02 8.487659164037836268e-02 2.012026759105489671e-02 5.080301346415455090e-03 1.641455879683637875e-01 2.837542823742993936e-01 5.741176573983632070e-03 2.315727458767750241e-02 1.583508200191787937e-02 2.895293763000945236e-02 8.579786400491465348e-03 1.608228215431308644e-02 7.592011711954885222e-02 4.078610973020176389e-01 7.738762857509878801e-01 8.348580575391573166e-01 7.991910767392536030e-01 6.183477676287338909e-01 4.557843639899853971e-01 4.432761613311760884e-01 2.986730760775934135e-01 2.689121178820987751e-02 9.572735754112328757e-03
3.021689494770725404e-02 2.695696985991061223e-02 1.361958205460813733e-02 9.592555358216519820e-03 1.218351074100076231e-02 6.437071178577417549e-03 3.634839997196950140e-02 3.205418145051421031e-02 8.741740263503171987e-03 4.795857776401877409e-03 1.669124861451691793e-03 2.162422475515003994e-01 1.282353435427143196e-01 7.039498799612414759e-02 1.811371530759632587e-01 4.562479270049306194e-03 1.624654452363280890e-02 3.693903231609365484e-02 3.541201875955088396e-02 1.575873692998590037e-01 4.302340128499270722e-01 6.260862801736057914e-01 2.562660553722056478e-01 3.870193663740958967e-01 5.020896287303151517e-01 2.854686898097655301e-01 2.137252111286848666e-01 1.755419877193742373e-01 5.338028483402762481e-01 4.871594742569992365e-01
2.428691207978886379e-02 2.722960521173786730e-02 3.955389321977844687e-03 2.684851630743753485e-03 2.153498697340759573e-03 3.162289258598746135e-03 4.460676708524963750e-03 1.991665019634830947e-01 1.407189365921647679e-03 4.043768734729676073e-02 5.265295502503279657e-02 7.973136217981680041e-02 8.825429544916163493e-02 3.152844432333501423e-01 6.232919741463491259e-03 8.469872558747777724e-02 1.604007454624722107e-01 2.304451803500481566e-01 1.563016120453892543e-01 1.176258389679294969e-01 8.372547678251611447e-02 3.015447321460894281e-02 1.172810115791565570e-02 2.539204553248946769e-02 9.235389858950443509e-02 3.137018837246711989e-02 2.906110571428738992e-02 9.828418509662817382e-03 9.188338415147215277e-02 7.520468559435888878e-02
5.027251714622432699e-02 3.786081949071212760e-02 4.050941204651341623e-03 2.628193452785308470e-01 2.483416021671278930e-03 1.908499467415909279e-03 2.908221277198500161e-03 5.505445425711225776e-02 4.669728645851116411e-02 2.010580599682132777e-02 4.744865032453786380e-02 8.936425955076719718e-02 1.190523353235174997e-01 4.254347353543743229e-03 7.406559771135530490e-03 4.888011623360356828e-02 1.762682579393733129e-01 3.258324826091696380e-01 3.664495761844358546e-01 3.195494484768373056e-01 6.909673293672691230e-02 1.562167815004965495e-02 1.952391796442646404e-02 4.783688384296481272e-02 1.067271763593662937e-01 3.155153980354249293e-02 1.216998987365492529e-02 3.761097832363248239e-01 1.190373798035791186e-01 1.071460028048832197e-01
6.165373757491486584e-02 7.715047773397227387e-03 3.044190141557867046e-01 1.049294269916688227e-01 1.259807415145872134e-01 2.816339277399270147e-01 2.110163647625849619e-03 4.145274806685622648e-02 2.297863584581219878e-02 2.640017008031022433e-02 4.651986499216331783e-02 7.906026768164559071e-02 8.961877484404155714e-02 3.267046104981768950e-03 1.357520442843898612e-02 6.942816527300596507e-02 1.325983856101800307e-01 3.019744527019246894e-01 3.766809158913192457e-01 3.210626718151576298e-01 1.640778909580198619e-01 9.641892193586357879e-03 6.946901333664059174e-03 1.502983300719174312e-02 8.654671072762690209e-02 5.186231940217583131e-02 4.692027465961443738e-02 8.903728417093992667e-03 1.061218444282235329e-01 8.196750114192272174e-02
3.387061977270956759e-02 1.033338414478933605e-02 3.981925858320104969e-03 3.693509782382583834e-03 8.207629664497843175e-03 5.539918401003840823e-03 2.250392198920092568e-03 1.610870689574459003e-01 2.425325348523358904e-01 3.132645481410490929e-01 2.897309754264401627e-02 3.246493680777597091e-02 5.069129619500604977e-02 1.153841567000459811e-01 4.855380969206883439e-03 2.111560596337463958e-02 2.112140820702492969e-02 8.975681265785553919e-02 1.144942024428688421e-01 9.950669265922688911e-02 8.620064365006568918e-02 1.142236357034459929e-02 1.683423995867304734e-01 3.192858602072409790e-01 1.551565405675119254e-02 3.873797304362846389e-02 1.044308710249384764e-01 5.937812697947554563e-02 1.260590791443300107e-01 9.586931326026004729e-02
1.210997223352099951e-02 4.734364009689711293e-03 5.011866064773525323e-03 8.423976951975501587e-03 4.612333389436097664e-03 3.431443535670635203e-01 1.593738870655563022e-01 1.131026187730665294e-01 1.963928506843325757e-03 7.674087692489796851e-03 9.322913260745874231e-02 3.194108032029627231e-02 5.411790221509527044e-02 1.193503385371822156e-01 3.933858425413692267e-03 7.526236905907036402e-03 5.182453180740696774e-03 3.248632718010699971e-01 4.063902152408739588e-03 7.518207244947113649e-03 1.383900134781530615e-02 3.350068208262270142e-01 1.683881810799023326e-01 8.922229341614032472e-03 2.186553141580524148e-02 7.796314555772864731e-03 2.706239088414138377e-02 3.065893089218555551e-02 1.099849190691858970e-02 1.472901978874024409e-01
1.227665144383237664e-02 9.711500386555736719e-03 4.690053025822345581e-03 3.430691259535176806e-03 3.201322949778985863e-03 1.995244966485861249e-01 1.331186107355395720e-01 1.377543381504678921e-01 1.528996613759874279e-01 3.360179270768036928e-03 1.691604347760051752e-01 1.594875595762697551e-01 1.508548720943229671e-01 1.890622804765825504e-01 3.815821251572841608e-03 2.868421373353940984e-03 2.638106567341992337e-01 1.583379539884715581e-01 1.396908181114544234e-01 1.072102713914765693e-01 8.524647707619661952e-02 1.244181106587325947e-01 1.977753921917451696e-01 4.949025311925402959e-01 9.003215923388454417e-03 4.176916585384214953e-01 7.295079809234421980e-03 4.325842843226107570e-01 4.378331390439774706e-01 2.844733264339672774e-01
1.663065755511778168e-02 8.549299356410045361e-03 4.820536391684895720e-03 6.579624539626873631e-03 5.795133439145168201e-03 3.106887980508139108e-03 1.040847413331469004e-02 7.721010869469170645e-03 2.057796112240258268e-01 1.478621945411449645e-01 5.224111291925405409e-02 1.189419590654593878e-01 2.129884737307853951e-03 2.562331294051950481e-03 8.604104779794825505e-03 6.982037304398508969e-03 3.011693505601115151e-01 3.595481480664206031e-01 1.669627693189065787e-01 7.273725487338225659e-02 6.604795645252629910e-02 1.007884516384822959e-01 1.566852680346986770e-01 4.740655136211252216e-03 5.229268424717829940e-03 1.279743827794216360e-01 1.445039050524490609e-01 1.844452484723292374e-01 6.835924927218563381e-03 1.243623190160464687e-01
2.232654720267863990e-02 1.904931047506089326e-02 5.731152930290148509e-03 1.959556014135045016e-02 2.277929509399320013e-02 4.240634540243922584e-02 2.804278720711993536e-02 3.127465362849286053e-03 2.034476540803650813e-01 1.164099724706324640e-01 3.405491729658570443e-02 4.218658402080854852e-02 5.306006072354642333e-02 2.168760616490925941e-01 2.784367811834961293e-01 1.286395161154204603e-01 1.266688245153283487e-01 1.527227741545155726e-01 2.083956407153926271e-01 1.138563210057209341e-01 6.177591467353953092e-02 8.366653591310546645e-02 9.375660450750329666e-02 1.651149278386956076e-01 5.243504077793235789e-03 8.856111911826010374e-02 1.312852332018384083e-01 2.155337442810846549e-01 2.545366862056875901e-01 5.227909514121188428e-01
1.225645245714430780e-02 3.006806015354727621e-02 8.940630370462084378e-03 9.589322187366145986e-03 4.642446468396772136e-02 4.882404081540500651e-02 3.242415457532674822e-02 2.216999791152461999e-03 2.809037518880360129e-01 2.623108526988741085e-01 1.065303659921889023e-01 5.224014428774265140e-02 3.379733901874906743e-02 6.067332612772727979e-02 2.990414314866864931e-01 8.970340846604092644e-02 3.231327627937666813e-01 1.659553179022691533e-02 3.096115712520206009e-02 4.341205885822957411e-03 9.280226601024854638e-02 1.171044066311020260e-01 9.933118738413145021e-02 1.142383549998863546e-01 1.589388820313225870e-01 1.265095918108795903e-01 1.526512825517826188e-01 1.892223703840521243e-01 2.478701296009465094e-01 7.799109285558681985e-03
