6.759474846703344281e-03 9.852174227093392703e-03 7.464124473500826154e-03 9.472425213239453468e-03 7.231937505531258262e-03 1.590901912938857271e-02 1.580327097424444674e-02 4.280057788635758392e-02 7.769120266442752776e-02 3.503661418656236343e-02 2.509519978510141303e-02 2.159122826232996728e-01 1.354056320567938732e-01 1.277110407943666745e-02 1.086592146062284429e-02 1.455313335787824791e-01 8.596681634926847324e-03 1.197368214578201084e-02 1.066268105554077188e-02 4.296259602361531503e-03 4.090264646040734503e-03 6.708873925690467255e-02 5.313713709751566316e-02 2.057010959266949157e-01 5.056448210267676380e-03 3.086807199647101929e-01 1.458648953627228462e-01 1.288607515774375586e-02 1.233246020948330392e-02 1.556700823957684818e-02
2.086249729772999828e-01 1.145603437191335984e-02 1.829808845370874473e-02 1.497917942941707700e-02 1.046131809132839346e-02 5.203373315545278127e-02 2.724924042665742216e-02 3.396354532529097942e-02 2.017014132660208819e-02 1.570377538059611333e-02 1.640636557426258454e-02 1.099222499704010647e-01 1.580174559459985029e-01 1.000468574464304095e-02 1.041820025849785232e-02 6.750008535936937240e-03 8.411217549408767091e-03 2.227146684651130221e-02 1.651844101128420450e-02 6.001719255437130626e-03 2.534233220795555352e-01 6.458201745699804208e-02 1.388730770634672984e-01 1.200212455290365354e-01 1.054495402706002727e-01 1.403193347120586243e-01 5.118518887174432208e-02 1.308239755693895411e-02 1.866372559021279437e-02 1.870469751047101198e-02
6.362561636841869428e-02 6.351708568389222154e-02 1.201479410714006990e-01 9.771644187090329503e-02 2.074938051942571693e-01 2.346907393749973064e-02 1.790541889053992863e-01 1.893134079045269424e-01 7.966521636089624048e-02 2.189416730832473290e-02 5.840280140024053240e-02 4.312112449186369934e-02 1.593000944309801159e-02 2.579766452081075356e-02 4.988710232659320995e-03 2.172267467680557076e-02 1.216064215082178143e-02 2.039663115835396723e-02 6.666655843157494321e-02 1.357794924467267336e-02 1.613236870687351499e-01 5.381457550328296036e-02 8.442475432282985082e-02 2.940567214835818066e-02 1.734434688175642142e-02 1.139796306073768972e-02 1.028559735688541407e-02 8.099573770693466179e-03 1.382805728881172577e-02 1.551263311049543188e-02
2.615861048605093095e-02 7.447023847085956771e-02 1.633631142223046229e-01 1.319738191308770514e-01 6.046746609767458813e-02 1.038783485124976022e-02 1.331455276849542908e-02 8.474268770477520404e-03 1.260395817441402333e-01 2.812713465187701919e-02 1.640520939886203761e-02 3.234097315340060674e-02 1.460616519010384147e-02 1.736711648506002875e-02 1.829234489739904879e-01 1.632019674803001086e-01 6.030930292569752597e-03 8.005171007677402278e-03 5.567322727751572962e-03 5.066064612922968786e-03 2.927450449111032062e-03 1.089866042628496873e-01 3.750713579142889165e-02 7.320816483096036220e-02 1.415161446884455679e-02 1.018186665318702999e-02 8.796779747196526236e-03 8.350371629840579527e-03 1.696060296129962841e-02 1.842697280119323655e-02
1.507874697637785234e-02 4.646007831866261900e-02 1.296409770310539833e-01 5.028055855078004260e-02 3.492310950880905124e-02 2.050687293986525050e-01 1.523560774378392331e-02 2.012373257848237840e-01 7.914384856439679594e-02 6.818055104961578960e-02 7.363172676648091497e-02 7.105536471847896662e-02 1.268158026058125928e-02 1.935915079045743420e-02 2.400921251498919218e-01 9.893482705584616399e-02 2.337905925279769315e-02 8.406899499944541290e-03 1.343495538157229996e-02 6.704617528795002099e-03 5.382098519270453116e-03 1.421444151538229783e-01 4.359606430178549277e-03 1.156044249329219453e-01 2.558639666843172747e-02 1.375225205162580386e-02 9.599373757038204280e-03 1.110870676059453471e-02 1.738727836590028483e-02 6.395911119570207859e-02
1.990575290872196798e-02 2.118916241965602618e-02 8.249268080596154629e-02 6.006050577873397328e-02 2.745096471707354421e-02 1.192738819090806146e-01 1.515705340949549396e-01 1.616038967791057768e-01 1.373262456917616059e-01 9.989511110884213840e-02 7.140236602521249365e-02 4.903805263778470563e-02 2.056462354767839840e-01 7.778286841744835867e-02 6.530154944556471053e-02 1.111097528774470933e-01 1.375924393342441501e-02 1.481292291157367547e-01 7.791099414646800517e-03 2.112661953509076609e-02 2.991521463041644374e-02 1.909253671406988331e-02 6.335289825014175924e-03 6.832005936983376326e-02 3.832498681404781365e-02 3.636512224620028211e-02 2.287251827201809348e-02 1.578982735161631873e-02 2.086134702983559810e-02 3.753989845159708127e-02
1.128226603297120822e-01 1.689879660966588648e-01 1.704445730348633781e-01 1.893496646212104381e-02 9.203286060432164239e-03 1.830690709539577882e-02 3.280312954450000096e-02 1.859412549657367755e-02 1.902396726113730896e-02 2.064203455344221574e-02 1.503996597046349318e-02 8.707697276585652305e-03 1.167566016317553579e-01 5.563960760582739584e-02 3.242294141983646100e-02 5.500820144092929964e-02 7.747234444746720766e-03 1.397423370188480840e-01 1.259083447361154795e-02 1.777535698228173422e-02 1.122769658124364231e-02 1.452661959222942278e-01 6.780776237576514875e-02 6.408378714461249182e-02 2.623595245665114734e-02 2.734896356371094295e-02 2.436285533383340113e-02 2.105192604326203837e-02 2.409091239677133012e-02 5.734158469881198844e-02
6.003472212175512551e-03 1.160298368228476588e-02 5.816619235930574859e-03 1.122548036823856066e-02 1.592520851237756718e-02 1.802665252092450557e-02 1.609543021633082216e-02 1.527459616810890493e-02 1.223958880825518417e-02 7.871697957267161788e-03 1.385595464149897704e-01 1.278989397301562997e-02 9.859490353221841974e-02 3.636530726859101004e-02 4.123529232105073439e-02 7.483085469552125391e-02 1.324946705670401390e-02 1.552372264490044229e-02 1.364437856560957521e-02 1.181517542956089968e-02 2.067480982955755553e-01 1.227121070001621073e-01 4.957408786447867893e-02 4.186613836426841817e-02 2.013984142388771520e-02 2.103901420779209080e-02 3.267896574608969429e-02 3.717449113339851841e-02 3.582163812270497405e-02 1.044470858602309787e-01
1.203400272616916671e-02 7.929138703316816750e-03 4.631081691520076878e-03 2.681842553536669185e-02 1.956590270321030556e-02 8.315293197256497237e-03 2.696106180825141863e-02 1.316249048383600836e-02 1.139854034079585028e-02 1.274454787505183845e-02 9.347930598640672578e-03 1.344473865448236535e-02 2.724686623167036498e-02 2.170236063607312860e-02 1.325200395810564036e-01 1.115054869780785773e-01 1.039871718692488879e-02 2.601469535065063787e-02 2.555880107235036086e-02 6.344404247123668419e-03 5.505861755484930259e-02 5.782126221040427561e-02 6.296913027521278128e-02 4.151187860157761617e-02 2.450615051217077539e-02 3.446332985794998971e-02 1.230399950344060050e-01 2.239979115403274990e-01 1.065523176139343726e-02 4.583328771580041407e-03
2.023237018110881150e-02 1.326583188879202832e-02 2.091533193120005338e-02 1.957967415269151745e-02 2.125373612594510034e-02 1.559104817011414679e-01 2.781682020014056289e-02 1.240361356232701565e-02 1.616054264437810362e-01 5.838067051401694962e-02 1.551459714899004229e-02 1.484474498744614221e-02 3.144337416603666668e-02 3.758501445873783930e-02 1.889665017038133846e-02 2.051152386750032877e-02 9.966180797063430019e-02 9.777534789581374119e-02 4.249072946781971838e-02 2.576958363088209525e-02 7.054943941465391388e-02 4.494039353398011916e-02 5.159415257920701992e-02 5.714073432115000101e-02 3.214630678377938811e-02 3.879805849841410498e-02 6.330065353272347310e-03 8.526460862876384522e-03 1.139708628288205704e-02 1.712226357183675995e-01
2.848132057871517742e-02 1.451587432892365720e-02 2.245775425457442048e-02 1.687968981462823620e-02 3.244754411256360604e-02 9.756135202589694133e-02 9.457338266222693746e-02 8.631832191559175860e-02 5.909421298072116413e-02 1.185462121827378368e-02 1.231932079105647615e-01 2.022772492422703627e-01 4.192957643698769221e-01 2.071190429702721714e-01 3.821504388676469355e-02 7.527871774343725120e-02 1.400275025219905600e-01 3.854307020861726107e-02 1.237871421123491397e-02 1.161503092364714468e-01 4.899452104171249378e-02 4.380649133000229234e-02 5.661415328174457251e-02 7.978982962234335008e-02 8.598609117921229839e-02 4.544258440845637403e-02 6.805477540237489520e-02 5.115597104387342026e-02 4.717161419049713256e-02 3.460338224178132610e-02
1.672282992562159620e-01 9.108373970515673546e-02 3.203730317218515117e-02 2.266629753846359507e-02 2.036398314028502882e-02 1.528515199613947328e-01 7.367798621393913117e-02 5.121560044266065814e-02 6.100667318515592963e-02 2.077794730381602242e-02 3.758542938522178856e-02 2.470860116292103448e-01 4.344569556913070452e-01 2.255336847658867550e-01 8.135270465019471542e-02 9.196646526145663136e-02 1.015194794950170232e-01 5.970154252570662734e-02 2.020429400856447316e-02 2.669044444442925101e-01 4.725512516016117798e-02 4.814968815764408827e-02 5.696541705819698626e-02 1.023957818940650216e-01 9.795038029570775351e-02 7.008037334228364723e-02 5.403274108996776459e-02 4.921453888549075228e-02 5.390827815167934661e-02 5.838213647557970870e-02
3.962106650021027243e-02 9.309474538021074441e-02 2.037777774022273558e-01 2.602984497527751490e-02 1.743130921896510546e-02 1.265064561109899566e-01 7.298480344437166534e-02 6.464190831620025834e-02 8.296715014318829795e-02 1.127652446375135634e-02 1.597582838926744908e-01 8.152016366812928072e-02 3.231380361591627559e-01 1.387998189277902805e-01 4.368925182384985478e-02 5.061050254539356530e-02 1.870961813968732845e-02 2.746622736491630482e-02 3.883419068945223596e-02 1.667395326692754087e-02 4.558394491088645084e-02 5.001207320070110568e-02 6.280262047586063212e-02 1.046937153016906791e-01 1.333025970999711929e-01 1.183956174033547193e-01 8.782042873757432699e-02 8.306185532920190573e-02 7.326475906752039080e-02 6.093892206328480055e-02
3.410731115840995309e-02 9.350002613857888445e-02 1.445650946552586580e-01 9.920934382301771493e-02 5.831512345507186557e-02 2.565630316528456079e-01 3.272291644883264933e-02 1.794114875682123814e-02 1.151171560145312356e-01 3.745065620609339119e-02 1.338627262279452057e-01 1.331609982745821791e-02 1.472687949487485048e-01 1.995627952250568216e-01 2.129294371119366813e-01 2.872220673454138895e-01 2.594585857883020541e-01 1.691972198766377722e-01 4.642322305037852592e-01 2.196635478431080424e-01 2.604614809601872583e-02 2.993611780603450678e-01 2.228806204604694696e-01 1.873051367048397461e-02 3.414498119788022396e-02 2.843940255552964216e-02 7.201592894001548895e-02 2.977476519464387905e-02 9.949550836819873179e-02 1.154636301751383320e-01
3.197834903100825465e-02 3.086507394564327530e-02 7.399018719605593430e-02 4.113652378152175826e-02 1.912192840932089299e-01 4.830334888387818881e-02 1.643108837229739078e-02 2.866087922933840959e-02 2.180999189813712796e-02 1.429864056862973354e-01 4.642401992673537980e-03 6.404562289834055122e-02 1.305648109761833875e-01 1.663279945210568156e-01 1.506377593407719484e-01 1.822767211427810397e-01 3.132779707464867225e-01 5.458642369493038604e-01 5.601995072415610899e-01 4.432099994655425146e-01 2.447067790892976796e-02 2.961463233075097012e-02 2.580675442483788828e-02 6.532654996995954089e-02 8.148905108388346252e-02 4.193034565946353598e-01 4.202347688837230755e-01 9.876581151171348605e-02 1.022645673072928169e-01 7.851014495016565842e-02
2.954902303283851034e-02 3.118327171980367699e-02 6.106914248997974415e-02 6.464880405060451085e-02 4.210101677137177006e-02 5.098806821284460056e-02 5.820877869577138070e-03 1.412444229115901451e-02 3.160185504088718067e-02 1.135491273301838383e-02 1.174019794167764294e-02 9.350323197587493904e-03 7.308749851684326337e-02 1.487412466665703481e-01 1.393286780526015733e-01 2.142666525538851618e-01 3.751275948486934020e-01 4.613121135195090705e-01 2.696683519813651286e-01 5.937466814353804800e-02 3.596651132122470618e-02 2.491115432836738808e-01 3.661577647914086020e-01 6.191691919725776927e-01 5.869008561401701796e-01 7.709258837730500469e-01 6.195645386679273781e-01 1.934317724865105559e-01 1.484682144945682347e-01 8.714777787807359566e-02
3.811848737671992560e-02 4.306160812363150209e-02 4.047824109502631829e-02 3.668153668112301979e-02 5.359493412979182692e-02 9.462261655679560235e-02 8.548305148131943310e-02 2.737952123215085520e-01 1.335705406149040875e-01 2.270843073868752948e-02 1.672801112340049912e-02 2.598962867863493370e-02 5.150204955406566254e-02 7.643306190124034283e-02 1.016139047135874163e-01 1.833931754170080863e-01 4.015266618272320676e-01 4.106728288532056625e-01 1.973152379890230068e-01 6.860412633880014210e-02 2.992391302748171888e-01 5.487188005770728960e-01 7.113251838310545860e-01 7.373927148444336943e-01 6.547510955441273595e-01 5.695641930275436859e-01 8.458843264690399932e-01 1.550420241388556775e-01 1.941433297777188649e-01 1.047149440457719599e-01
9.567606597227423793e-02 7.446208435945822490e-02 3.596167092616915639e-02 5.032293483770165082e-02 1.057277081806443086e-02 4.246541825069291565e-02 2.253841687540443228e-01 1.820380930632634342e-01 1.789449251611955616e-01 8.873482966739873468e-02 3.502392714041946409e-02 9.454294734582400356e-03 9.234244951339225238e-03 2.176093404957309824e-02 4.945226330207547899e-02 2.291097786285110072e-01 2.453952345306417149e-01 3.003704290310401648e-01 5.322416564261955862e-02 9.524440737997257045e-02 3.324589177013755337e-01 7.277807556048098148e-01 9.075614290400311202e-01 9.505007453499034753e-01 7.899608250352190275e-01 7.670690009231794226e-01 7.163386819717727505e-01 5.761404304460152614e-01 3.015258432478827230e-02 2.061895851647812736e-02
3.832383176206177744e-02 1.050325663746631832e-01 1.828474356279587987e-01 1.963885542768083192e-02 3.306292978440844577e-02 4.468281573337262724e-02 1.409825638047624285e-01 1.760878935750485597e-01 1.204065553560727808e-01 9.303581661560776650e-02 2.354349502270122740e-02 1.925522849716093943e-01 4.680169089805160353e-03 1.084066250794823300e-02 1.810867025836122163e-02 1.077594884165533201e-01 4.182267579423300241e-02 1.406304497519598670e-02 2.304184520108585876e-01 3.512778337461172629e-02 1.310627468863208855e-01 7.042926823185342577e-01 8.988236405831944165e-01 9.482222276333525102e-01 6.971851530337671576e-01 3.259292924521632329e-01 5.318037619226759771e-01 3.617212813241122427e-01 3.250955521358747657e-02 1.266661880628362422e-02
1.341888558025679246e-02 1.956564825049753042e-02 1.228498284998917611e-02 1.296239709904368348e-02 2.499789419127057544e-02 1.427523786679909742e-02 7.307658728866807396e-02 9.388419537989819985e-02 8.593339978716819927e-02 2.021075369349858292e-02 8.250048874491312106e-03 1.316721941835315712e-01 2.265154823865242195e-01 9.787316418038084082e-03 2.495527264802146691e-02 1.613100528323567484e-02 2.881980160137537217e-02 9.013603225084316009e-03 1.711341298414470816e-02 8.170995741490444386e-02 4.303673962524511842e-01 8.191755770345938714e-01 8.838973611914489048e-01 8.464646962170356836e-01 6.565072772166731241e-01 4.855865871124575017e-01 4.739701941717588407e-01 3.359916929867389213e-01 4.805605237965328291e-02 1.861227457942685182e-02
2.946278212467375729e-02 2.659413422950043099e-02 1.350372639125948550e-02 9.593279663218951675e-03 1.227918193774621240e-02 6.508956007929240367e-03 3.824094451071238798e-02 3.374193776276664114e-02 9.455345209492243413e-03 5.336145237426339477e-03 3.418623294842388759e-03 2.005582917786515873e-01 1.124345413663867116e-01 5.227572053156826631e-02 1.121719053237692915e-01 4.613744155207072373e-03 1.614051933834932326e-02 3.733273323790287090e-02 3.644616048290716392e-02 1.645008931383994677e-01 4.505221195473584350e-01 6.532478383440565306e-01 2.659637526555579945e-01 4.034119151466418196e-01 5.279727637789265460e-01 3.027433661261050846e-01 2.278718162006638515e-01 2.049906924816844445e-01 2.610902661577497175e-01 2.847584167625219487e-01
2.385442559172864727e-02 2.700977897098744834e-02 4.801902355984976126e-03 3.416670389273538874e-03 2.855245199814838465e-03 3.199272702689256141e-03 4.916858024461600793e-03 1.487900505591879807e-01 1.778328279913871622e-03 3.564545088542540874e-02 5.261998298629748383e-02 8.371046807896936892e-02 7.906878519598097010e-02 2.480677033181044044e-01 9.015645893597955263e-03 8.516514536293065540e-02 1.597099487992713895e-01 2.342309682415522898e-01 1.621322125718923923e-01 1.229423646460132274e-01 8.700403785442016591e-02 3.104582868254907382e-02 1.202684992620128672e-02 2.639954142870301265e-02 9.702133045958004354e-02 3.322102728800262195e-02 3.716699225581125005e-02 1.809246974480622355e-02 5.012348122324699479e-02 4.693346498587688820e-02
4.973266046635649307e-02 4.167522319831377942e-02 5.725423667924998614e-03 2.288694174133246717e-01 4.164457847470900628e-03 2.279314039656604556e-03 3.759628389290876546e-03 5.254844750982407692e-02 4.953897021819347185e-02 2.147920352214083631e-02 5.406532322655298317e-02 9.835053234057931915e-02 1.020950389708508294e-01 8.879642333310476532e-03 9.947729467585691293e-03 4.816869751260146465e-02 1.787592090647484866e-01 3.375416750351802886e-01 3.868177469596408846e-01 3.376909827071848946e-01 7.185230478250453912e-02 1.604182484300452696e-02 1.998455463706615143e-02 4.990642019127353168e-02 1.122772372961141352e-01 3.348183506742968135e-02 1.543702082702643266e-02 1.803501415241845207e-01 6.843667902205240183e-02 6.614007253942563724e-02
6.175663746725701397e-02 8.658826172785766273e-03 2.297847686246093646e-01 9.529498994346255469e-02 1.213555025275492444e-01 2.674801619892648308e-01 2.904326219324360366e-03 4.292697788068837450e-02 2.498940393085079606e-02 2.855762126695033168e-02 5.180552559090995102e-02 8.691093559821318204e-02 7.647744826249056049e-02 5.688917304906609441e-03 1.496295969574715570e-02 6.843522346470334861e-02 1.344486643922728208e-01 3.133052285361621059e-01 3.991129918781635144e-01 3.413230432498047806e-01 1.716378815433348137e-01 1.145224771499585986e-02 9.026804461943867958e-03 1.910573662207638856e-02 9.944745008786809448e-02 5.546587632301688831e-02 5.902865212373172715e-02 1.617800076123570782e-02 5.477335280706337184e-02 4.973951609420441261e-02
3.417943261794988835e-02 1.187409092923986248e-02 4.947114052444342991e-03 4.988899757707513684e-03 1.067213105620713233e-02 7.284433095164390137e-03 3.365710655557719276e-03 1.676365024995002395e-01 2.526864196402659468e-01 3.232968088726819178e-01 3.052807953151820061e-02 3.617844831895689756e-02 4.599708926782365009e-02 8.728229241455125187e-02 6.438519534197002792e-03 2.091515307198567319e-02 2.276653731106283510e-02 9.794029825755984353e-02 1.266045000396996689e-01 1.049719733793287590e-01 1.036479574796276004e-01 1.928445702763957256e-02 9.097570539848964799e-02 1.474312519524071385e-01 1.791350151221795736e-02 4.127723195031501868e-02 1.110888776942014766e-01 7.466527210185941454e-02 6.100619438935361155e-02 5.362617587434328342e-02
1.223287506164572741e-02 4.856334703290074960e-03 5.094318506509228246e-03 8.521547563024671132e-03 4.880964074648336780e-03 2.422397121108442897e-03 1.626557747844862567e-01 1.186983784654533636e-01 3.301483200067798721e-03 1.261040573815332307e-02 9.754794829880543416e-02 3.565283159302554822e-02 5.267961492228535880e-02 9.299852761855351146e-02 6.251428894595022906e-03 1.122334577389702027e-02 1.106235286113572275e-02 2.055388961257993974e-01 9.776626916222327240e-03 1.508750886642465198e-02 2.985178949038267554e-02 2.018584559857650729e-01 9.766963866291833440e-02 2.648361190006849955e-02 4.610052667989991693e-02 1.039653751214865418e-02 5.061319350615856028e-02 8.168483326633398101e-02 5.701868375359963464e-02 8.227209430529094925e-02
1.239866961008361315e-02 9.951163775512472665e-03 4.765611335954671526e-03 3.457964822791610021e-03 3.382725476133926611e-03 1.970550707552513048e-01 1.351527455953798196e-01 1.418719810141833015e-01 1.557105896855428551e-01 5.256704588094753515e-03 1.787453784034299942e-01 1.627051299185880984e-01 1.312243521314773731e-01 1.321032671802246650e-01 5.536608368911153516e-03 7.019213552294036734e-03 1.813994618699382722e-01 1.157639218715575957e-01 1.020110000645065157e-01 7.649452265690444286e-02 6.051316775092384359e-02 8.592605443523401720e-02 1.222419635130498894e-01 2.641750393139896680e-01 3.309464796192147090e-02 2.004190587521918754e-01 3.069710029423059622e-02 2.340644977712475483e-01 2.447000331335542067e-01 1.621752175335667845e-01
1.684207541582986856e-02 8.777296250703805341e-03 4.899509146789592443e-03 6.619327775946502734e-03 6.098241005100918724e-03 3.389179310763055890e-03 1.188597839881709931e-02 1.008673456164738830e-02 2.148341190548202495e-01 1.565075364488914822e-01 5.713788561633698082e-02 1.208109492752780789e-01 7.577478945432404578e-03 7.880940628202633483e-03 2.312342285662543837e-02 2.507463027085431867e-02 2.067958168535170560e-01 2.514683716554998449e-01 1.156228770352366042e-01 5.111338811592684717e-02 4.882227177294118370e-02 7.425266195553503756e-02 1.066291955786810991e-01 2.881388706388584575e-01 2.773606378570757369e-02 6.889605498126645522e-02 8.596768381835802331e-02 1.097771605316670840e-01 3.531402069222786544e-01 7.222111128740006658e-02
2.265939181427489846e-02 1.959225297553610773e-02 5.839881948049699401e-03 1.974786786040295256e-02 2.283137599668021156e-02 4.261086786920765396e-02 2.818355998120199851e-02 4.141350026087743316e-03 2.167343639785995202e-01 1.269593046314686502e-01 3.785368805156227173e-02 4.318279538331801226e-02 4.718006219739782209e-02 1.697047632284451324e-01 2.014096465289367810e-01 8.710811448198989282e-02 7.346454866877032142e-02 8.068195576526587809e-02 1.083661041800098729e-01 6.236509592350712727e-02 4.377347252980004488e-02 6.451694755692063965e-02 6.988625435530440577e-02 1.049985046255587640e-01 4.194686710279961483e-02 5.321968015414820646e-02 8.284652877621911937e-02 1.334199050067271242e-01 1.508446406248958593e-01 2.944383170502256064e-01
1.234537146499981031e-02 3.060488835300595456e-02 9.026865334298361798e-03 9.598491923958936065e-03 4.627724112939674006e-02 4.865801382406476083e-02 3.217898353358845942e-02 2.744101732493078438e-03 2.950228518265095579e-01 2.786269352230082430e-01 1.138853045671338327e-01 5.671541660109270105e-02 3.394195580075035079e-02 5.386991562727063559e-02 2.476579418141030553e-01 6.544388488922067704e-02 1.786825823410709280e-01 3.815324242507213415e-02 5.031685716229198496e-02 1.358521384184850633e-02 6.131851820491503180e-02 8.551535653559799721e-02 7.226470898893223860e-02 7.229118544583819361e-02 9.434144326764662414e-02 7.512144833252745735e-02 9.301434992442589311e-02 1.121606649971296221e-01 1.390167098243524357e-01 6.778641216587455443e-02
