7.900469071243823582e-03 1.157310710564656703e-02 8.798416765752992141e-03 1.109840648967672962e-02 8.420063463732006120e-03 1.845403761973462772e-02 1.830827770414738404e-02 4.952899706990947920e-02 8.981437632360095291e-02 4.017032675952419973e-02 2.793646613952087063e-02 1.905388548083538081e-01 1.190569303072132046e-01 1.386453777709528712e-02 1.185429765512482567e-02 1.244943656574990787e-01 9.156085629181172011e-03 1.281545358329225746e-02 1.129298407267092727e-02 4.446298928659068485e-03 4.190744710534734935e-03 5.665645964136092894e-02 4.516552789983984545e-02 1.752658064181406850e-01 5.116364493037031322e-03 2.667962030036341581e-01 1.273762460988367984e-01 1.125580776563374179e-02 1.075543225266975371e-02 1.353510501255416297e-02
1.878894510692711017e-01 1.370711024255288034e-02 2.200696624236147744e-02 1.796990557499093116e-02 1.251799964092734779e-02 6.170851731786618916e-02 3.205484007389212270e-02 3.983909838476552834e-02 2.370361716669494231e-02 1.826940721350831659e-02 1.844018749610620844e-02 9.687514229228166851e-02 1.383937269301300232e-01 1.088206900850805479e-02 1.138761054053021721e-02 7.294711921947994240e-03 8.970690231057294739e-03 2.380826336245245312e-02 1.743818846138276216e-02 6.144660302494518722e-03 2.119832800323819266e-01 5.427846534923513877e-02 1.173097955829347366e-01 1.016508538344428614e-01 8.994387508507091511e-02 1.213361021414145619e-01 4.472762305236402391e-02 1.141499663673072908e-02 1.625061930611233427e-02 1.624882269155150313e-02
7.604474470317633406e-02 7.769501782297305592e-02 1.479323258545338637e-01 1.202708584811236492e-01 2.553241274903811364e-01 2.861241619173661779e-02 1.660284118699760780e-01 1.750408406727473332e-01 9.515986839131505837e-02 2.584863490606868416e-02 6.762072287804742066e-02 4.891700481190712491e-02 1.784203224651136760e-02 2.838562430812181792e-02 5.422495537722759815e-03 2.331459406621178010e-02 1.300352547745666984e-02 2.178573296773585882e-02 7.017161298327220798e-02 1.380138405551549832e-02 1.345020303060418809e-01 4.501105227551861765e-02 7.087421374433895693e-02 2.474818054845341272e-02 1.474236716922029677e-02 9.854406936222208716e-03 8.957949057481406560e-03 7.046520001330893422e-03 1.201496613959729572e-02 1.346588406404843410e-02
3.141236398005345376e-02 9.113949557328306084e-02 1.999559166450395886e-01 1.615320868732071369e-01 7.354460964583564575e-02 1.253902175857132470e-02 1.571701219219338516e-02 9.985744547926424242e-03 1.167829950564546609e-01 3.319509825385820456e-02 1.906741143943278816e-02 3.703618163413334441e-02 1.655100621669794783e-02 1.897135731371576289e-02 1.584655186400079352e-01 1.407985190341352610e-01 6.471451639569563569e-03 8.647415590881096098e-03 5.927544958335027522e-03 5.285045813741335967e-03 2.990834185727662790e-03 9.171198583917945790e-02 3.162455339949965527e-02 6.185803279971777147e-02 1.204428710500873335e-02 8.766912477924973870e-03 7.621646554643686164e-03 7.220398032862198473e-03 1.463082966422311545e-02 1.586810597651215279e-02
1.805047198492576097e-02 5.643632200189910991e-02 1.574931242505003548e-01 6.108571360973531761e-02 4.197184747404080624e-02 1.893809873870188620e-01 1.783581717207410877e-02 1.866389578309753383e-01 7.364147428886043401e-02 8.020712243946370723e-02 8.550596400881765868e-02 8.061483031669340604e-02 1.412837391075609864e-02 2.106844254441257377e-02 2.103361761481812864e-01 8.676824163184848615e-02 2.528906365868702211e-02 9.168368645247889498e-03 1.441920628653190622e-02 7.178077542966220317e-03 5.685452582725024177e-03 1.209466844968990484e-01 4.460575059726327660e-03 9.845823039113651975e-02 2.182808566395125216e-02 1.177359468493844458e-02 8.238507095795081017e-03 9.498922088327265562e-03 1.480614554944928093e-02 5.427320065851071879e-02
2.339544900104184241e-02 2.511548532435246145e-02 9.854293104824053684e-02 7.210742364899822010e-02 3.268820817994967654e-02 1.096478502577562381e-01 1.399540794393591969e-01 1.500487940898374561e-01 1.283001582231853843e-01 1.178564875988193789e-01 8.288304894363297814e-02 5.519905365011072013e-02 1.808700462625437710e-01 6.871525866489862355e-02 5.807747833030744988e-02 9.969521951771882773e-02 1.524380548250892607e-02 1.303478188495919010e-01 8.486409894255843300e-03 2.307880090340344581e-02 3.227742124625494063e-02 2.041849616358212480e-02 6.585207480736793295e-03 5.865263301369114113e-02 3.275060061056211946e-02 3.095649507015807780e-02 1.938779557044796598e-02 1.331232970816122012e-02 1.748529428761446888e-02 3.130777289651684447e-02
1.012461951864723764e-01 1.528983681828400831e-01 1.544059350066716574e-01 2.242504983610700900e-02 1.089550341286161378e-02 2.153548286048303367e-02 3.850710085258662874e-02 2.196544249942261953e-02 2.276605120618850273e-02 2.416715454417834447e-02 1.730276965525250760e-02 9.713242433560649591e-03 1.029206123232222631e-01 4.948656554108231409e-02 2.919564240580146963e-02 5.029381307624265079e-02 8.764686612812204458e-03 1.250578737317052380e-01 1.399409969535869713e-02 1.942847678847118079e-02 1.201648579860195923e-02 1.266733913575840975e-01 5.896132722200747578e-02 5.531452420853413821e-02 2.241970833416573675e-02 2.314067000145527200e-02 2.040190206493657649e-02 1.751015329088438308e-02 1.989740262452076996e-02 4.706122812852057968e-02
6.824803640530585115e-03 1.314244326647161752e-02 6.656006810083888760e-03 1.294909278721042417e-02 1.849996916038778444e-02 2.102499931146013107e-02 1.887858943012651197e-02 1.803350470460933150e-02 1.455862607910170942e-02 9.108093056460968978e-03 1.232676830363582110e-01 1.424583447577264933e-02 8.654522391390132019e-02 3.197647584294913831e-02 3.638845568715287637e-02 6.639973475561856964e-02 1.457858768048014321e-02 1.719482670343904299e-02 1.494251657787522281e-02 1.267120764608447615e-02 1.781981151626125526e-01 1.056230897430966431e-01 4.259693135807958442e-02 3.570416262384785988e-02 1.699464068182401227e-02 1.756974147963315594e-02 2.700637668176335618e-02 3.058905694469834721e-02 2.933899582651032512e-02 8.518054488985947470e-02
1.387948856829311975e-02 9.100908928747630453e-03 5.306228475666174491e-03 3.070565031979301945e-02 2.227503504405218410e-02 9.489968598175527875e-03 3.090560389296823432e-02 1.507243091675203144e-02 1.311867935827647560e-02 1.440044754986615286e-02 1.057584458900606705e-02 1.503216940016122855e-02 3.035105749147310600e-02 2.368163150685565974e-02 1.149815657914148304e-01 9.649149696410679045e-02 1.123778953478333890e-02 2.835631770928612877e-02 2.774374005784177588e-02 6.698912014990622034e-03 4.695385542255187811e-02 4.923149321681920265e-02 5.353165416319670411e-02 3.501798774632453037e-02 2.044763586080070028e-02 2.845873390079883825e-02 1.005666662744785778e-01 1.823732091087175988e-01 1.031278956209724131e-02 4.448473255671734315e-03
2.334883067778967952e-02 1.528474739313294417e-02 2.404586085011244795e-02 2.245093537485079449e-02 2.405545762719633190e-02 1.367629694705167764e-01 3.104555740892200183e-02 1.382169511619361912e-02 1.436607784537180521e-01 5.164496061817758221e-02 1.764174999080610901e-02 1.682420742357702143e-02 3.526658449697795544e-02 4.115520372200629634e-02 2.029858288697752172e-02 2.172385445305220070e-02 1.061829340498039592e-01 1.047800238752207014e-01 4.538526678173866041e-02 2.706570558920669278e-02 5.979061315486053352e-02 3.799888319477469356e-02 4.352313246141820136e-02 4.779674871605698455e-02 2.659132454263798961e-02 3.175280027155968215e-02 6.079796470441599029e-03 8.227561367446926607e-03 1.090079736538503499e-02 1.374820840190902616e-01
3.208585194180826189e-02 1.636699972969622024e-02 2.566865782031416132e-02 1.936784303806112287e-02 3.643741478960569463e-02 8.558849753526477644e-02 8.308677805085497303e-02 7.598457469259103925e-02 5.214125637815020253e-02 1.314067433681078041e-02 1.390735610221236207e-01 2.274237755770032177e-01 4.659656557899093388e-01 2.259381026970289641e-01 4.096055912617467543e-02 7.934962533226036507e-02 1.477415274882560303e-01 4.085080224052597270e-02 1.293875300248933241e-02 9.794785388776715285e-02 4.119909860187824513e-02 3.673572891364078330e-02 4.733318304958687717e-02 6.616657695783398352e-02 7.056489001803623040e-02 3.692342058049920966e-02 5.475457196097459345e-02 4.085738135024997997e-02 3.753259927835397858e-02 2.755013387130251373e-02
1.479763581236541448e-01 8.057354344837086568e-02 3.597097619745709407e-02 2.561792690142151649e-02 2.280424683481625803e-02 1.339741312821346175e-01 6.462448661151612428e-02 4.497508740951693118e-02 5.362483971637331537e-02 2.299230887311422972e-02 4.199499214659935253e-02 2.736679867230056296e-01 4.764565891053536006e-01 2.437529114494758342e-01 8.671386275267439769e-02 9.672949494159825690e-02 1.067154560290718701e-01 6.287285979952374204e-02 2.091489037891985925e-02 2.223367996272375136e-01 3.925100249548411219e-02 3.988367763319346226e-02 4.704175811403965568e-02 8.398509644521155726e-02 7.967035031018075697e-02 5.653978575852483535e-02 4.323435975599895786e-02 3.908585025078954722e-02 4.263979519231954340e-02 4.619621310780851198e-02
3.515732249100750328e-02 8.257253082794141497e-02 1.800379655822539893e-01 2.899842577810038055e-02 1.929480129148359452e-02 1.107726064411283656e-01 6.392825658867178074e-02 5.666666768564948553e-02 7.273838677053370838e-02 1.235851680174623532e-02 1.376380249966333014e-01 8.898264606360331563e-02 3.502130023038635409e-01 1.487881888920917217e-01 4.637490889479312095e-02 5.325107769368463140e-02 1.963844551182960391e-02 2.879392659074328509e-02 4.012323027138862963e-02 1.707444117949184076e-02 3.746147267809631087e-02 4.098860178170461721e-02 5.132849865945525447e-02 8.512295749148358903e-02 1.076983404758583007e-01 9.506138072900252589e-02 7.005389981587412107e-02 6.572038800081587973e-02 5.766028426030384013e-02 4.795925614540022530e-02
3.035817203844140208e-02 8.318102505805753666e-02 1.279829417089957955e-01 8.735845223152653716e-02 5.110402809861043505e-02 2.243625067164370657e-01 3.602549487136331996e-02 1.993390605463090867e-02 1.005040603893862516e-01 3.235305941570085914e-02 1.145314203694633992e-01 1.437043404249442081e-02 1.578994392225901433e-01 2.123858405728428767e-01 2.254401083042338050e-01 3.032387128083802175e-01 2.726836594988548690e-01 1.769819681218895990e-01 4.834612747293755008e-01 2.276014998953893032e-01 2.631842696746528043e-02 2.433195642343557452e-01 1.807125793288792137e-01 1.842027952417830960e-02 3.361410773067233237e-02 2.792091451966504517e-02 7.036132649502344072e-02 2.831650832171313595e-02 7.805101620608918822e-02 9.051441363359541414e-02
2.813307196983702574e-02 2.712173513767206917e-02 6.493010879096985932e-02 4.512590893503146822e-02 1.672511551097405624e-01 4.219541284342244458e-02 1.819328827111936497e-02 3.233668744888780477e-02 2.432623753298579841e-02 1.234402318879054827e-01 5.054777707723277433e-03 6.958618162950225283e-02 1.409136745470052909e-01 1.781695440306984290e-01 1.604127937801407278e-01 1.933018219455648889e-01 3.301102972688340076e-01 5.714686987209514069e-01 5.828955001729383412e-01 4.583834763676152280e-01 2.475965635702843601e-02 2.956034280342739046e-02 2.560749514651154690e-02 6.508901407970546504e-02 8.135066044921127060e-02 4.160454866522997897e-01 4.143658091884901418e-01 9.542814247764411228e-02 8.053075211675339573e-02 6.179244139818964449e-02
2.568950527716610394e-02 2.704907325517852401e-02 5.308962183276274421e-02 5.630329786877494996e-02 3.676023031465219804e-02 4.450048957206140937e-02 6.540464794660673375e-03 1.595716113544911816e-02 3.536862248704571859e-02 1.260296742172014803e-02 1.292782399481098680e-02 1.028878877558362520e-02 7.976450099950130324e-02 1.609696576281761382e-01 1.496390845686451088e-01 2.285628019777274367e-01 3.966912992257711768e-01 4.838168785763770630e-01 2.807024743888053564e-01 6.132200110971004064e-02 3.677325699530003406e-02 2.521821683300339290e-01 3.670310679434324874e-01 6.171392168253346799e-01 5.830203567586088598e-01 7.638691078467382267e-01 6.125360905239022324e-01 1.891608267277810063e-01 1.178850283123791809e-01 6.920195578467053243e-02
3.278965505544603060e-02 3.691217589306378111e-02 3.487708667635742305e-02 3.177927394449748394e-02 4.671512249651878917e-02 8.251664283038670500e-02 9.629591571440773712e-02 3.079449666582813050e-01 1.495307931321908090e-01 2.536637977500823954e-02 1.864288967467652922e-02 2.889163894722758530e-02 5.688480661708059105e-02 8.360531034836539421e-02 1.101361976797187170e-01 1.971028442682527804e-01 4.265495800545240357e-01 4.316694763953787817e-01 2.054943761065736729e-01 7.075693975142816061e-02 3.046074231641316410e-01 5.516305008261582765e-01 7.066528650377046361e-01 7.295801137956945404e-01 6.480562318098676000e-01 5.649345766124481694e-01 8.414260959978786536e-01 1.534357847541510667e-01 1.554487371086827885e-01 8.386533661721121136e-02
8.190239042477337472e-02 6.342412208053299638e-02 3.078616133593774229e-02 4.336725225318217164e-02 1.173576024286153083e-02 4.776405085380808213e-02 2.533412609386944125e-01 2.037785070590561465e-01 1.993908241966365624e-01 9.911107239239289046e-02 3.900736752186825806e-02 1.054387974528679314e-02 1.025129043048139676e-02 2.403623795826568404e-02 5.408815132646280222e-02 2.483730653062475313e-01 2.620521845621344159e-01 3.158615897825964303e-01 5.534555166200225834e-02 9.791992592609885526e-02 3.370318714671491356e-01 7.271995685901212481e-01 8.949143109960336906e-01 9.346431336819650548e-01 7.800926306393449750e-01 7.632888900342681415e-01 7.189331178747611073e-01 5.773472285035243790e-01 2.987239553145764129e-02 2.037269604888070074e-02
3.289384652592520358e-02 8.972309669679838506e-02 1.563939287793981447e-01 2.142000837692490181e-02 3.676039182058487426e-02 4.987461263889921004e-02 1.572793375861854248e-01 1.963003487888473897e-01 1.341562536015564466e-01 1.037770457352447384e-01 2.598413163589721048e-02 1.661887283544653537e-01 5.075901556465044900e-03 1.177525837281465614e-02 1.981930147888365593e-02 1.171301982394897107e-01 4.470145439300382550e-02 1.475968587470643037e-02 1.883068359359547639e-01 3.595223489987533355e-02 1.331497001485463239e-01 7.094164570490180122e-01 8.981144184515179596e-01 9.431829956165489470e-01 6.920997453443209491e-01 3.234144117068141200e-01 5.280360222620420485e-01 3.592209437875540923e-01 3.228647464276492712e-02 1.258304233927465612e-02
1.474632175494104691e-02 2.123126789075504076e-02 1.331395006355414259e-02 1.412232235642234095e-02 2.752590664591918548e-02 1.575329268966744328e-02 8.098256359480945910e-02 1.044595966692171141e-01 9.594595589956703141e-02 2.255874365939903453e-02 8.943230910930081295e-03 1.131517417213319388e-01 1.944938525307255417e-01 1.049994410681746176e-02 2.723726774596328670e-02 1.759180354465029322e-02 3.092704799401787413e-02 9.472984281385321559e-03 1.769659254073880500e-02 8.361720605358605174e-02 4.400111496820070522e-01 8.354002994434035489e-01 8.991908026653372410e-01 8.538117974568414370e-01 6.556858909615723707e-01 4.806001136078893454e-01 4.658565163913110929e-01 3.288405206687322613e-01 4.565871910789866261e-02 1.760888981702473516e-02
3.289258729589097929e-02 2.957365761511627361e-02 1.490291709444036168e-02 1.051116434173040085e-02 1.336046172934231974e-02 7.116846134732967427e-03 4.209119374615499787e-02 3.747917138906173978e-02 1.055008990615725201e-02 5.912380899126185030e-03 3.647755435634511458e-03 1.718652813458675099e-01 9.633357806788098165e-02 4.484656202430545302e-02 9.654873457898988098e-02 5.072578712382098086e-03 1.744068709061376982e-02 3.955023843818710610e-02 3.789595604170031135e-02 1.693237704310757707e-01 4.653502005918477291e-01 6.769107383006544021e-01 2.764188336723826245e-01 4.133711759594572710e-01 5.308546440534501754e-01 2.989692142518494133e-01 2.219424761459349582e-01 1.982718505721977886e-01 2.071154223510719150e-01 2.258870429447296935e-01
2.654905275536342465e-02 3.000920638951484753e-02 5.202613020462827642e-03 3.655633091078754060e-03 3.018831099117642944e-03 3.487524029131145072e-03 5.378584038383621424e-03 1.271745716063815146e-01 1.947287615331575643e-03 3.056554011449703206e-02 4.505794220926619825e-02 7.161948043725900603e-02 6.763290895703352734e-02 2.126431121795336054e-01 9.722711006503449022e-03 9.382375742637621974e-02 1.728058169259070187e-01 2.483277780222588049e-01 1.686009396464385468e-01 1.267278651398816014e-01 9.035596177795182649e-02 3.247218025542070174e-02 1.266276339906534723e-02 2.733319554273375140e-02 9.814385782371848332e-02 3.285968103367578608e-02 3.568263930796985312e-02 1.702832902523824382e-02 3.964978985173656795e-02 3.712193164294563807e-02
5.525999414283483402e-02 4.591413856490039747e-02 6.132580111882805426e-03 1.938391950643138517e-01 4.335099712650669623e-03 2.444587791905086013e-03 4.044027067770185682e-03 4.491037469477336674e-02 4.245588475276407259e-02 1.838224191128158894e-02 4.619687880380847489e-02 8.397712622151529138e-02 8.708072461760037186e-02 9.399548119517863246e-03 1.070846154881366363e-02 5.264705142063853122e-02 1.914019477421838034e-01 3.543530326547572606e-01 3.988278560495993053e-01 3.456851198667841851e-01 7.414087722622854371e-02 1.667736134525225206e-02 2.092262337816160403e-02 5.163775034607877984e-02 1.142655608505081244e-01 3.352389196018341205e-02 1.505889141310868054e-02 1.440222565824761936e-01 5.449473724679797931e-02 5.261812815623658629e-02
6.855999086428896105e-02 9.507314173508777874e-03 1.946095296543277620e-01 8.068833001679479033e-02 1.032047350660730139e-01 2.280376068598065631e-01 3.090873292222203958e-03 3.667838176189384958e-02 2.137665398438493014e-02 2.439489344870014731e-02 4.418317611375103399e-02 7.404900755948590207e-02 6.504031816281317935e-02 6.028616747146652369e-03 1.618396312452382441e-02 7.422748282097561823e-02 1.428408426762461658e-01 3.266500371287068827e-01 4.093912923160160644e-01 3.482363645771929805e-01 1.765745049501645236e-01 1.174764011893454987e-02 9.279191425754082165e-03 1.956595075714452625e-02 1.015706323421650403e-01 5.640735670843347038e-02 5.878224242270173316e-02 1.569181453313636676e-02 4.402077713491268918e-02 3.989794964675309752e-02
3.785013358981859782e-02 1.295705561936557823e-02 5.328622245090757457e-03 5.323796576800405612e-03 1.141865823407273682e-02 7.787311562246108931e-03 3.542630205201945885e-03 1.432644572226342561e-01 2.158972878294529718e-01 2.757940991336419456e-01 2.599308093787520979e-02 3.074957950765887932e-02 3.899398036737436457e-02 7.373175112846057366e-02 6.862115939272323342e-03 2.256448703777073558e-02 2.395543785484090596e-02 1.013340279791831444e-01 1.292278071823363683e-01 1.071422986658424337e-01 1.056251618835505335e-01 1.944334320483950135e-02 7.528651521028918714e-02 1.220067638797986964e-01 1.853919058695110283e-02 4.284172576916187719e-02 1.147528020650454145e-01 7.547226535263713842e-02 4.969866686999163674e-02 4.353687272193867974e-02
1.354117874367043867e-02 5.341140961552675454e-03 5.576197610464040180e-03 9.324574767425437838e-03 5.332891703285268757e-03 2.613401009499677526e-03 1.392291319621178636e-01 1.014384551285398006e-01 3.439609623939146599e-03 1.320656691152247847e-02 8.301603573905858013e-02 3.028281667219710413e-02 4.461147037277850974e-02 7.845484042920584933e-02 6.602031808740038005e-03 1.182628998454664931e-02 1.129240605025449463e-02 1.681579009573255790e-01 9.672218303318019794e-03 1.494737796824937084e-02 2.965340784240089872e-02 1.659529412990190522e-01 8.070615053189764132e-02 2.657456907926643991e-02 4.669163431426930772e-02 1.073443200010704666e-02 5.135237879957550711e-02 8.102189602750309305e-02 5.505620526184344665e-02 6.719584835086779562e-02
1.372476475732548051e-02 1.094394226542371590e-02 5.216582624500518128e-03 3.784315313923383283e-03 3.694989014978655555e-03 1.691421912170884001e-01 1.156947110404225321e-01 1.212665169318722647e-01 1.330192367046386104e-01 5.526491747459519321e-03 1.521065830061415491e-01 1.382346820885647087e-01 1.111421500715045196e-01 1.114591017200770029e-01 5.877100521645760994e-03 7.278714194940602220e-03 1.497208049592201329e-01 9.459903001702468783e-02 8.288598391741464066e-02 6.215568420625336432e-02 4.934689271955775697e-02 7.030877390354216272e-02 1.003489851011176714e-01 2.176421475416916440e-01 3.304703603014838564e-02 1.660975247148986367e-01 3.055171645648841611e-02 1.927091652446867864e-01 2.003898595625640544e-01 1.323876618342299805e-01
1.864189058459524151e-02 9.651545991018976173e-03 5.363098522879057931e-03 7.244408638094683786e-03 6.665297618763142001e-03 3.696117944270249298e-03 1.290245192384331663e-02 1.077976538537627794e-02 1.834817397693513930e-01 1.334088799059897079e-01 4.861030506539996965e-02 1.026431942463093133e-01 7.823131041608982414e-03 8.200444292511061689e-03 2.409647069559296348e-02 2.581550308374827227e-02 1.706311296428565660e-01 2.054349905793934894e-01 9.392243983512167660e-02 4.148635019243271382e-02 3.969165155074736578e-02 6.045822626615585810e-02 8.693692591332716213e-02 2.361745227375260936e-01 2.745437870487612078e-02 5.698641108446966808e-02 7.115989483402332394e-02 9.025392256564672422e-02 2.887412708086532498e-01 5.889533241936947133e-02
2.504322938736102538e-02 2.152434633753604054e-02 6.391874521908002572e-03 2.161345922241547993e-02 2.513969995590183831e-02 4.706223294006738056e-02 3.118528017168824967e-02 4.407037183538476885e-03 1.851104022720521658e-01 1.081948745745415497e-01 3.219758890778453425e-02 3.668944479804474301e-02 3.995309445700719053e-02 1.429768229498069032e-01 1.689976821392825401e-01 7.276597801496936802e-02 6.059433408553407951e-02 6.591424377151409997e-02 8.805659167767371232e-02 5.057224462819918942e-02 3.545672184763990625e-02 5.221466761271796597e-02 5.653793723973217500e-02 8.554412327834015617e-02 4.102920389391068873e-02 4.388660463087012964e-02 6.845981350689044065e-02 1.095492270185393635e-01 1.233360995817713301e-01 2.402080849170043497e-01
1.356676263220230050e-02 3.351288411411906115e-02 9.876161952556569701e-03 1.051360063132942592e-02 5.103261131433908110e-02 5.390390792137503273e-02 3.576080765199621259e-02 2.957735074175400596e-03 2.547173130130900298e-01 2.395474279166424081e-01 9.756456614146065409e-02 4.845127848441765223e-02 2.881329059957033617e-02 4.530081082469106235e-02 2.065356862402208116e-01 5.414278917748030495e-02 1.463457936091528966e-01 3.812844849582223278e-02 5.027698127813189782e-02 1.325672412407610454e-02 4.956297927417371157e-02 6.907627630364987503e-02 5.836423623393992288e-02 5.871401235822207298e-02 7.705078256870409592e-02 6.163522731909059499e-02 7.649852798938036602e-02 9.194684055419904967e-02 1.136963545040508838e-01 6.511637198228920065e-02
