2.810212754178358918e-01 4.049258085887479930e-01 3.407229384184377596e-01 4.211574328003933054e-01 2.924217876046055764e-01 3.447345998526329947e-02 2.351403105422427905e-02 6.339568773440941440e-02 1.151259553110253325e-01 6.027912374289437492e-02 3.968043403224853771e-02 1.668299838979331040e-01 1.130021615534818891e-01 4.458084364184304316e-01 5.484694235740660284e-01 1.294775578699653429e-01 4.845706373059814331e-01 3.085053532963212206e-02 1.915588359082186914e-02 3.502055602354736119e-01 3.282514430483439161e-01 4.916168686828992912e-02 3.772036166261916873e-02 1.545316984312996023e-01 3.117038870551749330e-01 2.537833378715224075e-01 1.209090915843564207e-01 1.081645934657256281e-02 1.048853838377353069e-02 1.339748343869322580e-02
1.870777176620420090e-01 3.989731484232513781e-01 1.040187185015547106e-01 5.251477654825972285e-01 3.581816683987307237e-01 1.096246667405320341e-01 4.246381771041062708e-02 5.278400717360413191e-02 3.131267527363001957e-02 2.752111158364002261e-02 3.986723019063387330e-01 8.544287719866525133e-02 1.322029210906959518e-01 3.407645077470733419e-01 4.991799960722539398e-01 3.526634645420630432e-01 4.417098378265137959e-01 5.480405735980119208e-02 2.887775020098519788e-02 4.182284213609881451e-01 1.880731237991843663e-01 4.717140216368609362e-02 9.796487559465157091e-02 9.024850449966792532e-02 8.394769770164768607e-02 1.180889147324699628e-01 4.348144053561178723e-02 1.115588461012939105e-02 1.601330014771281188e-02 1.614715645478695047e-02
1.240924689858014657e-01 1.263686644190877839e-01 2.598979500876512638e-01 1.949488810715082898e-01 4.534764843089491571e-01 6.810281400292535203e-02 1.602073886786357926e-01 1.689474165963232299e-01 1.561803480257704657e-01 3.963797978946256850e-02 1.023140442584034027e-01 7.549764845266131175e-02 5.012997656863297374e-02 1.148578277503267825e-01 2.039389661648699226e-01 8.807962929103654859e-02 3.582766980472273932e-02 5.091072052633038164e-02 1.430457023185561782e-01 2.721956336522353068e-02 1.184805218313365466e-01 3.907316584334719761e-02 5.946565699606533306e-02 2.142691415196600405e-02 1.348734164015653880e-02 9.416498653579489717e-03 8.901800593065254535e-03 7.004087637977487665e-03 1.196331902877800953e-02 1.343307036074754129e-02
5.198133786224640868e-02 1.486236723356131328e-01 2.651996013189414914e-01 2.149781503219119205e-01 1.109666459858280191e-01 3.235808280763935452e-01 3.232444504793582363e-01 2.018906486846077375e-01 1.101951979745103283e-01 4.345030303574937830e-02 2.460470294162958940e-02 5.871594839993007214e-02 5.728756952800689167e-02 4.734428576671216304e-01 1.521308047244451234e-01 1.288053796014473618e-01 2.802977782447865773e-01 5.448146902910953049e-01 4.333573385488802554e-01 3.999686220291644445e-01 2.205509081399527060e-01 8.534120571748654571e-02 2.859431580474633763e-02 5.802686918533048882e-02 1.113243046491426032e-02 8.340300706036630346e-03 7.508971789061701096e-03 7.119925775598553302e-03 1.443973745056832680e-02 1.567466843091955969e-02
5.681008500209427936e-01 9.291839198285868628e-02 2.087315284186390119e-01 8.091470007715034773e-02 6.393159165559415824e-02 1.881970790218334411e-01 3.301438281142575759e-01 1.870287148608607009e-01 6.934131236058717340e-02 1.058002840993194915e-01 1.107104355868653023e-01 1.255210958222859052e-01 3.594437321476726122e-01 3.767775078000203393e-01 2.007599082275297875e-01 8.271706440156348372e-02 7.700006046841632867e-02 5.517070859581155728e-01 5.029604749306753469e-02 5.157763984931039714e-01 3.669062445228446490e-01 1.141201290393987766e-01 2.904959074852307976e-01 9.770719558317139675e-02 2.027950778611065791e-02 1.109140240489474641e-02 7.954135390970040395e-03 9.184989636479380659e-03 1.433907757609907511e-02 5.264381854548241119e-02
4.222300933877050355e-02 4.469945079187750969e-02 1.409578255148515036e-01 1.147859385566359081e-01 5.266761813218159838e-02 1.062378364573966089e-01 1.383118934938743771e-01 1.505738351431946953e-01 1.246362479232180492e-01 2.555772942848302809e-01 1.478374049526203771e-01 1.054856815426653271e-01 1.644842949603223525e-01 6.341624555381435158e-02 5.446522593384489630e-02 9.732451574768208324e-02 5.316488862478289112e-01 1.361837724953666173e-01 4.327531218646801237e-01 8.083849286359380548e-02 7.242360018308151293e-02 5.471328123549136502e-02 3.700082584167699307e-01 5.837834057683075756e-02 3.052944488143664870e-02 2.886087848687488716e-02 1.831091095955104942e-02 1.260131808869583217e-02 1.659851597852046376e-02 2.975987259539435853e-02
1.015109425032229978e-01 1.565871384925634213e-01 1.551165507943538802e-01 5.820934041405891740e-02 3.475943663048741694e-01 3.516700111123991640e-02 8.296228427597700239e-02 5.458132236129262793e-01 6.354232837615291229e-01 9.328397921814995941e-02 4.741576019100868233e-01 2.012341332415091555e-01 9.196442808572523331e-02 4.387541908649350564e-02 2.653300758840125909e-02 5.036760586184721444e-02 2.892619935865797243e-01 1.324856946008255987e-01 6.356583522641525708e-01 5.998010607125790067e-02 4.394798732762621452e-01 1.217998528197010988e-01 5.626971248878844672e-02 5.379089841055786914e-02 2.080951956481225801e-02 2.135981344196016124e-02 1.901105687888466483e-02 1.647537484754665882e-02 1.906544360221755496e-02 4.484408529684719147e-02
2.066727529851515033e-01 3.877028822159072630e-01 2.108793047118310837e-01 4.178344952965697967e-01 4.352104483895730125e-02 3.815442017462913893e-02 6.021724540957922728e-02 1.060280824634882990e-01 5.715959277863472687e-01 3.180634086519946169e-01 1.248571629014886136e-01 3.710602570547399393e-01 7.996787423742342249e-02 2.854563819022949006e-02 3.314912267822692216e-02 6.389995873764073298e-02 4.911783622100421853e-01 6.263858397843331816e-02 4.039175159480334204e-02 5.154449452364966433e-01 1.693272183970225830e-01 9.731888599028634679e-02 3.857398748294810914e-02 3.217470275063387397e-02 1.533655739521635510e-02 1.617117967994316161e-02 2.632473256956656057e-02 3.405089628349087377e-02 3.353732454406560537e-02 9.658739140268865486e-02
4.670511548883042319e-01 3.043370365049072879e-01 1.753694148652620854e-01 7.889925158059575561e-02 4.311453752427497899e-02 2.554406166175509085e-01 8.522035049242875082e-02 4.464301923245752590e-01 4.336721527755171279e-01 4.355687790353356958e-01 3.811747977823987665e-01 4.681384232516406230e-01 9.456907387695775991e-02 6.541207965752531273e-01 1.034402591452539127e-01 8.885652680146367832e-02 3.564144349862943817e-01 6.282592287991992097e-02 5.580894301411819247e-02 2.152240898713939643e-01 4.271030185313440947e-02 4.344337289574370931e-02 4.696055313519263696e-02 3.061595940433108065e-02 1.795818069072348255e-02 2.756791550333620444e-02 1.098001040202123413e-01 2.215489814100283228e-01 6.328129435819658255e-01 3.094918493082495781e-01
1.157574223027634380e-01 4.263236561479165077e-01 8.845133694285900461e-02 3.773766297989744611e-02 3.630088655616033749e-02 1.183785708374739121e-01 6.988416140472218652e-02 2.872959793896797676e-01 1.417239872669593947e-01 5.067536721405629246e-02 7.776560182333915050e-02 4.513343168726546839e-02 8.252649766083991478e-02 7.235088688122036371e-02 3.578517981321001351e-02 3.016079657915691700e-02 1.488348267291791649e-01 1.624991700555000473e-01 7.111201641725474476e-02 4.026241501186176436e-02 5.142939374895022508e-02 3.238110167264299233e-02 3.701276354995794438e-02 4.064259607900472943e-02 2.273516193724938600e-02 2.922270924686246746e-02 2.834296477043695694e-01 4.887773972599433470e-01 6.090039978563634993e-01 1.601638496356902752e-01
6.500821065528501752e-02 2.867929660709742090e-01 1.418208849395124205e-01 1.225676085952554228e-01 1.365850190645050977e-01 7.678047628205157682e-02 7.166182677621099617e-02 6.575819130079665897e-02 4.578792346987175382e-02 3.604301645204661120e-01 1.981618603240413168e-01 2.824816821100705755e-01 5.787001906100713855e-01 2.803858872237883770e-01 5.076997238380861338e-02 9.839546864429611628e-02 1.834968709970476175e-01 6.976724712527013206e-02 3.471260635741140188e-01 8.430496332057350883e-02 3.459104398138387187e-02 3.074267801042462889e-02 3.957463114473737387e-02 5.535440006069775737e-02 5.923013955191618746e-02 3.232404366171996724e-02 5.231994114013205355e-02 4.229076618277056304e-02 3.850926186373687665e-02 2.810319430784427586e-02
1.174890252322209200e-01 6.871735528173558705e-02 6.314534105250315665e-01 6.201590721130033623e-01 5.071051894947752325e-01 1.226691526448994152e-01 5.364777167574453359e-02 3.676109920974662132e-02 4.497800220473233829e-02 4.034301804147810006e-02 7.768733920941488236e-02 3.368385113183249291e-01 5.907031204030268601e-01 3.017235439145601883e-01 1.071440467418679210e-01 1.194227340491505612e-01 1.317962452247878613e-01 1.086630969418268255e-01 5.804500646195690505e-01 1.920393086902378310e-01 3.307647057842016264e-02 3.341955986173355403e-02 3.941608571945918321e-02 7.048467956416479274e-02 6.702645406568230602e-02 4.782038886841603886e-02 3.692401650290647042e-02 3.447185343046198225e-02 3.857950826830091468e-02 4.287685591292096643e-02
2.790209071564314636e-02 6.990092792852010961e-02 1.662688781438203534e-01 4.638295690688036821e-01 3.083369091038200005e-01 9.987679841989501039e-02 5.236320129006318685e-02 4.474453988230106538e-02 5.875880101263656480e-02 4.072704041878345560e-01 1.155414782430450593e-01 1.086974951060828976e-01 4.335374273324833494e-01 1.838651976230942509e-01 5.719606132369876167e-02 6.558374114090562146e-02 2.416746538900914690e-02 4.493563898706615795e-02 6.315438593061445394e-02 4.031474464548573944e-01 3.155295406555403553e-02 3.440539112187477461e-02 4.349770898962664750e-02 7.229431933300863033e-02 9.167924890263497162e-02 8.019011392763310264e-02 5.934871431920014928e-02 5.737625405508593734e-02 5.181495859855146657e-02 4.432021446427399786e-02
2.415639600949564050e-02 6.883711010503448802e-02 1.218530377526272079e-01 8.736187805996938061e-02 5.158061856511078624e-02 1.994487161584847512e-01 6.277140556059564169e-02 2.954431900358888211e-02 7.879248710959695090e-02 2.633361311663520721e-02 9.551329255771291715e-02 1.921204475512951204e-02 1.953880675745985895e-01 2.620897223386692287e-01 2.774792140522824857e-01 3.724864132725910215e-01 3.342049611351713967e-01 2.165918350185246644e-01 6.236263260140465503e-01 2.929853737256430390e-01 3.214951587802587080e-02 2.048992907497927951e-01 1.541685097487965062e-01 3.672641418877732322e-01 4.664279116661813884e-02 3.323694354266223949e-02 8.430851598691641025e-02 3.384819123553844955e-02 7.013447219436952373e-02 8.366646382041358077e-02
2.302485795576152822e-02 2.301075090601985285e-02 6.181677813892065554e-02 4.571214972612557270e-01 1.650435797646614966e-01 3.677862838517757804e-02 4.267771993796965480e-01 5.430016842750582523e-02 3.045542207225495832e-02 9.797699239649479419e-02 2.071470753470175674e-01 1.007413035743421753e-01 1.871112588406232680e-01 2.204210315165779643e-01 1.979101489699910399e-01 2.379659970248547141e-01 4.051807220797943865e-01 6.996364416242534245e-01 7.116815112242292907e-01 5.583941237241228928e-01 2.930933764632257313e-02 3.627214617311257105e-02 5.094617275192777628e-01 9.740375407988009770e-02 1.202645967312078734e-01 5.182813486823241167e-01 5.204639670922978079e-01 1.197666266809219726e-01 7.296407642151325756e-02 5.731451298178742021e-02
2.149803617762310881e-02 2.321636301089612803e-02 5.126440558529319486e-02 5.594639367495229942e-02 3.697923645068209447e-02 3.868024257463292120e-02 2.134752771469027310e-01 2.650385810603474168e-02 4.431765220053908438e-02 5.004797143472263787e-01 2.049318607757119604e-02 4.546763156299853392e-01 1.066302185750025999e-01 1.998678279728719476e-01 1.852036207579969285e-01 2.822540198397082700e-01 4.880834241308045773e-01 5.929479677500152368e-01 3.426138875158721286e-01 7.465013784621518655e-02 4.485219477675837091e-02 3.238891365872040851e-01 4.713865317241084374e-01 7.993014390268079472e-01 7.312978132884541127e-01 9.713178374150686079e-01 7.898696453638672788e-01 2.450516158241904940e-01 1.083431471457877021e-01 6.463256322448987512e-02
2.794182894789645766e-02 3.186760372083997928e-02 3.043553260398160556e-02 2.803219771766593885e-02 3.953335526057912691e-02 6.580071618876355555e-02 1.135852624527544236e-01 3.584537834706642001e-01 1.887444969141055251e-01 3.337700854517326038e-02 2.762698877253604371e-02 3.874180130935977323e-02 7.695531807516137190e-02 1.042465682011682881e-01 1.369025423304178202e-01 2.444505787162011001e-01 5.265181138968640928e-01 5.298753377317541036e-01 2.508589319163224141e-01 8.612668246985669129e-02 3.719376462750386692e-01 6.756678414778215513e-01 8.678001895933866727e-01 9.089552488441214884e-01 8.238156006319466984e-01 7.333620852225420927e-01 1.113859675832586937e+00 2.036705103650586490e-01 1.512259659608633788e-01 8.247488852292508832e-02
7.057812707312022260e-02 5.463009999458286886e-02 2.601668700012136487e-02 3.569687859264107643e-02 4.132352706868354653e-01 6.287113881636625934e-02 2.859665747149121584e-01 2.303482274432752108e-01 2.262293317620283073e-01 1.156747687852752171e-01 4.662597043904465749e-02 1.543366513174091077e-02 1.821678980770006714e-02 4.289614866980172303e-02 8.176613181583883283e-02 3.099379679721236958e-01 3.443864719151557563e-01 4.096603934890879484e-01 7.134770117004071710e-02 1.189788968864626123e-01 4.122117233541372494e-01 8.918453006451331211e-01 1.099009200744737180e+00 1.170585777401443206e+00 1.004373207649758681e+00 1.011488523816863827e+00 9.766458924033130096e-01 7.852455006863172660e-01 9.047180005409422021e-02 6.441807397549967895e-01
2.855450876871998278e-02 7.779852390332578360e-02 1.318126761979107886e-01 3.482369697651121337e-02 5.164174721870296025e-02 6.891473671227354991e-02 1.853223824826913391e-01 2.315471653729851143e-01 1.587764159605700998e-01 1.395791961909587098e-01 3.535624628048180534e-02 1.427428605854951238e-01 2.238507442581302576e-01 5.333892172236550655e-01 3.980908038605542043e-02 1.505831234290192222e-01 6.798203126627302972e-02 5.183559435282386607e-01 1.640229826154853965e-01 4.500171099370726957e-02 1.676107090364871433e-01 8.950338388787968391e-01 1.135035303958355613e+00 1.208423998926486664e+00 9.036647661883838722e-01 4.309251263799830922e-01 7.165731857942306826e-01 4.884545752735661162e-01 1.261410450977793751e-01 4.667148421818566040e-01
6.031538416332768993e-01 3.983695608236615532e-02 5.274130784075317102e-01 2.173112141146654394e-02 3.393030191660846573e-02 1.935782101322490803e-02 9.953885014133716236e-02 1.285800726638509917e-01 1.322791670366471883e-01 3.964692178619946827e-02 3.846883070889813294e-01 9.952712120875312207e-02 1.767174148268677303e-01 4.351133988797317720e-01 5.882015143120136041e-02 2.428132978090949412e-02 5.185366092285609990e-02 4.136092689167769065e-01 2.748440953586046495e-02 1.079157281805142449e-01 5.703591628476345488e-01 1.083605756558062128e+00 1.166976149214528746e+00 1.117072665212396121e+00 8.676341894573296187e-01 6.437916449883482883e-01 6.310109569721483735e-01 4.449321550551671445e-01 1.004812896081251627e-01 3.583488928271413299e-01
6.038062050078861487e-02 6.888934153228232216e-02 3.026476220206348808e-02 2.435965920541267177e-02 2.606371951859524916e-02 1.340509669043940880e-02 6.910506040677723283e-02 5.837751365029282546e-02 1.644577562871791382e-02 4.238666319889247136e-01 1.714247666105042645e-01 1.516324497864552645e-01 8.650215263108534947e-02 4.116633447518647931e-02 8.981561323352507675e-02 2.643584856930841775e-01 2.807004731926244015e-02 6.065222457635051356e-02 5.731407523669018039e-02 2.263162283204556424e-01 6.214168768336605364e-01 9.258560834759376190e-01 3.774050735481584429e-01 5.652916875729859791e-01 7.114708431167897640e-01 4.026508808865512656e-01 3.257068775725316390e-01 2.884957573660753560e-01 2.007994009979748584e-01 2.183750344565389412e-01
3.351996595857384409e-02 4.787583310342701653e-02 2.682233977375743650e-01 2.310488058223683083e-01 2.159025862189545009e-01 3.167391573693426055e-01 4.448306341377256667e-01 1.123597945440183571e-01 1.566403392046706589e-01 2.709850518512469525e-02 4.001811385104372260e-02 6.301014802934576386e-02 6.117648642849780882e-02 1.990255297112785426e-01 4.544957264290702681e-01 1.715797733554334514e-01 2.459367736319009734e-01 3.383377188441669126e-01 2.286794723307020161e-01 1.712917950842336168e-01 1.366960001821668769e-01 5.040816062204880876e-02 3.754775766781701107e-01 3.782533040668809021e-02 1.320140422708390715e-01 5.306573736488329890e-02 5.988447803581435636e-02 2.881889914832401756e-01 3.723188714294137919e-02 3.475939912524619174e-02
7.661614656610403473e-02 7.755028384828280275e-02 3.044005181276777106e-01 1.811200521740299607e-01 3.101188141616694205e-01 2.442161650679449680e-01 3.805664514753206440e-01 4.172296000429977919e-02 3.681630797148243567e-02 1.590427028213887636e-02 3.932402538109727730e-02 7.265876538906924920e-02 8.023835491471838222e-02 3.812247087683365843e-01 5.044914126891130168e-01 9.082977627587719704e-02 2.563666650801155189e-01 4.716125416861467468e-01 5.277131793993827813e-01 4.553758231904652121e-01 1.190157857919074552e-01 5.974637479899207460e-01 4.937697121909628839e-02 9.971077208859618901e-02 1.824577874908319408e-01 5.281125619936063997e-02 3.255198359746423464e-01 1.331685566426374923e-01 4.973872409079890811e-02 4.773925374371901231e-02
9.405780082669297493e-02 4.727080201854260144e-01 1.715408107853136632e-01 7.605739953163204170e-02 1.014316634085751512e-01 2.308640689424159564e-01 3.062537958859073428e-01 3.418947313979232155e-02 1.807832811313138735e-02 2.057072983196992638e-02 3.735090919787583535e-02 6.389728198363889278e-02 6.002624380163436302e-02 2.918358559407335240e-01 4.795678443515048739e-02 1.310002116414202278e-01 1.874208526020924859e-01 4.250104138611924820e-01 5.287967320628556012e-01 4.474905932647946782e-01 3.131298367694916873e-01 3.638407256227136344e-01 2.519625195569190068e-01 4.540086171340920185e-01 2.392678360481584054e-01 1.243464033279004927e-01 9.662972341792158693e-02 2.236108982688561342e-01 3.907161719354231011e-02 3.530238433905020373e-02
5.774234403424197831e-02 2.534654261433564107e-02 3.717500696929958437e-01 4.137775740387884538e-01 2.768135724380527823e-02 7.537312556471955638e-01 3.189389306407641733e-01 1.285777788459118165e-01 1.833908905139875478e-01 2.340917543370552301e-01 2.194529171947253235e-02 2.657466694069977528e-02 3.540650755893822582e-02 7.005097854897122944e-02 3.654535052293173547e-01 9.369590428499358081e-02 6.146638253285482967e-02 1.601041270201616074e-01 1.859327142709742142e-01 1.904144052535395870e-01 2.081084253494244474e-01 4.522972839321279803e-01 7.331836127263968717e-02 1.277537888907614716e-01 5.212928762316354492e-01 2.360156662668951022e-01 2.185034885326898046e-01 1.658193421019777680e-01 4.456126712479786811e-02 3.890643917543760294e-02
1.857862410296119010e-02 3.545314444222725792e-01 4.769870341725386265e-01 3.261891692851479063e-02 5.910100702041405363e-01 2.765882403672433876e-01 1.293039491942698516e-01 8.940157602939183268e-02 2.737556017443260048e-01 1.974233004403436187e-02 7.269360352793870217e-02 2.788346758671084169e-02 4.273413774567096091e-02 8.203996322037832023e-02 3.507554605329570308e-01 5.839094134942056646e-01 3.447083390428862804e-01 1.493985133357120798e-01 2.110113734517582440e-01 3.587225728780238376e-01 6.310559953645240583e-01 1.494932481653685474e-01 7.831051543597919440e-02 3.792211100025238424e-01 8.676327166928453627e-01 2.687476129929047275e-01 1.368355040473475392e-01 1.880232633061993952e-01 3.602955741590504468e-01 6.136922484683907802e-02
1.916231886908791385e-02 2.291830798321766588e-02 4.619743765810973568e-01 3.974487274382551560e-01 4.163526983280778637e-01 1.612129908995935945e-01 1.033124165403650069e-01 1.050701373705001523e-01 1.146822588384280861e-01 4.544799910295642675e-01 1.355733579744519413e-01 1.452544002298384596e-01 1.217410077273216179e-01 1.362196596816160066e-01 3.661860214941980995e-01 2.420314824147407340e-01 1.528293013223677721e-01 8.519978812854453465e-02 7.172119442485645757e-02 5.358470702669776431e-02 4.308880157756981438e-02 6.337670907943304677e-02 9.805626022786920193e-02 2.350601306118254852e-01 4.027458117533569970e-01 1.813517258347093208e-01 2.659845968360185497e-01 1.822934143017419240e-01 1.882139109392009790e-01 1.242292183531931438e-01
2.222685506456877763e-02 1.651450207558835884e-02 4.634772729217692122e-01 7.467461449734023038e-01 7.151535870589730282e-01 3.886009562879386703e-01 1.864032514664293663e-02 1.430765361943543527e-02 1.579519973850463666e-01 1.144667423448110372e-01 4.378554464352871212e-02 1.087998661491994118e-01 2.867572372072809128e-01 2.881486736639569668e-01 8.365083096174044108e-01 5.922599386236199193e-01 1.716443016003840194e-01 1.843249062285915452e-01 8.101588198727614765e-02 3.548478692575214588e-02 3.458625734013710817e-02 5.431358189198187691e-02 8.315309847650256825e-02 2.547157439230096077e-01 2.579523814991759312e-01 6.082518591518156631e-02 6.693451847735958082e-02 8.568681958125995424e-02 2.789254153012650228e-01 5.712934135725935419e-02
2.998039482951297963e-02 3.178557661697440501e-02 5.277910463182674539e-01 4.433810237586031239e-02 4.577908812528476423e-02 7.370321274283722635e-02 4.744239720546091638e-02 4.077161634958544334e-01 1.575433744311853790e-01 9.132159299800386709e-02 2.805315368768718925e-02 3.849917574608975601e-02 4.323984943904638639e-02 1.581059694851636444e-01 1.872497828965163646e-01 7.736722897382813935e-02 5.948876737291640404e-02 5.858784680570387760e-02 7.697184641371142277e-02 4.408911499543964607e-02 3.130253724541441629e-02 4.671944261820196870e-02 5.334078545297344515e-02 8.945433437538238830e-02 2.799533485668914690e-01 4.410821577793187093e-02 6.388597968206834177e-02 1.043746054607336271e-01 1.258790697539655945e-01 2.501962767003259591e-01
1.670094940167414499e-02 4.584418496896044970e-02 1.423325169612470881e-02 1.600373096510046556e-02 7.129669747534041202e-02 7.529015742047430459e-02 5.348889893160328063e-02 2.962740558881362674e-01 2.258880924277604785e-01 2.093432939419886951e-01 8.568493569005625199e-02 4.410196737362137576e-02 2.813664998359356045e-02 4.421103156106579585e-02 1.991663759100001929e-01 5.067872622489516532e-02 1.301853766651344668e-01 4.946243641160986970e-02 8.535203352360243301e-02 1.687539868671012189e-01 4.363971916284022090e-02 6.115859484364886967e-02 5.333802389261922683e-02 5.896745825215113368e-02 7.858056970518331741e-02 6.032234311586049530e-02 7.102427093848753814e-02 8.735072571918363338e-02 1.174690175262920605e-01 2.885704018790751224e-01
