7.245928998731548942e-02 2.555070744667159530e-03 8.380230509219351032e-02 1.642840458307116445e-03 7.678075952965066064e-02 1.602144489577604159e-03 9.519728326590623990e-04 2.576216581485073296e-03 4.682805704849614392e-03 2.133617650860319178e-03 2.179151475469722887e-03 4.854784554947420144e-02 3.055029582184953449e-02 1.137075532335251812e-03 7.789352980295733732e-04 3.256727738901435409e-02 6.273367256929064141e-04 6.729514006073659396e-04 5.810697899835055077e-04 5.513824991957092924e-04 1.003624737676021283e-01 1.577108986604375956e-02 1.225024646463317504e-02 4.852561071221443700e-02 9.209829417336927448e-02 7.059395049349770357e-02 3.168051868442784552e-02 2.792286524778221039e-03 2.671116536080604242e-03 3.366379748895775327e-03
4.697239892690135282e-02 2.520935156971859745e-03 2.064247671142685221e-03 2.133256889581971495e-03 9.493237367921914579e-04 5.092575167200232185e-03 2.063369379172757655e-03 2.546586852643346974e-03 1.354661512112368847e-03 9.234509042782074661e-04 1.357984584315649482e-03 2.444586832855626113e-02 3.535747749757801872e-02 1.031528205337643028e-03 9.716143276748057849e-04 6.591729311317371135e-04 6.093364402062402020e-04 1.257589212112166085e-03 9.040112934562669110e-04 7.394711085512431980e-04 5.884351143453472877e-02 1.542493601669040794e-02 3.264051677763060710e-02 2.890608108817002003e-02 2.492665089698576850e-02 3.251501301334257243e-02 1.109834880256303780e-02 2.827194382099372429e-03 4.033662384915035967e-03 4.042342798455305329e-03
4.317417575117779398e-03 4.121897939816465337e-03 6.648917681788077232e-03 5.399355617147459652e-03 1.151287149776954871e-02 3.477471831145697613e-03 4.043129856278871587e-02 4.307958445626890176e-02 8.106285000321034398e-03 1.356552674933829330e-03 3.569552849184390482e-03 2.960320771707593019e-03 1.116702745761971940e-03 2.514663811526064979e-03 5.434750379431817213e-02 2.775376619346366265e-03 1.210388824714406317e-03 1.854707240403690588e-03 3.667032204920269312e-03 1.408292035902635473e-03 3.773242650452646174e-02 1.299901020202579201e-02 2.030856233931115779e-02 7.001032629736527596e-03 4.024581724521108204e-03 2.564103978777459557e-03 2.211448301211713530e-03 1.742017964667716152e-03 2.980208201346965825e-03 3.349982341996245172e-03
1.491084849082712068e-03 4.100560388681205766e-03 8.993493789700978194e-03 7.257670173874422592e-03 4.139485497046607038e-03 2.786633340550093933e-03 8.199214349098025989e-02 5.165902481198417912e-02 2.839295890541462114e-02 1.855518306516130631e-03 9.639776754513764475e-04 1.925574298399365756e-03 8.790069022457540132e-04 1.885664815237183102e-03 4.192418651647811939e-02 3.798729172879098531e-02 8.238595411073969255e-02 7.172461992060226053e-04 3.162105928255703547e-04 4.635575301103366701e-04 6.641628012095011913e-02 2.698380111559634323e-02 9.482173921996810487e-03 1.859128202296185528e-02 3.312016675814098352e-03 2.298513382939227061e-03 1.916997845073507845e-03 1.820574173541121728e-03 3.701635176214170854e-03 4.024673805185753454e-03
8.584821526611499274e-04 2.555049736981306920e-03 7.123482316419837805e-03 2.763291491892781466e-03 2.647224941942691919e-03 4.774829983775577547e-02 8.437405816518843416e-02 4.822819181633138802e-02 1.799831574936399184e-02 4.893614684410519701e-03 4.486216854263460653e-03 5.138046470765427788e-03 1.076744906632878286e-03 2.135516993058953709e-03 5.509600626789258604e-02 2.299840488363056462e-02 2.776216527416483504e-03 8.293099976622852207e-04 9.527050479823206790e-04 5.574979230005080609e-04 5.419241714599842830e-04 3.514484243641852884e-02 9.203811631738921528e-02 3.029597667205747094e-02 5.996648478506398823e-03 3.118765182934680330e-03 2.127082473545374545e-03 2.456005405321364833e-03 3.837986070586828745e-03 1.409108943191584098e-02
1.555640275680548763e-03 1.632655025175656265e-03 5.540826532807512084e-03 3.579642782848893850e-03 2.119958102556767244e-03 2.709874227605884450e-02 3.505156678657662256e-02 3.783592626220032284e-02 3.113283253646873319e-02 6.941759103639868859e-03 6.059191181054630719e-03 5.013048874661565381e-03 4.751969026567092608e-02 1.790478437937963185e-02 1.511561962528796405e-02 2.632571909367728905e-02 2.121126015379024531e-03 3.521422977150754502e-02 6.322882641290146141e-04 1.269187458161812054e-03 2.270758867745284806e-03 3.735765396444374990e-03 1.118869169800768421e-01 1.752160023840506481e-02 8.970364251595966051e-03 8.275512553549278089e-03 5.120899111353490601e-03 3.517489600264606629e-03 4.627715496043485928e-03 8.286542214966073627e-03
2.497292309860290466e-02 3.755910946655392768e-02 3.680638672013761270e-02 1.751939512553832160e-03 5.929705027186753458e-04 1.493157790543173840e-03 3.152024886290252358e-03 1.785080958579660614e-03 2.224971530581320699e-03 2.291533273216996014e-03 1.974810082490876563e-03 5.795049797521518303e-02 2.720684661601577292e-02 1.290242330532479290e-02 7.556290611769890184e-03 1.313272981495717043e-02 7.456283296226515200e-02 3.337007747252439954e-02 1.016916356469843097e-03 1.447828418454484350e-03 1.135029932850794079e-03 3.451044399041067190e-02 1.631001367667329199e-02 1.571828482392720328e-02 6.092831462154175981e-03 6.243098699844280494e-03 5.498162787129863907e-03 4.718615529622628528e-03 5.373226077447491172e-03 1.268002663758467652e-02
5.245443846710635960e-02 2.707215778285401633e-03 5.363548659007612990e-02 1.344138567291041546e-03 1.371583832436395426e-03 1.553152591534127155e-03 1.407103897957056845e-03 9.308339982776478796e-04 1.291252909544582340e-03 7.677079440386851139e-02 3.232853361129147535e-02 1.472165130311645694e-03 2.304224826189974623e-02 8.412275523044991307e-03 9.536930522558556209e-03 1.766105864267442788e-02 1.920826813707068566e-03 2.122126636510159904e-03 1.305714578662424104e-03 1.263547580083514057e-03 4.848255107444874451e-02 2.872793066803113957e-02 1.170574397241513215e-02 9.839659115813007353e-03 4.683521393760279108e-03 4.876619149549134800e-03 7.549496675830542729e-03 8.453441141431972811e-03 8.332303893510764614e-03 2.399200349238449562e-02
2.444360431635182913e-03 8.059718480851918443e-02 4.679624363066356429e-02 3.178642447409408753e-03 1.833712726413267357e-03 7.390357403360661714e-02 3.932085710673906970e-03 1.662883721020372296e-03 1.928482340456080021e-03 1.602727491880311843e-03 1.153526374373731005e-03 1.171527304626929916e-03 2.214449671166673298e-03 2.011493044050708008e-03 3.041001017556887315e-02 2.545906985132866118e-02 8.283796329504477694e-04 1.640933979936216175e-03 2.172684070892614942e-03 6.437127154519381445e-02 1.293110099861842326e-02 1.360458510860341856e-02 1.494580504763659903e-02 9.785384559934247675e-03 5.709461587361824852e-03 8.535889099194275687e-03 3.164753562640293394e-02 5.563828158511650857e-02 2.603930109803757192e-03 7.388591586651974130e-02
2.417113057551025391e-03 1.839434488004385200e-03 2.952359152443968359e-03 1.697809434312343678e-03 2.138862506268170236e-03 3.567584692746483821e-02 4.221886456992573339e-03 7.916211090110310267e-02 3.702168194749171776e-02 1.323249840658615763e-02 1.037995466031122870e-03 9.876813099691389170e-04 2.100392662585384967e-03 2.752637414877094103e-03 1.430152680550285686e-03 1.506499555442412886e-03 6.605389629298892215e-03 6.117953914699343805e-03 3.793705545670305462e-03 2.812521918124991950e-03 1.663066389363416706e-02 1.063563082489816548e-02 1.234594940274924210e-02 1.355328930197056102e-02 7.513899094421358851e-03 9.423607887818687134e-03 8.530032421532786346e-02 1.281564471177970288e-01 2.681110361581139599e-03 3.902324190644659158e-02
2.680246844653584766e-03 1.342884337962512711e-03 1.646047033795829942e-03 1.099545207120553297e-03 3.062782479577108932e-03 2.245680492819530222e-02 2.198114153675356786e-02 1.996581478584402713e-02 1.363984773081498153e-02 1.142247107294989180e-03 8.197602750654398029e-03 1.330792463876104281e-02 2.760908348747010896e-02 1.334337071657722487e-02 2.406432640468672036e-03 4.611786264895027451e-03 8.581087637922240469e-03 2.380363507102601153e-03 1.031147192979225535e-03 2.666559323864367906e-02 1.137960502490884852e-02 1.029687046196509255e-02 1.346450974597793344e-02 1.881698306041876614e-02 1.995548580738701686e-02 1.070454436587693105e-02 1.653956703271473178e-02 1.223237815529474963e-02 1.080368968251673063e-02 7.673648770646634976e-03
3.813145932444973046e-02 2.074345652602179943e-02 3.244723405328065521e-03 3.476834099902808943e-03 3.292227952613789067e-03 3.628638291614053046e-02 1.701777739421708388e-02 1.175793559399825397e-02 1.392408987766470194e-02 1.829153419021125118e-03 2.484348323274595833e-03 1.643246420178341716e-02 2.800018864528408882e-02 1.420978948771933585e-02 5.009292779058656386e-03 5.519629085492568608e-03 6.107203809144414082e-03 3.622226728177419062e-03 1.665545793472449250e-03 5.984597018558085457e-02 1.069942072122370691e-02 1.100939040721429785e-02 1.315813935429047642e-02 2.353318236950869072e-02 2.226381925936253212e-02 1.578895068784120018e-02 1.207960482667738353e-02 1.097902631949701849e-02 1.201087561798131614e-02 1.302912490448465688e-02
9.099891971133337518e-03 2.132407066328475403e-02 4.682429138593977719e-02 4.023327188897727474e-03 8.610987758194212083e-02 3.009797908486916418e-02 1.692339523687259872e-02 1.486430183874183283e-02 1.901710041007831017e-02 1.029454654542135295e-03 3.661979215867210147e-02 5.604401426459804277e-03 2.041078593784909773e-02 8.554607772747390912e-03 2.629136878860607353e-03 2.971154221304787152e-03 1.102793660230671699e-03 1.633311160474056490e-03 2.902238286882098499e-03 1.394371286515023881e-03 1.007584477168203124e-02 1.114299376332166316e-02 1.410661132892821780e-02 2.347165702350644673e-02 2.969811453051010228e-02 2.622243574951164946e-02 1.935702616648445062e-02 1.839936413071790317e-02 1.636150797567928472e-02 1.371769210765562928e-02
7.882691442783801641e-03 2.151397856656217522e-02 3.332317058821052808e-02 2.336848274728238126e-02 1.382866607911773481e-02 6.093057924527336966e-02 3.867955297659418125e-03 1.664140074509685898e-03 2.645109362486402702e-02 8.663315160939188617e-03 3.090078277190590542e-02 1.130479388140198573e-03 9.092787332135979922e-03 1.202543384650391067e-02 1.253261768448449623e-02 1.652836683021509379e-02 1.501240615736996326e-02 9.875306879650689457e-03 2.733101239788023398e-02 1.331695732804751529e-02 2.184560566156917676e-03 6.512343714643806236e-02 4.879790874590820421e-02 1.823482536917535790e-03 2.936243913705138299e-03 2.251431441707211090e-03 5.364630936193742761e-03 2.686445680464815983e-03 2.231482791709007291e-02 2.624003361290614539e-02
7.363400921437114957e-03 7.078684886550258570e-03 1.700932711608849762e-02 5.170491069762512756e-03 4.426201254221065473e-02 1.117436005869916656e-02 1.795193525639674848e-03 2.156492126682020213e-03 1.695324498868022419e-03 3.284689269297520059e-02 6.783044821527678403e-02 5.408913623145271930e-03 7.976528693830042122e-03 9.905164648392354720e-03 8.756341830922971872e-03 1.035507099175572189e-02 1.794156128633571379e-02 3.162383328805959404e-02 3.284129610697304053e-02 2.632084710376791231e-02 1.874653449356661252e-03 2.513324189511676257e-03 2.174590737428157717e-03 4.693377289947376317e-03 5.036053614719453696e-03 2.591210370390814935e-02 2.603736917972453505e-02 7.412849356379997562e-03 2.290178541921764066e-02 1.779857850587877877e-02
6.767009170814267290e-03 7.114736595876336098e-03 1.396540598301851920e-02 1.482814872161882305e-02 9.676486548938573184e-03 1.170274037724654617e-02 7.120885512593574940e-02 9.466415444067511438e-04 2.086144563225156463e-03 9.793632328913798139e-04 1.037817715770623884e-03 7.588413077602915429e-04 4.419177500388016440e-03 8.775044365033604979e-03 8.028651398383105514e-03 1.206393601926775139e-02 2.135086930404653943e-02 2.665273931626942899e-02 1.582871469745252349e-02 3.540910339682916321e-03 2.174039679529764062e-03 1.525027195881422000e-02 2.267395357140945811e-02 3.865697779739382667e-02 3.682850003461213967e-02 4.854362173321811330e-02 3.923631940330994661e-02 1.383117844816540189e-02 3.306422649441872336e-02 1.956993202024989026e-02
8.654027835126846049e-03 9.751251959847195491e-03 9.215313124226673369e-03 8.378367954266465606e-03 1.227548097453742132e-02 2.158973376773905620e-02 6.004421294322744365e-03 1.775281640754721932e-02 7.689206319498191437e-03 1.330926586130065561e-03 9.970052669878775795e-04 1.565190889012084809e-03 3.079721312510221368e-03 4.464770238926633536e-03 5.798484453262486155e-03 1.022247396783641793e-02 2.270795324680343480e-02 2.367722516847077172e-02 1.159995610978426309e-02 4.107087057207727855e-03 1.817385878008384234e-02 3.377767570881003850e-02 4.438172847031995188e-02 4.653688499103168091e-02 4.170145796057794785e-02 3.656023961621603785e-02 5.460911048901957027e-02 1.075957031459960807e-02 4.300830275689201954e-02 2.329904426258953484e-02
2.157828029176987739e-02 1.675889301268420131e-02 8.157945170475787780e-03 1.146536625536486061e-02 8.839272193139470577e-04 2.802076544417400183e-03 1.346042102895040303e-02 1.035926261704182491e-02 9.942868205079500796e-03 5.050599638881838292e-03 2.270861063439706066e-03 8.835528960164289267e-04 8.548331596201309618e-04 1.815339368043430383e-03 2.798065447200910171e-03 1.267384133821845837e-02 1.382568395414937243e-02 1.793840629851814819e-02 3.239179098600568265e-03 5.895563092337029881e-03 2.028605957632710621e-02 4.509922035710973998e-02 5.713098310259202839e-02 6.073177303488969808e-02 5.116195683325698573e-02 5.009642780904848686e-02 4.698975662793393460e-02 3.884124788809923540e-02 2.405072111674161957e-03 1.705269004969755002e-03
8.698272693878950773e-03 2.383521139114202700e-02 4.171043225958069589e-02 1.675287881738455166e-03 2.143055455283357502e-03 2.648347368108711596e-03 8.127042366196665993e-03 9.843654062817648945e-03 6.553621436786824517e-03 5.160913900330320325e-03 1.693390111629151581e-03 4.418124590331352908e-02 6.643020417237791020e-02 1.079041923571755950e-03 1.030458635837208994e-03 6.094301929242087676e-03 2.407315256274466207e-03 8.597014502456540612e-04 4.992936020240393985e-02 2.197361975222469292e-03 8.010098108468173897e-03 4.342180400921617778e-02 5.594724343291193613e-02 6.004841382755751050e-02 4.493829833740013019e-02 2.127141896297469678e-02 3.499418896204260776e-02 2.385273682909688081e-02 4.942311432179230350e-03 2.208875225596772067e-03
1.105661987981386993e-03 1.770176156920443911e-03 1.070300836112144955e-03 9.880802432082561731e-04 1.499883494443222075e-03 8.339942227052932373e-04 4.139440507147923790e-03 5.141608129744041668e-03 4.567810438167256223e-03 1.547164680508144588e-03 8.730077867487069524e-04 3.017773973158035042e-02 5.156124602421652964e-02 1.076576342065148004e-03 1.762675657102599986e-03 1.089385086671751379e-03 1.892775238270170924e-03 5.663868078057097966e-04 1.082799884846590704e-03 5.168992152623577696e-03 2.636435204464046902e-02 5.025504701549710074e-02 5.435990831569101345e-02 5.307337923478307184e-02 4.203396976428390441e-02 3.166614063225955261e-02 3.132390629492834422e-02 2.415156553848480520e-02 7.721145597939123133e-03 1.019963000051541391e-01
1.867739191957709264e-03 2.202790481893756279e-03 1.569149792007573825e-03 1.451310560805623654e-03 1.626374573066609883e-03 5.801934602354412353e-04 2.248061348804151344e-03 2.327767323668561688e-03 6.702902899691571192e-04 5.528422429864995229e-04 5.102509682029015420e-02 4.502541205372565664e-02 2.506661977764684454e-02 1.172360003970404109e-02 2.541265823901895857e-02 7.577413821619995160e-02 1.077355864153999553e-03 2.273235566061789208e-03 2.243948836980616708e-03 1.016408138870984572e-02 2.762551339709158615e-02 3.980221940139225256e-02 1.611259035636403505e-02 2.497995254718229571e-02 3.358881610983834032e-02 1.973522914523153510e-02 1.881575708071366038e-02 1.862137516018435440e-02 5.866092839410472215e-02 6.378557735638798465e-02
1.523113440386634912e-03 3.087114423252801474e-03 8.705751569646762167e-02 7.438549499389340847e-02 6.815963894747263663e-02 6.844925027193838945e-04 4.872471869638439891e-04 3.345848326066547945e-02 4.686091128245915144e-02 8.084186781723739709e-03 1.187513932161470692e-02 1.883520468097830969e-02 1.760044745096904506e-02 5.581934436463661942e-02 8.110602256177903502e-04 6.011661574132543331e-03 1.078913118710281976e-02 1.445113425813751747e-02 1.008024589631455019e-02 7.661030160640366557e-03 5.383176876713056253e-03 1.907694834164435369e-03 7.327253229802684412e-04 1.642274111446237646e-03 6.211252558955626148e-03 3.421868696116142378e-03 4.889689021345467075e-03 8.551569818525364686e-02 1.106696301279788165e-02 1.032734282626850478e-02
3.194369713252823845e-03 5.077302091280339741e-03 9.843185052392387779e-02 5.745951831319795478e-02 9.425473304551405807e-02 7.073252622628159458e-02 5.759254758077671276e-04 1.205346026076229045e-02 1.128125257431285104e-02 4.892916151926425192e-03 1.211040822423135703e-02 2.209332786295133827e-02 2.348024571914269013e-02 1.227287283887208745e-03 1.209566071425411836e-03 2.957277476371064466e-03 1.103111746470066164e-02 2.093399328739846757e-02 2.411287414803631873e-02 2.120793253670873180e-02 4.553977918213605695e-03 1.676596978377702237e-03 2.049487530962179616e-03 4.807884770876042803e-03 7.461176112929105222e-03 3.517878095939452887e-03 1.004930411907033194e-01 4.118930549046288109e-02 1.543684176602509207e-02 1.482022857291289027e-02
3.946905719031938709e-03 8.973294209191684306e-04 5.468864310820484298e-02 2.330785814295505479e-02 2.967311573389129833e-02 6.520484805133647255e-02 8.641073497934548264e-02 9.934357648243548680e-03 5.610968155532622403e-03 6.419645079599913332e-03 1.167616747941748433e-02 1.976327209020048783e-02 1.786651264831705735e-02 8.563669122660368116e-02 1.891252486531354434e-03 4.255509245166276371e-03 8.380388487040394893e-03 1.957667867173130960e-02 2.497622136763432213e-02 2.159062022998535502e-02 1.111284795616259390e-02 1.401862160787685279e-03 7.563195499631149288e-02 2.311371627407395567e-03 8.011683374036775857e-03 5.881071984279538818e-03 8.229692362357036994e-03 7.187570846892299414e-02 1.262145311195613136e-02 1.141886322681732839e-02
2.154204791134362723e-03 8.712137375815032746e-04 5.550841194596124089e-04 1.203117019592293141e-01 1.545011644039181358e-03 1.221055142659883443e-03 9.228978852472063954e-02 3.926303922178685929e-02 5.735940342531389152e-02 7.366944662551828948e-02 6.933026087574915321e-03 8.325193246408643319e-03 1.094924793342340504e-02 2.117689289759825538e-02 1.322324152699740595e-03 3.550179178882150073e-03 2.170616389684268139e-03 9.999031409504650914e-03 9.707522107321273075e-03 7.666964900040790232e-03 8.450832049215409661e-03 3.042138924926334961e-03 2.284776118538594386e-02 3.706305017520337280e-02 5.834259833470294143e-03 4.691198669511877951e-03 1.529810260705276835e-02 1.824786357783678842e-02 1.497026268482794242e-02 1.310537757241729898e-02
7.689756686953583926e-04 2.994533718658068454e-04 6.273492209142048168e-04 1.345576801056483536e-03 9.321674358158275669e-04 7.662843809645333848e-02 3.735925887993478411e-02 2.737164742625316713e-02 8.582242224489010363e-02 1.994391648821634746e-03 2.284080135108953677e-02 8.499653695807895051e-03 1.261202500981819380e-02 2.309996205581164169e-02 9.592873462215159575e-02 3.186714738882322727e-03 1.015341468903336042e-01 4.760780459015310356e-02 6.917457608073546149e-02 1.704179345098116860e-03 3.693427511586443342e-03 4.862530667225865161e-02 2.513612082618190552e-02 1.166031134990780649e-01 2.711432594204727167e-02 8.215021728742331886e-02 1.509075239509416293e-02 2.658045379413664921e-02 1.231892672692562335e-01 2.103881264002876658e-02
7.792016677135734336e-04 6.133504449983618635e-04 4.127585124508607113e-04 1.122269206225628424e-01 1.146567444729820195e-01 4.522524481339865871e-02 3.074207780583845112e-02 3.216992815300276365e-02 3.593477954411007647e-02 1.433811876753474657e-01 4.230660473157384083e-02 4.255703636823660041e-02 3.434586495188540756e-02 3.490757804161826600e-02 8.799278051618496244e-02 5.972647180432055780e-02 4.243006856849632080e-02 2.673459623154976830e-02 2.338748723020485365e-02 1.762351178657505305e-02 1.419690403921378130e-02 2.085974147385733293e-02 3.195073953168144076e-02 7.470423085642145800e-02 1.278404577620336768e-01 5.773369645715956122e-02 8.900519528650849277e-02 6.221082067098001461e-02 6.451008146964205825e-02 4.263423089152635487e-02
1.058060099506740077e-03 5.406199595682922247e-04 4.239572069090398487e-04 7.727458628441576972e-04 7.963589399653287111e-04 1.114716773057254640e-01 1.062989394150859164e-03 9.536516845784729236e-04 4.955031362542461348e-02 3.615899139688255604e-02 1.363369485253134762e-02 3.174874275980302252e-02 8.007159484597729804e-02 7.350270297109998130e-02 5.728612106734066144e-03 4.311140150909494734e-03 4.810742003862579497e-02 5.779185319798933740e-02 2.649828410143414970e-02 1.181421524549922629e-02 1.151500329570549069e-02 1.801517746044202506e-02 2.739123080261379045e-02 8.394790235968671577e-02 8.505411699515370849e-02 2.022039992351194748e-02 2.262317421545642637e-02 2.931331827536901025e-02 9.586709960144593201e-02 1.964550310363605973e-02
1.423186886517682293e-03 1.207268034417152995e-03 3.500960610779195676e-04 1.139414675904717013e-03 1.441661635362254026e-03 2.671311533992285284e-03 2.365406222760138913e-03 1.244908531661703954e-01 4.930867836345284583e-02 2.880885528312390753e-02 8.792678628723821221e-03 1.129142527935055561e-02 1.214334373548592999e-02 4.166200859807304285e-02 4.780027138530184433e-02 2.021622370780454606e-02 1.690991100369700073e-02 1.849927529690127345e-02 2.525896834529321386e-02 1.471653748946595563e-02 1.044940194246151560e-02 1.555753440194650346e-02 1.770292550288166816e-02 2.974541814519951130e-02 9.326954310825368022e-02 1.480185401465415433e-02 2.166400901399382142e-02 3.568432288447122291e-02 4.320268764874760775e-02 8.596006236029858638e-02
7.776776136794832624e-04 1.901249573758558714e-03 5.475915576486724062e-04 5.630326469196210480e-04 2.610540670391283020e-03 2.715081312570082062e-03 2.449732903421118334e-03 8.789974492538388251e-02 6.798106926811202377e-02 6.373607076521371761e-02 2.627025387666681588e-02 1.328724096417825684e-02 7.982338662835248774e-03 1.252983513854463195e-02 5.715524350157972361e-02 1.496608558037039113e-02 4.048753883295670014e-02 3.969586802329976537e-03 7.875135841360746819e-03 5.591783433468911629e-02 1.445295159342494494e-02 2.023110860580121587e-02 1.761679132890346319e-02 1.946489403903560456e-02 2.592933672521213415e-02 1.998885026067462670e-02 2.370866589458725526e-02 2.942305394367306093e-02 3.993278378538547141e-02 9.824344159559277034e-02
