3.758979810370469465e+01 5.677264114900902570e+01 4.906361922172354184e+01 6.167151178124362332e+01 4.642227235821091824e+01 1.022316036967098398e+02 1.022351910844471377e+02 2.795096038554273150e+02 5.155508305440985168e+02 2.332243386788637736e+02 1.098499950749200451e+02 2.537543527635597940e+01 1.523392395953970180e+01 5.962727838696847016e+01 7.346191040803542194e+01 1.722029692468609596e+01 6.571770166865715623e+01 1.254738893146045342e+02 1.250882230011158356e+02 4.797833103389761789e+01 3.887395854711547116e+01 5.698823637876647474e+00 4.476813992023124911e+00 1.814114186249009819e+01 3.595812111787135024e+01 2.898942228140257527e+01 1.384074980915556807e+01 1.242021845723645157e+00 1.203486778734264906e+00 1.543602828880295208e+00
2.801984428336915300e+01 6.365142112148902953e+01 1.142969018628732982e+02 9.243060186654787458e+01 6.407164686963618294e+01 2.894681394596809696e+02 1.406860695336584399e+02 1.789678559761696022e+02 1.198415663238344564e+02 1.036482235180403393e+02 7.592189646058750441e+01 1.531208343760626889e+01 2.106806106123073263e+01 5.027631645975221630e+01 7.343322711661357971e+01 4.990377794760114938e+01 6.700261992630393593e+01 2.406721291825919309e+02 2.016823475458456869e+02 6.686994238436010107e+01 2.432739407529098941e+01 5.578507179985910724e+00 1.198920368269644676e+01 1.092546725314484313e+01 9.970427693004605629e+00 1.391839385231665815e+01 5.182444009311013566e+00 1.322952546566507959e+00 1.866760796524074228e+00 1.861505294528523313e+00
3.281224299178414299e+02 3.425832516377620323e+02 7.253100004385389639e+02 5.839416693305340686e+02 1.251195648256387813e+03 1.292705530475351452e+02 2.490681019193919354e+01 2.736069685341290381e+01 4.588998193296675367e+02 1.428934806240310422e+02 3.983019608659594724e+02 2.769862978229288046e+02 1.063523548368597886e+02 1.615206675736506554e+02 3.201981640418870256e+01 1.411498410854169947e+02 1.027324601679340219e+02 2.328619735703780407e+02 8.684982926372737211e+02 1.608134318286741404e+02 1.586472159254893199e+01 4.758154253971628833e+00 7.528508581358695828e+00 2.750772927645124710e+00 1.731650989479986524e+00 1.222990803190410869e+00 1.166893414500319359e+00 8.792071450143256195e-01 1.430917772707188007e+00 1.559529431129262456e+00
1.563265549003038188e+02 4.593653653297528763e+02 1.007271180052257023e+03 8.049363379260688589e+02 3.352153440540408269e+02 5.223656624475647448e+01 4.229925880742534616e+01 2.864201244096780030e+01 1.789129807829057484e+01 1.686394664430432613e+02 1.102338583094308433e+02 2.259170234459804192e+02 1.062723814011061592e+02 7.475577325673049245e+01 2.307277590138501111e+01 1.852845404486369318e+01 4.153942681211954380e+01 8.423322909139733383e+01 6.575111485696749014e+01 6.143288742515386502e+01 2.928297404025175155e+01 1.046976995232513730e+01 3.417876473345327959e+00 6.945733165582403501e+00 1.379503354214704158e+00 1.089636090712152061e+00 1.003520143784448759e+00 8.942889697871065913e-01 1.689508837011489240e+00 1.769923622577074918e+00
9.355881871390099036e+01 2.999619239458824609e+02 8.347697556119121600e+02 3.231784745770872291e+02 1.866619504359142638e+02 2.716967188460449734e+01 4.157450324531665586e+01 2.314729717514261154e+01 1.068252329080226204e+01 3.699168649363872987e+02 4.606497259777107729e+02 3.967745401640495402e+02 6.034005780326088342e+01 5.320494178130553564e+01 2.640857536957860674e+01 1.036361345104347897e+01 1.179172363974862492e+02 7.194605293827207504e+01 1.242801615553848364e+02 7.610425658245293334e+01 5.563551224027162334e+01 1.642591903030562150e+01 3.820600238899559287e+01 1.106203024695125769e+01 2.364247021939218651e+00 1.384684614188034679e+00 1.033062800936467740e+00 1.124600117526058263e+00 1.632809918838507013e+00 5.781147529524791828e+00
9.728842883010378273e+01 1.067316706572204339e+02 4.772878620255352189e+02 3.812806490654307936e+02 1.515254514649863893e+02 1.602325634023687684e+01 1.914503860083060260e+01 2.019344646274206667e+01 1.859385262212636292e+01 5.482662115920878705e+02 4.197809444053398238e+02 2.189692009991012469e+02 2.545077302473807634e+01 8.184149144460391767e+00 6.596778526321481095e+00 1.144223330695206187e+01 6.260160824528193046e+01 1.700369388333433562e+01 5.793534811934976858e+01 2.101660384323986364e+02 2.738066541477249416e+02 1.742306921207350570e+02 4.650554881291684239e+01 6.367986336458772101e+00 3.389445392392761214e+00 3.477904945509164847e+00 2.327032781727511157e+00 1.506303744156249236e+00 1.835394350874775204e+00 3.178533717196102781e+00
1.362783053227634511e+01 2.281337358281584216e+01 2.416561609599498794e+01 1.227624979629744075e+02 5.897959701217973816e+01 9.632295218102001400e+01 1.421608041336892825e+02 7.915040614207839553e+01 9.194674598382627551e+01 1.029764372744466243e+02 7.662169633213541431e+01 3.075877277114106434e+01 1.277956733207223294e+01 5.267532201237879796e+00 2.938633812469572781e+00 5.567451663505806891e+00 3.393202336881988401e+01 1.652092406659276236e+01 8.720725551946472365e+01 1.242030893855431515e+02 6.140964743487835165e+01 1.581107805504597863e+01 6.664125780529168708e+00 5.554916698519503981e+00 2.224058897680965874e+00 2.489112704261456699e+00 2.343653484157170563e+00 1.905839703938901231e+00 2.043397687817409825e+00 4.666687227269870064e+00
2.786108103798565239e+01 5.311631928687150150e+01 3.130390669714388352e+01 6.813798225585628643e+01 1.054884575086380494e+02 1.181704616948807001e+02 1.037649599537997460e+02 9.732716064944229117e+01 7.804697019649094614e+01 4.243031324874930021e+01 1.663260463437359959e+01 5.024194128479565080e+01 1.073201243300567853e+01 3.693702761878541629e+00 3.925240556362747490e+00 7.547813297646754904e+00 6.476736322983572336e+01 1.074517219292223160e+02 9.832759835879485877e+01 7.344205198174007876e+01 2.156057951309208676e+01 1.086912794886002231e+01 3.919641245346096703e+00 3.231593832163567992e+00 1.616052545516389660e+00 1.812859376230822939e+00 2.971287264890578150e+00 3.541326814241362975e+00 3.367185165817739190e+00 9.527972003877268392e+00
7.047247069138326481e+01 4.727108796812744629e+01 2.806622384817775284e+01 1.654412714364515864e+02 1.096644351302965106e+02 4.679245800782697984e+01 1.516474600258628413e+02 6.876972323033905354e+01 5.876323921622885393e+01 5.657696144615601952e+01 4.942438772968959881e+01 6.408170008069510004e+01 1.394798038841003915e+02 9.268359565201690486e+01 1.406852465140596387e+01 1.312583802792727283e+01 5.906602057710770737e+01 1.870085348831789247e+02 1.933172443258610542e+02 3.413836111330837753e+01 5.768719480365838592e+00 4.753231744060212982e+00 4.782807993683517722e+00 3.077266804339699569e+00 1.862118613671921441e+00 3.014729893307303676e+00 1.188195765345848898e+01 2.285481296176016031e+01 6.342572891605836816e+01 3.026788213508071479e+01
1.142062547684153060e+02 7.473239231241223024e+01 1.207911954389084315e+02 1.152049025675918017e+02 1.044282623255905236e+02 2.100937667543034237e+01 9.920315298405802196e+01 4.330109046728678379e+01 1.884985787838756011e+01 6.922548458946837791e+00 9.980007712440701084e+01 9.601825196874379742e+01 2.011518315326292168e+02 2.155898106547863051e+02 1.022544955345631195e+02 1.113196668518314141e+02 6.159362084202143706e+02 6.679168044893735896e+02 2.832507117395701357e+02 1.346098184276428071e+02 7.072616684452660785e+00 3.568003056200226286e+00 3.879474286283077777e+00 4.221843372823536278e+00 2.376463561975988625e+00 3.182854893812288921e+00 3.109589818985407561e+01 5.116837873906963807e+01 6.147032774374302733e+01 1.564126721199395575e+01
9.610672480908139903e+01 5.009781636633923085e+01 1.126636895429088980e+02 9.753590670006079222e+01 1.280571970707331388e+02 1.208508854872624916e+01 1.044414812394394865e+01 9.416866722367682740e+00 6.167737244905235450e+00 5.440672093324791803e+01 8.397880851514605638e+02 1.381358954461775511e+03 2.798076895810311271e+03 1.339629336374079230e+03 2.407913300476993186e+02 4.577269833056973312e+02 8.674623951018577372e+02 2.489568478383929460e+02 6.231539427405911624e+01 1.316274563184495605e+01 4.713109027199537060e+00 3.441901673442255394e+00 4.293278071617142366e+00 5.990892333470032582e+00 6.424222826794199648e+00 3.560994698973676265e+00 5.788616858799780829e+00 4.475837537979365344e+00 3.890597977542858299e+00 2.717162369497911900e+00
1.826536244575765977e+01 1.072663227336106218e+01 9.435593143628895518e+01 9.337488027287706416e+01 7.445441318980448386e+01 1.763741157596514597e+01 7.115600215106802295e+00 4.767645677006990823e+00 6.187345979122895301e+00 1.136260035971028657e+02 2.698974625577652091e+02 1.727715773362235723e+03 3.005673994061176927e+03 1.494054426357856755e+03 5.200215608777079979e+02 5.627411888500331543e+02 6.204170930431318993e+02 3.707128034796346014e+02 9.305601784049800074e+01 2.699566977459991790e+01 4.109907337093503976e+00 3.755331362352446689e+00 4.376708834176289642e+00 7.850711648309202317e+00 7.524520461400966198e+00 5.417245822727453586e+00 4.197144564553730639e+00 3.720606886284973491e+00 3.902121167582275785e+00 4.105203435597814199e+00
3.592970559533050334e+00 9.269144893361040971e+00 2.243390155840321398e+01 6.369016048328883528e+01 4.221791791926387560e+01 1.382698091066710333e+01 7.396078841569271312e+00 6.505088124160298690e+00 8.670162042064362140e+00 6.107476804371680146e+01 1.982985765002070977e+01 5.866652826752020928e+02 2.362659942304891956e+03 9.506454594243002703e+02 2.830370824584691150e+02 3.100960770049911162e+02 1.118403762376283765e+02 1.616769847184860112e+02 1.824186413821312840e+02 6.849587974877371721e+01 4.670114837897196836e+00 4.251533307398585926e+00 5.204482639354827356e+00 8.942609927405587911e+00 1.169995258341644906e+01 1.104822448914902644e+01 8.232387231602004363e+00 7.393199432663731585e+00 5.587525816046321481e+00 4.309974476354723194e+00
2.915650630053582937e+00 8.389264096900364009e+00 1.514650474920031797e+01 1.101925647241658979e+01 6.574863931077596035e+00 2.692844166029329500e+01 9.896059381287471979e+01 9.235858878161485563e+01 1.309602922804284120e+01 3.954712733188256113e+00 1.557682396920764489e+01 1.017467897539473398e+02 1.137446517902843880e+03 1.418513566213464856e+03 1.410016211415304952e+03 1.781296289092027791e+03 1.527685083904943440e+03 9.485539368428909484e+02 2.492804436734482351e+03 1.137713117722355491e+03 9.483277183403025390e+01 2.773258277312283226e+01 2.099563443521981654e+01 5.246511336533733072e+01 1.201028376264267763e+02 1.119234727341596880e+02 3.093145332421324269e+02 1.032272807119907299e+02 8.366857441476314605e+00 8.251346940940701202e+00
2.652595679765843428e+00 2.678298331359390883e+00 7.367727570037020612e+00 5.534450744937163336e+01 2.034251946520672760e+01 4.931099309556578270e+00 6.785110064767569327e+01 2.105414006161767588e+02 1.531689248975882549e+02 1.580076672465471077e+01 3.379697495112222327e+01 5.365503032474766769e+02 1.091516722703888718e+03 1.268734353635043817e+03 1.058877255876982645e+03 1.188469596804662160e+03 1.890629749725326747e+03 3.061526982464931280e+03 2.950161561749369866e+03 2.252651453490401309e+03 9.628348726443624628e+01 1.007819627306855921e+02 8.933854594879298361e+01 2.747421327691553188e+02 3.846736728029255801e+02 1.945362405251296195e+03 1.955894441747899464e+03 4.046992800276810840e+02 9.202338690055785975e+00 5.634593255072310569e+00
2.356845712370236434e+00 2.594446590772406136e+00 5.979055639914308884e+00 6.692212451675588980e+00 4.518781559486966692e+00 5.279424662084533537e+00 3.851740707037377121e+01 1.131110032950533935e+02 2.461805922314234749e+02 9.113389335725715057e+01 9.750478340510747444e+01 8.825985571933954077e+01 6.694833672925960855e+02 1.242659530325590595e+03 1.070056354127889790e+03 1.517029723105284347e+03 2.389486200074471981e+03 2.667661821153869369e+03 1.438327543722635937e+03 3.006136714808532133e+02 1.786476495347796174e+02 1.215692149418013514e+03 1.752947765170527873e+03 2.860710243027479919e+03 2.605186432047512881e+03 3.346811493327811149e+03 2.693889615294559917e+03 7.912934475048355125e+02 1.384116313055852032e+01 6.326104376426171072e+00
2.921286670525575779e+00 3.430333432281045702e+00 3.424923300501255596e+00 3.331858271683497463e+00 5.225392317757126648e+00 1.112673198673349262e+01 6.585567132748709582e+02 2.254572713059713351e+03 1.138389469277360377e+03 2.037845682778464038e+02 1.608634437908463610e+02 2.691906872289347348e+02 5.271033252253995443e+02 7.074646815442428078e+02 8.548260773274658959e+02 1.412854144562722695e+03 2.705425226186634063e+03 2.464624961675164286e+03 1.073802046395123853e+03 3.477374138545445703e+02 1.460667484247474476e+03 2.582591348955300873e+03 3.244321768256657379e+03 3.213648992776949854e+03 2.745755843160388849e+03 2.347417154568091973e+03 3.501754250583740941e+03 6.215121692494136596e+02 2.004581407423866679e+01 8.477234281088133372e+00
7.155576054174341394e+00 5.732015341681449883e+00 3.043625064122928325e+00 4.929057342292253452e+00 6.714332617259930203e+01 3.446951216674375473e+02 1.927955354120560969e+03 1.598089359604286983e+03 1.624162150257199755e+03 8.484521895033904002e+02 3.321016013252294101e+02 9.833920268295106837e+01 9.615814650201919278e+01 2.237359529530559428e+02 4.582829845761199294e+02 1.942871800119451564e+03 1.774668501596056558e+03 1.836117748585470054e+03 2.881851376897485579e+02 4.717282715003768772e+02 1.605285548072134134e+03 3.346053411815491472e+03 4.002252827592165886e+03 3.980612182158252836e+03 3.199400817624302363e+03 3.068619685384040167e+03 2.886594340696366544e+03 2.290453908481437338e+03 1.017693844181015663e+02 6.719623358230242616e+01
3.223011271170237446e+00 9.159399158648492190e+00 1.760838554081919227e+01 1.289840032500584357e+02 3.083396891531136816e+02 4.481634872901771018e+02 1.429845881407280103e+03 1.818888826631730353e+03 1.291889893228682013e+03 1.032716995716909651e+03 2.269897295891196336e+02 2.352430295028773344e+01 3.489428690784770026e+01 8.914642325263908162e+01 1.761323132560537488e+02 9.550944674279244282e+02 3.208103270719615239e+02 9.155619428105549673e+01 2.758645851301957919e+01 1.840049176255743646e+02 6.599216438738906163e+02 3.325591506967737587e+03 4.007205963564381364e+03 3.971937937861504906e+03 2.781577712425088066e+03 1.256159107362476107e+03 2.014947204896579478e+03 1.383819302261553275e+03 1.248600213618188093e+02 4.932186719870830416e+01
8.272387768242198547e+01 1.119617662593197167e+02 8.034362375861640260e+01 1.082752434185055108e+02 2.809417563986860387e+02 1.685871928857466173e+02 8.914339325572283315e+02 1.184040189562860633e+03 1.131159893389918125e+03 2.681980484929247837e+02 6.808997004902103356e+01 1.457951338900339344e+01 2.443194788154444907e+01 6.553844472585784331e+01 2.374825516788386324e+02 1.469586294858592623e+02 2.386571963275367523e+02 6.314099664786067478e+01 1.063487535171657612e+02 4.573751364023351584e+02 2.280713102308876842e+03 4.036604078344599657e+03 4.074867526486659244e+03 3.612802437197738072e+03 2.608994425195307031e+03 1.819916609564925920e+03 1.713205281760238449e+03 1.154885513320736891e+03 1.040343862844079439e+02 3.705208425174039633e+01
2.433247148981199643e+02 2.393633836589161774e+02 1.362879933004946906e+02 1.099592746134980246e+02 1.624360433318609580e+02 9.281233865568920294e+01 5.514152972189825732e+02 5.148785505088391119e+02 1.475549602080251645e+02 7.752935372410053105e+01 2.594248742111758332e+01 2.009364741421964951e+01 1.141029794480487247e+01 5.873230794196635962e+00 1.422012773837034416e+01 4.487177515098336755e+01 1.430227876114937828e+02 2.928866418147370609e+02 2.544011495176592632e+02 1.031441373943951021e+03 2.571132545469413799e+03 3.436730235390787129e+03 1.300675170453650480e+03 1.780647111697761829e+03 2.107929737430488785e+03 1.111310239830972250e+03 7.943354060125018350e+02 6.526945303299876286e+02 2.393426736531206700e+01 2.164195514352295646e+01
2.066604686168836054e+02 2.562360479840123162e+02 4.233509571693929274e+01 3.320873339764551702e+01 3.127181363018241456e+01 5.014289702827137063e+01 7.525108850449171882e+01 1.983228563429146618e+01 2.684336171154203043e+01 4.044791495514936663e+00 5.116378180041621704e+00 7.539172245159855734e+00 7.936906794855922875e+00 2.651499078842233459e+01 7.010645638518053602e+01 8.520394592700204157e+02 1.459792542777063545e+03 1.909470930655906614e+03 1.186248763630910844e+03 8.148150498203351617e+02 5.220935145005914819e+02 1.704822857551367292e+02 6.055168036711025792e+01 1.178123374108778876e+02 3.870649005386574117e+02 1.204773996274157071e+02 1.051008670659806796e+02 3.542803253227026516e+01 4.019106481689291854e+00 3.284083052533871783e+00
4.626192664524288034e+02 3.797426772421862893e+02 4.532997674612558825e+01 2.179667509580438889e+01 3.597895840228332531e+01 2.987498631084472578e+01 4.821035119410476000e+01 5.396918597942152118e+00 4.706586715211542149e+00 1.967743906006660826e+00 4.515449753217462003e+00 8.280387652048661451e+00 1.047929796604596220e+01 5.282876759721411020e+01 8.108979784411022251e+01 4.749951595253608048e+02 1.569512262340298321e+03 2.671776802826432686e+03 2.779881136471301033e+03 2.211747587287871738e+03 4.263727170779185940e+02 8.661125309622201485e+01 9.791383260636965247e+01 2.204226659802798736e+02 4.557365121235295646e+02 1.256278008718328465e+02 4.586960922377499372e+01 1.705998464310421525e+01 5.286563155732219244e+00 4.717200975033165378e+00
6.224901800929508227e+02 8.368852386399825605e+01 2.499413965924987480e+01 8.933947087135264198e+00 1.122043431839319183e+01 2.584721920463165645e+01 3.454106330204104580e+01 4.012776587167192766e+00 2.272098433971780906e+00 2.537119729895521481e+00 4.351829954789586452e+00 7.209621399576283451e+00 7.751445778513584628e+00 4.008696069912657833e+01 1.459321398148173898e+02 6.585720231625818997e+02 1.164526493285398828e+03 2.468437739769899053e+03 2.876572400467334774e+03 2.240675298042556278e+03 1.012321577922928100e+03 5.310740304438832027e+01 3.445827074054772510e+01 7.036430774918241582e+01 3.870980066959825763e+02 2.217120891079074454e+02 1.928973745306710725e+02 3.545042643566608831e+01 5.009835447065422720e+00 3.727625946262499657e+00
3.801841446211650464e+02 1.226803971725752831e+02 4.996192561642166652e+01 4.962234034457496534e+01 1.202905302950255475e+02 8.584998256331954281e+01 3.655297798785248631e+01 1.544195266927845900e+01 2.361734438468892705e+01 2.966742532455456782e+01 2.674252250245031881e+00 2.926295603632420583e+00 4.325068451731031161e+00 9.134797140710510632e+00 5.166738316775310125e+01 1.977108117347598863e+02 1.846856311959805907e+02 7.370137773347635175e+02 8.870227759880417580e+02 7.057029850393445258e+02 5.365307833816963239e+02 6.333985557219416762e+01 9.000067194232606482e+00 1.708902787443734184e+01 7.455073170650184977e+01 1.831570581475245945e+02 4.827927119694957128e+02 2.626921298080879410e+02 6.334807749331146987e+00 4.582212171689530322e+00
1.384117296355940994e+02 5.714172798302836043e+01 6.364645865932617141e+01 1.140068077519612757e+02 6.781094484896343033e+01 3.165499143032041118e+01 1.494898565626081499e+01 1.082439451027808808e+01 3.494157270887253475e+01 1.303812324971549401e+02 8.579663260306144679e+00 2.871950098555301256e+00 4.600906791309605559e+00 9.405092162848546877e+00 4.175958994290452608e+01 7.034554648051559411e+01 4.535526192321260197e+01 2.120808585778531707e+01 3.171610259205572646e+01 5.428946100461232049e+01 8.935561930432422173e+01 1.903614705137927032e+01 9.244088619956979613e+00 4.630570632817151022e+01 1.116773303311493208e+02 3.921993912689062256e+01 1.328428537997058356e+02 1.430262111999400645e+02 4.913213398923489450e+01 7.231411385792259061e+00
1.403994284141501510e+02 1.172669280523593187e+02 5.959172666044813127e+01 4.646313999317656851e+01 4.710997922604869359e+01 1.840876269344069271e+01 1.248850765071252766e+01 1.318644507798428833e+01 1.483693779318984873e+01 5.706510866202506804e+01 1.556380992735448032e+01 1.433711345941726023e+01 1.281542743870441114e+01 1.488806788024623984e+01 4.044822662732939023e+01 2.677956638960526448e+01 1.764476587033801991e+01 1.033453919751465300e+01 8.925338131539721331e+00 6.682712800021951338e+00 5.144981681597107226e+00 7.291373351296057237e+00 1.128044552358831609e+01 2.773825612191787116e+01 4.810876835453372280e+01 2.281972809013072734e+01 3.583279270792598936e+01 2.291461512363834885e+01 2.236305332289431291e+01 1.396370247390495933e+01
1.903030108543107417e+02 1.032777208715799873e+02 6.128235396308109983e+01 8.917430118310113585e+01 8.535746223951457523e+01 4.820694229680204046e+01 1.691057449082529160e+02 1.322050170435412042e+02 1.996268478694084081e+01 1.395109372957350757e+01 4.805386605547191436e+00 1.069000606927006380e+01 3.005101297323059129e+01 3.117153457611055956e+01 9.108796621540588490e+01 6.514166076688312046e+01 2.013844598896862692e+01 2.346213964805819074e+01 1.066587793660058026e+01 4.564666615607710476e+00 4.074474067827633661e+00 6.114726132941176395e+00 9.354370623152684416e+00 2.884786614576728780e+01 2.933924858298648530e+01 6.967763484557431219e+00 7.666868487118223996e+00 9.600978184551047789e+00 3.051046682905057850e+01 6.165643294778321071e+00
2.549887233291181587e+02 2.296828328055176485e+02 7.274549734574532067e+01 2.652247715823943963e+02 3.349425429604732471e+02 6.559310022057744618e+02 4.537964646520590009e+02 5.329192275786380151e+01 1.963940929920033440e+01 1.093599630100258757e+01 3.120687281065795737e+00 3.779209658048147347e+00 4.490837448291156164e+00 1.703099744493571066e+01 2.038033614536688276e+01 8.836964373746088341e+00 8.467272758585583148e+00 1.009640616230108279e+01 1.358720592865140375e+01 7.218073248314568424e+00 3.902050534832564921e+00 5.279362615887171373e+00 5.908104460543042613e+00 9.905301644950483819e+00 3.099026716915800250e+01 4.854467446903414363e+00 6.963444022892742780e+00 1.131939836426279911e+01 1.349775542688888308e+01 2.660153751786106824e+01
1.379923766118402000e+02 3.577929128116003881e+02 1.121996117730751763e+02 1.283276275269590201e+02 6.719086503565395105e+02 7.350822210714125049e+02 5.041812724245255595e+02 3.577194267879999501e+01 2.565665409954358722e+01 2.328452214067734616e+01 9.211319800629357957e+00 4.409726131472163857e+00 2.710776552924624383e+00 4.556343953232691035e+00 2.109076611008421054e+01 5.973589184677723374e+00 2.071788105780418832e+01 1.218387177365968910e+02 2.099546012405260171e+02 2.825301845317132887e+01 5.474766706152568219e+00 6.912922683743107477e+00 5.867537327125191382e+00 6.462385037612603966e+00 8.592383986017402719e+00 6.573309665143499458e+00 7.684224823601076615e+00 9.413618084645618111e+00 1.260764372108235598e+01 3.076426640856297468e+01
