5.689502752812589104e-03 8.392405600716759673e-03 7.409617618171686002e-03 9.473884341241477908e-03 7.300754771168448988e-03 1.620209094762118177e-02 1.626798003825149358e-02 4.457283045934563870e-02 8.170818050850775505e-02 3.687765419703783326e-02 1.707804289674109272e-02 3.899417850016134810e-03 2.296544179902860160e-03 8.627716186028042480e-03 1.008052850815613528e-02 2.217108005415794302e-03 7.959550040794814707e-03 1.433719447599937462e-02 1.335265200785668363e-02 4.797075856169282643e-03 4.029042205797061724e-03 2.186473957671562079e-02 1.700113429367882886e-02 1.947800160782867671e-03 3.388420117884923671e-03 2.704009226674198348e-03 4.759603433868811462e-02 4.383991127428186335e-03 4.265007465958098841e-03 5.459510098597093915e-03
4.533613317609581569e-03 1.006481657959870483e-02 1.818267351150429714e-02 1.499171595829656631e-02 1.050967571104990256e-02 4.744981195942681029e-02 2.281424422634725085e-02 2.935573396309433883e-02 1.945820614372698390e-02 1.664190010610839057e-02 1.168106400302173185e-02 2.273285376369116751e-03 3.022566697380762047e-03 6.959595370215956693e-03 9.796613589056998514e-03 6.300034817438318786e-03 7.995192410205098979e-03 2.715888711216042986e-02 2.129438455544782269e-02 6.591232359675056919e-03 2.465260585306254786e-03 2.125587755304755508e-02 4.532798692372117660e-02 3.926078513837076567e-02 3.403771923929677090e-02 4.643605957013538510e-02 1.685400101883411175e-02 4.491549849804174141e-03 6.487716261286117017e-03 6.573279623151993996e-03
5.525926694201119260e-02 5.629445985142224329e-02 1.191566111436511421e-01 9.717434748111052067e-02 2.057519561353554349e-01 2.108850655120217410e-02 3.970699084604545868e-03 4.357748854780268098e-03 7.159081702155462024e-02 2.182470719941832088e-02 5.812695473793065559e-02 3.837935880809068695e-02 1.409409972079593218e-02 2.078775685604925330e-02 4.022872871926462708e-03 1.699718883959625351e-02 1.179819629780686809e-02 2.527192155973835910e-02 8.830862435912530117e-02 1.525878806725942949e-02 1.581973844303973496e-03 1.801872314636484423e-02 2.868966807176203879e-02 1.000444280646081013e-02 5.952216916293855652e-03 3.938400154583704231e-03 3.529065089620437874e-03 2.803906345627770001e-03 4.828325702437154081e-03 5.461902784229743027e-03
2.605347065659619973e-02 7.495860092094736027e-02 1.646851252709559676e-01 1.332260911517637592e-01 5.408595563731306149e-02 8.393676840823479507e-03 6.706503428858165070e-03 4.701968653598308234e-03 2.939921737245695336e-03 2.757548584464344921e-02 1.738322767187221174e-02 3.421455612984398986e-02 1.546873435333310370e-02 1.034801536652244815e-02 3.243510900329113576e-03 2.500926548208744996e-03 5.386234292910691522e-03 9.736640951649404643e-03 7.145819129428126505e-03 6.283527116997377621e-03 2.997823977126635835e-03 3.683637417043059137e-02 1.266361422276643389e-02 2.512317037983348433e-02 4.881442102155735853e-03 3.527915115336778280e-03 3.035875156413322777e-03 2.898878508214000962e-03 5.925209321255317345e-03 6.479061082963283313e-03
1.518628220776365584e-02 4.745748443268561073e-02 1.326547564549063751e-01 5.138752033383493789e-02 2.898869798341660239e-02 4.241874525282694590e-03 6.577243264970801355e-03 3.798045300320399952e-03 2.443142393741008084e-02 6.286982869295613952e-02 7.787027767130670630e-02 6.530506101384722650e-02 1.049584087632663386e-02 9.849036217071348992e-03 5.254200271729570805e-03 2.985712168164720084e-02 1.772868828100465644e-02 8.847028102286108239e-03 1.453912449776206817e-02 8.542831488404310780e-03 6.132952379516796136e-03 1.728720467285252372e-03 4.310206166111256280e-03 3.970100663040757732e-02 8.792714073501026531e-03 4.730675134131416201e-03 3.297995292142857828e-03 3.832418846393088191e-03 6.026536044931490692e-03 2.227716332259777401e-02
1.675378475366212996e-02 1.745478966457369649e-02 7.241991900201126542e-02 5.801497885798626714e-02 2.280880565475625413e-02 2.462168109763214832e-03 3.038147629437446332e-03 3.360030709017215993e-03 3.210125176534565482e-03 9.724610258970088628e-02 7.515037692918973000e-02 4.199218993612426065e-02 5.969981638097877560e-03 2.378085681542747507e-02 2.014714890830047664e-02 3.441642519885591139e-02 1.046704552079796152e-02 2.228224463769861927e-03 7.308723019243712135e-03 2.564765312305592945e-02 3.142420720112730492e-02 1.942048776771146401e-02 5.665466161070886741e-03 2.345374002835080504e-02 1.310766283511245224e-02 1.239678395317658083e-02 7.767769423557770343e-03 5.377212020057487059e-03 7.128052757509504948e-03 1.287262673099107656e-02
3.511092177870354936e-02 3.733707284226612470e-03 3.626144903716523905e-03 1.839879321001839513e-02 8.820109579468838820e-03 1.474017963038545126e-02 2.257606584605438213e-02 1.298356619644217003e-02 1.564400748062913515e-02 1.819506638409142119e-02 1.399747213201141087e-02 6.494889318805469221e-03 3.639687488758470285e-02 1.742521491466847428e-02 1.028509017238172021e-02 1.765792777754805754e-02 6.008593760979160335e-03 2.279827425293099678e-03 1.172994407031028273e-02 1.623604471002976571e-02 8.699340053376893034e-03 2.392588576214573631e-03 2.297425215646216670e-02 2.192980070985892441e-02 8.920214758558690782e-03 9.216480422895722766e-03 8.134413080871658389e-03 7.040413559080601832e-03 8.087044765037713565e-03 1.930161181769061290e-02
5.022596759679254230e-03 9.242815811896469905e-03 4.979758631112424401e-03 1.079741438336203653e-02 1.672842321002202676e-02 1.900303432343793120e-02 1.698268590898580066e-02 1.614383033493506717e-02 1.294474744210315741e-02 7.229750947385338647e-03 2.902905079814774910e-03 1.039774667234408603e-02 3.102737959058090092e-02 1.152204395766442090e-02 1.317516981217498918e-02 2.417168323834364974e-02 1.161302027636347545e-02 1.582113715785970348e-02 1.401205878387150328e-02 1.046113545229300154e-02 3.806203523835154263e-03 4.015064763637565814e-02 1.666155973373849991e-02 1.423049551282571344e-02 6.804227544051928873e-03 7.035783781800973233e-03 1.050425575490490301e-02 1.216526347269526222e-02 1.186814093381942034e-02 3.543201355001208280e-02
1.216639023239477445e-02 8.073039705321329723e-03 4.756785467667824958e-03 2.786681555301300656e-02 1.822499636479973581e-02 7.799706960761363696e-03 2.517502311307557097e-02 1.135762523277269315e-02 9.526576484268679118e-03 9.379455218591735075e-03 8.364140984542502155e-03 1.161592386286136418e-02 2.626272128657035007e-02 1.935189821450444131e-02 4.256848916556153078e-02 3.614803690949026926e-02 1.057667892937004354e-02 2.957150923513007790e-02 2.935169233283488333e-02 5.471288700280003622e-03 1.794542252822402609e-02 1.903066476009721009e-02 2.124957773194032298e-02 1.403980880012080552e-02 8.227314278200429168e-03 1.147462121411307011e-02 3.989652171473186126e-02 2.603398458345155490e-03 7.900615821959182730e-03 4.045464475190048252e-03
2.019566976125466637e-02 1.336053606631979265e-02 2.144698977356497907e-02 2.043198578725451825e-02 1.902598502710270770e-02 4.181077999210808770e-03 2.130195311748451018e-02 8.987096424412182455e-03 3.461671669730022674e-03 1.813092768045614436e-02 1.620784230480564261e-02 1.575646165357630704e-02 3.356379899351212559e-02 3.861428405505445971e-02 1.909509740111883444e-02 2.108503505873437003e-02 1.089076796346719750e-01 1.109697421331905520e-01 4.643161134917152266e-02 2.438208045366345098e-02 2.325191980734216471e-02 1.496760378102786164e-02 1.741015999792159749e-02 1.926737499503290707e-02 1.074301409799707438e-02 1.286042435415749724e-02 4.673797082161705758e-03 7.090356893471337629e-03 8.484430993223769993e-03 2.254996009508768769e-03
1.771249162903400926e-02 9.388218775884429879e-03 2.114114898390038327e-02 1.751497476472840126e-02 2.363872570626617334e-02 3.045067182840690764e-02 2.938750694041786585e-02 2.688515499349878810e-02 1.828809404620318144e-02 9.090770196424173555e-03 1.304638634803001462e-01 2.182997800468042537e-01 4.545229164550407264e-01 2.258383037734000842e-01 4.184985285232466212e-02 8.304318950694401791e-02 1.560908190233565307e-01 4.333709008571110660e-02 1.072936848618751340e-02 3.730850691753419962e-02 1.591664284901805546e-02 1.454526560874311314e-02 1.903059203021728596e-02 2.679679078714160625e-02 2.867416988198745117e-02 1.506090508991563513e-02 2.246661707169129649e-02 1.709069561605827334e-02 1.580360485391553438e-02 1.173954345591703315e-02
4.405764942525170272e-03 2.620971113427794652e-02 1.955152295475749008e-02 1.650989189844551466e-02 1.498604867176340019e-02 4.681113554731457585e-03 2.288766703247583842e-02 1.605377203989920287e-02 1.915392737406121024e-02 1.886166440567825509e-02 3.986817788901447779e-02 2.652970691932205471e-01 4.785868547141592932e-01 2.471141943503797067e-01 8.848197894711212763e-02 9.960975268314120612e-02 1.106206268329636422e-01 6.540936925775171773e-02 1.679387757926512764e-02 5.522212326288566779e-03 1.520493804438091852e-02 1.582293509650500862e-02 1.894793171596747747e-02 3.415281377880928504e-02 3.262299481504023907e-02 2.330805150466018841e-02 1.796189461432402823e-02 1.652686243365034807e-02 1.833619841699660538e-02 2.012761138380592812e-02
1.142626995673231942e-02 2.626805026982803257e-02 6.498478720974865987e-03 1.270477738308367632e-02 9.198250231769221699e-03 3.833969000612080097e-02 2.211255375664693962e-02 2.020719235776895217e-02 2.602507098362836710e-02 9.774536151845879955e-03 2.811963792502831811e-03 8.530293801375658791e-02 3.603761192554885695e-01 1.526575368288031753e-01 4.730297102145043092e-02 5.402186396407174240e-02 2.002764622195176564e-02 2.954494215897822407e-02 3.377624537408530081e-02 1.365323598007771311e-02 1.438359757711903109e-02 1.597284282375258796e-02 2.034276768474364144e-02 3.448411147619750983e-02 4.434057708180799695e-02 3.950351202611926404e-02 2.939517932548023002e-02 2.808081248808915256e-02 2.506707292095909298e-02 2.111423363381029900e-02
9.917343282136240057e-03 2.666321653716292872e-02 5.306238596153620840e-03 2.824560229419029525e-02 1.708874179965912468e-02 5.629359690265188336e-03 1.921815919992009639e-02 1.557406167937055302e-02 3.576249356942277219e-02 1.171783637536391934e-02 2.092964819808942629e-03 1.407806841120695825e-02 1.663964497437604162e-01 2.203024886380914316e-01 2.293083818821715358e-01 3.022711459096829034e-01 2.734967840448714327e-01 1.793492003834830650e-01 4.945151920052964223e-01 2.328040062057977755e-01 2.043460654910763188e-02 6.687350587937007131e-03 5.547579508784728289e-03 1.444289433088624328e-02 3.188359287294435795e-02 2.839754036441098292e-02 7.545949335776232225e-02 2.860475526156579240e-02 3.420172004877487099e-02 4.014067830622080474e-02
9.528550765172517575e-03 9.125391468190951344e-03 2.192320278513400569e-02 1.703219672839747373e-02 4.937384132276991834e-03 1.410164710113891856e-02 1.039998435224303783e-02 2.984114567037053981e-02 2.061961100625252230e-02 2.152189362923424051e-03 4.439600552413547341e-03 7.050253867848564615e-02 1.502395452212647031e-01 1.867515986237369141e-01 1.648247125459559592e-01 1.944896259072879108e-01 3.336515376697232749e-01 5.818944691205927278e-01 5.968588154598146733e-01 4.721352626806020192e-01 2.043120543086163893e-02 2.165630428343450278e-02 1.976134111829965997e-02 6.274208559914118410e-02 9.122211939437245565e-02 4.718913347522225576e-01 4.764319494762625506e-01 1.051332370412570300e-01 3.472981560762123526e-02 2.690061423839580287e-02
9.055369297279314625e-03 9.583744174847424677e-03 1.878615396066949869e-02 1.942288630616136047e-02 1.255768670487308891e-02 1.516021642373994484e-02 5.753289549510112733e-03 1.550710260692031266e-02 3.238114388720565728e-02 1.170874431783405431e-02 1.229156759045107496e-02 1.099028220812778463e-02 8.587068799252703388e-02 1.704307122443706191e-01 1.555237733816690338e-01 2.332921271672422359e-01 4.058913572722642749e-01 4.964149033576212289e-01 2.881401114229075189e-01 6.325934321787310410e-02 3.884527738588738205e-02 2.735705160496981203e-01 4.102189828363860258e-01 6.920439279979087033e-01 6.519524696327936297e-01 8.549050357503897857e-01 6.876690896780534024e-01 2.042618291188158242e-01 4.934969974777347890e-02 2.914348235447174196e-02
1.193772810972885089e-02 1.356808068589901613e-02 1.268167792851925511e-02 1.142845268927547217e-02 1.660516892602031599e-02 2.951443181926825809e-02 9.137313743332237115e-02 3.045177160120204340e-01 1.500742535871418259e-01 2.600253155835209953e-02 1.958330493679525525e-02 3.112982146831831318e-02 6.173039110710063643e-02 8.942729641748403679e-02 1.160481063444845362e-01 2.044481771678905158e-01 4.419175709245240502e-01 4.454273023622685179e-01 2.110112765579159333e-01 7.307007477536187068e-02 3.248183121899732573e-01 6.080691418346259036e-01 8.043822163520032431e-01 8.255562393133620835e-01 7.224231040033055606e-01 6.231359574424031322e-01 9.204104515762872030e-01 1.623112220240081061e-01 6.906079940868646745e-03 3.424415574163700016e-02
3.049496108883676532e-02 2.383208792364957529e-02 1.140600526970777379e-02 1.581570370532083686e-02 1.001241645243890199e-02 4.551979293700175039e-02 2.513596861111909719e-01 2.066406295618960776e-01 2.052494834991272776e-01 1.035502793219402057e-01 3.833487957118254796e-02 1.049555091227451567e-02 1.027745380011516399e-02 2.596436959502441966e-02 5.774929989200836000e-02 2.613431617802324247e-01 2.744430957219171074e-01 3.186237199508633045e-01 5.539379269979755049e-02 9.873222074510745738e-02 3.622524134796631379e-01 8.101400936178260181e-01 1.030668057814860816e+00 1.061670856023965159e+00 8.634923625857778839e-01 8.264212201258178681e-01 7.645504843682721097e-01 5.984682267616632245e-01 2.862456945547956280e-02 1.907353084342562621e-02
1.239421974032131786e-02 3.396196665076824800e-02 3.938201609759993914e-03 1.786090714810602276e-02 3.764187410001131051e-02 5.233516575314671460e-02 1.648914279029125018e-01 2.061504997026762376e-01 1.411870570270270242e-01 1.106116558901464875e-01 2.335516077460489393e-02 2.315526412442005071e-03 3.532641941193319021e-03 9.906721248844011646e-03 2.144962174062793950e-02 1.255070413153079045e-01 4.770744281277108229e-02 1.514375520463262514e-02 5.059319285727181120e-03 3.689471909734776817e-02 1.427967916729560027e-01 7.724096517735432599e-01 9.910634493831013137e-01 1.034778795717643973e+00 7.519014156727316101e-01 3.482609471443700033e-01 5.660910819856468379e-01 3.835078185037990584e-01 3.433887630228203702e-02 1.331228360543791622e-02
1.368311202090804687e-02 1.767533647647602860e-02 1.143471809490563540e-02 1.313293776949217215e-02 3.093454179841110055e-02 1.761793026797916009e-02 8.935252671949775460e-02 1.138794476401895628e-01 1.034205813257398909e-01 2.448887683015152014e-02 6.188771809171367960e-03 1.458124916309256214e-03 2.641682854247710127e-03 7.691923876205154255e-03 2.811938665715256469e-02 1.855146211121750169e-02 3.365510463531204421e-02 9.874126064405592401e-03 1.847744244496081836e-02 8.761906901661518920e-02 4.714911859912035430e-01 8.890164779232591075e-01 9.499370430366204099e-01 9.037308412904080379e-01 6.977091771482474281e-01 5.148731020568237948e-01 5.025889623380038751e-01 3.348476649261292182e-01 2.994052374362873165e-02 1.049959619987304513e-02
3.562943903821966241e-02 3.281253740456240714e-02 1.696153506248377490e-02 1.228724801538204348e-02 1.603721717616511319e-02 8.457340322934537441e-03 4.675812944521375719e-02 4.064954603595450494e-02 1.099094925869327326e-02 6.193666452076387191e-03 2.353794183713987364e-03 2.259676857137841999e-03 3.420848542970085504e-02 1.657003427400935425e-02 1.607198919467555699e-03 5.465543436735592793e-03 1.945395567674272977e-02 4.401673096306669974e-02 4.207254771141713534e-02 1.858944600616040110e-01 4.967058927914655420e-01 7.015393975745616295e-01 2.782704475855539150e-01 4.204822251291400748e-01 5.526660519880857159e-01 3.184388477335961531e-01 2.407600287646505799e-01 1.988603726082243117e-01 8.476329733045493559e-03 7.880401782613361689e-03
2.924540266915450631e-02 3.376689949274651326e-02 5.024063807860044105e-03 3.516625371470630517e-03 2.922494760903865396e-03 4.271903042665267658e-03 5.968536586754256273e-03 1.471369911291526330e-03 1.905899999511336505e-03 1.149427050224512831e-02 1.644328756159913266e-02 2.611291052452592229e-02 2.463113645738427421e-02 3.392310579993161948e-03 7.744828428733138877e-03 1.023253955539139559e-01 1.960888310275143986e-01 2.821039192476937352e-01 1.915222243472675945e-01 1.414491485958117856e-01 9.644612349571843324e-02 3.313096603921726613e-02 1.238487267220080186e-02 2.720178342072921210e-02 1.007958768397195781e-01 3.475170984024782833e-02 3.228436874863773592e-02 1.309878587454172370e-02 1.579351480530686441e-02 1.485941454440298237e-02
6.074968651451127105e-02 4.674011322716769418e-02 5.199418614345340146e-03 2.352560087341813971e-03 3.551694386602633792e-03 2.639871291722030444e-03 3.968050835164983053e-03 1.712287110615522828e-02 1.581889221304877066e-02 6.946184146015151571e-03 1.747792188172602942e-02 3.177424459057281297e-02 3.258242341285984278e-02 6.629722847645816604e-03 9.071290403876785396e-03 5.944022782981052411e-02 2.184374252719313014e-01 4.073290920652896108e-01 4.607232071331100465e-01 3.924595322709438783e-01 8.017542203721507443e-02 1.721580710045511955e-02 2.074337851817210227e-02 5.188267526226490733e-02 1.174043197995989773e-01 3.516858188785882550e-02 1.342765349239418912e-02 6.396310749460178482e-03 2.184716934919079048e-02 2.122957732636739439e-02
7.473811436326011082e-02 9.506316504088231992e-03 2.718908418528556345e-03 3.131346437200426686e-02 4.052015119762741174e-02 2.329265155247867147e-03 3.047375638106159662e-03 1.406052688375632187e-02 7.944221859092895355e-03 9.110201319596613126e-03 1.670856387336814783e-02 2.829231806073952138e-02 2.501512980318114712e-02 5.336527053443064841e-03 1.734655966316657819e-02 8.318478970645812320e-02 1.628771384375399534e-01 3.776745662615804688e-01 4.781301873350898290e-01 4.007497451018994239e-01 1.935619912703710199e-01 1.154558683310034743e-02 8.004788110632795120e-03 1.739416629134384051e-02 9.627397562351897031e-02 5.890604729859286182e-02 5.314781213444551289e-02 1.234014196217244827e-02 1.740248861598315752e-02 1.590191855490988987e-02
4.063504226589480239e-02 1.257010526099588965e-02 5.124331965357241392e-03 5.090126477726341497e-03 1.175801816956142769e-02 7.941695362729619262e-03 3.368048770143777966e-03 5.515614286484495088e-02 1.947104261161833978e-03 2.522678908691761580e-03 9.902029434817180217e-03 1.179182415496269655e-02 1.501457681986439162e-02 2.849946303126465671e-02 6.749808816179090828e-03 2.507493102022739090e-02 2.570866173810571961e-02 1.112855590271128459e-01 1.445917040926929797e-01 1.245879350243352668e-01 1.024716877516934910e-01 1.549625566228502588e-02 2.830960386130417297e-02 4.514142341625899946e-03 1.741161692182486079e-02 4.416312516195433635e-02 1.189022906034682414e-01 7.274922028793145978e-02 1.931684550709329706e-02 1.702066504322390789e-02
1.449428985029140547e-02 5.752288001094254394e-03 6.313266510408560572e-03 1.101764291667131461e-02 6.206813208953027884e-03 2.874327986019826423e-03 5.468420998381157139e-02 3.907557003479470575e-02 2.886074444357862763e-03 1.062655145901711569e-02 3.059114138098652930e-02 1.123853693020235127e-02 1.660907000460259964e-02 2.992177833202790821e-02 5.501605079384293967e-03 8.883236452739957587e-03 7.197791773514997105e-03 4.142441311440247902e-03 7.117059458099960975e-03 1.260926108999801606e-02 2.296031119523924205e-02 6.643279636050746124e-03 2.981267766463786134e-02 1.403112146531712741e-02 2.489416885801028212e-02 8.907612008322322514e-03 3.086459289261051647e-02 3.626654643374389864e-02 2.114429511987024959e-02 2.474006261967473183e-02
1.469063111119574966e-02 1.179293789812562755e-02 5.910388331829879473e-03 4.470887103885789506e-03 4.283348802512141132e-03 1.666795314853667656e-03 4.542516010670090421e-02 4.688414744995388073e-02 5.084185766914811611e-02 4.928009934213871748e-03 1.654632792518269824e-03 1.921199280364495462e-03 4.161712402389484977e-02 2.033300305914219775e-03 5.120910540550689498e-03 3.450980741699673227e-03 2.854448075395792789e-03 3.388886657183327877e-02 3.116354553019034385e-02 2.472818847875417336e-02 1.951834667040526841e-02 2.725545465247292132e-02 3.690752235297805467e-02 9.912265589823046272e-03 1.191130708413973283e-02 7.006834995357685142e-03 1.340857089576865183e-02 8.588152668876384774e-03 1.103315946159141338e-02 4.464787208682238773e-02
1.996407919894059232e-02 1.041132638364443593e-02 6.079612586318615050e-03 8.557251326062971855e-03 7.753615619300305642e-03 4.211113965031570983e-03 1.421859836237636399e-02 1.071568899170579486e-02 1.678066779875667276e-03 5.042190662963028092e-02 1.798433429570952050e-02 3.843728456202716304e-02 3.880088130184307198e-03 3.888457970929705670e-03 1.145973141921183790e-02 9.713294634942585409e-03 3.887768290051829990e-03 7.002756575411349382e-03 3.547715697372697680e-02 1.655475072382789348e-02 1.587750639462631383e-02 2.384708889797270207e-02 3.298268394776312368e-02 1.391546430063014816e-02 1.085612753075243346e-02 2.135993262420070662e-02 2.569891186382656373e-02 3.079318125142836704e-02 2.144199677594514630e-02 1.908201702258930516e-02
2.692601646014130407e-02 2.331371883458609878e-02 7.265928734754316040e-03 2.555868135771661304e-02 3.065635638788068856e-02 5.723519218857969770e-02 3.745509989278093116e-02 4.131956254016973251e-03 1.602204083357638585e-03 4.025733740779405267e-02 1.221199855689862092e-02 1.405129241819375908e-02 1.471274026761200740e-02 2.256093401045754579e-03 3.254653312300219252e-03 2.437254419253159082e-02 2.110673301519427197e-02 2.363677681876227149e-02 3.336404030285972794e-02 2.032765453792336266e-02 1.432306031395189430e-02 2.100892993231752784e-02 2.234096843346426373e-02 3.308223552906554982e-02 2.032371337593984542e-02 1.660976784294248762e-02 2.517410086778594513e-02 3.881487547455739207e-02 4.194651700723309173e-02 1.547861425992177846e-02
1.491126460724814112e-02 3.703743446951873047e-02 1.134616573720075364e-02 1.245686955483725315e-02 6.208790517906213891e-02 6.570778508155297737e-02 4.339128292328271047e-02 2.955982768042682632e-03 2.173536006575036740e-03 2.345892313484097217e-03 3.738310460802472812e-02 1.861644186168733700e-02 1.046729439721472664e-02 1.508780014937384679e-02 3.658925140203179299e-03 1.839279880831390379e-02 4.140261901678331073e-03 2.469842131425141127e-02 4.751169219745872419e-02 1.022572593830102169e-02 2.016152917855832880e-02 2.804301688017422217e-02 2.365280474496947449e-02 2.344579348674977540e-02 3.030552898750807703e-02 2.363227877848304848e-02 2.856105291762880971e-02 3.390547802192820509e-02 4.010950266396980102e-02 1.743653387036732394e-02
