3.731211907673729344e-01 5.351201916467024366e-01 4.489048060982901989e-01 5.579432382880862296e-01 3.883370009744666618e-01 3.205473128466918877e-03 9.925018854397213430e-04 2.662721153265929733e-03 4.804593842329860608e-03 2.151422250487101170e-03 4.301159216713395204e-03 2.251181522906331445e-01 1.493500919568757357e-01 5.495081721217655035e-01 8.604005349069757114e-03 1.529126379339207920e-01 2.110875155191936029e-03 6.420988294666416570e-04 1.868971463843751690e-03 5.184191191223117556e-01 4.811034761981081154e-01 7.300777436065684911e-02 5.598006681262325535e-02 2.266415951855006161e-01 4.460530344272801706e-01 3.505164246977022779e-01 1.609505908203101576e-01 1.423744186484349888e-02 1.367333513402808551e-02 1.730554827730589051e-02
2.470289113177974449e-01 1.278627469904972287e-02 1.824808308619798453e-02 1.040516226206422527e-02 4.828996500892759891e-03 1.109597340473223413e-02 3.757092856182803545e-03 4.530545936337580792e-03 1.988791951268816059e-03 9.706298523682239422e-04 2.690325300184191228e-03 1.148545691926310813e-01 1.743982561984241952e-01 4.203810441582613855e-01 8.498432922166910750e-03 4.201899363042617686e-01 1.944792161873357909e-03 1.173412477156527377e-03 2.667638418598674774e-03 2.414581358596884237e-03 2.766770803691933067e-01 7.008333758129035862e-02 1.456809904382089516e-01 1.322830640340626196e-01 1.193891644709983157e-01 1.608343473714766991e-01 5.687053878593817391e-02 1.451337387383284071e-02 2.073460306243678566e-02 2.080696905595190785e-02
8.081842756060692023e-03 7.679386005609390407e-03 7.972868785971563149e-03 6.457444453185494024e-03 2.456070909100024902e-02 1.005706723475497354e-02 2.072609811238013411e-01 2.176768626920090322e-01 1.738071606376009881e-02 1.833268337485043477e-03 4.565469762185217668e-03 5.065777221874012692e-03 4.078866185316851710e-03 9.176695523181467237e-03 2.596704784917041042e-01 8.395263223366757413e-03 3.727825507021001288e-03 2.951352619933351150e-03 3.319814498280439837e-03 3.027895278286603029e-03 1.712285574590340920e-01 5.795981809404417151e-02 8.859283175373072750e-02 3.137878610484152314e-02 1.904672066179839002e-02 1.263582125391702650e-02 1.145224549624562944e-02 9.007517226143450795e-03 1.538391767060490190e-02 1.726495388428723327e-02
1.726331166865422307e-03 4.850192866241278059e-03 1.063608563616285849e-02 8.586378418738343024e-03 1.018888702271081304e-02 4.207803864931390914e-01 4.184061986093842167e-01 2.598242587717922714e-01 1.408826403299496821e-01 2.691844085250748395e-03 1.013853936919849102e-03 4.930442569251677204e-03 7.034708889158005664e-03 9.670628283308646198e-03 2.032031961198260683e-01 1.766971432840600542e-01 3.795174105732586622e-01 1.111034960821676238e-03 2.896802016302142116e-04 1.351580513471507729e-03 3.106946522362899477e-01 1.249087080684931350e-01 4.211572575306046784e-02 8.421911752716730593e-02 1.563705595378718158e-02 1.125506381477918080e-02 9.797261246664287770e-03 9.297356966573694023e-03 1.888222278512389704e-02 2.051035673039113341e-02
9.859193961181695470e-04 2.999953429086971331e-03 8.360650759462788517e-03 3.247129310397392759e-03 7.026860669923565630e-03 2.456651445620394725e-01 4.277219028574459347e-01 2.404181378981494754e-01 8.831949368593965122e-02 7.763741683218704920e-03 4.669818798385464570e-03 1.377151181925452897e-02 4.852225237277022485e-01 5.067908414911135306e-01 2.679861444306409490e-01 1.080985484544279840e-01 6.335622197011923223e-03 2.447580788297563491e-03 3.089507957354711148e-03 2.484780337048996153e-03 5.114008338205369153e-01 1.638050697860252980e-01 4.191560878172866378e-01 1.394289820858815865e-01 2.833353485288682763e-02 1.515520885446864502e-02 1.065961196480405201e-02 1.232442686698776574e-02 1.927624400927103673e-02 7.084298567895259968e-02
3.810001415932507546e-03 4.194350616015906155e-03 1.136260720388853479e-02 9.720022928818438865e-03 6.136857075541938926e-03 1.390714382446990860e-01 1.758162473325213249e-01 1.868158645560718256e-01 1.510452387904600846e-01 9.755363123151731403e-03 9.620242363263795116e-03 1.399586249164496560e-02 2.285666980389166603e-01 8.689234476564892951e-02 7.316839505952085765e-02 1.232947515895702062e-01 5.101736329543421142e-03 1.659651021537280058e-01 5.464985468095246990e-01 5.483847468580185097e-03 5.725973159021463185e-03 1.034212377675049893e-02 5.166464917618487362e-01 8.142762700422644107e-02 4.240261512666916588e-02 3.989214339308792129e-02 2.521459112263150365e-02 1.739129840356271398e-02 2.297333772044943961e-02 4.125905054304086078e-02
1.321784207666669431e-01 2.024376292150517898e-01 1.988532502807692226e-01 5.572665596360128031e-03 4.514082041265805034e-01 4.205317050128474371e-03 7.148177654804087171e-03 3.888784825320845250e-03 5.751598441736150390e-03 6.166363081469934324e-03 8.331506660597717828e-03 2.766792188651012174e-01 1.282080005563783764e-01 6.030950290122331914e-02 3.535787017439710050e-02 6.081299576968678122e-02 3.439371572020912260e-01 1.560151149944168647e-01 2.786318663813352244e-03 3.992626541412533717e-03 2.490984894778725846e-03 1.605672692837460946e-01 7.574067429371666993e-02 7.344147353978951187e-02 2.878984187208185816e-02 2.986114957787928612e-02 2.681734935724288879e-02 2.332233023744990225e-02 2.709269954213758269e-02 6.390649757033325939e-02
2.647743585648990594e-01 4.974300156684121621e-01 2.772493758664381081e-01 4.244378623901802657e-03 3.489133316358571883e-03 3.891922435545870553e-03 2.272193978804141947e-03 5.552470682393164866e-03 1.157707891093694673e-02 4.038159595159247495e-01 1.655160946630375163e-01 4.996605909629421305e-01 1.075252121212774969e-01 3.876700620730434699e-02 4.434024415377740835e-02 8.286220693629117728e-02 4.936853298533141511e-03 5.143124361799445224e-03 2.226340043044032577e-03 2.510548015323051021e-03 2.254158509143543987e-01 1.330721619325654914e-01 5.396266645998429312e-02 4.551693521048730262e-02 2.185434135419749707e-02 2.315402237544661110e-02 3.783119477964016347e-02 4.892139759852759395e-02 4.816157422941502037e-02 1.384092435209842431e-01
1.219390836093665366e-02 3.910146906248230803e-01 2.293910674495185376e-01 7.157980282411763664e-03 3.186058106821650776e-03 3.525234937358207032e-01 9.022175425606203392e-03 7.610712926128035752e-03 5.534894847852952493e-01 5.688355215188342084e-01 5.086491196403913895e-01 8.483232597184076768e-03 9.983136369343875022e-03 3.880565552339733295e-03 1.403953548835256693e-01 1.197096227621661235e-01 4.812482730404420428e-01 2.904625363560995634e-03 3.058964453779399427e-03 2.975502105585927093e-01 5.947212250592016913e-02 6.222128235219491488e-02 6.792443044275316144e-02 4.457145512794694758e-02 2.620624531495358706e-02 4.028070734257185870e-02 1.605995111763219019e-01 3.229800889877798009e-01 9.174621700346928810e-01 4.453836168130550499e-01
7.968018695382630273e-03 5.973386018512790926e-03 9.349146710006545763e-03 2.758184578296431037e-03 3.786793105592180502e-03 1.646742456794416942e-01 1.020828335354291919e-02 3.845297302762034630e-01 1.883477049916915669e-01 6.840584096062747588e-02 1.269058634653999831e-02 4.903595255221825620e-03 1.961682028719746815e-03 3.556699520610036823e-03 2.115261683667872105e-03 3.084531991357450723e-03 1.220765255948377467e-02 1.051471640613499750e-02 5.920277918938672383e-03 5.627029131726870269e-03 7.485152478814505184e-02 4.753236835615490263e-02 5.476694175896455741e-02 6.032319272764922330e-02 3.375323192993785748e-02 4.339513380064661391e-02 4.207170624570788497e-01 7.200868461752015781e-01 8.885801588463140277e-01 2.309513325277048057e-01
8.528627022909266928e-03 4.208620542646728246e-01 4.811367682185199376e-03 1.104241419052374561e-03 5.684803335134625338e-03 1.019818371186191619e-01 1.007020672047652388e-01 9.242826281529867294e-02 6.405043734861144700e-02 5.047535552776482026e-01 1.740029305341107835e-02 1.228339800746778773e-02 2.559012056162527499e-02 1.284989780516340371e-02 2.409161291792928736e-03 4.797274193161176099e-03 8.822186007978476477e-03 2.394939677205981839e-03 1.834293977515446704e-03 1.209237134833537342e-01 5.116330586765659161e-02 4.588458928406490001e-02 5.947490134662458683e-02 8.337908663417205324e-02 8.922515972505773441e-02 4.870447460212128099e-02 7.877032950403109468e-02 6.288792001604406878e-02 5.654287793627713055e-02 4.064501180128497065e-02
1.888052323455427783e-01 1.027291427031676307e-01 1.065921841666449613e-02 8.976103409047510306e-03 7.922057809694574987e-03 1.653082280216240929e-01 7.738692514163497682e-02 5.359025441591213496e-02 6.412287074837613732e-02 4.584030158531581314e-03 5.084078771479712267e-03 1.653335744797139462e-02 2.624107327117599156e-02 1.395025614813928325e-02 5.156865963281738290e-03 5.949555048628421203e-03 6.557635613787049858e-03 3.841668138214334415e-03 3.124673943493863886e-03 2.804070892104540969e-01 4.972283663454487440e-02 5.079043968797732067e-02 6.020613100769624249e-02 1.077900449280598805e-01 1.024445723805537667e-01 7.303806559117587138e-02 5.627912562519644946e-02 5.173481776392781228e-02 5.707360041739384382e-02 6.238224827439892151e-02
4.478130446989991159e-02 1.071819072604052875e-01 2.360135378464369160e-01 1.802852304713818687e-02 4.123823802233959612e-01 1.408024916551062211e-01 7.815117467914620142e-02 6.799973679807484739e-02 8.699172191895315764e-02 1.952745948733704967e-03 1.647944747312187763e-01 6.429059972864486008e-03 1.938534147829567428e-02 8.571861966299491875e-03 2.782528288708575100e-03 3.319065004398606862e-03 1.236760509092667487e-03 1.823857251023928332e-03 5.113071011359026849e-03 2.798488956913882785e-03 4.845850348153871168e-02 5.327779403727894714e-02 6.760426043690306863e-02 1.123788930224178806e-01 1.423404879252038457e-01 1.243366468323544305e-01 9.175293474512387359e-02 8.709832250409983712e-02 7.738387364613791286e-02 6.492760496753149924e-02
3.876773337090060056e-02 1.092767535479459706e-01 1.899191293116815338e-01 1.349382697993654068e-01 7.894541251267951643e-02 3.049003883702571249e-01 1.089897117962037969e-02 3.259838934226136267e-03 1.223396135291671960e-01 3.939295443226025623e-02 1.391976257950074958e-01 1.658621118045715444e-03 8.750788574709553180e-03 1.230242440472960330e-02 1.364847956446388171e-02 1.914238749625146382e-02 1.758246104137091426e-02 1.159843762892552935e-02 3.215040587730952359e-02 1.648331172974282569e-02 4.682176688058768514e-03 3.227548916024547410e-01 2.434201814517952533e-01 5.795814597218327258e-01 9.243069254131954654e-03 4.382219957337675845e-03 9.275398047236319693e-03 5.663628014033927210e-03 1.057581489843358868e-01 1.233530114702567626e-01
3.544079076729368671e-02 3.542211597495894398e-02 9.590371698611134532e-02 7.149373215895961087e-01 2.597962197155550546e-01 5.757990603415659436e-02 5.183546901433254243e-03 3.001419077192112907e-03 2.740021300683045773e-03 1.506639907103296261e-01 3.067791212478481189e-01 7.794365231550167208e-03 7.567495210980530393e-03 9.993431854470009174e-03 9.394344247958180683e-03 1.180107258688561228e-02 2.081523332795818387e-02 3.711499254648312901e-02 3.895827058086033523e-02 3.139703652043790427e-02 3.632537801410110068e-03 5.536891049769582067e-03 6.606598153121437389e-03 1.382341516218760571e-02 1.363749568120478303e-02 2.950855977462309848e-02 2.934441712149202935e-02 1.192294007862786456e-02 1.090829053478768740e-01 8.401138704258954981e-02
3.184501612838176732e-02 3.460654430117038327e-02 7.754631777017226280e-02 8.628154543366300944e-02 5.811373924796413293e-02 6.081572018312424166e-02 3.364336824319048569e-01 1.104444385315575452e-03 2.711283516392146153e-03 1.560281515772319119e-03 1.637887032286863050e-03 1.017818048178694952e-03 4.101292087993437495e-03 8.645497193334865729e-03 8.387357247501711632e-03 1.333516793233500801e-02 2.417429747706957913e-02 3.078796915852655830e-02 1.864177870989775637e-02 4.215115808528067595e-03 2.558967639383076531e-03 1.772211236400669798e-02 2.595484230785174984e-02 4.399750071495751175e-02 4.170990444115060813e-02 5.449797584878940393e-02 4.357874905291174439e-02 1.970070201572153915e-02 1.585073974543926290e-01 9.329537673998941627e-02
4.057790138669704894e-02 4.663471614885777300e-02 4.528674735987411187e-02 4.263918260545616207e-02 6.205515576694953239e-02 1.051377884586528755e-01 8.631568932696087951e-03 2.103451328101695744e-02 7.931612143070197393e-03 1.303679955982807101e-03 9.287783027128102258e-04 1.403429947718750357e-03 2.796732290519365199e-03 4.292316046748441936e-03 5.886530065310298897e-03 1.093996820569880131e-02 2.506437940443396670e-02 2.693356279067810055e-02 1.357336086263987926e-02 4.879724570883865568e-03 2.130236871305821872e-02 3.900995257072503025e-02 5.047387608433129974e-02 5.253382099738982541e-02 4.673109797969041829e-02 4.050959537454627141e-02 5.991373169146444605e-02 1.400213680324016892e-02 2.075876126014110368e-01 1.121730279083657661e-01
1.022373742581669381e-01 7.984716647855574778e-02 3.843980052626546490e-02 5.380373135032540111e-02 2.082231104642960455e-03 3.881456687306130554e-03 1.435527243074478931e-02 1.060083310844580490e-02 1.039727846333137438e-02 4.991742783361351014e-03 2.791664997691517200e-03 1.427636043891545269e-03 1.385012864402096477e-03 2.680675967597573230e-03 2.765288183333424257e-03 1.315388449494840975e-02 1.488725412536858611e-02 2.213438617599047115e-02 4.109776091275292760e-03 7.569148773968049741e-03 2.365596323795675013e-02 5.183726178688295716e-02 6.471537659796740283e-02 6.817927792063753489e-02 5.687931478703737997e-02 5.504673812875694044e-02 5.122214901790347885e-02 4.580297590263644747e-02 1.040270910875593958e-02 8.276880055686443652e-03
4.060346533843472994e-02 1.112000234875480109e-01 1.917031367408448816e-01 3.115115032432253829e-03 2.404328814950396076e-03 2.419184400736864270e-03 7.662979817105113056e-03 9.572846623288656237e-03 6.529971297485065093e-03 4.954884800088862028e-03 2.629689897102884324e-03 2.032928349632658060e-01 3.072397926345239449e-01 2.116920226550047385e-03 1.010640269278333721e-03 6.191726441595730296e-03 2.511337463090914345e-03 1.033848919027876559e-03 2.435336166565420513e-01 2.692594427485593342e-03 8.963967610501917885e-03 4.847503076245864712e-02 6.226691528941183384e-02 6.694440767007923954e-02 5.007614364221455588e-02 2.363752813573660391e-02 3.868890078645183944e-02 2.644275864971170134e-02 1.978528118380257911e-02 6.355579405766954570e-01
1.901796694793986102e-03 3.437586356071024515e-03 1.977503043061011601e-03 1.500617022731524225e-03 1.293475952273415381e-03 7.286236113185588911e-04 3.715961169160719550e-03 4.751794540092875094e-03 4.334620638312828775e-03 2.304232201618470425e-03 1.930141351960704740e-03 1.413937073189288351e-01 2.425371511438520755e-01 2.429671048959995347e-03 2.524582538617601950e-03 1.406280262579828527e-03 2.235292013089161967e-03 6.698815043742478714e-04 1.277770245223213601e-03 6.060462306243398663e-03 2.845033816726558196e-02 5.486223384676779113e-02 5.996523980156686501e-02 5.914123599600400183e-02 4.716246725138869417e-02 3.559770949740558021e-02 3.515371396936690929e-02 3.344371649608246511e-02 2.817371953485286323e-02 5.110294018255517878e-01
1.676652833611636797e-03 2.849010034995061880e-03 2.654165997228572719e-03 2.842610385223788387e-03 3.966735042367162609e-03 1.359487386909380337e-03 4.903949584962898761e-03 3.216666105266934896e-03 1.036011797956408508e-03 1.100720092704818341e-03 2.424096104530233942e-01 2.156656230946994157e-01 1.206797641955320993e-01 5.631777695327326583e-02 1.212214626739972351e-01 3.567017309822660964e-01 1.219699543570148398e-03 2.229287778470971215e-03 2.241424302520590717e-03 1.037483561665212585e-02 2.901755186480323156e-02 4.298670540921336464e-02 1.786057015805639706e-02 2.809558220149355537e-02 3.806383334348428793e-02 2.244442524477852779e-02 2.852182134228600438e-02 3.343011733785936079e-02 2.891446462684421070e-01 3.144510960786749409e-01
1.319570132483393558e-03 4.988569986523396817e-03 3.928301340388442586e-01 3.389493498838548891e-01 3.170126053918933540e-01 4.575033684064395700e-01 2.285138576622783736e-03 1.597986959393852824e-01 2.214554951166032848e-01 3.839451435531206214e-02 5.676197817682131913e-02 9.124749915295764235e-02 8.794838939804754119e-02 2.768706939158549485e-01 3.193965908457699690e-03 7.320675158282282692e-03 1.176388623267390215e-02 1.367342897042501254e-02 9.714261670465830500e-03 7.569109039301052076e-03 5.517195048857309603e-03 2.027834909617933553e-03 8.058118368459290604e-04 1.831469519222306925e-03 6.982869851078209698e-03 6.167397179567944525e-03 1.082705239622676167e-02 4.185209374085844813e-01 5.416182544385284015e-02 5.054565374789453391e-02
2.710109595418128473e-03 9.023953646595455486e-03 4.416591430841045884e-01 2.631190538097772369e-01 4.499909221404603255e-01 3.479627960145081911e-01 5.386676144776015862e-01 5.879021194416014784e-02 5.328958736113389993e-02 2.311458369934913867e-02 5.741612892881900465e-02 1.062438275694247147e-01 1.160295589868577393e-01 5.375968997438729247e-01 4.558552803033207208e-03 2.671528748514044420e-03 1.010106404632794656e-02 1.950543809216861990e-02 2.287052408162475181e-02 2.056268288436240502e-02 7.618174469922809125e-03 3.665774149138557089e-03 4.427455610747020077e-03 8.005149566087409185e-03 7.974569555405272916e-03 6.043783151424017910e-03 4.814609425503713069e-01 1.971342097874806409e-01 7.378888709493658382e-02 7.079331918073981933e-02
3.424104532958303221e-03 2.328002221649957092e-03 2.486696521332850129e-01 1.090384735299810282e-01 1.430667339494788859e-01 3.254556323588017608e-01 4.311433579856331910e-01 4.952058039500659148e-02 2.648175409465469698e-02 3.019184782441615075e-02 5.487248009191591364e-02 9.364416087040781933e-02 8.716469375566458788e-02 4.178930222885438583e-01 8.505820861970624092e-03 9.133259484767944011e-03 7.566111351121239219e-03 1.800757625596294612e-02 2.349356311853219650e-02 2.073902083321256182e-02 1.825851247847181183e-02 5.228183070613825478e-01 3.537105049172031834e-01 4.580229311800035341e-03 1.114977203408041087e-02 9.605017107164732365e-03 1.683489627298867877e-02 3.367144758789307746e-01 5.901608535276953865e-02 5.332673740452072847e-02
4.472288641439828814e-03 3.323101335801948060e-03 5.328261523863677684e-01 5.744860351053261427e-01 5.397778127987646300e-03 4.359732765322542163e-03 4.484587095903403431e-01 1.879964976292926304e-01 2.708812061587187459e-01 3.451659222645159231e-01 3.228802005358012706e-02 3.877701024605600955e-02 5.102816403759629499e-02 9.908661984958583302e-02 4.979795074323515314e-01 8.971382659296759515e-03 3.404262269090871894e-03 1.670020122522294925e-02 1.893022722340628045e-02 1.396373141162076184e-02 2.093858497131375826e-02 7.508068374949311737e-03 1.048607261920696809e-01 1.694824269955216844e-01 1.344681355863880032e-02 7.214193149909133539e-03 2.713802012834886160e-02 4.165452697821193234e-02 6.833223296356612242e-02 5.972962002108053725e-02
1.715909469270907994e-03 5.828003024315151492e-01 3.176068019125517349e-03 7.017408305668085614e-03 8.184110075918448191e-01 3.853130717668268868e-01 1.816368620310985227e-01 1.310343206188247511e-01 4.053336499239625912e-01 5.111077338811304861e-03 1.060765370468668700e-01 3.922996575768234601e-02 5.805418589597792500e-02 1.068383187820597935e-01 4.420897492632084314e-01 8.232826614524176717e-03 4.656830851504553115e-01 2.207689967871432346e-01 3.265384019813988292e-01 5.554709243159052789e-01 9.366959799554536517e-03 2.247436483003261154e-01 1.151117588624190058e-01 5.322370676061554118e-01 6.918228996897080041e-02 3.737355501826729043e-01 3.660195184701646454e-02 6.741006117145666166e-02 5.564120509605976483e-01 9.486134570916122943e-02
1.886197897529238478e-03 3.438448706538619476e-03 6.617098843909973160e-01 5.406644856567676127e-01 5.756959274075027500e-01 2.279673296601407162e-01 1.494393021745188954e-01 1.539470022203222321e-01 1.696887344644253393e-01 6.711376894502929513e-01 1.964193030036053278e-01 1.962367124137036067e-01 1.577482820984896505e-01 1.599057602269762235e-01 4.021027382801782846e-01 2.722822400833166956e-01 1.946588399954283233e-01 1.239306060017855426e-01 1.100698650222573655e-01 8.344444315084112440e-02 6.667072480597817374e-02 9.702717537824218086e-02 1.476310944867787467e-01 3.434432676883574787e-01 5.852127511475466726e-01 2.632016960535695227e-01 4.042596345583847617e-01 2.814487684518089949e-01 2.912344859617397308e-01 1.922036985792300312e-01
9.657166287475253252e-04 2.212448436187539752e-03 6.704271823444551970e-01 3.255753945262043671e-03 1.947860742886739580e-03 5.503941548304631670e-01 2.123788587920423000e-03 2.052521494761094800e-03 2.340290601488246580e-01 1.692825791273087632e-01 6.329720634712746041e-02 1.463666226803911619e-01 3.674080292622390331e-01 3.361772233755276340e-01 1.400419351919342595e-02 1.038503385355563774e-02 2.207085247781007675e-01 2.679022778686144246e-01 1.243841190410107239e-01 5.582415830107051447e-02 5.417352558484399283e-02 8.442296551678010741e-02 1.278684469347014796e-01 3.889190576201805305e-01 3.912732658877048353e-01 9.237565446249716705e-02 1.026893998369034500e-01 1.325899028859421347e-01 4.328202691804359237e-01 8.857055969900498593e-02
1.287789987966774918e-03 2.594773669748083253e-03 7.678014044559656028e-04 2.875294817586669834e-03 1.789293145076211421e-03 3.344322978304654567e-03 4.045267761716402587e-03 5.961763203755854335e-01 2.332024081082750278e-01 1.349841653212838777e-01 4.084442028477021369e-02 5.205529457117256953e-02 5.571494731042136994e-02 1.904567278689340282e-01 2.179695128390471415e-01 9.206662392799111472e-02 7.756465670218992692e-02 8.570615182412970323e-02 1.184992583127817412e-01 6.958503830529713663e-02 4.941282476898739562e-02 7.355950362328349257e-02 8.364895176964935730e-02 1.390671823777349103e-01 4.315922299796723927e-01 6.785713540779246544e-02 9.853706786804203310e-02 1.618346179820402964e-01 1.958073690186462601e-01 3.887274474656549628e-01
6.636724900496828242e-04 1.639422435344336289e-03 4.586744954414932848e-04 4.894987492767480632e-04 2.399388520242272133e-03 2.491600488166617437e-03 3.696723441026453054e-03 4.257503854533910004e-01 3.273196449888085002e-01 3.038542513601519834e-01 1.238076742631221694e-01 6.186942733248487064e-02 3.689547244667779752e-02 5.766517490751835173e-02 2.621969855202638811e-01 6.849623715701697035e-02 1.869093867391991570e-01 8.607534595162226812e-03 1.791740517410431166e-02 2.672703170197664457e-01 6.903917651430495350e-02 9.659784924215029933e-02 8.407500880532396692e-02 9.212896727232353089e-02 1.218152557809819431e-01 9.320840425908748228e-02 1.097878881464371403e-01 1.354350993508187662e-01 1.828249340180989613e-01 4.486836822565553051e-01
