2.731784224686911993e-03 4.018059654057631880e-03 3.503495837339737178e-03 4.425799924373191065e-03 3.363539730807139222e-03 7.391176509750959495e-03 7.365573959219885204e-03 2.003267125475734212e-02 3.651130193367239235e-02 1.633565120168126161e-02 7.506304102827091561e-03 1.697332793904184327e-03 9.920975757607224631e-04 3.724138590358055511e-03 4.352001947347374465e-03 9.579722803256948086e-04 3.427914781789540444e-03 6.137299654934308749e-03 5.679797771441199433e-03 2.030606485210511864e-03 1.605014484930266608e-03 2.294689991149576297e-04 1.746992900284880716e-04 6.758001468910189349e-04 1.255758123655491276e-03 9.408916325059030281e-04 4.138680127350324997e-04 3.586058384872261570e-05 3.333461302271632575e-05 4.050816859183799218e-05
2.182590076255030813e-03 4.821163153314716662e-03 8.654923050591812120e-03 7.077066452998959437e-03 4.927290642333478042e-03 2.208112996451557647e-02 1.052772248187329625e-02 1.337771144988508451e-02 8.781225725389803921e-03 7.499082629138108594e-03 5.267355143288017343e-03 1.022819308746952816e-03 1.352235622845636203e-03 3.084192738935487808e-03 4.294628266847337617e-03 2.735843924426380018e-03 3.431672521037456864e-03 1.148239157884545225e-02 8.849637916868215506e-03 2.699836489533558384e-03 9.382450619558778057e-04 2.077050249180197462e-04 4.270193185035381584e-04 3.642063301026895431e-04 3.027185471973011400e-04 3.812509674610372505e-04 1.268648269128299277e-04 3.317937874688634047e-05 4.770890105121127584e-05 4.789933241835250490e-05
2.668558649189292989e-02 2.697260549783743119e-02 5.703030240254160915e-02 4.642591082126748536e-02 9.841509164934295062e-02 1.003286812194344353e-02 1.870279650273312059e-03 2.021443984281792294e-03 3.275871986078369991e-02 1.006149426849628839e-02 2.702534289498422990e-02 1.793298858510360486e-02 6.555137803671542453e-03 9.488485883567323101e-03 1.796575675702814356e-03 7.426787411771414507e-03 5.051590278359626048e-03 1.056841052271649886e-02 3.589784740742775482e-02 6.049156602458374832e-03 5.647994128494534605e-04 1.617308053396859823e-04 2.419066299873853766e-04 8.063179390612890140e-05 4.478004156649884065e-05 2.758134880340573365e-05 2.281075773942614683e-05 1.887992731853010674e-05 3.343058850689722999e-05 3.907705961158452042e-05
1.265119930239040104e-02 3.628168978000789746e-02 7.963382851983304145e-02 6.434749081938939685e-02 2.620171024019486705e-02 4.026908580759333903e-03 3.160079040185519942e-03 2.121333800950330351e-03 1.298788251120077796e-03 1.234228958943639314e-02 8.006298406794128131e-03 1.594085048930690349e-02 7.176511373841946116e-03 4.678211231098359027e-03 1.347854875469460490e-03 9.999614196730037628e-04 2.107484706892726392e-03 4.015599667987308601e-03 2.894254419084441813e-03 2.500977387407699384e-03 1.115365184719148287e-03 3.765654610315773186e-04 1.156617600012321026e-04 2.122377540008908248e-04 3.667811420804948139e-05 2.493810781014567897e-05 1.975153679522816894e-05 1.970280243131913034e-05 4.149692135466461092e-05 4.767917624554765180e-05
7.424339870099673153e-03 2.323429352352468502e-02 6.488298322627862602e-02 2.514080819548610013e-02 1.423914036487551084e-02 2.051763478840870885e-03 3.089435889931216143e-03 1.693142008427806974e-03 7.778041873058903028e-04 2.770254950084300241e-02 3.541936057195044230e-02 3.023533614434910366e-02 4.426436322157814920e-03 3.538704607628886598e-03 1.597843551981115379e-03 5.719893628097869488e-04 6.164398056202118233e-03 3.604878276279514186e-03 5.890176853718860801e-03 3.433982213591387118e-03 2.373703377338160728e-03 6.570127081330693307e-04 1.420359850234342511e-03 3.684348377883325267e-04 6.842376151517369238e-05 3.452084806814664786e-05 2.221205332642296908e-05 2.714595969939491665e-05 4.424146101426071429e-05 1.730810108234438988e-04
7.524938606253671509e-03 8.001635947192060894e-03 3.588031422018291006e-02 2.874279005480806157e-02 1.132369096067887063e-02 1.195714336601079106e-03 1.419509919227676621e-03 1.480749182677027756e-03 1.360643372814167047e-03 4.217211878749661108e-02 3.381982605725861873e-02 1.790184220154403608e-02 2.014974768268994968e-03 5.770049860108236554e-04 4.148039304045970000e-04 6.424977378751499900e-04 3.364964481937062976e-03 8.956181813401403215e-04 2.950008140924668260e-03 1.036331400539662433e-02 1.274179550629342579e-02 7.568180184631960634e-03 1.867424862622249363e-03 2.284188444809853648e-04 1.056405780639933724e-04 9.331491492569363253e-05 5.390952854877691141e-05 3.946551546930792640e-05 5.442460613060331597e-05 1.049701986864462217e-04
1.062410342064898719e-03 1.716372171476979614e-03 1.814554903168405856e-03 9.197392271257298288e-03 4.402489082145482138e-03 7.168933596140117902e-03 1.051417703588763963e-02 5.792920375486579343e-03 6.672925388691692238e-03 7.958693981958156471e-03 6.265117726959976326e-03 2.607740820017584969e-03 1.057343027263740395e-03 3.870153197561169230e-04 1.911094615263070969e-04 3.186425575292782812e-04 1.883033391831620421e-03 9.107504744026550646e-04 4.729045030107837527e-03 6.588772112308558838e-03 3.086639567151957305e-03 7.390801459449284835e-04 2.861473321681047587e-04 2.129762947198125486e-04 7.430604782715243852e-05 7.149191560882561206e-05 5.795014233322732280e-05 5.375482512011340284e-05 6.547348487269332123e-05 1.675346617377045078e-04
2.313062167924703066e-03 4.299663623447357551e-03 2.512269634077386217e-03 5.409142228551190590e-03 8.306944862387309267e-03 9.197566260145872627e-03 7.922945591066279936e-03 7.260131603867374904e-03 5.620558082826168991e-03 3.203006403275158922e-03 1.308839720365641062e-03 4.100108835993039429e-03 8.706311913261582242e-04 2.787810298115885000e-04 2.736412096922735053e-04 4.852454294035061133e-04 4.039419353970054478e-03 6.581116768358523210e-03 5.848774698758386383e-03 4.192008998675278431e-03 1.147157308528848948e-03 5.358362463396774272e-04 1.785558769582875369e-04 1.333956629829179607e-04 5.947582911777649913e-05 5.881604812280338417e-05 8.544118386663541532e-05 1.146727788390478227e-04 1.221157660082059545e-04 3.816298346879513264e-04
6.191946391020365648e-03 4.119655142095362231e-03 2.400654293034622071e-03 1.388701241454221719e-02 8.964130218281773574e-03 3.739300253019697731e-03 1.172500187026641154e-02 5.132758003962278708e-03 4.151996834750642552e-03 4.146149304918370949e-03 3.739001510050260751e-03 4.987397378901877072e-03 1.092306797502878152e-02 7.069062239133052858e-03 1.039197263231002050e-03 9.439745066066589519e-04 4.149658531516896981e-03 1.275588731518461499e-02 1.262714406894204465e-02 2.099826493006489748e-03 3.275478671446187240e-04 2.486949111078715362e-04 2.303498117012708402e-04 1.358902342062516977e-04 7.492487390998242775e-05 1.093758095757861181e-04 3.914465005344366444e-04 8.416011540576483468e-04 2.567110159751091313e-03 1.329779539077467028e-03
1.033570082488454410e-02 6.813776277903075239e-03 1.079549777617050225e-02 1.009488386300188417e-02 8.753770567286095830e-03 1.703303827468339486e-03 7.682961006428237587e-03 3.197759133509394617e-03 1.294543006053258801e-03 4.912466571464574544e-04 7.254859859111089347e-03 7.152539164438867329e-03 1.526657318397395789e-02 1.671568028277692353e-02 8.019170239412806364e-03 8.886629963624935111e-03 4.789903237793659285e-02 4.969181436873783969e-02 1.980756877759148188e-02 8.745129125761313613e-03 4.229186292574727262e-04 1.963505801064623806e-04 1.956183958503802218e-04 1.980696196420329597e-04 1.036549584847342294e-04 1.274706236965443052e-04 1.149150659237226915e-03 2.092818722687816470e-03 2.729977213135974332e-03 7.437977071437382398e-04
8.523842624862004377e-03 4.513254320407462244e-03 1.003902794104393967e-02 8.610199388973654305e-03 1.081260611008616479e-02 9.804909200090592639e-04 8.004898480237304876e-04 6.787036858171938440e-04 4.095619143296591494e-04 3.700385331344877796e-03 5.857034832730310947e-02 9.862239064113410836e-02 2.061559252397363595e-01 1.039307306091842159e-01 1.953485806313431938e-02 3.916599950758484217e-02 7.313710919287712275e-02 2.012554072770813759e-02 4.745116490543030419e-03 9.353075783285697345e-04 3.114178308553093339e-04 2.109744679122204747e-04 2.430242113006897235e-04 3.208855632132340545e-04 3.260487361682848665e-04 1.689592524220125656e-04 2.563913119657660103e-04 2.131039719571052907e-04 1.961113058292401673e-04 1.429055815992721890e-04
1.542366275696403300e-03 9.173635010953340961e-04 8.152468538481193183e-03 8.112164280677262515e-03 6.297292724739771141e-03 1.418819932769695234e-03 5.329204463841839432e-04 3.318219368865994354e-04 3.973776829980242673e-04 7.456646838889834268e-03 1.819803860143676816e-02 1.196091554592006584e-01 2.167704777703289565e-01 1.147619829307583300e-01 4.215232746345495829e-02 4.853717551547601095e-02 5.378843972010339397e-02 3.163272692409485609e-02 7.731874557839137421e-03 2.170165071928476137e-03 3.165840792526058512e-04 2.768431606159965554e-04 3.070180431746779648e-04 5.329664548584694180e-04 4.946231909828368830e-04 3.396858311145164533e-04 2.505892549198891891e-04 2.258592413877343118e-04 2.398492227287061791e-04 2.520044408402991694e-04
2.883813046120024945e-04 7.507808336034754639e-04 1.872288315174910640e-03 5.391324581315653890e-03 3.537786119530440462e-03 1.102955519380107146e-03 5.464288115288612078e-04 4.395217984534153730e-04 5.319417550438965137e-04 3.811269056771965542e-03 1.267970709392791896e-03 3.848589596537562579e-02 1.634208369473507672e-01 7.160165423856668099e-02 2.296146034853534246e-02 2.710109658485485712e-02 1.006152718411120264e-02 1.478890251377657818e-02 1.684124997297175436e-02 6.290703355942673693e-03 4.167743523683716412e-04 3.707489878724252552e-04 4.432650482179137982e-04 7.499101136819325822e-04 9.665973181897146230e-04 8.881924650998915391e-04 6.406460667378369687e-04 5.624390165624032229e-04 4.143427403449327640e-04 3.035113670835539444e-04
2.228018344895996649e-04 6.442864218094128013e-04 1.228421647687649330e-03 9.190342165015936678e-04 5.508271839123376600e-04 2.124509484352636243e-03 7.159932256391002107e-03 6.039377145733283367e-03 7.645104747462627389e-04 2.351589474314633480e-04 9.470613389011896819e-04 6.344659370815862280e-03 7.549228531043318535e-02 1.044039054244277065e-01 1.135094160331816537e-01 1.560879309671596993e-01 1.417365255212700292e-01 9.270238753596896086e-02 2.549342697668810498e-01 1.187563765286591272e-01 9.769864332688298417e-03 2.819644187358312949e-03 2.119628159758691222e-03 5.294275048258594366e-03 1.219406985828112161e-02 1.130844231391675038e-02 3.049219681615820965e-02 9.627318019541078117e-03 7.235942989697818038e-04 6.474613362715363326e-04
2.024090839664934732e-04 2.049669147875435424e-04 5.820088784415599053e-04 4.411502369120881735e-03 1.605965319305092780e-03 3.714177045281969293e-04 4.827051156069742804e-03 1.400769366930741840e-02 9.413527463386342845e-03 9.565788537849560661e-04 2.019139369860921927e-03 3.183624738747511257e-02 6.805385695671581359e-02 8.812006349974833841e-02 8.104069389248497179e-02 9.957803164572492927e-02 1.719340631060543023e-01 3.004446594983005703e-01 3.089336264920394259e-01 2.442509844999322388e-01 1.044043177411647580e-02 1.091429589243452999e-02 9.771002639905842710e-03 3.035091397350352799e-02 4.302915333494988781e-02 2.168897471503191954e-01 2.129355005861165162e-01 4.158666010467799296e-02 8.741967198086026325e-04 4.896148192061295593e-04
1.787459460588044136e-04 1.968101713409745924e-04 4.588628624560406517e-04 5.085037380234147270e-04 3.329677114011087968e-04 3.748265607549206664e-04 2.675564477613909427e-03 7.649952134426623272e-03 1.594643441483658414e-02 5.620558276556778671e-03 5.736689839780829622e-03 4.963793584841329209e-03 3.877787799355162518e-02 7.978692931241945785e-02 7.550299490665797475e-02 1.173124855384453796e-01 2.060193902012403266e-01 2.537821738390712567e-01 1.484841284165375752e-01 3.263817310693346158e-02 1.967710414411119255e-02 1.357989753670471866e-01 1.991727775384483090e-01 3.285830883835628713e-01 3.019224926181361401e-01 3.854027553865403410e-01 3.017573773432161155e-01 8.417123785062592678e-02 1.384922196699540572e-03 5.984449372329785685e-04
2.186782336151616758e-04 2.560527791314968897e-04 2.514710090268526890e-04 2.366766242227524083e-04 3.533289985359106163e-04 7.434060902426238701e-04 4.430465710394932560e-02 1.510375548491294795e-01 7.442461310130316088e-02 1.253813126129497968e-02 9.159234956794817459e-03 1.406813692819715474e-02 2.781009003875418648e-02 4.152719641626687747e-02 5.553706770808446158e-02 1.007713983063847352e-01 2.208656567906152057e-01 2.257457980333116565e-01 1.084114260026967369e-01 3.760894445355958404e-02 1.630142647852698135e-01 2.973055359378232732e-01 3.833785689708628097e-01 3.845804535552912462e-01 3.282897531625050824e-01 2.755700342529089353e-01 3.964548395804134429e-01 6.791142394218685485e-02 2.121069133783216442e-03 8.681789835629556305e-04
5.200801357006771706e-04 4.137398206128944131e-04 2.142805135829896823e-04 3.311382037980462826e-04 4.219286841203173134e-03 2.160120441439924641e-02 1.231120497345358361e-01 1.022711755755868340e-01 1.016023479015688152e-01 4.991890573858890484e-02 1.794407740167715259e-02 4.747069979147038217e-03 4.620849006099757642e-03 1.195496362712017424e-02 2.718907699843264164e-02 1.258938847974586384e-01 1.347746874367610481e-01 1.597175706943037565e-01 2.828512591785023456e-02 5.055328825226806932e-02 1.800890023754890823e-01 3.910595247134309727e-01 4.836227906358605000e-01 4.864725575672629310e-01 3.858321827151982020e-01 3.587347669815048046e-01 3.232825836923752250e-01 2.536730770562932724e-01 1.117053221400195369e-02 7.283503682790580351e-03
2.275013631786838928e-04 6.330387430703932408e-04 1.158497060380038945e-03 7.999570991738152656e-03 1.768738216660375312e-02 2.516773387846474308e-02 7.972874884902628190e-02 1.001289992380892530e-01 6.879037456882455825e-02 5.287085248482600169e-02 1.094067157667333832e-02 1.060139082233220757e-03 1.599841449580265661e-03 4.494817118073714778e-03 9.739624164062314626e-03 5.711287886951593729e-02 2.214281021718801298e-02 7.187269810684243296e-03 2.450866996964608854e-03 1.799279628909063178e-02 6.845521005837286455e-02 3.641462480488084630e-01 4.599048872356564788e-01 4.712417907220770585e-01 3.350430107657096923e-01 1.514813430828846619e-01 2.407573169414703451e-01 1.634961229449908293e-01 1.466099889950150774e-02 5.702129801835503602e-03
5.627406677604840021e-03 7.350209987232994915e-03 4.925718354824381619e-03 6.144193161613004280e-03 1.448261731356726562e-02 8.276855361812650649e-03 4.222493901860008281e-02 5.414863340597522029e-02 4.949228833335483912e-02 1.160107350590764037e-02 2.899787051755297555e-03 6.120091093905259899e-04 1.064445869368932330e-03 3.089150032732418914e-03 1.204362039923761139e-02 7.951534425393739017e-03 1.472785644362703886e-02 4.423819632456377909e-03 8.456565953484420847e-03 4.055435435792052734e-02 2.175252540283817981e-01 4.090614825373019570e-01 4.360453558850843070e-01 4.092614121535140259e-01 3.101829455519339862e-01 2.243915063880851657e-01 2.151764922617005471e-01 1.436466882848773940e-01 1.286092449627132886e-02 4.522037166228100313e-03
1.585303088220711698e-02 1.476552828778631039e-02 7.663008655875732864e-03 5.570882621125160944e-03 7.301057779885614975e-03 3.870597852740536964e-03 2.155581972656952019e-02 1.888102080255880943e-02 5.081565907249716886e-03 2.778735754703916174e-03 9.676489075578282488e-04 7.794057502929811147e-04 4.670183737884642987e-04 2.565384548963830428e-04 6.585217859415054727e-04 2.192208056858279980e-03 7.966939532280824590e-03 1.848009816692146312e-02 1.809224545885608493e-02 8.145283826067244159e-02 2.201492036002189456e-01 3.148759062669043152e-01 1.264756132417394208e-01 1.895788916755941078e-01 2.453267678490092529e-01 1.390666695695842725e-01 1.036804994638834548e-01 8.441476642572742772e-02 3.082516700616492328e-03 2.766543304141591466e-03
1.289581123351054605e-02 1.505674562446127768e-02 2.242256267732444918e-03 1.570141735975997318e-03 1.305201068558914596e-03 1.920354088802881266e-03 2.664671885229617874e-03 6.476937617225653069e-04 8.170349603103450355e-04 1.321917204714323870e-04 1.799525411652639554e-04 2.823395352137841484e-04 3.154909886023859111e-04 1.116352936933705893e-03 3.121740524700423319e-03 3.996782869364636642e-02 7.796596409200097499e-02 1.147066529641487254e-01 7.963501655603363871e-02 6.009479624140798282e-02 4.179788121139030310e-02 1.466265599204127565e-02 5.592159018854155408e-03 1.220963864648587013e-02 4.470421289023116668e-02 1.523570965939785408e-02 1.403631582832621377e-02 4.714258070459815750e-03 5.383429426616203424e-04 4.402575731012992153e-04
2.737061332824984594e-02 2.126713938976497117e-02 2.301908018459210802e-03 1.002703662336198445e-03 1.487742344994499345e-03 1.148316317033725798e-03 1.735120286704618098e-03 1.813869686789159306e-04 1.498522876600957366e-04 6.675394388972209552e-05 1.631563516639510732e-04 3.154252416411458776e-04 4.258403530483788639e-04 2.313605170129217833e-03 3.835626028113867103e-03 2.411355855387295813e-02 8.973040185636767252e-02 1.699291608843053469e-01 1.952959986227930100e-01 1.690578309083227149e-01 3.506914425815477188e-02 7.647233370220911895e-03 9.334002892903175974e-03 2.320584092947914137e-02 5.210915140886972219e-02 1.549160989615826732e-02 5.891311513815037162e-03 2.207430856678758123e-03 6.969713720729310644e-04 6.288462880501104191e-04
3.435548213008195878e-02 4.404373684197950521e-03 1.214303704330288664e-03 4.017223819503464325e-04 4.601555491979937920e-04 1.000810859977480051e-03 1.266646428289758871e-03 1.389185093043922802e-04 7.497056305815912080e-05 8.824519254587410793e-05 1.595973143285018495e-04 2.767491975299012519e-04 3.187836731681406425e-04 1.804859320942409605e-03 7.178943823680851953e-03 3.516974193877513838e-02 6.928820913146312155e-02 1.619221341715412488e-01 2.066711372205071173e-01 1.746853158502871817e-01 8.506916141337617088e-02 4.792371826218796635e-03 3.349204078883411245e-03 7.336247585367054042e-03 4.256896544433254326e-02 2.589538670646996180e-02 2.324861210232593428e-02 4.335068070429027275e-03 6.196286915244710383e-04 4.674211888019442758e-04
1.907481968031359693e-02 5.935669505346557323e-03 2.301761124656008430e-03 2.161726356149595157e-03 4.816654544252375880e-03 3.278357539847863867e-03 1.341658261214486152e-03 5.410964217746282688e-04 8.015202909498353066e-04 1.053640549545100400e-03 9.914192186488178580e-05 1.123805206125772231e-04 1.789630220530195404e-04 4.206470188413413149e-04 2.637329352175910285e-03 1.103980089573922477e-02 1.132141795072337011e-02 4.903234936276517492e-02 6.374584451503172156e-02 5.492451838761062272e-02 4.519939524096146938e-02 5.723333953281664263e-03 8.691508867918942144e-04 1.715942665022524927e-03 7.634002992168508785e-03 1.934345694853163711e-02 5.186836641463531822e-02 2.898644928593862441e-02 7.087511997986884220e-04 5.191052304275470090e-04
6.828450775904305881e-03 2.724157863280515703e-03 2.913499155328401133e-03 4.942555958984660297e-03 2.702150777850196965e-03 1.204408493935857621e-03 5.477679145201820241e-04 3.796760599142085923e-04 1.194490457679573151e-03 4.657712388445751743e-03 3.193521696935449836e-04 1.103564449029247480e-04 1.913280245801320329e-04 4.362681735153669691e-04 2.148787763245328143e-03 3.959937340787974408e-03 2.779162517616582360e-03 1.402321652557270149e-03 2.251244525604237986e-03 4.138746704252817959e-03 7.315898718805487720e-03 1.665178761565651267e-03 8.597952806797732640e-04 4.436531532593423859e-03 1.083075042788754321e-02 3.876409513543071714e-03 1.336423837165038112e-02 1.492995889546394096e-02 5.229269401704651245e-03 7.789713498373215935e-04
6.921794434018093377e-03 5.583726753873921415e-03 2.726885024202252688e-03 2.006283978985596347e-03 1.865766005579828522e-03 6.962127370124698063e-04 4.563546623055245665e-04 4.622735481209358705e-04 5.074953901585874637e-04 2.038399646222615984e-03 5.800978902320944345e-04 5.528781980789391299e-04 5.363720951207244687e-04 7.004666156584361900e-04 2.112261429540080847e-03 1.529569093270278374e-03 1.093934266248249325e-03 6.894206273236895728e-04 6.374884381159084262e-04 5.053589237233666997e-04 4.098134170640567670e-04 6.110705970609297925e-04 9.955980370699689386e-04 2.559137968761248261e-03 4.559013227216764282e-03 2.209546887058322796e-03 3.535195049525366104e-03 2.371351729678853638e-03 2.385655711661726058e-03 1.516146247072033089e-03
9.404574509419701481e-03 4.926698870236516717e-03 2.804062181741638193e-03 3.840256509885448758e-03 3.376853033033310868e-03 1.826328238764566170e-03 6.189046738677831706e-03 4.633464723755802150e-03 6.797569329890107035e-04 4.963713715734846630e-04 1.786380286415170887e-04 4.122607631065894882e-04 1.259772698834835418e-03 1.468765539318868342e-03 4.756094432131712131e-03 3.717546587104098368e-03 1.247944624725212280e-03 1.566605997976424801e-03 7.621485462782430541e-04 3.414969788546092910e-04 3.144800173304449788e-04 4.871349583336020517e-04 7.690800966168845256e-04 2.524169913597575348e-03 2.695862353334283531e-03 6.680193087270475637e-04 7.571444890632159910e-04 9.935575274759161912e-04 3.276136314448616256e-03 6.743214554801023894e-04
1.266622562468683322e-02 1.102039729971611426e-02 3.346849193722863103e-03 1.145725953115927891e-02 1.333003421472882775e-02 2.508969639363150400e-02 1.672967569218358763e-02 1.879275206930117919e-03 6.726994109606675327e-04 3.920064576636970608e-04 1.166248272305084316e-04 1.463137038377745143e-04 1.889027576205903024e-04 8.081461367533746129e-04 1.071425931037407525e-03 5.083402174046046558e-04 5.305231843314441812e-04 6.931409294581725037e-04 9.992710799370204712e-04 5.445696499538534973e-04 2.924463670765374860e-04 3.991004820958865920e-04 4.494755766706106390e-04 8.178369139400508718e-04 2.758924031908178195e-03 4.617887981054913946e-04 6.938466957640157615e-04 1.181263349843532503e-03 1.471950542014338875e-03 2.946127410610995066e-03
6.957220524937502391e-03 1.745089265123999506e-02 5.205463262330407848e-03 5.557274676339096775e-03 2.685457391343128511e-02 2.828775722439086371e-02 1.873066515575014246e-02 1.278989922983039948e-03 8.996706711181640635e-04 8.611789589570252113e-04 3.574994525363411912e-04 1.783687577645642691e-04 1.197411552051340816e-04 2.267619446391636235e-04 1.170008927749716836e-03 3.663627536677534907e-04 1.415919054548666007e-03 9.340895788944097652e-03 1.758455223934640016e-02 2.455689978450174664e-03 4.704621414005304408e-04 5.968919201986808186e-04 5.069242115283902495e-04 6.001326305064795660e-04 8.562980165528561111e-04 7.004140269778601647e-04 8.582920499995738998e-04 1.086474513908383980e-03 1.511784160588838626e-03 3.735834123379006607e-03
