9.224150385433962929e-03 1.371683960448400776e-02 1.192087871472042454e-02 1.503692994045160644e-02 1.132878568798033683e-02 2.467135896813624912e-02 2.417115186175540151e-02 6.466873947685126967e-02 1.165842469418387206e-01 5.155775207586973941e-02 2.365665246052005288e-02 5.311772028225031014e-03 3.060919081521785903e-03 1.123522186948276540e-02 1.292586685844496902e-02 2.814672732275414618e-03 9.758813274892419454e-03 1.671835464321810502e-02 1.484015704071414872e-02 5.140339153760058351e-03 4.173261602939032193e-03 4.849137417615553142e-02 3.822043823954580227e-02 1.892009240573705973e-03 3.618995148865346550e-03 2.785049413813837742e-03 1.145227369304816362e-01 1.015465795964630782e-02 9.668303854872226447e-03 1.212023865166976869e-02
7.440448529255022300e-03 1.666378160689112667e-02 3.001150426551465675e-02 2.432929671199780125e-02 1.689299090655798502e-02 7.521406628676118034e-02 3.545298165598462919e-02 4.359221188778602402e-02 2.807814140131791383e-02 2.324305824755863725e-02 1.618227733473166091e-02 3.089090612172563574e-03 4.015603283005887356e-03 9.050248029852301507e-03 1.243831095759029629e-02 7.922853926777351577e-03 9.615673805969752672e-03 3.066965363941596273e-02 2.262358208546541224e-02 6.687196038008253948e-03 2.386443886450376022e-03 4.486184410455922728e-02 9.533645192012291103e-02 8.615756926011318428e-02 7.776690532288188518e-02 1.065254963533165677e-01 3.873138804446511069e-02 1.006620725157483451e-02 1.438294267734451654e-02 1.445318778182518547e-02
9.318739694724341438e-02 9.589076598404212837e-02 2.029509549089616172e-01 1.636515676532022678e-01 3.498490117777902642e-01 3.547019950740960131e-02 6.569698176599663396e-03 6.892253330243189660e-03 1.094014692236495723e-01 3.206294090785512252e-02 8.328277696681610220e-02 5.342367126181667147e-02 1.909015499678164834e-02 2.760308547094261072e-02 5.187293098961994788e-03 2.157201397172491333e-02 1.414103529665185557e-02 2.820054367869629514e-02 9.145142061321751004e-02 1.488271275980051177e-02 1.411191125143158647e-03 3.601321926690276981e-02 5.546721618006175691e-02 1.991521226608498549e-02 1.231137326644375467e-02 8.456310427044528080e-03 7.796599458969921508e-03 6.192086047495154802e-03 1.054554800688268547e-02 1.196439180429407709e-02
4.303395152554028574e-02 1.235560258739970552e-01 2.715837989335446734e-01 2.176702594896275933e-01 9.026726369887341783e-02 1.391325507906188141e-02 1.099382242651995856e-02 7.233663826004112750e-03 4.366831629087956912e-03 3.946387374341827486e-02 2.451040039210291427e-02 4.735244150846462663e-02 2.094909973442379489e-02 1.388239355958908669e-02 4.022831838337011939e-03 3.021669950295059488e-03 6.165085306162572561e-03 1.120419945153378061e-02 7.770929826577508900e-03 6.491626961685885780e-03 2.922646472263188289e-03 8.452344769880387743e-02 2.670764114975188869e-02 5.263542489300303967e-02 1.008926823777940400e-02 7.635372825095343256e-03 6.708641069826964086e-03 6.368855374876547862e-03 1.274068525665949213e-02 1.407032891223707581e-02
2.480126077148468028e-02 7.669828685626665921e-02 2.135749357821165040e-01 8.272265897278996416e-02 4.779981090539685284e-02 6.946890669097965237e-03 1.056624167342794761e-02 5.827644363098507738e-03 1.439091674530246778e-01 9.028250433137974262e-02 1.096136632360234231e-01 9.150525044612520253e-02 1.327803837208911715e-02 1.092243328292519244e-02 5.040070705370913381e-03 1.159482773213933726e-01 1.924005151135560476e-02 1.079067216642450380e-02 1.704617390739769298e-02 9.562090120414673544e-03 6.537114103863407577e-03 1.794144935286470354e-03 3.857013017613343791e-03 9.099824811152401605e-02 1.846934032078237364e-02 1.021650225799908447e-02 7.186453144978021540e-03 8.365296789173319938e-03 1.292690043823161751e-02 4.849821650065987144e-02
2.466808714166034838e-02 2.573016964729900324e-02 1.151398205156321797e-01 9.203401411284792277e-02 3.658992313855056328e-02 3.908239846173334510e-03 4.736756560459056721e-03 5.046805001425375137e-03 4.678988811631092440e-03 1.387493090845041410e-01 1.062778063715662247e-01 5.514910314362406890e-02 6.197911113107815173e-03 1.039848908369996328e-01 8.077943679148218148e-02 1.345054054262106169e-01 1.114235208468404223e-02 2.848345342075575288e-03 9.098022646644131350e-03 3.083198804169358376e-02 3.733551699117713257e-02 2.191089987531014138e-02 5.350175963580007868e-03 5.645310825454374209e-02 2.813718249662857523e-02 2.690115630971395486e-02 1.677124119555422829e-02 1.166221917798922203e-02 1.519495815290497140e-02 2.803061013494982309e-02
1.801608390868700560e-01 5.310144837863284978e-03 5.614519386532658418e-03 2.846833176226389733e-02 1.365140403352955653e-02 2.264294090236993254e-02 3.427321809387241097e-02 1.949893132845447949e-02 2.305310785440812388e-02 2.648045898496224904e-02 2.009477298189489211e-02 8.188648359716147254e-03 1.745552585914370569e-01 6.965963921006791681e-02 3.745285052426835376e-02 6.803532512368952456e-02 6.508195186216164489e-03 3.040374300491999107e-03 1.533972442116505151e-02 2.073186181311439599e-02 9.504906360536267973e-03 2.243665698924237218e-03 6.696441681874962248e-02 5.254732683644211533e-02 1.951016663831867115e-02 2.011276729977658911e-02 1.744878595567694521e-02 1.532379706349183690e-02 1.764081104963162450e-02 4.306005503063426582e-02
6.939740923721319718e-03 1.277179174167372352e-02 7.499012490286813964e-03 1.623384748354220197e-02 2.493255466667776074e-02 2.798991352520264000e-02 2.475930244583083792e-02 2.331288292494225478e-02 1.870484058816353559e-02 1.038674967371162362e-02 4.138856288609717507e-03 1.267454773601556922e-02 1.414062885275984283e-01 4.758970318939922256e-02 4.931714852700842810e-02 9.220156612790691986e-02 1.288497589188434059e-02 2.046241766571777615e-02 1.786756923033573641e-02 1.263613331282284480e-02 3.423385620837447567e-03 1.135105611964601913e-01 3.936121428235193898e-02 3.084902349299316338e-02 1.453225171875332719e-02 1.526956512756856219e-02 2.348567963350604165e-02 3.008476589908862242e-02 3.060378547963437529e-02 9.233214325483822538e-02
1.750781390487808620e-02 1.154021518020204029e-02 6.832137324589015667e-03 3.994141395467955269e-02 2.611983317149860900e-02 1.105163704149095261e-02 3.556400458357551059e-02 1.592379999155354997e-02 1.335875143324092261e-02 1.308935044566841323e-02 1.159230169503925115e-02 1.519214873559223550e-02 3.285437516107284073e-02 2.119523527201525384e-02 1.736085681411738413e-01 1.594967155163828920e-01 1.210460044438629174e-02 3.662592690162520814e-02 3.606240089545256072e-02 6.011854058374470691e-03 6.218622559173341002e-02 4.943269707146637215e-02 4.779454674200804554e-02 2.951277254942860639e-02 1.707759239699204942e-02 2.625202070485553596e-02 9.842459357133226394e-02 2.348675526914840040e-03 7.280340234990840750e-03 3.859152758407530595e-03
2.777397558007425882e-02 1.815274810530603106e-02 2.951000477542178174e-02 2.789070446031843842e-02 2.478554973757480032e-02 4.902753947245005670e-03 2.272700943456538308e-02 9.641614823229309114e-03 4.034654410221355514e-03 8.347774004287451810e-02 2.188150966920485857e-02 2.117681751220281544e-02 4.442178929073480748e-02 4.747560882701896273e-02 2.238908053460349559e-02 2.416018055540675863e-02 1.289116437435295082e-01 1.336405419630687930e-01 5.384122437659914773e-02 2.405406192326124681e-02 7.575522775504053841e-02 3.681751591283181912e-02 3.840848476227388258e-02 4.049251838243012741e-02 2.208433758087225557e-02 2.841494532983699847e-02 3.103879501919916146e-03 5.732571524510815530e-03 7.650459914566004604e-03 2.143838938807349909e-03
2.280057840450998990e-02 1.192193041073422687e-02 2.708243972282490392e-02 2.334344011771357502e-02 3.004457973504904081e-02 1.482070522062675366e-01 1.261588377769134461e-01 1.112117342330551928e-01 7.067521174841681630e-02 1.102006518404624255e-02 1.717635648725990560e-01 2.840348715321631135e-01 5.817535647479705752e-01 2.840961587745178818e-01 5.193917330065417337e-02 1.001519582977200840e-01 1.854504189614749887e-01 5.144197842007355165e-02 1.235374871521938492e-02 1.482716173312816077e-01 5.155475589073625631e-02 3.642249106748449844e-02 4.377941648828858473e-02 5.974265642062108472e-02 6.273069320159614659e-02 3.377098065176469682e-02 5.330441959807645513e-02 4.391551757712970627e-02 4.041015912591804093e-02 2.970598422701383606e-02
4.226469033338801397e-03 1.265532306934715745e-01 2.219370284945558491e-02 2.195244648951497068e-02 1.726702989196354787e-02 3.952050983995640532e-03 8.372288945436481833e-02 5.429813839881729443e-02 6.778875974790703196e-02 2.141878169056658787e-02 5.154908443042778565e-02 3.333037003514058849e-01 5.928283962151170705e-01 3.060240266018862121e-01 1.103114008982627736e-01 1.233357667758854803e-01 1.359155563816557000e-01 8.046894865902162741e-02 1.990948204493680693e-02 5.626115434190582035e-03 4.772686749710869369e-02 4.273163599732571205e-02 4.867729239065898827e-02 8.627426824538381167e-02 8.181895629465342490e-02 5.786478974552117238e-02 4.409389821304544876e-02 4.069597125840312968e-02 4.423427956486435803e-02 4.802717851043526720e-02
4.154518543966841809e-02 1.075313180554775955e-01 5.142153968892390799e-03 1.467750842869501408e-02 9.637343858077237341e-03 1.637621746113989973e-01 8.454443141684371554e-02 7.122244980088346389e-02 9.041071999188900199e-02 1.066662794656101157e-02 3.526573377531186729e-03 1.058246698472619374e-01 4.407134199183592171e-01 1.876675648771564675e-01 5.894125787568849778e-02 6.790883042063582120e-02 2.504739247214785372e-02 3.676718441086483657e-02 4.193724212946584040e-02 1.572046835569946427e-02 5.729142027378851532e-02 5.164697173278857967e-02 6.247916414387548467e-02 1.069696869295069241e-01 1.396181820891648773e-01 1.307280309244643890e-01 9.657802110100170701e-02 8.885235331006111070e-02 6.841039977145212114e-02 5.331569647489084462e-02
3.304983768834007796e-02 9.537836627607998441e-02 3.370726019536435508e-03 1.306882890161142896e-01 7.833461543496468560e-02 5.717209423642221136e-03 1.922412237926183695e-02 1.616820335886817728e-02 1.297061297641810829e-01 3.975637480200165663e-02 2.572142262498596996e-03 1.709021304027081439e-02 1.999537793869744784e-01 2.693524253586407902e-01 2.877304867183733128e-01 3.888256598982806067e-01 3.490312444575888184e-01 2.253551767577221809e-01 6.127664021724765764e-01 2.857565846952570543e-01 2.367603159348726644e-02 6.851757074751276336e-03 5.103385580854153183e-03 1.275498392790197499e-02 2.932327576265780084e-02 2.711607795915403629e-02 7.354197911653984066e-02 2.401265854841124620e-02 1.090012087561135073e-01 1.065536066220933165e-01
3.039653151528995054e-02 3.061524532718479588e-02 8.550298426349291214e-02 1.186271774929470099e-02 4.290822470854099326e-03 5.605333286585355290e-02 1.280742887464426938e-02 3.685447621278627878e-02 2.478254444089068864e-02 2.548414600641315912e-03 5.425533013381992307e-03 8.520260742231407225e-02 1.793390636886720846e-01 2.264431646164054568e-01 2.043250865111328751e-01 2.469263711049800580e-01 4.195348226034915640e-01 7.216728946699360048e-01 7.341602948255226968e-01 5.817623551271283722e-01 2.495772957706695466e-02 2.610940372848144855e-02 2.297595147665351667e-02 7.190110305128982748e-02 1.028510562045650972e-01 5.237617197159800675e-01 5.235882024701657977e-01 1.058252175715893306e-01 1.279116029831589840e-01 7.758160321695672934e-02
2.724307993516972282e-02 2.972931325048147957e-02 6.881851704547338466e-02 7.665970001203306627e-02 5.108216152226159601e-02 5.849225481999477394e-02 7.022175242223281655e-03 1.971847569293600638e-02 4.090078958239043438e-02 1.467802939784489114e-02 1.516667354587260784e-02 1.314813365743675543e-02 1.017075149575566995e-01 2.057862387775844515e-01 1.921943353859121850e-01 2.942265190069630609e-01 5.052576311746973525e-01 6.118000939278263051e-01 3.547816622377676365e-01 7.798722864644223873e-02 4.676623197204499149e-02 3.197484407471260504e-01 4.608580748043240582e-01 7.780299281716271942e-01 7.368533647654288421e-01 9.679383109067510871e-01 7.857508791714304941e-01 2.259331427481376109e-01 2.051854527667956174e-01 9.345992509664347025e-02
3.382712868954194235e-02 3.913485380544669268e-02 3.896153721897464839e-02 3.735387648777609149e-02 5.721459799353960374e-02 1.196436095565067831e-01 1.144919961727261792e-01 3.824463454785551608e-01 1.870594191413297025e-01 3.212191130808986217e-02 2.390999997159996837e-02 3.717351828239295886e-02 7.330139463106327691e-02 1.078626891799280008e-01 1.420113873371990354e-01 2.541801476585061614e-01 5.429600670170718901e-01 5.486575561527512468e-01 2.619063374816970602e-01 9.036594897058880527e-02 3.851028306937765433e-01 6.881828719877446376e-01 8.710910876546307247e-01 9.086232606910753518e-01 8.196123930860269580e-01 7.249307652824457104e-01 1.096166420698938770e+00 1.921639061326532172e-01 6.113047112421419321e-03 1.333463081860197519e-01
8.269246175545896804e-02 6.482331444197826642e-02 3.406038046725765045e-02 5.386749044117606494e-02 1.110131898836218788e-02 5.591672380582219520e-02 3.114952988773649900e-01 2.533888948773042049e-01 2.498087469629047819e-01 1.258901967615974893e-01 4.634423834449246521e-02 1.250144392618751481e-02 1.222670771202307577e-02 3.139988481726044278e-02 7.037632995872832031e-02 3.233001902662923088e-01 3.368455527699661389e-01 3.948478835843749479e-01 6.910640648694697796e-02 1.220070154755721337e-01 4.249260693536150990e-01 9.024423468153403016e-01 1.097273767614789897e+00 1.166474376549822667e+00 1.000952896444935236e+00 9.989093476370392022e-01 9.570289369015868575e-01 7.586442336667535979e-01 3.366408353077723903e-02 2.219357212056470574e-02
3.735887572841679882e-02 1.030582433105836915e-01 3.037836966743392726e-03 2.072202355543530800e-02 4.538055643178805221e-02 6.392316766285725815e-02 2.017953091424857237e-01 2.512292623823565996e-01 1.730051796542205478e-01 1.356066440697357989e-01 2.870191951667513605e-02 2.829415808636957363e-03 4.308263367476466467e-03 1.214974834380270347e-02 2.631845641291542456e-02 1.552414552246212109e-01 5.884310449511816893e-02 1.885420162292510832e-02 6.321854801944909799e-03 4.567108589798144630e-02 1.711382963368794363e-01 8.991484474169278984e-01 1.127143087886619099e+00 1.198248823254686624e+00 8.957746191144312364e-01 4.244918799358138317e-01 6.997513655867166893e-01 4.803395369803236115e-01 4.331768783513097881e-02 1.710156371957861562e-02
1.554016470697267699e-02 1.948337583448135624e-02 1.282467396724324554e-02 1.564259518163421681e-02 3.629078287130114294e-02 2.074577107959696756e-02 1.070667060513056101e-01 1.379835611186737976e-01 1.277685675759544226e-01 3.043054658378273672e-02 7.720043824220293796e-03 1.644415810767688862e-03 2.899734207599783016e-03 8.593250236383624674e-03 3.418479290625367484e-02 2.306148315941251165e-02 4.184935848490032445e-02 1.232213682532300007e-02 2.296308920153354582e-02 1.077190806340287133e-01 5.740411359697958904e-01 1.080715620214809602e+00 1.157088951243253616e+00 1.106570816595415341e+00 8.580947131242619985e-01 6.347870537639861421e-01 6.198635845117925758e-01 4.176838311682063432e-01 3.760915309460445555e-02 1.338903322748905521e-02
4.396866784082315710e-02 3.924693563265929663e-02 1.992451715314426039e-02 1.411852957609789801e-02 1.806460276681187346e-02 9.639909785846596454e-03 5.502694970112462225e-02 4.906847546895158618e-02 1.352459450797798175e-02 7.457900048049685704e-03 2.609085871865464510e-03 2.104388357496704987e-03 1.005752912052334247e-01 5.490584295072396814e-02 1.949308823808764118e-03 6.695905398397596422e-03 2.368333800154610869e-02 5.355690876525771166e-02 5.108995457097446902e-02 2.266194249536845062e-01 6.180488285788160452e-01 8.984200940569652127e-01 3.673622815544707598e-01 5.496924251873317457e-01 7.064604445732655114e-01 3.986998041537819781e-01 2.970517624921124589e-01 2.439969824825894418e-01 8.944302322873552008e-03 8.085825403977196790e-03
3.518576076965904131e-02 3.955710221052579495e-02 5.806585647457961769e-03 3.987174664973979106e-03 3.238646529329133883e-03 4.812997706914756181e-03 6.868782392483665719e-03 1.711326079326043340e-03 2.216853011618707264e-03 3.135526493687502969e-02 4.113377524334033142e-02 6.276240426242801762e-02 6.951378471987684771e-02 3.227028276749961330e-03 9.411823599896290346e-03 1.250289400918806471e-01 2.350588179814441236e-01 3.356553139291695853e-01 2.263850008265438918e-01 1.699952440572773671e-01 1.213582865667285904e-01 4.383947317891846024e-02 1.710353462898268895e-02 3.652483305804037766e-02 1.307412804622834213e-01 4.380171842522351255e-02 4.015599561657778871e-02 1.356760554670439524e-02 7.153149704169067813e-02 5.852358065234611328e-02
7.242745650957986558e-02 5.474515260840821795e-02 5.970520316223713007e-03 2.582799628612279189e-03 3.786525171195416137e-03 2.942565534934778182e-03 4.525445754655737542e-03 4.257545997522356462e-02 3.621283326643130046e-02 1.560889025793577023e-02 3.688237446202295017e-02 6.956108181700761117e-02 9.270742233310610980e-02 6.518955405218819325e-03 1.117782839164897270e-02 7.258337598420966374e-02 2.588884443816433789e-01 4.736322530128906361e-01 5.273919113877909570e-01 4.570604422860389260e-01 9.882031441652794346e-02 2.234673873292771298e-02 2.794332735142963584e-02 6.779783241590434106e-02 1.495439187504734591e-01 4.375486494427986706e-02 1.673099017863869178e-02 6.303638606319128881e-03 9.138507696144847203e-02 8.206309630656240250e-02
8.800057127949613422e-02 1.107338474813585050e-02 3.129666471530655365e-03 8.028533904678974986e-02 9.781972919809837907e-02 2.598973324509053825e-03 3.318094197056872287e-03 3.236942048092442126e-02 1.795002610074235977e-02 2.051646747221163095e-02 3.597128906725516329e-02 6.083623493567472118e-02 6.898174580573937509e-02 4.977788646198869939e-03 2.048111255615259196e-02 1.036620442965182631e-01 1.949063925513433992e-01 4.371602582122602887e-01 5.372745152994036211e-01 4.532227603436890795e-01 2.308995025195312856e-01 1.353494423774861607e-02 9.732557079781442924e-03 2.093486729618126291e-02 1.197615946845804746e-01 7.131943318088697359e-02 6.410283397273394690e-02 1.206107264174547875e-02 8.016079842366501118e-02 6.164897781352838418e-02
4.778081527688856495e-02 1.469983695595706782e-02 5.900526642743144853e-03 5.645005711251195775e-03 1.283841456348342770e-02 8.749067521975148129e-03 3.575845665376746994e-03 1.269869675106115869e-01 2.119843908218336202e-03 2.749956217324563308e-03 2.228130479363771982e-02 2.468831683219474896e-02 3.856113782242900911e-02 8.847981557795779606e-02 7.331085579672584444e-03 3.174462193968580204e-02 3.108251605732621770e-02 1.293645171874709121e-01 1.616994907992328756e-01 1.384568724977942034e-01 1.192087376124244813e-01 1.571422346186557989e-02 1.266016262633419265e-01 4.799092675687345079e-03 2.117954985634197540e-02 5.278758007730308122e-02 1.417149270937841932e-01 7.958621934198206738e-02 9.352974916617030898e-02 7.071317477427260800e-02
1.704723088356235525e-02 6.726792826847224904e-03 7.432815946708901111e-03 1.290190668664547950e-02 7.232468190646507838e-03 3.231906032198471855e-03 1.260376937859981339e-01 8.934537990747254410e-02 3.148080450100551597e-03 1.210000543097845480e-02 7.158855592326815453e-02 2.421176028537194713e-02 4.103834078565946064e-02 9.133815461775970923e-02 5.942159053518934753e-03 1.134313408989996372e-02 7.630387177796360727e-03 3.703676329665353539e-03 5.720483271400772680e-03 1.041597068886776327e-02 1.905407609673316280e-02 4.462717297553176268e-03 1.255399727229812024e-01 1.214012705265386446e-02 2.972745379900458215e-02 1.059150071689070674e-02 3.662434082701406662e-02 4.091105007334518151e-02 1.448665120145250888e-02 1.077050264689182191e-01
1.727995773334665627e-02 1.380487953854879837e-02 6.958040375094553046e-03 5.255732222862219936e-03 5.020925245355623706e-03 1.878782106077074273e-03 1.052726948371222049e-01 1.088182585965045968e-01 1.204607792655245369e-01 5.297285261421382473e-03 1.481143293602951933e-03 1.392726861060735680e-03 1.144058243861243440e-01 1.849677429914348354e-03 5.763644165231834350e-03 4.322651890177350506e-03 2.970049917874420346e-03 1.198083763972672966e-01 1.042548804012146946e-01 7.939178849658698467e-02 6.321337731589281306e-02 9.239404541516019198e-02 1.470801947329586357e-01 6.773433158792790260e-03 1.226865751914920678e-02 6.054456860272615024e-03 9.871508844092645799e-03 6.554069915708880291e-03 6.595579055122123731e-03 2.080067297279362404e-01
2.340580533752773321e-02 1.215836693399786200e-02 7.154173631290566479e-03 1.008247759338625274e-02 9.090860014988494039e-03 4.918257390877051743e-03 1.657769241167019250e-02 1.235562742117549823e-02 1.799643640621380455e-03 1.149871014573760342e-01 4.010482046182678451e-02 9.013722556995469593e-02 3.228946621523648853e-03 3.877995852942166949e-03 1.299589117188339540e-02 1.051934530128809456e-02 3.391173979138918746e-03 4.100763243459039711e-03 1.245920297947967770e-01 5.384972306669497111e-02 4.893061902971711924e-02 7.472075199668509748e-02 1.162470812926943847e-01 6.505447001888674252e-03 7.144291001043134859e-03 9.547568193585705132e-02 1.077899541407619372e-01 1.366412848166589367e-01 9.001689728717969866e-03 9.094383619416827880e-02
3.153853581403295858e-02 2.717797977853516483e-02 8.518737658784433439e-03 3.004031743401207669e-02 3.572928693485421386e-02 6.710667245649858115e-02 4.465763607084459463e-02 5.004088487424558467e-03 1.781369249636985657e-03 9.057468111563513058e-02 2.615878901965864450e-02 3.198877573930283824e-02 4.026952533677892465e-02 2.127357168653482965e-03 2.916170626609193833e-03 9.998117733037810428e-02 9.711938784502356647e-02 1.155323893054475554e-01 1.554903091821134287e-01 8.427190896974526280e-02 4.572353201095677444e-02 6.192825839621587253e-02 6.940020015290597477e-02 1.224729885506690014e-01 7.183932533330298839e-03 6.603327400407066339e-02 9.792309154854189623e-02 1.596671980197786056e-01 1.873761270196442619e-01 8.053977371041281391e-03
1.771387708515165943e-02 4.369079807079069566e-02 1.341051957460243083e-02 1.472457750027660744e-02 7.265019113692916530e-02 7.702108831393542077e-02 5.146169306058703818e-02 3.541527560950330066e-03 2.495091539994869195e-03 2.358340187182312621e-03 8.284363600593928900e-02 4.018032200128970888e-02 2.600651948598402957e-02 4.701292237323560774e-02 3.254984250056634082e-03 7.030064614333141060e-02 3.811223638964773321e-03 2.371678755584186865e-02 4.303389253726057351e-02 5.942409396748481350e-03 6.829309937669328368e-02 8.618172563112860840e-02 7.310570599463005192e-02 8.415967195355275599e-02 1.172469255172285257e-01 9.347814540307258779e-02 1.128990936885477664e-01 1.397454787164518208e-01 1.829063543000963854e-01 1.018621694481601156e-02
