1.158923755030896730e-02 1.725127500973946959e-02 1.505484822662643551e-02 1.907245316826874232e-02 1.443364522825696036e-02 3.153323674913034724e-02 3.095199470790245544e-02 8.295657572222832343e-02 1.497993358747952142e-01 6.628548383746360462e-02 3.038835986116254426e-02 6.807889364773019210e-03 3.913040464951948912e-03 1.434652798530856171e-02 1.648577985545756838e-02 3.585476819017901010e-03 1.237949159994320564e-02 2.109834822483709973e-02 1.863338374814389742e-02 6.419866029654446200e-03 5.175742288863096306e-03 5.898630846673781625e-02 4.616320033622195451e-02 2.324602953930551136e-03 4.514717324803366183e-03 3.541562986909952901e-03 1.454405821983184854e-01 1.307010872107998434e-02 1.261110398651329317e-02 1.601942521843839617e-02
9.342196756489307488e-03 2.092491770963024120e-02 3.774923754383210928e-02 3.065765431143847516e-02 2.132830151016261097e-02 9.533196375373299836e-02 4.517475335004354081e-02 5.582493257348197790e-02 3.612750476126491694e-02 2.987457413796733297e-02 2.079141280770705619e-02 3.958828545962043977e-03 5.128360230960107152e-03 1.155034764007417843e-02 1.586420795669028078e-02 1.009907314436593942e-02 1.221248738334975749e-02 3.877188068531293302e-02 2.847127001970418264e-02 8.378622190002189829e-03 2.978567862340580994e-03 5.505103763383271953e-02 1.165440295804907322e-01 1.059977141323612815e-01 9.731993643930865467e-02 1.358692022283408685e-01 5.021589005454751842e-02 1.314993057445107937e-02 1.893183749495255808e-02 1.916979870034109593e-02
1.168300761926167747e-01 1.198923445459636195e-01 2.537756618321248547e-01 2.046588356854019686e-01 4.375725891297324588e-01 4.461405785958555414e-02 8.345185823303956016e-03 8.838122575986165352e-03 1.415611756309063662e-01 4.123225452299482396e-02 1.068276937774912533e-01 6.839785706503984097e-02 2.435064803832861016e-02 3.520273584285629059e-02 6.615181677100641540e-03 2.751286922609581451e-02 1.798064744493426195e-02 3.571133297607089613e-02 1.153442167960150727e-01 1.870587646491679579e-02 1.772746547694142383e-03 4.458960372797972360e-02 6.864682156077886455e-02 2.485986408086303737e-02 1.566806637857971404e-02 1.098955909133826278e-02 1.031273137184700317e-02 8.206330498511419172e-03 1.400441259917774642e-02 1.592274456684001846e-02
5.403197565252154666e-02 1.549406063062581107e-01 3.405586880241034398e-01 2.729442990023597249e-01 1.131858773344858460e-01 1.754788714715383585e-02 1.400762796996761483e-02 9.308987874547135569e-03 5.674477421006179391e-03 5.085020074803203033e-02 3.137685320878323691e-02 6.024300797901581406e-02 2.655028436269254652e-02 1.769567903324317099e-02 5.157393616427016769e-03 3.896185028975774831e-03 7.929374428486513082e-03 1.434466114542104140e-02 9.905686717499135110e-03 8.241976538350211448e-03 3.698833867147024654e-03 1.050262261331104396e-01 3.308602390189824966e-02 6.565951513649381788e-02 1.280457340533582705e-02 9.867409383869577347e-03 8.812865341813191922e-03 8.372375893461866600e-03 1.675992976390454012e-02 1.852116327336852941e-02
3.118666532667846436e-02 9.646549408013700699e-02 2.686115581152169751e-01 1.040368200988914110e-01 6.011419845712600435e-02 8.788940013045493799e-03 1.350926664839315235e-02 7.530618267273470057e-03 1.844056321877009519e-01 1.166170250239614153e-01 1.400397282155424472e-01 1.155886896309133716e-01 1.670744222454144737e-02 1.391560138148598483e-02 6.499816261499438697e-03 1.488394756876379732e-01 2.508150471617941538e-02 1.400621061979406487e-02 2.203609359712006832e-02 1.230402131591068135e-02 8.349087881350161083e-03 2.274933239978682142e-03 4.856816114722755512e-03 1.130212080425430227e-01 2.322686429114900059e-02 1.301482407677862461e-02 9.268361376619444966e-03 1.079090283632574108e-02 1.667751281093590374e-02 6.257551146131945519e-02
3.106442081586528389e-02 3.244633817698960171e-02 1.451905116685410224e-01 1.160514817230216406e-01 4.613743166113483396e-02 4.958555373341565035e-03 6.077154908749477988e-03 6.552422980046351819e-03 6.151645735369874225e-03 1.797160023681032837e-01 1.354942968413593851e-01 6.915892071991100454e-02 7.742836411160522632e-03 1.302921942713994030e-01 1.029026946926909492e-01 1.742160636238775651e-01 1.474240696948324325e-02 3.757230536185757544e-03 1.196429205662792247e-02 4.034554609283973192e-02 4.828095449725244154e-02 2.800741887484826942e-02 6.762699208371607783e-03 6.989969473927455657e-02 3.507078638508077939e-02 3.376595658498921654e-02 2.119743147474264025e-02 1.473287151274543447e-02 1.918480889327322386e-02 3.536893370693044297e-02
2.237108381311152527e-01 6.688283336461102631e-03 7.077786626626642041e-03 3.591720180811464741e-02 1.723661121658989770e-02 2.877104571585626172e-02 4.404887387456100922e-02 2.538220109269750599e-02 3.043193493437508154e-02 3.434710288476941487e-02 2.558396454406134876e-02 1.022120349996260419e-02 2.137446088335872851e-01 8.713256415469521066e-02 4.781090934111231761e-02 8.861706949503836417e-02 8.700451798545425636e-03 4.059757423973681459e-03 2.045516355884400422e-02 2.751911846059015149e-02 1.242607792840704287e-02 2.889631758428314219e-03 8.309078991430246530e-02 6.487583929332098320e-02 2.410205043400298619e-02 2.486619223264099204e-02 2.158932245890127916e-02 1.894177114635951439e-02 2.178176395700955406e-02 5.310534493166636782e-02
8.630941308494829989e-03 1.591987252863630645e-02 9.374167489086716529e-03 2.035067987068038889e-02 3.136442728239115241e-02 3.545612746783738389e-02 3.167241946851657997e-02 3.014037005218404841e-02 2.445894770546532676e-02 1.341881216213446429e-02 5.280916767756319539e-03 1.594475959679063359e-02 1.747502772152179362e-01 5.970362743075584983e-02 6.277951984575780298e-02 1.191090436774836780e-01 1.697018669691750109e-02 2.687646830939218259e-02 2.340513935756661709e-02 1.646703320969455930e-02 4.401320814333615529e-03 1.411200932518346107e-01 4.825391743973213299e-02 3.762942130864364160e-02 1.772750031649835203e-02 1.863270133877273013e-02 2.867785617718345351e-02 3.689206852764420619e-02 3.768369634289434750e-02 1.141512733850211653e-01
2.152680574565444746e-02 1.422496451613875466e-02 8.469270145215330309e-03 4.979142227635335177e-02 3.274437648116589744e-02 1.395563666161705324e-02 4.529630542980175173e-02 2.046207052506517771e-02 1.732162495683262776e-02 1.686381059903189344e-02 1.482523666917955237e-02 1.926685409730242299e-02 4.159407342510751393e-02 2.706353382648966910e-02 2.202147634831487510e-01 2.040367068062919897e-01 1.570270192410588850e-02 4.735629838235291128e-02 4.647378878141983360e-02 7.705527183895374832e-03 7.738496102731422244e-02 6.071501238814609042e-02 5.794627088000547238e-02 3.560719329320369969e-02 2.059512516281337274e-02 3.165322439739099575e-02 1.187384394894540479e-01 2.906741806965916410e-03 9.102703092102279112e-03 4.874728250484044144e-03
3.395926519495955087e-02 2.221351167469750101e-02 3.627799330810911604e-02 3.454800975282630582e-02 3.096397434284032038e-02 6.172372229746377059e-03 2.881890716207424763e-02 1.231495895987006622e-02 5.190613944608035192e-03 1.057399477900597407e-01 2.805221822807869858e-02 2.708108983060225280e-02 5.673134363421650922e-02 6.068193509788976509e-02 2.864321757985705680e-02 3.094011007731192406e-02 1.647717463821652961e-01 1.703219353667815850e-01 6.839069051808674415e-02 3.038683719669630148e-02 9.312911969072924789e-02 4.472531090242005264e-02 4.610771448446476795e-02 4.838339152406298527e-02 2.636528427063479160e-02 3.390147616882079051e-02 3.761697748759320215e-03 7.038773843100159036e-03 9.528489359975425566e-03 2.713020198716669436e-03
2.787883244758808735e-02 1.458431846229265791e-02 3.322126916673947411e-02 2.872396586845150229e-02 3.720069950155584226e-02 1.822672479148227664e-01 1.559871413174316046e-01 1.382690469520437004e-01 8.836748330303709209e-02 1.400271479933785229e-02 2.190349498327128774e-01 3.634018787777037462e-01 7.445175337378548974e-01 3.623878850773281646e-01 6.603560911872698169e-02 1.269208820149455019e-01 2.345921916382134043e-01 6.493503756555674133e-02 1.555121450194336952e-02 1.831213579736871988e-01 6.303110979306483785e-02 4.408053121082990133e-02 5.244689975073447280e-02 7.129524007119499018e-02 7.480973530138443350e-02 4.025043991272054394e-02 6.357990336635313544e-02 5.313279920609138840e-02 4.962503850137176681e-02 3.710370411390522677e-02
5.177376289649733912e-03 1.530735025300020979e-01 2.713362143291023557e-02 2.681401133037736306e-02 2.108309440134630702e-02 4.834631334546866596e-03 1.015679696543992372e-01 6.609813444182552344e-02 8.283063634566417699e-02 2.671517797440342221e-02 6.488407368067028447e-02 4.232309129939086922e-01 7.551178438245411684e-01 3.884508202199318805e-01 1.395614484481921824e-01 1.555550393470530035e-01 1.711824614477992501e-01 1.012096954682572686e-01 2.500011004710269921e-02 7.044088656083547298e-03 5.854976106923232004e-02 5.205866341883472886e-02 5.888622827963269774e-02 1.042073684888979723e-01 9.891530504101347931e-02 7.001022322714386958e-02 5.344082425076453896e-02 4.994621949488019241e-02 5.501240571491693848e-02 6.064881527510164461e-02
5.033302921285046083e-02 1.301024711032801318e-01 6.264248332635080109e-03 1.778415571943726264e-02 1.161967957725909897e-02 1.948805234933494168e-01 1.007388095385583632e-01 8.498429888068774474e-02 1.081022862071796126e-01 1.306611841758645309e-02 4.381178242043778578e-03 1.333851185535823158e-01 5.587963167220239002e-01 2.371099578701854338e-01 7.422040599879801970e-02 8.524551715417365283e-02 3.141478614675462938e-02 4.608696076167599631e-02 5.253378027291302765e-02 1.966835997055172910e-02 7.051664704155201358e-02 6.333177795533821708e-02 7.632141019832827666e-02 1.307606386564557355e-01 1.710767682594186712e-01 1.604975836280868873e-01 1.188682554461748808e-01 1.105939759221302582e-01 8.616043911642419506e-02 6.807868092386538950e-02
4.009691365879432950e-02 1.154322699246028566e-01 4.090775953430791402e-03 1.549598165639841651e-01 9.196458849316521689e-02 6.769567224085323853e-03 2.274847978809398097e-02 1.912186129045300928e-02 1.516724888591462761e-01 4.737417512515760404e-02 3.154074289946748669e-03 2.138544730801213503e-02 2.524058027633863110e-01 3.388246620100384132e-01 3.607070956735347056e-01 4.858292175216044062e-01 4.360180043048915155e-01 2.815839829810932171e-01 7.658519511134659341e-01 3.572626426534660782e-01 2.960837619604991811e-02 8.569622884411588065e-03 6.382984412865023820e-03 1.599782733062451306e-02 3.689978548548900061e-02 3.420616323599971753e-02 9.303776071556359162e-02 3.075674165439119465e-02 1.390042450169932664e-01 1.375925158176216634e-01
3.690334537167976742e-02 3.705263941927952609e-02 1.024423807828732380e-01 1.423857195329288755e-02 5.091715458844254388e-03 6.537947187726693421e-02 1.510292352733554576e-02 4.340355677387492533e-02 2.919199811337711697e-02 3.062075375200403338e-03 6.643600472221684004e-03 1.066617519951570531e-01 2.265756726637355722e-01 2.848901153618341731e-01 2.560296306119950183e-01 3.082358759860812092e-01 5.236920331040437748e-01 9.012553215476173385e-01 9.173028737731931948e-01 7.276114944179890021e-01 3.127591738666834348e-02 3.278011640559803930e-02 2.889783970394810622e-02 9.073332286353161247e-02 1.302317868392245948e-01 6.650414822860525321e-01 6.669718663841603945e-01 1.362420605655902672e-01 1.635957827481540894e-01 1.002636571514112923e-01
3.315518581907584555e-02 3.605420857398185241e-02 8.259494078098959802e-02 9.096618357888645867e-02 5.987038768181318638e-02 6.820005950698022901e-02 8.273645551590110003e-03 2.319403892605081605e-02 4.811877829332218692e-02 1.763410659149161966e-02 1.858978207787936876e-02 1.649371761716351623e-02 1.287482252721966480e-01 2.591997780757190339e-01 2.409491729899173318e-01 3.672916012592284951e-01 6.307985084605070014e-01 7.642303491005884020e-01 4.434197731384276753e-01 9.761029839243161310e-02 5.871472914102903590e-02 4.026060833235691194e-01 5.818621632208283989e-01 9.855155121704596288e-01 9.363917314850603857e-01 1.233780245554406907e+00 1.004965670648000797e+00 2.913293961615184280e-01 2.617266451628000867e-01 1.200920184847847905e-01
4.139153078943801772e-02 4.769091257146049895e-02 4.686802468218338735e-02 4.437517138923086774e-02 6.705180212526017092e-02 1.394325856223413707e-01 1.347611687830651273e-01 4.492785091439032152e-01 2.197930152265326620e-01 3.858410007673194336e-02 2.933388831474487493e-02 4.672556525242026193e-02 9.296087504812999835e-02 1.360032273877022635e-01 1.781007489997554760e-01 3.172623414376004591e-01 6.779314996004813798e-01 6.855055725771522779e-01 3.274307335939703467e-01 1.131858121694141878e-01 4.843524687380156846e-01 8.687555389863039768e-01 1.103295105306961510e+00 1.154712912786934664e+00 1.045177302852661860e+00 9.276530523699330066e-01 1.410357551850484947e+00 2.484284006785593690e-01 7.941648658791097132e-03 1.702118653723596331e-01
1.017154662180758951e-01 7.941365417671136795e-02 4.114673707692902832e-02 6.420049075665082428e-02 1.320240612653674275e-02 6.610173183643447414e-02 3.674002969689300069e-01 2.981742783522493001e-01 2.939623954254483862e-01 1.513352639213910167e-01 5.688598600210635625e-02 1.571624923724073211e-02 1.550595615250184231e-02 3.960231983054680882e-02 8.830285064935046446e-02 4.037824881510432840e-01 4.209130962879057969e-01 4.937374091908779405e-01 8.646079199409330285e-02 1.529815604461411127e-01 5.354444892523341215e-01 1.141940819343708835e+00 1.393323851275674707e+00 1.486586218170091955e+00 1.280656079442082262e+00 1.286122736295913782e+00 1.239999819812191539e+00 9.830584194212084181e-01 4.363073680688903111e-02 2.877248106952263323e-02
4.609802112433613458e-02 1.265512700944856628e-01 3.740210326561221096e-03 2.526103473188012760e-02 5.485879165787745787e-02 7.693066957080950397e-02 2.423002365198931862e-01 3.009898442563881948e-01 2.071146280489846447e-01 1.641211963144790786e-01 3.518730235078827012e-02 3.516651216989439849e-03 5.396128456810800160e-03 1.525205735985961548e-02 3.312706633974596415e-02 1.960271472938931725e-01 7.435574429231450733e-02 2.383236434935711093e-02 7.992532236021631167e-03 5.782494463006414287e-02 2.174927419251421468e-01 1.146429915992209336e+00 1.441109929650621790e+00 1.535682441524096609e+00 1.151315259473302266e+00 5.478557345399452938e-01 9.062375659878243450e-01 6.220836603851004343e-01 5.610065033054728589e-02 2.214830714503003561e-02
1.948875631820350465e-02 2.428149630469854034e-02 1.592194742780677144e-02 1.933210177108104361e-02 4.460779001905504360e-02 2.541261542711711202e-02 1.308639305564589517e-01 1.683038171719868914e-01 1.556109109335056528e-01 3.716681599030150634e-02 9.458159680933584529e-03 2.021435355729287418e-03 3.589116615214103887e-03 1.074428270368818841e-02 4.319436412377389983e-02 2.946081540236836563e-02 5.350798383547167303e-02 1.575421886862284418e-02 2.935519730812831407e-02 1.377939953682128793e-01 7.358223941263503098e-01 1.387878829115763324e+00 1.488389611570555049e+00 1.426804974108184743e+00 1.108607963424420806e+00 8.211781730208952412e-01 8.024618020673578433e-01 5.407256896220972164e-01 4.868822903181418277e-02 1.733327803507658804e-02
5.533448575840111544e-02 4.906957835198063472e-02 2.494075517173757403e-02 1.768565557190876839e-02 2.263251662197401232e-02 1.206129397813209513e-02 6.873281711110727776e-02 6.119089494833796633e-02 1.682567640818003959e-02 9.205618203477245950e-03 3.196247554389646320e-03 2.559355127597200304e-03 1.218475719676277574e-01 6.754555074870301212e-02 2.474984005697210016e-03 8.683839042932593733e-03 3.074063585547159166e-02 6.949207323585453178e-02 6.626821573294364165e-02 2.938721614560774742e-01 8.014012716711554907e-01 1.164854826086179962e+00 4.762597395554681312e-01 7.136829173784979830e-01 9.172975643841341231e-01 5.169706997170034901e-01 3.844905958519165279e-01 3.158191025722890677e-01 1.157712543027205818e-02 1.046595766604149595e-02
4.423368737904295744e-02 4.942285671138635372e-02 7.292375194728315316e-03 5.032234346749708820e-03 4.107184232915709991e-03 6.095203587542325115e-03 8.667805660388508415e-03 2.152191259672534256e-03 2.776222830720097810e-03 3.853271714831166955e-02 5.004328660656241073e-02 7.558406825693164688e-02 8.400434510675693078e-02 4.012290840910788005e-03 1.194201978264276820e-02 1.623355084787666269e-01 3.057431792874724663e-01 4.369072910778979413e-01 2.948799297526859542e-01 2.214413842274835786e-01 1.579183962780230377e-01 5.698505563399754170e-02 2.220767604635175488e-02 4.746467630490954631e-02 1.697561585092509095e-01 5.671177662182369517e-02 5.182702677776747369e-02 1.750780979780421076e-02 9.022630453467966882e-02 7.380514930611824231e-02
9.066753862689844179e-02 6.825160391566266471e-02 7.488220232556894174e-03 3.267006075706093554e-03 4.830083859119304115e-03 3.738201354753794073e-03 5.699591161206752320e-03 5.262434366020145304e-02 4.444108868366723752e-02 1.910214967206698769e-02 4.500505855379653697e-02 8.462224665317154282e-02 1.129655456528402269e-01 8.099225483104190160e-03 1.402975985769717819e-02 9.221985735107145199e-02 3.301960470515420409e-01 6.060446296918143849e-01 6.769418048264138621e-01 5.877881458827636241e-01 1.270623887784395334e-01 2.872515189834556545e-02 3.590476520388083403e-02 8.713796125928072178e-02 1.920610830710251238e-01 5.608807942797505025e-02 2.139426834400050270e-02 8.050261472007410116e-03 1.142624308309510700e-01 1.024690236959224510e-01
1.098628312389287598e-01 1.377643555428383938e-02 3.924914060797913412e-03 1.006219580491209270e-01 1.239474511769520920e-01 3.312053185024683207e-03 4.171034487334178767e-03 3.970666811427754628e-02 2.178314063789713040e-02 2.500680548205456641e-02 4.403107810067322797e-02 7.477611959717561652e-02 8.476531109579119039e-02 6.181210822915500849e-03 2.545390030498634326e-02 1.291401131729067175e-01 2.443053278088291869e-01 5.511198286835804483e-01 6.811847147984750883e-01 5.768716945964323939e-01 2.940717551624579262e-01 1.724430661817844684e-02 1.240089080615438925e-02 2.667196593526850734e-02 1.525010514814855445e-01 9.072712600546421757e-02 8.142168520609648075e-02 1.528414691517676616e-02 9.949750147460481586e-02 7.631816711182254354e-02
5.934017470111256631e-02 1.820545430438428106e-02 7.397861004636083551e-03 7.173556259602830755e-03 1.662110226885998854e-02 1.120777533735276693e-02 4.486837454860885532e-03 1.545996155700616048e-01 2.569563699041818323e-03 3.373367166370151542e-03 2.736395439892741477e-02 3.066692967834343947e-02 4.778876776472428672e-02 1.084091394999359692e-01 9.023110530810953336e-03 3.879573489498516076e-02 3.831691871333699900e-02 1.608005278688499073e-01 2.027011918290402559e-01 1.746364617208168712e-01 1.505556094966937486e-01 1.986383318231651346e-02 1.573917182920364366e-01 6.068212037294328995e-03 2.677669066295214687e-02 6.672504213160454500e-02 1.789964403600364518e-01 1.002077934676097182e-01 1.153319214104950863e-01 8.683585294017627521e-02
2.114567121757517792e-02 8.323576527513313478e-03 9.318599858341871864e-03 1.640491574399116637e-02 9.381034969804132734e-03 4.144094646119691680e-03 1.562177676275964544e-01 1.085746793566174512e-01 3.806868864047661255e-03 1.483266052860478766e-02 8.800279091008972321e-02 3.016181964758246972e-02 5.096886238266948310e-02 1.118888834007127353e-01 7.292236817590259067e-03 1.378101577911062040e-02 9.358415954019648139e-03 4.583131474299172690e-03 7.145016021866788455e-03 1.309716647261116237e-02 2.398821227343591114e-02 5.623560224308448222e-03 1.557155109761781953e-01 1.530775127570748080e-02 3.748517779451149973e-02 1.335560953548465060e-02 4.615407093663100035e-02 5.137905672217076003e-02 1.811338806585493025e-02 1.317957461484588200e-01
2.143201504829850279e-02 1.708418955101089626e-02 8.724392900301690054e-03 6.683825052204598292e-03 6.513914494788108044e-03 2.408540910054484275e-03 1.304564086425190339e-01 1.322127134900530632e-01 1.442412652564543096e-01 6.494469988725462724e-03 1.840810401175003606e-03 1.754679632164150762e-03 1.420704248933554181e-01 2.295590794847304859e-03 7.072437541011622648e-03 5.251584300851530433e-03 3.642982210712612193e-03 1.461328717330213356e-01 1.284229997613865470e-01 9.843476516278645838e-02 7.840003424032977730e-02 1.146156878277164726e-01 1.824685009298868399e-01 8.537926480891242995e-03 1.546827802212023990e-02 7.634398502949496859e-03 1.243975090916218593e-02 8.230766792259812045e-03 8.246412263783333557e-03 2.545196043855573187e-01
2.902662473620575695e-02 1.504862263996619744e-02 8.971365098807275104e-03 1.282421408700018702e-02 1.179661368359377974e-02 6.303699649948089553e-03 2.078192577621136225e-02 1.517038169977584852e-02 2.176818273841784387e-03 1.395276990405920070e-01 4.931285518071952534e-02 1.123172188157583046e-01 4.057535336882906254e-03 4.812337893792995210e-03 1.594533383316475150e-02 1.278150879350166587e-02 4.159881103779715546e-03 5.075373955091295325e-03 1.534898271094442546e-01 6.676095227130049437e-02 6.067363720144603595e-02 9.266773361253413666e-02 1.441876958405231834e-01 8.194747356303194036e-03 9.005225269594616111e-03 1.184111444947254371e-01 1.335555754258710426e-01 1.687567197870415703e-01 1.125425021158862372e-02 1.112716114727229921e-01
3.914023829637965773e-02 3.366039346980195107e-02 1.068580096088149467e-02 3.822714386793619329e-02 4.638248541628397364e-02 8.606922983312577380e-02 5.605628548377055570e-02 6.156266337300562996e-03 2.160381070053232159e-03 1.100849469249653295e-01 3.219792832258416143e-02 3.988266632288800517e-02 5.000418891159716384e-02 2.639937907485370022e-03 3.577731008778735344e-03 1.196131208095401327e-01 1.173630299179636849e-01 1.409386120133001297e-01 1.915720659590336716e-01 1.044649805063853909e-01 5.668209793986608153e-02 7.677152912850056243e-02 8.603572871823997326e-02 1.519041737089469601e-01 9.051719360444477822e-03 8.190402979125716021e-02 1.213271205020584609e-01 1.971802933702632155e-01 2.303727387563579698e-01 1.001814750007310600e-02
2.206692660434294087e-02 5.425452574841346104e-02 1.684162297605714537e-02 1.878625890206706353e-02 9.448127050840078589e-02 9.960067046551797365e-02 6.573053688842221687e-02 4.466422000057372783e-03 3.118042676245119920e-03 2.965100706580433513e-03 1.034662763397807134e-01 5.052886875103380221e-02 3.245955259519395925e-02 5.776482512929929924e-02 3.998304706449513739e-03 8.402866120909885383e-02 4.675249718925611996e-03 2.937680759763976190e-02 5.381647322777548953e-02 7.473476556991084062e-03 8.478130175868713037e-02 1.069875248536202861e-01 9.075360859401451763e-02 1.045558063795230669e-01 1.457302869595925310e-01 1.161849270167856774e-01 1.401227222811495532e-01 1.725966511493279842e-01 2.245464790011728051e-01 1.262449583843098730e-02
