8.422527660105305625e-02 1.195256178086529092e-01 1.008729676406500547e-01 1.255370094837995332e-01 8.792981430366557383e-02 9.656083226380731202e-03 7.055052267959611122e-03 1.921695224570714802e-02 3.520098629080941482e-02 1.593920573414719238e-02 1.029939502491230424e-02 5.299195122566819488e-02 3.529590505621302970e-02 1.304044475712509421e-01 1.189882324650607878e-02 3.743345809690338394e-02 1.603376440347693832e-01 8.639410779896817411e-03 6.720028935213688027e-03 1.320260346699112242e-01 1.203565744852458236e-01 1.796304445798686117e-02 1.356195057471611294e-02 5.371602367647024256e-02 1.038423430310657508e-01 8.117975354673587218e-02 3.720382515139189494e-02 3.313958056372322703e-03 3.201061229836663427e-03 4.071976537889052464e-03
5.494852792690578525e-02 1.143840874035251670e-01 2.372478709127462393e-02 1.497799503966452082e-02 1.033993778482059367e-01 2.890850707556885668e-02 1.176261201113239577e-02 1.487517400094627226e-02 9.058714538467479635e-03 7.181106841822200090e-03 6.781002935351224808e-03 2.693257602708749518e-02 4.111109806633364561e-02 9.942713731895629070e-02 1.160054374395909881e-02 1.020723571529130458e-01 6.168659828447582184e-03 1.580928939849367970e-02 1.048400920511198542e-02 4.425074012212017183e-03 7.069739303694368149e-02 1.764019311065571569e-02 3.617092490523250020e-02 3.202836954063600222e-02 2.817349404475849584e-02 3.755341146699200938e-02 1.311874044326145038e-02 3.370065067397951582e-03 4.846057380743729916e-03 4.893492519473577156e-03
3.213007169515589428e-02 3.141478055591771096e-02 5.920372551631231106e-02 4.465347386933701118e-02 1.032105177904621973e-01 1.646313251723679344e-02 4.511919104228442889e-02 4.803081240763275306e-02 4.160002364941617348e-02 9.848551669658329316e-03 2.618481357916518926e-02 1.938173254110877458e-02 9.270728214081975019e-03 1.665250372688853106e-02 6.136011821752138801e-02 1.432235438858608240e-02 8.053565159796983314e-03 1.244436236212803290e-02 4.123749625933865320e-02 9.329740597405322688e-03 4.540054888021211044e-02 1.494504565063630754e-02 2.255176647255885056e-02 7.759145421051345110e-03 4.558693313189646906e-03 2.974391732782324677e-03 2.632175860448672002e-03 2.086132243290525403e-03 3.589690599038772127e-03 4.058769118632184203e-03
1.120523677670508603e-02 3.183038803464125627e-02 6.973564832081473319e-02 5.657237663751466666e-02 2.827472494925618515e-02 9.120555898869099620e-02 9.165724291206900354e-02 5.757568613912533717e-02 3.160582965863414917e-02 1.254968449269484691e-02 7.503331743484551938e-03 1.753914235408354783e-02 1.220431475043949783e-02 1.248083368645066561e-02 4.735993590329214131e-02 4.102154636117223002e-02 8.991488694993229891e-02 4.748941309606531831e-03 3.310609111759282332e-03 1.453171204574900954e-01 7.967567728500950242e-02 3.152170128387798281e-02 1.055423442794533109e-02 2.067548614088716638e-02 3.745507492734387062e-03 2.650148872285034308e-03 2.256541143061257648e-03 2.155708169984242931e-03 4.407944441496320850e-03 4.821865193061076506e-03
6.512108492290242384e-03 2.012078409388621397e-02 5.621957681789786082e-02 2.184319169308495887e-02 1.651112239574134208e-02 5.380846604607157635e-02 9.448157913432135568e-02 5.356317007220801063e-02 1.986012358230850386e-02 2.983102161925372739e-02 3.370018395862715843e-02 3.723192864201337743e-02 1.131241087658226424e-01 1.171417716788558938e-01 6.157562724070353433e-02 2.552273761368606397e-02 1.702736769086240359e-02 8.813109369303916835e-03 8.995479412329563523e-03 5.832211443264530455e-03 1.259272438149639517e-01 4.011138450435772218e-02 1.027459314714354588e-01 3.382650286744166845e-02 6.760503636850951487e-03 3.559166136018588646e-03 2.459179331581743972e-03 2.859264214387875324e-03 4.498595537374442017e-03 1.663725626688553408e-02
9.260369062148526842e-03 9.880419948652746295e-03 3.760256894578965781e-02 3.075650109014041109e-02 1.388024276680339085e-02 3.084165506364228843e-02 3.916463532022739641e-02 4.183844666732539075e-02 3.403037690699475815e-02 4.431444073407392326e-02 3.678330535694542686e-02 2.700036165704129340e-02 5.292114718651434735e-02 1.986522466968186976e-02 1.664998132514874593e-02 2.905132572355954845e-02 1.582315380990762799e-01 4.058300136970218602e-02 1.281891222640263728e-01 1.657629559669761277e-02 1.975570172720950493e-02 1.757559558747209469e-02 1.251569093260761489e-01 1.962567548364260728e-02 1.007687662454852945e-02 9.345051005915493841e-03 5.817238639684440583e-03 4.032034673196733914e-03 5.354387951972790043e-03 9.671802775446408651e-03
3.068097074367631683e-02 4.682379250633191686e-02 4.631796750312634769e-02 1.529648531598440039e-02 1.037410984947766540e-01 9.262204346566558014e-03 1.449910318523379114e-02 8.208055980099713753e-03 1.083240540571530838e-02 1.234071319295787679e-02 1.266544656174712832e-02 6.378126785911798768e-02 2.964667132694280213e-02 1.371835177782044016e-02 8.037261091659692394e-03 1.474085797862056957e-02 8.494413107979290056e-02 3.874266508306039442e-02 7.072486731393184956e-03 1.067545831444545283e-02 1.333882623436820902e-01 3.872969392694129709e-02 1.831711157760079756e-02 1.764043169700238445e-02 6.818893174809302800e-03 6.986163660392715434e-03 6.204223194665477344e-03 5.417934521921050767e-03 6.322643313931133879e-03 1.499027551394628392e-02
6.569633007713902850e-02 1.222422028851338771e-01 6.608712739159129657e-02 1.304339257079129566e-01 1.225703421965605895e-02 1.093645905098412051e-02 1.134315611245659793e-02 1.415794028417921048e-02 1.738994642230234228e-02 9.206562676671645185e-02 3.860118870880446112e-02 1.185628925506563708e-01 2.561853574996451194e-02 8.965503103339768701e-03 1.023638044457285227e-02 1.983358476358839870e-02 1.531918877469888030e-01 1.566236922313741370e-02 7.483649625187596341e-03 6.692284740685951541e-03 5.375329620607303960e-02 3.222036556843972666e-02 1.307171305994173083e-02 1.099197242359051599e-02 5.240705974799497215e-03 5.520905432318322197e-03 8.976332014798943382e-03 1.161957382053521379e-02 1.145437920682658081e-02 3.294375886123115937e-02
1.546437581204668232e-01 1.000328389341517410e-01 5.666973439330695583e-02 2.259270284085894073e-02 1.272613000848587562e-02 8.140376335911331251e-02 2.263402220141829194e-02 1.336743666926801799e-01 1.284195432062658626e-01 1.314405651864963553e-01 1.203205622623722826e-01 1.517058716299978238e-01 2.293055312939867862e-02 9.374819981715987530e-03 3.301969555968606307e-02 2.910143796001702851e-02 1.174874113976216300e-01 2.037109992933008179e-02 1.403503894386654016e-02 7.029800443320474712e-02 1.421211552658621993e-02 1.502678460775529190e-02 1.657887708881322641e-02 1.088879180924213867e-02 6.391592726549825271e-03 9.819773271952344715e-03 3.915736538058483401e-02 7.854048247022905882e-02 2.222940132440497096e-01 1.075017882319536794e-01
2.672376297504965373e-02 1.785402830430811785e-02 1.874703298735776527e-02 1.086769922917325132e-02 1.056608047955264265e-02 3.882200723626181432e-02 1.900371360678408325e-02 9.162608103725966568e-02 4.449065043732559899e-02 1.606590816299498931e-02 2.046141613926703504e-02 1.323964596550251775e-02 2.016416765851543683e-02 1.731448031811356342e-02 8.713373256470284198e-03 1.051226711227233948e-02 5.329127854465143949e-02 5.773079646491992289e-02 2.468031975191413083e-02 1.366626237939257485e-02 1.827287046123457145e-02 1.169919547580268622e-02 1.360374761607137384e-02 1.504029557231944050e-02 8.423668883543098534e-03 1.084855584840542335e-02 1.053512604650046341e-01 1.789276355562335330e-01 2.189805888354240115e-01 5.644528454274719276e-02
1.379299794728142646e-02 9.315209513716145306e-02 1.242048335856258713e-02 8.133274846726932725e-03 1.431274958929145726e-02 2.438236490887490254e-02 2.401532795969194001e-02 2.199741885771427236e-02 1.518333492858081613e-02 1.198678413466470610e-01 6.492265121102519521e-02 9.509039278675054940e-02 1.979760888280550635e-01 9.903922732594774847e-02 1.847907464198042526e-02 3.684502506955592005e-02 6.919354250235981718e-02 2.079734719374161031e-02 1.222740810600925487e-01 2.984080882367805276e-02 1.264366893552728612e-02 1.142660262780981900e-02 1.494082679674311152e-02 2.104551168186134802e-02 2.258378168903520458e-02 1.236635262317248123e-02 2.004882125680956112e-02 1.585147907440740550e-02 1.410212483497185962e-02 1.002611769662371810e-02
4.122465744913695468e-02 2.267844065699662140e-02 2.352887257549166750e-02 2.324568687830113820e-02 1.918895398482746775e-02 4.011848806274734974e-02 1.857897997999431727e-02 1.284282111001170366e-02 1.568439717608895861e-02 1.317071386782247416e-02 2.586338703278577220e-02 1.172211555733232019e-01 2.078803976307535550e-01 1.082545641747259119e-01 3.910914543205909477e-02 4.433023082210860166e-02 4.927053780839978775e-02 3.181561276418220369e-02 1.036151920401837817e-02 6.854750567723282006e-02 1.217687128321524176e-02 1.249978700380114521e-02 1.496156355829701516e-02 2.695769315492182322e-02 2.574540857640865779e-02 1.845051725243659901e-02 1.428189649332384931e-02 1.302518990858242409e-02 1.424107462382735723e-02 1.541436505269847337e-02
9.756621667093793443e-03 2.360693134586941758e-02 5.501410228149262310e-02 1.510707035319724945e-01 1.024576906311838037e-01 3.409932882014170274e-02 1.876226294088553792e-02 1.626200058875123741e-02 2.137838434160313494e-02 1.467921999596261129e-01 4.119181336249862213e-02 3.890089925068839632e-02 1.564089513121427188e-01 6.685288121017184115e-02 2.091276722843570315e-02 2.408678133369055938e-02 8.958265569211127863e-03 1.325404284696337504e-02 1.867718472911893482e-02 1.452376201179533255e-01 1.169321603808870687e-02 1.292935426092181941e-02 1.656543307540442669e-02 2.775258658401099504e-02 3.539068742153905073e-02 3.113126203585964494e-02 2.311307467449302475e-02 2.183671366037176487e-02 1.927153707894531734e-02 1.604138178264622253e-02
8.417807737913410304e-03 2.390538977794777128e-02 4.311221665430313432e-02 3.141996006352618109e-02 1.886761363889161852e-02 7.343856598573168804e-02 1.895035064804689168e-02 1.029805747507958093e-02 2.986835507914772231e-02 9.831634112722864582e-03 3.511291184494229334e-02 6.961306166206505594e-03 7.210090223631691886e-02 9.644179392059280820e-02 1.014472569146852854e-01 1.350290283267773783e-01 1.227584297889958709e-01 8.080725266910107618e-02 2.336840209085140063e-01 1.110959576207809912e-01 1.194955081982711741e-02 7.708644070428712081e-02 5.872239135955956146e-02 1.411146760661729227e-01 1.837426468719905934e-02 1.369953079715071666e-02 3.550486575044146942e-02 1.381013257661366407e-02 2.623585410285514744e-02 3.042816735936125852e-02
7.991191101460551685e-03 8.033280678630809815e-03 2.209120708836725608e-02 1.668184042471302087e-01 6.142900672544675950e-02 1.383056170931662790e-02 1.619606655790104266e-01 1.973080595644888593e-02 1.022725936487960813e-02 3.665450814444713018e-02 7.559192701139448578e-02 3.442952367278870329e-02 6.487042286452232576e-02 8.143834064580764143e-02 7.260864132975723695e-02 8.648534734251844824e-02 1.492606370410947680e-01 2.617726790908255219e-01 2.700594823926872334e-01 2.149311995973941236e-01 1.114742559212696105e-02 1.328212237356640041e-02 1.349722878351374868e-02 3.704801063530733379e-02 4.830649884789805365e-02 2.141469386459069479e-01 2.151660945678461612e-01 4.830876685382767821e-02 2.658850922242297909e-02 2.039514636880995074e-02
7.434101092078627959e-03 8.124830244343366273e-03 1.834057972984338286e-02 2.044705823415833915e-02 1.379147439777021061e-02 1.462865024791630032e-02 8.213119868871276985e-02 9.852194556399854891e-03 1.544962378000215054e-02 6.054605356966877294e-03 6.308169608676118811e-03 5.179804747887167653e-03 3.690550008879156518e-02 7.399334857726798387e-02 6.820594865906823290e-02 1.032055265458859256e-01 1.808097016692885584e-01 2.227276958799388751e-01 1.302797633243126252e-01 2.880404604822258546e-02 1.773476108706364962e-02 1.250320347232162510e-01 1.874119447174603659e-01 3.150844065801557958e-01 2.949855509507026130e-01 3.839406881971341168e-01 3.065619130930551384e-01 9.345607281998326299e-02 3.776951040712810820e-02 2.217514346050014282e-02
9.613368844188490553e-03 1.116480614135847114e-02 1.088601204370248481e-02 1.021133049343966696e-02 1.471757394613965736e-02 2.492709187404104978e-02 4.385620564729624665e-02 1.422185499584520674e-01 6.788352980059488007e-02 1.158170800649781750e-02 8.581541421874401554e-03 1.338815271424516166e-02 2.642228699832312525e-02 3.866235084912843234e-02 5.062754776288535402e-02 8.988521786162149974e-02 1.960356659804979584e-01 1.995885237200612505e-01 9.549380793337500228e-02 3.330807147411163349e-02 1.481972984414703931e-01 2.774033381401054821e-01 3.670548683948897661e-01 3.745569205406212299e-01 3.246564629007935299e-01 2.770784699216371494e-01 4.052217526270908698e-01 7.321926109178521214e-02 5.054612973854329810e-02 2.734001046960320841e-02
2.419247174286668495e-02 1.915722075765911858e-02 9.325112734707249884e-03 1.300139492465144167e-02 5.126589335535236720e-03 2.089085276296304139e-02 1.129835375212792231e-01 9.293327170911495905e-02 9.260430719181603210e-02 4.601754673730178852e-02 1.785932552267162701e-02 5.540902362405104517e-03 5.379678963862074073e-03 1.279354251301893612e-02 2.507130381699048186e-02 1.141979404154164351e-01 1.212344904657122052e-01 1.455966541557017491e-01 2.559780817916088372e-02 4.592847520063498418e-02 1.651927149550596330e-01 3.696273428778808490e-01 4.707741336340255378e-01 4.809675846850046677e-01 3.860603638408066085e-01 3.640303541888640360e-01 3.324164151314145110e-01 2.664175087517782203e-01 2.834766595894505636e-02 2.065396808766337411e-01
9.728134802481698540e-03 2.691251046834010341e-02 4.692388610632394763e-02 9.077974561927585131e-03 1.666233759496133990e-02 2.294724724369844732e-02 7.258990220230095158e-02 9.105639105390206378e-02 6.253675289754233313e-02 5.306468118797867672e-02 1.289061150914846444e-02 5.093662303773193595e-02 7.760217352261895851e-02 7.387155056303731059e-03 1.171922389733419910e-02 5.426830096937437786e-02 2.302456545412606692e-02 7.562553157859096958e-03 5.821048620300773441e-02 1.685851775286917667e-02 6.398505111512513277e-02 3.467905634703475903e-01 4.462595044548784418e-01 4.640425651319083356e-01 3.346209760926427967e-01 1.536092530093030040e-01 2.475591394027571168e-01 1.686237335814162741e-01 3.986528192353575722e-02 1.509054528651364580e-01
6.215620583293491458e-03 8.865980473978452708e-03 5.722240342486570319e-03 6.411744297593993322e-03 1.334961010966666944e-02 7.607699311252266033e-03 3.864866621341515179e-02 4.934505596079050149e-02 4.491947203423807267e-02 1.301110083361255512e-02 1.376185909115423267e-01 3.533058655758419125e-02 6.107574767042772690e-02 1.483879577489998214e-01 1.668512375134648465e-02 8.441311565622878349e-03 1.686951168657456132e-02 1.408861426372332304e-01 9.195284907731235413e-03 3.919591001053689822e-02 2.073370275184812095e-01 3.927526720214188916e-01 4.217879629363044947e-01 4.013765503083611685e-01 3.091866594614340880e-01 2.274292320092714814e-01 2.213187009404615491e-01 1.550402803117025829e-01 3.249038878316679729e-02 1.169726866202767390e-01
1.525467649921500093e-02 1.531635589588734719e-02 9.018857078587421208e-03 7.366688887611346978e-03 9.857689206926473560e-03 4.531574427185383440e-03 2.276494776769243458e-02 1.881378205080911845e-02 5.156389876688994775e-03 3.651237788037348803e-03 6.020172761755675228e-02 5.358437084018378982e-02 3.010496960476680833e-02 1.389182060035212482e-02 2.965402191396556558e-02 8.542986895860689434e-02 9.492294761726536093e-03 2.082061298071858496e-02 1.984516767325960468e-02 7.955102317667582523e-02 2.141236990667970963e-01 3.114404754408732767e-01 1.244948522304693550e-01 1.889890535623076073e-01 2.440376554479007365e-01 1.409480128045372260e-01 1.148009780094408766e-01 1.007396407092871343e-01 6.614050873397862851e-02 7.190840840196906225e-02
1.255074349933253501e-02 1.772706458663440149e-02 9.877209982668701260e-02 8.526026586744737956e-02 7.970200890764617130e-02 1.143727100308638972e-01 4.100463186932530590e-03 3.922156578961944612e-02 5.382854565465162999e-02 9.337040224230297100e-03 1.385174431554176029e-02 2.227812536385899086e-02 2.129728184906657523e-02 6.645439620073642639e-02 5.740429224297209296e-03 4.538097265985002737e-02 8.442413901400190601e-02 1.181348823313939644e-01 8.051873315435043033e-02 5.985175863248820560e-02 4.124253718658887902e-02 1.470483216157819628e-02 1.162953235640524358e-01 1.227423199027263476e-02 4.468703367916090213e-02 1.826222083137526639e-02 2.076811072298061570e-02 9.606852467987836430e-02 1.242545918484577912e-02 1.159384633231976339e-02
2.632952028532646940e-02 2.653250456979958094e-02 1.116574915308133076e-01 6.603624449421149900e-02 1.114040378911854423e-01 8.564457494391024273e-02 1.320955359902560855e-01 1.434053927799850379e-02 1.291422298888906389e-02 5.607399884413248256e-03 1.393832040369202135e-02 2.580814753219945815e-02 2.811181569724651580e-02 1.293896931422401086e-01 7.491375206422851672e-03 2.496264490568727776e-02 9.191194761219925735e-02 1.721104711594092784e-01 1.955675471728798576e-01 1.679873157619922175e-01 3.735701795158689886e-02 1.008803667560905122e-02 1.425231443516411858e-02 3.202503397822456521e-02 6.192314000547789049e-02 1.869018129697527092e-02 1.110272806393704237e-01 4.542940154280113857e-02 1.699291448041916064e-02 1.630016339123308705e-02
3.268676084760462064e-02 5.741675604479405670e-03 6.291725704621257964e-02 2.737355753186977020e-02 3.491086231226536024e-02 7.887298070205592260e-02 1.045578810214046195e-01 1.200157734378702427e-02 6.411687073106931214e-03 7.326401030274152723e-03 1.333844380333181270e-02 2.280809650924518761e-02 2.121302751357507024e-02 1.011992041768002282e-01 1.390385986540441585e-02 4.006855729840457653e-02 6.932424351338924151e-02 1.614015825993876385e-01 2.052825056080347932e-01 1.735481135702627298e-01 1.021327269339000754e-01 1.239687425482612210e-01 8.407936320135667163e-02 1.511601219499288107e-01 6.776138604866756288e-02 3.799043444020479970e-02 3.437174502490580180e-02 7.782488350102015340e-02 1.362284996734736305e-02 1.230605949225459586e-02
2.002446415078762768e-02 8.678292577162922267e-03 1.359488051297216005e-01 1.470902233159512296e-01 8.046700820207043289e-03 5.717465545665502066e-03 1.075282459527016482e-01 4.527754254790024302e-02 6.561692298318680394e-02 8.398594287989030738e-02 7.882733273307370933e-03 9.483288559501036954e-03 1.249061136635530936e-02 2.421384410555977793e-02 1.211932239544833700e-01 1.808769518250430072e-02 1.311391707938529619e-02 5.843276629408750145e-02 7.305701484111244703e-02 6.105943059856679123e-02 6.443461605575145912e-02 1.585884727543804551e-01 2.491129535385836619e-02 4.068084210572699144e-02 1.650407594792525079e-01 3.188386370344308690e-02 7.278131956945931014e-02 5.948021110835377545e-02 1.583475692964354115e-02 1.382965118660167171e-02
7.244702751579894240e-03 1.362911731366693857e-01 1.763494406006904658e-01 1.106246590793660313e-02 1.958754902182860691e-01 9.157657994798802659e-02 4.345131126846803193e-02 3.151771598200882318e-02 9.816021563222718238e-02 7.179600985473345680e-03 2.592285354900079886e-02 9.622411680332098802e-03 1.426560061463049214e-02 2.644690610760871280e-02 1.096503431883672497e-01 1.285982149733701577e-02 1.148802507879555929e-01 5.394217265658280552e-02 7.881390673225560639e-02 1.328119422094686530e-01 1.549403562628175191e-02 5.331871063026621949e-02 2.715441946181065824e-02 1.258331203205482196e-01 6.754426996298303065e-02 8.817133823687664518e-02 4.131264680159581204e-02 6.310276974262328531e-02 1.290075321999273328e-01 2.199135810550517309e-02
7.461752506686919299e-03 8.546145403583279426e-03 1.692468423466950145e-01 1.385706672382708560e-01 1.374570736812438243e-01 5.412472116273452788e-02 3.576139177559152504e-02 3.708164652470694045e-02 4.111968495424270925e-02 1.633502876876581078e-01 4.800757890397057415e-02 4.824470639629645230e-02 3.888942550880783444e-02 3.962563829618349215e-02 1.055749860356152980e-01 7.138344309746812166e-02 5.020153917342713018e-02 3.048866906595626425e-02 2.665893408004139237e-02 1.998271930217530162e-02 1.586739358253659582e-02 2.300612694152354490e-02 3.491206473042705177e-02 8.091070461284111115e-02 1.372582440685346794e-01 6.140435393756953769e-02 9.378721125014258253e-02 6.520884471632329427e-02 6.746986606489858984e-02 4.454295659606834906e-02
8.819826509918915480e-03 6.250279105989048345e-03 1.695700748917488287e-01 6.244722143577669145e-03 4.317163165666280771e-03 1.309480741572260076e-01 6.726444381407531252e-03 5.238167088868518617e-03 5.662731483270438959e-02 4.113665343573458949e-02 1.545358942631624814e-02 3.599416842661484067e-02 9.062524059126536580e-02 8.363003328921213286e-02 2.731970658136824090e-02 1.760880358194248096e-01 5.690727546631241252e-02 6.596507099039486399e-02 3.012828966176614442e-02 1.338376464550507586e-02 1.294086784091182281e-02 2.012659156061734692e-02 3.043976019185355014e-02 9.201948461984185701e-02 9.187430030912514811e-02 2.152090162569490414e-02 2.378303647502456875e-02 3.069960922676092177e-02 1.001807466699842775e-01 2.051970892466560906e-02
1.186025565464096827e-02 1.221381576345094075e-02 1.928128275185605478e-01 1.336076826374423682e-02 1.303610452313563699e-02 2.432613564431190464e-02 1.719124258446710907e-02 1.436095001285383477e-01 5.632365622143969269e-02 3.275345099422770356e-02 9.958911423243451549e-03 1.278777078529136704e-02 1.374124233544258243e-02 4.714454943419782440e-02 5.603713724413215969e-02 2.361670424181482389e-02 1.991043617136027330e-02 2.107629264441724867e-02 2.870717567521862551e-02 1.670533963675155387e-02 1.184908791467888071e-02 1.764340335446444932e-02 2.008252460229816364e-02 3.311517272633660719e-02 1.016726971602511104e-01 1.581166816905324804e-02 2.278538143880415312e-02 3.740995578625087858e-02 4.519410521973332706e-02 8.987448239749776246e-02
6.479654913598250493e-03 1.757614667876350109e-02 5.328096288405466223e-03 5.810795846727579220e-03 2.545812971943058750e-02 2.684169035708017584e-02 1.905339195672193717e-02 1.006909868600023988e-01 7.736532955921136823e-02 7.216197024273006411e-02 2.959639423277540468e-02 1.491342473696664027e-02 8.965531012930553004e-03 1.413237476714117834e-02 6.425385023109181359e-02 1.676512823879700020e-02 4.575783298687035455e-02 1.711054617781098894e-02 3.253383637085617563e-02 6.447452826032185058e-02 1.664212950508387606e-02 2.328939305453167977e-02 2.027781158153276614e-02 2.203986534588806001e-02 2.883734240562577100e-02 2.183664139743986959e-02 2.551415763051679761e-02 3.141009060870952885e-02 4.227707362950052644e-02 1.035845638403836977e-01
