4.044489618935289132e-01 5.827672364372685765e-01 4.928686807961518701e-01 6.102328402680243791e-01 4.277281370478673295e-01 8.904413542028518647e-01 8.103973949130459653e-01 7.659686464713632778e-03 9.264451430888838435e-03 1.795794194057451915e-02 9.980833478221216026e-01 2.612652630411839150e-01 1.718268505243500388e-01 6.796478122183531312e-01 8.409696920925545660e-01 1.990662619584058490e-01 7.477660843470469443e-01 4.754061623860324909e-03 1.755784000009969923e-03 5.474381103084368094e-01 5.131594942283685956e-01 7.670751035930281625e-02 5.859553583822614542e-02 2.327159387038182370e-01 4.464197058740868029e-01 3.456893194566606486e-01 1.566307745350986880e-01 1.368830525219859491e-02 1.297396722840192008e-02 1.618861668511439172e-02
2.610095655694112393e-01 5.509113805661953744e-01 9.694495584755450368e-01 7.296916829101918189e-01 5.069008136861917757e-01 2.632691792581847573e-02 1.045415596638599176e-02 6.602955922760707017e-03 8.150631598572000147e-01 7.505866802038144714e-01 6.094231486373316020e-01 1.349810189433947039e-01 2.035296208209977364e-01 5.252483507849323718e-01 7.660604206787613446e-01 5.482974315549881128e-01 6.949767673968936244e-01 1.270976720610284168e-02 2.475808407121961926e-03 6.521423374085321134e-01 2.936184396485365111e-01 7.371682995934582261e-02 1.525731020080179356e-01 1.355776805799666362e-01 1.186846171780166215e-01 1.571284059434495672e-01 5.440632920519815341e-02 1.376392151073186666e-02 1.950066666517528621e-02 1.939614732531397615e-02
7.933695381995922030e-03 1.255879752227491084e-02 2.483585924315912311e-02 1.681325438131854935e-02 3.982342541660137403e-02 9.872701197407918183e-01 2.092781096306252087e-01 2.189071451737009955e-01 1.707501292871956705e-02 5.158508749970384423e-03 1.184995807049939870e-02 1.898032763105575102e-02 9.245486109480168802e-01 2.914718145134539279e-02 3.146387613033964636e-01 2.107242166008781864e-02 1.082918696178960527e+00 1.460788010797150864e-02 2.194132411122542980e-02 4.818878334289402113e-03 1.846963257539780690e-01 6.104902826146263450e-02 9.276495107299093101e-02 3.202269562512154860e-02 1.876478823043861363e-02 1.219167409521002693e-02 1.072623256705537015e-02 8.413291496337817893e-03 1.433361628288381227e-02 1.603369837524462951e-02
3.314711955287783906e-03 8.321301898926615134e-03 1.006752120777381233e-03 8.140703644778828421e-04 8.813023497112250360e-03 4.241943390047513418e-01 4.224862985036739182e-01 2.608057226533814221e-01 1.406284506950591096e-01 1.828733662803213060e-03 7.546407861081693147e-01 1.267125901433972801e-02 9.075241350475649060e-01 7.355761247715491002e-01 2.312286521795123007e-01 2.133856068175023768e-01 4.848779819075610953e-01 9.573161121060707046e-01 6.743591462562950056e-01 6.031101267925611520e-01 3.328177069096588392e-01 1.288240534053105013e-01 4.319063657502053566e-02 8.467271915416950401e-02 1.532011535647737933e-02 1.080018075098894935e-02 9.160569311495480802e-03 8.688825940547038537e-03 1.764831897426544227e-02 1.914592545435666454e-02
8.157861583330835442e-01 2.189403020509426284e-02 1.104228326192205172e-02 3.132057597902017767e-04 4.089176197250033069e-03 2.465602052265714605e-01 4.322207745537723356e-01 2.436789950816437289e-01 8.922171396823917744e-02 5.855562800401423879e-03 3.015814060064845800e-03 1.818455907506104363e-02 5.469397185194097011e-01 5.667539005897466176e-01 2.977138101845315243e-01 1.304828945288283859e-01 1.541219955638681194e+00 9.059833729942606828e-01 1.267090999575616432e-02 7.522513453681446416e-01 5.299401996642982837e-01 1.648994661115522342e-01 4.197720054011087054e-01 1.382579290380007153e-01 2.764379104941474402e-02 1.451941235715036548e-02 1.001120531357089366e-02 1.157502981741464348e-02 1.811914269059986676e-02 6.655373426465346909e-02
9.498254715808306381e-01 8.828811879923778028e-01 3.266619447399286141e-02 2.315577793231091489e-02 1.808445221277809808e-02 1.468646669435352825e-01 1.892142421307480560e-01 2.005720393056608930e-01 1.679547504843121597e-01 4.576016133911017109e-02 2.128103634150189591e-02 1.346539467850922829e-02 2.443086802784276701e-01 9.234740073458619358e-02 7.799508191292305048e-02 1.461398633848241257e-01 8.170952361609568060e-01 2.116000294571734330e-01 6.441323652301207403e-01 2.273872689301115191e-02 1.784607203137503206e-02 9.595051441280076990e-03 5.122768533493466947e-01 8.008669282680325185e-02 4.120211865350822261e-02 3.817529023417995382e-02 2.375260496668607155e-02 1.639401686026472835e-02 2.169302975472784528e-02 3.896140965998372285e-02
1.626656655626299020e-01 2.472574454883407769e-01 2.424124713776719675e-01 1.141122239300446317e+00 5.698899160712506129e-01 9.312291639398770915e-01 4.538725746937791183e-02 7.886750702185862938e-01 8.981157286489445113e-01 9.575569104866106240e-01 6.864330430814074013e-01 2.942694694327920302e-01 1.352616466471644463e-01 6.252688540285269991e-02 3.690236586794071183e-02 7.001158383626522597e-02 4.134463176480760449e-01 1.943002653004259339e-01 9.559549974949933526e-01 1.305694442622582274e+00 6.220596331136661883e-01 1.646968978335264233e-01 7.526195877058011741e-02 7.197761304514266323e-02 2.789501397977121530e-02 2.859477391685478001e-02 2.542078114934276378e-02 2.212316365699805443e-02 2.574378930502165333e-02 6.075803713070674489e-02
3.670713469820772179e-01 6.847871621293381006e-01 3.637128084106209247e-01 7.398404165854578496e-01 1.108370153241934997e+00 1.191111509486479481e+00 1.019303862220537482e+00 9.681027655155169942e-01 8.441560897351888526e-01 4.680463828137140792e-01 1.851668686796291430e-01 5.510545376988745803e-01 1.187269131310206977e-01 4.132781365830338199e-02 4.712711751125798348e-02 9.051506703520796615e-02 7.190394570256349871e-01 1.136386916599723573e+00 1.019731523879665813e+00 7.824366112192508993e-01 2.486501069278661546e-01 1.374210099245106453e-01 5.401010821229729891e-02 4.500619893968341168e-02 2.145835620387905734e-02 2.259980592404315508e-02 3.675767548755402847e-02 4.723011962582380346e-02 4.621813139370865159e-02 1.318842152718815997e-01
9.610922126815145683e-01 6.358794488717668392e-01 3.535818670871105351e-01 1.684945808109248044e-01 1.259174355660548139e+00 5.154028256176831357e-01 7.072770823697678566e-02 7.279247416940131110e-01 6.589929276147313830e-01 6.535912872498393922e-01 5.718373681634233430e-01 7.061911821011572776e-01 1.860940797348450276e-02 9.680812908116220861e-01 1.529345181741648962e-01 1.310297843586060995e-01 5.420818523031126768e-01 2.071362047703541667e-02 1.929540766161024629e-02 3.282369175336756206e-01 6.312556750127935878e-02 6.359590176673514395e-02 6.850480525819177546e-02 4.464487016137648479e-02 2.619172547828836281e-02 4.019001815779876807e-02 1.600752931733218365e-01 3.176975693724823357e-01 8.897477721704789566e-01 4.254735611167962950e-01
1.596904629159422440e+00 1.038655391993956734e+00 1.597401295699177659e+00 1.491881918694990095e+00 1.313083513724333740e+00 2.534995429615133355e-01 1.087731249387838384e+00 4.720428889704620379e-01 2.187225353752954016e-01 7.743525891601721334e-02 1.039770916225886355e+00 8.756637721443677469e-01 1.281793126242490588e-02 1.002929498498472509e-02 9.545846671377320458e-01 9.546946300186175405e-01 1.285420183787018555e-02 9.477847397204251442e-03 5.410214738458894723e-03 5.082276109284685622e-03 7.770641055516118445e-02 4.900566977946115704e-02 5.613680765739032658e-02 6.171416576675030352e-02 3.453457125049896187e-02 4.439109582512250352e-02 4.296780960569333008e-01 7.201545510240293657e-01 8.695486665213729705e-01 2.210436969866694801e-01
1.362993234557716260e+00 7.086569714598673908e-01 1.571273140074371577e+00 1.350642544339470286e+00 1.756078266797194587e+00 1.599282526509190061e-01 1.282760856104169511e-01 1.123230337605336110e-01 7.291352662492914249e-02 5.655158312749469784e-01 4.136404357608420429e-02 2.359561633933384209e-02 1.369228228437544860e-02 1.303431117289593870e-02 4.716171969479012599e-03 8.607944392462560032e-03 8.311057409806352214e-03 5.504112698880833654e-03 5.317183453049856290e-01 1.295967969891624882e-01 5.337376949019230488e-02 4.763916427865855924e-02 6.155329010027459774e-02 8.627844461628696171e-02 9.242012695689226509e-02 5.045181930865232089e-02 8.141695559800819770e-02 6.342979184894637079e-02 5.563407576375474506e-02 3.896590344312284709e-02
2.622126050368506767e-01 1.540881851954015724e-01 1.349078152568456757e+00 1.329621433773512162e+00 1.053292405385327868e+00 2.461871206636984666e-01 9.549711331047126828e-02 6.171852081998171341e-02 7.387282014667456709e-02 1.156867832163781973e+00 1.462439065694281538e-02 3.499009542445228466e-03 2.534350550576797579e-03 1.329313380674308634e-03 4.880171278950670277e-04 2.221820835625172141e-03 2.424675453376228321e-03 9.979624692146756015e-03 8.924246980987023958e-01 2.959185323738412476e-01 5.114702630313598675e-02 5.183331691035202027e-02 6.138321606412850545e-02 1.100131308831184540e-01 1.047344743038196718e-01 7.470559837945218995e-02 5.742167240659106636e-02 5.176727014879334982e-02 5.592756005416838622e-02 5.977358785256264156e-02
5.282478633440823579e-02 1.359291250546965091e-01 3.266461695578128932e-01 9.209245179525856750e-01 6.053686076745714573e-01 1.939509277766047202e-01 9.898729961794193455e-02 8.336557735473690278e-02 1.033143468751371447e-01 6.708794883325337466e-01 1.866340315829953522e-01 3.594777923189959763e-03 7.006062670516732815e-03 7.996310147403959444e-04 2.576810374267211748e-04 1.207773054768481510e-03 8.828439742841349691e-01 3.284028168412439410e-03 6.621647815487454077e-03 6.248869587214396226e-01 4.916355732129895628e-02 5.373872240560590569e-02 6.786324182735692379e-02 1.134846452494679275e-01 1.445143308308261543e-01 1.265009935774968342e-01 9.316854680011622813e-02 8.672627549330601260e-02 7.569808698683488934e-02 6.203217088196393697e-02
4.353915204114255227e-02 1.253597998148604786e-01 2.243017346182893945e-01 1.618929333386180947e-01 9.567529592111401193e-02 3.763817678011139312e-01 1.251662492840586172e+00 1.077460957644942097e+00 1.415597846808557825e-01 4.375039701604779840e-02 1.549673958626730796e-01 8.228473079612406149e-01 3.398514691361410878e-03 1.129825512795675163e-03 1.243297493237649270e-03 6.928940520936829016e-03 5.972747755890546809e-03 3.695299930687911700e-03 1.203292534481526128e-02 1.843421405563362009e-02 8.862089242588129245e-01 3.228765189806909741e-01 2.412873460814687621e-01 5.756334036477164240e-01 1.159146965346048663e+00 9.851611539799172146e-01 8.701550947310255149e-03 9.790447446509152885e-01 1.024178288370039269e-01 1.172805471460803967e-01
3.952398334763959631e-02 3.990929643987528586e-02 1.088720748366021757e-01 8.123480097137335543e-01 2.958328315881812443e-01 6.772366185081803158e-02 8.266851027902607507e-01 3.980098581713002043e-02 1.068057891463098687e-02 1.641165965580704822e-01 3.395048534819211650e-01 1.213778597323065568e-02 6.289931698617741256e-03 9.004419329274375395e-04 8.445428833431523064e-04 1.060879010917991153e-03 1.873943794238865741e-03 3.346381267357469332e-03 3.533480207426313406e-03 2.553249034896484804e-02 8.567255694825810508e-01 9.582007150702404052e-01 7.941389508392933116e-01 1.162719321623990540e-02 1.216762725560042828e-02 3.180046272690105480e-02 2.822324671839032337e-02 8.433561315547314849e-03 1.052749021996941536e-01 7.990360679328628590e-02
3.519660586013017428e-02 3.852950632056965224e-02 8.778161044312028649e-02 9.772164671458583030e-02 6.563783161254427290e-02 6.872783072495161627e-02 3.728520321695162343e-01 9.930828380226007779e-01 3.391469991323281096e-03 8.332328883315327506e-01 9.046689573019398578e-01 7.165738882811174548e-01 2.246383976353241978e-03 7.670342692557522313e-04 7.444841639067387769e-04 1.190831075217251532e-03 2.167300583230916296e-03 2.768962871305304194e-03 1.685934255313377254e-03 1.616873643479333628e-03 2.313219066725027886e-03 1.974530586383038688e-02 2.045356326486118953e-02 1.344343967491721387e-02 3.760758717745071172e-03 4.936168118346110148e-03 3.952612928599512701e-03 6.687690660965433034e-03 1.527157617795683320e-01 8.935968031319921345e-02
4.402992767068849428e-02 5.101568291677391342e-02 5.006799183457466551e-02 4.738210500006196507e-02 6.819377635326420717e-02 1.126517773972389030e-01 6.594642617737460528e-03 1.369664216898069768e-02 1.083265276741595014e-02 3.078795988765814073e-03 4.102449142212479839e-03 6.386406715489665632e-03 7.265962122706692838e-03 3.797242214634155219e-03 5.171571506460831413e-04 9.707826120557391022e-04 2.242444736826022193e-03 2.424901087096912287e-03 1.226446215043670114e-03 4.409561409269394409e-04 1.918469054036049844e-03 3.492621546089591522e-03 4.484255127973010152e-03 4.703901972153691664e-03 4.225786481560286911e-03 3.681002999064113181e-03 5.448806542454640717e-03 9.507011378151498937e-03 2.117402541349403811e-01 1.143589825245169278e-01
1.079061397815930107e-01 8.480274466401334366e-02 4.151996266664664120e-02 5.831131624464242630e-02 6.875782327179760234e-01 4.430360167113462332e-03 2.403990453582304041e-03 9.151915259806702460e-04 8.894191294964783360e-04 4.332788645528105756e-04 3.002500443210123510e-03 8.303997052573998117e-01 8.022122314168725898e-01 4.567985992553236750e-03 3.751113564387784701e-03 1.156279393447124564e-03 6.696821788781366983e-03 1.019445966654416481e-02 1.741791774873219971e-03 1.329494661844023455e-03 2.126895826607383844e-03 4.634980637783825234e-03 5.751705408235284304e-03 6.135911164757660609e-03 5.184853208062498338e-03 5.025170522835750199e-03 4.669439542729790851e-03 2.999027027458204403e-02 1.078262854137003623e+00 8.892450679273098402e-01
4.387112256077849159e-02 1.217525776743455246e-01 2.142202504299122734e-01 7.477369739203266509e-03 7.199943597847956352e-03 3.580846643844690178e-03 6.472732307113674040e-04 8.037257180075736782e-04 5.471304868207979219e-04 3.928989276882888064e-03 3.708497184738825201e-03 2.236992388769164786e-01 3.453803927574589649e-01 8.088853768095015662e-01 3.569842164248108324e-03 5.346630306557011766e-04 3.247838856984759052e-03 7.773398837973087838e-01 2.461707512837527645e-01 1.914764597925269415e-03 8.062959845012535823e-04 4.384422172209762741e-03 5.664968929498504467e-03 6.134223606429404368e-03 4.608052684862536108e-03 2.168706649711125891e-03 3.551184831749867096e-03 3.556421038868114171e-02 3.053428228827766502e-02 6.497719482882884368e-01
9.230194581104032014e-01 1.221346446871162339e+00 8.678074324839417653e-01 1.069262347382162970e+00 9.071189838500992933e-03 6.390518555122126848e-04 3.187698761601817296e-03 3.894161185146314988e-04 3.820134985400300623e-03 3.122651096426359244e-03 5.956872732246530910e-01 1.526559092137846907e-01 2.673922851563704794e-01 6.459952209447896720e-01 6.325888714698903355e-03 4.673666275847643595e-04 3.099746074083536626e-03 5.995482769852409355e-01 9.743646392201427142e-01 4.530784492211750898e-03 2.537543406156180480e-03 4.973777896040034244e-03 5.534696747894230461e-03 5.491800133708696699e-03 4.378918673706731768e-03 3.301459324674770220e-03 3.274281864493206601e-03 2.704202132491199603e-02 1.141635588391345157e+00 4.983472026294125667e-01
1.253480250834414396e-02 1.713093237102204097e-02 1.148506417244713439e-02 1.128381196662019637e+00 8.667985232538684068e-03 7.855213126078117725e-01 7.266663160530793114e-03 3.714727342410963432e-03 1.113793807100194695e-03 6.512858926908368096e-01 2.629572694702382862e-01 2.319484499307506720e-01 1.301628638832590112e-01 6.016845327914702862e-02 1.273272626673870311e-01 3.628434067587562595e-01 1.226316215048849686e-03 4.384883092984862007e-03 3.785342835116793994e-03 8.229088014992145400e-03 2.529040381689108899e-03 1.046373092729772046e-02 1.003838126765723218e-02 1.451289716814960565e-02 2.978474240929186723e-02 2.718129156287002468e-02 2.879654445685640371e-02 3.662887663760493184e-02 2.790454473615524567e-01 3.035336831143923830e-01
1.178242730833048456e-04 3.054958084290986496e-03 4.170027638984971086e-01 3.599583365925522194e-01 3.391351060545883533e-01 4.829220793664666944e-01 6.793484021405747919e-01 1.704056948068947419e-01 2.380751948792780570e-01 4.129302912116487867e-02 6.119326984982111778e-02 9.638401895531802099e-02 9.204712330077007010e-02 2.902869295685795437e-01 6.413753986675986285e-01 1.041698500053413710e-02 2.670732343616626352e-03 1.100310852241131575e-03 7.876661916749896995e-04 6.257038670239043008e-04 5.113965645499209470e-03 8.151641551008911510e-03 5.293332987229911746e-01 1.022817850104129844e+00 5.671077173421013723e-03 1.134688925608400512e+00 1.106108523967632040e+00 4.025856074271476071e-01 5.192108085991485600e-02 4.840816049820130529e-02
2.427161633228863604e-03 7.877292092571933774e-03 4.674012766893870241e-01 2.737136407005803518e-01 4.590915080858293806e-01 3.620789645980289628e-01 5.694509459188199507e-01 6.313308547025318906e-02 5.625617393333857963e-02 2.433229796642968554e-02 6.030446514304076827e-02 1.112268968179069978e-01 1.213622825188525878e-01 5.644870843849554287e-01 7.306152006055659509e-01 4.509501776145158521e-03 8.218327484122731150e-04 1.577453917540849434e-03 1.859865147371762839e-03 1.722116607307186843e-03 7.509991631720070067e-03 8.758600346537495085e-01 1.038001803189953165e+00 1.924761024607793067e-02 1.606985193353532848e-02 5.887915266056821181e-03 4.716707145050743621e-01 1.920834537584640012e-01 7.148041880822877947e-02 6.844518015553868739e-02
3.265088744006565315e-03 7.581153517247474216e-01 2.666452638081233117e-01 1.168548935714338599e-01 1.508318199889448763e-01 3.447586269856377506e-01 4.532232674340957446e-01 5.154066743912186915e-02 2.775449410002387568e-02 3.157054523750143366e-02 5.731381404150241027e-02 9.777582616770671975e-02 9.116732645322753181e-02 4.384043365075667720e-01 7.290467435685369854e-03 8.420550705428178281e-03 6.352468388877582049e-04 1.478141684583196861e-03 1.922775304567487598e-03 1.752994663550728593e-03 3.008998118673941041e-02 5.509191234501276124e-01 3.788842004716778677e-01 6.800587199177751119e-01 3.385589384068646290e-02 1.514369528570494970e-02 1.050166204787591866e-02 3.295664350027156519e-01 5.776447927696570783e-02 5.207049340283107647e-02
4.510925041042074951e-03 4.699033395561280808e-03 6.015870365470989967e-01 6.575636810814726729e-01 1.582031498266900815e+00 1.109683970163490629e+00 4.645901387803644811e-01 1.923564434209658613e-01 2.936001311834393057e-01 3.739328940657554723e-01 3.489124722280912555e-02 4.067265395661096711e-02 5.402739112680248618e-02 1.068189485488577201e-01 5.564954994624851103e-01 1.732353287293469588e-02 8.974358346691900870e-03 1.159706345069744932e-02 1.013390687282451560e-02 1.868756813513432549e-02 3.062459553505605600e-02 6.896856108489459736e-01 1.113996889483131747e-01 1.941383585474764917e-01 7.909839924475878803e-01 5.243014631046310353e-02 2.057551443408540265e-02 2.801297569327514461e-02 6.755377692327521610e-02 5.890105227458426046e-02
3.313930523918284712e-03 6.035874286081459594e-01 7.949879161464732391e-01 1.526449758303002779e+00 8.886266628188411731e-01 4.057423631841138856e-01 1.874667827795690189e-01 1.335446747913172361e-01 4.377732021288913700e-01 1.656717513081576332e+00 1.152710260871934456e-01 4.272580820184145728e-02 6.536997635354026281e-02 1.257542226129302887e-01 5.383975619799886703e-01 8.960174561474084642e-01 5.295544656473727407e-01 2.300005233827948081e-01 3.258987562307502639e-01 5.551832750978544784e-01 9.750802988326519039e-01 2.305491838138815641e-01 1.205668856968634128e-01 5.855991694907629608e-01 1.337792504727625786e+00 4.131403274296354122e-01 2.980707169428267397e-02 4.811494907810506122e-02 5.529700515578318543e-01 9.396929259875770601e-02
5.435247247577696013e-03 1.383030568302853647e+00 7.846410741282361379e-01 6.180487275874168018e-01 6.061826765718072441e-01 2.261844399594163391e-01 1.510835851003679564e-01 1.589769404245897078e-01 1.855301003588014364e-01 7.251234573047382614e-01 2.144460930670041010e-01 2.224998787196863503e-01 1.865518955706836346e-01 2.099080873545694226e-01 5.655433368520104143e-01 3.734386907996211091e-01 2.358265072592636014e-01 1.316784056307742645e-01 1.111654394796161849e-01 8.318145247272767939e-02 6.677488225030382696e-02 9.812785149929167949e-02 1.521564830406449131e-01 3.657939737543312031e-01 6.246182085275979734e-01 2.798093652762023709e-01 4.083767996290375013e-01 2.812978342394856779e-01 2.902012307547164327e-01 1.907569180165196998e-01
5.910662721371209849e-03 1.204435773431191015e+00 7.644547328388787699e-01 1.112108192708080034e+00 9.845485137384802909e-01 5.393572546781222332e-01 2.912870456455061378e-03 1.542350223736694392e+00 2.461589350656377684e-01 1.758076678185014341e-01 6.729563081616407594e-02 1.666221830332565990e-01 4.395703040703664022e-01 4.442284604496413158e-01 1.291553363882826932e+00 9.132328284925504969e-01 2.647242545928331081e-01 2.849527870970468557e-01 1.256132266496873262e-01 5.511029116382745036e-02 5.372303271555045612e-02 8.445954112553367976e-02 1.297783267657683925e-01 3.984611782272950431e-01 4.013056519309415315e-01 9.421093001458649696e-02 1.033444070335418213e-01 1.329037096660363182e-01 4.330547113454290553e-01 8.822576131141857125e-02
3.016498714029252227e-03 7.786064735211296016e-03 8.554858025161730106e-01 1.221454618980422416e-02 7.087870658650324840e-03 3.787631796381885421e-03 5.726439745569081134e-03 6.097983124057683169e-01 2.438993655695874951e-01 1.394903002568216310e-01 4.293314185620591278e-02 5.886299937917904845e-02 6.619949833395344374e-02 2.441030346156300435e-01 2.895966230351802451e-01 1.195493980338528661e-01 9.175613106560145948e-02 9.048597185023964096e-02 1.192792862272485377e-01 6.860534136215788725e-02 4.894484561061696049e-02 7.325942767166898628e-02 8.401640616152121488e-02 1.407547216917668098e-01 4.372883190534463949e-01 6.861252667464128041e-02 9.912800467593908815e-02 1.625336632205832965e-01 1.963871697014483719e-01 3.884449378833096378e-01
5.660571103104783945e-05 5.848641565560355401e-03 1.310881999395389519e+00 1.521749736456240010e+00 5.079276772966450151e-03 1.710891531204323504e-04 2.006324351947112814e-03 4.149831120558600817e-01 3.223283601663872178e-01 3.022724740893100726e-01 1.251541314857152754e-01 6.506647093980900964e-02 4.183363760102038614e-02 6.655060354788035204e-02 3.025657303873613424e-01 7.764228180282227443e-02 1.993550402170879698e-01 6.720794068010638340e-03 1.159973766123249123e-02 2.612975174726664407e-01 6.779055891197346972e-02 9.515618617416583824e-02 8.314282165301924155e-02 9.178853162962583023e-02 1.215608183773552869e-01 9.306199830826612784e-02 1.093765138539456727e-01 1.349568013830511892e-01 1.824937809631204111e-01 4.469074420937206860e-01
