8.405532579315887209e-03 1.242357367512726338e-02 1.085968195509680670e-02 1.377761870398822031e-02 1.044012348467951261e-02 2.285811894055413129e-02 2.250686432225758662e-02 6.052035639955738455e-02 1.096674674505175584e-01 4.903495820353390156e-02 2.302447182780347282e-02 5.350398693917612740e-03 3.178481104749099513e-03 1.173383143598061285e-02 1.356838027006690602e-02 2.968598932021824545e-03 1.042263744334768864e-02 1.814851528833450953e-02 1.639653270765843718e-02 5.749370319245186885e-03 4.571287397953447372e-03 6.552472683354365222e-04 5.015129726763354907e-04 1.877011399424878199e-03 3.640082585366515890e-03 3.178123684182745760e-03 1.740157760703082979e-03 1.681758642212238353e-04 1.729671744074095748e-04 2.288676648195507048e-04
6.769749495753940756e-03 1.551425801026343199e-02 2.800024966992597369e-02 2.274799734269853518e-02 1.583008790209286532e-02 7.083805362806254446e-02 3.364485152150564762e-02 4.169598880363249715e-02 2.707611160607745551e-02 2.197470592721321309e-02 1.543654311696572926e-02 3.065006539709282368e-03 4.161929484494299690e-03 9.449031205397343328e-03 1.306637133790827104e-02 8.365771157735873986e-03 1.029440704592260621e-02 3.342236800177807859e-02 2.513384242849421926e-02 7.535938180385605596e-03 2.649132021102499745e-03 5.844063819327388956e-04 1.203046589679636217e-03 9.926204695110377348e-04 9.017264341933191492e-04 1.423412934609850217e-03 6.309496818832614502e-04 1.743596021009545321e-04 2.623231468332734204e-04 2.752900872736563213e-04
8.750988006510042327e-02 9.615469779227209246e-02 2.033423504380699187e-01 1.638405647406906696e-01 3.499986065863097129e-01 3.566652504952816383e-02 6.674331015777221904e-03 7.077836511457991087e-03 1.136260949546008259e-01 3.111280488474253356e-02 7.889317121705557989e-02 5.233170587844649529e-02 1.974902526657018945e-02 2.880495216436794806e-02 5.455971784047708266e-03 2.281674051231833214e-02 1.518123699502880140e-02 3.085829042940595179e-02 1.021804401331865980e-01 1.690473610959529124e-02 1.588724099328950356e-03 4.510679030949533487e-04 6.713529771856476718e-04 2.176217301427074257e-04 1.398320040449203220e-04 1.164218076364275051e-04 1.306209386292388338e-04 1.089238559100509646e-04 1.938435024583742990e-04 2.290191497043579162e-04
4.076196268262154143e-02 1.259569719420183254e-01 2.768225085793989959e-01 2.218390280539104253e-01 9.198281920083274665e-02 1.424817745761448699e-02 1.136554704914052340e-02 7.552134984762095930e-03 4.606255407332859354e-03 3.848129200714744957e-02 2.313988649710072704e-02 4.601526636449011776e-02 2.130860628883402344e-02 1.400362775680850068e-02 4.034732311787141319e-03 3.019611976791910547e-03 6.237349893386331598e-03 1.153526985006209787e-02 8.152751864349378277e-03 6.912403449563148117e-03 3.091707009252345813e-03 1.031970461999301555e-03 3.129289250062422534e-04 5.821657402076042430e-04 1.174936843490638353e-04 1.031600356380702485e-04 1.067959698960576021e-04 1.067711154554986752e-04 2.240461272580091597e-04 2.587497970422762673e-04
2.369147034240211974e-02 7.935737479056415022e-02 2.209470732345332200e-01 8.556551595674842525e-02 4.943550843364029335e-02 7.211154627767116070e-03 1.104514413949257527e-02 6.136931934429384547e-03 2.818321300312973642e-03 8.803987960252199207e-02 1.029709938397017632e-01 8.822423463165059154e-02 1.324763749030490045e-02 1.066749951027344892e-02 4.892754543877873320e-03 1.794779875109874141e-03 1.914092401815412070e-02 1.089440364011627638e-02 1.747887663954161147e-02 9.917142448533807636e-03 6.732437486270649585e-03 1.835572540273244270e-03 3.923707348693647110e-03 1.060101684189219528e-03 2.227508525330996374e-04 1.326426872214176388e-04 1.022873601917147570e-04 1.258231714446927843e-04 2.048623049873838633e-04 8.073902730173970537e-04
2.377917249707253711e-02 2.703444103948831473e-02 1.209574915630061975e-01 9.666958514721132878e-02 3.842742572137402418e-02 4.112537021304817596e-03 5.004275535164919193e-03 5.356464334999506451e-03 4.992160317035718685e-03 1.352374955220325137e-01 9.929188160692514753e-02 5.261119612988089667e-02 6.053203538840135761e-03 1.757037372121202697e-03 1.320835375239396000e-03 2.199649917498547758e-03 1.155490720100620441e-02 2.992177329858021484e-03 9.681435279110809505e-03 3.308415439343904280e-02 3.973183825649279077e-02 2.314332220435077331e-02 5.612898032631747844e-03 7.063355614136331310e-04 3.498237156518945444e-04 3.346038767941526848e-04 2.100036990808173249e-04 1.549914936720855722e-04 2.136021958025340636e-04 4.157120364645693132e-04
3.156745665599816446e-03 5.340455521071725727e-03 5.699894885333735631e-03 2.916795581827719488e-02 1.411198468676874186e-02 2.351002442645210369e-02 3.565259345697174842e-02 2.033759516862112746e-02 2.412866459880236292e-02 2.555779246167542637e-02 1.870431081415693808e-02 7.773726661687767846e-03 3.205009547516818325e-03 1.196954826739148351e-03 6.358026662668379066e-04 1.195780501039650110e-03 7.162601288887654460e-03 3.390192174978794246e-03 1.732099835762759138e-02 2.359124496273119417e-02 1.074157476512748247e-02 2.519937778152231325e-03 9.563459248466245691e-04 7.075992879222102157e-04 2.476957834884992637e-04 2.394017390230865491e-04 1.947624585366760123e-04 1.826162853328714808e-04 2.232966182109543773e-04 5.765779185561967007e-04
6.564807863023615006e-03 1.187972161782832256e-02 6.982844004847802918e-03 1.526061489338660648e-02 2.385622828935011347e-02 2.701754594397434706e-02 2.388525525926935705e-02 2.247979344337358576e-02 1.803039989990303307e-02 9.764990216144728286e-03 3.900023472282198016e-03 1.231415030798631120e-02 2.630892243405204538e-03 8.395095580655650069e-04 8.472872950346345888e-04 1.586220401528914232e-03 1.320779305538782172e-02 2.112801489930795848e-02 1.858167087399723721e-02 1.318719436234103322e-02 3.545373361059757280e-03 1.623201833698246620e-03 5.273587301821661567e-04 3.918688936273106820e-04 1.755929711616097577e-04 1.747458558586594099e-04 2.553825120586383454e-04 3.549631956091650110e-04 3.918828796774667471e-04 1.283224114679040262e-03
2.002339156214247642e-02 1.243763762464679574e-02 6.877604672430725520e-03 3.846513873085847385e-02 2.469445823370917253e-02 1.043490414593053334e-02 3.349678478306986062e-02 1.493815264827654324e-02 1.247774913411475381e-02 1.237008229886254682e-02 1.118715370880592717e-02 1.509945480504278070e-02 3.308579183261919909e-02 2.107370839824976652e-02 3.084287507454981040e-03 2.796057304944824830e-03 1.212513414906816675e-02 3.675642269484800939e-02 3.625782205383903944e-02 6.042232424383160369e-03 9.315672493298544042e-04 6.953620975014404484e-04 6.298548921745879010e-04 3.707708294810081609e-04 2.058093044954297326e-04 3.018374985985290042e-04 1.082737690279320965e-03 2.408016656333196795e-03 7.797539304990515514e-03 4.378740313576811108e-03
4.643995840903490657e-02 2.882804583804017898e-02 3.866249247600329897e-02 3.088908788768654490e-02 2.501011175542217427e-02 4.818421191257016116e-03 2.221263744315910352e-02 9.356573297694664032e-03 3.882878906088936717e-03 1.474652352034591923e-03 2.186675052804453595e-02 2.154914824955966174e-02 4.576869100092990222e-02 4.912092087092216619e-02 2.324596401919760275e-02 2.514237939724470183e-02 1.338941766415343571e-01 1.383829484459435655e-01 5.556667196293646471e-02 2.471122631705574904e-02 1.183708763964316617e-03 5.403057443731798873e-04 5.278275930509513649e-04 5.334731285902022000e-04 2.811212038361583006e-04 3.470954689524432938e-04 3.132952860837848099e-03 5.753911512621473490e-03 7.980085154980191484e-03 2.413050942535992748e-03
4.262707846603826234e-02 2.170496600485671834e-02 4.272219603701347956e-02 3.076675179084292777e-02 3.366212815087977345e-02 2.968545905842053228e-03 2.467569199267740081e-03 2.112221422665086588e-03 1.295132982696900253e-03 1.155472744884479368e-02 1.796091572175105011e-01 2.964221085266511846e-01 6.105911105213865930e-01 3.023783906009068212e-01 5.599833753729508562e-02 1.091246106580577024e-01 2.018348354397876965e-01 5.578345545219030865e-02 1.334009652646964313e-02 2.659767357026930536e-03 8.783169646160030389e-04 5.876462150879967206e-04 6.662895184779702232e-04 8.799038008396360558e-04 9.004389953585146189e-04 4.690549260441969986e-04 7.114467872312383321e-04 5.803456489428543289e-04 5.616835760133186356e-04 4.594796315764714564e-04
7.838089429439441813e-03 4.525456901641314311e-03 3.683682801628028469e-02 3.273642928212638914e-02 2.266887758310977621e-02 4.905084793484519069e-03 1.869214169930485166e-03 1.168749545347714212e-03 1.397085163959432136e-03 2.454470675059458248e-02 5.685988557957678824e-02 3.568608307366720744e-01 6.296028926869031705e-01 3.280484013113887931e-01 1.192789592066811205e-01 1.344341394342203344e-01 1.481883198763364606e-01 8.762667902795978625e-02 2.164651906691410221e-02 6.103613738757656532e-03 8.810585421243873668e-04 7.601107127699747003e-04 8.324612963945272458e-04 1.447514098994092443e-03 1.355217211567961641e-03 9.397987737585340685e-04 6.962032490163206407e-04 6.186799196561596197e-04 6.887502758291348323e-04 8.110593145058718001e-04
1.482394434893808842e-03 3.786616126900621548e-03 8.947574823921724055e-03 2.430789730039228241e-02 1.509633048379268455e-02 4.617392868419206882e-03 2.295180679410699972e-03 1.852619097169117815e-03 2.235116465526970804e-03 1.412936540648089198e-02 4.131911878462139233e-03 1.161936936549100297e-01 4.730754585207722074e-01 2.024690763834429696e-01 6.386842731708052001e-02 7.385985409808802638e-02 2.729197151258747414e-02 4.011673576869682206e-02 4.581029777513317969e-02 1.718014217858918405e-02 1.139018867328744737e-03 1.004832067201506937e-03 1.187632421343614176e-03 2.020878616739775827e-03 2.632929317502132223e-03 2.446999445842446778e-03 1.772817790470809351e-03 1.538484059899055886e-03 1.184939531111655394e-03 9.736192976655843505e-04
1.149947186986064991e-03 3.303084022263544708e-03 6.127488701788362177e-03 4.495983702445244604e-03 2.651797058980073438e-03 1.025006334709479237e-02 3.442627493713974751e-02 2.893811908443657058e-02 3.644530206988409043e-03 9.801541676196948247e-04 3.261452653760735405e-03 1.921173589955627037e-02 2.164581484826486046e-01 2.922569011365423464e-01 3.121972520365043358e-01 4.214168705826127903e-01 3.797084358848210051e-01 2.461969347682058384e-01 6.720813491002136653e-01 3.143589773254573672e-01 2.608641509949538584e-02 7.562351676297405373e-03 5.643800838224934807e-03 1.419450101126228450e-02 3.288509805658908908e-02 3.063850132335381796e-02 8.299484126974808473e-02 2.613220762925739030e-02 2.076472219048974485e-03 2.084027391347054604e-03
8.997396830321138187e-04 9.127542032314662655e-04 2.661053695215396132e-03 2.076915540476234265e-02 7.774670400934485283e-03 1.819949138315715828e-03 2.345767282275840887e-02 6.755138632925092312e-02 4.510140763598336627e-02 4.011048098665353362e-03 7.004170711155311389e-03 9.619932776824176301e-02 1.944649380109257086e-01 2.456394952122848419e-01 2.214467566130324805e-01 2.671278266731653139e-01 4.559222300291119190e-01 7.883006125234411909e-01 8.058779207939870126e-01 6.414996246813053915e-01 2.763748661407533155e-02 2.904211228405635323e-02 2.567962415590741704e-02 7.984952055738277210e-02 1.131900686046840576e-01 5.725696063276222159e-01 5.684408087250824027e-01 1.148161456923383617e-01 2.595891977851184917e-03 1.612168728219442191e-03
6.463358628069580929e-04 7.238065597095736260e-04 1.859890942250599271e-03 2.247286666593221408e-03 1.591098687696575675e-03 1.837265423232722558e-03 1.290538174426551429e-02 3.626285635108218025e-02 7.457195107919835364e-02 2.309626583730145163e-02 1.953912489242679018e-02 1.482299661391780696e-02 1.101796440322042187e-01 2.228310614681585089e-01 2.079023713647933647e-01 3.177818111480217311e-01 5.485414950729148309e-01 6.679515530534350098e-01 3.893976991259641696e-01 8.608073043273922753e-02 5.198420899629292713e-02 3.579968422180271892e-01 5.198442131630780505e-01 8.563452848413100060e-01 7.905780304209060194e-01 1.026405597892035670e+00 8.355260272906882557e-01 2.470587255031649887e-01 4.381900576805862826e-03 2.046296420023718896e-03
6.566923551422163691e-04 7.748995361796318440e-04 8.940164604507173495e-04 9.905906040003262768e-04 1.683297468562715152e-03 3.620215513944996782e-03 2.111793996417145880e-01 7.059636428198353686e-01 3.419033212728913584e-01 5.055011733141884234e-02 3.074554568045097594e-02 4.184278351484879005e-02 7.930071362528427759e-02 1.165865472101421940e-01 1.532844367426440813e-01 2.737427597610421759e-01 5.886632776131723865e-01 5.986328052824922974e-01 2.874321401109923846e-01 9.985485298372286100e-02 4.297437110726768372e-01 7.755078896021392332e-01 9.912682140586555057e-01 9.927125076170799645e-01 8.692889852764664749e-01 7.725371426136053987e-01 1.207067006615690330e+00 2.170575125639239711e-01 7.110104260556270039e-03 3.059512717372409214e-03
1.440703023255745846e-03 1.148317154965852044e-03 6.666040984910378111e-04 1.268615246570565678e-03 1.920278521155912091e-02 1.011833624061121706e-01 5.643679985838906399e-01 4.600228834803329336e-01 4.490235857905136019e-01 1.947021280885810612e-01 5.866850148598581893e-02 1.400080913959137266e-02 1.316947552805454100e-02 3.372425150227847251e-02 7.533352043258412234e-02 3.443927363724689772e-01 3.622845343014274855e-01 4.284033008904646334e-01 7.552778294967166239e-02 1.345199384575522239e-01 4.746167083904649919e-01 1.020972236735164351e+00 1.257303461344812412e+00 1.267187849239318931e+00 1.064482254464248268e+00 1.106180373680098805e+00 1.138629535480624178e+00 9.028636412052321036e-01 4.010126060531166853e-02 2.647918927769537384e-02
6.252804978053138740e-04 1.753761616651679754e-03 3.445883717821301376e-03 2.652345481313231682e-02 6.791867444468392689e-02 9.965481215629334866e-02 3.142498765017944784e-01 3.910563738583359150e-01 2.657576433207117228e-01 1.811009772506343152e-01 3.363407220262074754e-02 3.080370302870938208e-03 4.518062555622202534e-03 1.252603547603896306e-02 2.679567144453230340e-02 1.568550925940953578e-01 6.004754671100778762e-02 1.943278359328484695e-02 6.568404405143711891e-03 4.774708640812112825e-02 1.796036386165169585e-01 9.472783469484618024e-01 1.192111967778767712e+00 1.261122129081006182e+00 9.627375928176734599e-01 4.792498520939716400e-01 8.388929061677437016e-01 5.758256244454429407e-01 5.192644659981409533e-02 2.049937249466753791e-02
1.536282526418538200e-02 2.023279403293915327e-02 1.399743340719879908e-02 1.810603967532189995e-02 4.495556214807518852e-02 2.651013082614877767e-02 1.363500887076123658e-01 1.752307342955493064e-01 1.599929299219732259e-01 3.547655183716868360e-02 8.549428874352466706e-03 1.744700845853966367e-03 2.966581653484020187e-03 8.598192486961170333e-03 3.414530176613464474e-02 2.345431717560826634e-02 4.309616715861536163e-02 1.282320107905358247e-02 2.412508422725866478e-02 1.135724611077299218e-01 6.022849592864619739e-01 1.128785761928651432e+00 1.203495286284922194e+00 1.175173223417328661e+00 9.451859033621099471e-01 7.318148303983611491e-01 7.470231074613329358e-01 5.033444805919990994e-01 4.532017998992189656e-02 1.613344330087449277e-02
4.292112208649635774e-02 4.033170922442054496e-02 2.105522104554442137e-02 1.536387422859801857e-02 2.027279514639919455e-02 1.086292518814345118e-02 6.154393719499504783e-02 5.449946084231228893e-02 1.489864753061309784e-02 8.043883928418343876e-03 2.757402078969077314e-03 2.178376542315498161e-03 1.283770251945835121e-03 7.192631861543236603e-04 1.968801112922776222e-03 7.250541856538515566e-03 2.605054459037517076e-02 5.955390869441846285e-02 5.738524804503020160e-02 2.548724389845322680e-01 6.861294887770670314e-01 9.852156878769297021e-01 3.982114106766286854e-01 6.087693838507662880e-01 8.072131449072301734e-01 4.701767758129374863e-01 3.598712391966375490e-01 2.955829124984964973e-01 1.083480058889346731e-02 9.794360501751179018e-03
3.628992170548627633e-02 4.360832372632116039e-02 6.267238375835665169e-03 4.241453887273150848e-03 3.418035149991439231e-03 5.067822637375056852e-03 7.225503140383889716e-03 1.798954131020815469e-03 2.329350837651728793e-03 3.732425192945199033e-04 5.002523934220921798e-04 7.760796622649100609e-04 8.613651573145969000e-04 3.148157176052361009e-03 9.516760406390626856e-03 1.372768810186561494e-01 2.632282384192306535e-01 3.815688569082221759e-01 2.610442369355309711e-01 1.965313255984957874e-01 1.380804425700034033e-01 4.913526051420073759e-02 1.889969592769677811e-02 4.086336435645460119e-02 1.489603763882935972e-01 5.075656412544631707e-02 4.717796604250609760e-02 1.596078412068921426e-02 1.816997548733262054e-03 1.489722520351904975e-03
8.824051387359890808e-02 7.174573516108363747e-02 6.906545958648716878e-03 2.750508103295801633e-03 3.900730991584273714e-03 3.006617958877320484e-03 4.616680395023861454e-03 4.945282235571173092e-04 4.204818241679043889e-04 1.857382784915153468e-04 4.487633397140202329e-04 8.637291375876751231e-04 1.163104634243097152e-03 6.406998698072350479e-03 1.095169039467572616e-02 7.276691275832875005e-02 2.651259198530211414e-01 4.947475150217742201e-01 5.615033387945318477e-01 4.890501339931597191e-01 1.040339331548144064e-01 2.317413295750045746e-02 2.857551400337255548e-02 6.990178726006834875e-02 1.562462621980987842e-01 4.629338818501240599e-02 1.788078062870859103e-02 6.747227097256903658e-03 2.119938125373912238e-03 1.915200307019297938e-03
1.367658801460233942e-01 1.823674780601479764e-02 3.888369413927339913e-03 1.110335414230559196e-03 1.254048186551507977e-03 2.678311847437779732e-03 3.335553362294354455e-03 3.704516753207354705e-04 2.074570864344061575e-04 2.432873851549522467e-04 4.368017793001481835e-04 7.554570786906110620e-04 8.740466253202224282e-04 4.986931299924030926e-03 2.003559776585468050e-02 9.992450006994832434e-02 1.926535819548726991e-01 4.429766578912347486e-01 5.565808150512898678e-01 4.725200162639715540e-01 2.367960269035196963e-01 1.367226214486994863e-02 9.695182717384821791e-03 2.092916455511072138e-02 1.206592828932399886e-01 7.239743981163876407e-02 6.548473766017209874e-02 1.234385751829999295e-02 1.782906312197685573e-03 1.352793172284292439e-03
9.102521271502012068e-02 2.816050015758468639e-02 7.870269283473353347e-03 6.056373175913393539e-03 1.434010733853145064e-02 9.426051221104951583e-03 3.595790128617662278e-03 1.430410856265419261e-03 2.182458847272154313e-03 2.870378627557056920e-03 2.694047724275178872e-04 3.057220542842352265e-04 4.926159390771362150e-04 1.170625525934719394e-03 7.384425475658793619e-03 3.120359549824658005e-02 3.151669800074707872e-02 1.349995514671080699e-01 1.732592689429459654e-01 1.496549383779579301e-01 1.267236225257037385e-01 1.645339608144143900e-02 2.540135283138691968e-03 4.948073229680472439e-03 2.187390711447796676e-02 5.461496641486993792e-02 1.469165642669055805e-01 8.270626035357253603e-02 2.054791192637835627e-03 1.525858507243781428e-03
3.312739533836978056e-02 1.307113975370085071e-02 1.001016286565213631e-02 1.384633209478448521e-02 8.220690973187887163e-03 3.523992628328617531e-03 1.477441376832774531e-03 1.002946995552089987e-03 3.236093093379315347e-03 1.263390193307316334e-02 8.645050659551364305e-04 2.995064621675643662e-04 5.254754952410596071e-04 1.217399548934146487e-03 6.069395491847463797e-03 1.134200902467769750e-02 7.895205367072338429e-03 3.951846080325802611e-03 6.282117770516179762e-03 1.156872209028933160e-02 2.088370244555412536e-02 4.831518030566928253e-03 2.523045636769544447e-03 1.294187791309510047e-02 3.162007221318477446e-02 1.124166065069603752e-02 3.884277674201251640e-02 4.353551948844460590e-02 1.546058330435130281e-02 2.340482499478584427e-03
3.361743787079395085e-02 2.676987167023473987e-02 9.340164711555395960e-03 5.635497889010259234e-03 5.717753746952054794e-03 2.046498890676006800e-03 1.233144694278466569e-03 1.221397507825430512e-03 1.374752975414509281e-03 5.531848602599972325e-03 1.568801852782918593e-03 1.495652153122999399e-03 1.465547215971151757e-03 1.929552442078018033e-03 5.885796875958755614e-03 4.322121649253524156e-03 3.074093878055586537e-03 1.927117468865254240e-03 1.769021825315695521e-03 1.406609479394563614e-03 1.154770453106924869e-03 1.737239080716482774e-03 2.841766932583702013e-03 7.293377316193212431e-03 1.313098926014854943e-02 6.443045407637227467e-03 1.046990201542068524e-02 6.974746675275648317e-03 7.039171821196796644e-03 4.520876420264673817e-03
4.558591219427408914e-02 2.352808573229783068e-02 9.572237367608319586e-03 1.080179335486913632e-02 1.037230017976588370e-02 5.351880943934188457e-03 1.668309572318375095e-02 1.224151277942354954e-02 1.850514875866363530e-03 1.352941228805060701e-03 4.845388790863526095e-04 1.115527801320496558e-03 3.440898657101067529e-03 4.044642888191940337e-03 1.326857014923501360e-02 1.052163962220577405e-02 3.511093916511522344e-03 4.377932300415976995e-03 2.115221722664559299e-03 9.481128001696969730e-04 8.754742201862143140e-04 1.358347307835309744e-03 2.146528787233617681e-03 7.079284274412892507e-03 7.695650589652399017e-03 1.937769925169606066e-03 2.241037078455374552e-03 2.923378358777061359e-03 9.607311514624686938e-03 1.996846003573310522e-03
6.026505504902947979e-02 5.167855112220409719e-02 1.117974396585810076e-02 3.206914439045478737e-02 4.086619783856398902e-02 7.327227166711497430e-02 4.509379801171829738e-02 4.944048809729977012e-03 1.812447539010647764e-03 1.057991069907922429e-03 3.144944159126597419e-04 3.947068109300790398e-04 5.154241810231780050e-04 2.215114369982014008e-03 2.975374725779860070e-03 1.429712843933793375e-03 1.477844397292741099e-03 1.885638613496650210e-03 2.696574135158794072e-03 1.478424128085879894e-03 8.003058252554265655e-04 1.085042488804155176e-03 1.217571483122253766e-03 2.251146098517912454e-03 7.789453647003855008e-03 1.329473590195049152e-03 2.036437887633726820e-03 3.448007276532865945e-03 4.251820448343847196e-03 8.618052929204459214e-03
2.705279909289867377e-02 6.970887571244031855e-02 1.576806505979215164e-02 1.546064867325757861e-02 8.364422115359199106e-02 8.798519956600604763e-02 5.576498072319367727e-02 3.664880897388924589e-03 2.500569389682689991e-03 2.355094599868411305e-03 9.686242776531738506e-04 4.823136955377310903e-04 3.258247243482632850e-04 6.213773788968370796e-04 3.255517365465166249e-03 1.038402242180233451e-03 3.964227203837327948e-03 2.544017270350865806e-02 4.750433668535446186e-02 6.663583532866257896e-03 1.289472036284251485e-03 1.626161570535090842e-03 1.378488684025260241e-03 1.656346980069904736e-03 2.415895767341670174e-03 2.006835830542330872e-03 2.501436775742031486e-03 3.172502077948572731e-03 4.375740491157521263e-03 1.095533295187112524e-02
