2.701198926883492668e-02 3.986453879527802890e-02 3.474364940388166567e-02 4.385760814311048805e-02 3.337985106467854235e-02 7.342001829071773122e-02 7.329757145413642871e-02 1.996655259739796018e-01 3.638138048223634735e-01 1.639079984508329813e-01 7.578241869575316758e-02 1.726577723519228530e-02 1.015136500739221084e-02 3.820722147195079049e-02 4.473065247742511602e-02 9.857254698651110245e-03 3.485778027045901423e-02 6.146508961028732121e-02 5.598596120107067475e-02 1.978800633563755629e-02 1.679773869790768259e-02 8.029917055852571484e-02 6.280513077234727015e-02 7.126441670542982103e-03 1.276633585164166189e-02 9.924889424335307450e-03 4.626658042257985812e-03 1.604899804843619091e-02 1.568963627621756951e-02 1.982914913481501409e-02
2.130410561325899593e-02 4.727253652092659741e-02 8.484398237782676822e-02 6.950680831907765644e-02 4.840339361768269955e-02 2.167095040782721083e-01 1.031570437810118701e-01 1.314357568357182593e-01 8.623111144912215531e-02 7.415030254971365087e-02 5.239619670843033428e-02 1.025999367504382837e-02 1.365298313934380781e-02 3.134913869907676037e-02 4.403348393375247638e-02 2.826657902953637336e-02 3.509122159341090952e-02 1.156663208493700912e-01 8.781464549852599499e-02 2.649319990948846223e-02 9.964735303518320458e-03 7.627623955358903141e-02 5.235220992919679267e-03 4.121761905947401126e-03 3.204754361879278909e-03 4.225277060509732147e-03 6.129285965193987523e-02 1.631996043398830504e-02 2.376919035456285384e-02 2.382751996039279840e-02
2.571240173013549235e-01 2.599980436195529765e-01 5.503988963760205744e-01 4.488428650894858429e-01 9.499385114933455165e-01 9.660293391196238255e-02 1.792859755015560261e-02 1.939763639203347448e-02 3.139496661838112601e-01 9.753456319555513232e-02 2.636289332118627038e-01 1.767311530135594055e-01 6.511773851188248918e-02 9.530692919788578965e-02 1.830973308190771490e-02 7.689265867199927829e-02 5.186256692603433138e-02 1.068578987057147434e-01 3.578448496494354147e-01 5.968853911335186835e-02 5.844914897048283410e-03 6.233074987972259118e-02 9.880697461854032193e-02 3.459306557019044270e-02 2.053802927290340058e-02 1.386989041219654530e-02 1.285285158041264177e-02 1.030864605715455483e-02 1.761246591091405675e-02 1.975862260845890825e-02
1.207990933511237236e-01 3.463879857318382660e-01 7.611312366079970859e-01 6.157730279301304455e-01 2.499209915191224207e-01 3.843681612092266636e-02 3.021520818611647674e-02 2.046218888255478888e-02 1.261430906649217698e-02 1.204224355447509748e-01 7.825242302384398385e-02 1.564004592922432213e-01 7.097960105083508942e-02 4.703483026853736565e-02 1.381933674775717713e-02 1.045820743914863474e-02 2.188809222583633016e-02 4.113171671325317053e-02 2.920059018436575379e-02 2.495078841421238813e-02 1.129586935273216818e-02 4.040424509519675508e-03 4.392299692777054676e-02 8.776728683960118016e-02 1.695319732727788853e-02 1.268748988739625168e-02 1.113234009579460934e-02 1.056490734668460475e-02 2.145754383060421988e-02 2.330676004114686992e-02
7.006951735596227138e-02 2.191943214521551164e-01 6.131230763983038790e-01 2.375548051458089005e-01 1.339576390209076262e-01 1.941266732481752161e-02 2.960437421398262256e-02 1.644848654229446455e-02 7.695805361666118935e-03 2.725348869397010154e-01 3.473013861567860738e-01 2.951964761831134543e-01 4.353971994616930019e-02 3.937790494673503588e-02 1.841972242269326876e-02 6.853115600880000172e-03 6.480833980260078397e-02 3.738402992185192730e-02 6.015869738929358751e-02 3.468325202446340128e-02 2.387965516192472326e-02 6.671792059698529280e-03 1.546711478237498306e-02 4.461742483080263603e-03 3.081340809814692855e-02 1.702168404697363899e-02 1.198145911809869908e-02 1.385228536997341192e-02 2.166631826619629109e-02 7.963487412152532585e-02
7.019546915260169162e-02 7.449863011262158885e-02 3.344635421269644970e-01 2.680351861962330107e-01 1.053550455909202654e-01 1.126290629352129369e-02 1.367397923156762202e-02 1.459085428257898831e-02 1.377059584545614612e-02 4.195019242891880884e-01 3.326320742248491391e-01 1.744022283603626489e-01 2.247168938042745298e-02 8.116487790643897929e-03 7.459780681519745382e-02 9.231981685424805670e-03 3.853792305116802291e-02 9.494727452230072515e-03 3.080192414849066557e-02 1.068843027460964767e-01 1.302077802866739853e-01 7.943795845113996168e-02 2.164129851514658837e-02 8.285457644798542576e-02 4.632224562148655467e-02 4.470358613280658172e-02 2.809338698017083136e-02 1.934637822003670155e-02 2.548025314793878754e-02 4.579116261730775683e-02
9.755555344469288986e-03 1.567525608800456743e-02 1.663265613647930963e-02 8.455406603744926308e-02 4.056455214480502586e-02 6.719418842354388244e-02 1.013837444564812534e-01 5.749549838911695993e-02 6.836442514860828490e-02 7.955341995625367368e-02 6.161183331377596828e-02 2.533572944173391461e-02 1.217490089896961468e-02 6.494939371095843905e-02 3.778213489786934332e-02 6.508249707103547221e-02 2.186881761405359142e-02 9.842064518766287934e-03 5.045319611120249736e-02 6.947116863735706971e-02 3.215235808311957266e-02 8.558029790758540228e-03 8.094481925285509916e-02 7.864779202989197193e-02 3.215957073355714402e-02 3.331186975745905471e-02 2.944357964106461556e-02 2.536925683785669003e-02 2.827709593288150677e-02 6.726671879434062418e-02
2.079793664620392668e-02 3.821468890574197808e-02 2.250926361157193356e-02 4.887752500449555476e-02 7.585194426445407423e-02 8.562615144651884724e-02 7.562527319071966903e-02 7.109217190990541058e-02 5.640369592650264913e-02 3.167636823693819464e-02 1.281164228955145208e-02 3.981627887550773237e-02 1.004887434754991003e-02 4.310168592688334854e-02 4.870526798682514591e-02 6.311379400850815856e-03 4.382036103247725217e-02 6.728276878776792702e-02 5.947014392822972534e-02 4.402682705738395624e-02 1.373937174875845477e-02 8.718724691920781700e-03 5.797630099178122109e-02 5.052715385550599764e-02 2.440338401547025027e-02 2.478510885100967259e-02 3.713257203078450946e-02 4.299631436809649154e-02 4.163499106260021981e-02 4.779512352831978561e-03
5.436327021699506601e-02 3.635554666511758848e-02 2.145553326643025865e-02 1.256108416117175386e-01 8.205987413058912772e-02 3.484590930703376777e-02 1.115012420035253193e-01 4.995762968166345130e-02 4.171252337896882989e-02 4.130525083252539753e-02 3.700281190776953666e-02 4.855106467041245266e-02 1.090838791816587938e-01 7.465139111992508125e-02 1.103256331868240209e-02 9.724839189900965492e-03 4.063843404802426618e-02 1.252553695126907840e-01 1.242215716801041286e-01 2.284627258815544529e-02 6.479026274157199949e-02 6.757050893955152127e-02 7.423728385049550849e-02 4.957062057300835184e-02 2.925679200830646337e-02 4.056201279935472276e-02 5.052900947622541994e-03 9.552128270491205830e-03 2.837763425291712355e-02 1.437371462058548155e-02
8.515538162533632660e-02 5.691411523267687900e-02 9.353841488671194027e-02 9.070243534200968238e-02 8.055522968389411398e-02 1.596143616171149388e-02 7.316160264367677080e-02 3.229873841682267405e-02 1.355661810970359982e-02 6.987561964497973621e-02 7.193799675122648785e-02 7.011727663499112140e-02 1.485326849756082312e-01 1.600860596027595673e-01 7.567733036784091150e-02 8.311536403114642979e-02 4.507556347660771623e-01 4.713741211706525824e-01 1.893314057574413400e-01 9.779574667324836268e-02 8.531939645457173316e-02 5.398954754429902830e-02 6.129415517020769810e-02 6.669665797274781927e-02 3.708968968023457213e-02 4.458142779080107726e-02 1.662843689230775190e-02 2.593942752953998579e-02 3.313884988613445548e-02 8.723735830942103142e-03
6.917452879311121461e-02 3.699456179233390207e-02 8.492838706655710113e-02 7.560097037575143342e-02 9.824161467338748954e-02 1.043012845387419202e-02 9.859657130573412295e-03 9.171838202649124777e-03 6.908716909264357720e-02 3.965309177597841489e-02 5.768234419255298118e-01 9.666692617661343245e-01 2.003224301156487197e+00 9.842111861456175337e-01 1.805816588457666849e-01 3.556962520221990109e-01 6.672963868018036981e-01 1.850024434702962906e-01 4.396603500591647617e-02 1.047754144155439888e-02 5.871461970803712460e-02 5.257358591986909663e-02 6.554531280590242259e-02 8.849439898436470275e-02 9.290602075927113790e-02 5.026428543993764764e-02 7.881841791967139632e-02 5.999338701794895701e-02 5.485682552285027491e-02 4.030728417747030112e-02
1.455173083078121696e-02 8.600091688339214432e-03 6.886567597016356179e-02 7.023344750960454352e-02 5.594998732827970167e-02 1.486032379548160934e-02 8.261621431910100288e-02 5.835744547736883281e-02 7.095887704130132700e-02 7.739428142594746707e-02 1.747693638399483163e-01 1.164388331480536110e+00 2.096948905867638935e+00 1.078800729956147508e+00 3.852197912449961126e-01 4.329702253456521044e-01 4.788804757483179353e-01 2.818591670202574839e-01 6.895517453855240508e-02 2.225917063362473081e-02 5.611463812636062476e-02 5.723145624802705722e-02 6.488777126041953003e-02 1.123241993480714011e-02 8.594235474147832524e-03 7.693662395832985557e-02 6.168084577788221501e-02 5.705144551011516463e-02 6.253159891576967611e-02 6.806338220038014863e-02
3.893110877777020834e-02 8.843025495658296542e-03 1.582911962664396502e-02 4.827299296457956967e-02 3.232116508536728161e-02 1.190599048159947382e-02 6.826726101553937109e-03 7.345383191764079389e-02 6.436960716221317748e-03 3.778609817768564111e-02 1.218159410509738090e-02 3.711897536314475166e-01 1.570157051714490493e+00 6.676281730025177552e-01 2.077976573175479014e-01 2.385765471453509812e-01 8.788809441068799744e-02 1.286365703631832669e-01 1.459559033375343873e-01 5.811220172181943977e-02 5.340363039766739955e-02 5.818441025363634000e-02 7.023452847329367255e-02 8.747206714451526144e-03 9.810666823285574267e-03 1.001959195212788478e-02 8.174584849898459266e-03 8.474774149356276501e-03 8.167835553285937578e-02 6.780885362150075590e-02
3.415137537515035293e-02 1.123557650619500317e-02 1.222518430163595238e-02 8.216438144978660540e-03 6.108174048153805491e-02 1.994391386931056859e-02 6.743747277435688248e-02 5.552675210358420932e-02 7.283945968212078223e-03 4.292215395096278530e-02 8.973148996068221195e-03 6.081649317537898836e-02 7.219528524938287894e-01 9.654995200926134169e-01 1.016827987300295222e+00 1.357153032513153779e+00 1.216778117716453167e+00 7.889386354529170919e-01 2.152274216860892153e+00 1.001496786237663139e+00 8.626645897132691199e-02 2.718906391701656627e-02 2.021228369812183567e-02 4.785356407134581241e-02 1.032521786860917945e-01 9.700560787864176415e-02 2.658188199472804047e-01 9.470235387994221932e-02 1.120433844664853185e-02 1.145387336581589997e-02
3.424277143680667240e-02 3.251114309619276138e-02 9.209768509637913589e-03 5.607133126378385790e-02 1.842628822014022796e-02 5.129397092768422928e-02 4.326954530062362969e-02 1.194215734375949356e-01 8.210835691537038405e-02 8.666428949037316073e-03 1.891903386166671544e-02 3.031217715609679786e-01 6.498699722232392784e-01 8.172082680747746464e-01 7.305577360427415456e-01 8.738755824799354643e-01 1.485201135015087548e+00 2.560462678003453618e+00 2.597569471287515697e+00 2.029512400983490394e+00 8.636862554224783439e-02 9.000248921589534823e-02 8.073857830416621140e-02 2.540705930407478608e-01 3.673970433343378694e-01 1.889403313832048958e+00 1.894570685869134463e+00 3.814574775729436262e-01 1.222102563826115741e-02 8.736946988439325823e-02
3.420353299663134866e-02 3.571422633184040407e-02 6.890878666735657243e-02 7.045425979692124252e-02 4.582414671759114239e-02 5.508627005917483832e-02 2.373766949163544360e-02 6.436928536081054641e-02 1.339302140936419749e-01 4.916941365904668737e-02 5.221705992257245910e-02 4.710862073449313681e-02 3.706576164533842976e-01 7.437892478739254187e-01 6.869506424010497492e-01 1.043898500131168028e+00 1.800072743228788852e+00 2.177787184103596285e+00 1.250999020451869503e+00 2.710671030605976695e-01 1.631549107292769307e-01 1.126346655489383064e+00 1.655648980369095469e+00 2.791151876736311266e+00 2.643146123265041947e+00 3.478579195334916996e+00 2.800219291306485836e+00 7.949337323670070399e-01 1.934953352822153111e-02 1.012084498696906171e-01
4.593499544527872291e-02 5.170502050945588457e-02 4.770498783063564091e-02 4.248108200673825219e-02 6.079659955693952206e-02 7.168294512161639889e-03 3.769279634497741949e-01 1.257159635299189837e+00 6.157781834938864662e-01 1.084068637497928450e-01 8.273144299096191201e-02 1.330389253905276958e-01 2.659590367394231714e-01 3.892217999909469150e-01 5.108820035435812645e-01 9.116575977355569904e-01 1.952755241625041993e+00 1.948157796980853451e+00 9.139340587984567943e-01 3.121277372721303900e-01 1.355555515697171920e+00 2.480107472346929853e+00 3.207071093308995202e+00 3.314689824913980676e+00 2.943567987209532610e+00 2.568789846650209707e+00 3.824862419945525893e+00 6.593046320163615803e-01 2.492292320909566747e-02 1.085529695711688961e-02
1.166384813742210869e-01 9.039085427819919250e-02 4.296307593357227839e-02 5.927924827718710626e-02 4.179991683335107511e-02 1.892881357049532864e-01 1.039112368575219936e+00 8.524812343610695953e-01 8.404174270416506776e-01 4.306846239181485458e-01 1.616377533535649780e-01 4.482515142277603004e-02 4.425812629846882784e-02 1.127889336413572807e-01 2.534945002526022284e-01 1.161821297485474691e+00 1.208513319830532229e+00 1.389143775205311071e+00 2.393812453758815684e-01 4.205969319135335338e-01 1.503216283989863733e+00 3.276315541117583940e+00 4.063394540280183875e+00 4.244950256358158924e+00 3.533294387784843948e+00 3.448017163839907973e+00 3.224929880282477068e+00 2.522473823094414147e+00 1.107412755692214756e-01 7.200217563048652569e-02
4.644542584623453235e-02 1.332011568500788765e-02 1.546214628003217233e-02 7.623252764437130069e-02 1.600683728643574055e-01 2.220065330347767152e-01 6.986315507495146626e-01 8.723462279472606884e-01 5.974980729333019269e-01 4.728675838204874915e-01 1.007046499842839948e-01 1.004163726528240971e-02 1.536662581570442943e-02 4.322460057465160599e-02 9.395032503862163487e-02 5.521038101498231265e-01 2.081173907339179951e-01 6.550538929278494626e-02 2.173571636957185096e-02 1.571723114510758246e-01 6.005033051987321846e-01 3.205970523214748624e+00 4.059357047012712272e+00 4.255819389043228540e+00 3.117801094844272924e+00 1.453985059876166552e+00 2.367972960328774690e+00 1.603783239867110355e+00 1.435131356504236733e-01 5.561032519148176312e-02
5.364996376031624936e-02 6.952360211207306295e-02 4.479934783283271577e-02 5.578277769658095131e-02 1.310694127218590688e-01 7.503662171347127985e-02 3.838031715177575576e-01 4.934765950682287183e-01 4.520355905318244050e-01 1.074908413499957027e-01 2.720839303834650391e-02 5.815152659506177615e-03 1.052226867400939299e-02 3.095986142021515952e-02 1.223631935015027095e-01 8.054066387380767744e-02 1.450515021689525175e-01 4.226069465845128104e-02 7.859597584867521192e-02 3.714761003135970685e-01 1.999052580970647419e+00 3.767730960258117712e+00 4.022469884627456693e+00 3.812801626215402528e+00 2.930559960119679896e+00 2.149725794972063841e+00 2.084675101408873132e+00 1.388677675265062472e+00 1.241515629006757354e-01 4.352785003505627026e-02
1.473444726059602583e-01 1.368210718737480625e-01 7.080266849754440761e-02 5.140771867554890656e-02 6.731886621805067972e-02 3.600590336414376258e-02 2.030340735845515554e-01 1.802025588424184255e-01 4.956966438484071424e-02 2.769581438326329526e-02 9.666449078787322721e-03 7.670362893637438367e-03 4.656543976863419983e-03 6.147045724704050529e-02 6.946017584091288867e-03 2.340912745332506678e-02 8.281152590525267532e-02 1.863247779849168673e-01 1.771383843874842490e-01 7.835467889988789736e-01 2.119337650793867045e+00 3.029939071936576411e+00 1.216131753531060511e+00 1.817063091347480563e+00 2.346475439151706421e+00 1.328947507465666922e+00 9.907237227743413976e-01 8.174787732019134223e-01 3.458546439149011442e-02 3.211167283420862661e-02
1.206678795123487524e-01 1.402072404651689141e-01 2.091333696621944585e-02 1.466967303008973045e-02 1.221862015061061027e-02 1.817302672773817712e-02 2.597851330873647210e-02 6.555775633805369096e-03 8.649972826404901671e-03 4.409105283354161631e-02 6.099771993914489265e-02 2.916678362786716706e-03 3.152069682511184252e-03 1.153378423202606161e-02 3.332179467201561163e-02 4.351558189775666663e-01 8.284444838265461186e-01 1.184358919392175524e+00 7.990082926483711434e-01 5.917464974018381563e-01 4.110945206610304714e-01 1.439060401340028217e-01 5.484558670690863752e-02 1.187954692705704141e-01 4.302802517331903998e-01 1.451445747315006918e-01 1.324871198171745090e-01 5.325134559891393782e-02 5.805106584360888305e-02 5.459474213537209714e-02
2.510287203174667026e-01 1.916930969513557237e-01 2.138984081275510998e-02 9.458700825955904806e-03 1.411855816730618780e-02 1.097671239706802387e-02 1.725260065364364256e-02 6.500779732484837647e-02 6.073642986580436720e-02 2.652281332745943729e-02 6.192532353092985997e-02 3.375841748995665921e-03 4.112434361481030753e-03 2.297311293399745963e-02 3.923420396290135115e-02 2.544136374437250270e-01 9.259499605471541717e-01 1.709672913341547140e+00 1.914452612868597026e+00 1.629655682984251008e+00 3.378794237809132905e-01 7.361977833688460038e-02 9.005159869628320823e-02 2.232987299420320371e-01 4.976591037512251292e-01 1.468788801924428566e-01 5.537488583338985582e-02 2.601853276182812189e-02 8.089944422272409008e-02 7.849426958424356171e-02
2.962077931404662468e-01 3.721627471111414037e-02 1.118410243354460258e-02 3.835118651394161908e-03 4.427983007391278480e-03 9.666856513552236907e-03 1.274317887561686111e-02 5.295606782818235159e-02 3.015601115887912853e-02 3.465665337706284876e-02 6.021740900942641750e-02 3.269328954050727907e-03 3.358110785842036931e-03 1.862530265926190531e-02 7.161584876836804558e-02 3.585249770190720442e-01 6.916601165306150989e-01 1.579908114922508044e+00 1.973463502099152445e+00 1.647875527387092864e+00 8.048224751479353678e-01 4.544448313207991030e-02 3.190892601453109573e-02 6.993959617381681482e-02 4.043800934422131510e-01 2.454095622635702745e-01 2.196477551941974915e-01 5.016714613778260751e-02 6.456610900314811718e-02 5.883525918346136502e-02
1.527672237945137956e-01 4.700552764732525424e-02 2.079025065872315559e-02 2.089694001924392863e-02 4.705504783676998232e-02 3.196150789611534870e-02 1.318841191831491080e-02 5.369351357965710531e-03 8.039807934549145912e-03 1.081306760493884814e-02 3.652200148759881387e-02 4.224647030520268381e-02 5.396761414005899621e-02 4.548728713760015648e-03 2.568741097994237110e-02 1.088490446654754029e-01 1.091882650081383715e-01 4.630461470771380927e-01 5.904522830658338606e-01 5.047096775125763379e-01 4.182633378108429056e-01 5.331922479509305923e-02 8.165278929772212119e-03 1.619188180569621632e-02 7.204567529319294561e-02 1.828430083752616286e-01 4.904977269953680330e-01 2.956582854869239663e-01 7.136211685227905610e-02 6.261286470200269627e-02
5.430543478769139787e-02 2.144006086138887379e-02 2.623775546665364777e-02 4.792048320220104046e-02 2.648448666834454443e-02 1.176291335889074509e-02 5.318896832213516022e-03 3.673373942828816064e-03 1.151985491358573088e-02 4.504451540639159424e-02 3.350117487036853234e-03 4.047405575922632948e-02 5.951390385218000012e-02 4.707280528365549548e-03 2.078265666033941514e-02 3.863408420104863517e-02 2.644854325538958939e-02 1.306421133889791586e-02 2.226507431697087244e-02 4.357908017446598253e-02 8.631937244323251157e-02 1.859012174945377099e-02 8.971626688053435314e-03 4.157562022619271103e-02 1.016988863249458780e-01 3.658849159046354688e-02 1.265014811606253731e-01 1.460395533550381542e-01 6.798830357146382064e-02 8.840847569349902235e-02
5.503089875594398273e-02 4.396547913218391834e-02 2.459626603599639194e-02 1.944704690667858546e-02 1.827615330913548788e-02 6.794314077739727065e-03 4.429626401736762656e-03 4.472000898072914059e-03 4.893821737898098982e-03 1.999332386188188565e-02 5.872014083870159135e-03 6.052560665536678083e-03 5.630142668453927066e-03 7.134023337028080544e-03 2.049484194586450106e-02 1.496795816417888919e-02 1.043408908578328555e-02 6.440415720877461572e-03 7.732728802111722005e-03 8.519639489650132624e-02 6.930394324167667153e-02 9.371120687597930821e-02 1.405959609323472262e-02 2.411610503376342488e-02 4.687615227491358227e-02 2.607413915727107082e-02 4.190730558238709574e-02 2.591773819808195628e-02 2.889215472532248932e-02 1.866015470381331837e-02
7.477216499232164360e-02 3.882416844776651055e-02 2.533213540245912027e-02 3.721790751203356978e-02 3.307574035135719959e-02 1.782501156976584039e-02 6.008276107512335040e-02 4.482285382287837239e-02 6.551242992353760453e-03 4.998390599961047981e-03 6.568827181699830875e-02 4.634562997737448273e-03 1.335144795717194827e-02 1.491693374882691048e-02 4.618688834490456557e-02 3.639364047951298975e-02 1.190466773581734181e-02 1.464300663619510362e-02 9.109386684250405167e-03 5.665657693105849435e-02 5.584686750247219722e-02 8.239627171395443039e-02 1.751415720647833338e-02 3.154437496400144814e-02 3.216564254431763387e-02 7.617982449235830011e-02 8.774099470679776192e-02 1.420005869595221404e-02 3.488453127099007400e-02 6.531979575296534279e-02
1.013858826121620677e-01 8.740611721097106546e-02 3.049798309018875164e-02 1.111182194696722358e-01 1.307412739093442022e-01 2.453957560860142717e-01 1.627248387709429589e-01 1.821436145691468500e-02 6.496310011528646025e-03 3.957817456712692597e-03 4.402150366473898957e-02 5.170437899750243010e-02 5.495033220808660107e-02 9.704524244173440978e-03 1.303430238687732640e-02 5.661589838382206398e-03 5.644582239686442987e-03 6.517179246385250424e-03 1.067226020474411688e-02 1.012811009681056397e-02 5.035136201525965138e-02 7.309599171393083017e-02 7.666572256109722983e-02 1.773488933795273545e-02 4.979198407810991878e-02 5.695701152027664305e-02 8.317071684638630003e-02 2.250237128070270085e-02 1.565956490703612758e-02 3.080701785150133376e-02
6.029983010105827851e-02 1.480716292692794700e-01 4.888788023858219034e-02 5.394121490467178315e-02 2.645281850576303162e-01 2.790806512627830860e-01 1.844777809358193188e-01 1.258705489847463700e-02 8.853750475718628193e-03 8.670281112182839575e-03 4.356713189983023142e-03 6.904262250391005051e-02 3.943706725476259223e-02 5.708408397040891369e-02 1.456439033153442142e-02 6.905759708971259681e-02 1.475473668773013072e-02 8.565141035791193347e-02 1.583740727979046081e-01 3.483790310482026698e-02 7.107200100232982654e-02 9.863832467602347276e-02 8.207888802652407723e-02 7.972313040224104919e-02 1.455031971117341089e-02 8.107420390253454456e-02 9.514276846949852595e-02 1.914602185849147500e-02 1.431155030906599776e-02 3.470829019342495936e-02
