3.646172453566568095e+01 5.638451152657168564e+01 4.958108030588925885e+01 6.255764373810634993e+01 4.775020225168121613e+01 1.009613821440539425e+02 1.033863663179295997e+02 2.473023777593524528e+02 4.994600436074161962e+02 2.134594178259324053e+02 1.056252563544980489e+02 2.421171935009697407e+01 1.474298695746065135e+01 5.848999416021778330e+01 7.339441605666930002e+01 1.775514697188991065e+01 6.980176109381179117e+01 1.358171352524332178e+02 1.403325306182221937e+02 5.506558507898682819e+01 4.306285804734051936e+01 6.109548839866262071e+00 4.719462052475170921e+00 1.922899338996501939e+01 3.829071396076773226e+01 3.094879847040667542e+01 1.473333436953526387e+01 1.315289361312424576e+00 1.274061809325466532e+00 1.631659220557296397e+00
2.399868353800894383e+01 4.434020005582254242e+01 5.332853295273777405e+01 2.532847518170441603e+01 3.703646228438117305e+01 1.669842400684394192e+02 1.468104490116254226e+02 1.331754848105512110e+02 1.132294713333853622e+02 6.670531684548362250e+01 6.912297484441998563e+01 1.385157341974723799e+01 2.046825351900925227e+01 4.930946152959136697e+01 7.313641500569084997e+01 5.158848525686661191e+01 7.223437582587359884e+01 2.646857688919201337e+02 2.306466209713221929e+02 8.001609991792984999e+01 2.816932518487556791e+01 6.107769982782766505e+00 1.284822095781929718e+01 1.181605865622760554e+01 1.086478575934127555e+01 1.521766988332767667e+01 5.632359961047336050e+00 1.419568327356513615e+00 1.995864431515830040e+00 1.977923092432888552e+00
3.495501491444082376e+02 4.145350947467275091e+02 9.472229439228992760e+02 7.637676150759901930e+02 1.486401263125096648e+03 8.868309437831445052e+01 2.643266304568871305e+01 2.522580593061892174e+01 4.717846297318271809e+02 1.395155225287113865e+02 4.327811611000707899e+02 2.811462245681206582e+02 1.104776033734941478e+02 1.624541120930299769e+02 3.276269154185931143e+01 1.508806351447122438e+02 1.139446028759681440e+02 2.647683758252770758e+02 1.028396326567815322e+03 1.995611409771013314e+02 1.913938863625749320e+01 5.415475041659348676e+00 8.255533675852539943e+00 2.990841726911336096e+00 1.876893089657115432e+00 1.317997354176855485e+00 1.257663995629997977e+00 9.433825625449915320e-01 1.535665356188549602e+00 1.657695113583549817e+00
1.256842248416131440e+02 1.920740547200469450e+02 4.332980302026923027e+02 2.867196199233730454e+02 1.504177393226252661e+02 3.410159573568094515e+01 4.306274795506151065e+01 2.701691950568751821e+01 1.716181496440709964e+01 1.066976552173493644e+02 7.224970059451810300e+01 1.562465925036022156e+02 1.079190598605053424e+02 7.470529018556507594e+01 2.355706049845129968e+01 1.960811382682502568e+01 4.510627701309928739e+01 9.261322138385247627e+01 7.528251035482729492e+01 7.324181633659787849e+01 3.577792572487600609e+01 1.275160670524702766e+01 4.015681847678004956e+00 8.058268799582100073e+00 1.497063786664021068e+00 1.154756744717120531e+00 1.065195996244388654e+00 9.528638813774299443e-01 1.820358644353571975e+00 1.888140305522971074e+00
1.053084562731139613e+02 3.900813755966372582e+02 1.266153197708095831e+03 4.843237916063768580e+02 2.279055760019772379e+02 2.990771009774762490e+01 4.213679003835711256e+01 2.313599564987178780e+01 1.145726417039060863e+01 4.029868957605923470e+02 5.543896689781622626e+02 4.166627800529899446e+02 6.309913473860615341e+01 5.363383486053096050e+01 2.713254848922964868e+01 1.081187813198812364e+01 1.237723733042313938e+02 7.670972589610511250e+01 1.377322226692106995e+02 8.605499362164704280e+01 6.421505431942696873e+01 1.951167757857282936e+01 4.621046390767778433e+01 1.298624568819351488e+01 2.549952769971172817e+00 1.460668943740297099e+00 1.092500812661479692e+00 1.192052616556511291e+00 1.753686530319897408e+00 6.154530979662194312e+00
9.692516046826062848e+01 7.455844065624067696e+01 2.867726320579177468e+02 2.339427178969678494e+02 1.315756995984704076e+02 1.517732905977359081e+01 1.880402698991487753e+01 2.001160164865821400e+01 1.886081089429512048e+01 4.874213760990631954e+02 3.288445733032925204e+02 1.994674643914973160e+02 2.548908585059824716e+01 8.198031080412041760e+00 6.736182886888274268e+00 1.173800214535507536e+01 6.410304873859688257e+01 1.753407185315712624e+01 6.120856221133185215e+01 2.239024532959422231e+02 2.996886370911816471e+02 1.972629989591695221e+02 5.353227812857141998e+01 7.205250091251116373e+00 3.608526880101685208e+00 3.635872282878853667e+00 2.447661923396445172e+00 1.590888942144339957e+00 1.972602376226693544e+00 3.387291580251475143e+00
1.451822010313440003e+01 2.648173807723722106e+01 2.915301535850419867e+01 1.502067676350383181e+02 7.021671207226457057e+01 1.081297343082576532e+02 1.498156089352222295e+02 8.068886139760849119e+01 9.685100578257041093e+01 1.130363997248055625e+02 8.509112146761830786e+01 3.259094659961137808e+01 1.289587127706083969e+01 5.240702900202608205e+00 2.940815291274311960e+00 5.620426350719958997e+00 3.437553194499732712e+01 1.667872338857145564e+01 8.860367168369928947e+01 1.267874234590629214e+02 6.438281247538489538e+01 1.715771041942304365e+01 7.320324825848343764e+00 5.989845656987963451e+00 2.321735829660747541e+00 2.579442276951353641e+00 2.462882242507932418e+00 2.014545265476498592e+00 2.195113147349926574e+00 4.966147536957153719e+00
2.826859180955295514e+01 5.401096110614128776e+01 2.945666278444424435e+01 6.227448368629305264e+01 9.015602064645918290e+01 1.068600783249171684e+02 9.887902051173850282e+01 9.336478224162519268e+01 7.756972514860919432e+01 4.158819282228550662e+01 1.623124480722339058e+01 4.854146762193172293e+01 1.031758179408802611e+01 3.590226098762684614e+00 3.841801164613142916e+00 7.451790093457969277e+00 6.455351957186742595e+01 1.065255031370133452e+02 9.805906296032893010e+01 7.436117506938929012e+01 2.246623794696748533e+01 1.142289046043277168e+01 4.117273146353416458e+00 3.388796874987251684e+00 1.686199528643459455e+00 1.889795715748522120e+00 3.198979394373738572e+00 3.907179447118626303e+00 3.701131431653504222e+00 1.026874282981629705e+01
7.200114752165811183e+01 5.088106138251647792e+01 3.165775990446604737e+01 1.965565021911061194e+02 1.294933035802291670e+02 5.383291980943406685e+01 1.640503945409068649e+02 7.080592230297358469e+01 6.006778765028324329e+01 5.685779407148920939e+01 4.883432872881395781e+01 6.257803200909086172e+01 1.358111504130518767e+02 9.061185340087320128e+01 1.379434741135131404e+01 1.275762449030082202e+01 5.662150944543634523e+01 1.785428599457239329e+02 1.870181003680793026e+02 3.402007357392791675e+01 5.912925425678231761e+00 4.863868152339033024e+00 4.937467624592021487e+00 3.211638925494217034e+00 1.949212283702789650e+00 3.147618703310736343e+00 1.293898162061899093e+01 2.505930711966401248e+01 6.864666889601174660e+01 3.224737459224655112e+01
1.153447221848300757e+02 7.202241285110557101e+01 1.070414696907304517e+02 9.211335728470429274e+01 9.164952517577555113e+01 2.018667048217506732e+01 1.019386687802328879e+02 4.421386721810439724e+01 1.951438351207702482e+01 7.042696975126206738e+00 1.013165283039005686e+02 9.776341185319795102e+01 2.027957489472499333e+02 2.168131575396882340e+02 1.002269399768950393e+02 1.055678184087051648e+02 5.780688069761985162e+02 6.291226427260820628e+02 2.735219129299117071e+02 1.345063338872860470e+02 7.189628642745765852e+00 3.576551609057618375e+00 3.938935359462208297e+00 4.364357419243940939e+00 2.493318919551192892e+00 3.318913075090718756e+00 3.301918092199385768e+01 5.448484392364948548e+01 6.494363464277660114e+01 1.635721365104879865e+01
9.995261539045250743e+01 5.492699945468076095e+01 1.312304693353941616e+02 1.180253658328761617e+02 1.515872675646116079e+02 1.360571497090703019e+01 1.139551445176098454e+01 1.010845339924513731e+01 6.512783232026980507e+00 5.637387037206868712e+01 8.604767055870347576e+02 1.438757441238680258e+03 2.773570225019770078e+03 1.382774307631917509e+03 2.340461282803090057e+02 4.343509917068603841e+02 8.102844620919300951e+02 2.342335995987155002e+02 6.003937760363474752e+01 1.311592005250357573e+01 4.734583609045023955e+00 3.400493342211089676e+00 4.305479331220204209e+00 6.132423424338886875e+00 6.722747183069976984e+00 3.748090785729878416e+00 6.125743990740238232e+00 4.681627507796475740e+00 4.053609035424415197e+00 2.817865466163815391e+00
1.917873450041381034e+01 1.093537683903112523e+01 9.408991875723631892e+01 8.561900822247095277e+01 7.661159696442757649e+01 1.917193387782958425e+01 7.819947280362433695e+00 5.061242834041607352e+00 6.435731835713433213e+00 1.182782045180506998e+02 2.753868200052691009e+02 1.953887890839534066e+03 2.925648676427921146e+03 1.665603444940332110e+03 4.962958912863201704e+02 5.500539610192593045e+02 5.835883666269653531e+02 3.569036976598627007e+02 9.241594879472123125e+01 2.765036927346298867e+01 4.162275804824703940e+00 3.698676543967075681e+00 4.387204437881607078e+00 8.063319069268736428e+00 7.947305019892473510e+00 5.876269054622076382e+00 4.641936752121861964e+00 4.029240929746004340e+00 4.138372481057248642e+00 4.278885017292752835e+00
3.796447418496077475e+00 1.009879884479237688e+01 2.510472290948693441e+01 7.231860216310514033e+01 4.776473653477424364e+01 1.532600489637081864e+01 7.888978057094154117e+00 6.670433920158356678e+00 8.930346405410110933e+00 6.431829251822559002e+01 2.086060683248496872e+01 6.798619607230366455e+02 2.091533989872047641e+03 1.190682688588225801e+03 2.055796615945911299e+02 3.709734354488473969e+02 9.227999914107149948e+01 1.945453093362038430e+02 1.959023640773673947e+02 7.928743752147930479e+01 4.778385946678124441e+00 4.391737372994485078e+00 5.376242616839264521e+00 9.443558461665405801e+00 1.254717921050689711e+01 1.194584723240447666e+01 9.050361553728922814e+00 8.162150217697728749e+00 6.007588646929027831e+00 4.420125719879363757e+00
2.957738370036045783e+00 8.866457621954705104e+00 1.593162864644254384e+01 1.158900835855985889e+01 6.968278925506377064e+00 2.905149493196316968e+01 1.040045420070448898e+02 9.569195219709934008e+01 1.360758012867090372e+01 4.146525979121143735e+00 1.715076824882577711e+01 1.255692017784835315e+02 1.031088383696415804e+03 1.889599495827122155e+03 8.201536310810195118e+02 2.373750261115274043e+03 7.427747781825800075e+02 1.324661849799503216e+03 1.329868287637422554e+03 1.415337264123109435e+03 7.630856291362283628e+01 2.910187786039543667e+01 2.229672700053242096e+01 5.634376827834530843e+01 1.353553359443590693e+02 1.263432975598668122e+02 3.572006924785695219e+02 1.154201624499868331e+02 8.979734025135904574e+00 8.313642403286435112e+00
2.574902247016963130e+00 2.741702269557787730e+00 7.680388279415311992e+00 5.790235888266603581e+01 2.139065863643067900e+01 5.226903576380069083e+00 7.137834368852784905e+01 2.217327795725826718e+02 1.634199931685091940e+02 1.735026465930902262e+01 3.805810532441119420e+01 6.657555130917307906e+02 9.228040037892526470e+02 1.726855731321867097e+03 4.934941143593072184e+02 1.750122648200650474e+03 7.291551756222539780e+02 4.980808244425164958e+03 1.317383519182189502e+03 2.878728775202533598e+03 6.367377238133411765e+01 9.316881946559075800e+01 6.667940026519228525e+01 1.433133213557634917e+02 2.496094713564410199e+02 9.478328168616483254e+02 1.210572974162490937e+03 3.447464488997467811e+02 9.553432494592268398e+00 5.638978334584691332e+00
2.211276566799972976e+00 2.553816640822481610e+00 6.200032391989759972e+00 6.971325284167159353e+00 4.744746979312551183e+00 5.852504820532843155e+00 4.359683118172470984e+01 1.257279235745640591e+02 2.735270256962400595e+02 1.024929359953983123e+02 1.101536790789623126e+02 1.077830458405196765e+02 6.062674777483205162e+02 1.650529699888538289e+03 5.604888950374572687e+02 2.248129475079163967e+03 9.254048296357993877e+02 4.261557918388645703e+03 5.451183392422030920e+02 3.645574773223853526e+02 1.928313858869155126e+02 1.461881373417476880e+03 2.144926034317652920e+03 3.526983567704025063e+03 3.343462707756684722e+03 4.641845171740047590e+03 3.545375660264516227e+03 9.152349978729932900e+02 1.485664309259314209e+01 6.373073336429456504e+00
2.775887450924059863e+00 3.351954164795152735e+00 3.444473315221152632e+00 3.464312949958186394e+00 5.812783672780325261e+00 1.300066377071359547e+01 7.545465309655477313e+02 2.535865821925161526e+03 1.279449056122357888e+03 2.314588319262820164e+02 1.847026195632245162e+02 3.217267684299335997e+02 5.578657460424610690e+02 9.078853779743099039e+02 4.507644927831616997e+02 2.073656060257879744e+03 1.093887848323148091e+03 3.544089701263096231e+03 4.831330925447533104e+02 4.051723933680587493e+02 9.832748487140258931e+02 1.129169146960608941e+03 1.130853565456843853e+03 1.066855676622350302e+03 8.056982752767307829e+02 7.620101689763228023e+02 1.023063016048391546e+03 2.880663517248449352e+02 1.760471540202692609e+01 8.730971134785821874e+00
6.961097464823644998e+00 5.675192611392134268e+00 3.087018379154102377e+00 5.335413113446822564e+00 7.724551268588083985e+01 4.005858387966624150e+02 2.193339577953921889e+03 1.788472819290617736e+03 1.821829026577136801e+03 9.685068506403164292e+02 3.850828745743991703e+02 1.169718968381336452e+02 1.105580234979765635e+02 2.767612846032183711e+02 3.288142857194610542e+02 2.625670550773474588e+03 8.669308524896321160e+02 2.399670611388119596e+03 2.076618208207285079e+02 5.415626908314901584e+02 1.928768989094338167e+03 4.915629632758379557e+03 6.968305877222308482e+03 6.804540524479049054e+03 4.919256560890506080e+03 4.654506448681649090e+03 3.934111143708646523e+03 2.807084877951092494e+03 1.044893297963384526e+02 6.903586680771502415e+01
3.187511628972944155e+00 9.281056231848943128e+00 1.838372422386297700e+01 1.430973172811248446e+02 3.565553442225041749e+02 5.234779350991869933e+02 1.656862563214612237e+03 2.076741733363860931e+03 1.479442373222340393e+03 1.197982669483074005e+03 2.693099202516734749e+02 2.882001948285764215e+01 4.254692578960637661e+01 1.083153850918103984e+02 1.641255095419131749e+02 1.153678572768324329e+03 2.378368616100497093e+02 1.067032049913379979e+02 2.544801975310869935e+01 1.422243040390964666e+02 2.158162256682744271e+02 9.271521992884628389e+02 1.348507070889109173e+03 1.329001297646327203e+03 8.056482231143008903e+02 3.473056557286028578e+02 5.879052529418074755e+02 7.434826122836798277e+02 1.052675637685300103e+02 4.967797296534197926e+01
8.402786738701135505e+01 1.158720215618652105e+02 8.508433236754032691e+01 1.204268737399509348e+02 3.255790614015473352e+02 2.012498000947898333e+02 1.069821919367858072e+03 1.402270921424949847e+03 1.345321891735024337e+03 3.252708570114754139e+02 8.436589800898205738e+01 1.834319498542502203e+01 3.107086358736153642e+01 8.107481018376915927e+01 2.779613069752193724e+02 1.736543130028976520e+02 2.814959848901534087e+02 7.552286084904190488e+01 1.240971429831595856e+02 5.428781193864596162e+02 3.034776758995933051e+03 6.106586417107987472e+03 6.583350010251695494e+03 5.380977295692944608e+03 3.509880698099961592e+03 2.272735142065651416e+03 1.986457635162785891e+03 1.290950882896360099e+03 1.072948587406223737e+02 3.685482548435514616e+01
2.500162810817782315e+02 2.500485549597392776e+02 1.457340915426076151e+02 1.238832390776003649e+02 1.919901097739837610e+02 1.159713065788653239e+02 7.010097843484744544e+02 6.488261960267055883e+02 1.893409251928028425e+02 1.013794770184722154e+02 3.369686979137136973e+01 2.501050188435642241e+01 1.458204978510918259e+01 7.489766359637576087e+00 1.726716223675779815e+01 4.608155966832448769e+01 1.121707825243254746e+02 1.996064608842896178e+02 1.954349607252867713e+02 7.750083000174570316e+02 1.550661642514244249e+03 1.692905360052207016e+03 5.648177424119755869e+02 8.331696376295436721e+02 1.207813186585923631e+03 7.158683196626404879e+02 5.866784808375489320e+02 5.642482450272370897e+02 2.287226787549334617e+01 2.104212407996097767e+01
2.094533426061448154e+02 2.631792937917927020e+02 4.485956185764838011e+01 3.707614897136191701e+01 3.666479510558784227e+01 6.410933669925076117e+01 1.002508719010778293e+02 2.684425895131574435e+01 3.732073716399585095e+01 5.330321529046589291e+00 6.479283137658883085e+00 9.216360222496589927e+00 9.838025543375763959e+00 3.449967303516690720e+01 9.075076425640801858e+01 1.161331986643240725e+03 2.121230716174839472e+03 2.912601036538518201e+03 1.830867067802281781e+03 1.170604188545949910e+03 7.161743701558616522e+02 1.956047881870978244e+02 7.315858308361622164e+01 1.309456755177376976e+02 4.180591012714920680e+02 1.290021134968133367e+02 1.082983818611630227e+02 3.528458120437875323e+01 3.877445900067398643e+00 3.007101508682222590e+00
4.563103799248165728e+02 3.783910254605528962e+02 4.735207232021151924e+01 2.378090560706180412e+01 4.109595719861941632e+01 3.539586270288889835e+01 5.831707781746604269e+01 6.666987967893354572e+00 5.690786001120050841e+00 2.295045464343451691e+00 5.129906038691386172e+00 9.691579660845123456e+00 1.299025951533252510e+01 6.855879606927729242e+01 9.950039010036627474e+01 4.121671037067933412e+02 7.666035528894075242e+02 1.226138323766696658e+03 1.301586077914925681e+03 1.058144824933902555e+03 3.183157619956554072e+02 8.628003637794171254e+01 9.374322403094805622e+01 1.934026858559928428e+02 3.918711889753486162e+02 1.069566979202008099e+02 3.979597901068644461e+01 1.486033827071283930e+01 4.589127138589304877e+00 4.055623756518166978e+00
5.977058266044430184e+02 8.089836108729272723e+01 2.556645540266352867e+01 9.447075575127710678e+00 1.214769327962555678e+01 2.856033475093940410e+01 3.820734418045670111e+01 4.431661844858560073e+00 2.430154130092204046e+00 2.706526284007392924e+00 4.752439328944912056e+00 8.241266109684472596e+00 9.464509546093673009e+00 5.230429563664282711e+01 1.893780957176131778e+02 9.189364028606941019e+02 1.738742981509258243e+03 4.049485027760452795e+03 4.859938206933831680e+03 3.257690610065153123e+03 1.274996215925191791e+03 5.641112028525156319e+01 3.232639442729881551e+01 6.152332877971681313e+01 3.314752363066649536e+02 1.857607861616839671e+02 1.592805734464750458e+02 2.928936732896412565e+01 4.161901237800256226e+00 3.087844315754566971e+00
3.565960791685807294e+02 1.160356067760095584e+02 4.981729700167394270e+01 5.064598410967526831e+01 1.260255326273796470e+02 9.068537317804637610e+01 3.859224113907585263e+01 1.630437325882853017e+01 2.513287374800454188e+01 3.138416206439058698e+01 2.852095907622259396e+00 3.279128640124611138e+00 5.036778629110147065e+00 1.181928240700075783e+01 6.506320780172971752e+01 2.237502091843908829e+02 1.492682742695713216e+02 4.155010884679282412e+02 4.060119676979973065e+02 4.278837850970521686e+02 4.647178423305863930e+02 6.494832402499852719e+01 8.079671093169856988e+00 1.450469706322654417e+01 6.213522415864348147e+01 1.494318639144065060e+02 3.917278069897889736e+02 2.130602117802237672e+02 5.177653086357339340e+00 3.706930816942926477e+00
1.278021571640936997e+02 5.358862881164206726e+01 6.276250403874538364e+01 1.153299496424711776e+02 7.091417181978775375e+01 3.325258243218312515e+01 1.563870793980871454e+01 1.134383274390432561e+01 3.726765779060460204e+01 1.381296885479746095e+02 9.239876958322442491e+00 3.292156677595756697e+00 5.316507840249775185e+00 1.140477663170091205e+01 5.203594013082319236e+01 8.786297447823795892e+01 5.884589898931706387e+01 2.821276638526095581e+01 4.185870620111793983e+01 6.790290646070720015e+01 1.026238596155992013e+02 1.978149958505304085e+01 8.155674262880253877e+00 3.907764363307762778e+01 9.318102531258524834e+01 3.199922759789866689e+01 1.074720317963896008e+02 1.154552720318521750e+02 3.978581232288526337e+01 5.796535183238305855e+00
1.281475912502176016e+02 1.095186306230708766e+02 5.795747827984757095e+01 4.657660895133211909e+01 4.884270899062465787e+01 1.908604085242665249e+01 1.297161575385661969e+01 1.382020040615072887e+01 1.582299748528909333e+01 6.043599255552243221e+01 1.697459739982717863e+01 1.707798145358143671e+01 1.499109407510542447e+01 1.724028214462286712e+01 4.613459881733734846e+01 3.020278274739575863e+01 1.946555717364939042e+01 1.116110856707340560e+01 9.437009084126177783e+00 6.995339781417600378e+00 5.216415963228394403e+00 6.994376297417447930e+00 1.000776555460270067e+01 2.360071178519697099e+01 4.042594321271792523e+01 1.890924150786294788e+01 2.937025542147962653e+01 1.838851060978748109e+01 1.779633800293303736e+01 1.106623354953178051e+01
1.719692365385679409e+02 9.560575584838649377e+01 5.913169709252174044e+01 8.823097987523914298e+01 8.785811208811901452e+01 5.015988621162125582e+01 1.770213824166391134e+02 1.390945219271653741e+02 2.111580508444712478e+01 1.469097372269249568e+01 5.279142963178260928e+00 1.277381023639643409e+01 3.526202622904869344e+01 3.564804185845083850e+01 1.020769422274832863e+02 7.203968920146954247e+01 2.175868064155642401e+01 2.474288151934459989e+01 1.099955032848501446e+01 4.633274896092247630e+00 4.052443297366774999e+00 5.897152023246321484e+00 8.620160254056747462e+00 2.521261334688700373e+01 2.510326403031771036e+01 5.814909986327266189e+00 6.206931475928401554e+00 7.555697595500034502e+00 2.362377276343617538e+01 4.796764158459520644e+00
2.291013247668265649e+02 2.114288309138158013e+02 6.999628650050604506e+01 2.616352244553566493e+02 3.461255240921415179e+02 6.902007656451470439e+02 4.796588751885182091e+02 5.645905824473814505e+01 2.082535319661355899e+01 1.158218140381937644e+01 3.395287506336563510e+00 4.482169110652511890e+00 5.265125139797799392e+00 1.926364721855781070e+01 2.257594398595600893e+01 9.617720563019037883e+00 8.721529002220478333e+00 9.928550972978623435e+00 1.318962217369295686e+01 7.011517340252046537e+00 3.863449518455549736e+00 5.172529152159038190e+00 5.634696284149541157e+00 8.902045395538277006e+00 2.690798382645802178e+01 4.043140905033592247e+00 5.538132781455047393e+00 8.759833812105714657e+00 1.025496810519282320e+01 2.035702750350511536e+01
1.240337384498895403e+02 3.298472977717059393e+02 1.071997309363308943e+02 1.245317915386977461e+02 6.776537898711117123e+02 7.536324853538662865e+02 5.189571917998994195e+02 3.689165185019051307e+01 2.657861867284416846e+01 2.424181617685440315e+01 9.713159396347748498e+00 4.835732143171213693e+00 3.124907031537841995e+00 5.116456268512003192e+00 2.333706463861422264e+01 6.574983200764913605e+00 2.141353338359965264e+01 1.192631588603028376e+02 2.019613452719213456e+02 2.712019125457816315e+01 5.326906994321127797e+00 6.661089939003829841e+00 5.592530366775656070e+00 5.829561346312734926e+00 7.457148127837757379e+00 5.441904946195368353e+00 6.062735057493004120e+00 7.279489081408170748e+00 9.545844348717867689e+00 2.340675827766773409e+01
