9.975016183993356753e-04 1.445939283394577154e-03 1.277002125017675420e-03 1.636270012070364672e-03 1.251679187686129775e-03 2.758246620906732501e-03 2.726424829989547438e-03 7.357043646620979593e-03 1.337295666021748319e-02 6.088392275773343160e-03 2.876951372089123389e-03 9.534151464909013107e-02 5.676417096292975251e-02 1.423478689110166005e-03 1.628875340328012847e-03 5.818725423108149497e-02 1.206869977846299546e-03 2.036370775790454467e-03 1.778297114515951273e-03 6.079443325558804220e-04 4.977891318780384381e-04 1.570548550203719820e-02 1.237363790559563824e-02 4.877972642377675916e-02 3.933200365415976101e-04 7.004823106431667945e-02 3.150752223898718035e-02 2.799190480616167969e-03 2.672810925764727754e-03 3.361161693624455278e-03
1.064945651669262083e-01 1.658466469401309422e-03 3.011451529771486287e-03 2.461369448766436915e-03 1.723052476999384960e-03 7.762639574941257795e-03 3.712326096792902420e-03 4.627785220962615971e-03 3.019835693634782652e-03 2.588593449310136983e-03 1.867705438851421668e-03 5.559650627850491744e-02 7.557445715678107190e-02 1.118801858228382455e-03 1.551536411242422989e-03 9.963571176496547905e-04 1.199621092895729194e-03 3.776344996558820763e-03 2.748483568561249212e-03 8.057150599931371194e-04 6.523955679910595218e-02 1.495598170498657273e-02 3.203338717596641849e-02 2.806352788526716643e-02 2.390733928353999671e-02 3.096699875477408950e-02 1.064512721378922840e-02 2.774311109910945587e-03 3.976882021589974760e-03 4.010349307882186617e-03
9.214693506039152784e-03 8.980579453822743960e-03 1.902388399814645276e-02 1.535543578942952063e-02 3.286356566325750184e-02 3.372688206761678513e-03 9.160937951557290848e-02 9.845685230008324740e-02 1.101260913748270710e-02 3.363142366285367009e-03 9.104074172572401008e-03 6.071313181187743685e-03 2.240992760862905477e-03 3.322383214345994880e-03 6.401599112339394953e-04 2.725898393939151301e-03 1.779981330394041911e-03 3.509648758629696150e-03 1.126452904185789791e-02 1.828422740755689113e-03 4.152767813280298231e-02 1.237930259312079034e-02 1.938738134657990234e-02 6.719865544059217162e-03 3.876389551675150490e-03 2.486616812185157756e-03 2.140386704206474582e-03 1.706072866301802096e-03 2.916382166937025316e-03 3.321858974005061516e-03
4.281058258372606208e-03 1.168958321475239287e-02 2.569147262791568118e-02 2.058872212076907210e-02 8.537221088749340561e-03 1.334053570478092475e-03 1.079662623099757234e-03 1.059454306940537105e-01 6.482395758379366768e-02 4.224733359301165690e-03 2.735742585460765146e-03 5.499061320083905094e-03 2.504997026413823945e-03 1.687415566887139930e-03 8.082235262187187352e-02 6.357941933724373107e-02 7.727420082676540129e-04 1.393045519831120731e-03 9.585316420401140958e-04 7.985412223257191923e-04 3.661887049281715924e-04 2.840310865790886957e-02 9.099815961881793647e-03 1.744240408353134320e-02 3.163924300437946039e-03 2.265205130757638827e-03 1.881863665108290820e-03 1.790375587420147329e-03 3.589744212627501291e-03 3.974211032965327579e-03
2.483094312175707086e-03 7.337909812993939629e-03 2.043108086030025888e-02 7.912624086922420696e-03 4.571639668921234981e-03 9.900031496578802492e-02 1.057192375166405955e-03 8.656355014180557028e-02 4.010210518273641528e-02 9.943664789472431501e-03 1.258765927514022762e-02 1.094795640534765996e-02 1.628764586279411730e-03 1.345941895650387210e-03 9.667142723452959441e-02 3.676071402890873641e-02 2.390256632588059517e-03 1.334815791785600456e-03 2.097885851083431015e-03 1.172299314697742602e-03 8.052531545319854302e-04 4.721854820686106902e-02 4.816839152568228076e-04 2.912373162670413296e-02 5.714307641728326795e-03 3.052549880295764122e-03 2.072553980176181088e-03 2.412950110317982257e-03 3.729647478003946318e-03 1.399706643827328123e-02
2.484371702218772255e-03 2.486998480580845765e-03 1.112808175225090193e-02 8.894070106853967095e-03 3.535580743220143821e-03 5.747325944132006259e-02 7.050717352111619818e-02 7.615123933263059919e-02 7.084137815013312467e-02 1.570056484371039340e-02 1.253353299407226895e-02 6.769041169352892767e-03 1.046491453468827437e-01 3.242709310515098919e-02 2.511335022391985444e-02 4.171549057410282868e-02 1.369157682362295760e-03 5.854567813011779531e-02 1.116328356335323860e-03 3.766006199874384099e-03 4.519822615142212070e-03 2.634913928340113128e-03 6.406185274406223443e-04 1.747870442233950480e-02 8.590325952705086046e-03 8.088278397877013415e-03 4.961601283487212383e-03 3.444140172175529958e-03 4.479109037876298667e-03 8.246492720092580414e-03
5.023423434516519070e-02 8.031213293324543367e-02 8.482384065717510357e-02 2.825540188299712711e-03 1.352586948949824341e-03 2.287698012462289782e-03 3.580523784778123081e-03 2.103345440009303687e-03 2.564865862277827639e-03 3.072906051402565612e-03 2.427546985727145785e-03 1.027705707740505375e-03 5.468135160154739827e-02 2.163203630499575814e-02 1.152807317010009006e-02 2.076042541765374047e-02 7.931098893489908937e-04 5.921696066708394962e-02 1.879748675854584199e-03 2.529028015640239543e-03 1.136893992947270345e-03 5.008708358478050626e-02 2.016928665445448521e-02 1.582807384542415929e-02 5.892137136361347977e-03 6.085541296808478703e-03 5.284009412836385838e-03 4.624128890512876899e-03 5.302528176245933575e-03 1.288762279010660650e-02
7.696385028784079752e-04 1.380381197686889397e-03 8.058700110060359068e-04 1.734800704714564799e-03 2.650421519575578335e-03 3.009166150003059204e-03 2.719891217971620243e-03 2.612938202296812527e-03 2.136282838429018685e-03 1.233542425185813005e-03 6.789296007029793634e-02 1.618530897830347363e-03 4.502914321466260777e-02 1.505406541856159006e-02 1.549489524417595535e-02 2.877638273475136010e-02 1.606154413007476137e-03 2.555997861411001514e-03 2.234338956889781163e-03 1.576146516301224921e-03 7.299071074004416515e-02 3.539409740901611201e-02 1.223729727795288755e-02 9.575375053906558590e-03 4.504712566683792031e-03 4.727130137379042564e-03 7.258685649685890987e-03 9.239293279547871815e-03 9.336270233245271000e-03 2.796931071404878608e-02
2.084238942854539645e-03 1.351261105013854902e-03 7.922531488792813317e-04 4.588428688132421135e-03 2.973453778773674921e-03 1.262596686553016639e-03 4.105929531976794562e-03 1.853324098214596555e-03 1.565567092742328054e-03 1.590117920056327398e-03 1.456841723481487778e-03 1.969774824111569442e-03 4.317339939638152775e-03 2.758513327015705945e-03 5.563681164413585706e-02 5.086029431368226800e-02 1.538960875689377589e-03 4.663790370636283072e-03 4.597928820816241623e-03 7.667917431721899772e-04 1.997599307087143117e-02 1.586407837332708473e-02 1.534419140634653983e-02 9.441581285852710531e-03 5.433521183868916804e-03 8.314360461247033429e-03 3.103928376569312086e-02 6.345774107026098954e-02 8.590686501072687404e-04 4.548654914554590544e-04
3.542217437453097466e-03 2.299092968837830684e-03 3.691866718833371544e-03 3.447165720572483057e-03 3.025303809432756518e-03 8.139822898112086813e-02 2.756254707948286014e-03 1.165177989147463252e-03 7.020105762026129792e-02 2.637584600888314909e-02 2.799118845191716706e-03 2.784368312597527463e-03 5.912246345812646221e-03 6.271350963068586006e-03 2.930123344507236730e-03 3.124551365086166311e-03 1.666998292799599934e-02 1.732245086840798406e-02 6.995271049141993380e-03 3.136534693437964018e-03 2.497093111419826372e-02 1.216826055963193820e-02 1.273994262811602510e-02 1.335586807488664540e-02 7.214423143239938330e-03 9.207271189706087156e-03 3.792051875824649409e-04 6.973955994263670091e-04 9.262626088417376218e-04 5.065830043776381464e-02
3.007515607117133144e-03 1.565579835404317874e-03 3.517366661478892997e-03 3.000895281601740142e-03 3.820268093378725686e-03 4.764981250728268780e-02 4.042774294914563277e-02 3.550815935847059790e-02 2.247252404826403926e-02 1.393278015528401879e-03 2.225056880895392303e-02 3.765494707800028096e-02 7.780756778137387641e-02 3.763499652161696185e-02 6.803189748054142352e-03 1.293209815210662021e-02 2.397140345443726783e-02 6.677054623462225398e-03 1.610452106696097334e-03 4.913084952314442089e-02 1.717103704176129939e-02 1.220035855742795938e-02 1.475281770529267289e-02 2.002598725407519348e-02 2.081831328343359405e-02 1.111039068874905902e-02 1.739486926881152543e-02 1.414732069064830039e-02 1.285202554888691465e-02 9.335488680266457173e-03
7.311096133745530190e-02 4.288655443604005163e-02 2.913068289163964469e-03 2.861548290817681785e-03 2.232439748720967294e-03 6.951012815097581954e-02 2.727288892307924359e-02 1.763980962638832251e-02 2.196755831656513336e-02 2.742377479071893970e-03 6.723091076315309590e-03 4.424917331038346474e-02 7.892529738004176731e-02 4.010307694027515080e-02 1.421097634104815863e-02 1.559951051405082667e-02 1.722339640528261842e-02 1.025420297482200656e-02 2.552111866316921548e-03 1.044507788905127410e-01 1.571527389669326660e-02 1.416073141440110997e-02 1.624068922655347996e-02 2.874269122858047476e-02 2.712499930556279762e-02 1.910574218108675171e-02 1.450152036759541456e-02 1.328420938583271989e-02 1.433359363741353552e-02 1.546325389409458281e-02
1.424803693075170526e-02 3.664907280138645501e-02 9.004742660409734145e-02 1.938491301963767011e-03 1.265306892508791378e-03 5.426062819877940091e-02 2.796287767641163213e-02 2.351225298166828570e-02 2.979619812592489841e-02 1.380497167839797026e-03 7.021285436936944291e-02 1.404330192276622216e-02 5.828795686282660371e-02 2.429225920201378078e-02 7.459541631212448717e-03 8.394479261923827942e-03 3.106099039362670428e-03 4.593469003239725526e-03 5.279757893082066139e-03 1.998027647453639189e-03 1.863825884609283598e-02 1.692352524327840613e-02 2.062595677543577893e-02 3.541345026940734275e-02 4.624954272735378596e-02 4.334888879612503604e-02 3.205071073367644213e-02 2.944148608624093041e-02 2.262002728906845408e-02 1.761128936123762881e-02
1.141270640579598004e-02 3.269075440394925147e-02 6.031414539592993423e-02 4.431947199295335066e-02 2.638701129895375252e-02 1.050584322166360218e-01 2.527554529627554052e-03 2.109932853419441146e-03 4.341140393770566430e-02 1.332573603111670418e-02 5.323997258289980827e-02 2.260624221074800533e-03 2.619288100875109826e-02 3.438742546916690596e-02 3.573109994533466005e-02 4.692421302589572241e-02 4.233599162717707753e-02 2.759982411576483372e-02 7.576672885118378165e-02 3.571839632857821967e-02 3.001128062728069743e-03 1.157574579763766820e-01 8.797569454027723279e-02 1.682553583224910901e-03 3.900776676485399712e-03 3.633498706149630719e-03 9.933754757784605399e-03 3.316415889780200549e-03 3.684418110772897520e-02 3.615244850916948804e-02
1.024455605710240108e-02 1.027184867728513432e-02 2.874592926918306118e-02 1.563919613758949249e-03 7.954018413833371937e-02 1.878718564889944598e-02 1.663086431245796052e-03 4.734886026429466037e-03 3.153668284367295432e-03 5.304842063799503765e-02 7.037301239693858224e-04 1.113891308724491991e-02 2.322465248261822851e-02 2.855009516276318243e-02 2.506381821501328655e-02 2.946051930412119796e-02 5.046575441807677614e-02 8.788385729129744028e-02 9.048458038972131967e-02 7.266667762204162551e-02 3.172726787892526674e-03 3.379021219625934040e-03 3.028136543412648062e-03 9.583572897588744921e-03 1.381099320463647848e-02 7.076617559787615197e-02 7.127760769846035183e-02 1.470210087312387101e-02 4.296984344324844551e-02 2.617472981214270800e-02
8.941497413276862025e-03 9.744001908483831964e-03 2.275226085700247924e-02 2.552227821769902094e-02 1.709655491054663454e-02 1.951517163351623035e-02 8.955468984510807796e-04 2.478054935209215125e-03 5.075776435823353694e-03 1.844229125296580150e-03 1.928452467275977881e-03 1.690591602467386278e-03 1.298436904045452422e-02 2.560698847347101653e-02 2.331382213163437495e-02 3.480214007891689609e-02 6.049148370789307616e-02 7.439211447344262762e-02 4.378821571750821096e-02 9.789016059026385552e-03 6.006393818342740422e-03 4.202802124561596381e-02 6.200876305520303805e-02 1.055167216768321814e-01 1.000334164569630785e-01 1.313900957178323337e-01 1.067707036823572486e-01 3.109917212497380345e-02 6.739782425826057466e-02 3.077881876125619295e-02
1.081320689561947844e-02 1.253408890662074948e-02 1.266493137065536484e-02 1.230312601460801028e-02 1.905535158733575804e-02 3.971042002514773434e-02 1.431735969285304923e-02 4.693264442931423946e-02 2.259239277075826557e-02 3.939264658203144379e-03 2.975259383819066437e-03 4.691149911575636516e-03 9.205178690871378827e-03 1.323105213049077106e-02 1.701893100917050913e-02 2.975750580610327448e-02 6.464682125746167018e-02 6.658183926453536960e-02 3.235534180640783908e-02 1.139323866894651795e-02 4.995187009236046194e-02 9.181031468050790401e-02 1.195042233944447474e-01 1.252075863055823191e-01 1.123031498665164885e-01 9.863199548862136568e-02 1.482204963041590662e-01 2.612700887407915992e-02 1.000154784536673863e-01 4.286646691320346314e-02
2.592882566797542060e-02 2.042754043013345067e-02 1.094058536895874817e-02 1.759682855925784675e-02 1.409023489061960116e-03 7.013954704542966698e-03 3.817856843586207860e-02 3.033063305431753925e-02 2.930309262705051848e-02 1.502021995111781083e-02 5.622181370093711286e-03 1.540647411475184895e-03 1.504013932554195982e-03 3.789161021083399007e-03 8.325959313594573016e-03 3.743726597990575111e-02 3.987477844147564732e-02 4.782822851574072137e-02 8.544800612275093438e-03 1.544449213116291623e-02 5.561116709591558405e-02 1.220211196227377060e-01 1.532014669860106981e-01 1.630709322258936389e-01 1.382220987118722710e-01 1.358767647260651634e-01 1.281859635965667266e-01 1.016406736581629000e-01 4.511729292664894836e-03 2.975698383458360262e-03
1.179403658209750121e-02 3.280290618148096887e-02 6.222101152077900987e-02 2.595117610549852079e-03 5.732871203363201773e-03 7.941271133934122220e-03 2.438208536262334233e-02 2.947731952891420593e-02 1.976435467300887566e-02 1.564557856808174163e-02 3.343684045203988535e-03 6.677479646074016562e-02 5.083726860252490770e-04 1.430050760887552168e-03 3.084987845505865380e-03 1.809922364901017655e-02 7.021937379855427291e-03 2.303558805660358994e-03 1.093815680166379811e-01 5.803632530070467963e-03 2.214485572882837761e-02 1.184840095704386698e-01 1.512559964855150763e-01 1.621174649821139624e-01 1.215409113363260241e-01 5.755360468492413950e-02 9.461905746109197657e-02 6.494403059093135921e-02 5.856122122619151008e-03 2.311705758145998508e-03
1.917863405599486409e-03 2.414024447183799830e-03 1.601628109739106163e-03 1.963875840982385636e-03 4.565705287748397789e-03 2.551226028647753628e-03 1.273220924137825893e-02 1.583211648510051903e-02 1.417966364359431880e-02 3.387650751215435206e-03 8.619511118722568074e-04 3.928318329467914843e-02 6.787627949981878128e-02 9.870169391517379966e-04 3.976673971115289759e-03 2.711727036253284810e-03 5.039804067467635804e-03 1.518621652284047252e-03 2.890508047914308772e-03 1.373724123918716213e-02 7.337338417777863886e-02 1.385394579191382702e-01 1.488530416752418817e-01 1.447539905079478495e-01 1.142273049406011820e-01 8.575889382707818642e-02 8.461635922189844616e-02 5.701182143590285967e-02 5.132963558672180501e-03 1.827186073802237933e-03
5.511834418788569973e-03 4.950865338114128315e-03 2.514053802362733146e-03 1.776591919143938152e-03 2.259745924390262322e-03 1.172157110648325848e-03 6.429458175305948452e-03 5.491961002160058655e-03 1.453417313230179675e-03 7.989604661244474517e-04 2.786469521312800296e-04 5.113612803504200693e-02 3.036383338545436267e-02 1.671817086669618452e-02 4.307336889741320007e-02 7.955845094390702520e-04 2.882009426904088949e-03 6.663152370373242803e-03 6.487670136179107122e-03 2.898055139734401209e-02 7.793615714750903867e-02 1.118131742115598404e-01 4.516088717072759551e-02 6.935384498233107542e-02 9.221521252777660493e-02 5.366805179453600083e-02 4.092036641878289693e-02 3.360867430674156081e-02 1.317498371977817162e-01 1.204213896913730181e-01
4.498753857662856834e-03 5.085194801581468214e-03 7.370114759206872809e-04 4.983896308195999133e-04 3.976261791185947301e-04 5.731711345796011844e-04 7.879856006826778045e-04 4.788746462083236927e-02 2.347581406312405439e-04 9.589629276005673733e-03 1.246751908604538592e-02 1.882853683439716930e-02 2.089839419475987212e-02 7.512735874986428697e-02 1.094409092903842785e-03 1.507570420750327725e-02 2.900706425239689412e-02 4.231233328049599507e-02 2.910988208897413720e-02 2.195337310150866431e-02 1.535570735542766789e-02 5.435522977136337044e-03 2.077896932231097088e-03 4.573653693628983684e-03 1.706461890424410335e-02 5.941688289266941654e-03 5.611531098894107644e-03 1.896805111426609364e-03 2.279806122004509467e-02 1.865095508200744975e-02
9.474948162781313132e-03 7.172986330693909007e-03 7.579930442717344903e-04 6.502785277737847813e-02 4.498708671115986702e-04 3.403442147101832464e-04 5.101188239531842701e-04 1.324912546420770228e-02 1.116568622495015678e-02 4.811635932860309703e-03 1.136021596041359577e-02 2.139771221875442359e-02 2.859025596890699128e-02 7.508714138346935787e-04 1.329041341545324998e-03 8.892345391364695276e-03 3.248216726681153743e-02 6.077572466831947934e-02 6.912206429848333222e-02 6.052429786436268333e-02 1.300380023020675756e-02 2.919860673068634498e-03 3.622501633416800107e-03 8.987207628949858002e-03 2.041128428438688733e-02 6.140916520198470840e-03 2.400534519892005055e-03 9.468707060824635424e-02 2.996646895281525683e-02 2.692263503843940475e-02
1.173728655427421462e-02 1.470115869498096707e-03 7.628508342821740951e-02 2.586768043781506946e-02 3.051791375491544681e-02 6.790588046937903743e-02 3.671138388697084182e-04 9.978361941487677578e-03 5.527073772297553568e-03 6.370274981801721942e-03 1.125565764156488680e-02 1.917543194188137123e-02 2.180697756617758221e-02 5.896006717011749530e-04 2.484388615640490544e-03 1.286061041320655379e-02 2.482938060988418988e-02 5.710384593855814817e-02 7.173807099444429181e-02 6.149004757384254893e-02 3.156019400803813935e-02 1.860942930177481025e-03 1.343793190221193642e-03 2.932125876682452163e-03 1.705770014002721408e-02 1.032627678198846932e-02 9.411964494241633825e-03 1.780913616565270264e-03 2.696707177223833102e-02 2.080778623476767231e-02
6.470873950120987345e-03 1.971836699548237294e-03 7.441330773039278113e-04 6.682306900126115190e-04 1.422568126841707633e-03 9.520345148476155352e-04 3.877219281150496005e-04 3.874047032814367797e-02 5.857988681623976790e-02 7.615538654951793662e-02 7.081412883794024546e-03 7.972941329000693758e-03 1.249098575183241536e-02 2.847317089790894415e-02 9.048921264947107791e-04 3.971710691826830023e-03 4.011773335131145653e-03 1.716757582149940065e-02 2.199555675081284883e-02 1.927158177959029453e-02 1.694113812290640522e-02 2.274760438287540612e-03 4.351282510895596034e-02 8.256675729896956195e-02 3.150235223777922769e-03 7.886334130716054353e-03 2.129130612547769016e-02 1.205837016578125385e-02 3.239491142534911550e-02 2.458119415610513642e-02
2.313999198180957933e-03 9.031469097981201580e-04 9.359348398163111395e-04 1.520619171071959080e-03 7.952752796745401640e-04 8.159320790260565781e-02 3.812330069122173842e-02 2.719512861414694060e-02 3.399416372432531911e-04 1.349212726408736789e-03 2.284409259551489768e-02 7.869759229748252150e-03 1.338025905405016043e-02 2.953997553946019483e-02 7.368716911317912824e-04 1.421585309644058607e-03 9.884937436810991348e-04 8.148278737453618081e-02 7.829994327630169799e-04 1.459921476716541768e-03 2.728428486781722326e-03 8.646512612135283382e-02 4.375892030215881856e-02 1.818636402000903696e-03 4.469537231092302401e-03 1.598002484817584792e-03 5.553992083552556150e-03 6.265959160002236919e-03 2.236236002739552461e-03 3.793409263043294455e-02
2.346000552921102562e-03 1.852328152275963414e-03 8.755817582550148252e-04 6.190358297808035148e-04 5.517193921623157445e-04 4.744596317418757481e-02 3.184446809089557656e-02 3.312417475974424597e-02 3.696858058115134321e-02 5.908519043190557131e-04 4.145193866161669960e-02 3.929712169035988467e-02 3.729841622768954867e-02 4.679430131343303989e-02 7.148245041402945862e-04 5.418431159880485615e-04 6.568009449566597491e-02 3.971717316240204465e-02 3.527204267202020682e-02 2.723052440514211331e-02 2.176801010143248477e-02 3.193799981475251015e-02 5.101065960294223073e-02 1.280872126865932326e-01 1.826000759789600525e-03 1.087833330357473594e-01 1.497111829859763994e-03 1.122966090208414036e-01 1.131445894878640585e-01 7.326105598694188092e-02
3.178231695466512616e-03 1.630409481727903859e-03 8.996777498381399157e-04 1.186766115280666212e-03 9.982610831307495332e-04 5.317802905527629822e-04 1.789618242362038189e-03 1.330823078210222445e-03 4.975767537254257439e-02 3.601393083941341333e-02 1.280213015896044040e-02 2.930833377822616645e-02 3.893654021886681351e-04 4.748060442173246062e-04 1.611963904752621241e-03 1.319037544729856175e-03 7.498729481470944869e-02 9.019417165761760280e-02 4.216078072763339984e-02 1.845465074034222802e-02 1.680392166659773132e-02 2.571382247539855809e-02 4.008598391272820416e-02 9.424293114550835650e-04 1.052238853228591774e-03 3.331662069008048399e-02 3.774951420421223530e-02 4.792764191709601718e-02 1.389744993385280333e-03 3.197489904556830020e-02
4.269292191016521229e-03 3.635526795519918204e-03 1.070462112161235484e-03 3.539661801708490329e-03 3.934291385027963855e-03 7.279702398008656289e-03 4.833761037937703113e-03 5.401945532980865182e-04 4.919599098306567941e-02 2.835287994178933499e-02 8.345483059534549927e-03 1.039517193957200172e-02 1.311934760578170427e-02 5.368072038051105443e-02 6.887370070056428317e-02 3.175318210779867062e-02 3.154144493175678465e-02 3.829308661477365955e-02 5.259528646024212023e-02 2.884478727519192848e-02 1.565746860092073409e-02 2.120917383569798087e-02 2.377199135614308997e-02 4.220675451448926280e-02 1.046815900182171194e-03 2.302166300110398967e-02 3.429516703639316766e-02 5.596364771080046541e-02 6.561496941645382497e-02 1.341214125792335454e-01
2.348858813787084703e-03 5.768607199809899777e-03 1.683191072640675707e-03 1.756602319229045662e-03 8.226342076213141036e-03 8.598016324276437292e-03 5.713479120558825550e-03 3.907762979878338580e-04 6.786511047771741356e-02 6.378269048279124054e-02 2.606881775718532246e-02 1.285615514711756918e-02 8.352817096177602568e-03 1.503100679111332022e-02 7.412054998487913049e-02 2.222378815543888525e-02 8.042905481483512975e-02 3.155748114834286064e-03 5.871866302346751693e-03 8.215179764309627928e-04 2.322960378451587038e-02 2.931635479921757687e-02 2.487000160215388500e-02 2.872983255036662409e-02 4.015537633857453603e-02 3.210076409562200722e-02 3.887034477668957488e-02 4.819986741453584356e-02 6.297720074842104443e-02 1.550628550027383090e-03
