5.648445175929627839e-03 8.231372104983664811e-03 7.148312247387485045e-03 9.010834036777140912e-03 6.784864731324286545e-03 1.478643387792894642e-02 1.451629189222076316e-02 3.892686834639935700e-02 7.036316633575817603e-02 3.155941337154019588e-02 1.468980195330502059e-02 3.342581581268738722e-03 1.943995843224787315e-03 7.150714598036702480e-03 8.239928993573963217e-03 1.796952985392378035e-03 6.360524434730762885e-03 1.121786600598693312e-02 1.027714309346501945e-02 3.641752569737195626e-03 2.864701396161565237e-03 4.067203872305905380e-04 2.286266958145702355e-02 1.189841912101241832e-03 2.213823470494311225e-03 1.663902955658626542e-03 7.363548120449647360e-04 5.429225371530786368e-03 5.113333468081715169e-03 6.341170630502686659e-03
4.407060094444648253e-03 9.541654371774409976e-03 1.717856207443562572e-02 1.392161537550214157e-02 9.663637025867966718e-03 4.308272683589203789e-02 2.037269338897917254e-02 2.515313995067352051e-02 1.628073719744005041e-02 1.392987166197037774e-02 1.002664086062947726e-02 1.972739005790789986e-03 2.609010410427625194e-03 5.867773589901348862e-03 8.034168897915246882e-03 5.090901620295100113e-03 6.291798655560051912e-03 2.062507423165513970e-02 1.567185011993311311e-02 4.729605485406688375e-03 1.641229135519985116e-03 3.578165551956603374e-04 7.289646715787012014e-04 6.211266865020494913e-04 5.206788293860388018e-04 6.622308289839214188e-04 2.065938789433875711e-02 5.330753829965919482e-03 7.562854453920016956e-03 7.546082093083771557e-03
5.327246803313186868e-02 5.221828719275974778e-02 1.105685456302523961e-01 8.919640611586084067e-02 1.907590010013671400e-01 1.937799405530969687e-02 3.604974521052405588e-03 3.804645254250553933e-03 6.084474705374264686e-02 1.881708411327763508e-02 5.153941096125878862e-02 3.466788675684839144e-02 1.270353232667395700e-02 1.823768614631362389e-02 3.398470026542382665e-03 1.396111155782654711e-02 9.294000911464348619e-03 1.901214664344487437e-02 6.336603879767378766e-02 1.050648372463828563e-02 9.722703429194431805e-04 2.722140092397342011e-04 4.001600224306547634e-04 1.167671713312026099e-02 6.944445056139450338e-03 4.602544736986313202e-03 4.103955860118807183e-03 3.248283519004998079e-03 5.513412567928999489e-03 6.234116474901652341e-03
2.473505383332670615e-02 6.823155486101850631e-02 1.499534515564699133e-01 1.201669618724292010e-01 4.982485000360972055e-02 7.673441077458756018e-03 6.061853286769738024e-03 3.992389106419661111e-03 2.415608321959862061e-03 2.296567459574421280e-02 1.501657850613935183e-02 3.040407245773655773e-02 1.375811582206412816e-02 9.011150548745353733e-03 2.576171553245334891e-03 1.904373928209543085e-03 3.926662683631699027e-03 7.278296380047349565e-03 5.157351317445817152e-03 4.371450195117833164e-03 1.930993628411522244e-03 6.371988739110941592e-04 1.568909408400824546e-02 3.514287660135027207e-04 5.620868642018756953e-03 4.141706662454597461e-03 3.548925275239994508e-03 3.358318018966593814e-03 6.697095645364714925e-03 7.373054799863927242e-03
1.436068364550947135e-02 4.310056946937398936e-02 1.199972166652261973e-01 4.646960256175172721e-02 2.684704451509042217e-02 3.886721585186645768e-03 5.877912132279802457e-03 3.227319656651067917e-03 1.465840624667107909e-03 5.216302151339599624e-02 6.631160014279662007e-02 5.789484963235223824e-02 8.555080358828962700e-03 6.917574847657913598e-03 3.131514725810790115e-03 1.115126198491830532e-03 1.177968360995870420e-02 6.696073345861490791e-03 1.073563657131653554e-02 6.080125657551076548e-03 4.095975189859392060e-03 1.108382760890791116e-03 2.353015539039883443e-03 6.115660873376699931e-04 1.012752598007119961e-02 5.531351061182630466e-03 3.844365302209694531e-03 4.456090793001693182e-03 6.857298706406800629e-03 2.967296962074349349e-04
1.440706769153974817e-02 1.473406892370370848e-02 6.592065946285902145e-02 5.268198556610646788e-02 2.094098590207293248e-02 2.219501266990741607e-03 2.657833355782611776e-03 2.802607947508709875e-03 2.575831679050549512e-03 7.956963430995661612e-02 6.345959076097029694e-02 3.424771272670401601e-02 3.904335667628577519e-03 1.136548437407467480e-03 8.238105028937915122e-04 1.274936396280951581e-03 6.548960363288067535e-03 1.687983314583841286e-03 5.439348959555239185e-03 1.852124341578103087e-02 2.215712560596583280e-02 1.285653504955365511e-02 3.106566483347369349e-03 3.804266241479959884e-04 1.518710589350734733e-02 1.453624742966646080e-02 9.068890356506527015e-03 6.272732785245713552e-03 8.130142880589616775e-03 1.492048912494457584e-02
2.015995172092696457e-03 3.148207098566471913e-03 3.318561612136962033e-03 1.677870270859932109e-02 8.024352336437343483e-03 1.314481618697384280e-02 1.954214933192121098e-02 1.094219486408229587e-02 1.275791870972439734e-02 1.518753419614213979e-02 1.193103640346396960e-02 5.025003018404451682e-03 2.062052615447129006e-03 7.680906819796595123e-04 2.138366298775273150e-02 6.418601428910202618e-04 3.712878520865142001e-03 1.739921405399057165e-03 8.805121334988804879e-03 1.189810566654999138e-02 5.397182655280739760e-03 1.261110952552945558e-03 4.765773308083438809e-04 3.554372893879646604e-04 1.039190780895142205e-02 1.085953736548445417e-02 9.538467646339539308e-03 8.321914119888335071e-03 9.519732625746710891e-03 2.308680810790181628e-02
4.459994649952846862e-03 8.123062389770166133e-03 4.715573268078748249e-03 1.009522846886624220e-02 1.533884900457770095e-02 1.693940722863081921e-02 1.470195903648008166e-02 1.359917293673061633e-02 1.073279034529720302e-02 6.142039791485497113e-03 2.519453408118118350e-03 7.928641055884992975e-03 1.686095640709811463e-03 2.845933580357146164e-02 2.902223771937163105e-02 9.441118442438493907e-04 7.715134090985785974e-03 1.225814019806163377e-02 1.071016078377972844e-02 7.553269872734070384e-03 2.018379335788320593e-03 9.182185528024363642e-04 2.120151461034230217e-02 1.662961385709881001e-02 7.920363168738689397e-03 8.414156208826625155e-03 1.306805382126213950e-02 1.654909042252949644e-02 1.664608893159874245e-02 6.491545057011996510e-04
1.203732626360293038e-02 7.858441955421287956e-03 4.557738580147177240e-03 2.611409530203409254e-02 1.674386469971376329e-02 6.950959581299386708e-03 2.195847866212109756e-02 9.639773517471580261e-03 7.936082584854169120e-03 7.967492645954084990e-03 7.220055430628079599e-03 9.653580652802674911e-03 2.106832717848194578e-02 1.352529202056610563e-02 1.972055503103287664e-03 1.760244603242037053e-03 7.582617805123038381e-03 2.290792030507741300e-02 2.252193532484946664e-02 3.737437759906599155e-03 5.716779677235124708e-04 4.230727192881141279e-04 3.798306974961169081e-04 1.633525820722638022e-02 9.530086358164709809e-03 1.477273647775323093e-02 6.721079943088268099e-04 1.423526872381723762e-03 4.313086092408440972e-03 2.234691249817233327e-03
2.030224357254387102e-02 1.317655417878565646e-02 2.087663139251182479e-02 1.919653840827856978e-02 1.657092093014888440e-02 3.203989032235721006e-03 1.457003028191049612e-02 6.055613373204312561e-03 2.480310625515786630e-03 9.411557274974756155e-04 1.391690876539440624e-02 1.365185747901922000e-02 2.891146111702129137e-02 3.104083629491399127e-02 1.467918477881779288e-02 1.583785442723174841e-02 8.430773921601486531e-02 8.714045345974533174e-02 3.499247955665115567e-02 1.552494111860111201e-02 7.366108216102140640e-04 2.146119552865796004e-02 2.192100049782563093e-02 3.251874688807625605e-04 1.262741944798126750e-02 1.634142255826907461e-02 1.948320698340868552e-03 3.500405382717148607e-03 4.546945015210230798e-03 1.241232383738309891e-03
1.686297766083806257e-02 8.776362683729265271e-03 1.947993646258009900e-02 1.642116993481802789e-02 2.060334616523563922e-02 1.857950949858062787e-03 1.527915059498170629e-03 1.294440730487913215e-03 7.857276390624734659e-04 7.097469202904952736e-03 1.114426436264656650e-01 1.855092629643125823e-01 3.830744185447013672e-01 1.889717034602872436e-01 3.486195131296557920e-02 6.762675172898341414e-02 1.251256341101140979e-01 3.462661919882038808e-02 8.291066366239246976e-03 1.649901213593030474e-03 5.387647093784804974e-04 2.186242521747523010e-02 3.990513559176620808e-04 5.259121934829940736e-04 5.398722839734574307e-04 1.990815777081576116e-02 4.301812221564192034e-04 3.545304934691095237e-04 2.261811122810699487e-02 1.621693008242909226e-02
3.061563915311596700e-03 1.797526650223635379e-03 1.581814067002081450e-02 1.544316322931780019e-02 1.196684015373918747e-02 2.703375746777505334e-03 1.023441790368723311e-03 6.358921692223460861e-04 7.584820427164278272e-04 1.415905954983577575e-02 3.406527877032869411e-02 2.200940402273964536e-01 3.933987565536534725e-01 2.054457249430085564e-01 7.485765865208035552e-02 8.453145263261922782e-02 9.327389752076462037e-02 5.520336637108538835e-02 1.364873636410633695e-02 3.840361046631376313e-03 2.984828536716451625e-02 2.632466753524703024e-02 5.075262209001307669e-04 8.792004937533783645e-04 8.228277468181644265e-04 5.700707494797828097e-04 4.234791053474986711e-04 2.400406076069941386e-02 2.537679453998567536e-02 4.195574167454222780e-04
2.870368119432282344e-02 1.477180190542498259e-03 3.634052192330586382e-03 1.032796302812510197e-02 6.739698138394987874e-03 2.095477259226367038e-03 1.037140826751803933e-03 8.336992422799020070e-04 1.007527105517049557e-03 7.220058773680996557e-03 2.371881430393758122e-03 7.060716990634217927e-02 2.946281647897029399e-01 1.271389077388108968e-01 4.042235272789032607e-02 4.709885160046633351e-02 1.742301291663493970e-02 2.561491776553141003e-02 2.925464017382429366e-02 1.094471331575977424e-02 7.190469367977774667e-04 6.284249631908693338e-04 7.355152147382963256e-04 1.244405648757918991e-03 1.614865924960023121e-03 1.494405691612187958e-03 1.083192064659090981e-03 9.483026481665590961e-04 6.895469855989978976e-04 5.038940288100818808e-04
2.252083451634923419e-02 1.265220177522256503e-03 2.363550110386960709e-03 1.748436840842433788e-03 1.039971111437830312e-03 4.027718917781831012e-03 1.350306229019110696e-02 1.133112766867448717e-02 1.434313573769233942e-03 2.607009319064661906e-02 1.758794270006828683e-03 1.149510960266293333e-02 1.343846900568879121e-01 1.841166191810701958e-01 1.993419442791902751e-01 2.726124911292437392e-01 2.458318334771380786e-01 1.592628209805133366e-01 4.343980395231243907e-01 2.026009831566019659e-01 1.667961821348330764e-02 4.796005216542746294e-03 3.549127017080187102e-03 8.855689813433693588e-03 2.036871461853700938e-02 1.884540079391231956e-02 5.097779574477000891e-02 1.616731528482372171e-02 1.211505869404241832e-03 1.078844947687180277e-03
2.038069936048973393e-02 2.060441166455576414e-02 1.110728570537784180e-03 8.384101617927710443e-03 3.045652460874586145e-03 7.050783618639545327e-04 9.065727732449244472e-03 2.604710708500133226e-02 1.749134445347159256e-02 1.780977053478256323e-03 3.751972492777063198e-03 5.810940250299823084e-02 1.219753226740869778e-01 1.557159325574137554e-01 1.418095764763780964e-01 1.727680566517597605e-01 2.951810681328467800e-01 5.103322753656183153e-01 5.216168499341652387e-01 4.140412709126380375e-01 1.767629660092182378e-02 1.840300293618223060e-02 1.611835882445691870e-02 5.003353098058543891e-02 7.090984996853183508e-02 3.578902438939229880e-01 3.540540783681703774e-01 6.986522339144178584e-02 1.477480699017909727e-03 8.249526520830721080e-04
1.798798088689353147e-02 1.977330836950136339e-02 8.665136122734544465e-04 9.605372901166724618e-04 6.324354610381731183e-04 7.136827790975746374e-04 5.001388263815567323e-03 1.402287611724756591e-02 2.904484864037553543e-02 1.034510541247326589e-02 1.060436849414389884e-02 9.091340338613362881e-03 7.004005927524378783e-02 1.422585796537197134e-01 1.332775702111550498e-01 2.045342696365191892e-01 3.535716834246059870e-01 4.310288192011844099e-01 2.515238980278059477e-01 5.544428660224845484e-02 3.310524645339048277e-02 2.253940507516830061e-01 3.235355662500432050e-01 5.362170633656495600e-01 4.958493951857031456e-01 6.362326353182745642e-01 5.051042864312671465e-01 1.429387510873210698e-01 2.381032712916077675e-03 1.028456681944463430e-03
2.197120273665723045e-02 2.572157598192537781e-02 2.588698828741380076e-02 2.505904008965579438e-02 6.787485740204157953e-04 1.410309180172183595e-03 8.207896423342336822e-02 2.737506571785024434e-01 1.337161722710644707e-01 2.284280990931553817e-02 1.691331587445105145e-02 2.607722755712210683e-02 5.111070948972654127e-02 7.497389268675798413e-02 9.835961938592437115e-02 1.752370696311557063e-01 3.777291958073545897e-01 3.850607196482105365e-01 1.852940510107582706e-01 6.418677019988683341e-02 2.725295674208640939e-01 4.852697239915088057e-01 6.121115550702334041e-01 6.200812977245502289e-01 5.382764121768490728e-01 4.584661855697649280e-01 6.698286853690915699e-01 1.163453853782236563e-01 3.665918084910380591e-03 1.511353019157871472e-03
9.600068737800275098e-04 7.551484540343459013e-04 2.243156739937141736e-02 6.212229983390148060e-04 8.001405434008016654e-03 4.035407167873256845e-02 2.243756181085207468e-01 1.823022938362582335e-01 1.795801209289263622e-01 9.019876965724767104e-02 3.309549667207731249e-02 8.873219593689619933e-03 8.606145672312773970e-03 2.187711559398317421e-02 4.850332403501984857e-02 2.198824896123333927e-01 2.320960422444482141e-01 2.754707604279920674e-01 4.871450503537330667e-02 8.647407516594872445e-02 3.002615430757994974e-01 6.359430936122455469e-01 7.713454125355070357e-01 7.879917092782844357e-01 6.414342375832208232e-01 6.069583199183694600e-01 5.549052234439809661e-01 4.399484255721830550e-01 1.952199045503951250e-02 1.286766504712825998e-02
2.344067256640954694e-02 1.139754760746099996e-03 2.107205473691559083e-03 1.460680324637663417e-02 3.245838493031761446e-02 4.586528394270968090e-02 1.445764964148414933e-01 1.798765150511624500e-01 1.238135199183634100e-01 9.651900980517479078e-02 2.030411394063829852e-02 1.987199190725681599e-03 2.984193970771239872e-03 8.250582882022516884e-03 1.750458011074865206e-02 1.011035288218888328e-01 3.886669553629805429e-02 1.264915217702947473e-02 4.296837575012412216e-03 3.118924401861707801e-02 1.157242164507931992e-01 6.022259021472434748e-01 7.479767398952263946e-01 7.723518531237330009e-01 5.567128723519231270e-01 2.534268653358154877e-01 4.035369815611316024e-01 2.770169770924648667e-01 2.498288264643554885e-02 9.863545359314045136e-03
1.007232632324001412e-02 1.299305563453694023e-02 8.728659721601778054e-03 1.087536064245788955e-02 2.578859290529897721e-02 1.481254417619439281e-02 7.638446847346017088e-02 9.847711904225775470e-02 9.119998743207362313e-02 2.154299448909656814e-02 5.419927605753623208e-03 1.145036528449742399e-03 1.979203129670616818e-03 5.685506714284509905e-03 2.193403627962710323e-02 1.436017952106895604e-02 2.647079392297559813e-02 7.934650963716292221e-03 1.503721374363718374e-02 7.083519477724713187e-02 3.715606788297898255e-01 6.890046390006119292e-01 7.270605731072873334e-01 6.823550607091174447e-01 5.167315739316042933e-01 3.726803706692918827e-01 3.560282773130934442e-01 2.399126630820910266e-01 2.160313911184677527e-02 7.691121320493352759e-03
2.779074478846382812e-02 2.557682248919768836e-02 1.330706525098516307e-02 9.670977753457607809e-03 1.270191884571486747e-02 6.836149846646571993e-03 3.903885647906055190e-02 3.486974720490517571e-02 9.623970016582189535e-03 5.256578563459653533e-03 1.821666209362642454e-03 1.452481479259052624e-03 8.628580670562819525e-04 4.712592665738329629e-04 1.203322093827135456e-03 3.975372899361204887e-03 1.431272840885718448e-02 3.302068761258499657e-02 3.210553407582588531e-02 1.429930179278124658e-01 3.819474273344084514e-01 5.444738663374876220e-01 2.185960903544379441e-01 3.239196254411240150e-01 4.124790865106018889e-01 2.302892351747769240e-01 1.699730485147821768e-01 1.396203603627684808e-01 5.118312946444309938e-03 4.627202020026772306e-03
2.249660001088793493e-02 2.602237602892282231e-02 3.883413219884701215e-03 2.714040061176304069e-03 2.246525907326005645e-03 3.365541358813057063e-03 4.821993844537644791e-03 1.205560936035873646e-03 1.566798119215001475e-03 2.509213999666011041e-04 3.361437868997979367e-04 5.204280254328605415e-04 5.791320973706375920e-04 2.050209066247838698e-03 5.705535312770047135e-03 7.242130635119883864e-02 1.389789731916779014e-01 2.029584668010488979e-01 1.398384960415102740e-01 1.053494418065147875e-01 7.332592248799008061e-02 2.587713154414491082e-02 9.881064251710994228e-03 2.102951387072074518e-02 7.527800313264307319e-02 2.519301247793497012e-02 2.307321397956084430e-02 7.792976274780955004e-03 8.857173307256233780e-04 3.206900369027469722e-02
4.843553118831486065e-02 3.745809772826704659e-02 4.075244086373637845e-03 1.761221939097988055e-03 2.583075979849352045e-03 2.018456944229377048e-03 3.127295135167129647e-03 3.344372893074498872e-04 2.817517709230052902e-04 9.961507619391860371e-03 2.998028012318666074e-04 5.759582127884731520e-04 7.751956822656075156e-04 4.195430808203907437e-03 6.871891328175991354e-03 4.267290318610465760e-02 1.561039924693662928e-01 2.933182233023744478e-01 3.351259184750187692e-01 2.916485193265322406e-01 6.130598621292721734e-02 1.351249450936516973e-02 1.650734364471301285e-02 3.989901198647530234e-02 8.804147338231413378e-02 2.575217867817006234e-02 9.839836714442631166e-03 3.702985243848374436e-03 1.160444356901891346e-03 1.045777698306963373e-03
6.121956129352021381e-02 7.815309735145405806e-03 2.175511773387334407e-03 7.101807144247857494e-04 8.008538416473517723e-04 1.748473897841757059e-03 2.255504761132300605e-03 2.028918028814492500e-02 1.134183638848616782e-02 1.301817312048893227e-02 2.291074214682686447e-02 5.009365649642650437e-04 5.765715141759495451e-04 3.247607458374042726e-03 1.277857659026971314e-02 6.190751111821807262e-02 1.199587996551762237e-01 2.774766749213016803e-01 3.502964426915021190e-01 2.964860841945174408e-01 1.464663211938280196e-01 8.349091767399997172e-03 5.853265841763375874e-03 1.253478772040690983e-02 7.173396206648120776e-02 4.272333913892954749e-02 3.838360320416946830e-02 7.206255301057512205e-03 1.037038702357511236e-03 3.546053186807845287e-02
3.441906315058609889e-02 1.069216048846338696e-02 4.166086535131152332e-03 3.860272809354976797e-03 8.463457861100557797e-03 5.769260281735713765e-03 2.387527947865546434e-03 9.738975025845016207e-04 1.451547022569401506e-03 1.904837983953199670e-03 1.421012060017135675e-02 1.590498513964848024e-02 3.211656932892710363e-04 7.495409999874031413e-04 4.643079936004472323e-03 1.925699742096130540e-02 1.953016962402732981e-02 8.395445623681895009e-02 1.080582524299817937e-01 9.285997363382868242e-02 7.732915110693341920e-02 9.889227494530189802e-03 1.505784239111617687e-03 2.922105592367425439e-03 1.289699121251754524e-02 3.214640815689514403e-02 8.623998987128955740e-02 4.827078553913079911e-02 1.193281262065334740e-03 8.823327096428917535e-04
1.234940824148695465e-02 4.915591058496078178e-03 5.260576494939557535e-03 8.820624412363441136e-03 4.749838659180461234e-03 2.122863652321593016e-03 9.757664628059976083e-04 6.827722058434576233e-04 2.150369098449579283e-03 8.376229364195669075e-03 5.714453631834892113e-04 1.563406495313750255e-02 3.413790493844173985e-04 7.741482740210252735e-04 3.778628014221883241e-03 6.911419864911294737e-03 4.826658342149105219e-03 2.421009013309369240e-03 3.855026129935598418e-03 7.062320515386458740e-03 1.255738048714589300e-02 2.864292907964537376e-03 1.475920582710195123e-03 7.535690855872064463e-03 1.836332483274525501e-02 6.512237453733178347e-03 2.242142716782747486e-02 2.495309262587590976e-02 8.806876219370343012e-03 1.326178328794564397e-03
1.252179923542214024e-02 1.008486723063474651e-02 4.922800579512118593e-03 3.591893499750024865e-03 3.296126488537909262e-03 1.234222533178564981e-03 8.149088982531518029e-04 8.314645397587152285e-04 9.134969697334204865e-04 3.667516152978972377e-03 1.036959250310121646e-03 9.854433298639886808e-04 9.519052238859202885e-04 1.226761513548941043e-03 3.663587330266144561e-03 2.633421390206048401e-03 1.879378853363804659e-03 1.180621649100031942e-03 1.085580751513611593e-03 8.603955781581512554e-04 6.990686469459444705e-04 1.041248342903833843e-03 1.687011117659852327e-03 4.296604548435523432e-03 7.681553686693026045e-03 3.743922294914112450e-03 6.043171533727121486e-03 3.997439887919390124e-03 4.009536415120066970e-03 2.561529348651699414e-03
1.696598669979113710e-02 8.879373795839837907e-03 5.059762179784257560e-03 6.888117543131597881e-03 5.965578221792859279e-03 3.231329722101505125e-03 1.103134662005173308e-02 8.333127063827838049e-03 1.229604551776611408e-03 8.969564784900825941e-04 3.202643916525209702e-04 7.349679397836043427e-04 2.234474025203695650e-03 2.570965783207235320e-03 8.257298635995419245e-03 6.410925310024572464e-03 2.146612949305336162e-03 2.682117453215906132e-03 1.298053402444578064e-03 5.811655866934902544e-04 5.337519936553308201e-04 8.237158268088757423e-04 1.294768764215464742e-03 4.221965249038766438e-03 4.535608376745280806e-03 1.129437486827529740e-03 1.293423445763626240e-03 1.675372707959970654e-03 5.472063066586652091e-03 1.131361731052829382e-03
2.277771970031290671e-02 1.978381429409820785e-02 6.008170582417697581e-03 2.047997675019615216e-02 2.341486627996199749e-02 4.401179094809280767e-02 2.962689228859743604e-02 3.361784971578302660e-03 1.211963062595914492e-03 7.048418487782955825e-04 1.666137935693702901e-02 2.606856472884907941e-04 3.351814448028385385e-04 1.409158381673145327e-03 1.852228889805955948e-03 8.713371325708653328e-04 9.035728286038804437e-04 1.155243245943753019e-03 1.654842900974081051e-03 9.082577309140016202e-04 2.899477466795268715e-02 6.662324241590883867e-04 7.472960064360525869e-04 1.360067764219993454e-03 4.626114109428274349e-03 7.772316017813125791e-04 1.175255491454908286e-03 1.975911704242763398e-03 2.421591045040112980e-03 4.882545676684858608e-03
1.247951242303336344e-02 3.116516386428739432e-02 9.291357083847064796e-03 9.892789635889423505e-03 4.721907143092382575e-02 4.964004966167550464e-02 3.309532102651027013e-02 2.272771189587997898e-03 1.604119189556059855e-03 1.541576661559469329e-03 6.428697759333591374e-04 3.223114983404797604e-04 1.614736095006534186e-02 4.049400175444770023e-04 2.073391766128157825e-03 6.440878780457192504e-04 2.454657257040021058e-03 1.570987914097913066e-02 2.925449242446874140e-02 4.098426456204687374e-03 7.930757266902445108e-04 1.000137919480699380e-03 8.477990401057871727e-04 1.007153847668186943e-03 1.450454938246559331e-03 1.190361656524839724e-03 1.468653833231142822e-03 1.851721878523613415e-03 2.540385992008705254e-03 6.329673868874721374e-03
