2.697435871608685076e+01 1.071452351543025472e+01 3.211930387920592977e+01 9.388400214365464791e+00 2.899965425831522481e+01 1.303839091133332673e+01 1.164260283480051328e+01 3.195564530340365650e+01 5.897647796096876505e+01 2.657424227857439547e+01 1.489718185791951299e+01 1.770125336147176753e+01 1.125514714781041548e+01 9.254917691633519183e+00 1.092978026641672784e+01 1.289317362184097249e+01 8.681957447938076555e+00 1.343421559183187775e+01 1.381091380778376809e+01 4.462233786468075891e+01 3.826462522696373725e+01 5.680383946637386217e+00 4.430294158852139397e+00 1.801064491650978638e+01 3.582369252949153804e+01 2.893305563067030306e+01 1.379082365486772233e+01 1.234335238805221113e+00 1.197577170717234685e+00 1.537183820788943445e+00
1.752883262632297345e+01 1.125130008304375551e+01 1.521587990527124035e+01 1.337266724812369389e+01 8.076038840893092541e+00 3.834437502096842820e+01 1.776428636918507209e+01 2.266960501229615588e+01 1.443410662279618784e+01 1.183452446767821620e+01 1.006960644516995629e+01 9.266097237575973367e+00 1.354804742777516857e+01 3.307338139155663725e+01 1.131539344025272520e+01 3.595166902381778584e+01 8.596113438315184041e+00 2.550566897099034946e+01 2.195076412633464358e+01 7.729819884442701294e+00 2.348173316865088367e+01 5.618015606834282138e+00 1.198697861104625417e+01 1.097995409982147486e+01 1.006770406377593652e+01 1.409197540283584260e+01 5.233071954431474104e+00 1.325988550446303815e+00 1.869388184749660065e+00 1.859372473605366505e+00
3.915450417506438896e+01 4.081133746200291057e+01 8.165402992477055477e+01 6.622142665346564172e+01 1.489321514154485442e+02 2.033720618074520914e+01 1.573852495847296495e+01 1.680537726210837590e+01 6.162407125879920500e+01 1.633532460925802710e+01 4.470688395419900019e+01 3.228436562526328402e+01 1.402478305776694967e+01 2.401275674627105161e+01 2.202801842755818384e+01 2.150400011810256728e+01 1.352483406632395102e+01 2.569821596156420185e+01 8.910222049070139860e+01 1.745736635644244217e+01 1.519023863406940222e+01 4.824122571133676374e+00 7.598034254344199212e+00 2.771171742495390333e+00 1.743008396328736387e+00 1.229259580242235916e+00 1.175214771241954059e+00 8.821734982925932833e-01 1.436765100802930739e+00 1.557591292516442127e+00
1.749431209121559760e+01 5.184766508651060235e+01 1.137856208981231561e+02 9.165288123347372107e+01 4.232416422827109415e+01 3.148884598000114110e+01 3.124047544913758045e+01 1.958254851244490169e+01 1.093012898632049712e+01 1.957306564021880035e+01 1.212004930349117160e+01 2.444210923377428557e+01 1.456519643575765244e+01 1.371438484619463871e+01 1.639496150226858617e+01 1.443225115364695910e+01 3.218035229390768848e+01 9.337419409525070435e+00 6.794742691218347730e+00 6.577167426380790438e+00 2.690470561192671894e+01 1.026430019719195563e+01 3.465625261826368764e+00 7.083209202103379454e+00 1.392263538716855376e+00 1.089671470695764866e+00 1.006179978378395123e+00 8.957792633267582794e-01 1.701871606724504105e+00 1.770250818711074370e+00
1.039293043449393039e+01 3.362453991878799542e+01 9.371076816729816983e+01 3.631248059705444575e+01 2.444719329392812313e+01 1.853739164120091587e+01 3.198433605453782747e+01 1.799868303317553142e+01 6.741964623564326686e+00 4.374172731183293195e+01 5.065603868000015098e+01 4.559177840664606407e+01 9.334482971834288989e+00 3.852065677889581252e+01 2.062084691440945861e+01 8.454076124614790189e+00 1.609299310609193512e+01 8.312471221686061895e+00 1.345167682230143313e+01 8.139486307103716456e+00 6.105798284812856025e+00 1.429896147775237836e+01 3.592257674845878057e+01 1.126391829396406763e+01 2.388753573550967069e+00 1.388494127864329020e+00 1.038847057373446514e+00 1.126490724574425561e+00 1.642812350802305366e+00 5.767470330172958626e+00
1.258260733573863099e+01 1.409963216172544342e+01 5.827292916333800576e+01 4.401413500455825556e+01 1.885956865314561881e+01 1.063991731531847407e+01 1.330024148809681606e+01 1.403785459460169704e+01 1.144657903315881953e+01 6.294432655824950018e+01 4.909809459000006626e+01 2.846033513579290997e+01 1.674260937536298854e+01 6.340424809149761032e+00 5.429462198942207607e+00 9.411691755708101681e+00 9.355951284851190763e+00 1.325358256413338509e+01 6.598122745671383349e+00 2.209694360462135165e+01 2.969960323139082092e+01 2.186814671024125190e+01 4.287116747606731337e+01 6.400629100503982372e+00 3.418683961654129355e+00 3.488650639146651855e+00 2.344380006508649306e+00 1.510042591817623681e+00 1.849447631845418272e+00 3.169489226679113258e+00
1.003316855065808966e+01 1.574413208838062772e+01 1.564806062898714067e+01 1.591761626361157056e+01 6.807628812763491410e+00 1.215166764528399135e+01 1.952107243830988281e+01 1.071560066507921150e+01 1.271281424719811781e+01 1.373507146739085272e+01 1.212396052402058011e+01 1.997285377272810436e+01 9.212049858323387852e+00 4.294748152396822505e+00 2.531828315424295539e+00 4.585944392057165864e+00 2.674604777379388310e+01 1.232422620909824218e+01 9.956607224423313696e+00 1.409968678718575852e+01 7.444283972285095530e+00 1.316955972636401739e+01 6.063845999888312299e+00 5.540486811568768211e+00 2.233852613237055973e+00 2.496913903452723904e+00 2.365999235279724999e+00 1.909384074543915233e+00 2.046324131320571116e+00 4.621312320591878908e+00
2.039758530961769623e+01 3.868981233407208009e+01 2.171987262838857191e+01 9.642362008234458770e+00 1.281074192744814511e+01 1.434308046823928429e+01 1.257220477621835641e+01 1.080727804424484617e+01 9.765112825338249536e+00 2.793784696675383827e+01 1.166358877893370050e+01 3.636281263850467838e+01 7.868498510234649856e+00 2.815769672842037163e+00 3.192660913902569675e+00 6.076841222054319758e+00 9.073258257962706352e+00 1.357713174335402861e+01 1.161931797755078222e+01 9.086045351384623103e+00 1.777510951283039020e+01 1.001266336447129390e+01 3.865551810125960941e+00 3.241340306206349720e+00 1.623152020836363452e+00 1.817948155902738172e+00 2.998525371303858655e+00 3.403207650406048224e+00 3.225670989549539236e+00 8.975011961222685741e+00
1.570190408878096910e+01 3.114567365612898442e+01 1.839336279588991374e+01 2.261937800657194586e+01 1.401140077737378675e+01 2.852994719337415219e+01 2.214071977311750317e+01 9.672371383633738162e+00 9.293786288990698807e+00 9.647743360777509380e+00 3.637970639882661317e+01 1.116603344186628632e+01 2.020456458850918580e+01 1.172680985299735568e+01 1.044487315724340704e+01 9.005500020945955697e+00 6.924800178361449454e+00 2.052881960630129754e+01 2.219326351500733807e+01 2.383564142475694680e+01 4.634712786532356077e+00 4.510208076353857010e+00 4.751167343793257558e+00 3.097474692996109447e+00 1.874204128422176430e+00 3.023211245886823662e+00 1.200173805399913185e+01 2.157163515741638804e+01 9.104759119316943483e+00 2.744800516148082181e+01
1.738027656134773835e+01 1.201097519513672474e+01 1.939185503577193259e+01 1.412950997556120569e+01 1.387855287597215082e+01 1.344187484838780122e+01 1.717658449030318479e+01 2.891503388025373766e+01 1.348106926136887651e+01 4.883286510504198930e+00 1.413469060670379740e+01 1.287621588964604058e+01 2.298186832326257800e+01 2.524400269687321696e+01 1.213851109296931341e+01 1.316127488016344671e+01 7.030161212201460330e+01 7.416519279997355341e+01 3.354387758967241950e+01 1.726218218088872192e+01 5.788241085332021640e+00 3.402024895510466607e+00 3.849944697238532498e+00 4.240836767212706526e+00 2.395669940247844742e+00 3.188259602218111777e+00 3.098166651004555661e+01 4.757256388229694011e+01 8.767159868567304670e+00 1.400332915718379212e+01
1.496865777067958092e+01 3.077549026238806817e+01 1.504235410060360678e+01 1.101306319234599940e+01 1.719007566898441652e+01 8.241986923659638364e+00 7.896657723076817348e+00 7.137233311947181136e+00 4.907145185233099838e+00 3.958796694882317979e+01 1.010981036145779655e+02 1.589225858529056268e+02 3.232690118577583576e+02 1.540519702870004437e+02 2.752556293044851188e+01 5.242130809671505176e+01 9.881861995357378703e+01 2.798867495796795168e+01 7.542935627329468318e+00 9.470296432412904863e+00 3.853365468746148714e+00 3.247147355934267843e+00 4.183884655008203168e+00 5.890169639987302475e+00 6.346142589696260217e+00 3.512501329919834880e+00 5.681892548940205678e+00 4.205247740869517692e+00 3.620899304211820713e+00 2.501919658547731906e+00
1.333706545500414542e+01 7.304109763586600579e+00 1.543889534290826049e+01 1.440394276417280928e+01 1.227542497287688050e+01 1.308348805303616302e+01 6.001064434211258458e+00 4.112348882319164289e+00 5.037405524875007146e+00 1.485801326404705236e+01 3.253757659975836702e+01 2.010406323116804117e+02 3.488993978595914314e+02 1.725495390163611376e+02 5.956315832262533405e+01 6.436262303444868849e+01 7.050010101684840436e+01 4.160115864130165164e+01 1.139703426619434623e+01 2.074203486974263200e+01 3.522788875474078374e+00 3.458637971303722747e+00 4.107930319907833194e+00 7.391131018081489756e+00 7.074013221057189327e+00 5.088650675414988278e+00 3.941913515132384305e+00 3.487258325071978859e+00 3.688160162519726448e+00 3.880702204457292304e+00
3.035737860636410268e+00 7.302520795790542252e+00 1.656422409147944919e+01 1.426706397327804510e+01 3.125197334282041339e+01 1.083198174089916321e+01 6.031789086054462956e+00 5.328311499052042599e+00 6.996967071807510763e+00 7.707080401867326458e+00 1.394572763982283092e+01 6.863009048529676193e+01 2.729936753810000027e+02 1.097891549531958901e+02 3.255788832490458162e+01 3.563014978215603890e+01 1.277674706382157765e+01 1.831463685787369755e+01 2.184626392433189679e+01 8.420244428546585169e+00 3.438241343933754912e+00 3.618205201222416623e+00 4.574468860881491850e+00 7.655532600823514500e+00 9.780749993461073544e+00 8.758861131027128266e+00 6.522708507223976326e+00 5.961448675472147407e+00 4.915253089059583580e+00 3.964336958649024467e+00
2.570987990184865346e+00 7.306721772973171269e+00 1.286982837469597385e+01 9.312399322294538706e+00 5.589207606844624365e+00 2.248153852057322055e+01 1.553261452593823755e+01 1.160473050966117725e+01 1.021358254375576280e+01 3.254688738675845627e+00 1.186502044061965222e+01 1.227922240333945325e+01 1.312000788903391140e+02 1.637528408652156031e+02 1.624155966097957275e+02 2.049998534330942448e+02 1.752497872463449653e+02 1.085021898159978235e+02 2.840262688123908674e+02 1.288486252113785895e+02 1.168309535412313238e+01 2.174084132281166148e+01 1.644262528677521829e+01 3.944959275525030051e+01 1.538583263046782967e+01 1.268073545826394088e+01 3.360451899598428582e+01 1.160095137611146754e+01 6.595209255065912934e+00 7.352042020178997994e+00
2.390280840519952932e+00 2.416478882760276559e+00 6.628283702234591956e+00 4.988205746990560385e+01 1.839560083216824893e+01 4.214940587485861201e+00 9.442955943335437752e+00 2.420336611800958337e+01 1.806271241626750879e+01 1.274264624132644386e+01 2.649683745351671504e+01 6.375402534478040195e+01 1.245477627982927800e+02 1.450257638418119086e+02 1.210016366609910250e+02 1.357353708961114478e+02 2.162135947884583516e+02 3.504331211395330001e+02 3.370753172526755179e+02 2.548092607885106133e+02 1.151527099420514233e+01 1.251542704477272494e+01 1.171364236202690279e+01 3.332896916049696046e+01 4.391709644245095490e+01 2.037380171093817864e+02 2.000762980246117877e+02 4.206130761661480477e+01 6.642836253672752100e+00 4.889826644148119961e+00
2.171907564418202874e+00 2.400615978937366002e+00 5.484876243208870683e+00 6.117523503554370023e+00 4.143479366986390744e+00 4.486467234413051841e+00 2.783881585937517400e+01 1.262344310121275903e+01 2.801088033447181402e+01 1.077996690522567214e+01 1.156650646626837897e+01 1.025616513093652316e+01 7.542269410611814351e+01 1.397360992020403501e+02 1.199548000992770938e+02 1.697583590018231519e+02 2.694880724707525701e+02 3.023622350193472244e+02 1.631274672720534795e+02 3.386409077057984263e+01 1.993012831492870518e+01 1.345554069218626125e+02 1.932379827591134926e+02 3.095485952504922125e+02 2.755711171103254742e+02 3.453560917240857293e+02 2.689557624355486496e+02 7.948957090796025682e+01 9.527621057155922557e+00 5.331492580141064863e+00
2.752040717110661117e+00 3.231095743465633774e+00 3.195183076373552922e+00 3.043796199126903801e+00 4.526292039510037668e+00 8.375602350419002917e+00 7.216484193508981093e+01 2.499448840825489810e+02 1.263884513705585277e+02 2.257272691320702407e+01 1.776744522989286779e+01 2.973061779017472972e+01 5.818007904827008758e+01 7.791945384977077538e+01 9.404006558763778401e+01 1.550760385868763365e+02 3.008723028129996919e+02 2.757795313857118344e+02 1.204416425582652153e+02 3.892972162169882466e+01 1.628935224728552100e+02 2.873503013055003521e+02 3.600135016782224966e+02 3.486627693033551054e+02 2.880239889055029607e+02 2.373930745783364387e+02 3.403051822214656568e+02 6.055247121817252065e+01 1.233367504956379079e+01 6.444323098957170259e+00
6.817958846234688508e+00 5.461261435076891324e+00 2.743649611784967579e+00 4.096342979894462388e+00 7.204068931877891657e+00 3.566793793167847326e+01 2.040424640140371935e+02 1.736727413792380048e+02 1.795465673588795141e+02 9.323995824261672283e+01 3.717322806035015503e+01 1.152585733984142280e+01 1.118125933682831530e+01 2.524732141468228974e+01 4.938729726840153944e+01 2.084750648126905048e+02 1.935479837610249660e+02 2.041730007337484381e+02 3.234222128699677512e+01 5.313006662878976982e+01 1.785982724047669876e+02 3.717202020475155564e+02 4.437298160662381292e+02 4.283983734028408321e+02 3.284101605184018808e+02 3.007514527587300677e+02 2.710925124782101534e+02 2.157988110411122875e+02 1.157365483355667379e+01 7.958266664411453917e+00
2.829306097124267616e+00 7.958841677688325511e+00 1.469509754731314644e+01 1.370484862322781794e+01 3.058529745462545790e+01 4.490536027920958873e+01 1.474739696455505964e+02 1.929846861912022860e+02 1.393687984030107145e+02 1.113137925338814256e+02 2.559404417842374357e+01 1.957448799866206812e+01 2.887268814676373552e+01 1.065909219119615159e+01 1.895062143207327310e+01 1.026523744942331149e+02 3.482141502729617599e+01 1.009964679885781180e+01 1.817467026231283356e+01 2.051453687257546221e+01 7.277398654816616386e+01 3.665947201054778475e+02 4.410257109746083870e+02 4.240806318120472156e+02 2.843219693024717571e+02 1.230275349140495678e+02 1.905078220638119149e+02 1.301234614866926336e+02 1.564034792744095270e+01 3.525671529642993107e+01
8.722890701779846268e+00 1.204897042484754799e+01 8.470933880543103811e+00 1.099524405504443081e+01 2.717803327724342921e+01 1.656052946527239200e+01 8.951184658263558447e+01 1.218231527485383765e+02 1.182635520538881622e+02 2.900284967669115588e+01 8.199813821231929367e+00 1.318612427904804107e+01 2.196344061966250649e+01 8.343564558091149053e+00 2.641125440624238152e+01 1.615687944626059291e+01 2.606219853332224190e+01 6.883388804932043747e+00 1.166152205350256033e+01 5.043041532703508523e+01 2.489486924440089126e+02 4.390165627769271737e+02 4.409692066115593434e+02 3.798661047664687658e+02 2.642755112645409667e+02 1.775829421766045186e+02 1.619945682050703795e+02 1.111030187315399900e+02 1.518541049948693100e+01 2.750375912441425896e+01
2.398647974837526320e+01 2.408684282832432189e+01 1.428339256222586329e+01 1.194002757519181301e+01 1.683467629510707297e+01 9.233570511346833598e+00 5.420148849827371151e+01 5.266704136938495395e+01 1.540881542138545868e+01 8.470874961146975579e+00 2.341652813313801573e+01 1.931236856042855976e+01 1.070121583296731416e+01 5.049921619902686842e+00 1.097146436844603556e+01 3.197091359353884599e+01 1.555149415650861755e+01 3.134010089917516950e+01 2.730538656837766354e+01 1.109754261673329410e+02 2.759284378178775228e+02 3.661199025310107800e+02 1.372490718699174579e+02 1.835208701019301145e+02 2.109640759779144616e+02 1.078447301088371972e+02 7.785916993986560897e+01 6.598872243157612161e+01 1.537960111178264455e+01 1.649572976054183471e+01
2.053198846202329975e+01 2.722797829976461514e+01 3.333371694390456241e+01 2.872235159360927881e+01 2.754616469651475796e+01 5.423046141282061861e+00 7.582530582291851395e+00 1.659925370386487131e+01 2.359750172115812461e+01 3.760936959729464846e+00 5.007844135458727308e+00 7.609301098681111597e+00 7.656729701925717002e+00 2.403734737474688288e+01 9.088137083881825617e+00 9.153660080041689184e+01 1.560984955081852661e+02 2.013539449211076544e+02 1.254875221225181861e+02 8.608389404179989413e+01 5.491084955535008305e+01 1.780439969500190500e+01 6.291351761222987449e+00 1.207317236139565608e+01 3.873555184802529539e+01 1.293533257321399432e+01 1.233900501106473158e+01 2.254346609547881997e+01 2.830788879780420153e+00 2.614178469834006702e+00
4.735360354676359407e+01 4.269225947899916918e+01 3.769479243984346795e+01 2.104636534065376807e+01 3.533056001368566257e+01 2.844832641966521436e+01 5.188689136044679628e+00 5.184219937346484564e+00 4.713817325446997941e+00 1.971765188191666685e+00 4.583789635850460620e+00 8.415039248310769437e+00 9.985559153083389816e+00 4.626180146738290944e+01 1.052133961950689489e+01 4.779852455926587851e+01 1.597357074855426902e+02 2.736553050481586524e+02 2.862454027138646779e+02 2.279161625936074813e+02 4.553696972884220173e+01 1.017626160630178944e+01 1.154555675126983871e+01 2.466054079674406552e+01 4.632140995281961438e+01 1.378906535944038936e+01 2.713218715083826638e+01 1.093631087081881148e+01 3.949950587550062231e+00 3.749699824431493411e+00
6.568155212503687324e+01 9.757293804803509829e+00 2.139230098805051483e+01 8.709892354426393979e+00 1.111574261707614397e+01 2.539896856926673507e+01 3.412364648704166115e+01 3.985822376940174827e+00 2.271351852868816135e+00 2.528171967173017176e+00 4.376927414746890399e+00 7.305268130040492913e+00 7.337661674000980128e+00 3.515464379552126672e+01 1.858417513903156504e+01 6.691220799403680530e+01 1.134922461931942195e+02 2.430615983257870028e+02 2.861310559651407743e+02 2.247953680482474397e+02 1.062937494274615631e+02 3.491867619852218496e+01 2.282900586892977657e+01 8.755746005555311129e+00 4.199769019556516980e+01 2.492175245622100377e+01 2.419168755663107362e+01 1.935479601802911276e+01 3.247241078074277087e+00 2.897382843586498780e+00
4.110974393512725555e+01 1.410158045144087779e+01 4.505780340246451487e+01 4.731942310661858642e+01 1.355225983702364090e+01 9.488836533008148777e+00 3.622212583640949646e+01 1.543527548062859012e+01 2.330154562366427484e+01 2.912911285735810196e+01 2.633595669265690997e+00 2.966255532827044128e+00 4.135878143130254259e+00 8.104196649548104148e+00 4.055521904525675581e+01 2.281106928485026586e+01 1.844837071854115607e+01 7.556318906313097727e+01 9.077932806406860777e+01 7.222705562187314854e+01 5.981899749480655260e+01 9.118971284433277091e+00 6.463266782760959117e+00 1.039816163588823628e+01 1.268374056322022625e+01 2.126296028978559960e+01 5.894682348290628227e+01 4.012064302868105869e+01 3.903939664306389723e+00 3.370247465418327870e+00
1.502171807931308578e+01 6.452813490425794996e+00 7.505498737033851064e+00 1.369977410473244461e+01 7.750040214958968221e+00 3.078584159840266210e+01 1.475624590468742880e+01 1.078967853389096199e+01 3.459103040299470422e+01 1.350674347053351987e+01 8.506060293200832234e+00 2.944156194529151449e+00 4.533282714697840277e+00 8.610611151658705609e+00 3.520997664948101402e+01 1.115164853216369956e+01 3.490059667211744454e+01 1.594439193735083471e+01 2.287141939669252722e+01 3.780967352946263560e+01 1.184318806406821167e+01 1.414027587676507025e+01 7.026162242246888567e+00 3.212714417361858921e+01 3.782931487280842475e+01 2.255524615355278328e+01 2.673764175068691173e+01 3.686458613519931049e+01 3.190340380075866733e+01 5.396769617254073559e+00
1.523512054068759092e+01 1.263165878769568451e+01 6.451357058982673642e+00 4.375684030572300287e+01 4.558044553929248366e+01 1.798756670539179225e+01 1.225298661613200935e+01 1.296512975275624235e+01 1.460329294749241669e+01 5.617727742061208573e+01 1.552426939006923590e+01 1.487437160311132445e+01 1.259806182008320263e+01 1.293385281899257144e+01 3.223172762717612727e+01 2.105503032564543631e+01 1.441275772245170472e+01 8.801926694883157154e+00 7.531882225700437417e+00 5.513046397061433623e+00 4.273070942210233980e+00 6.120542702944389291e+00 9.110203350169877368e+00 2.082728352821781215e+01 3.521275466672818766e+01 1.576022430391213014e+01 2.399535392752571994e+01 1.619739576201210696e+01 1.650094757056597672e+01 1.084678831995589832e+01
2.067983201202912369e+01 1.113529413049898231e+01 6.633966490142565675e+00 9.698289124957984342e+00 9.262913766253749515e+00 4.602202695402115751e+01 1.701563483810176081e+01 1.309611397810414424e+01 1.982045109716273146e+01 1.388657603811956776e+01 4.866701051289534341e+00 1.109669918493231400e+01 2.948859170107189343e+01 2.713883463156523845e+01 1.667441790884146258e+01 1.223872809818013785e+01 1.635979811107719328e+01 1.908489998906313545e+01 8.537681447882079055e+00 3.705155264605181742e+00 3.504622289565720639e+00 5.407300453358552694e+00 8.054108507896097890e+00 2.369739014626575724e+01 2.356942330030148725e+01 5.484824460667724111e+00 6.017532908710538919e+00 7.533020225791667634e+00 2.408091916747125794e+01 4.932412179193454094e+00
2.763433898178426773e+01 2.469651679663219568e+01 7.695181550029325024e+00 2.755261979253265636e+01 3.446855171472384427e+01 6.611505437121620332e+01 4.525105763032323836e+01 5.147674336612085710e+01 1.955813360337522511e+01 1.094448464079549055e+01 3.154875280108476510e+00 3.915939537809440374e+00 4.432886836430481203e+00 1.508281827132957176e+01 1.688855004529910175e+01 6.979137867205711387e+00 5.783191208337512990e+00 6.153464928786613442e+00 8.182947159571284601e+00 4.627473926714252173e+00 3.196073390109835266e+00 4.720110288109949259e+00 5.313875950827750216e+00 8.549095063847156339e+00 2.607511722134739784e+01 4.000831754582804045e+00 5.689635091895706154e+00 9.070919421383424108e+00 1.069268165089902567e+01 2.128733772890395315e+01
1.454748788361134970e+01 3.729955602605389231e+01 1.151523874098912970e+01 1.294402322467727195e+01 6.679307212730518017e+01 7.168830507941552810e+01 4.869542890438212623e+01 3.453836294389655848e+01 2.552470212000006455e+01 2.314544606345171474e+01 9.172934310266580127e+00 4.433534256622260195e+00 2.687084536875977925e+00 4.314811139348802449e+00 1.929020136961517906e+01 5.016473791928878434e+00 1.374155673871505456e+01 1.668074674508118704e+01 2.965287637770650875e+01 1.734227385831789192e+01 4.350501644639533261e+00 6.066034961175484241e+00 5.284410225334184474e+00 5.659344772631395237e+00 7.343518847574980413e+00 5.470884704184613589e+00 6.309700414538365720e+00 7.635004252410631409e+00 1.002632024279111533e+01 2.465638922122520427e+01
