24.3875764441631 24.3875764441631 24.3875764441631 24.3875764441631 24.3875764441631 24.3875764441631 24.3875764441631 24.3875764441631 24.3875764441631 24.3875764441631 24.3875764441631 24.3875764441631 24.3875764441631 24.3875764441631 24.3875764441631 24.3875764441631 24.3875764441631 24.3875764441631 24.3875764441631 24.3875764441631 24.3875764441631 24.3875764441631 24.3875764441631 24.4280779647209 24.4977334412364 24.5664678777414 24.6342827770071 24.7426354509789 24.8524855321752 24.9632545317738
24.3875764441631 24.3875764441631 24.3875764441631 24.3875764441631 24.3875764441631 24.3875764441631 24.3875764441631 24.3875764441631 24.3875764441631 24.3875764441631 24.3875764441631 24.3875764441631 24.3875764441631 24.3875764441631 24.3875764441631 24.3875764441631 24.3875764441631 24.3875764441631 24.3875764441631 24.3875764441631 24.3875764441631 24.3875764441631 24.3875764441631 24.4571479910429 24.5753505935243 24.6926323954744 24.8089948993242 24.8696304846453 24.9309311589109 24.9931505128715
24.3875764441631 24.3875764441631 24.3875764441631 24.3875764441631 24.3875764441631 24.3875764441631 24.3875764441631 24.3875764441631 24.3875764441631 24.3875764441631 24.3875764441631 24.3875764441631 24.3875764441631 24.3875764441631 24.3875764441631 24.3875764441631 24.3875764441631 24.3875764441631 24.3875764441631 24.3875764441631 24.3875764441631 24.3875764441631 24.3875764441631 24.4871406196892 24.6538893575304 24.819717534302 24.9838743486308 24.9957066634926 25.0084589218077 25.0221296211286
24.3875764441631 24.3875764441631 24.3875764441631 24.3875764441631 24.3875764441631 24.3875764441631 24.3875764441631 24.3875764441631 24.3875764441631 24.3875764441631 24.3875764441631 24.3875764441631 24.3875764441631 24.3875764441631 24.3875764441631 24.3875764441631 24.3875764441631 24.3875764441631 24.3875764441631 24.3875764441631 24.3875764441631 24.3875764441631 24.3875764441631 24.4957610724535 24.6748814756373 24.8540021678357 25.0305466292813 25.0305466292813 25.0305466292813 25.0305466292813
24.3875764441631 24.3875764441631 24.3875764441631 24.3875764441631 24.3875764441631 24.3875764441631 24.3875764441631 24.3875764441631 24.3875764441631 24.3875764441631 24.3875764441631 24.3875764441631 24.3875764441631 24.3875764441631 24.3875764441631 24.3875764441631 24.3875764441631 24.3875764441631 24.3875764441631 24.3875764441631 24.3875764441631 24.3875764441631 24.3875764441631 24.4974625781763 24.6765811317007 24.8556999742252 25.0305466292813 25.0305466292813 25.0305466292813 25.0305466292813
24.3875764441631 24.3875764441631 24.3875764441631 24.3875764441631 24.3875764441631 24.3875764441631 24.3875764441631 24.3875764441631 24.3875764441631 24.3875764441631 24.3875764441631 24.3875764441631 24.3875764441631 24.3875764441631 24.3875764441631 24.3875764441631 24.3875764441631 24.3875764441631 24.3875764441631 24.3875764441631 24.3875764441631 24.3875764441631 24.3875764441631 24.4991637945842 24.6782804987635 24.857397491929 25.0305466292813 25.0305466292813 25.0305466292813 25.0305466292813
24.3875764441631 24.3875764441631 24.3875764441631 24.3875764441631 24.3875764441631 24.3875764441631 24.3875764441631 24.3875764441631 24.3875764441631 24.3875764441631 24.3875764441631 24.3875764441631 24.3841428376728 24.3762493614004 24.3692871829518 24.3632548011803 24.3635787330516 24.3652452935747 24.3669100550597 24.3697493911858 24.3761387976792 24.3816020176225 24.3861405522834 24.4986852629026 24.6751064500609 24.8524481075342 25.023221920958 25.0264566881011 25.0287721797045 25.0301698971693
24.3875764441631 24.3875764441631 24.3875764441631 24.3875764441631 24.3875764441631 24.3875764441631 24.3875764441631 24.3875764441631 24.3875764441631 24.3875764441631 24.3875764441631 24.3875764441631 24.3640910465653 24.3076545414225 24.2521490918215 24.1975731969559 24.1893014090824 24.1909677036949 24.192632199556 24.2067730978838 24.2617064269308 24.3157138101902 24.3687967485895 24.4691850605962 24.5970595154752 24.7258542012524 24.8514981893184 24.9032780311295 24.9541388363572 25.0040821060619
24.3875764441631 24.3875764441631 24.3875764441631 24.3875764441631 24.3875764441631 24.3875764441631 24.3875764441631 24.3875764441631 24.3875764441631 24.3875764441631 24.3875764441631 24.3875764441631 24.3431064888327 24.2381279443552 24.1340802131556 24.0309617947671 24.0150240485493 24.0166900772563 24.0183543074989 24.0447225344388 24.1481987963954 24.2507493533092 24.352375705768 24.4387627978421 24.5180915104701 24.5983402145977 24.6806931866355 24.7810171133586 24.8804222424362 24.9789100745898
24.3875764441631 24.3875764441631 24.3875764441631 24.3875764441631 24.3875764441631 24.3875764441631 24.3875764441631 24.3875764441631 24.3875764441631 24.3875764441631 24.3875764441631 24.3875764441631 24.3211894022017 24.1676698076723 24.0150807841741 23.8634208315808 23.8407466514565 23.8424124142636 23.844076378893 23.8835974649124 24.0356156703882 24.1867084115484 24.3368771886409 24.4074187095784 24.4382026697306 24.4699063820012 24.5108066787559 24.659673700888 24.8076221642956 24.9546535693595
24.3875764441631 24.3875764441631 24.3875764441631 24.3875764441631 24.3875764441631 24.3875764441631 24.3875764441631 24.3875764441631 24.3868087901996 24.3617957923088 24.337717617982 24.3145727671978 24.2343224103229 24.0798462275088 23.9244373333095 23.7680972281262 23.7446062590449 23.7446062590449 23.7446062590449 23.7859335707591 23.945247120829 24.1054846769202 24.2666447384827 24.3334835385808 24.3528962527815 24.3713876562442 24.4020186052191 24.5811269331923 24.760235549138 24.9393444527422
24.3875764441631 24.3875764441631 24.3875764441631 24.3875764441631 24.3875764441631 24.3875764441631 24.3875764441631 24.3875764441631 24.3846330772199 24.3110798638946 24.2384612308354 24.1667756783606 24.0803878340068 23.9744541510078 23.8675879991496 23.7597908784941 23.7446062590449 23.7446062590449 23.7446062590449 23.7743438342178 23.8851134589563 23.9968068492823 24.1094225049865 24.1923912477138 24.2603464717194 24.32738062462 24.4037125436157 24.5828190240875 24.7619257925178 24.9410328485926
24.3875764441631 24.3875764441631 24.3875764441631 24.3875764441631 24.3875764441631 24.3875764441631 24.3875764441631 24.3875764441631 24.3815212640024 24.259428824014 24.1382707210112 24.0180454556524 23.9273856222818 23.8699934499516 23.811669051271 23.752413925962 23.7446062590449 23.7446062590449 23.7446062590449 23.7618286940059 23.8240553826772 23.8872055965199 23.951277835665 24.0522200411264 24.168716785927 24.2842926992381 24.4054061937395 24.5845108270243 24.7636157482534 24.9427209571132
24.3875764441631 24.3875764441631 24.3875764441631 24.3875764441631 24.3875764441631 24.3875764441631 24.3875764441631 24.3875764441631 24.3774735892455 24.2068429111111 24.0371463267002 23.8683823370106 23.7753155374578 23.7664638869043 23.7566802524913 23.7459661336009 23.7446062590449 23.7446062590449 23.7446062590449 23.7483883860336 23.7620731276483 23.7766811540363 23.7922109656684 23.9129696839455 24.0780069607848 24.2421236457327 24.4070995556047 24.5862023420166 24.7653054163591 24.9444087783176
24.3875764441631 24.3984934120669 24.4417638483632 24.4840932415069 24.5254830903388 24.5106266037581 24.4677429535867 24.4257979442563 24.378063026238 24.239039547006 24.0990816301506 23.9581907749619 23.8835589158824 23.8818872956592 23.8802174721256 23.8785494452949 23.8768832151803 23.8752187817949 23.8735561451523 23.8718953052658 23.8702362621487 23.8685790158139 23.8669235662751 23.9921551948055 24.1696034131167 24.3470537171227 24.5206878912996 24.6664230453591 24.8130764275492 24.9606465382465
24.3875764441631 24.4114733505566 24.5032807228512 24.5941472970397 24.684074571623 24.6520467980478 24.5606257717808 24.4701431420942 24.3805296773151 24.2900461519302 24.1986284321772 24.1062780170067 24.0578354658767 24.05616411267 24.0544945558656 24.0528267954772 24.0511608315181 24.0494966640011 24.0478342929402 24.0461737183483 24.0445149402387 24.0428579586247 24.0412027735195 24.1681329902342 24.3455796262035 24.5230283475659 24.6901467029046 24.7873391545194 24.885449595406 24.9844765262816
24.3875764441631 24.4253957176647 24.565739038 24.7051418052578 24.8436055175993 24.792528588819 24.652571174475 24.5135519124683 24.3839320616741 24.3419875017498 24.2991089906954 24.2552980271215 24.2321120524147 24.2304409662189 24.2287716761385 24.2271041821872 24.2254384843782 24.2237745827247 24.22211247724 24.2204521679373 24.2187936548302 24.2171369379313 24.2154820172548 24.3441105329895 24.5215555869252 24.699002725954 24.8586877937077 24.9073385315495 24.9569070198226 25.0073917595834
24.418735725883 24.4717911765584 24.6393985296634 24.8079485779727 24.9774398230513 24.9132224921233 24.7418533489085 24.5695475043721 24.4130899102705 24.4114119078997 24.409735701304 24.4080612904971 24.403729995074 24.3975207812135 24.3922428736984 24.3878947741923 24.3875764441631 24.3875764441631 24.3875764441631 24.3875764441631 24.3875764441631 24.3875764441631 24.3875764441631 24.5195558300728 24.6975312952928 24.8749768522956 25.0263113977838 25.0264214102715 25.027448934367 25.0293924714667
24.5585420409784 24.6337344745822 24.7528044350681 24.8728168454504 24.9937702076327 24.9454302350668 24.8225994636654 24.6988322348926 24.5873654990097 24.585687764787 24.5840118260525 24.5823376828196 24.5528607637066 24.498114123629 24.4442985474802 24.3914125372635 24.3875764441631 24.3875764441631 24.3875764441631 24.3875764441631 24.3875764441631 24.3875764441631 24.3875764441631 24.521253286675 24.7003459779715 24.8794389580704 25.0305466292813 25.0305466292813 25.0305466292813 25.0305466292813
24.6992913835518 24.7947355097736 24.8652690654616 24.9367448257553 25.0091612928982 24.9785762894517 24.9042829019721 24.8290533010519 24.7616411242991 24.7599636582191 24.7582879873406 24.7566141116764 24.7010605386767 24.597777460069 24.4954252029909 24.3940022697858 24.3875764441631 24.3875764441631 24.3875764441631 24.3875764441631 24.3875764441631 24.3875764441631 24.3875764441631 24.5229504541606 24.702041300512 24.8811324356517 25.0305466292813 25.0305466292813 25.0305466292813 25.0305466292813
24.8409835129429 24.9547945225438 24.9767926610014 24.999732758792 25.0236133184991 25.01266041588 24.9869034246828 24.9602104639584 24.935916786133 24.9342395881906 24.9325641851625 24.930890577062 24.8483295575804 24.6965110278758 24.5456230773198 24.3956642085951 24.3875764441631 24.3875764441631 24.3875764441631 24.3875764441631 24.3875764441631 24.3875764441631 24.3875764441631 24.5246473325431 24.7037363342637 24.8828256247585 25.0305466292813 25.0305466292813 25.0305466292813 25.0305466292813
24.832803846964 24.9471815052741 24.9737177967326 24.9993123741126 25.0239667344912 25.0305466292813 25.0305466292813 25.0305466292813 25.0305466292813 25.0305466292813 25.0305466292813 25.0305466292813 24.9438972051344 24.7844125269218 24.623998722173 24.4626572885077 24.4538571112224 24.4521945388059 24.4505337611236 24.4488747781886 24.4472175900145 24.4455621966141 24.4439085980009 24.5692230182009 24.7322456794984 24.896188171574 25.0279893658763 25.0146790032906 25.0022836901451 24.9908019288681
24.6927042825663 24.7890058161753 24.8640755504882 24.9382038159595 25.0113921093265 25.0305466292813 25.0305466292813 25.0305466292813 25.0305466292813 25.0305466292813 25.0305466292813 25.0305466292813 24.9693326247038 24.8583853781524 24.7465092471526 24.6337057289835 24.6281349831103 24.6264726765254 24.6248121643876 24.6231534467105 24.6214965235069 24.6198413947905 24.6181880605746 24.7069814983518 24.8214651390091 24.9368683709472 25.0184392977857 24.9565910411331 24.8956575954572 24.8356374635268
24.5516620606699 24.6317714283565 24.7553736187159 24.8780345854528 24.9997558249645 25.0305466292813 25.0305466292813 25.0305466292813 25.0305466292813 25.0305466292813 25.0305466292813 25.0305466292813 24.9956987091834 24.9332879069857 24.8699484624097 24.8056818723944 24.8024128914851 24.8007508507264 24.7990906041281 24.7974321517033 24.7957754934655 24.7941206294278 24.7924675596035 24.8438203207444 24.9097659282414 24.9766308875395 25.0079728225471 24.8975876590459 24.7881170680756 24.6795595527446
24.4096774219023 24.4754781014692 24.6476117613201 24.8188044427496 24.9890576418152 25.0305466292813 25.0305466292813 25.0305466292813 25.0305466292813 25.0305466292813 25.0305466292813 25.0305466292813 25.0229952210047 25.0091198761066 24.9943161308822 24.9785854819309 24.9766908363413 24.9750290614036 24.9733690803394 24.9717108931618 24.9700544998843 24.96839990052 24.9667470950821 24.9797397201403 24.9971482817036 25.0154759556062 24.9965901741488 24.8376690907646 24.6796623414823 24.5225684297506
24.3875764441631 24.4512669447901 24.6303402971222 24.8094139450675 24.988487888312 25.0305466292813 25.0305466292813 25.0305466292813 25.0305466292813 25.0305466292813 25.0305466292813 25.0305466292813 25.0305466292813 25.0305466292813 25.0305466292813 25.0305466292813 25.0305466292813 25.0305466292813 25.0305466292813 25.0305466292813 25.0305466292813 25.0305466292813 25.0305466292813 25.0305466292813 25.0305466292813 25.0305466292813 24.9907256545226 24.8116450060746 24.6325640698655 24.4534828462085
24.3875764441631 24.4530026256752 24.6320741355749 24.8111459410732 24.9902180418564 25.0305466292813 25.0305466292813 25.0305466292813 25.0305466292813 25.0305466292813 25.0305466292813 25.0305466292813 25.0305466292813 25.0305466292813 25.0305466292813 25.0305466292813 25.0305466292813 25.0305466292813 25.0305466292813 25.0305466292813 25.0305466292813 25.0305466292813 25.0305466292813 25.0305466292813 25.0305466292813 25.0305466292813 24.989036038741 24.8099572330816 24.630878139675 24.4517987588344
24.3875764441631 24.4547380106473 24.6338076784286 24.8128776417941 24.9919479004296 25.0305466292813 25.0305466292813 25.0305466292813 25.0305466292813 25.0305466292813 25.0305466292813 25.0305466292813 25.0305466292813 25.0305466292813 25.0305466292813 25.0305466292813 25.0305466292813 25.0305466292813 25.0305466292813 25.0305466292813 25.0305466292813 25.0305466292813 25.0305466292813 25.0305466292813 25.0305466292813 25.0305466292813 24.9873467110213 24.8082697478363 24.629192496918 24.4501149585799
24.3875764441631 24.4564730997213 24.6355409256981 24.8146090472446 24.9936774640471 25.0305466292813 25.0305466292813 25.0305466292813 25.0305466292813 25.0305466292813 25.0305466292813 25.0305466292813 25.0305466292813 25.0305466292813 25.0305466292813 25.0305466292813 25.0305466292813 25.0305466292813 25.0305466292813 25.0305466292813 25.0305466292813 25.0305466292813 25.0305466292813 25.0305466292813 25.0305466292813 25.0305466292813 24.9856576713492 24.8065825503248 24.6275071415808 24.4484314454309
24.3875764441631 24.4582078929113 24.6372738773975 24.8163401574391 24.9954067327222 25.0305466292813 25.0305466292813 25.0305466292813 25.0305466292813 25.0305466292813 25.0305466292813 25.0305466292813 25.0305466292813 25.0305466292813 25.0305466292813 25.0305466292813 25.0305466292813 25.0305466292813 25.0305466292813 25.0305466292813 25.0305466292813 25.0305466292813 25.0305466292813 25.0305466292813 25.0305466292813 25.0305466292813 24.9839689197114 24.8048956405331 24.6258220736492 24.4467482193736
