1.376315300244714546e-01 6.585882704378904530e-03 2.223501943692428578e-03 2.774691253145678601e-03 2.090359244485257093e-03 4.562514969274631196e-03 4.518894121158114653e-03 1.220656007860390288e-02 2.211002615715994615e-02 9.870656891196177840e-03 7.421487852682154100e-03 8.234662352417070064e-02 5.137372244171131003e-02 3.736428198217726059e-03 3.066268410516302841e-03 5.496519749390200993e-02 2.485716347853936855e-03 3.413454116487844338e-03 3.105397786876486470e-03 1.307726347424352899e-03 1.266289778928600526e-03 2.548225559375009996e-02 2.009902557666825781e-02 8.008488051010220765e-02 1.554267351590415402e-01 1.218874629434650025e-01 5.600926046080387938e-02 4.889149197289706025e-03 4.627697505694367518e-03 5.770660511515969711e-03
9.029819417649066760e-02 6.955536632546123997e-03 5.506856417877786271e-03 4.461874252999496575e-03 3.094502767766080156e-03 1.563187137941992114e-02 8.291064437327020850e-03 1.027652091345609975e-02 5.977751373361834403e-03 4.549651749550829433e-03 4.992393275300807676e-03 4.294979110513021114e-02 6.151588474762457320e-02 3.424198812293246814e-03 3.587221310676616190e-03 2.351816821912980013e-03 2.424404117338889268e-03 6.304102221971589343e-03 4.750551685265827148e-03 1.822305701971427792e-03 9.588102415548890867e-02 2.430828142894664312e-02 5.214126709748520550e-02 4.654198308265612705e-02 4.121359068852572388e-02 5.527242489472288661e-02 1.943023015643895873e-02 4.914115695138722775e-03 6.955554760008825915e-03 6.914763770480340105e-03
2.036994862764926126e-02 1.999974221257369567e-02 3.622067013754937809e-02 2.941905675401303849e-02 6.246769249602982660e-02 7.183643347295065075e-03 7.296712567198783417e-02 7.642275717666081880e-02 2.902808614740780280e-02 6.609650035446349749e-03 1.763537374333261007e-02 1.328462569042830783e-02 4.891643498261954472e-03 9.256241877997513356e-03 9.357269834643183737e-02 7.723175251664196952e-03 3.525035056161275430e-03 5.734105454888120852e-03 1.893777860683924785e-02 4.923031176156120528e-03 6.139031797340915864e-02 2.059948820622831134e-02 3.144813518724991208e-02 1.096525221833793973e-02 6.509153066420559318e-03 4.296592909715974545e-03 3.841132149043399290e-03 3.008788662721753864e-03 5.117096747781162309e-03 5.719382840647769563e-03
8.026583974913712588e-03 2.270862531150506097e-02 4.980449476698564637e-02 4.021230705754240409e-02 1.874863734090427558e-02 3.253976058854593512e-03 4.931540732028533158e-03 8.683126345190254891e-02 5.001595279402216293e-02 8.452532047148535524e-03 4.874704427248267684e-03 9.700620145716131945e-03 4.367299685496229926e-03 6.126960212787071688e-03 7.151404314083369129e-02 6.276317539993599148e-02 1.767780651710200391e-03 2.225190438319372705e-03 1.558641115543058777e-03 1.772914530714529398e-03 1.074103345454424652e-01 4.130266518270121062e-02 1.397496927030058428e-02 2.728230240844362053e-02 5.287339623414964891e-03 3.814843279628001797e-03 3.281209288305555853e-03 3.097931767594304473e-03 6.259446195142469131e-03 6.767657058083588126e-03
4.654441713489585603e-03 1.434265534745698609e-02 4.000523652397300345e-02 1.551265621415002030e-02 1.108256442205412390e-02 8.331872204692024331e-02 5.584165217338505141e-03 8.007442673873346739e-02 3.105885355494314090e-02 2.032947526514203643e-02 2.162120899171227073e-02 2.174928054028209615e-02 3.974205223024787625e-03 6.267910237204128536e-03 9.288710356654085454e-02 3.768657748878331826e-02 7.147466548243568488e-03 2.399643998391799704e-03 3.856745380872734358e-03 2.244218672558704990e-03 1.841080907734917544e-03 5.358913566303132731e-02 1.350598989837349185e-03 4.321710031062429153e-02 9.558637253574113132e-03 5.136012036189755749e-03 3.579320303088107547e-03 4.106917699959676885e-03 6.374212892022502498e-03 2.325916505514558086e-02
6.707557189763378031e-03 7.187117864790329436e-03 2.701855062054778212e-02 1.905358634465257814e-02 8.834277963045249205e-03 4.835701683466646361e-02 6.041888052434610940e-02 6.328494741081312769e-02 5.284522433128792385e-02 2.901657654372107736e-02 2.454547278703603230e-02 1.742618745828775767e-02 8.221641030003379313e-02 3.042901954281090893e-02 2.521006508550061379e-02 4.305262685126071825e-02 5.708648285449015314e-03 5.727299744830124939e-02 2.265302005727293493e-03 5.788690566235648628e-03 8.567758233669531612e-03 5.618934007265125041e-03 1.965886313400682164e-03 2.562350125703777987e-02 1.431435985212528225e-02 1.353205871294138087e-02 8.478369614157682532e-03 5.786207641423380364e-03 7.559784169462238461e-03 1.345516985114653813e-02
4.785374475272224926e-02 7.239326341576107771e-02 7.110382935752322664e-02 7.752130015817344268e-03 2.948918453612401139e-03 5.865273900024289312e-03 1.031838661665607053e-02 5.641162906236542318e-03 5.472657653221889469e-03 6.018864156475806776e-03 5.196890418974715181e-03 9.945048246795090696e-02 4.648966580817601862e-02 2.172298338491710293e-02 1.252234287206167515e-02 2.140364569593126987e-02 1.209685985804540703e-01 5.407536841035075204e-02 3.614612102498174131e-03 5.099809511758540345e-03 3.403430359626353260e-03 5.466818501206745229e-02 2.557135474324844643e-02 2.409221424196664185e-02 9.795299536657326583e-03 1.013814056179688193e-02 8.958877817912545491e-03 7.641775547341352753e-03 8.650759243772320958e-03 2.030584716844291079e-02
9.889986389611896134e-02 7.403141543105012587e-03 1.009732872324168168e-01 5.340599454726236393e-03 5.058830277895345895e-03 5.579867925775115062e-03 4.806191484177373997e-03 4.403132852117210699e-03 3.409269000003121997e-03 2.291950550500518064e-03 5.453816514982338243e-02 4.644930960608474949e-03 3.937917757060428736e-02 1.425515791357413048e-02 1.601141564001901108e-02 2.935563296787859280e-02 5.575448184369655169e-03 6.758017002345118734e-03 4.687030047480070238e-03 4.113550875121993640e-03 7.940870601293487097e-02 4.664706422748707282e-02 1.881090263578874197e-02 1.577044239454843122e-02 7.518701780074249150e-03 7.805406811854200162e-03 1.202853381995685339e-02 1.343511353910821667e-02 1.322899607123653905e-02 3.798604691795827437e-02
6.485030315781307488e-03 5.428712339842029118e-03 8.738111315885296881e-02 1.264154828573228230e-02 6.306745881444902196e-03 2.613843082990232550e-03 8.204834547484064419e-03 3.915494086052422398e-03 3.299049616725592549e-03 3.826321572809325729e-03 2.790798653815103770e-03 4.138377175132212926e-03 8.301255103220581827e-03 6.750955060337824470e-03 5.175910529832161017e-02 4.318396981561879039e-02 3.139052105894639660e-03 7.495421137278614199e-03 8.760161598619009213e-03 1.079659819232985374e-01 2.139881385314419682e-02 2.218687058414563901e-02 2.402313792443477869e-02 1.566293014713586451e-02 9.143979877371262444e-03 1.343361781313625637e-02 4.714979344377954323e-02 8.335279095392686410e-02 4.596519337184987695e-03 1.155698989193805482e-01
6.525191790398495416e-03 5.080284894802338143e-03 8.032585326162335060e-03 7.425906661951774991e-03 6.937676430676860753e-03 6.357606837938850619e-02 8.927619605650041756e-03 3.876681073495029384e-03 6.191874675177504866e-02 2.263851683937210049e-02 4.499583809887477102e-03 4.330537719308144053e-03 9.233411032254071338e-03 1.126930976409409174e-02 5.720545608611140274e-03 6.185245863263538584e-03 2.965228222174726147e-02 2.892778147037174466e-02 1.493809509631484345e-02 9.315517497467229457e-03 2.777055694937756447e-02 1.740515027173747051e-02 1.980589119733531731e-02 2.161947070816825495e-02 1.198833190844828672e-02 1.480787738779138288e-02 1.273923902072224279e-01 3.931673232110662400e-03 4.693321004926893393e-03 6.025731893628030744e-02
9.597382182697795916e-03 4.877931653453885033e-03 7.248468083444386048e-03 5.345127928628755354e-03 1.078159273256287277e-02 3.991491893111671907e-02 3.802522643516511452e-02 3.407140839353056672e-02 2.287233139696310050e-02 3.623907017873124851e-03 3.584386629086450116e-02 5.888872453809524538e-02 1.229970875349649245e-01 6.143706273577405341e-02 1.144776048379547370e-02 2.268596725697313160e-02 4.236178384825760312e-02 1.170700177100759964e-02 3.957125535714644225e-03 4.632637987355691517e-02 1.934232256352504120e-02 1.711198403226439624e-02 2.188125065539108308e-02 3.034750780535075063e-02 3.213920676863347287e-02 1.706783078470070630e-02 2.534273022672738768e-02 1.854371948440194234e-02 1.632327234985072456e-02 1.176202645497942921e-02
7.030642447196626399e-02 3.827299816630470169e-02 1.076517472175994410e-02 7.408177226284534678e-03 6.771705549714697632e-03 6.260898787643652541e-02 2.976311059017805113e-02 2.038884233053715397e-02 2.393108868495408270e-02 6.355164809409293014e-03 1.099124617342521135e-02 7.216104029746313320e-02 1.273680220315864808e-01 6.732060988623266018e-02 2.470524052403577989e-02 2.837002826450365014e-02 3.148805724974584191e-02 1.859032629897746855e-02 6.617323162957916734e-03 1.069789572912646924e-01 1.874924881119771972e-02 1.890960263941679487e-02 2.215095716908261486e-02 3.923797500518611675e-02 3.692690087736968940e-02 2.599981594146404465e-02 1.971101754124559083e-02 1.754806672925239563e-02 1.883987125492799647e-02 2.004826146903214423e-02
1.642206229574802445e-02 3.859827069305506869e-02 8.433627716896505144e-02 8.787429788041461326e-03 5.929548886128925209e-03 5.174487064835396610e-02 2.953246041444402073e-02 2.586858130156013263e-02 3.284176633273686030e-02 3.528842846242008242e-03 6.275315633704800500e-02 2.400774371180096345e-02 9.479007992849174113e-02 4.173706636680289683e-02 1.346096656570730521e-02 1.596357171873964351e-02 5.938098434580267766e-03 8.747733645449758469e-03 1.281578058514593922e-02 5.595725816173879527e-03 1.817770142718452137e-02 1.974869708118134892e-02 2.455982644322484906e-02 4.038398998137420620e-02 5.062152848191983634e-02 4.425155672120619638e-02 3.227468032550129262e-02 2.990589786648015572e-02 2.588581619824106492e-02 2.116384625617056744e-02
1.395611265347539327e-02 3.830959083812670446e-02 5.923956265661897008e-02 4.070212882880955979e-02 2.393920890551900701e-02 1.047567616297599008e-01 1.090646255736692216e-02 5.728970855538022267e-03 4.584029276516951579e-02 1.493657754949825195e-02 5.300764459021054670e-02 4.466611415245704680e-03 4.316761982055306729e-02 6.050324613651360955e-02 6.664705267557341495e-02 9.279148724807127768e-02 8.436963775335311333e-02 5.515817893745830064e-02 1.516655399684085914e-01 7.186516017581927318e-02 8.870049646738634511e-03 1.190010985166231328e-01 8.776816870105175195e-02 6.309638454789025241e-03 1.102431292997421534e-02 8.881872577081567285e-03 2.180580402558172926e-02 9.030109387911504706e-03 3.553553430267510083e-02 4.052697059723060768e-02
1.319145016086310448e-02 1.276096082220351362e-02 3.052564765524524298e-02 1.435902603544362242e-02 7.868450750150030037e-02 1.976312697712128558e-02 5.399460556663683054e-03 8.825207775235146754e-03 6.855437719350833056e-03 5.740764467930226794e-02 1.177485419871263511e-01 2.210199717263744423e-02 3.889119372402914665e-02 5.091011289187784977e-02 4.733853549265179539e-02 5.878935993595054560e-02 1.017630604103846870e-01 1.780944415075199905e-01 1.835217962203292696e-01 1.451076590612597195e-01 8.212013252655140511e-03 9.981413375425324253e-03 8.566796451210246036e-03 2.068019083911238482e-02 2.464991132676111821e-02 1.240411340966779963e-01 1.215619246930888658e-01 2.869174702611933941e-02 3.650817851890163224e-02 2.763350578410345496e-02
1.231449105307008338e-02 1.304064172266590667e-02 2.541508982209972692e-02 2.679395665591088188e-02 1.738189122859338034e-02 2.092127639725560248e-02 1.842248136303622141e-03 4.350894750052954757e-03 9.874026569941593209e-03 4.090885095435825743e-03 4.244250292136743374e-03 3.296377772991422681e-03 2.218143540412810186e-02 4.598512267811672577e-02 4.384142039023732756e-02 6.854518521203602222e-02 1.208851695851323321e-01 1.496113382405203918e-01 8.802175095806348548e-02 1.937309691654895416e-02 1.154229137826798257e-02 7.862402256814218782e-02 1.136340241350631830e-01 1.877436194397398006e-01 1.734289915103102431e-01 2.220210213672361710e-01 1.742931961136919283e-01 5.456933690846773460e-02 5.269718973611466767e-02 3.064959069585489193e-02
1.600175766634250041e-02 1.817239542523021653e-02 1.698100369966144135e-02 1.528988108217548339e-02 2.220743364758792637e-02 3.895135367479520688e-02 2.690458666960457781e-02 8.546255608331523868e-02 4.169437603796286029e-02 7.082775576549800445e-03 5.207596401236102603e-03 8.028849685863145152e-03 1.592668038283066856e-02 2.387456781594416919e-02 3.201692511369255006e-02 5.817118331093736050e-02 1.284359606394865350e-01 1.324706205110220136e-01 6.419359748993755388e-02 2.230799021147790787e-02 9.527664481725278689e-02 1.711104145783633179e-01 2.173548676390168466e-01 2.192822075857154829e-01 1.891996147865726841e-01 1.601102713958150181e-01 2.317003231189443124e-01 4.258726132428002770e-02 6.857386491605392542e-02 3.682446622276177445e-02
4.014447610881848733e-02 3.146747030868224382e-02 1.513039149658761476e-02 2.103852929443576075e-02 3.500230372549993033e-03 1.350677099831290411e-02 7.113084973212291384e-02 5.740026982751764845e-02 5.650471735876807372e-02 2.807988824573313252e-02 1.130796547894827656e-02 3.735694653088031478e-03 3.629473595638889154e-03 8.417827071917230106e-03 1.556398198018765951e-02 7.182848135553604463e-02 7.775083219145760560e-02 9.669224492898023660e-02 1.730631503304073601e-02 3.094445018927827890e-02 1.049455107432325784e-01 2.242711820807217482e-01 2.732370768774360359e-01 2.774705588410132373e-01 2.235952471515187667e-01 2.103673864053266229e-01 1.910773274036721980e-01 1.543663353012001971e-01 8.302527245076560258e-03 5.712878021332607782e-03
1.576794077985937959e-02 4.359131845954301171e-02 7.587110665765217643e-02 6.637682716074424366e-03 1.059751066545235737e-02 1.413708062410413101e-02 4.459344334112080172e-02 5.568343014313511391e-02 3.809427468245773357e-02 2.950413065758323433e-02 7.836277552193978910e-03 8.000195487989521237e-02 1.197779454199791871e-01 4.234806839111110270e-03 5.551091227283933179e-03 3.256389717233119235e-02 1.276106953077912887e-02 4.366144021207337723e-03 9.071269747224057489e-02 1.100788203525387456e-02 4.005924887916392785e-02 2.110210016019984924e-01 2.641410213300746102e-01 2.726170332746585823e-01 1.959065026543874710e-01 8.921188931319438964e-02 1.423255737094429041e-01 9.685200781167704887e-02 8.706938351896226572e-03 3.394603408905105466e-03
4.354655993634674351e-03 6.579013921529934701e-03 4.117321340461153369e-03 4.263359373911006743e-03 7.976351230059918612e-03 4.546504523202798617e-03 2.322593385216545694e-02 2.978361146165687742e-02 2.725069818324117252e-02 7.712548549224309755e-03 3.275961096654836022e-03 5.514899715941108671e-02 9.319833888814180178e-02 3.787475663274158903e-03 7.550274634797263414e-03 4.720847243699539085e-03 8.466141061310054200e-03 2.698556189104763924e-03 5.176639934649323455e-03 2.472612654872438295e-02 1.276638396078870752e-01 2.394739906698798160e-01 2.547315416149317779e-01 2.402495476836730426e-01 1.829551853408124262e-01 1.327044047660721482e-01 1.273557299027827383e-01 9.139582494299523796e-02 1.393824780446676140e-02 5.447563577566098998e-03
8.882578436039309175e-03 8.172580235035994609e-03 4.200160195128067007e-03 3.661891517565218999e-03 4.830045920448646814e-03 2.546060972048903772e-03 1.226955442933923106e-02 1.195719798503200315e-02 3.388101637720937823e-03 2.359316996008092599e-03 9.427030732218356912e-02 8.315284331975596188e-02 4.540120472432238735e-02 2.052328406101331520e-02 4.292316168725384545e-02 1.294168407492819056e-03 4.545039236601560242e-03 1.064198647109599639e-02 1.051106799042539341e-02 4.764720900654131897e-02 1.294237588208075329e-01 1.861717447337189746e-01 7.520482593584659758e-02 1.129419194676487687e-01 1.460159804136241801e-01 8.258335344839988490e-02 6.908562156213647609e-02 6.300806694603455771e-02 9.202107893000362193e-02 9.995011409117701695e-02
7.141976670727865142e-03 8.245328225378975584e-03 1.561588806237094052e-03 1.341094657433035452e-03 1.157012781724068018e-01 1.576923001317160180e-03 2.000870244527156415e-03 6.102611597682883193e-02 8.633133442433094107e-02 1.491805514762525528e-02 2.193211539602529098e-02 3.474262369127324723e-02 3.176070205907289418e-02 9.670045350219289015e-02 2.728264116722302172e-03 2.338803570494297698e-02 4.402422840284264671e-02 6.534671677978390325e-02 4.574219033491624259e-02 3.484620623740640466e-02 2.452003516958892876e-02 8.707531777310888524e-03 3.356947173356837882e-03 7.318566846937815326e-03 2.667783339047478594e-02 9.052164988054393208e-03 1.164236536055010367e-02 1.357188138842050085e-01 1.766052830058526327e-02 1.647626499941411832e-02
1.513713739667383804e-02 1.311179631500752549e-02 1.921949097246919121e-03 9.409598231331783857e-02 2.042419942989177374e-03 1.229163252234494602e-01 1.899630003812646404e-03 2.192252078209259644e-02 2.062940223234403445e-02 8.943359494159239254e-03 2.208909001421945420e-02 4.010850335538325429e-02 4.103242268198985937e-02 2.935605240745502078e-03 3.011779722521387356e-03 1.335285436483498941e-02 5.004439681575540561e-02 9.556377633964104057e-02 1.107268731792111771e-01 9.686870209705968071e-02 2.036976755879445211e-02 5.976116404257364630e-03 7.288629770869823297e-03 1.726698390454226018e-02 3.077206029114715885e-02 9.123196734155614857e-03 5.597445666936417923e-03 6.458071288207065108e-02 2.428952754120839233e-02 2.324959321583901228e-02
1.890494755238844582e-02 2.723991873916297227e-03 9.360810506301034395e-02 3.880588460840540821e-02 5.029733827474407171e-02 1.132288886763064134e-01 1.559207005726992445e-01 1.802263228415049157e-02 1.019889781148491416e-02 1.163708183820966538e-02 2.108356432293077842e-02 3.533815166816667991e-02 3.075531613867255043e-02 1.866576666616733384e-03 4.456532656851842043e-03 1.930420334827400233e-02 3.828075091074304576e-02 9.012881707133234277e-02 1.157627361516196940e-01 9.878981519235832676e-02 4.876901172596195821e-02 4.221412241474579823e-03 1.221709514991231593e-01 6.557654053567217069e-03 2.757684832466937574e-02 1.503743780673898883e-02 1.924699374178169900e-02 1.109783724016399770e-01 1.945405795881648831e-02 1.749212273107036975e-02
1.042903853611525967e-02 3.722676113210371483e-03 1.616036378644995298e-03 1.684267165426680309e-03 4.076472470817433039e-03 3.875755870719770416e-03 1.671166992003414731e-01 7.109159554619817745e-02 1.038218500671004157e-01 1.326841544483487734e-01 1.242159673438533903e-02 1.473034728467561769e-02 1.856223356750037051e-02 3.467990797884221155e-02 2.020044621523858341e-03 6.017531488771920949e-03 6.695266038614667084e-03 3.125994095793280247e-02 4.042178276579856677e-02 3.300093953494759313e-02 3.062518561154363092e-02 7.147991797429528900e-03 3.361395066628736217e-02 5.423803817106900849e-02 4.958060139564555470e-03 1.119467602505884452e-02 3.601118291451706893e-02 2.421681878219733922e-02 2.186026850936402532e-02 1.895341424676717443e-02
3.729630460702062274e-03 1.486755910815625156e-03 1.602757422288822843e-03 2.731566848236195635e-03 1.823705553887104052e-03 1.377099542727910630e-01 6.774514936106407204e-02 4.955168393513094405e-02 1.526274830962033313e-01 4.958913814127736269e-03 4.025412953831753599e-02 1.500018047841192997e-02 2.182971492302951053e-02 3.757484715797512753e-02 2.735839337224502121e-03 4.514182071268943268e-03 4.288856244089277181e-03 7.942762943171483014e-02 1.165219607769081012e-01 5.171359524170211948e-03 9.959993678664675124e-03 7.643040645968234015e-02 3.705545302723252388e-02 1.093179935059732794e-02 2.009794085029240757e-02 6.013671528106796955e-03 2.804183555223479715e-02 4.258030867593871199e-02 2.457248026126552382e-02 3.022760733043862794e-02
3.779893603401652744e-03 3.047282378050399261e-03 1.499639381541052101e-03 1.108501241647820695e-03 1.276230353183432746e-03 8.082228924642440027e-02 5.552268974008212760e-02 5.827381991921228716e-02 6.388724731933750900e-02 2.069801914793540417e-03 7.454162829080719643e-02 7.518128798761888887e-02 5.958999623307176252e-02 5.777621298591011090e-02 3.543748229956745262e-03 9.551879458670885226e-02 7.066556727743866784e-02 4.473640740018761802e-02 3.935592287347670915e-02 2.950174749697937956e-02 2.330234748255537863e-02 3.332285788267580484e-02 4.870939274254671575e-02 1.099078115370306780e-01 2.971668340066684760e-02 8.449690248433094908e-02 1.347458513268073865e-01 9.302542744911641848e-02 9.534317119252407047e-02 6.238736642246144742e-02
5.133815435035413849e-03 2.688304131412549113e-03 1.542101225382793307e-03 2.122170646718595823e-03 1.990517909173983302e-03 1.115679245630095103e-03 3.945218025307762298e-03 3.421121926966658438e-03 8.739878157287689353e-02 6.371638329318470018e-02 2.397178982230563360e-02 5.611197944952954486e-02 1.393711717770782788e-01 1.240952941579560043e-01 1.249769478938976726e-02 9.521826072385275452e-03 8.049778370881929823e-02 9.706912418733920633e-02 4.459052204347258019e-02 1.981165935953910565e-02 1.905756738282396098e-02 2.931700879604873938e-02 4.357538731420764616e-02 1.288616025114462660e-01 1.286849569136946370e-01 3.043389597236649535e-02 3.448614110660935123e-02 4.424870246396744866e-02 1.431645970817493341e-01 2.909552274617353829e-02
6.914420399105281057e-03 6.011604907464589836e-03 1.838912940102768257e-03 6.324601629824563170e-03 7.347940163988172721e-03 1.370798073465166744e-02 9.666547784711843408e-03 1.485493637121926454e-03 8.840943562847269899e-02 5.161878515164750741e-02 1.566519077172730603e-02 1.996387073032397999e-02 2.118809217139307199e-02 7.165872599913576668e-02 8.104302773538821225e-02 3.381271485104180713e-02 2.838069042605527101e-02 3.111071516158800052e-02 4.254472570797088876e-02 2.474186875040985945e-02 1.747136880553069524e-02 2.586250622399913560e-02 2.907089626351884101e-02 4.752441142191999451e-02 1.460056666607126019e-01 2.288995780822241505e-02 3.320285499420318198e-02 5.411447020467213820e-02 6.491679222068559574e-02 1.280681757186563907e-01
3.805061789257804718e-03 9.506759514196187408e-03 2.848216364046393060e-03 3.046355852167261392e-03 1.469948811626740036e-02 1.537509771023035272e-02 1.079954498346954832e-02 1.542327620973978630e-01 1.185015698441614224e-01 1.115880771888196621e-01 4.593867471514581635e-02 2.319015378477515266e-02 1.387374349256085757e-02 2.164343758009774910e-02 9.810219202541778372e-02 2.553573186085427923e-02 6.924051720471702254e-02 1.259562902029394589e-02 2.469036635419104286e-02 9.524590762423872092e-02 2.448354371588007741e-02 3.413125259004159973e-02 2.956334851555881410e-02 3.194768039915244634e-02 4.190797097676936256e-02 3.192596413047825432e-02 3.753803678236442010e-02 4.605373185517275259e-02 6.166690384305525963e-02 1.507122540144588685e-01
