4.249060504533161264e+01 6.449459237406735213e+01 5.556303881503664854e+01 6.960320738382790751e+01 5.219353922091310238e+01 1.146773996755792950e+02 1.144462375180879974e+02 3.108927711519985451e+02 5.713170545992534244e+02 2.589557079861899638e+02 1.217064958115581703e+02 2.795657146454396269e+01 1.670564129486709248e+01 6.522427105659812696e+01 8.012358917277221337e+01 1.871829055612471748e+01 7.154714982800889800e+01 1.369739747040410691e+02 1.368218960150113332e+02 5.258420985386258906e+01 4.281321137164539437e+01 6.303929953540222009e+00 4.971794231607622017e+00 2.016169127046055465e+01 3.990415202218068202e+01 3.210987613583171196e+01 1.529332810460113379e+01 1.372453519750383322e+00 1.328105491331982080e+00 1.699289562611421278e+00
3.187573288614406408e+01 7.253136644475928563e+01 1.297378059478540138e+02 1.031342990445866405e+02 7.167811907622113665e+01 3.252026483944206916e+02 1.594439068401443080e+02 1.990132142841253255e+02 1.321687101078032924e+02 1.137018546904437244e+02 8.483361426097727076e+01 1.703587234319007138e+01 2.328632109843530884e+01 5.534985224221267686e+01 8.049469977649511065e+01 5.444718648674279393e+01 7.310475079102840823e+01 2.628718904263354830e+02 2.203791232721371784e+02 7.310950635301293232e+01 2.669711836054073117e+01 6.142469615254929849e+00 1.324043039734161376e+01 1.208003905313859860e+01 1.102072849884033268e+01 1.536578214719627766e+01 5.712004053638613854e+00 1.461297859580517500e+00 2.062121119660082158e+00 2.053657209679888851e+00
3.750999440488183154e+02 3.867543037088744882e+02 8.096202152488319825e+02 6.432264871228559286e+02 1.403595112660936138e+03 1.472700918539000838e+02 2.868431933449211613e+01 3.146999731819375512e+01 5.260231123715766444e+02 1.623393884171314880e+02 4.505331647609659740e+02 3.108198154743541863e+02 1.183401415771604661e+02 1.787942382411943072e+02 3.523925054054133454e+01 1.543882139322431044e+02 1.122042450878750515e+02 2.541740149562112947e+02 9.468365128226238312e+02 1.751773973350393589e+02 1.733321969749187375e+01 5.211425793854432165e+00 8.262250931836391032e+00 3.024444935499833065e+00 1.905500257554742172e+00 1.345447223013026550e+00 1.282604811473261996e+00 9.702238390236880283e-01 1.580779393285536294e+00 1.723242419230149647e+00
1.788532625897890966e+02 5.129069362302772106e+02 1.111346978401903016e+03 8.792302503336047721e+02 3.775761540969114094e+02 5.988640823166203120e+01 4.869985837596978229e+01 3.296625626950142873e+01 2.057018351409225332e+01 1.914119852464672817e+02 1.239910925631762382e+02 2.548694552033257423e+02 1.199388326467210106e+02 8.376368168968471650e+01 2.565088197350133115e+01 2.043005471233205839e+01 4.567063705989167488e+01 9.245519076791045165e+01 7.201966063958231246e+01 6.715607525233487252e+01 3.199393556632571034e+01 1.142991804119108501e+01 3.727479114984069142e+00 7.578792524828317667e+00 1.506430359681438791e+00 1.189641105529781751e+00 1.094912906646102080e+00 9.825634773110636377e-01 1.864586058158203663e+00 1.960193147284547965e+00
1.071074624154359469e+02 3.399256546072174388e+02 9.331856161440291544e+02 3.620202813813461376e+02 2.140801982367704568e+02 3.120933711321700699e+01 4.776539795557224011e+01 2.659645924186838073e+01 1.227551917385415692e+01 4.235616912312933664e+02 5.198899940074246615e+02 4.538582533500614318e+02 6.907392123117315919e+01 6.035481780464506585e+01 2.967179692561145288e+01 1.152582633604328244e+01 1.306134218993026366e+02 7.949394930511643054e+01 1.369509167084733008e+02 8.360231924567938222e+01 6.084674032319718151e+01 1.788038144439300936e+01 4.138507351516596344e+01 1.196410490115891179e+01 2.557728858006119932e+00 1.497188540648118682e+00 1.116177569456459073e+00 1.228193439532899500e+00 1.799516739066720383e+00 6.420758654654683539e+00
1.112497986293070653e+02 1.220931187673449045e+02 5.451972482008416137e+02 4.354804866718078529e+02 1.733563335137143895e+02 1.833733311362411200e+01 2.192229122723486867e+01 2.313511045194561433e+01 2.131321168312369352e+01 6.289070923944552760e+02 4.792108630330018855e+02 2.535567915711527576e+02 2.949010985512477845e+01 9.389387927511322118e+00 7.484539319149998704e+00 1.282520307443279250e+01 6.982145829513478930e+01 1.890326741738531169e+01 6.418358268033014724e+01 2.317818229118735189e+02 2.995776335587794392e+02 1.890198598434709538e+02 4.999915577259643840e+01 6.821380171416024041e+00 3.628948275857849737e+00 3.720339695554615300e+00 2.487615819860039323e+00 1.634558304618754399e+00 2.018430300101786923e+00 3.538984159818642450e+00
1.559056732416622815e+01 2.606070718348119186e+01 2.764702322699915982e+01 1.406398607521309145e+02 6.765158924265554674e+01 1.103967313770347403e+02 1.626097822986089909e+02 9.037748106949149474e+01 1.048234258962311856e+02 1.183332347706330836e+02 8.859922795716565247e+01 3.581525746594326165e+01 1.488524697292326771e+01 6.080668605199372578e+00 3.355939259528162744e+00 6.276588437664964104e+00 3.804968377260372847e+01 1.845599317963071329e+01 9.701368109076398127e+01 1.373651984856773538e+02 6.717942406028808477e+01 1.709060147429345022e+01 7.109967484734208476e+00 5.893334681905908923e+00 2.356601794154094875e+00 2.633024321223615516e+00 2.476485675352540827e+00 2.054686762840607805e+00 2.241641540629893292e+00 5.202015264850693654e+00
3.198507089673653070e+01 6.100402046916282472e+01 3.624182629042721970e+01 7.945171888650867231e+01 1.237703212696514470e+02 1.380406062370383893e+02 1.197832654595918029e+02 1.109718926398030874e+02 8.785711179919708513e+01 4.809402517033915103e+01 1.896373975272018697e+01 5.759679088713899375e+01 1.231499304970560793e+01 4.215118681139205847e+00 4.447773438323341821e+00 8.485006568060525112e+00 7.249562906881115509e+01 1.198251551502766148e+02 1.092006589710931053e+02 8.108838481677769039e+01 2.353992635928024413e+01 1.172481885950636027e+01 4.174084966144321562e+00 3.425183303545122016e+00 1.712600989803195972e+00 1.920231948750215301e+00 3.148628610272971251e+00 3.833972179083344756e+00 3.714152180002239234e+00 1.069194714523369605e+01
8.096408745682553842e+01 5.444747219075762246e+01 3.282024920508542465e+01 1.959605332125281052e+02 1.312773270034064694e+02 5.558810065655187316e+01 1.765047001493201151e+02 7.824594838455244883e+01 6.522328688975942157e+01 6.315326114941260016e+01 5.542684558623921021e+01 7.215783908790430701e+01 1.572671292167393631e+02 1.042877473628719542e+02 1.578911265390597052e+01 1.468645370405522677e+01 6.589097086197941167e+01 2.078832905122582133e+02 2.140471222038660812e+02 3.757613810651071873e+01 6.277869492483995728e+00 5.109778319755497122e+00 5.074436871779811398e+00 3.251742789006936363e+00 1.969301434832278153e+00 3.189665113567801136e+00 1.259232232021726361e+01 2.480657954563938716e+01 7.027597168072978207e+01 3.416736403139648104e+01
1.309635206144887434e+02 8.613641842413217375e+01 1.424528556208551890e+02 1.383014450575575722e+02 1.272798320775392824e+02 2.533943924791968527e+01 1.163260906960091745e+02 4.913377381835448432e+01 2.059112466619434301e+01 7.595082547572658882e+00 1.098185430314513411e+02 1.058396270949597238e+02 2.221190241909454812e+02 2.386910997920419959e+02 1.134662429856843033e+02 1.237551049511146175e+02 6.835464568117843100e+02 7.391035143982854834e+02 3.122386930037991419e+02 1.474990512540824739e+02 7.661759269660693761e+00 3.816758856229443886e+00 4.092900900304419665e+00 4.438265053904163260e+00 2.502418669999291634e+00 3.355268895715450839e+00 3.286760682410447032e+01 5.558946818056548977e+01 6.835100387654819087e+01 1.774889353871766673e+01
1.092739868474776301e+02 5.734187804769398156e+01 1.326648156430078984e+02 1.173944464136001500e+02 1.568666298931671292e+02 1.463956452871836156e+01 1.225813026034357556e+01 1.064073745443227637e+01 6.667781119822300262e+00 5.904804747711201429e+01 9.137320688185418476e+02 1.504543551151244174e+03 3.057533845971384835e+03 1.473361747480072609e+03 2.664346020523640277e+02 5.093325933462135708e+02 9.650911934152850336e+02 2.768483507180181959e+02 6.915886913728508034e+01 1.454975378452864021e+01 5.166353290799224673e+00 3.736547548825145615e+00 4.609718511605739089e+00 6.423516971352741578e+00 6.908322753168643970e+00 3.837292441312119440e+00 6.252308524324330818e+00 4.948572867546866760e+00 4.382376920967142375e+00 3.110453384765391682e+00
2.050640307845981525e+01 1.213429597257812631e+01 1.101923246811781212e+02 1.118313725565923846e+02 9.090560291956364836e+01 2.129486853048158679e+01 8.318575469093268282e+00 5.361751270517708612e+00 6.657361692110155715e+00 1.228929528539185867e+02 2.930235056307414538e+02 1.881343564543249613e+03 3.291254343395869910e+03 1.651466508071030148e+03 5.798873809405226893e+02 6.327658444362236878e+02 7.003690980536157440e+02 4.196780822667576558e+02 1.055767359215085150e+02 3.065505220117997709e+01 4.662532285087623407e+00 4.253423220593438359e+00 4.945615536190354433e+00 8.904453675330509910e+00 8.587312476080425583e+00 6.212876765213408703e+00 4.833480662404259220e+00 4.309527212059035328e+00 4.532989671505164964e+00 4.777051055919969258e+00
3.975445954104691371e+00 1.034474828343073227e+01 2.595713494297842772e+01 7.582811213290827368e+01 5.135815871668209809e+01 1.663372142804729137e+01 8.610329220384249638e+00 7.278692399195175966e+00 9.272212982535872783e+00 6.576648117846103503e+01 2.147985159667950583e+01 6.386421038957447536e+02 2.592943253181535511e+03 1.055964589831767171e+03 3.179865550179256388e+02 3.521328133400460274e+02 1.279462286884513418e+02 1.861548876237148420e+02 2.112528992269547814e+02 7.973306956482673513e+01 5.465250453181846879e+00 4.999255392105615314e+00 6.145904891206696696e+00 1.063980493826693596e+01 1.403031363965093092e+01 1.334099974634359143e+01 9.983301763955990893e+00 8.909990502054556671e+00 6.672500209425400897e+00 5.089619953064303814e+00
3.175493433879772009e+00 9.227655032236850019e+00 1.734755663256772351e+01 1.303280923166138905e+01 7.961257904349310799e+00 3.226471610592248140e+01 1.146965932329865581e+02 1.027321964157397076e+02 1.390498254357689412e+01 4.238781250494315422e+00 1.683280641919682097e+01 1.107094831563666730e+02 1.250764508738582208e+03 1.583235107611955073e+03 1.595542345907453637e+03 2.041612328755553790e+03 1.768478281580586554e+03 1.102925202984804400e+03 2.915037855010778003e+03 1.350824518704190268e+03 1.141376175136344102e+02 3.370737043565576840e+01 2.573088860658831578e+01 6.486620530114758765e+01 1.497708896072110178e+02 1.402856750675711623e+02 3.882310089656328955e+02 1.283464270206078766e+02 1.022973776949315550e+01 9.858601195323201338e+00
2.902045565672451310e+00 2.964174618695832653e+00 8.452453109089677952e+00 6.534138199008567938e+01 2.452870620104932087e+01 5.917806637896452671e+00 7.982030709807538926e+01 2.417786059556487430e+02 1.713567820534704538e+02 1.761464368268313052e+01 3.752545265114569162e+01 5.929524941870994326e+02 1.209634418376269423e+03 1.421863426326790886e+03 1.198973793931237651e+03 1.356472066323077343e+03 2.172707925640531357e+03 3.522675313244149947e+03 3.430367896388666395e+03 2.682978977418354134e+03 1.168796224003677224e+02 1.235853655878752591e+02 1.101911398907352009e+02 3.401426964850506920e+02 4.726427628255015634e+02 2.371538522201187334e+03 2.402693851338328386e+03 5.067162396383497480e+02 1.142338868807143903e+01 6.864158979702747132e+00
2.590944282950179645e+00 2.889670453956809659e+00 6.872953148242161525e+00 7.884011301303347707e+00 5.419323476907576875e+00 6.340588439269175147e+00 4.598900496936704485e+01 1.340349295168384174e+02 2.891662235860819692e+02 1.056504403090190749e+02 1.114051611219370272e+02 9.922293512832732176e+01 7.481031563355293201e+02 1.396960891405624352e+03 1.209333988442376267e+03 1.721809828391478277e+03 2.730049068685096245e+03 3.064726467125884483e+03 1.680053925523568068e+03 3.592757910066602562e+02 2.158869288981051966e+02 1.473210444738015667e+03 2.106096723857443521e+03 3.439026171520226853e+03 3.110173458669290085e+03 3.969016191455958506e+03 3.249763400421540609e+03 9.798476328069748433e+02 1.733384548654309398e+01 7.845404124011295721e+00
3.222515771277583596e+00 3.838929854692282095e+00 3.939733966664219267e+00 3.911662950849815523e+00 6.221851285523383623e+00 1.333873723257001309e+01 7.937116609485833578e+02 2.725419769170006475e+03 1.378104270689668510e+03 2.434933514884837678e+02 1.882296113325331532e+02 3.071494306463912380e+02 5.931982888827307079e+02 7.968888663487301756e+02 9.632959985293202863e+02 1.591745508772110497e+03 3.083084996737582514e+03 2.856685064378171774e+03 1.272793144181400066e+03 4.189295081364937232e+02 1.752883498488392888e+03 3.042022544097669197e+03 3.760624870848807404e+03 3.736911188825173667e+03 3.212984760884097341e+03 2.757742506481118653e+03 4.178314205809321720e+03 7.623691035622903200e+02 2.524561208621216934e+01 1.064762364102758774e+01
7.922403754353490868e+00 6.442009848656139681e+00 3.498335799417306546e+00 5.756145769766543907e+00 7.918439740614205391e+01 4.111540413864803440e+02 2.323901704240350227e+03 1.938763178551187821e+03 1.978155113641341813e+03 1.026882148454709068e+03 3.949472191230092903e+02 1.134951320913412474e+02 1.088962313960982442e+02 2.525064249907711655e+02 5.150307801576876727e+02 2.171271941894713564e+03 2.025590220811688141e+03 2.142762587306122441e+03 3.428974734987669422e+02 5.690641146187795130e+02 1.913306375837003543e+03 3.882602743527380881e+03 4.583934736085605437e+03 4.600568361039277079e+03 3.765539346831584226e+03 3.642367954870265748e+03 3.478805295562099673e+03 2.809034246394528964e+03 1.278758948387747409e+02 8.466506473474905192e+01
3.603000722701535263e+00 1.037700980588916266e+01 2.020970887314192765e+01 1.492912158778403295e+02 3.586724060783575965e+02 5.266400772040146876e+02 1.699788888284994300e+03 2.181798920798475137e+03 1.557394309602376779e+03 1.234866400020321635e+03 2.672863867818635981e+02 2.716623185445601152e+01 3.982860548969648562e+01 1.015116243487340171e+02 1.999669444187335330e+02 1.079892351627884864e+03 3.699893495181863727e+02 1.077064969363738385e+02 3.303279636007426490e+01 2.231862170308745590e+02 7.849159897114957403e+02 3.848282205170371071e+03 4.586266808127000331e+03 4.595924132954580273e+03 3.275900955071541830e+03 1.498145298958662352e+03 2.428494897290340305e+03 1.696374397139256416e+03 1.562441807066093418e+02 6.226206643224654158e+01
9.319547032669649411e+01 1.275430279521568337e+02 9.194927289983652940e+01 1.240411685316800288e+02 3.214588751264955704e+02 1.940480922169620044e+02 1.035466931258316208e+03 1.387080532546904124e+03 1.333691859442399164e+03 3.144746434914054589e+02 7.928942042326995931e+01 1.683799626596202970e+01 2.807927841331932228e+01 7.521710043373948906e+01 2.720630146569755539e+02 1.678882076068601634e+02 2.776133629165069578e+02 7.476996513211352635e+01 1.279928075614783722e+02 5.565985227705014040e+02 2.714634490269815615e+03 4.718110776270060342e+03 4.732153705303750939e+03 4.241326204287383916e+03 3.112263976849098071e+03 2.201349201753400393e+03 2.093838593057370417e+03 1.430030580778578951e+03 1.309675379408211313e+02 4.684085286415121629e+01
2.756263122702027317e+02 2.733073983859065947e+02 1.552061752216623631e+02 1.244432196973584723e+02 1.822879090335247270e+02 1.042036940426155240e+02 6.219178706844265889e+02 5.833024607672192587e+02 1.679335481244875723e+02 8.873835261193661950e+01 2.983090609677431715e+01 2.319189319396772930e+01 1.318813636951833068e+01 6.785447544728146596e+00 1.641609134403170955e+01 5.170198611502936359e+01 1.676016547638233192e+02 3.488050713546142561e+02 3.074476025988011543e+02 1.256884167484736054e+03 3.103028269173702938e+03 4.127405135191734189e+03 1.564511868712270825e+03 2.158172296137369813e+03 2.575572172646585386e+03 1.368248855087745142e+03 9.841505165426056010e+02 8.173626089307573466e+02 3.022881018605988501e+01 2.733402904134301181e+01
2.297897994731610538e+02 2.872216184520854085e+02 4.738749190772330877e+01 3.700276405870401675e+01 3.460670420414818693e+01 5.542943597768406505e+01 8.331928474480480418e+01 2.199305482337624440e+01 2.985914282233989425e+01 4.553822016786097215e+00 5.823839113342762275e+00 8.668984893079773713e+00 9.175535107953297853e+00 3.070001694226495914e+01 8.126351588704278583e+01 9.875634652654330239e+02 1.717014038473248775e+03 2.277520731407231324e+03 1.431415302658495193e+03 9.892737961370530684e+02 6.347127057317709387e+02 2.085709757069315344e+02 7.425815759100717628e+01 1.444497045500945376e+02 4.767769835604334503e+02 1.495364849307721613e+02 1.322551797205252058e+02 4.478682098593630201e+01 5.078886731493623685e+00 4.148572315489782447e+00
4.929652024121470504e+02 4.087084123121021548e+02 4.923164667361673708e+01 2.383337397667426671e+01 3.953122636252450661e+01 3.291679255711938623e+01 5.324615578227307822e+01 5.974245511923049534e+00 5.227093407439220130e+00 2.205795680949406368e+00 5.106275462539922927e+00 9.441250448197259004e+00 1.202438837044765307e+01 6.090135344235722670e+01 9.386574567694232485e+01 5.514922281140953828e+02 1.842248612388976653e+03 3.165130269619265164e+03 3.311029005702595896e+03 2.655524939900747540e+03 5.136693142229064506e+02 1.043383780046998623e+02 1.179419723704483545e+02 2.657957039197758036e+02 5.504149111634283145e+02 1.522328087228474374e+02 5.676580079678338109e+01 2.121044308064688977e+01 6.568523013451590842e+00 5.854924926035611321e+00
6.313569233665947422e+02 8.587568912399093790e+01 2.623681992827756559e+01 9.568025370391348261e+00 1.222488651007936866e+01 2.835253054740113399e+01 3.801681642775865555e+01 4.429688780489726696e+00 2.516467242641081459e+00 2.829451481811132485e+00 4.884908848225871125e+00 8.142790051395481399e+00 8.819329578876470066e+00 4.596213171089871707e+01 1.684712730090408854e+02 7.647232603263652209e+02 1.362545769428218136e+03 2.908519430108916367e+03 3.403646347552057705e+03 2.658495526961749874e+03 1.197175869769359451e+03 6.245879138768684413e+01 4.028086963350806116e+01 8.231741929085028175e+01 4.511850509507456763e+02 2.534091961059946527e+02 2.228723324970084718e+02 4.158298009044428056e+01 5.982354758693090524e+00 4.443219089263845234e+00
3.640254819823915113e+02 1.192276245445602569e+02 5.051240041288058080e+01 5.195095293197603326e+01 1.298202156733746904e+02 9.366708768703597343e+01 4.006389345284559766e+01 1.698703405939780708e+01 2.606268516164201543e+01 3.288978821923296181e+01 2.977178196214384620e+00 3.270434944175709902e+00 4.874634913574785955e+00 1.040639295562197830e+01 5.943807004254624360e+01 2.292925810731834702e+02 2.151606208826558486e+02 8.621035257727419321e+02 1.041314020514081449e+03 8.267945730327862748e+02 6.215573941730416436e+02 7.240393494983906919e+01 1.013431815671529712e+01 1.922378685088847305e+01 8.373474835100657288e+01 2.011877795144923766e+02 5.299558070096527445e+02 2.911416470581351064e+02 7.156851194209916223e+00 5.163817021274015318e+00
1.312471672936486868e+02 5.501750297900323972e+01 6.391824799761114662e+01 1.188578401072990971e+02 7.304990997470098080e+01 3.449716840127894102e+01 1.636935678307195019e+01 1.189739545373836194e+01 3.852351777775537300e+01 1.443229359376399543e+02 9.530724889951335044e+00 3.200387480099441184e+00 5.171851581534022024e+00 1.069401166444230356e+01 4.798525638703415552e+01 8.153298161661011534e+01 5.276110961427251311e+01 2.474678390670817407e+01 3.709825790540246970e+01 6.331537940523996610e+01 1.030882039856451797e+02 2.167416663953442679e+01 1.036823883645665134e+01 5.163253435428197236e+01 1.240895609809554117e+02 4.309731548036218385e+01 1.443943333639919615e+02 1.558023809068815524e+02 5.399051608284975146e+01 7.915638082436347034e+00
1.331301223479284488e+02 1.129564143840441517e+02 5.986920533376085984e+01 4.845661166220352811e+01 5.076452827958722480e+01 2.006262163821985922e+01 1.367565396277760570e+01 1.449404215775198423e+01 1.635858087288090701e+01 6.316936277456279925e+01 1.728962593650478397e+01 1.597717116194082720e+01 1.440748531060231485e+01 1.693020845736122482e+01 4.648298802640398719e+01 3.104052352279238391e+01 2.052656412721932355e+01 1.205923765070405729e+01 1.044009873915803865e+01 7.803127298407892098e+00 5.967306665138008448e+00 8.388810559823843604e+00 1.286179078219343985e+01 3.136949827547237390e+01 5.396155473262176372e+01 2.537553757383658848e+01 3.956392021512677104e+01 2.525256784745015892e+01 2.457648425272985193e+01 1.528431491212372251e+01
1.804474459417819503e+02 9.952448315272067703e+01 6.159134346944622251e+01 9.303181781006685469e+01 9.200609587903556985e+01 5.254058862742137137e+01 1.851884186464354798e+02 1.453192739508537272e+02 2.201090555547610350e+01 1.544399001631033386e+01 5.338408963251222161e+00 1.191320011853435901e+01 3.378830610339496587e+01 3.545093159607785083e+01 1.046881618044181010e+02 7.550934524788874569e+01 2.342829245783834580e+01 2.737843293658708888e+01 1.247622768316153596e+01 5.336565801929495478e+00 4.748055114864758508e+00 7.100801181766076553e+00 1.081997309620460967e+01 3.304014260959445437e+01 3.319656707836345078e+01 7.779443815793486650e+00 8.465116658464369337e+00 1.058413727624784606e+01 3.352452522497272724e+01 6.748488334533353949e+00
2.422041148162873014e+02 2.217354820905094925e+02 7.315255690631650509e+01 2.766110214690585849e+02 3.607149661285425282e+02 7.141568536571687673e+02 4.965434990052262947e+02 5.854269846700750435e+01 2.164661183321787874e+01 1.210461019320473142e+01 3.467042111955527250e+00 4.212509687118166646e+00 5.050941427580481147e+00 1.937396121811680061e+01 2.342817139222773903e+01 1.024450520308545265e+01 9.850952364710295228e+00 1.176141216706873749e+01 1.583609825596177423e+01 8.447770980454068379e+00 4.567138947355147138e+00 6.178128484737289483e+00 6.912302759633552007e+00 1.147157099713841433e+01 3.534950084619630672e+01 5.440716020983201062e+00 7.688423521544238248e+00 1.247823138681905064e+01 1.476850934826531514e+01 2.909267320266562251e+01
1.325099462453209185e+02 3.486451835447524559e+02 1.129571998550009653e+02 1.331056397963777442e+02 7.158591357938098554e+02 7.914403206698152644e+02 5.461565689844160261e+02 3.895726860278846715e+01 2.808776279334640691e+01 2.568558700695798080e+01 1.023266832663860626e+01 4.930110421134277665e+00 3.061377137186778619e+00 5.206840646462547184e+00 2.436848361882253045e+01 6.963457330535135270e+00 2.421107796411777713e+01 1.424547089194738874e+02 2.453264512494949940e+02 3.315173753724917560e+01 6.426731762026495431e+00 8.114820968113559019e+00 6.887559925035610320e+00 7.525848663204103062e+00 9.893658466455999445e+00 7.470975204847317919e+00 8.636809840858798992e+00 1.055748319949317171e+01 1.405234395542101922e+01 3.423428283504006231e+01
