7.932026964287476611e-02 1.122876677424232555e-01 9.451551696269326619e-02 1.173775312829976880e-01 8.206656634076525680e-02 4.871899504931184169e-04 3.302882780981042165e-05 8.836503363303798992e-05 1.596598250917788734e-04 7.331586444983514462e-05 5.626384381698068234e-04 5.006955740290684742e-02 3.340887467612998346e-02 1.224797433874777047e-01 1.311311492497514676e-03 3.379712368528359906e-02 2.984672183668361290e-04 1.968817721215753431e-05 2.453562513306130192e-04 1.136474331608481464e-01 1.059505203672152507e-01 1.614051580804105185e-02 1.241341979290816640e-02 4.896852709693338968e-02 9.269100441595806705e-02 7.085228224594354585e-02 3.170914209774311487e-02 2.791892589010427916e-03 2.668599719764726784e-03 3.361322637851898391e-03
5.128058650104461852e-02 1.064070651718510285e-01 2.802207062902239108e-03 1.511962998675872843e-03 9.577905911295316044e-02 1.531798889523457510e-03 3.606718286417155369e-04 4.329787442501674497e-04 1.514703338022950886e-04 3.113164392152240311e-05 3.405796132275561703e-04 2.514162993015725545e-02 3.855519690984474807e-02 9.312380705146001969e-02 1.305479916130656594e-03 9.338976814774470336e-02 2.746961473667822434e-04 3.628620804267503795e-05 3.479521159078759673e-04 4.154248837039651058e-04 6.182543135551931551e-02 1.580069669978224206e-02 3.311614331603539990e-02 2.919875061942062838e-02 2.509520296223323454e-02 3.262687710118086781e-02 1.110195198964752418e-02 2.826340194248796404e-03 4.029995683806307342e-03 4.036391879389981258e-03
1.464324656674150958e-03 1.315976582187791200e-03 1.534099071825062097e-03 6.732956702280018654e-04 2.864584188504243345e-03 1.259756554327593056e-03 4.136469275049963618e-02 4.380765235085489623e-02 1.875988204319830677e-03 1.146022895810123386e-04 2.871096682834909015e-04 5.198346452997625695e-04 5.432984338181234612e-04 1.306603482860448388e-03 5.760440112921476341e-02 1.257274672868082281e-03 5.528826531550690756e-04 3.615552420961827855e-04 9.873472941674199337e-05 4.839544526538490095e-04 3.885986472798175217e-02 1.334071538507863690e-02 2.067567880164555838e-02 7.081184805154201040e-03 4.054749540626921556e-03 2.573689440555125465e-03 2.212269745460125267e-03 1.741698002813362031e-03 2.977807773366481815e-03 3.345110573102956248e-03
5.206873796367550943e-05 1.383977623391257554e-04 3.023655016667013131e-04 2.445821490450918309e-04 9.535072760383884669e-04 8.321773962464049101e-02 8.371432580699295078e-02 5.256800823924037691e-02 2.881517007637669422e-02 1.997192209841411185e-04 3.219387379067671770e-05 5.256265091726968017e-04 9.913500566774071255e-04 1.441783215929244837e-03 4.478487762061535149e-02 3.906337588727125387e-02 8.391930995361071566e-02 1.280572104840633357e-04 8.892412480233395839e-06 2.018626856631935127e-04 6.941085630605810242e-02 2.822834812598204457e-02 9.632748200001456373e-03 1.877592599919944774e-02 3.334943500702744392e-03 2.308174703081521898e-03 1.920582327479577849e-03 1.823544479989982082e-03 3.706644838083241952e-03 4.029077343853867087e-03
2.947583805660014138e-05 8.449085620431408511e-05 2.351777559862965549e-04 9.156884154418075069e-05 7.206806483714206990e-04 4.864778966496620394e-02 8.594869589312457980e-02 4.899605629548935831e-02 1.825106484821486380e-02 6.845042878664438484e-04 1.554081061114018106e-04 1.658083257710715264e-03 1.068752943932890637e-01 1.111408215693972801e-01 5.854983873858039117e-02 2.359720773891207588e-02 9.159201897584175016e-04 3.432149172537769994e-04 4.235130870932120729e-04 3.634057625456531618e-04 1.119747901084297836e-01 3.610792798355316746e-02 9.309109494711390043e-02 3.053460525190772670e-02 6.032902533532767154e-03 3.133168717091189357e-03 2.134715736060312664e-03 2.465848754149933125e-03 3.854989311608244054e-03 1.415950960111024559e-02
4.034802011608362043e-04 4.438277736656799600e-04 1.001311761836946347e-03 8.904001362127303984e-04 6.527393776251710954e-04 2.758284199695362759e-02 3.548742947819207016e-02 3.834812580960274969e-02 3.152298576156925547e-02 7.441359451314130636e-04 9.246307747863984116e-04 1.881854302069276789e-03 5.052456936390973402e-02 1.900295197607440589e-02 1.590721934369942678e-02 2.682576205046127010e-02 7.552837525672304693e-04 3.607948610599743394e-02 1.186070419221878364e-01 1.094359205973457518e-03 1.240385957224024536e-03 1.938979438925071599e-03 1.128176553719804354e-01 1.762937573227880625e-02 9.018747842561515918e-03 8.318298278738835844e-03 5.148803496412951083e-03 3.542932964636622255e-03 4.671480856236556040e-03 8.372627821117270205e-03
2.681865244067140747e-02 4.019637747368633857e-02 3.941896805941962761e-02 6.170863109227625598e-04 8.921564632806749939e-02 4.648621298282198662e-04 8.199386042950978842e-04 4.475424774877961474e-04 7.116278097959552766e-04 7.690148909194969695e-04 1.154150725405289277e-03 6.074572051859678662e-02 2.844047390133807793e-02 1.318922408959798467e-02 7.687417438611622925e-03 1.326590812062838909e-02 7.507813267799480494e-02 3.401422702137650578e-02 3.621542311713782662e-04 7.606562698276848975e-04 1.234338988073381826e-01 3.529492227141820676e-02 1.645037424924907302e-02 1.580071625091740081e-02 6.125419017651731642e-03 6.287571428840826177e-03 5.593758006739214111e-03 4.845044889766261277e-03 5.608136405664670802e-03 1.317882764450000951e-02
5.638177497799750498e-02 1.039226723534175389e-01 5.744284498261187366e-02 5.120143138053353214e-04 3.711349984030450403e-04 4.112229233393955435e-04 2.041781598480085368e-04 6.897789032647711881e-04 1.593526785437276690e-03 8.600499475241485392e-02 3.589895082532748583e-02 1.108735064972170975e-01 2.405910280512655805e-02 8.552234928348107293e-03 9.676319431391496376e-03 1.798760564253228111e-02 7.111033449115070548e-04 7.057719917919798172e-04 2.612342104170472840e-04 4.772200669286791124e-04 4.977640576512201015e-02 2.951298714204138654e-02 1.184920567242997262e-02 9.923211098464862490e-03 4.725902559692976568e-03 4.972607224437886227e-03 8.075431759097912235e-03 1.036077903264367474e-02 1.012181935125918385e-02 2.884385228843184060e-02
1.701890903504912119e-03 8.676160699484072869e-02 5.028521484116694334e-02 8.454844441420206582e-04 3.388376954023738499e-04 7.463489588227580074e-02 1.145746336409653393e-03 1.046294591035753238e-03 1.176844254373373422e-01 1.228476228369903972e-01 1.118383129353070077e-01 1.286399384206944390e-03 1.458458872338012089e-03 5.219094638215205587e-04 3.091475656024379737e-02 2.609815979488708942e-02 1.049851762935060939e-01 2.641669634790819762e-04 2.962890232522510719e-04 6.555880322368298763e-02 1.316188721406885004e-02 1.382114010437186270e-02 1.513887351033131948e-02 9.892630917565734677e-03 5.782711646774849230e-03 8.846886707941963718e-03 3.514176161013703864e-02 6.982911872506998574e-02 1.958125102836461850e-01 9.382679493185699937e-02
1.004029658124482678e-03 7.738742293980199185e-04 1.257989078748425254e-03 2.733280499723243296e-04 4.481408990427065216e-04 3.614510620455098355e-02 1.432092609498514637e-03 8.372079161087556121e-02 4.086207508635104901e-02 1.504123374198472300e-02 1.904958742592132749e-03 6.821400902320886445e-04 7.594854660864045620e-05 3.211442950689463141e-04 2.187810035302970718e-04 3.556721654390034449e-04 1.216664578039393808e-03 1.692104049192040029e-03 1.017184010358349131e-03 9.946747274949599687e-04 1.693147274306514363e-02 1.079907915977847133e-02 1.250391247430924016e-02 1.373598822431483686e-02 7.638373863955224587e-03 9.770626335277258351e-03 9.426979347094813222e-02 1.585619490486691874e-01 1.922701182808916887e-01 4.913790716973274325e-02
1.129859353328244468e-03 8.879473191173027635e-02 5.824138431990995681e-04 4.132826054406135013e-05 7.164423109831263717e-04 2.280603160796370807e-02 2.242669676550267110e-02 2.050621446483011714e-02 1.415217789842888006e-02 1.124635702372463880e-01 1.954740939639543207e-03 4.637087010547314781e-04 9.641507211233257563e-04 4.722193401823531660e-04 8.627099665266699745e-05 1.666780164498042659e-04 3.072562033461549106e-04 3.607639228227844984e-04 1.120602188394602544e-01 2.748596879762606193e-02 1.161779140927918057e-02 1.047891425617872296e-02 1.367204975771951943e-02 1.913106190222418901e-02 2.035761607899263387e-02 1.105910786141739953e-02 1.780251132069269118e-02 1.397081313952142946e-02 1.234442283121202528e-02 8.723513329200363597e-03
3.982276606058635093e-02 2.171692464188406529e-02 1.487368779358644224e-03 1.235679583245012344e-03 1.120100011364687578e-03 3.712184114681352232e-02 1.733218375659486069e-02 1.198198070574004771e-02 1.462418356926868494e-02 1.260065749205654864e-03 1.795910456333957121e-03 9.232172272927985628e-04 9.576052433543959241e-04 4.937065492200771923e-04 1.768054166999774601e-04 1.971270760207419323e-04 2.182236955888509780e-04 5.712521638635073562e-04 5.222081865184890473e-04 6.177328641119497060e-02 1.094576876323573138e-02 1.124462421277003764e-02 1.342088786149385309e-02 2.404298657377518592e-02 2.280203944703894717e-02 1.623001568531782374e-02 1.248558255061224705e-02 1.137490026232654099e-02 1.243193100525982579e-02 1.345131405658743333e-02
9.483296620779861977e-03 2.268657633053114409e-02 5.073909026852240628e-02 2.516407442014880012e-03 9.150730352904140608e-02 3.136195213052555414e-02 1.738180717895749031e-02 1.512248370287576013e-02 1.985582050907324508e-02 1.363388378185292071e-01 3.824005052800887039e-02 5.187649064240746960e-04 6.854345037503217948e-04 2.919933314771214618e-04 9.125738016890670116e-05 1.046164829195426549e-04 3.927580532020788468e-05 5.882410196396178074e-05 5.577912144727788105e-04 3.494747849086124523e-04 1.032587378511260444e-02 1.141809753473585660e-02 1.458295925278519506e-02 2.431259132377262475e-02 3.083394018498654757e-02 2.697585206753798370e-02 1.994240247595829157e-02 1.892692249959949946e-02 1.680341353356933423e-02 1.406149629390377603e-02
8.235046974816463000e-03 2.312694449452411607e-02 4.056602278558837926e-02 2.914215922589694086e-02 1.727262292154079296e-02 6.699070375714884229e-02 1.563900098630180641e-03 4.636359318131113194e-04 2.764024901608289411e-02 9.074303709760657075e-03 3.231069618794511072e-02 1.877744069422092408e-04 2.989611476088543246e-04 4.028287328495419963e-04 4.277744687355969550e-04 5.735436947439979342e-04 5.323359910248134192e-04 3.574228479535764219e-04 1.007736686927879341e-03 6.847064696421449300e-04 5.553503939613127103e-04 6.691424324118132316e-02 5.077945474281582439e-02 1.215436783722504410e-01 1.196016459510340852e-03 4.827513433999467839e-04 9.322132706967440870e-04 7.256158172210659760e-04 2.287311687775834754e-02 2.682527896876562776e-02
7.705377241743465756e-03 7.663842984441992037e-03 2.081332368361613755e-02 1.557407851216397743e-01 5.688203802611598026e-02 1.259628642492434045e-02 7.172551349762315565e-04 2.986826953366455593e-04 3.391041880260307916e-04 3.336503037144848693e-02 6.890958200670667388e-02 8.689576936334382929e-04 2.540520063334097620e-04 3.218153828990926758e-04 2.902504305958935032e-04 3.496589271992934502e-04 6.244582993414227873e-04 1.134139468066308522e-03 1.211925307993922882e-03 9.943018996126620941e-04 3.814392156331872143e-04 6.558864295352384880e-04 8.337699690614076625e-04 1.580530830186684501e-03 1.347375719704716011e-03 1.005705629034281444e-03 1.007690972864113159e-03 1.161064301270291329e-03 2.341361973832440865e-02 1.815433748396019092e-02
7.052879360521875120e-03 7.627697827175883467e-03 1.708675105430529362e-02 1.897851707487618195e-02 1.275494818117650295e-02 1.326217146583062896e-02 7.274761800546443447e-02 6.720176294607449073e-05 2.157915851653735486e-04 1.812753793747159427e-04 1.971560994383520372e-04 1.028781059249442986e-04 1.355302310388270385e-04 2.753418157367947547e-04 2.577280301536660594e-04 3.953208843186604570e-04 7.271951466982686917e-04 9.442127160021372917e-04 5.824447045983196809e-04 1.342516973510564837e-04 8.326431281620124054e-05 5.885734389763851940e-04 8.787829414067412342e-04 1.511217778718132974e-03 1.446941638964946691e-03 1.903226068188995732e-03 1.534149286565471932e-03 1.593417618743078008e-03 3.368068542790042530e-02 1.990706559602233028e-02
8.962603686939820541e-03 1.029263308393584334e-02 1.003984480131834243e-02 9.420795121369703387e-03 1.360075706120255669e-02 2.280565463437472795e-02 7.424616076258746698e-04 1.239962569052798858e-03 2.387457203488699688e-04 4.086588981116038476e-05 3.010475659374691422e-05 4.618166403357831746e-05 9.089541085205211674e-05 1.351768379311005447e-04 1.796861503144694765e-04 3.235811463934898098e-04 7.549959716343870473e-04 8.287500919843852291e-04 4.258171738901608892e-04 1.562328238486577418e-04 6.997828241454937415e-04 1.313212440182583759e-03 1.740141519245906208e-03 1.842406553964827561e-03 1.657188009812131336e-03 1.447699792429667665e-03 2.149470032159054179e-03 9.300125156585261049e-04 4.365408548455924215e-02 2.363418376697623211e-02
2.221600708653416467e-02 1.739821483027264096e-02 8.514585615474981606e-03 1.193086038207996982e-02 2.785159771786429738e-04 3.339674535085060945e-04 6.316308976180778434e-04 3.151045344208016361e-04 2.989082043151250045e-04 1.503605081305089324e-04 2.224893320160774767e-04 1.757254018256142344e-04 1.672061111556586907e-04 2.714657887543547215e-04 8.380966348837983458e-05 3.877400354537553534e-04 4.492169385110234567e-04 1.101270086784621486e-03 1.989478824703051004e-04 3.579628556358117951e-04 7.848228908291737891e-04 1.770437574216266472e-03 2.273531677875013143e-03 2.442523794363366148e-03 2.062296336016508809e-03 2.002616597265353092e-03 1.857714780650562749e-03 2.272021555334121940e-03 1.395537966168923592e-03 1.140067551181296384e-03
8.879059850837421261e-03 2.440124593599610897e-02 4.258969969224671304e-02 4.230281629438791360e-04 1.753478789745156633e-04 7.682793952471006678e-05 2.336773510451095181e-04 2.794464275026985320e-04 1.835193739850466961e-04 1.442516784089174471e-04 2.913490160313094639e-04 4.485575507066508205e-02 6.744975208860215510e-02 2.735100728286193037e-04 3.039131450329498311e-05 1.843652014881574854e-04 4.692550880437960687e-04 1.775204602500063411e-04 5.145386303465822320e-02 1.334181357880801096e-04 3.022397760560594122e-04 1.663523960426700494e-03 2.175222182252820567e-03 2.377099796599864770e-03 1.802952472283880867e-03 8.582061140968677256e-04 1.411334003509545935e-03 9.680887455291351494e-04 2.760581384838255246e-03 1.317168621949637020e-01
2.352220651522237229e-04 4.769945821111215740e-04 2.708398967838546276e-04 1.801037136635684065e-04 4.206744406139786434e-05 2.274156114948135493e-05 1.106695845179108057e-04 1.348827283330648798e-04 1.178582855320104659e-04 2.374356384388573698e-04 2.808441975648413684e-04 3.063727492408671593e-02 5.233755636951831214e-02 3.378852419535902552e-04 2.277420703182922749e-04 1.031378121150117123e-04 4.664683705901487851e-04 1.257476934479885566e-01 2.256400805616767292e-04 3.113184207075778143e-04 9.659498412580742877e-04 1.872306966820958376e-03 2.058760492949523405e-03 2.064695085176577669e-03 1.677248143061190171e-03 1.288748123002905104e-03 1.291064794682022197e-03 2.379556173611653818e-03 4.061303172644890186e-03 1.055467585179549472e-01
5.855763795161360931e-05 2.775923140633580646e-04 3.479744712416742354e-04 4.166553769257101952e-04 5.984916772197446241e-04 1.902692541756812795e-04 5.847189175937809276e-04 3.196704533882305851e-04 1.154200791046169840e-04 1.530586067499445282e-04 5.167305301490633662e-02 4.580639285377632181e-02 2.556759651772773367e-02 1.192206604722316141e-02 2.573096138029554170e-02 7.630495282170590698e-02 2.587446333425998698e-04 4.604970523662914577e-04 4.113565839616882330e-04 3.533663754576211883e-04 9.786383248823987517e-04 2.584868180094978575e-03 1.033180569920162575e-03 1.587569405843547833e-03 1.333544486631995426e-03 8.101571778600993043e-04 2.358079560851700490e-03 3.464605904105769792e-03 5.952290804943219382e-02 6.473528686997090387e-02
4.689756149683314818e-05 6.497347783418279572e-04 8.820751518814573533e-02 7.560465969930027508e-02 7.013457639856592041e-02 1.004127196641771275e-01 3.774795587847356139e-04 3.439822811256750684e-02 4.716620154484778976e-02 8.154465529483009151e-03 1.202154678363692546e-02 1.924716957000667528e-02 1.854873003296359651e-02 5.856852769942590825e-02 4.450815746688204541e-04 5.655411967091564761e-04 6.960176084910589187e-04 4.529285738714058647e-04 3.298384733696508187e-04 2.598608194893738165e-04 1.872720794870427535e-04 1.305833699460503628e-04 1.051423015066038080e-01 1.064513376187989536e-04 2.462215552701056925e-04 6.539136267146004617e-04 1.368115432767075691e-03 8.647257451725835764e-02 1.119815658763423198e-02 1.045241124628324553e-02
9.709420166676526658e-05 1.271728306419764526e-03 9.962840747693317567e-02 5.841207584100804179e-02 9.755827917931852999e-02 7.489929616150074743e-02 1.157942892135357532e-01 1.260312551436570776e-02 1.138416074151319714e-02 4.940044965693666731e-03 1.227261319157371515e-02 2.269523824111931501e-02 2.481470904273435502e-02 1.151338762719004982e-01 6.496972376564386607e-04 8.605762966634925948e-05 3.315449185653534690e-04 6.549990743402891004e-04 7.853983963296058300e-04 7.200193952228975056e-04 6.904275087338117723e-04 5.221491428870585942e-04 6.059434308416854166e-04 9.621488722739954562e-04 2.972688694163043584e-04 6.622744611997885599e-04 1.014338407774253020e-01 4.162335428193661424e-02 1.561823541938710432e-02 1.501009141719662071e-02
1.183430236545667241e-04 3.484635654612310354e-04 5.607308106792467661e-02 2.411989900601087949e-02 3.036044002198182851e-02 6.859586325983227373e-02 9.145476685761495805e-02 1.056387184035202653e-02 5.671155751040074522e-03 6.488456960615189041e-03 1.183097504613468166e-02 2.024433443683481756e-02 1.888714377163325589e-02 9.068369616659739674e-02 1.240989275276740272e-03 9.715261856558253572e-04 2.537680732995554176e-04 6.138590212806509802e-04 8.119397337569665566e-04 7.334484334825440649e-04 4.012226118732043108e-03 1.144613960444119394e-01 7.715255113617788818e-02 6.308184062429649441e-04 1.028254506324790185e-03 1.081495431977790370e-03 2.290262451995899416e-03 7.262661868042161184e-02 1.278121639388288787e-02 1.158631311147446767e-02
5.129199854486918590e-04 7.314646352421895004e-04 1.210230414575547281e-01 1.289746751062464392e-01 9.071802917100631669e-04 7.431089620586623637e-04 9.377664701987312168e-02 3.983614853068603162e-02 5.800350497053097937e-02 7.448636142386023951e-02 7.016219600820312527e-03 8.483063834439363848e-03 1.119934607333512161e-02 2.178197858247610599e-02 1.095650673777285172e-01 1.301448458785631418e-03 4.067129061721423060e-04 2.046778121506637182e-03 2.196487631456914107e-03 1.452024614427068362e-03 4.131407852310729940e-03 1.478117641498014334e-01 2.321447768405755438e-02 3.732066982065838229e-02 2.042026037942766721e-03 8.178243251531456008e-04 3.525721157145155719e-03 6.504992312661766508e-03 1.517227151467951882e-02 1.332362975551849849e-02
2.026891108307783218e-04 1.231373576702725903e-01 1.569072511738516251e-01 1.616603068969561493e-03 1.687049446730807811e-01 7.908687821706712751e-02 3.786938064494056039e-02 2.772548474842152777e-02 8.680902076608278117e-02 9.499598851580615426e-04 2.310398506423386525e-02 8.609935646169918771e-03 1.278736542908666743e-02 2.357013042326669763e-02 9.763549966577245165e-02 1.270068155808525218e-03 1.025933139701090957e-01 4.834198817508424811e-02 7.090045235483299901e-02 1.202247371161379585e-01 1.650549965664849152e-03 4.956516678650402241e-02 2.545519881728217429e-02 1.175122227765816041e-01 1.082394460310304000e-02 8.260350129312797607e-02 5.817194946203209024e-03 1.106932720822753971e-02 1.249199074660777009e-01 2.140858148833603772e-02
2.314664007690274980e-04 8.133030167047684573e-04 1.504990879320675656e-01 1.213662518973418897e-01 1.184691716272593814e-01 4.680632678389282098e-02 3.115585314372172621e-02 3.256352029829966133e-02 3.633781609474755203e-02 1.450166761986307895e-01 4.279022217207981149e-02 4.306751387126056541e-02 3.474975291884693784e-02 3.527922741980268895e-02 8.879843983218811687e-02 6.016536500592639669e-02 4.288611702085670663e-02 2.714232315506704546e-02 2.390633721299339001e-02 1.805117485602963576e-02 1.448737362658313391e-02 2.117932109872836671e-02 3.235166020386960606e-02 7.548467948333069388e-02 1.289437584814010218e-01 5.813596346920742869e-02 8.961984403410550026e-02 6.287869035078465230e-02 6.542757718979766435e-02 4.338466089012405630e-02
3.111817286950490047e-05 3.271799953588631817e-04 1.494548410253324355e-01 5.839292973631198718e-04 3.114755373947102968e-04 1.129553950024571735e-01 3.153424474679158334e-04 3.394752018425347632e-04 5.013964922376405731e-02 3.659738478678955381e-02 1.379595775192532688e-02 3.212428423189513105e-02 8.093813016582986075e-02 7.417218196408678632e-02 2.156477988350854243e-03 1.602032920632744930e-03 4.862566287263023895e-02 5.867072934100462517e-02 2.701376926831702829e-02 1.206638007314301750e-02 1.173621402458646309e-02 1.833065353478641538e-02 2.782685722760676328e-02 8.505714444935406904e-02 8.595768593830555027e-02 2.038476540423119279e-02 2.278713350618007463e-02 2.963167205389505635e-02 9.724670819844982717e-02 1.999259271467788285e-02
4.142885211582560378e-05 2.974813819749895006e-04 9.886411429934133439e-05 3.838056483080996709e-04 1.367844877341159904e-04 2.632314268696826689e-04 5.292916484695003041e-04 1.259081298131342619e-01 4.989314084391856946e-02 2.915694513117119552e-02 8.897013693947216154e-03 1.142171483249138780e-02 1.227109198910546206e-02 4.203095542565767062e-02 4.815202766145248309e-02 2.034731862546839895e-02 1.708902308818903426e-02 1.876792560846106059e-02 2.572787036289611931e-02 1.502196648993103963e-02 1.066458788587729828e-02 1.587488720796570094e-02 1.805944376197931439e-02 3.023278974477652120e-02 9.444208814146759501e-02 1.493794591918867591e-02 2.183088825822827872e-02 3.608637251534754092e-02 4.384635856547548088e-02 8.750632428760551917e-02
2.253146515718555771e-05 5.365404168393634373e-05 1.496301806065035402e-05 1.479889696982619446e-05 6.570893907274528035e-05 6.683783822591875365e-05 4.218061295942281911e-04 8.880829295316593208e-02 6.872298345209572334e-02 6.439513288413138692e-02 2.652624130129076219e-02 1.340768963646121748e-02 8.049110376463488800e-03 1.263059916659508251e-02 5.759905688120676992e-02 1.508242832265384997e-02 4.096338222254959638e-02 1.198433995296341922e-03 2.517482506522443486e-03 5.716398196604033366e-02 1.477556787602535109e-02 2.068039297930425804e-02 1.800515563626791868e-02 1.984501307975936740e-02 2.637477322120634557e-02 2.028685316482393627e-02 2.403854602736432700e-02 2.988797459907004128e-02 4.064288841651191031e-02 1.001849023151189511e-01
