3.396498562259879228e-01 4.913401886688882336e-01 4.165802857572548090e-01 5.169780047008700752e-01 3.630668903789225355e-01 7.570659207316943196e-01 6.899556675536602235e-01 1.852955013897326225e-02 2.633953834939304836e-02 3.587221741871916836e-02 8.396195582718750661e-01 2.187840159180838295e-01 1.436264493778866280e-01 5.668218983787736143e-01 7.007450063281153163e-01 1.660269527874353168e-01 6.271661991906827271e-01 8.358487996510685983e-03 3.607030867052139506e-03 4.655328670533112057e-01 4.334835438552279152e-01 6.445397108742047243e-02 4.905778729861835080e-02 1.950957193246143362e-01 3.775171273938388583e-01 2.963171746819400210e-01 1.366293901888110118e-01 1.205539549189728332e-02 1.153796597003248561e-02 1.454942548800908578e-02
2.225885300859668792e-01 4.741212669781857958e-01 8.355537909023922349e-01 6.298194965276848745e-01 4.340385983132463155e-01 4.625503696158210498e-02 1.806329879628370411e-02 1.515927746591593309e-02 7.078988804969240656e-01 6.425281221674219445e-01 5.150146973183591381e-01 1.127293993317605436e-01 1.690488119563936520e-01 4.353885711323400853e-01 6.356783205755822674e-01 4.556590440828028887e-01 5.816865395866817057e-01 2.088227775712545725e-02 5.174406542700019790e-03 5.573358685687639369e-01 2.492952611430773180e-01 6.218257656736299321e-02 1.282648069607195684e-01 1.140530291709984378e-01 1.008631809578207084e-01 1.356979017991247483e-01 4.800605358673543793e-02 1.223116807194970547e-02 1.744192603362946375e-02 1.747208203522186004e-02
2.212758281924460252e-02 3.131425955061480776e-02 6.339131981960055562e-02 4.452655455030073844e-02 7.414806431950160537e-02 1.562868495239920844e-02 1.820678811638331840e-01 1.926315490832120059e-01 4.046881641589353262e-02 1.185523143358816443e-02 2.732224617255396212e-02 3.701875992718196146e-02 7.648810888695469767e-01 5.270565535793170914e-02 2.601156334048538854e-01 3.493284725381022582e-02 8.908917932065748557e-01 2.003319778599584738e-02 3.270982542177723607e-02 7.458393821466052093e-03 1.576782043912685893e-01 5.177835116417425776e-02 7.839583885565445942e-02 2.710216034825783243e-02 1.606865807769781301e-02 1.064268944520138822e-02 9.602628428021852541e-03 7.554317810087636358e-03 1.290229240896962129e-02 1.448268536095892456e-02
9.295004962639689255e-03 2.447702238176734796e-02 2.286940029328917573e-02 1.841119134627654946e-02 1.619206606316506841e-02 3.700313181863945644e-01 3.689380966016667651e-01 2.295093108768656576e-01 1.244790236556895940e-01 6.506288495403494097e-03 6.448017092002803485e-01 2.636182113036543428e-02 7.519240548661261236e-01 6.087217476195763144e-01 1.907363905345617894e-01 1.624185082656763590e-01 3.577290632988887054e-01 7.056111373420589361e-01 5.549462174001243975e-01 5.163651515320677454e-01 2.841139074085136107e-01 1.096341508291820976e-01 3.663180043006807052e-02 7.195390521624318858e-02 1.315650432310417131e-02 9.423350576252906979e-03 8.141870449972199095e-03 7.733863489132505008e-03 1.571750479698668171e-02 1.709057037691387448e-02
7.098998438448639314e-01 4.496697023620877670e-02 3.697902182538031352e-02 6.920433755409200610e-03 1.108914725005528436e-02 2.168236010808498315e-01 3.798662787864091617e-01 2.143983083453488425e-01 7.892207963254656289e-02 1.828881818435687881e-02 1.466887624128494598e-02 4.008269430887531626e-02 4.547580988704902349e-01 4.712309912125705047e-01 2.462493102657316579e-01 9.979084555089819120e-02 2.687551775813338401e-02 6.749832992369972917e-01 1.575911898863024962e-02 6.389682190135881346e-01 4.535048552230150909e-01 1.409878694591588377e-01 3.585179436217383886e-01 1.181822827364222006e-01 2.377062121634929137e-02 1.259963966074474813e-02 8.770332903433077087e-03 1.015389567422745123e-02 1.589731688639099347e-02 5.850486496221895399e-02
8.233496787822509599e-01 7.724126616686125546e-01 4.103873208304494036e-02 2.605408311118560111e-02 2.629388211950360946e-02 1.284653090129680153e-01 1.660482911444002840e-01 1.767872083685638473e-01 1.482627337696016678e-01 1.002540882077397610e-01 4.770545497892891146e-02 2.820243612251561310e-02 2.040959905699775978e-01 7.731628762180092762e-02 6.517422124891833479e-02 1.145234251064857489e-01 6.282008535556252715e-01 1.630136496794844791e-01 5.194205373159954675e-01 2.548027726038779375e-02 1.689471169186659155e-02 1.551076914940748355e-02 4.412746363285080520e-01 6.895411398368765654e-02 3.547957945212749931e-02 3.295468888129345075e-02 2.054786601864606876e-02 1.419879505249679180e-02 1.878296946101985082e-02 3.379740675102989311e-02
1.376738275360061825e-01 2.099982382531432601e-01 2.032823481478238103e-01 4.176662994216265301e-02 4.748500674750711914e-01 7.950550615887014283e-01 8.962341598272188792e-02 6.913572541755470535e-01 7.891963784535772630e-01 8.300866648237796852e-01 5.869112392314079774e-01 2.482314125171831143e-01 1.134571585724237497e-01 5.277862562214052922e-02 3.118334459081407647e-02 5.839273618821051032e-02 3.440244062547990200e-01 1.612450695486561669e-01 7.879434228863435585e-01 2.543788988051200878e-02 5.118119897801438611e-01 1.413435645422994047e-01 6.531524304800483127e-02 6.233959435530708748e-02 2.403189761525663729e-02 2.454498961639564950e-02 2.172958979324706927e-02 1.894306118084892326e-02 2.205329968289628309e-02 5.215799170573142546e-02
3.028212183526495238e-01 5.643764218438233060e-01 2.983271898018032831e-01 5.977391455324871927e-01 8.974429218264838859e-01 9.826520485172781649e-01 8.661615893683892731e-01 8.361593612373597884e-01 7.309060895315607764e-01 4.010627745899403296e-01 1.569731416804096280e-01 4.625207145426551980e-01 9.923226813898980425e-02 3.477327465548205737e-02 3.982926603661147980e-02 7.656103285843671169e-02 6.070250569091852899e-01 9.530825595847197684e-01 8.371845894598752835e-01 6.385836644545607177e-01 2.034269581823141271e-01 1.164708332879708097e-01 4.622248631982396605e-02 3.851207039482479333e-02 1.830149274837251580e-02 1.922240483574420844e-02 3.115582140673088876e-02 4.021006700790027283e-02 3.950542827361358533e-02 1.133763504975630193e-01
7.742309072490779487e-01 5.098261653231696000e-01 2.824477754870515778e-01 2.179362943238521422e-01 9.852016247796800963e-01 4.096969249917394862e-01 1.211720808154448659e-01 6.165033673395881042e-01 5.652117304096524464e-01 5.565021051788174855e-01 4.827152856530543268e-01 5.915462921011604980e-01 3.346191680395875501e-02 8.135217000499395112e-01 1.290366222919733796e-01 1.108983554620916190e-01 4.578778395708866800e-01 3.644926327592401538e-02 3.261151743992123098e-02 2.738755345583420708e-01 5.292126335260865372e-02 5.366296525598877876e-02 5.813155502517745876e-02 3.788335692093858925e-02 2.217240076482549643e-02 3.394838741210882971e-02 1.347882180224736492e-01 2.688933381395927635e-01 7.586153500250778503e-01 3.661742126773993578e-01
1.271767486743037079e+00 8.204920761282848973e-01 1.245790611611275134e+00 1.114485411877937482e+00 9.583635706102413554e-01 1.846342289134868253e-01 8.832550564125489778e-01 3.945686429869804113e-01 1.860334799398776773e-01 6.557751711631207292e-02 8.752128807673492661e-01 7.330151910892617195e-01 2.438246062815782947e-02 1.992297332049409314e-02 8.045113847582663347e-01 8.086539115545468004e-01 3.218910550991323227e-02 2.712221578170938979e-02 1.320275224155388616e-02 9.861376070636329941e-03 6.558068577461090287e-02 4.135314598774472022e-02 4.740736188766421499e-02 5.209010772512451953e-02 2.911182930155154641e-02 3.736848005025955599e-02 3.613074138360961585e-01 6.090332354671678106e-01 7.416890347279816442e-01 1.906668573213937123e-01
1.082134808397174464e+00 5.560808887125046063e-01 1.209787120783596848e+00 1.001231884322818289e+00 1.832302932185498889e-01 1.152761677689878028e-01 1.014620325210981999e-01 9.213634171924450778e-02 6.129012852853989862e-02 4.762129693568359912e-01 8.126517946138783755e-02 6.268672515739645568e-02 7.299162478603792026e-02 4.551677391353708968e-02 1.206135628690874553e-02 2.281385186903923598e-02 3.009500708890999743e-02 1.338406742963583682e-02 4.494601600008180098e-01 1.094101981515558514e-01 4.501676624045317793e-02 4.013768584756256114e-02 5.184481927492413933e-02 7.265071604925710247e-02 7.780700351067605658e-02 4.247142055785642356e-02 6.855438689786270967e-02 5.369352351712481514e-02 4.744514774049384681e-02 3.361279157539169560e-02
2.085850526012093809e-01 1.206763144787583869e-01 1.037215324487169354e+00 9.881569206203120181e-01 7.706658377233921442e-01 1.779214871931893149e-01 7.468479242260869788e-02 5.021968170274208887e-02 6.139888970196023810e-02 9.674716259298803411e-01 2.732310884210072122e-02 3.486150182527286007e-02 5.656037039370676728e-02 2.941273110076711439e-02 1.065425574452690330e-02 1.472062834667943465e-02 1.617767131242287687e-02 2.305521772828362376e-02 7.533120852856547423e-01 2.497428279479112501e-01 4.315528923490602464e-02 4.373008065605096806e-02 5.176464406500910775e-02 9.278405520840966869e-02 8.838010783386253399e-02 6.310617375895306858e-02 4.856738188627318653e-02 4.396886838479690390e-02 4.771053156844211329e-02 5.144661087019750112e-02
4.222784775453806982e-02 1.068784271442305422e-01 2.529300268825188658e-01 7.049469433558246401e-01 4.617468831867909129e-01 1.491161657806175100e-01 7.817220217771170265e-02 6.757614474927928216e-02 8.526168913909223934e-02 5.586352351473442557e-01 1.559538678866591033e-01 1.491481334044796048e-02 5.014569422227973389e-02 1.787563219498998143e-02 5.649779043096809714e-03 7.987347871650890899e-03 7.443686306949874876e-01 8.507911509792139004e-03 1.427963338341675659e-02 5.280128039516358562e-01 4.154421300219916791e-02 4.542753627141062067e-02 5.737401552520500492e-02 9.605696254244146248e-02 1.224737538033435075e-01 1.074158216996959347e-01 7.921613070123853517e-02 7.387142370777582956e-02 6.452258656850738683e-02 5.326292410480217010e-02
3.482510822659475036e-02 9.954197446603477162e-02 1.768370354224373386e-01 1.272520165732430875e-01 7.532160897726519755e-02 2.977873560455348567e-01 1.003461677854026846e+00 8.754320111826130457e-01 1.165766058492532786e-01 3.639639733915484704e-02 1.295257924460345711e-01 6.929016427412334478e-01 2.289972452605592776e-02 2.542208666201533490e-02 2.727665871179883045e-02 4.505708300900169994e-02 4.060061769394635728e-02 2.635190203942127524e-02 7.576882664892793662e-02 5.601111216951156629e-02 7.508425490470972408e-01 2.737758132624870111e-01 2.048366513066979255e-01 4.897137675200733953e-01 9.881948466532487485e-01 8.417723706901563130e-01 2.165514835111284273e-02 8.381575312757594265e-01 8.750034922992852571e-02 1.007178393801615585e-01
3.179785895389914546e-02 3.195392768449339949e-02 8.687639610077799168e-02 6.488314439796798450e-01 2.368595902812699883e-01 5.444255609087721853e-02 6.672720550066468803e-01 6.424195802288659718e-02 1.834475441166248666e-02 1.366335985879371662e-01 2.836716847563330313e-01 2.658963601682711939e-02 2.543732339247102223e-02 2.080589864378249929e-02 1.897919745582424961e-02 2.316577370350390505e-02 4.028468769885324569e-02 7.098410856689273130e-02 7.375075247364833164e-02 9.550448246566245469e-02 7.270561710202128047e-01 8.144833398064378338e-01 6.764230180781700685e-01 2.629279071020309416e-02 3.071142100130453204e-02 1.064700323848988828e-01 9.996891190549275774e-02 2.389980398241796020e-02 8.990462093486822903e-02 6.850246959948308456e-02
2.859101145375191055e-02 3.115803789354328057e-02 7.047878547867454657e-02 7.840084504446880043e-02 5.275221401831048373e-02 5.562928589545865915e-02 3.069197958166153262e-01 8.193509617026463188e-01 8.786461332636694849e-03 6.937246761493490732e-01 7.550924109631145242e-01 6.013321247837445371e-01 1.196651487113252477e-02 1.825098508739149764e-02 1.726789180956865566e-02 2.683476015713978993e-02 4.768603369004065229e-02 5.957679367881823368e-02 3.543194306341110322e-02 9.894906661950631649e-03 8.174904815600445018e-03 6.295977191585915012e-02 7.856656296172430387e-02 9.836544462626806151e-02 7.794971902110453543e-02 1.019464235088793774e-01 8.155928276608293004e-02 3.159026546177888528e-02 1.303790830299922099e-01 7.647772255029712529e-02
3.612243616547290703e-02 4.166093619473135862e-02 4.079289301033037218e-02 3.854044598392339371e-02 5.555690903141377590e-02 9.254198759050899503e-02 1.988296272838814549e-02 5.351114005414071839e-02 3.249633613332903598e-02 7.395118211892134918e-03 8.362679808569814868e-03 1.305201010428246045e-02 1.776524867958452492e-02 1.515726159257713146e-02 1.237561556909620372e-02 2.261290737579127810e-02 5.045867413341216523e-02 5.277128579116897866e-02 2.590822505135182557e-02 9.149239342452243628e-03 3.992827463468651833e-02 7.311443210528817405e-02 9.459202359929309856e-02 9.809468890549566389e-02 8.696067298567994319e-02 7.528965024072067913e-02 1.113674750692468934e-01 3.241343045241801279e-02 1.802513325287015966e-01 9.748897374765341795e-02
8.957443784771312867e-02 7.013435391277145214e-02 3.418960320777956335e-02 4.804108438836392214e-02 5.689472990890274140e-01 1.100657656751145332e-02 2.909543962548908486e-02 2.220459672875679455e-02 2.169719210881216470e-02 1.066739918417852588e-02 8.460760192189000287e-03 6.945252102431722641e-01 6.724771336104156116e-01 1.009535427607274015e-02 1.194713891482560020e-02 2.787411544420093784e-02 3.903542362970136709e-02 5.105150056032637523e-02 9.152539413582776867e-03 1.357015030471472351e-02 4.435998526882074799e-02 9.714383305961217518e-02 1.212279377668727953e-01 1.270510149920802967e-01 1.054525974897788515e-01 1.018343577076299411e-01 9.470820183625591748e-02 1.162126983845470779e-01 9.169388073886212132e-01 7.562417761132810279e-01
3.614561738568813909e-02 9.980066317347108251e-02 1.736575734667923365e-01 1.167491508491090395e-02 1.355876297810382214e-02 9.989630198308402029e-03 1.652222821439349593e-02 2.055243127093090913e-02 1.399559195163095106e-02 1.648413557642165392e-02 7.932262974201917741e-03 1.866143543194084820e-01 2.888915660708751831e-01 6.790400328808996466e-01 8.066838031091217928e-03 1.303323751797103372e-02 9.887929096444692673e-03 6.572174468999211205e-01 2.084443357856006485e-01 7.310046295526165770e-03 1.708912330217757583e-02 9.233838476394709560e-02 1.185461132271798668e-01 1.260270455724589178e-01 9.320052454007848874e-02 4.367162950585157244e-02 7.129069420329250950e-02 9.994661800957341247e-02 5.173453912185278086e-02 5.563502094636395556e-01
7.615136567121776334e-01 1.164203640645718706e-02 6.928735678667985454e-01 8.693454093376722369e-01 8.960206224092603922e-03 2.500795760670482433e-03 1.254584122260124501e-02 1.044266645700463354e-02 1.494728345614118603e-02 6.875091903373082777e-03 4.950287236546406788e-01 1.270758313686413954e-01 2.234197385367490685e-01 5.432698748697921687e-01 1.302739854108382785e-02 2.546463617848848584e-03 8.130612597058498731e-03 5.090658268618193372e-01 8.274822288767587075e-01 1.676189694164979468e-02 5.491044918327876029e-02 1.056977906939706863e-01 1.153913533134970776e-01 1.121307680517833610e-01 8.808662902676385464e-02 6.576625212447072266e-02 6.463455506306806098e-02 8.127387711070389875e-02 9.859534245699338451e-01 4.303416190470812919e-01
1.197064522212598105e-02 1.764080195020677547e-02 9.085029051194161431e-03 8.013035198609233176e-03 9.047589457984422934e-03 6.567760546366570029e-01 1.418056532283267640e-02 8.511153628291809672e-03 2.445427837555256938e-03 5.403375980109680343e-01 2.182700199945347697e-01 1.928205688135359863e-01 1.088303596618345054e-01 5.076012592478835322e-02 1.083638292268618852e-01 3.117524096514889265e-01 3.725549868866302565e-03 1.102631308211293390e-02 1.017613391848754857e-02 3.224803816492654435e-02 5.642604251760527379e-02 9.348122040187695214e-02 3.857256322885034561e-02 5.947030594480181426e-02 7.127411837838945607e-02 6.493054851116245030e-02 6.215682174170068797e-02 7.950661605439612867e-02 2.429828721925775536e-01 2.643334687114465287e-01
2.915469594519578059e-03 7.620192872376533449e-03 3.448090323226069565e-01 2.953254456207031198e-01 2.767596450184968693e-01 4.050432037204004798e-01 5.683131727981401982e-01 1.419229420184180690e-01 1.975036339395764839e-01 3.426055502705423889e-02 5.073407055917327629e-02 8.007065075504968266e-02 7.697873689689505028e-02 2.451189068505829349e-01 5.468063950025178199e-01 2.710604247727685726e-02 2.226981015968415578e-02 2.785898740572956625e-02 1.936072254204074597e-02 1.486739778414596959e-02 1.772823682894717617e-02 1.583378877011563240e-02 4.468632554801589829e-01 1.065913276908612983e-02 1.320091648662716048e-02 1.144260436952542793e-02 9.624606078142166066e-01 3.516574953983627738e-01 4.527140807718386950e-02 4.224442117816000486e-02
9.406934938233546886e-03 1.581527812478949330e-02 3.924102976117547215e-01 2.294741266158900894e-01 3.861277352781321559e-01 3.042891965405323806e-01 4.770590198623793077e-01 5.258213133516030646e-02 4.660976155671618659e-02 2.016829233964920545e-02 4.996038151939701660e-02 9.240487488432583274e-02 1.013886064243287866e-01 4.751541557511775871e-01 6.193261328099668450e-01 1.322938250438857738e-02 2.106491888144236546e-02 3.980683566911955712e-02 4.579713955444288803e-02 4.071276708265074429e-02 1.951239181122836619e-02 7.406384794652051129e-01 8.734000792611745778e-01 3.495914911155122845e-02 3.045261054475327522e-02 1.136947958304222392e-02 4.054126433013967579e-01 1.658272730758608426e-01 6.162229834596271577e-02 5.912471311677109514e-02
1.188720451037830403e-02 6.312565756188039945e-01 2.224700216856387025e-01 9.799037981245223294e-02 1.276602113967005292e-01 2.910266107631415688e-01 3.802263429787537397e-01 4.295132724561674664e-02 2.301633003528763891e-02 2.620823848353025232e-02 4.758315262218548725e-02 8.134377653089706894e-02 7.617111785750342590e-02 3.680392193155796465e-01 1.336261816660836224e-02 2.155748610048931202e-02 1.586039690448123873e-02 3.691155153117771370e-02 4.720924756465810779e-02 4.123163199323827410e-02 6.423613435720225417e-02 4.658469576574038040e-01 3.200407271774352580e-01 5.760516875135814896e-01 6.634622243616047910e-02 3.105829601769274223e-02 2.203378546504781987e-02 2.826051388219877336e-01 4.946456328271458397e-02 4.470870425093918799e-02
1.020519727751133254e-02 7.539293620920646359e-03 4.979296730374096480e-01 5.497966282711148622e-01 1.347459226153272738e+00 9.436116581837199480e-01 3.918333513200859541e-01 1.610437879852942289e-01 2.442093099979076587e-01 3.111437276830084642e-01 2.903482344431903076e-02 3.387834945839964668e-02 4.513615060517028182e-02 8.939380073417986516e-02 4.666382470637947533e-01 3.099740553985861485e-02 1.710376636410078366e-02 2.816494015852763488e-02 2.844533193190625434e-02 3.928093841210812676e-02 5.625355482368780968e-02 5.852199877811945505e-01 9.444855097113410980e-02 1.644325290027941477e-01 6.710280872340252944e-01 9.451098813484398731e-02 4.735353219423164145e-02 5.019899198907404325e-02 5.765504894792622403e-02 5.042686689226100194e-02
5.744094553201371800e-03 4.966483524258941129e-01 6.565351075499681333e-01 1.274985904020629501e+00 7.577404549022827007e-01 3.455429077264283166e-01 1.583433845991109867e-01 1.119513447891571506e-01 3.643256948147061136e-01 1.379007529159304690e+00 9.589858697937878040e-02 3.557367371907144138e-02 5.456123562719916720e-02 1.050818598149777794e-01 4.505605268065853153e-01 7.517790575562386390e-01 4.454598340570109505e-01 1.942552844962762149e-01 2.766318210122583054e-01 4.724608822493836513e-01 8.290075539841333940e-01 1.958613022945865367e-01 1.023095330445535911e-01 4.952538055647198734e-01 1.132028104943318736e+00 3.501738199272851348e-01 5.243345584346324750e-02 7.998887949892366511e-02 4.711683734563296699e-01 8.039017438212600619e-02
8.492286514888681970e-03 1.137144666922993874e+00 6.476843133815853859e-01 5.166386230437469695e-01 5.176146519910669319e-01 1.930035224309652186e-01 1.278073081663769206e-01 1.334023378582344377e-01 1.544178262133095170e-01 6.035971668774189336e-01 1.783047097365998424e-01 1.852358556464521189e-01 1.554975366699855865e-01 1.746801883372325614e-01 4.710277588940380289e-01 3.119897624364874056e-01 1.977195944399435801e-01 1.108880062232873442e-01 9.411522665781456298e-02 7.065292121354724286e-02 5.670024518367708377e-02 8.323964795265841043e-02 1.286222283261976296e-01 3.081409284937691728e-01 5.268898958272598687e-01 2.367067531506306666e-01 3.466287881963131534e-01 2.383344853354443793e-01 2.464939832843355827e-01 1.628595509079794335e-01
9.524042795135710671e-03 9.909177189507032413e-01 6.320732811774865123e-01 9.317390365522946194e-01 8.438183799121174999e-01 4.615962269197845247e-01 4.073727381541343735e-03 1.295825955480330194e+00 2.050641787701227015e-01 1.464373674264758118e-01 5.595658909413260551e-02 1.387245720645932656e-01 3.663046888907396381e-01 3.695483107323492833e-01 1.075956020792015799e+00 7.633352157634774038e-01 2.220435434367414029e-01 2.399220536939560000e-01 1.063230974276317964e-01 4.680523625026527385e-02 4.558124585863290723e-02 7.152570236386736335e-02 1.094866199072635493e-01 3.349918538403748314e-01 3.381151631133192392e-01 7.950630214324315437e-02 8.737680026879302009e-02 1.121682281543117388e-01 3.658478446157813480e-01 7.497223353703355575e-02
6.388492087788462219e-03 1.176729782678263836e-02 7.088156584443523478e-01 1.625424483861532751e-02 1.044954087126150760e-02 8.635351650771835169e-03 8.842129943893892521e-03 5.133134929112768141e-01 2.034054498997060478e-01 1.162211079739260411e-01 3.571894905862042086e-02 4.901090215066314371e-02 5.518264999941142196e-02 2.027542454022960017e-01 2.408963675579540720e-01 9.975605908035167779e-02 7.695147385708343835e-02 7.621640403504366390e-02 1.009557771379440416e-01 5.817616804504675831e-02 4.135108495862804823e-02 6.174601871509258905e-02 7.056405087490202899e-02 1.180525981477293374e-01 3.677626460587689605e-01 5.773809761301639670e-02 8.346766982643281929e-02 1.367218620713763766e-01 1.652750940146645309e-01 3.286208191061742445e-01
1.437407465652045056e-03 1.052198408708141138e-02 1.091948729349595748e+00 1.283849039962259075e+00 1.056404595640979445e-02 5.124999677976023287e-03 5.439957689108898889e-03 3.556293176758091867e-01 2.745828852547768095e-01 2.561160613108942052e-01 1.054709154501047019e-01 5.459927641244176344e-02 3.507852222893775851e-02 5.563412910800551170e-02 2.528668423353135908e-01 6.490713091876842977e-02 1.674630451318247504e-01 1.341381536539930364e-02 2.279333290549901900e-02 2.228227938105850070e-01 5.768792365896582841e-02 8.087065870139120705e-02 7.055428923566915700e-02 7.778584876859447050e-02 1.032082745434134419e-01 7.896472421016310916e-02 9.279130627268597498e-02 1.144039467155704148e-01 1.544053501184315946e-01 3.797693419197190057e-01
