1.274996891465887856e-02 1.912212571519528170e-02 1.662494960984167713e-02 2.093932231552197293e-02 1.586328921531344333e-02 3.465921237923872550e-02 3.425803524895125463e-02 9.240378887589011103e-02 1.670009327019467416e-01 7.348164016718641833e-02 3.319710808820871412e-02 7.383620796606552017e-03 4.250026371991027022e-03 1.573658290314051272e-02 1.815065453818348953e-02 3.945119818960462349e-03 1.367805555266016909e-02 2.354788719980110273e-02 2.092873680831367975e-02 7.249429062765070861e-03 5.838239470149345946e-03 8.492640520515910840e-04 6.570906369129133999e-04 2.621419288821865128e-03 5.085376086927903203e-03 3.977959044187268957e-03 1.828497131799430636e-03 1.605153901185388363e-04 1.510538676044442395e-04 1.858191473287287973e-04
1.041733883692218601e-02 2.370026609698320727e-02 4.251428577772742995e-02 3.473279443942268313e-02 2.416121716336907393e-02 1.075782861352866521e-01 5.068882536743302136e-02 6.360429979633427933e-02 4.120578273039373490e-02 3.418135953699411034e-02 2.330291547704146232e-02 4.395866425312885614e-03 5.688502599912940300e-03 1.285519852320054189e-02 1.776421424827813109e-02 1.124839316491298494e-02 1.366843310344230573e-02 4.389899628578225466e-02 3.244237321284134529e-02 9.573225783196425559e-03 3.369078698772389954e-03 7.538392906448785702e-04 1.564091442651216772e-03 1.381627488597490230e-03 1.216011498718235244e-03 1.622562021310589931e-03 5.724808530171854185e-04 1.507205443441447042e-04 2.180844525372838312e-04 2.203536349411060495e-04
1.303875857247966952e-01 1.369655977969443661e-01 2.895222338136076989e-01 2.356043511248225308e-01 4.993264889306097132e-01 5.054530400301033427e-02 9.292816420482831463e-03 9.890330319090073069e-03 1.576057922848575488e-01 4.639619521715965950e-02 1.194566137525202576e-01 7.610651156189855715e-02 2.708097109169872382e-02 3.901394793663955085e-02 7.368073528059445286e-03 3.049180777389702210e-02 2.008924960622687425e-02 4.027458687919556468e-02 1.309532321505804953e-01 2.130271626266917739e-02 2.001421029636935890e-03 5.752919605046230133e-04 8.618950544870771771e-04 2.991977541413469335e-04 1.782456152811761588e-04 1.180039114769609665e-04 1.049359316628687712e-04 8.696779583769157385e-05 1.541186433429287523e-04 1.802855050219639716e-04
6.056945320557616252e-02 1.787080954899993579e-01 3.923797248100157065e-01 3.171403851839336152e-01 1.291930667527796950e-01 1.984900478831604781e-02 1.554496828448157821e-02 1.039879162013239954e-02 6.336181379205790658e-03 5.748740397659533180e-02 3.554818110024814820e-02 6.756923608105630530e-02 2.970932752736366034e-02 1.960111997094075506e-02 5.724939561065782445e-03 4.315260115915485993e-03 8.848653103479060117e-03 1.619165845187909777e-02 1.119618815544012012e-02 9.343351729290473237e-03 4.150347605853654982e-03 1.393323337899055872e-03 4.248625625127349856e-04 8.035620214072820497e-04 1.470530602508303560e-04 1.060059314436926416e-04 8.902662211884774092e-05 8.894025739799846285e-05 1.874348556077327975e-04 2.154472177531002318e-04
3.478074582806797016e-02 1.107316048783994339e-01 3.093236760265774543e-01 1.198938149052440200e-01 6.793665743012378133e-02 9.855901499901608201e-03 1.500485758487282370e-02 8.308241541032769864e-03 3.852661364674053388e-03 1.304609890961112018e-01 1.583186815998664787e-01 1.283440652032561413e-01 1.844884489092276855e-02 1.522104310460239106e-02 7.101590397430573333e-03 2.629170380499855700e-03 2.770548146388151708e-02 1.560265851925646784e-02 2.454256650682018828e-02 1.383406691809094431e-02 9.428857754492165483e-03 2.572951300020233888e-03 5.480164140537854833e-03 1.443997544050325873e-03 2.778805117628273627e-04 1.453658357275978313e-04 9.695517776983836929e-05 1.187684666317534183e-04 1.938642173882862722e-04 7.595487969139799820e-04
3.447598143653352737e-02 3.686682945311006016e-02 1.653695695242769492e-01 1.325140421810871716e-01 5.222700931429950788e-02 5.595320126351110111e-03 6.810376153203828893e-03 7.282694824271731746e-03 6.857546110831305892e-03 2.009632286263074163e-01 1.523206454333814741e-01 7.630865845074677467e-02 8.481277812416880904e-03 2.555871315958629843e-03 1.934921403753249837e-03 3.156125315880857138e-03 1.622231336055245804e-02 4.165386458649166478e-03 1.324271824644340963e-02 4.502120019260247297e-02 5.408994219081073029e-02 3.139606465537309737e-02 7.571064091426412193e-03 9.260956586919363246e-04 4.346263729847131790e-04 3.897471094294264788e-04 2.285749828193080853e-04 1.677898934822063821e-04 2.319054581342839779e-04 4.483740643828735173e-04
4.696367382050040812e-03 7.576715252977350365e-03 8.032074692551811196e-03 4.081674236653957955e-02 1.958512196979646236e-02 3.257507477164738041e-02 4.950451794888593993e-02 2.828185170859640746e-02 3.379072772486926834e-02 3.802646487478118786e-02 2.827420088638928769e-02 1.114128544915082321e-02 4.485672429062926257e-03 1.747005211014030510e-03 9.192306008668190212e-04 1.634733133102407544e-03 9.526692526647992376e-03 4.464644308922101693e-03 2.248682521774332185e-02 3.041431854083371036e-02 1.383001364115593948e-02 3.215870075277131764e-03 1.209405694204931806e-03 8.881810598814125855e-04 3.087132268837446038e-04 2.960385006178667009e-04 2.393203841811527709e-04 2.226836849907784500e-04 2.720435952492967634e-04 6.984754555078108830e-04
9.575624240403703483e-03 1.781072792327874355e-02 1.051862216095769686e-02 2.288656000439131741e-02 3.550304746208744755e-02 4.021410242688282233e-02 3.577643723472540005e-02 3.388537579864533272e-02 2.712980947603100060e-02 1.476798522963843584e-02 5.774941884815235418e-03 1.735533028764834826e-02 3.646162164611758787e-03 1.205227603312589461e-03 1.223297927471980870e-03 2.245615500959446086e-03 1.851535835906139779e-02 2.959867876884048066e-02 2.582245220594751173e-02 1.815733005801308322e-02 4.855903655635719282e-03 2.215564607578747892e-03 7.207050190818100038e-04 5.333354706284422660e-04 2.374831095267045762e-04 2.344517829090940226e-04 3.401258164637838838e-04 4.615573586089339697e-04 4.970399808002089626e-04 1.571370745366317814e-03
2.409444786139329497e-02 1.607025344801623137e-02 9.542520666734218698e-03 5.622835054627063622e-02 3.696283047703873698e-02 1.577536088535142975e-02 5.083789759510395911e-02 2.292117858226257188e-02 1.910890243827889634e-02 1.846532466510832429e-02 1.615020812201160144e-02 2.095844736053518315e-02 4.522509611074713304e-02 2.931070169263731012e-02 4.327704072269813323e-03 3.956188828509935376e-03 1.731309992995736652e-02 5.285984665300878793e-02 5.198597296151916819e-02 8.566722767533374236e-03 1.312316110308652624e-03 9.782220642644251073e-04 8.886834879765494969e-04 5.211635187156807032e-04 2.875750938399008398e-04 4.196880568891410055e-04 1.502131244518819771e-03 3.291866810527929559e-03 1.024021874450001257e-02 5.414025716661189855e-03
3.823679585340728632e-02 2.530248505802017156e-02 4.097065868305843628e-02 3.926066049803578206e-02 3.494056739778604592e-02 6.949760739986790732e-03 3.203922712128891986e-02 1.366806262647056458e-02 5.683735504246710014e-03 2.114795992584940932e-03 3.071536429670572096e-02 2.986215752676359830e-02 6.248628798471569934e-02 6.655808112634767348e-02 3.117813655012115215e-02 3.387063497028511977e-02 1.827158749639244684e-01 1.904889742645899942e-01 7.634937980888917286e-02 3.374478225557085709e-02 1.607817902871409247e-03 7.355611000588955497e-04 7.219233745287819770e-04 7.289009316708036472e-04 3.824059807165870370e-04 4.707325673315002111e-04 4.250298249502534528e-03 7.952863324698532937e-03 1.067532203579288352e-02 2.995958745381583667e-03
3.128317885208487664e-02 1.662765265721830032e-02 3.756300127477874007e-02 3.271492815315438230e-02 4.189705348278844471e-02 3.862135125489183762e-03 3.202139709266497644e-03 2.762868688716906777e-03 1.700822264115656483e-03 1.526206403660215066e-02 2.405312170776081060e-01 4.039131696801817051e-01 8.282179826785952548e-01 4.012678880540179183e-01 7.270132028769148158e-02 1.410335040968945242e-01 2.636924880578623842e-01 7.315114215080102678e-02 1.740825256515006123e-02 3.447607251887214314e-03 1.134078816040174405e-03 7.587983725931271226e-04 8.637436989737335346e-04 1.139569738332293957e-03 1.162038813059410166e-03 6.034851289543312217e-04 9.187547293213263466e-04 7.892286796266377363e-04 7.522485441704327390e-04 5.683455858025973422e-04
5.761912196008600086e-03 3.434836153500010585e-03 3.054937151843067564e-02 3.043875975064175635e-02 2.371376426966283549e-02 5.381680475409177968e-03 2.040825843934683873e-03 1.283746147937391393e-03 1.553782613397154547e-03 2.927555696594781598e-02 7.180975667731664958e-02 4.747486046068546406e-01 8.494646196396642424e-01 4.343412796416156740e-01 1.544155112453263201e-01 1.724420180086950194e-01 1.905375560851009786e-01 1.123071882314984060e-01 2.753837873039122197e-02 7.732719914633144273e-03 1.117111848023394837e-03 9.672297780958651970e-04 1.061787063900966133e-03 1.843133990903770766e-03 1.717496102328782163e-03 1.183524084516211555e-03 8.778400801397467923e-04 8.197066378131570141e-04 9.030412404587712105e-04 9.848456301539071714e-04
1.094932692176289442e-03 2.852383907927370007e-03 7.018813681939774229e-03 1.996266697061160542e-02 1.296869990144807958e-02 4.042138539203014511e-03 2.011752440179592327e-03 1.625229948755059061e-03 1.975851035225749223e-03 1.429663848808555154e-02 4.815516089200785367e-03 1.482842368184244253e-01 6.255450597694232062e-01 2.658891296836201068e-01 8.289804162583444547e-02 9.531871425169653744e-02 3.512722716511795795e-02 5.142840865803990219e-02 5.838655451685867415e-02 2.173261982504904113e-02 1.429171477879451419e-03 1.261687142546504166e-03 1.496616790737685058e-03 2.533266533627326084e-03 3.278483168964578445e-03 3.024252327137256363e-03 2.195863445800627905e-03 1.998133293113520895e-03 1.529616894491788934e-03 1.165701515942866012e-03
8.582797697318401021e-04 2.479516214311082087e-03 4.601585956459097737e-03 3.354418886487376631e-03 1.963268886088897353e-03 7.518436689564781013e-03 2.535564235077063591e-02 2.138686238481078000e-02 2.708252708551003429e-03 8.460585062625372186e-04 3.466787996841197081e-03 2.377971904741677314e-02 2.828322507466403124e-01 3.807168110662441096e-01 4.044380509795526546e-01 5.449264829848493585e-01 4.887130943321599252e-01 3.163108269530193750e-01 8.617827303245366721e-01 3.985834511442063466e-01 3.261913625397513256e-02 9.362099493370596576e-03 6.995460778983740580e-03 1.748020314980353734e-02 4.039963029364578018e-02 3.760347748530049744e-02 1.021511546756938560e-01 3.348458217404248760e-02 2.618428907726599950e-03 2.444807165674476538e-03
7.735460558950329156e-04 7.755136165653557642e-04 2.150556779181256491e-03 1.592670772358475290e-02 5.668665813311377262e-03 1.298479525206473317e-03 1.681204297162674013e-02 4.856196886694855858e-02 3.252338791894263115e-02 3.378546709048776790e-03 7.297183326772565225e-03 1.183182024107493902e-01 2.537632037440643584e-01 3.210052588427288467e-01 2.892460106000477871e-01 3.491140196505121418e-01 5.938771153763242605e-01 1.023688157975965574e+00 1.039522639033532592e+00 8.138449243563686819e-01 3.458016116859707889e-02 3.592104175428278284e-02 3.193567054289377788e-02 1.001799404617595285e-01 1.444012623501705617e-01 7.398854989730285769e-01 7.394859333165400006e-01 1.490184105276835536e-01 3.237832832128020085e-03 1.880033090138277622e-03
6.759661161364092586e-04 7.295112504075269236e-04 1.669828826997813483e-03 1.816662274688681661e-03 1.167162004443697597e-03 1.299153420084126495e-03 9.196340295361418379e-03 2.605750986201779348e-02 5.396399362609118067e-02 1.957754931615212149e-02 2.056843792257807141e-02 1.839528760319679435e-02 1.446410065696634717e-01 2.916812675125444176e-01 2.711368300617485461e-01 4.146822180632476762e-01 7.161064238341955379e-01 8.682412745297038992e-01 5.006454771248777247e-01 1.087735073243030065e-01 6.509189072673447762e-02 4.457556353572828534e-01 6.484612071670599054e-01 1.095970595843808848e+00 1.044425018774937541e+00 1.381925213235620120e+00 1.118851280092022282e+00 3.188547163012355745e-01 5.370466727735569677e-03 2.378092982707249396e-03
8.220193366953180069e-04 9.328911826935441408e-04 9.018642533644993537e-04 8.368614546518758765e-04 1.230297491603381255e-03 2.553889886045315836e-03 1.502693934502743467e-01 5.056297903838345986e-01 2.469046893706890178e-01 4.308482060193757207e-02 3.259072658769144454e-02 5.202103731956166099e-02 1.038482590978394710e-01 1.523941111139829330e-01 2.007412925413317728e-01 3.596987888159385305e-01 7.730396645805023281e-01 7.756965145309778764e-01 3.663025609289789486e-01 1.253633812557830296e-01 5.385409171089233782e-01 9.734502341911124290e-01 1.244076052370285179e+00 1.297443464018521730e+00 1.171343655989571131e+00 1.038963760696120842e+00 1.569089704840267219e+00 2.719031069959428892e-01 8.594218501629223225e-03 3.561629927331243662e-03
1.956077273613006894e-03 1.495519711761224670e-03 7.616145461225759571e-04 1.161782441888890155e-03 1.461099205637037858e-02 7.374191924593599679e-02 4.142237081124076070e-01 3.390233094900906297e-01 3.334611357698056278e-01 1.701983493247749002e-01 6.354168147363008223e-02 1.752317834407456434e-02 1.727951039295887864e-02 4.412519638767714580e-02 9.929798489300584174e-02 4.565055839308697627e-01 4.772790718901910312e-01 5.530952248269636051e-01 9.602050296288798525e-02 1.689091134556697793e-01 5.954107488525852698e-01 1.279771995267701579e+00 1.566995917794667514e+00 1.661978967813463548e+00 1.420994199025076288e+00 1.423369037240058699e+00 1.366450138647716361e+00 1.072109740870188954e+00 4.721397155232419374e-02 3.079703037269213711e-02
8.667873862791691808e-04 2.316635152859077007e-03 4.156701889090774586e-03 2.815486111160164090e-02 6.120341024722657230e-02 8.650366274134241307e-02 2.733488263417536701e-01 3.421203874037511139e-01 2.347922459071103973e-01 1.849301715360185672e-01 3.928560053144325437e-02 3.912073738649842099e-03 6.001081508082056586e-03 1.698622156906040570e-02 3.716482549674210434e-02 2.204632530673033552e-01 8.343389265250439335e-02 2.640671995602957359e-02 8.801231318241918566e-03 6.368033914310047838e-02 2.420212184616469808e-01 1.285980816641603131e+00 1.622168071170243753e+00 1.718310784216293019e+00 1.278302478997417557e+00 6.058805006426249973e-01 1.002252039615543877e+00 6.807826530088672001e-01 6.105743711571346571e-02 2.375492201174254220e-02
2.174618471975412262e-02 2.724620765801129274e-02 1.784528063707608442e-02 2.174920148187375890e-02 5.007295753846507241e-02 2.863039055001668706e-02 1.474540899272639149e-01 1.906803359621447869e-01 1.756662948058807239e-01 4.167824394258532600e-02 1.054860486922301090e-02 2.254674882320488721e-03 4.003169261389434401e-03 1.196052535044746755e-02 4.806923269349224620e-02 3.275281767977233222e-02 5.916230230310739330e-02 1.728660798407335997e-02 3.219016295711418091e-02 1.523176418478187633e-01 8.230405940218363803e-01 1.558739151575808224e+00 1.672712146353656060e+00 1.590325243991189463e+00 1.226311347349157810e+00 9.041501499009241272e-01 8.816761062572798791e-01 5.887142594735887968e-01 5.271720994981630298e-02 1.854168726108547730e-02
6.221161982730166046e-02 5.547098800805891350e-02 2.804230286453245416e-02 1.985674654141792589e-02 2.533684179113708870e-02 1.353270202617034602e-02 7.700337206343965679e-02 6.884656436298160209e-02 1.884006459751989826e-02 1.026372736669699422e-02 3.563412847051405756e-03 2.866701705857026619e-03 1.764311107047477614e-03 1.019230362075003102e-03 2.754581922569473811e-03 9.657661217459869232e-03 3.418365105074074040e-02 7.696701217559402675e-02 7.323403128887548408e-02 3.256505624743548655e-01 8.931740676510163679e-01 1.295744785237073149e+00 5.276078724512303086e-01 7.851714079037194205e-01 1.004532058663157645e+00 5.645207820024610301e-01 4.186651967353580139e-01 3.409378036652560562e-01 1.245157977794401558e-02 1.117817203019916099e-02
4.934106604373285354e-02 5.530877466125503489e-02 8.135613157161169368e-03 5.621310603643781684e-03 4.604774276693821347e-03 6.844956107532463967e-03 9.694587037207172409e-03 2.407130314574596353e-03 3.088186270166525579e-03 4.939876837868552480e-04 6.652775187705202821e-04 1.035730557306130612e-03 1.189963159066885576e-03 4.463509429258121289e-03 1.325190640561842680e-02 1.803300375948445888e-01 3.421927358687467113e-01 4.884842389436793719e-01 3.294285172088333158e-01 2.462149240865134925e-01 1.749714789441002838e-01 6.265849352568290953e-02 2.437126659615884011e-02 5.222709606161651807e-02 1.859384134671954181e-01 6.176480803857938712e-02 5.582444687200520395e-02 1.874955065016946018e-02 2.140952289156602961e-03 1.751025698258147720e-03
9.840829133011468055e-02 7.401896259384639631e-02 8.136607880552466573e-03 3.598559239612763964e-03 5.408739480330632121e-03 4.203881869690991556e-03 6.390154690331000149e-03 6.728584924837221256e-04 5.590914346333977986e-04 2.469045151575814082e-04 5.988155443511952421e-04 1.149923235752617909e-03 1.587553584963973322e-03 9.036788135685338424e-03 1.571744882757191916e-02 1.037852814830812348e-01 3.745600552074984102e-01 6.874001112785917966e-01 7.668616824274039345e-01 6.590280891570708954e-01 1.403194626460050609e-01 3.134590207927690636e-02 3.911826385891685465e-02 9.605173503133863921e-02 2.112635241159625810e-01 6.158208672639416820e-02 2.306380994788277336e-02 8.631695400326879278e-03 2.722197794662734472e-03 2.453791278979542464e-03
1.165707034404337150e-01 1.459759224380719270e-02 4.190007635973923630e-03 1.445955646535715877e-03 1.725428499966563797e-03 3.764319090384618104e-03 4.723070604817421192e-03 5.140659296990029688e-04 2.756549823005344387e-04 3.226259874974469273e-04 5.804661981051997474e-04 1.001762841150610327e-03 1.173995137639986374e-03 6.883510276299477891e-03 2.840552773508040266e-02 1.445043485472429778e-01 2.751838028909310840e-01 6.222850299642836980e-01 7.717303200380939421e-01 6.497236487643264224e-01 3.261252823022817715e-01 1.888507439224507145e-02 1.353014802223685871e-02 2.947656186066696660e-02 1.689062436094839470e-01 1.014797496447379377e-01 9.016292188231829485e-02 1.676224794059834669e-02 2.389334343711511845e-03 1.798234717775743906e-03
6.119858940937416419e-02 1.873354749910835851e-02 7.764912923307359938e-03 7.810289502433441847e-03 1.865834937227033030e-02 1.267891581511904585e-02 5.070276321256133971e-03 1.999043343059929683e-03 2.905926280062049154e-03 3.802731640709998678e-03 3.566472567895108544e-04 4.031559075148420136e-04 6.502732996753883858e-04 1.566810005608993599e-03 1.008058252732441963e-02 4.334940896944492611e-02 4.280730310008627748e-02 1.793296145452350221e-01 2.266207519860148623e-01 1.950520744154538577e-01 1.660945542655204166e-01 2.168996916168970321e-02 3.386264783348671027e-03 6.700197631775410383e-03 2.970080189802310269e-02 7.496850770537753783e-02 2.001838844841790088e-01 1.112666091489782072e-01 2.707453950362915390e-03 1.974868110452626061e-03
2.170633759417250896e-02 8.532879210498806044e-03 9.794675758921745842e-03 1.788255078212138555e-02 1.054105765591263275e-02 4.683573655643641712e-03 2.075568737259566622e-03 1.401740568395812682e-03 4.315219747163898806e-03 1.675314533486221488e-02 1.145225651724416987e-03 3.948365240491327820e-04 6.925972028880080259e-04 1.614400389384595307e-03 8.133776068780674412e-03 1.534369265791961888e-02 1.034775055197453136e-02 5.047688863392773770e-03 7.873953035127539274e-03 1.443526701533420602e-02 2.627435755893322428e-02 6.144410058932645545e-03 3.252756991672051210e-03 1.692424437553743249e-02 4.151116391798959776e-02 1.492258738951230193e-02 5.154088654526311347e-02 5.720080711517613187e-02 1.991545581155567193e-02 2.951713046546724280e-03
2.199038215499376711e-02 1.750248256727379714e-02 9.173918579820946120e-03 7.264805296324759916e-03 7.284425399987818663e-03 2.707083811775076298e-03 1.728869856753392472e-03 1.706263087575050907e-03 1.833287711022377545e-03 7.331639992286942756e-03 2.080195151500541673e-03 1.977879203086823495e-03 1.941808283216654068e-03 2.592069399834926683e-03 7.995759581308969563e-03 5.925635173121057697e-03 4.071062401260133919e-03 2.480638714701940712e-03 2.229016765287476515e-03 1.755850912286711007e-03 1.452749877847259435e-03 2.208095718315531385e-03 3.663667385759527412e-03 9.553248676133796816e-03 1.724300614445976876e-02 8.459827286186430081e-03 1.363573717959473686e-02 9.085479213451680414e-03 9.085103461350944182e-03 5.744366403221405799e-03
2.985810511452378913e-02 1.545276519273139533e-02 9.440193945828094166e-03 1.391643456276303419e-02 1.319332651140775643e-02 7.099071306396737176e-03 2.343921283656394405e-02 1.709776184668559615e-02 2.455834932468948465e-03 1.785496149698699749e-03 6.406308269089484300e-04 1.474807420672569333e-03 4.561640753632551816e-03 5.436326591898425244e-03 1.800835770817682882e-02 1.439682752400755182e-02 4.642655882745129470e-03 5.635208706778307812e-03 2.664213969249811399e-03 1.181632943740722023e-03 1.099608593281440000e-03 1.721008066290162812e-03 2.744995778589974685e-03 9.206563604226900357e-03 1.005571863356245765e-02 2.543621061864621748e-03 2.920243701329881640e-03 3.806481608014444795e-03 1.247492851914611643e-02 2.554594912677039722e-03
4.048146983668505366e-02 3.478133826449298499e-02 1.131751176424654858e-02 4.164441312364138698e-02 5.216011217141769407e-02 9.770552397492622554e-02 6.358680492858348465e-02 6.968293532090390381e-03 2.443927606240070983e-03 1.416709376863659140e-03 4.198577410165045477e-04 5.250616250170724465e-04 6.855209055094092178e-04 2.994082070820554622e-03 4.057916803436888153e-03 1.967278701537817243e-03 1.972538666692174800e-03 2.491493316606551312e-03 3.490856655883514681e-03 1.875488103470887265e-03 1.007706054165544369e-03 1.375980652913163160e-03 1.550853110540595815e-03 2.909388072733092717e-03 1.014311937615153432e-02 1.748571988095655623e-03 2.675611242184607053e-03 4.524829900758481870e-03 5.603545440540051194e-03 1.115891642568508924e-02
2.326317618547984675e-02 5.718409187874907290e-02 1.809854327416340891e-02 2.059398212803672037e-02 1.059892688214260359e-01 1.125347005200925538e-01 7.412532309166397493e-02 5.034918434767936268e-03 3.521197189425461210e-03 3.344138896893396763e-03 1.377455037249004748e-03 6.827326376585268058e-04 4.567173941187728666e-04 8.640864793953939539e-04 4.463037434996065637e-03 1.397582747883899853e-03 5.186875984113837809e-03 3.305788246019420590e-02 6.044011902810716291e-02 8.318687472155587154e-03 1.594110884883333636e-03 2.022745596502076738e-03 1.718117284839291818e-03 2.088782251155745472e-03 3.069041809675816194e-03 2.580362389631352896e-03 3.221202819321802510e-03 4.066220681983762596e-03 5.644199835686905010e-03 1.392833145625579569e-02
