2.201830875698360390e-01 3.128343505707851246e-01 2.612081236646806026e-01 3.231671579219828616e-01 2.239271017605976855e-01 2.324099911178076176e-03 7.930138003381599675e-04 2.112724432907911194e-03 3.785848050409868631e-03 1.696355837732343216e-03 3.010437148018244285e-03 1.279826894334395171e-01 8.464498381268156790e-02 3.105882313846136111e-01 5.783596706417567027e-03 8.600306681596468772e-02 1.426698954375198126e-03 5.060216166479751402e-04 1.281830158543504359e-03 2.913165170804695725e-01 2.678766351493021003e-01 4.030448362327779949e-02 3.066164082593611853e-02 1.219821424728565196e-01 2.364419291977512827e-01 1.850703785416630553e-01 8.489047795981878586e-02 7.403841452305984748e-03 6.997606920289081017e-03 8.707932632384896010e-03
1.436339401535356441e-01 9.074469199050130483e-03 1.290652090453133297e-02 7.320401198441340435e-03 3.397958785408585359e-03 7.880540957842080071e-03 2.687419532024673367e-03 3.205717410464603567e-03 1.430275811062514625e-03 7.544368577014643612e-04 1.886337466033738593e-03 6.578195044925075341e-02 9.980696018809900871e-02 2.391244832577361923e-01 5.745376056075907761e-03 2.359111176157207834e-01 1.312425643813902023e-03 9.200825137374601427e-04 1.821419060718431271e-03 1.531836726261097664e-03 1.533566707362914172e-01 3.850467425505039315e-02 7.939383799724836210e-02 7.073590903971964383e-02 6.259471095807080110e-02 8.382399222453409959e-02 2.941511923893584679e-02 7.431032464880269438e-03 1.050351688043392635e-02 1.042606451557740246e-02
6.073763716529079378e-03 5.637492838971139980e-03 6.286185869662142336e-03 5.091270521590930340e-03 1.822626645090089093e-02 6.984076509457970254e-03 1.161308673944231040e-01 1.208601420512556979e-01 1.158493152844547111e-02 1.344502713391126794e-03 3.488695066358983837e-03 3.811940899069943701e-03 2.968887595281323715e-03 6.482552212073829784e-03 1.472463768421836405e-01 5.637219179540203622e-03 2.490569474712520364e-03 2.039776747139022180e-03 2.584606035413498232e-03 1.946487289433321060e-03 9.446337627957983318e-02 3.167808494834192801e-02 4.799544566040443716e-02 1.663470176753656382e-02 9.873287249364870455e-03 6.498807749426377400e-03 5.798917319721009003e-03 4.539538850156908494e-03 7.714919573413092820e-03 8.617066128663482261e-03
1.399615438648520822e-03 3.828239047422776417e-03 8.395902140245796105e-03 6.776077999933947417e-03 7.340187667341068443e-03 2.379009287441072318e-01 2.342587592150671694e-01 1.441358313960094950e-01 7.749919117307733918e-02 1.927929390159444784e-03 7.973115181317793265e-04 3.656312001606238250e-03 5.038392622656056967e-03 6.689661523500560134e-03 1.135144664131142733e-01 9.718758137691296817e-02 2.080734442480379476e-01 7.503749283332938587e-04 2.177845441428534977e-04 8.526641140354006363e-04 1.676870194813875614e-01 6.686282720510670907e-02 2.236139851005670975e-02 4.393788024163847866e-02 8.013948654169751259e-03 5.707392070633845495e-03 4.890660665212285228e-03 4.626143156903490296e-03 9.362743305330866253e-03 1.014031019714167758e-02
8.012812793048973946e-04 2.373281015421788934e-03 6.614450907458595263e-03 2.568358865305913480e-03 5.002910374784294914e-03 1.389255728977610016e-01 2.395217849657056974e-01 1.334247548774810666e-01 4.861827268504001487e-02 5.422698028905712994e-03 3.612999783465724573e-03 9.909837009991326676e-03 2.762014538445792255e-01 2.832355019566415444e-01 1.470687643431045077e-01 5.839374573199514890e-02 3.992445368530970345e-03 1.533421777909229526e-03 1.927842686892213388e-03 1.515092259435738518e-03 2.699183611081115153e-01 8.579964780344261077e-02 2.178664771205861828e-01 7.163051417738397486e-02 1.436355312876500326e-02 7.582431446676313712e-03 5.253902632765510526e-03 6.055847920877032234e-03 9.440370852738593291e-03 3.460079439514951449e-02
2.804481066465798304e-03 2.986983900279983721e-03 8.298087656646037022e-03 7.040996429326563770e-03 4.348210206103331373e-03 7.869582936271798945e-02 9.852340844701756861e-02 1.037597460741829930e-01 8.322128373773376997e-02 6.890572964834858899e-03 6.786573136785549638e-03 9.717072469493702805e-03 1.284956931745376563e-01 4.783510194820402711e-02 3.961669331566649438e-02 6.601868841510925845e-02 3.107653721661450368e-03 8.782285909998022166e-02 2.877314853047636678e-01 3.312048585586004328e-03 3.427744559771227998e-03 5.860366569043702449e-03 2.654309177149819510e-01 4.140232082751676285e-02 2.126780804386596557e-02 1.971768320268556945e-02 1.227231309387358249e-02 8.438640938803025626e-03 1.111206616037628200e-02 1.991216757736916435e-02
7.697365195529021209e-02 1.160060369604742347e-01 1.137717116154815244e-01 3.984991789811119511e-03 2.574551243342683149e-01 2.948892603924131457e-03 4.904165742351803553e-03 2.626086416719030075e-03 3.796218552101074568e-03 4.105378069676006089e-03 5.543680736074736368e-03 1.540470533261789343e-01 7.141204443427064119e-02 3.289585710296614313e-02 1.902370456533175602e-02 3.253014459375671436e-02 1.827066352781614167e-01 8.224638762935070069e-02 1.670699108977302108e-03 2.354903301668777836e-03 1.426560938710499851e-03 8.257992876881706246e-02 3.872150514608384275e-02 3.707625544267251216e-02 1.430735204058122823e-02 1.462189644188235764e-02 1.295395872000604763e-02 1.122493769880221481e-02 1.299952549737063735e-02 3.061459898028881868e-02
1.592866120525468776e-01 2.948020620763281974e-01 1.625671030424951924e-01 3.131338075582328594e-03 2.573584714168516713e-03 2.820968550003269144e-03 1.657920255972745180e-03 3.806891032091426919e-03 7.691034209451385294e-03 2.236489517651424896e-01 9.220515015033341200e-02 2.812957417546944061e-01 6.044375346953075739e-02 2.135877220715335853e-02 2.400847784921903219e-02 4.430388584741386943e-02 3.026322157872761431e-03 3.152410043836499989e-03 1.394370140850828858e-03 1.521895261372750371e-03 1.174836009481932259e-01 6.884649216697387442e-02 2.769982900599948436e-02 2.314125323270661144e-02 1.099867850312346955e-02 1.154131067167651903e-02 1.868047009529773261e-02 2.387730677693084350e-02 2.324796395324667600e-02 6.619987477289657196e-02
9.821045619718402064e-03 2.412573586619158050e-01 1.391788617141037077e-01 5.560907553953445097e-03 2.433122223523410520e-03 2.028311931014604441e-01 6.454485009181956667e-03 5.280370953609470411e-03 3.104745201980306790e-01 3.199033280037465454e-01 2.874634525709018340e-01 5.876611066785998941e-03 6.917682222621381050e-03 2.642786413137291138e-03 7.691097080892440874e-02 6.457568998483637079e-02 2.587222771420131240e-01 1.948678738105806421e-03 2.032929460374457466e-03 1.590818532959852316e-01 3.150223019541862485e-02 3.262656608788108009e-02 3.524500285909563935e-02 2.295309135438306641e-02 1.341450082277647650e-02 2.049001598143218583e-02 8.107507502147305589e-02 1.598175694986546103e-01 4.455976210366820456e-01 2.127094717085382669e-01
6.094428463428482913e-03 4.596896460066636318e-03 7.322310393977854090e-03 2.252239229917100613e-03 2.927148622644081336e-03 9.594528572523651488e-02 7.411765977694011534e-03 2.218049533699893439e-01 1.080183813032366685e-01 3.922027086762969184e-02 8.888930577706552483e-03 3.482491304235271409e-03 1.543838233917530379e-03 2.582741940493411825e-03 1.480296930541021494e-03 2.078699610907230010e-03 8.367615402718473275e-03 7.307016888760455367e-03 4.011147987526704137e-03 3.662354250947786900e-03 4.068259597842750763e-02 2.551912685392087113e-02 2.901375166496487565e-02 3.171675043554488677e-02 1.766231627274202770e-02 2.258377656061703528e-02 2.173569114028168769e-01 3.619429167804759095e-01 4.350244164829188409e-01 1.102280822770739382e-01
6.200290730752899826e-03 2.372932454980107853e-01 3.664517014252206134e-03 9.510806163452768802e-04 4.403004590170531661e-03 5.987018112973551548e-02 5.902926274801571782e-02 5.413646652544747140e-02 3.743350344317493417e-02 2.934307204263322810e-01 1.285257964747217770e-02 9.798316474760997499e-03 2.012562018646367468e-02 9.936934748068310119e-03 1.835275062842886421e-03 3.596698395059002608e-03 6.609992368758968104e-03 1.799034215884330514e-03 1.244593953417070338e-03 6.709616172040655524e-02 2.808528347263090572e-02 2.491871180022871279e-02 3.189870616925685048e-02 4.439224709978875638e-02 4.727195147990100044e-02 2.566439372989713988e-02 4.120038296371367204e-02 3.188102851686041433e-02 2.777486676691803130e-02 1.934827867342329630e-02
1.055159132579825826e-01 5.765872756459294868e-02 7.851833140925310386e-03 6.772895038423669758e-03 6.012159091733970673e-03 9.731608556700380164e-02 4.557306770968583276e-02 3.157528980552634645e-02 3.777919768895258296e-02 3.324080411048536011e-03 3.766412168882861920e-03 1.293183173159660401e-02 2.054132675340287692e-02 1.073312856846091179e-02 3.904567335284807143e-03 4.438149590374837299e-03 4.881733847344966841e-03 2.860728873301492635e-03 2.096833336365662090e-03 1.526761478699943941e-01 2.684530424290244160e-02 2.719387816402245306e-02 3.195781482337087254e-02 5.686405295970601431e-02 5.378061699809411067e-02 3.815534927842709895e-02 2.919353415143783465e-02 2.604837806530584804e-02 2.785226703100888990e-02 2.950266935798719070e-02
2.492784135273530891e-02 5.988402600229127820e-02 1.335473669181624634e-01 1.345015557052319649e-02 2.391374065709406527e-01 8.195866865108646093e-02 4.555188339981897094e-02 3.969474997844381348e-02 5.082772339846079734e-02 1.422903237718653674e-03 9.566794002789380524e-02 4.901777698255642933e-03 1.513498665789818516e-02 6.569238488432271005e-03 2.095202452905915464e-03 2.457747424945680784e-03 9.116206901751807085e-04 1.340886832324475952e-03 3.437622895762742613e-03 1.838631948776192453e-03 2.566089161035037952e-02 2.802993073615587041e-02 3.532931227869095386e-02 5.841387673471659658e-02 7.363715516435380415e-02 6.402639149075714520e-02 4.693032864763784645e-02 4.340417379146167126e-02 3.742907775796610464e-02 3.046264266914874494e-02
2.149288676467475678e-02 6.078148439007358822e-02 1.063702537955642236e-01 7.619075404169099730e-02 4.502514638615960629e-02 1.745810582484492723e-01 7.924547460013179126e-03 2.365242559301037814e-03 7.027124451852989617e-02 2.284077906999555999e-02 8.088307712581026265e-02 1.210519722816318479e-03 6.810179688530461350e-03 9.402183786741801635e-03 1.022867246993238582e-02 1.408266599170376367e-02 1.283441063354254577e-02 8.415709532052674871e-03 2.319863457333425430e-02 1.168346314194050259e-02 2.996577699398441340e-03 1.666882511362137720e-01 1.250749838026856686e-01 2.962849969887815238e-01 5.633126498464699657e-03 2.705985320928223394e-03 5.712770623339849183e-03 3.239366253600451870e-03 5.062906981125684519e-02 5.737507380913825505e-02
2.028100338041051789e-02 2.026630675697843609e-02 5.472724262935412670e-02 4.075180854813374998e-01 1.482142926697733176e-01 3.289744265861360012e-02 3.778284870700397008e-03 2.283658360717946440e-03 2.020988483407721876e-03 8.737996285881871605e-02 1.787448895443424224e-01 5.754489812584549779e-03 5.964042961566696187e-03 7.729732006959169795e-03 7.132831623216350989e-03 8.804009128426876565e-03 1.533115725133025672e-02 2.701691475675912710e-02 2.804136828378291785e-02 2.233846580502811888e-02 2.340599226161442503e-03 3.473257470774013950e-03 4.061223190749307932e-03 8.506875809338091884e-03 8.430460892796920458e-03 1.932154665316437522e-02 1.892254498348291264e-02 6.917886602590157287e-03 5.177137936402397000e-02 3.895447394537957658e-02
1.874437633720836202e-02 2.032351704772593359e-02 4.512076810391976722e-02 4.974070599929770325e-02 3.324807459566436751e-02 3.476851143644014291e-02 1.926417009289489446e-01 8.761552664724617072e-04 2.096388501772973676e-03 1.166793336318760121e-03 1.225932031328530588e-03 7.668537015093430855e-04 3.278981291031989563e-03 6.794173091230640803e-03 6.484638770997482905e-03 1.014983236077575054e-02 1.807074699317489860e-02 2.260670391563403617e-02 1.345159494832225133e-02 2.989878410601597494e-03 1.783325127577540430e-03 1.212930605218739445e-02 1.743692473269849857e-02 2.902768546325007123e-02 2.702340459389632188e-02 3.466594685175904828e-02 2.719451811511833586e-02 1.139340045360040000e-02 7.474957991364111765e-02 4.330759193055499362e-02
2.397783701755521954e-02 2.756632348878785416e-02 2.669928215365180435e-02 2.485637003339304096e-02 3.567292721802085148e-02 6.019510220242505621e-02 6.667103556327453467e-03 1.672634717855678993e-02 6.523094419031844927e-03 1.087026499229423477e-03 7.801511276193488775e-04 1.161330081018642013e-03 2.268320407976675765e-03 3.427416589972970620e-03 4.633225275776041256e-03 8.483697216390017129e-03 1.901177636352486405e-02 1.994789453494123788e-02 9.819028876722809412e-03 3.450874201301481169e-03 1.474401106345045107e-02 2.642737379569435122e-02 3.346904163921492203e-02 3.405431863359607847e-02 2.958475295635903946e-02 2.504370788089996941e-02 3.602584670291275604e-02 8.011893872953959952e-03 9.732475959283141964e-02 5.215844736827044553e-02
5.956033091993694767e-02 4.666834115634042185e-02 2.270429481837011113e-02 3.159314088422368605e-02 1.547849066971723319e-03 3.018305063942965279e-03 1.171176263583677615e-02 8.774203258481345219e-03 8.604951462092688338e-03 4.194427506139544043e-03 2.234108219428238874e-03 1.069687158478354076e-03 1.022130496017344820e-03 1.993530822345507530e-03 2.205555934528672431e-03 1.031770038769591613e-02 1.140525386168318549e-02 1.615218078979266045e-02 2.921662924270107282e-03 5.247663130667417491e-03 1.626612323709698826e-02 3.478946757834727732e-02 4.241186744400014114e-02 4.345437913720963385e-02 3.520142262265498617e-02 3.287321254409768939e-02 2.948352416841334284e-02 2.596685421429184223e-02 5.314590687532050502e-03 4.206319113642175561e-03
2.361192552231506508e-02 6.495903956947193802e-02 1.128182543540854899e-01 2.350701408197804730e-03 1.932869430004519225e-03 2.034503604114250817e-03 6.475726768301688120e-03 8.127880702239732164e-03 5.571588180363829489e-03 4.257599133737505377e-03 2.033106876845587260e-03 1.190629563373750283e-01 1.773876868776946836e-01 1.494276573043368294e-03 7.839737135105762349e-04 4.664168515646912976e-03 1.858876365183190736e-03 7.332750532524581364e-04 1.276773703910171753e-01 1.848819268813989324e-03 6.157083086714768005e-03 3.271855663938028763e-02 4.129788461805060373e-02 4.288889619676612003e-02 3.081958350843931257e-02 1.389906783599131196e-02 2.187014700058689462e-02 1.494743184711852177e-02 9.908635190657143557e-03 2.941334444429190009e-01
1.405622269274005472e-03 2.525098861022110307e-03 1.462190347262823896e-03 1.134805675840477564e-03 1.084605885962861872e-03 6.159977653550034044e-04 3.180557835972373446e-03 4.117494245364442494e-03 3.796260706173074963e-03 1.815857309098517763e-03 1.420565919642826020e-03 8.289692120639506612e-02 1.396552539416499594e-01 1.657520336877830753e-03 1.758230527953371942e-03 9.634351594200584335e-04 1.543197615028156933e-03 4.583577192840325660e-04 8.681988740722421409e-04 4.089995984895789839e-03 1.938084499340317346e-02 3.700730653079906812e-02 4.004276436379348297e-02 3.789935328683208954e-02 2.870604903627457100e-02 2.061589592876683988e-02 1.954549040664920606e-02 1.789483725164317182e-02 1.384295578468941641e-02 2.348398241223756122e-01
1.346107123951544157e-03 2.167783460284487124e-03 1.932479086517573455e-03 2.023144011183446254e-03 2.801365755204006207e-03 9.839482033014007849e-04 3.701559061312971726e-03 2.529552744711137391e-03 8.091351770045632393e-04 8.183449547165541149e-04 1.434457673990635618e-01 1.264567423137777924e-01 6.911705109123397750e-02 3.122495451187981899e-02 6.539480838371178328e-02 1.883734790547990090e-01 8.091863641822820289e-04 1.511520441300101417e-03 1.501905369655513441e-03 6.899627889328931001e-03 1.927604800727305417e-02 2.852224348765175846e-02 1.183486558936052042e-02 1.781854849763261223e-02 2.286550571930773268e-02 1.280143084949390483e-02 1.483380434055514736e-02 1.698767083259410116e-02 1.319781676869568043e-01 1.435500922456954265e-01
1.075800688987084636e-03 3.703703951524688932e-03 2.290338739625505382e-01 1.954972364273065422e-01 1.808340595625162472e-01 2.628175805005353860e-01 1.578378881780107337e-03 9.422388468902719028e-02 1.319238386737520141e-01 2.275717541077090789e-02 3.346629924637799236e-02 5.338049455651659725e-02 5.024626428319468874e-02 1.529358220062452811e-01 2.004411632706530610e-03 4.749704475546050013e-03 7.697525863575637416e-03 9.122138564031401567e-03 6.395850290937410247e-03 4.948157378486258730e-03 3.615293954464990009e-03 1.332349218900790973e-03 5.310846387299012449e-04 1.158572907996843369e-03 4.194382817734157269e-03 3.259756612272501301e-03 5.402214793726121955e-03 1.917833511646707401e-01 2.478002205606217451e-02 2.311669575717044747e-02
2.275751229402119165e-03 6.693857160344215441e-03 2.605192248933539401e-01 1.521412088558425635e-01 2.533955224122103611e-01 1.968168095366406301e-01 3.096036028585236188e-01 3.429263178090352637e-02 3.143586924180893916e-02 1.358845849909912258e-02 3.361091683459109525e-02 6.193173616945746307e-02 6.644709478082506948e-02 2.996760025225543855e-01 2.925143134237913594e-03 1.880909122843467656e-03 7.006622075819111083e-03 1.334942233093602305e-02 1.544962190699873325e-02 1.376372474046148701e-02 4.786389625038233245e-03 2.193017691778379168e-03 2.665293246577070396e-03 4.776115112857403158e-03 4.935022070908285166e-03 3.333202145996083231e-03 2.277315257116229452e-01 9.303337242942302798e-02 3.472095841951723660e-02 3.326258719042866907e-02
2.809132364134314924e-03 1.648285737037922648e-03 1.472461228938669042e-01 6.320391491558427499e-02 7.942217575877562330e-02 1.810336713968134781e-01 2.441664233518051341e-01 2.853130382860254860e-02 1.546551426801114591e-02 1.759740597184818525e-02 3.190577006175711328e-02 5.434046562146758325e-02 5.000603852139439559e-02 2.353650457920289929e-01 5.593507041664007480e-03 6.084970236953161395e-03 5.392178768037519075e-03 1.260488013147470499e-02 1.608008638503230503e-02 1.395573588810346960e-02 1.150615779593330661e-02 2.679730261881878572e-01 1.816977296265696873e-01 2.678731718512885208e-03 6.653683145822640935e-03 5.468434449173035020e-03 9.183867566271351063e-03 1.630053561741695300e-01 2.844530523826404450e-02 2.563422712768772399e-02
3.182854165619702566e-03 2.234250330327231405e-03 3.139513386346750590e-01 3.338529242708422884e-01 3.342602607383912336e-03 2.656195552674501300e-03 2.499752712903130780e-01 1.068060259375216703e-01 1.562929133050438568e-01 1.994438292207255936e-01 1.865846333782872346e-02 2.240382011081964997e-02 2.931634096344191628e-02 5.636820942908540855e-02 2.804450438029256754e-01 5.951137671140407578e-03 2.268621887461005470e-03 1.077695599833375026e-02 1.189994258376141610e-02 8.699649921134554320e-03 1.255528772448915101e-02 4.375555035179553437e-03 5.331300227205587605e-02 8.588323212607083812e-02 7.745071372171672894e-03 4.253209824715227516e-03 1.560626779844176588e-02 2.319565803559598544e-02 3.372567071928508214e-02 2.936202846794154150e-02
1.206957907790003580e-03 3.181044308779891749e-01 2.221249284494502835e-03 4.739340823125866818e-03 4.449854433398624520e-01 2.096437546275015384e-01 1.009298452325623069e-01 7.422543062227475452e-02 2.331812069459449632e-01 3.322818210925680520e-03 6.119250949041494386e-02 2.263896590992701963e-02 3.335858955792022490e-02 6.093119852716635115e-02 2.502686506440918723e-01 5.485160965836465702e-03 2.554376255631650161e-01 1.177818541228854154e-01 1.689740372372141863e-01 2.819204492936827067e-01 5.542999628295952434e-03 1.137824305477603548e-01 5.822717456646957224e-02 2.691709098077925688e-01 4.033060108397618082e-02 1.890102704784558940e-01 2.104269182219848169e-02 3.818881648821582236e-02 2.772474535498013481e-01 4.707362233629758252e-02
1.318786815828069774e-03 2.270656993201281004e-03 3.895390409843899060e-01 3.139767221040410949e-01 3.128256378278624350e-01 1.240601677752665860e-01 8.306815070673695400e-02 8.724565561202407560e-02 9.763305982903140723e-02 3.869227322136398195e-01 1.132986132253738926e-01 1.132394208339334990e-01 9.060909866034320970e-02 9.116966883510610464e-02 2.276071086671632437e-01 1.529001547737508793e-01 1.067001968401886935e-01 6.605166106510633461e-02 5.690078150719420774e-02 4.233703718615261513e-02 3.379822150612255688e-02 4.914213520465166019e-02 7.467103865121174633e-02 1.736023593879019999e-01 2.958821858371755709e-01 1.330893952267468150e-01 2.040029628666598371e-01 1.409437266802943955e-01 1.450259946178876491e-01 9.536602305157261539e-02
7.480011583314996951e-04 1.475986652259342986e-03 3.948764244586121519e-01 2.207017757777281382e-03 1.209100328879569039e-03 2.997006683163930818e-01 1.382437538053401995e-03 1.336710962280579290e-03 1.346370001800036298e-01 9.757865331295063893e-02 3.650418430468683334e-02 8.446321830419360743e-02 2.110115573014726686e-01 1.916545688254982782e-01 9.545092551979189599e-03 6.939498864284722457e-03 1.209421870074461614e-01 1.427387981185867238e-01 6.427822537678698489e-02 2.832424971293084556e-02 2.747198310508924476e-02 4.278222242399441766e-02 6.471489697732507596e-02 1.964273882260429427e-01 1.977224685367817425e-01 4.667722638296119969e-02 5.178475183461313941e-02 6.634988442514401508e-02 2.153017719309980593e-01 4.392717049955492670e-02
1.003156852451825331e-03 1.807662567224043370e-03 5.715168066481896448e-04 2.061847125233630656e-03 1.258543203542543702e-03 2.358775947676862352e-03 2.704808188180266460e-03 3.366560809795319242e-01 1.335660571854555834e-01 7.755857139051303140e-02 2.350971321143122475e-02 3.000774030261415745e-02 3.197800533332857686e-02 1.084838686096974147e-01 1.232678205785637110e-01 5.164672416112678355e-02 4.249008834557054665e-02 4.565544477409826107e-02 6.122422202217909365e-02 3.530621269363156539e-02 2.505331055050462677e-02 3.727688998283253813e-02 4.233430566814352924e-02 7.022728717260008635e-02 2.180527527771648766e-01 3.427909430129232049e-02 4.968681255255069651e-02 8.097174140704434253e-02 9.730310594711559513e-02 1.926807686374576445e-01
5.442994834807026719e-04 1.325181914501772197e-03 3.843701100682114704e-04 3.933064672502774284e-04 1.793831912741883231e-03 1.848034630901144830e-03 2.415864682160221745e-03 2.303926736568299716e-01 1.781009659002058543e-01 1.672091234755172795e-01 6.899659716268918830e-02 3.491435306982861031e-02 2.087725400924375641e-02 3.250428450054052704e-02 1.471314828740226399e-01 3.823438445562375027e-02 1.021784624351467496e-01 5.510741251094808564e-03 1.107183878827211303e-02 1.362105675145655614e-01 3.516290922223604121e-02 4.918291591617218739e-02 4.278583498795102136e-02 4.677931993577381237e-02 6.181651683070566589e-02 4.724536591812925068e-02 5.555047162932886390e-02 6.806284307792996591e-02 9.114453531625252292e-02 2.230522598548969893e-01
