3.372558712082365795e-01 4.894718724055796555e-01 4.158456179700683042e-01 5.172148104214052688e-01 3.640768905406117084e-01 7.598414727912400357e-01 6.920617149036287774e-01 4.199662250412622422e-02 6.208053485081863054e-02 7.292105903040489723e-02 8.309348773318486758e-01 2.150543801546931366e-01 1.401881253360250656e-01 5.493822838625362914e-01 6.744218481379554708e-01 1.586983050111692439e-01 5.970147875414232308e-01 1.803706482484155466e-02 9.361099970159672545e-03 4.382450804713926007e-01 4.093933405323442187e-01 6.107439631549634040e-02 4.665565545975582096e-02 1.870692395332153313e-01 3.652882097707887965e-01 2.877605681138311056e-01 1.322158870026954869e-01 1.162814850029482081e-02 1.108342914359902905e-02 1.390980869792657164e-02
2.221586573567014555e-01 4.742376287695323489e-01 8.366421501412207862e-01 6.314238225839168273e-01 4.356885079742516820e-01 1.060767462808236555e-01 4.265289689214801089e-02 3.385111473405817695e-02 1.664108562780648032e-02 6.382583059570190454e-01 5.138159407974365323e-01 1.118567472877001756e-01 1.663885855667579239e-01 4.243907443789303180e-01 6.139736589317890125e-01 4.360151309338725634e-01 5.540677335543182647e-01 4.271911261177600838e-02 1.379972377317258830e-02 5.237986484361075723e-01 2.346776907954929714e-01 5.862364580802603697e-02 1.211804201052017194e-01 1.087934764193029119e-01 9.734083428480178046e-02 1.315184418792716414e-01 4.627444819249650065e-02 1.175663623993192068e-02 1.671167344870115243e-02 1.668470812054908062e-02
6.276510075744153039e-02 8.114171494107733085e-02 1.665883050115672115e-01 1.218328308762641060e-01 2.189193659004850800e-01 3.760984769958824331e-02 1.820924462924703724e-01 1.915825556649073114e-01 8.781138141595076774e-02 2.340437619029584262e-02 6.443010280159650049e-02 7.931091250698216188e-02 7.610674180993799443e-01 1.052618128176869700e-01 2.524493976190440581e-01 6.791112898639295459e-02 8.491388972135407442e-01 4.088993119694929457e-02 7.632007790070989561e-02 1.538042802576808366e-02 1.479366175870013567e-01 4.857608718519566132e-02 7.357335744499668428e-02 2.572009282991153875e-02 1.546902853728220062e-02 1.029416723484159399e-02 9.209106903124897672e-03 7.232472693888708851e-03 1.232949983601569315e-02 1.381547002206514815e-02
2.700097865904537570e-02 7.328569235820189820e-02 1.028928797227708775e-01 8.293253216841006692e-02 5.030617785735177344e-02 3.688647726966657880e-01 3.686633680111939260e-01 2.300668085160383070e-01 1.252756405594837308e-01 1.837037971907174577e-02 1.003288117621419645e-02 5.856690307759380987e-02 7.511250389996879662e-01 6.031430635857500944e-01 1.877079777001827432e-01 1.587704371336415843e-01 3.474183880919032852e-01 6.803985470377168499e-01 5.310710895092523032e-01 4.909442323607405845e-01 2.697492166220576415e-01 1.039536347081202738e-01 3.468670611310553653e-02 6.865157101040347820e-02 1.267547461186643507e-02 9.111681030257098857e-03 7.833301723267975872e-03 7.429150004967903509e-03 1.507105509641412655e-02 1.636334683226128503e-02
7.072725595471390792e-01 9.965404019459024598e-02 1.161759169981602530e-01 3.121097877446692148e-02 3.101818930868135635e-02 2.157996861683345868e-01 3.795859565802590097e-01 2.152926843056593154e-01 7.974110963400997398e-02 4.862322942261351755e-02 4.565744534624062434e-02 9.126788528868677586e-02 4.555708147503567673e-01 4.708792883029937482e-01 2.456369717822302623e-01 9.939834017277983380e-02 5.286872149516162050e-02 6.621944120068558037e-01 3.166372812316954610e-02 6.172250941537174018e-01 4.368130674360993781e-01 1.353400371581621742e-01 3.430507169137269052e-01 1.134279029035600017e-01 2.293537721670502877e-02 1.219086792042395860e-02 8.480148665457683602e-03 9.793926311663678913e-03 1.529062495304057620e-02 5.612691641100647083e-02
8.136430005327490722e-01 7.593503101094898344e-01 9.536324926691588932e-02 5.881250975881714693e-02 4.592741066162751851e-02 1.256904366862046651e-01 1.645674227831933067e-01 1.777727978748622206e-01 1.501892600676492384e-01 2.233894682484112992e-01 1.157975361338353104e-01 6.622435610010048157e-02 2.051239656456719240e-01 7.788568652571792317e-02 6.580877170931087594e-02 1.158537019567384141e-01 6.312408940240012978e-01 1.623130763351682826e-01 5.127808919738435778e-01 5.249482123956934060e-02 3.832424756885078471e-02 3.135586846756578672e-02 4.248778106618059658e-01 6.639030258098309323e-02 3.426924495783244956e-02 3.192501900595046821e-02 1.994654469622412704e-02 1.372365771915388249e-02 1.806767988752449455e-02 3.236353450018222139e-02
1.320143103701305054e-01 2.003046627474966701e-01 1.925866148298991387e-01 5.336827658141991143e-02 4.300627749568896596e-01 7.349092846451676930e-01 1.300605047647494794e-01 6.930296551077029799e-01 8.021831808273683917e-01 8.444509042069160420e-01 5.955465316936605635e-01 2.505322824499729428e-01 1.142762740597091375e-01 5.344388206187354606e-02 3.171588828825014361e-02 5.956168235776328895e-02 3.486543573075512326e-01 1.619728732545422933e-01 7.849977882354705061e-01 5.064202476307027440e-02 5.020587936128907414e-01 1.375270343927856298e-01 6.302526469953986799e-02 6.005863375479765509e-02 2.322163693921970584e-02 2.381208811904838435e-02 2.117115310816786167e-02 1.833192018473915608e-02 2.118996317293709436e-02 4.976455442325580097e-02
2.847338188024935990e-01 5.292170797357546030e-01 2.770491893157657204e-01 5.260250647940714064e-01 7.742580761897074337e-01 7.001338967901414578e-02 8.289919949228286011e-01 8.370597700605492131e-01 7.406985575508507891e-01 4.062711344770322808e-01 1.586085620229698567e-01 4.654484406295398835e-01 9.953471454331357104e-02 3.490066678970084324e-02 3.999348611003427506e-02 7.692292524068548853e-02 6.064661301262226356e-01 9.451175397775947173e-01 8.243403684232903927e-01 6.244944030966630422e-01 1.979958952564274122e-01 1.127343046263132587e-01 4.446628041567573381e-02 3.698296796169606160e-02 1.759668977227365691e-02 1.851724713196112315e-02 3.007279590394867919e-02 3.866926712553758055e-02 3.785284917801916282e-02 1.083084871282831707e-01
7.154040996898782812e-01 4.621463360018210342e-01 2.461158544194651243e-01 1.158601589936615328e-01 6.043956430518315770e-02 3.628981107266520678e-01 1.783327668297426116e-01 6.128840717668415650e-01 5.705550076429674045e-01 5.614452829257922106e-01 4.860700973794811475e-01 5.937965878149955579e-01 6.849412105380761617e-02 8.086280864937672730e-01 1.267263527437448301e-01 1.086212318037404478e-01 4.467019909329035809e-01 7.379622924480541690e-02 6.694450203730323290e-02 2.646786180526371490e-01 5.099018567788680956e-02 5.152330582898916045e-02 5.559012321942569113e-02 3.614834472790558195e-02 2.114275649204797394e-02 3.236761224988855129e-02 1.285004347892760024e-01 2.563757317169206296e-01 7.240408689545432264e-01 3.501168523558477741e-01
1.159390175283929292e+00 7.335433392341028647e-01 2.454201668160257699e-01 1.432226061556659547e-01 7.955390505556148018e-01 1.641738897521610729e-01 8.547283381006806069e-01 3.904969900135192851e-01 1.867320337282812881e-01 6.583476974126291348e-02 8.778076117605928541e-01 7.341075423638798725e-01 5.447188608490040329e-02 4.598340637490208604e-02 7.767076481948232969e-01 1.800794848432058295e-02 7.109922637798671285e-02 7.863116812582875148e-02 3.573840709815538641e-02 2.252347488406568343e-02 6.243278089876763692e-02 3.928166642420805044e-02 4.492117387211439633e-02 4.920768592786622930e-02 2.742924220404920760e-02 3.514727302916009766e-02 3.395618524700785290e-01 5.753616658701028452e-01 7.049790782844795878e-01 1.824736272899902811e-01
9.863581614103430484e-01 4.965605228235866475e-01 1.051801161756729330e+00 8.636771565246920135e-01 2.014422005596172571e-01 1.057372489172806185e-01 9.756843143353766123e-02 9.020836810464348543e-02 6.028223021040922391e-02 4.657311583961640800e-01 1.412705313141101315e-01 1.820907972237752470e-01 2.727914649821428505e-01 1.469972377469429548e-01 2.681854492319991207e-02 5.106741169462603036e-02 7.572242144971927380e-02 3.509629981416046568e-02 4.243799737723323862e-01 1.031516970087103940e-01 4.238393740917389962e-02 3.771930041721308774e-02 4.860916198334399446e-02 6.788560338689636486e-02 7.245559528584810671e-02 3.946244293478642917e-02 6.366540871746569075e-02 5.031477506124909516e-02 4.487550911217315364e-02 3.211885863739318697e-02
1.919548965888968617e-01 1.099299978196596334e-01 9.388685363333661993e-01 8.951423978053476560e-01 7.029812189327295791e-01 1.648878053805390986e-01 7.139399706148177871e-02 4.880714299200274164e-02 5.921729060467377515e-02 2.628881816005868358e-02 4.391018748788128728e-02 1.422980404145418321e-01 2.433919653655466364e-01 1.244789728546488727e-01 4.431311751514383640e-02 4.939715007485299264e-02 5.440821969360154498e-02 5.505425664376680656e-02 7.069257684078313897e-01 2.340184896842132933e-01 4.036986032407449687e-02 4.081606187018516768e-02 4.815124093933858401e-02 8.602918814219376320e-02 8.173786684861576723e-02 5.829197694502735727e-02 4.492584088605288545e-02 4.105508388540729525e-02 4.492710867739545949e-02 4.889054247234050216e-02
3.970452666029319205e-02 9.961903783285745717e-02 2.342631592823660736e-01 6.498746500967145234e-01 4.265544443381613093e-01 1.392234910065670572e-01 7.451302392250946927e-02 6.512669605275733797e-02 8.134902308494296186e-02 5.256520795209396191e-01 1.461651223368384822e-01 5.088401495147069908e-02 1.918632557346570122e-01 7.509107291397286443e-02 2.344308029037514909e-02 2.696189919442027599e-02 9.956384532186970254e-03 2.170397548537774529e-02 3.388243410220609375e-02 4.922427457548419483e-01 3.865151687569126637e-02 4.216114985799565562e-02 5.302271595492934197e-02 8.794501577125621306e-02 1.114804358791775807e-01 9.752299810550732473e-02 7.266816151141221314e-02 6.867742616525850108e-02 6.041600105115969843e-02 5.029317734810194451e-02
3.315346790344739225e-02 9.452810313500598083e-02 1.671605297523001687e-01 1.199038270800862338e-01 7.088210064703237556e-02 2.808576041602510731e-01 9.552485132880881302e-01 8.381873460280339083e-01 1.116979227498545169e-01 3.448321544697258156e-02 1.218352286964137221e-01 6.504331344169397289e-01 8.601928871242915664e-02 1.060984971946841993e-01 1.129323916794413851e-01 1.523955084344738309e-01 1.375140577834508271e-01 8.953643287118699667e-02 2.705628755772752081e-01 1.608983838173869418e-01 6.954673740209700306e-01 2.529641076356623497e-01 1.884668348904498247e-01 4.454650375975262033e-01 2.584392329891283327e-02 1.630963560417150390e-02 4.723651334014995762e-02 7.754000569192063264e-01 8.145111678199695726e-02 9.446576197043897449e-02
3.044430659610130457e-02 3.052197975314795836e-02 8.270627354897108763e-02 6.165944493210171462e-01 2.247940364258759760e-01 5.171957365971962400e-02 6.347627679588833116e-01 1.160548034247439464e-01 3.594972927017531239e-02 1.301941093327577958e-01 2.685363957595718887e-01 6.593545049069354791e-02 8.601862443015646786e-02 8.841442697858688249e-02 7.985327887247459233e-02 9.658257649235511832e-02 1.657262671032791734e-01 2.882840020754134369e-01 2.957775398540792855e-01 2.961532895837039048e-01 6.725660659935478458e-01 7.516659483092719141e-01 6.222358928614951656e-01 5.070790884173838331e-02 5.663801096834811255e-02 2.144680162942748103e-01 2.596769596796211221e-01 6.372144734004960009e-02 8.394530890671780821e-02 6.433724745784870358e-02
2.756766887958851664e-02 2.993424900689330148e-02 6.728625188608933216e-02 7.462875035254953882e-02 5.012792750198101499e-02 5.295614009661311211e-02 2.927324398712389808e-01 1.976008271310404629e-02 2.292104192593428375e-02 6.627798543386704822e-01 7.190516372231930964e-01 5.715961474334341208e-01 4.482389510218561662e-02 7.949766196200677704e-02 7.417703174718172365e-02 1.137678836422127693e-01 1.985350803100953965e-01 2.435795997876183394e-01 1.423160888606959662e-01 3.468538230481074680e-02 2.454967665923218564e-02 1.795268372746468277e-01 2.384228835423022330e-01 3.448941625930767030e-01 3.013077306550977497e-01 3.957711001028217934e-01 3.182119141074173374e-01 1.039039128287523039e-01 1.228027623116849376e-01 7.230218535828494830e-02
3.504223996365024574e-02 4.023109852711037604e-02 3.920143513531690327e-02 3.688717983910803910e-02 5.310436832388717304e-02 8.863373117945591573e-02 5.514767131146500884e-02 1.637044485593959209e-01 9.127724560557953781e-02 2.076137622447855532e-02 2.065148057853952168e-02 3.226948457249236707e-02 4.927853048546554371e-02 5.210860809929122872e-02 5.436069037690929168e-02 9.772383100870377093e-02 2.128465091369922402e-01 2.171276147197114814e-01 1.041777494904909812e-01 3.611913392021805919e-02 1.561234950557533196e-01 2.834102105034700392e-01 3.635365185543220079e-01 3.770429778175014013e-01 3.364599138563972858e-01 2.942303031340319786e-01 4.396245710813166951e-01 9.757205351189204845e-02 1.711528366205758156e-01 9.274253490108862186e-02
8.732647342505986399e-02 6.804194121713302845e-02 3.301207812070477282e-02 4.621717877347930603e-02 5.469750820644230238e-01 3.240405641279044124e-02 1.254816536712121400e-01 9.957575551131073177e-02 9.733939476490990894e-02 4.835642030582814471e-02 2.621879181085450677e-02 6.707656063029484583e-01 6.488954457091178352e-01 2.559412423004556181e-02 3.755591482269185488e-02 1.228569254372252062e-01 1.454032831797353043e-01 1.784894521639869280e-01 3.147324594238162798e-02 5.081926695132376465e-02 1.729572064443858359e-01 3.743092320385592586e-01 4.614331953072484671e-01 4.850876542347720699e-01 4.075096088876109524e-01 4.001232919749239114e-01 3.780161456933764375e-01 3.666544386199545591e-01 8.778751920161858013e-01 7.240107956460857253e-01
3.528843056974574621e-02 9.690566408754450189e-02 1.659766570456551738e-01 2.035590762266516890e-02 2.520565108330082363e-02 3.243274032613959607e-02 7.645882204016074546e-02 9.526534342403442102e-02 6.503523332607384633e-02 6.110129114878702639e-02 2.109164454499956598e-02 1.806896133454192477e-01 2.794254730831087219e-01 6.546059839571428673e-01 2.053275939934314995e-02 5.822403013910135150e-02 3.059840646440258050e-02 6.208085516851395980e-01 1.956343705739169714e-01 2.285339828017331903e-02 6.816035010535899386e-02 3.648943598975288860e-01 4.640721965449131625e-01 4.903700474800269382e-01 3.618083550404869730e-01 1.697107737653115178e-01 2.779883653099803897e-01 2.724512699415360117e-01 9.255553154394237370e-02 5.255578232927563542e-01
7.444131255959742788e-01 2.417467936476536822e-02 6.608118696308651341e-01 1.134318382637384409e-02 1.654891353316750163e-02 9.289640420196192128e-03 4.719982444637217667e-02 5.032182009550874302e-02 5.636817345560163339e-02 1.944329594233685024e-02 4.800975768506695052e-01 1.234166335810719661e-01 2.167216856212430542e-01 5.258765014560929929e-01 3.127197900247255524e-02 9.721083110288564894e-03 2.363553837198951318e-02 4.846471825462440597e-01 7.825629619876166565e-01 5.306104480456828171e-02 2.242441375016025473e-01 4.280903985542810486e-01 4.635184999237629833e-01 4.434325287875793276e-01 3.428661954526459055e-01 2.525981442877666128e-01 2.459827827371957876e-01 2.245724372155560034e-01 9.185264825878487471e-01 4.009399321582974851e-01
3.108576183639058868e-02 3.930077819519768589e-02 1.609032824703299225e-02 1.366689287822257966e-02 1.540410239875539961e-02 6.349753536315609903e-01 3.795534948178674872e-02 2.641013834551753092e-02 7.463302104470671480e-03 5.260929223690065104e-01 2.125791368253390767e-01 1.878704002842931930e-01 1.058812419016725570e-01 4.933088473539568031e-02 1.054000754456791838e-01 3.039428806921339876e-01 1.187657876507843165e-02 3.119743649880636280e-02 2.908879345106340011e-02 1.064609559170102415e-01 2.358730857346798548e-01 3.629360024657107830e-01 1.489582220745939156e-01 2.246772185468152716e-01 2.775590526429244087e-01 1.942718789743541064e-01 1.648437322392218296e-01 1.791456562786187812e-01 2.233449493510554218e-01 2.430004094820200911e-01
1.339867964744666934e-02 2.280666501332696133e-02 3.344847589307682334e-01 2.860668617728493457e-01 2.678126231401447566e-01 3.925548046333142138e-01 5.522918094846714920e-01 1.382863756470409933e-01 1.928763855237530800e-01 3.344700319241369207e-02 4.951279136085065535e-02 7.814055132649450064e-02 7.496572616533114797e-02 2.383398181432571650e-01 5.319459638352946884e-01 7.709159655193531524e-02 9.217197082288929033e-02 1.236740533599923197e-01 8.412605254774255248e-02 6.350410414804102954e-02 5.739076824431597890e-02 3.678322118373882066e-02 4.289152154961287100e-01 2.636227052284573907e-02 5.141179911505798505e-02 2.814933576572811041e-02 8.787483499536900000e-01 3.209633630509270974e-01 4.128631352915906882e-02 3.852674676180449509e-02
3.376315190677287026e-02 4.067531852846825030e-02 3.794971401409154010e-01 2.221494689742308237e-01 3.740526389884529790e-01 2.952717239443505282e-01 4.637823938480389874e-01 5.123124283213864594e-02 4.546967596637793707e-02 1.966848409231716777e-02 4.870063874829586720e-02 9.009066083336483843e-02 9.855583466931999714e-02 4.601947950547297106e-01 5.984665686604779822e-01 3.996219373788500312e-02 9.482528161460820892e-02 1.754260594511043436e-01 1.976807359827403576e-01 1.724464900793241662e-01 5.508245722492008389e-02 7.022187713913125018e-01 8.306499576592329959e-01 7.449412371821467760e-02 8.509345067956955444e-02 2.837773742667176052e-02 3.726999768573405758e-01 1.523940046148830330e-01 5.657652021010001198e-02 5.428315797700730000e-02
4.192297391279146274e-02 6.045749938335871487e-01 2.141219180921569709e-01 9.256006177790225553e-02 1.198934059209499220e-01 2.736653613878413105e-01 3.688539455508744180e-01 4.180994893463545192e-02 2.238679474577496414e-02 2.548357866439162484e-02 4.629224250917569200e-02 7.921689097377634936e-02 7.391202762389847969e-02 3.551397377000791167e-01 2.820299491490241284e-02 6.059769091278755654e-02 7.067692060456211289e-02 1.612157060697698707e-01 2.021205798111735119e-01 1.731528320026276269e-01 1.588900201871665807e-01 4.374594715443808624e-01 3.014772358017985265e-01 5.407936334087997121e-01 1.380585693289893279e-01 6.784593836586580440e-02 5.069338981383181980e-02 2.612630808249882253e-01 4.566820404363544639e-02 4.126187355169638749e-02
2.849737990424303785e-02 1.548693580418480584e-02 4.747727543124297123e-01 5.147122098435883419e-01 2.221854914212930548e-02 8.785863968851570505e-01 3.798951732071276233e-01 1.566606291879189539e-01 2.274839275848344888e-01 2.902635902191282313e-01 2.720168324557423190e-02 3.294116010942427925e-02 4.371553872280202480e-02 8.593690383264601662e-02 4.453618750666248904e-01 5.994853471391831112e-02 3.568349093227582425e-02 7.574766557183307270e-02 8.366393491491236345e-02 9.569462331170083824e-02 1.186831940838862509e-01 5.440883390594003499e-01 8.810442808900387224e-02 1.532808346685699541e-01 6.248250317111990748e-01 1.667168420384413929e-01 1.130866461505484755e-01 9.903021244077797602e-02 5.348703356623518007e-02 4.672799404738608997e-02
8.607400979589374321e-03 4.598613772090269780e-01 6.114673700473546303e-01 1.193393616383727318e+00 7.085114424451007809e-01 3.217031302132277171e-01 1.536890328247558779e-01 1.088608458324360206e-01 3.397742735763343291e-01 1.121444431861794329e-02 9.012827333530015750e-02 3.456174943499162183e-02 5.281117962356549067e-02 1.009094045283892016e-01 4.292728501909385819e-01 7.107724922001649182e-01 4.172629585780072148e-01 1.804631894569401207e-01 2.552174130271481767e-01 4.348313062617209512e-01 7.648683120082490072e-01 1.811783081652243443e-01 9.489019518910921103e-02 4.594600211512800958e-01 1.051030982085608301e+00 3.254617463436359492e-01 9.394446279807643074e-02 1.359900751443691158e-01 4.376526740299208074e-01 7.458214072419941387e-02
1.193986347866878885e-02 1.663948429877128848e-02 6.011549010751464639e-01 4.953457289445516998e-01 5.009003311545273673e-01 1.876633679467587801e-01 1.227499375395767756e-01 1.278996773705634582e-01 1.423056003841152994e-01 5.637653408295943969e-01 1.681003909951613584e-01 1.800356483339547453e-01 1.504460482752592587e-01 1.675657414135388323e-01 4.482187451549355384e-01 2.946480651509275073e-01 1.850333936024581294e-01 1.029343177162401757e-01 8.676914686690945233e-02 6.497305175455966864e-02 5.223344874194099652e-02 7.681148353555250496e-02 1.188226763949319642e-01 2.848511703866905553e-01 4.879916585228175618e-01 2.197135424498142253e-01 3.223694451738878253e-01 2.213763333005431266e-01 2.287654302310305754e-01 1.510265271230138429e-01
1.312862816119070644e-02 9.129327346182460889e-01 5.874740988651601103e-01 8.998461229365597447e-01 8.233537152037544438e-01 4.509313311137065350e-01 7.913621067026808606e-03 6.492637733938235595e-03 1.961091873593721058e-01 1.420784452571055567e-01 5.431511828843593043e-02 1.348508982958658842e-01 3.543557596216466710e-01 3.544422075769514402e-01 1.023845405408698728e+00 7.209169639754930969e-01 2.078011201009680731e-01 2.226882277817411881e-01 9.801370448680660208e-02 4.302753772775526342e-02 4.193297602085645226e-02 6.584087488997879267e-02 1.007950002914124316e-01 3.087629859537316390e-01 3.125903410632397961e-01 7.370962069871025979e-02 8.118078357301952708e-02 1.040952029146326729e-01 3.391157138214981881e-01 6.946305731063694144e-02
1.757855492897039684e-02 2.432380514460993903e-02 6.739260684327902373e-01 2.833145204584762086e-02 2.025455855063935592e-02 2.898937891890431690e-02 1.890733327855293952e-02 4.948305594701122301e-01 1.950160319618605698e-01 1.130965441171346009e-01 3.474185607284521748e-02 4.766160099624161539e-02 5.339173570204729102e-02 1.944120595911387195e-01 2.291595763357606730e-01 9.416965575053180826e-02 7.201042535324095328e-02 7.075206289534465010e-02 9.307488360485585699e-02 5.344939462614244075e-02 3.795953412583995268e-02 5.665569791506280817e-02 6.468961432321616856e-02 1.084709023909993797e-01 3.393216735059587097e-01 5.346083832412640985e-02 7.748986453064096724e-02 1.268001976321813107e-01 1.530526816476053542e-01 3.042234281823718578e-01
6.673085588724579978e-03 2.708610947733385357e-02 1.044446011513263217e+00 9.331898176021962560e-03 2.460508034782076664e-02 2.582732925361677298e-02 2.017306255459805006e-02 3.479058456580801373e-01 2.683448744466957470e-01 2.502573169103203821e-01 1.030112682999735907e-01 5.328799852412283156e-02 3.411220092012953731e-02 5.372510114821092697e-02 2.424534013087777384e-01 6.173667706632583740e-02 1.575276133299283454e-01 2.843092425772106996e-02 4.835167365052980837e-02 2.043129050233736255e-01 5.286518269386174251e-02 7.409312570981226032e-02 6.462245953420819866e-02 7.145020827800356578e-02 9.521596166885916424e-02 7.312340604419952095e-02 8.614956106692460425e-02 1.059943766694017298e-01 1.425508174775622638e-01 3.499470197922917580e-01
