3.952974214325189473e-01 1.460741209355329723e-02 4.568860280638978866e-01 9.085808802478573948e-03 4.141317079136325185e-01 8.508530225446076997e-03 4.826569214004238981e-03 1.297847223799745986e-02 2.344325981534690559e-02 1.059181283420475989e-02 1.128745973411884873e-02 2.535216098793071082e-01 1.591393784025255387e-01 5.883756255874900663e-03 3.942252906545913246e-03 1.704920851747246946e-01 3.232188614478353171e-03 3.358046909556301318e-03 2.913732464977874820e-03 2.968783818341408105e-03 5.185508879382209058e-01 8.085385356679671010e-02 6.225340463609636138e-02 2.486596765941992415e-01 4.821378770847104533e-01 3.779285264592359139e-01 1.736083735799172634e-01 1.527947040935952877e-02 1.458925721992712990e-02 1.834661918966570826e-02
2.583751184005839696e-01 1.455896290031308965e-02 1.159204585903904350e-02 1.201630485078479353e-02 5.219811270336856615e-03 2.807098045778595730e-02 1.118795441004165510e-02 1.366996712456641089e-02 7.098236724604205586e-03 4.706240555670776309e-03 7.171147718284439851e-03 1.289897130651826151e-01 1.857884795149985502e-01 5.419600691344485244e-03 5.003462606946137634e-03 3.396109632977915762e-03 3.105050165772511861e-03 6.186345140115775097e-03 4.448954110626120000e-03 3.917970829576473274e-03 2.992751042458032251e-01 7.760684448712050487e-02 1.621204755015568100e-01 1.450988482354012010e-01 1.287222328500217949e-01 1.730724017018729355e-01 6.100023421182608485e-02 1.549672904256979566e-02 2.204999179225960310e-02 2.203019056225407821e-02
2.398737432766371441e-02 2.331899004856916383e-02 3.691381339108927573e-02 2.996182676657820759e-02 6.385030200205345230e-02 2.006163735606214527e-02 2.234890302927380334e-01 2.359369469250392759e-01 4.460611880847963756e-02 7.180820428887356270e-03 1.873509016106598979e-02 1.565111482065980122e-02 5.867327624047727862e-03 1.324270676971570256e-02 2.833116042537278667e-01 1.437938508594610240e-02 6.163097698657107187e-03 9.329386442990901182e-03 1.768887769453586500e-02 7.187692363811544125e-03 1.887006429176351918e-01 6.404520395406727851e-02 9.836509858499097037e-02 3.433099586342173298e-02 2.044309439186722810e-02 1.353646452128642007e-02 1.217488498575323118e-02 9.557864724199343839e-03 1.629884919128567200e-02 1.825061244733855448e-02
8.050254353528612378e-03 2.258411582457340097e-02 4.953281660088761085e-02 3.998111951893561222e-02 2.329622767725513660e-02 1.615120573622559619e-02 4.519727322242771406e-01 2.820577806693170264e-01 1.532899778858349271e-01 9.709666578588547342e-03 4.907875454756419932e-03 9.707606677531687572e-03 4.388776220709984625e-03 9.826493461236405352e-03 2.171967814736567304e-01 1.954409636993192090e-01 4.219960492668249352e-01 3.552121386913448860e-03 1.505736170546572231e-03 2.302224711803127575e-03 3.320673259504065555e-01 1.330241636291099316e-01 4.604546829385280926e-02 9.118872451958240366e-02 1.672835665828566881e-02 1.198354070085083829e-02 1.034989278530285342e-02 9.817217931578850129e-03 1.994067215567187773e-02 2.163355501138354564e-02
4.597588524969646422e-03 1.394012268642437491e-02 3.886729266466128208e-02 1.507965118270242037e-02 1.491382182331855294e-02 2.642859347388482050e-01 4.626466477894664586e-01 2.618131981538195374e-01 9.657050413448201032e-02 2.527922515281917637e-02 2.223017769935407145e-02 2.563135521009443293e-02 5.419426809810825793e-03 1.098405243924075597e-02 2.835700100487804631e-01 1.179308377235152999e-01 1.406469707107838377e-02 4.103544108064810340e-03 4.624762686900501032e-03 2.708404067609754360e-03 2.649789961268538777e-03 1.745520165325478157e-01 4.514947355366363269e-01 1.496917545527418902e-01 3.022598190086605435e-02 1.604969545592100852e-02 1.119607394171268609e-02 1.294333385061593837e-02 2.025782092267924481e-02 7.440083433261462931e-02
8.587117048452488563e-03 9.169787050945555490e-03 3.068118993759225491e-02 1.956706917989982711e-02 1.187560126175411096e-02 1.490869720386414354e-01 1.909118390124465159e-01 2.039194773664274873e-01 1.659247949228783436e-01 3.486891449728987680e-02 2.995866372362820593e-02 2.495690427548793305e-02 2.428305745422568440e-01 9.160577121074486850e-02 7.735760502769506441e-02 1.346931282387549556e-01 1.073397992387621451e-02 1.795434287531016138e-01 3.087754903743873420e-03 5.924309431982069905e-03 1.086603068022020009e-02 1.851498485990195342e-02 5.551503695847445075e-01 8.717489754176034611e-02 4.510495606107113586e-02 4.203829303005469920e-02 2.630782103941447028e-02 1.814056352907516406e-02 2.397018439735757594e-02 4.304948168905463335e-02
1.355841304577000139e-01 2.056776321297970889e-01 2.014526184992343205e-01 9.643127364281486522e-03 3.213211828122016812e-03 8.169255462091625647e-03 1.712938628092945323e-02 9.523254113431132636e-03 1.167330977024114841e-02 1.168310657982545367e-02 9.894146324111993684e-03 2.947968221606787620e-01 1.376311442252778905e-01 6.550909737567982283e-02 3.848417621896917801e-02 6.706835039724072522e-02 3.804834754444976208e-01 1.700947600148554617e-01 4.906753461387700424e-03 7.026801898897296061e-03 5.649369968133268437e-03 1.741931649781111036e-01 8.172381235507041042e-02 7.865214042082047108e-02 3.054460299043120289e-02 3.132204775830670779e-02 2.761838443927151776e-02 2.384895225954777875e-02 2.733556211879281314e-02 6.489018110041491760e-02
2.795074580839817524e-01 1.493170256780351757e-02 2.871971946490270433e-01 7.232076763564684180e-03 7.206232241147137764e-03 8.102591515197774333e-03 7.263480760105789184e-03 4.639703850472489538e-03 6.623598350497251520e-03 3.989768536288840206e-01 1.659764890326344000e-01 7.242474934021616607e-03 1.163022690071761761e-01 4.263065718196493853e-02 4.850684491067061566e-02 9.013216630275272534e-02 9.608024693385940410e-03 1.044491637851507546e-02 6.308808187241401154e-03 6.198779950999423922e-03 2.439700313335481929e-01 1.434820416524032749e-01 5.795326234955662514e-02 4.868666037403929919e-02 2.326593103461800302e-02 2.429624099288168679e-02 3.772160300630852947e-02 4.241401361630343231e-02 4.205664903716393316e-02 1.217758968128407893e-01
1.295680084259154263e-02 4.233325494808345968e-01 2.455358526147464471e-01 1.653066243954656733e-02 9.404997366425705760e-03 3.871892926349177477e-01 2.044631435922059093e-02 8.642814718005719515e-03 1.010474828588559491e-02 8.215252490870612531e-03 5.748017279458876409e-03 5.631029537772287707e-03 1.045037618417693666e-02 9.810412541976591336e-03 1.545099115966544479e-01 1.298718218935810409e-01 4.018748062126777619e-03 7.614812128605238754e-03 1.030316203258525853e-02 3.238128218630303423e-01 6.451741858667085772e-02 6.725911303279782927e-02 7.310682692046334419e-02 4.789860396211157584e-02 2.813392643337132501e-02 4.227776647422745726e-02 1.574538423663600917e-01 2.777892660836261962e-01 1.316683654093297497e-02 3.723037577060806513e-01
1.227463626144550436e-02 9.407728375421635370e-03 1.507063444041187653e-02 8.399903237440324577e-03 1.070972905423915426e-02 1.836857342082258981e-01 2.181557624679388366e-02 4.112983769813195467e-01 1.930368948918013972e-01 6.820361983977180076e-02 4.871565941559245078e-03 4.511197932416010498e-03 9.535334797683200220e-03 1.296685769957052828e-02 6.886218444878616091e-03 7.338528569629841972e-03 3.146471571629503444e-02 2.850487079694665957e-02 1.814830204539202158e-02 1.366714144875430526e-02 8.225280738932334856e-02 5.204338997044154896e-02 5.968953877051589446e-02 6.568682530392278007e-02 3.675726201595879566e-02 4.646241901292614412e-02 4.231552764201753636e-01 6.373490346928905037e-01 1.341560879161872444e-02 1.954756145360279362e-01
1.358476451178687941e-02 6.800641879107667369e-03 8.023484296296373719e-03 5.209741912623007051e-03 1.509636256662070901e-02 1.143918027424377926e-01 1.126969438387747935e-01 1.029154375369930180e-01 7.062649190748591932e-02 5.773418323924731435e-03 3.837287739139755294e-02 6.082303195852921396e-02 1.258729904324083215e-01 6.187502120388527899e-02 1.136430372222834752e-02 2.221607076056486899e-02 4.105822953596454522e-02 1.124464760724212982e-02 5.057955166212955121e-03 1.334976977868688741e-01 5.638034941083294727e-02 5.043606052674608903e-02 6.516212687718933583e-02 9.131036516007649817e-02 9.775609056545851716e-02 5.287657039748479282e-02 8.223941341325247123e-02 6.083551411916153506e-02 5.379958095248257854e-02 3.826165000115451520e-02
1.947449322023297180e-01 1.061794928197510868e-01 1.634180313211644475e-02 1.732288339743149816e-02 1.635142795439332650e-02 1.838889549754053332e-01 8.660388110882115409e-02 6.007380494629824264e-02 7.138376783060051967e-02 9.083945107188089521e-03 1.161767311513038116e-02 7.600109717581331192e-02 1.291557757786263305e-01 6.690223100008883816e-02 2.410142275209019302e-02 2.717391620555411128e-02 2.988843217717062489e-02 1.752272534327667733e-02 8.342142220697032137e-03 3.037266450658621109e-01 5.379249726958942879e-02 5.478799718149223591e-02 6.480847697435816734e-02 1.160352538671680367e-01 1.104495588263338518e-01 7.873990669455351032e-02 6.046915548904255311e-02 5.470313822361115574e-02 5.964168319291048015e-02 6.446860012545872765e-02
4.638016030144377633e-02 1.091513171467869553e-01 2.382144289779298263e-01 2.014307912709286871e-02 4.339727050454933455e-01 1.517402770010599367e-01 8.551919367803755001e-02 7.529366991928065911e-02 9.656588530701119832e-02 5.103425923701695836e-03 1.855708494596294555e-01 2.632106407671491038e-02 9.528629136164278035e-02 4.091617708395049735e-02 1.289377521091449041e-02 1.495237352731357099e-02 5.519137782777580083e-03 8.087782065064953382e-03 1.468890480368347830e-02 7.061201987043692029e-03 5.137210111687337544e-02 5.631615942440670181e-02 7.065242792369075264e-02 1.173928745940432117e-01 1.489144340721843818e-01 1.317749070655783450e-01 9.735500178027257923e-02 9.167842437349009443e-02 8.091908038147924143e-02 6.727122324467339765e-02
4.008047224121509544e-02 1.100990982023201253e-01 1.692620561755430186e-01 1.180430608002716736e-01 6.947334884201374072e-02 3.057242361173291845e-01 1.906858850764190511e-02 8.136217212636050536e-03 1.330198274921334523e-01 4.371400355110255376e-02 1.563817480496466072e-01 5.453643609455071685e-03 4.298755971079689514e-02 5.846557193239691058e-02 6.266641646827741940e-02 8.500414151763077686e-02 7.679498957753205790e-02 5.001586471300995679e-02 1.370475867982797746e-01 6.618940843965037679e-02 1.118612047537372207e-02 3.339039061843889211e-01 2.481866778838186516e-01 9.137014085009364725e-03 1.447746996647506119e-02 1.099711324601271127e-02 2.589508633335035198e-02 1.281317504378122647e-02 1.096664588314193584e-01 1.273154593807490631e-01
3.756813769569970762e-02 3.629397417406065446e-02 8.652331941672401772e-02 2.597729249404164345e-02 2.224178075601544735e-01 5.613703023240720208e-02 8.829165054278663091e-03 1.029735750293322635e-02 8.251974886636250991e-03 1.663834707071490115e-01 3.437579247341474020e-01 2.609141953282411580e-02 3.768159757172248603e-02 4.823906369509912279e-02 4.394839821555235337e-02 5.353735490337251102e-02 9.220216942807767102e-02 1.608554247543645122e-01 1.653394275827620719e-01 1.309440084063732135e-01 9.529460744590897633e-03 1.274566869007576729e-02 1.085669879204397524e-02 2.268232971512294111e-02 2.364111284293851298e-02 1.214918818006630735e-01 1.213766290533598857e-01 3.442130491103569806e-02 1.130511217967161280e-01 8.685123445888576210e-02
3.467120273247233792e-02 3.657203793918609169e-02 7.117634335865258288e-02 7.507658685397819442e-02 4.868372909118770520e-02 5.897765235410453583e-02 3.605243576786293369e-01 4.534388764254086539e-03 1.016183336237928142e-02 4.826110984449162589e-03 5.087304510645742663e-03 3.639275064120255088e-03 2.079404833091956853e-02 4.263527280172506317e-02 4.025726332369444771e-02 6.238446901410970441e-02 1.096346708121539032e-01 1.353518522115695344e-01 7.949153963097031761e-02 1.754941870850437041e-02 1.057372003613957223e-02 7.274550768869696149e-02 1.060192576849315199e-01 1.796129180149556581e-01 1.709449825478598917e-01 2.249901641087251325e-01 1.810646454536004035e-01 6.375683416843423712e-02 1.648616633638851081e-01 9.687256373224970019e-02
4.459770221307333277e-02 5.031167102537962427e-02 4.708544294269643299e-02 4.248453523827588896e-02 6.187239193160997547e-02 1.091995503928727684e-01 2.908979203764028992e-02 8.669485213530542245e-02 3.775342176418350348e-02 6.422280736101664694e-03 4.725166499253794818e-03 7.281973959481776761e-03 1.443646393547489554e-02 2.164453658746711556e-02 2.904882426195128792e-02 5.287430156623608435e-02 1.165166008647508245e-01 1.200590486242703037e-01 5.812283561558730799e-02 2.028466586238740835e-02 8.786286037028298579e-02 1.598183871575790116e-01 2.054473015866859487e-01 2.139866022062009154e-01 1.915595211706846712e-01 1.677389032403450164e-01 2.498974350676240463e-01 4.937184553715000257e-02 2.165841040320830579e-01 1.169214220199665810e-01
1.113077149748262357e-01 8.642663204885744910e-02 4.168508929675964619e-02 5.816354200179208594e-02 4.325914191443364781e-03 1.341990305118178316e-02 6.510744387675054812e-02 5.110244462574980995e-02 4.994963143159705798e-02 2.478873018553492610e-02 1.106183820631694362e-02 4.329972446130835040e-03 4.199480936237559928e-03 9.046703292876299290e-03 1.399326232675226350e-02 6.542162157177562609e-02 7.074040063088493646e-02 9.114491781324302044e-02 1.625787588244224577e-02 2.914220361201571435e-02 9.748804115249951052e-02 2.117535263307001037e-01 2.620394550109998999e-01 2.765280447300949018e-01 2.327442950419016110e-01 2.278102249195965989e-01 2.136867496987087389e-01 1.775218944361484363e-01 1.134360818779667733e-02 8.086349909093038316e-03
4.434381876244859744e-02 1.214105276070590461e-01 2.111164929126886636e-01 8.182896672954359171e-03 9.969225439793090796e-03 1.237143456994137421e-02 3.904886240570631939e-02 4.870435478829786974e-02 3.325555096308879105e-02 2.572451694042047349e-02 8.570296298166158247e-03 2.269559825817743237e-01 3.415602872487820685e-01 5.549475036782909078e-03 5.100335154997135897e-03 3.063222236460418427e-02 1.196535055163095926e-02 4.249306852471448903e-03 2.578205865193153312e-01 1.061000680701746322e-02 3.811995212795273730e-02 2.047639959864086812e-01 2.612567982624238727e-01 2.782517637209156458e-01 2.068112342505566414e-01 9.723662861575047001e-02 1.590877520893257679e-01 1.084355508123469036e-01 2.423364710164543218e-02 1.090574895319297230e-02
5.268234070312270874e-03 8.591456158119487041e-03 5.167532825894258219e-03 4.674127499517886399e-03 6.777831531396511650e-03 3.859474934250774290e-03 1.981796490244661785e-02 2.552568644167855713e-02 2.342831563973575559e-02 8.065736791447352533e-03 4.672305876514109418e-03 1.573700416851711303e-01 2.682932910361517931e-01 5.643566100996989451e-03 8.815947266292015541e-03 5.398284269160042066e-03 9.206514363917561727e-03 2.724579419912287644e-03 5.141543985618723077e-03 2.439296673837751395e-02 1.244029008419396953e-01 2.384976219263151287e-01 2.591725440386337120e-01 2.506485872568394724e-01 1.958177705731966589e-01 1.455456162944668286e-01 1.423872517332439303e-01 1.117729195364873390e-01 3.879044089612839613e-02 5.209357909576193268e-01
8.169676375363589885e-03 9.944480189374533749e-03 7.321322334934449866e-03 6.934042320315417056e-03 7.793896581227518182e-03 2.780467610612945197e-03 1.085223332236096710e-02 1.192579290787518752e-02 3.580933019683210042e-03 3.006085104768657212e-03 2.703670206898187711e-01 2.383877592814310498e-01 1.319159655226747607e-01 6.113561781836485826e-02 1.315154021912403326e-01 3.898644879252061157e-01 5.088919076217570357e-03 1.049949091030351334e-02 1.024747703584559348e-02 4.649308143054830395e-02 1.292861528164287732e-01 1.903133356952982080e-01 7.861085902136071002e-02 1.203795722577104127e-01 1.584480801303901065e-01 9.118946624632388864e-02 8.780151074058978322e-02 8.851432519389608455e-02 2.999329929256680516e-01 3.261013276953730333e-01
6.563900067019369337e-03 1.415306280480208359e-02 4.300802343482418300e-01 3.693926930820928267e-01 3.402101731279340013e-01 3.489801349515541783e-03 2.484718581216150204e-03 1.747931346203118463e-01 2.489004998996095230e-01 4.294554560784076547e-02 6.313349946527940793e-02 1.001039153005586491e-01 9.273049660644760994e-02 2.902317422092470789e-01 4.092892750942505979e-03 2.831841179649908710e-02 4.975544392227349011e-02 6.520357346526829689e-02 4.502204428615411841e-02 3.437137867490912269e-02 2.485864944946627325e-02 9.062589248707200035e-03 3.579466836715833669e-03 7.918734600754703118e-03 2.923885656523943916e-02 1.644201758264347488e-02 2.372845091739365225e-02 4.350119545483206451e-01 5.638821851876114205e-02 5.259319991932346477e-02
1.374708531735532868e-02 2.354748917451995188e-02 4.872270353521801489e-01 2.874568477867542882e-01 4.763911164853585345e-01 3.609577464207469055e-01 3.055051028016592552e-03 6.288872783795904087e-02 5.953706062633132984e-02 2.577363035803691832e-02 6.372375440927509349e-02 1.159235812719257991e-01 1.222177268834407082e-01 6.398752426947397313e-03 6.068612699533943930e-03 1.345750184184253510e-02 4.970613367623350626e-02 9.349859489935541390e-02 1.068263206704768709e-01 9.405555077507835038e-02 2.051469978112828094e-02 8.078490490034064345e-03 9.970248814386389186e-03 2.303766121015595261e-02 3.385257214836161210e-02 1.646197331278325196e-02 5.032888809565774224e-01 2.060550494602768068e-01 7.725759524190030370e-02 7.402369010663416293e-02
1.697195767334335262e-02 4.127514958888311297e-03 2.712834109308273067e-01 1.174460988384679883e-01 1.518715915573970177e-01 3.360719304024767373e-01 4.476167466681489904e-01 5.176755104581686612e-02 2.938146514069911799e-02 3.348085993430312962e-02 6.070737678947431271e-02 1.023419488419072126e-01 9.188215264482732514e-02 4.371150639024020124e-01 9.282567005861870266e-03 1.913817848143946343e-02 3.735724086720968590e-02 8.659073340506651117e-02 1.097226810343721326e-01 9.458106188014908655e-02 4.883218820167928992e-02 6.658465308703325619e-03 3.783960049396219438e-01 1.091873247853563170e-02 3.600484899453813836e-02 2.676914544897216267e-02 3.835564058398559240e-02 3.534626470407892240e-01 6.202456091711272546e-02 5.594081820537146615e-02
9.259499031930719382e-03 3.909465142284677952e-03 2.698851254231180753e-03 6.103674714399933698e-01 8.177045904464561379e-03 6.608540815430444075e-03 4.799220349056555479e-01 2.041543831211161952e-01 2.977665812841769899e-01 3.801359386676589902e-01 3.559609303482813569e-02 4.255641898932715356e-02 5.567278733422934694e-02 1.072521607227985563e-01 6.555958392156044368e-03 1.710793323526382456e-02 1.008394482590685946e-02 4.631102210337053465e-02 4.356027732509578504e-02 3.371127273721608725e-02 3.781755362405347931e-02 1.433552569094967075e-02 1.113962224468426077e-01 1.804410935612754674e-01 2.713202155774688609e-02 2.063513726788608615e-02 6.845410157809557472e-02 8.442452031924353728e-02 7.213434350638152359e-02 6.290095200792251984e-02
3.305099375979395331e-03 1.297828499452230227e-03 3.052888092645981294e-03 6.884094874555510800e-03 4.986853083886778025e-03 3.994218343354218881e-01 1.943805153042726663e-01 1.422180454042192843e-01 4.447857596409366399e-01 1.082422736693571322e-02 1.169597908416656340e-01 4.330105907938407855e-02 6.394605206453569946e-02 1.167696090034005263e-01 4.836266060142364598e-01 1.566762840595730885e-02 5.074552594380398185e-01 2.363669436060760742e-01 3.410973305206542183e-01 8.030316826734711089e-03 1.736479800441062885e-02 2.363302140389949013e-01 1.217375450004028192e-01 5.638868012232712834e-01 1.263752966026825686e-01 3.963105565234671945e-01 7.001892305793873394e-02 1.236925099973514436e-01 5.887760610055684518e-01 1.000803566900932834e-01
3.348746228856308137e-03 2.658882691928598184e-03 1.947471918307952564e-03 5.703916456779553057e-01 5.958768198607440336e-01 2.357565133033808769e-01 1.598830830128895875e-01 1.670111705003664293e-01 1.861620098308513493e-01 7.381680078540273637e-01 2.166739175867855860e-01 2.167850915588794003e-01 1.742509261454019409e-01 1.765870842580511135e-01 4.437204177937631444e-01 3.007530236500384202e-01 2.123956452058935740e-01 1.329721011497129179e-01 1.154840793214083478e-01 8.653669028894678261e-02 6.949092999028824713e-02 1.018294093052369842e-01 1.558080986796585299e-01 3.636169267413534301e-01 6.202963986956594455e-01 2.790783494873067538e-01 4.289644012539062801e-01 2.989888106621035324e-01 3.088458325112290459e-01 2.030869865972373123e-01
4.547198699477473897e-03 2.344305857167011502e-03 2.000749233308081205e-03 3.887907780056434285e-03 4.194546349032559317e-03 5.805338181888145543e-01 5.563818893261269528e-03 5.081536708150039688e-03 2.567803543429242885e-01 1.862425022192107371e-01 6.986067588817472529e-02 1.617138583470680013e-01 4.062562538500135156e-01 3.718387250149621237e-01 2.846551819338692668e-02 2.123107445129460494e-02 2.408336373677670283e-01 2.874688750524410086e-01 1.308755554396181242e-01 5.808585711506828592e-02 5.655418993749379564e-02 8.842305266402772368e-02 1.345092071890581775e-01 4.115153006611688702e-01 4.148059456199356121e-01 9.815814596335703524e-02 1.092411204144899534e-01 1.412467808636899413e-01 4.607828767541814474e-01 9.391242140245971426e-02
6.119339139501035404e-03 5.236352556299982315e-03 1.567354491438183953e-03 5.274123576795567390e-03 7.056354043308298712e-03 1.320443386339754943e-02 1.210601894909369737e-02 6.450479080987124858e-01 2.553051954266944978e-01 1.483439489491474861e-01 4.504582321441621962e-02 5.751328756406670628e-02 6.160492681909220114e-02 2.109769942850120150e-01 2.413881214692923938e-01 1.019431236938931756e-01 8.466126336050047718e-02 9.199094239717583998e-02 1.247930994787874309e-01 7.251859945432755084e-02 5.164492319168405288e-02 7.702692608050200340e-02 8.782889893819827154e-02 1.468610503416512558e-01 4.572081731030174234e-01 7.219062578050738921e-02 1.051119693391338594e-01 1.727678709030456283e-01 2.089412578152712585e-01 4.134287942439065500e-01
3.352456959670521187e-03 8.236093389871305265e-03 2.426723903978549556e-03 2.555047402608251386e-03 1.214462009597187635e-02 1.269328731952520765e-02 1.201323866377917299e-02 4.501833089688645484e-01 3.480407964672619370e-01 3.255487683625872819e-01 1.338910986906941269e-01 6.755748401104798295e-02 4.044393720463874964e-02 6.338325347747406080e-02 2.886389001094790130e-01 7.549272855524327697e-02 2.029356214687141335e-01 1.899217258445528439e-02 3.786856246081581751e-02 2.770414517364582774e-01 7.166819899648244063e-02 1.003767040413760664e-01 8.746827986670872856e-02 9.632944622146355496e-02 1.277562387428757273e-01 9.820185844326267954e-02 1.160450871985112820e-01 1.434218119975060601e-01 1.940909499981963160e-01 4.754053035915911107e-01
