3.115402070071566776e-01 4.847946273962950442e-02 3.621870824450227899e-01 3.921588531516177756e-02 3.293811634398630117e-01 5.097539912387269445e-02 4.281416271823966502e-02 1.159479238100891846e-01 2.106829696013415021e-01 9.479369599893197607e-02 5.783779552186429918e-02 2.008201862211093647e-01 1.277409863856545369e-01 3.578680480076219805e-02 3.962018969082126835e-02 1.366413097477931216e-01 2.684841955959123283e-02 3.358166284243653543e-02 3.474638431986441789e-02 4.581238781464702092e-01 4.232763886651489393e-01 6.397054769721907674e-02 4.888099076500351803e-02 1.949039970729574411e-01 3.785354393502591841e-01 2.981432724571237980e-01 1.379596931038004626e-01 1.218678911266532668e-02 1.167617875060627912e-02 1.473824203837310887e-02
2.053952944954874626e-01 5.219520573056944668e-02 6.367163402394337979e-02 5.730503978245351376e-02 3.322721908681708358e-02 1.596495018682960731e-01 7.150289745181859224e-02 8.956683516886414231e-02 5.438964386642670262e-02 4.316887996132364597e-02 3.853071942718831744e-02 1.021480364997380819e-01 1.487732624974356099e-01 3.563061025104096724e-01 4.102010920802180716e-02 3.749969000419197673e-01 2.626533485096418929e-02 6.307531418078893282e-02 5.357248475751369421e-02 2.083458313564521061e-02 2.443664146633985346e-01 6.162483405144601745e-02 1.277176466596616766e-01 1.139189778036141382e-01 1.011781257453749916e-01 1.366671557966888106e-01 4.855031070271340066e-02 1.237774207528078742e-02 1.766178504928039850e-02 1.770272926673500599e-02
1.669852096047745316e-01 1.704589534932930417e-01 3.329051860601758284e-01 2.714153965434499272e-01 6.250423596190990416e-01 9.638967913654312991e-02 1.825057742292477969e-01 1.917756278544943405e-01 2.474939538610012590e-01 5.948811738107366576e-02 1.561859306193095209e-01 1.113453676890769767e-01 4.935989745246897875e-02 8.653077619163471179e-02 2.304216813520974516e-01 7.635497684827281806e-02 4.240084550812182884e-02 6.597218291088445541e-02 1.926916840401340369e-01 3.988802726799034470e-02 1.514398019885640212e-01 5.098082115522976215e-02 7.783335690724045575e-02 2.706471335133286277e-02 1.612471594647051434e-02 1.072823433339666413e-02 9.724955154160705439e-03 7.652169780914185211e-03 1.307235766179402556e-02 1.467684198292280862e-02
7.102257574363579629e-02 2.060664050254015223e-01 4.522043469590656950e-01 3.669177107673209925e-01 1.786734003380872904e-01 3.699345244728009519e-01 3.682255710265635029e-01 2.291635441464033585e-01 1.246428093208306470e-01 7.549124585422373190e-02 4.489783869322461901e-02 8.849941331140447065e-02 5.920188645996254939e-02 5.989018760521597901e-02 1.787375563152054925e-01 1.551769176966387720e-01 3.336268313183680112e-01 2.554648868989646895e-02 1.594644247220103339e-02 1.551166600445180212e-02 2.658837283690579367e-01 1.059414985744195625e-01 3.649940784910793434e-02 7.204453349628606174e-02 1.321216546260111507e-02 9.493345469534786307e-03 8.230450937935210667e-03 7.819547191331450292e-03 1.589506607031176619e-02 1.728720631424693691e-02
4.100576031995381565e-02 1.286346499919972242e-01 3.592711119504085615e-01 1.395437729060374499e-01 1.014191679354121134e-01 2.155486492649316688e-01 3.764926252258190553e-01 2.124430368282052561e-01 7.842457671241706563e-02 1.781263363839869773e-01 2.008503396057594315e-01 1.853178467897660942e-01 4.331524696582611522e-02 4.397925043811884427e-01 2.330732872893035434e-01 9.400922688162176299e-02 5.955597619603199971e-02 2.534715321629407020e-02 3.628309757829065174e-02 2.086153788954728250e-02 1.584112053285653687e-02 1.391457145718285049e-01 3.592385317882861306e-01 1.186272681067248314e-01 2.388750747032006294e-02 1.268099297813756257e-02 8.840635777350778698e-03 1.023685351980259568e-02 1.602987673652785799e-02 5.900392388529339394e-02
5.346026273428065162e-02 5.705845716754842645e-02 2.244836882649497989e-01 1.644541401261955249e-01 7.389543735974990479e-02 1.211329229349415171e-01 1.549373806484920513e-01 1.655713568506682887e-01 1.347524804176415125e-01 2.659789505345169780e-01 2.143371524467767297e-01 1.334465884698599614e-01 1.988373697107846394e-01 7.499132865248750446e-02 6.334974264738695016e-02 1.074842597383436071e-01 3.921592289782998425e-02 1.426004244187618897e-01 2.022483865999645525e-02 5.983961433557115350e-02 8.050548846695509964e-02 7.154350997565808723e-02 4.434216410379727691e-01 6.933935294787708925e-02 3.567287199810185300e-02 3.313993251335208001e-02 2.066423786072710267e-02 1.426924035017174131e-02 1.885561944108744489e-02 3.393332999575013331e-02
1.163916901680046717e-01 1.768150775112644346e-01 1.736623417731600338e-01 6.235032760361868681e-02 2.499147335038834697e-02 4.829950481361865861e-02 8.459621829297789275e-02 4.789438920234668357e-02 5.871585100624733544e-02 6.390732536035528821e-02 6.254320772329977074e-02 2.416594965703741660e-01 1.121414571824921880e-01 5.232042060626157509e-02 3.068711247401002123e-02 5.343584231061519751e-02 3.024373469775082923e-01 1.353403908157473079e-01 3.291463652849487692e-02 4.550064784471347101e-02 2.568867842999840098e-02 1.393785749160429688e-01 6.555054927351880445e-02 6.273984003824382982e-02 2.416437812642183158e-02 2.463977926140722280e-02 2.161326138156811211e-02 1.869470135741190323e-02 2.144332039808523327e-02 5.098550997008521879e-02
2.379444830426290514e-01 4.417857569362158010e-01 2.444467096533709805e-01 4.079385628458683660e-02 4.947980969560451803e-02 5.611322395456137119e-02 5.035246591090319218e-02 4.258958461352387037e-02 4.159580854243421361e-02 3.299468948753019326e-01 1.395159694500500425e-01 4.374333056666459552e-01 9.471915922173529401e-02 3.385570876488975395e-02 3.846293178305519589e-02 7.151223441116283386e-02 3.866215551798972416e-02 5.189091053269659359e-02 3.974807625755147344e-02 3.172137921059431376e-02 1.937442674639959228e-01 1.140440971509042167e-01 4.612148297462391466e-02 3.860887751933392287e-02 1.834994811452477295e-02 1.909217551113600447e-02 2.955055551312850415e-02 3.340050578326474173e-02 3.315588484043054812e-02 9.625865519478767063e-02
8.491919211284955360e-02 3.582855856828160990e-01 2.078499599654051733e-01 9.795885586129475520e-02 5.689648519459945819e-02 3.099842676155222243e-01 9.612717194976269641e-02 4.206286685891680310e-02 4.229072441339477156e-02 4.645908885894419610e-02 4.309914407306263406e-01 5.634478443643768653e-02 9.424322821800801275e-02 5.029602097503049762e-02 1.224614148097675909e-01 1.031492216083793184e-01 2.602474407769584872e-02 7.050269472784628788e-02 7.593008850477722671e-02 2.566069667866148762e-01 5.108086532073947278e-02 5.323844153210263719e-02 5.793482001698185141e-02 3.786994669053295182e-02 2.215686697692866025e-02 3.321687441065710594e-02 1.234137496817978435e-01 2.188109832588314707e-01 3.713723630820473659e-02 2.954867596280836284e-01
8.448523951407221899e-02 5.898822850238030768e-02 9.264597328565297996e-02 5.998162519047700592e-02 5.879490319039237800e-02 1.462116622795605336e-01 8.130280915701128264e-02 3.301261602419995334e-01 1.567157948791397526e-01 5.667914517742637243e-02 6.064769618092370751e-02 5.319755141508529517e-02 8.422380146694306846e-02 9.555967190924308241e-02 4.659303342928873548e-02 5.060402712032680689e-02 2.577147897812391841e-01 2.606646492182833619e-01 1.193752712412241290e-01 6.448374853923694028e-02 6.507319488733978585e-02 4.114128331347613465e-02 4.722181696930335959e-02 5.189106472889237764e-02 2.896711186497771817e-02 3.654340196403771390e-02 3.324781666677179004e-01 5.029410293817222488e-01 3.857162825162366304e-02 1.555315889902435800e-01
7.487871475356010220e-02 3.539311878111365828e-01 6.833448084050269822e-02 4.580254775928248312e-02 7.693214531919630172e-02 9.082834638671452576e-02 8.962891052684053561e-02 8.224717874303506815e-02 5.709989463603341864e-02 4.498912269475839332e-01 3.637252868856243326e-01 5.468567304970968213e-01 1.123493867283731795e+00 5.484159272539254060e-01 1.000574541370751469e-01 1.956768942879938966e-01 3.658240533680487960e-01 1.013315203380850404e-01 2.887527627591116725e-02 1.056712546120900931e-01 4.454874649715762081e-02 3.982890771623061321e-02 5.147976292800336695e-02 7.209350309195999840e-02 7.709657505308488423e-02 4.165300121380341447e-02 6.473565655569696320e-02 4.797599244140195868e-02 4.249164675502721533e-02 3.035280928028280187e-02
1.578623795044464262e-01 8.628545311804085294e-02 8.287422949799000405e-02 7.749108122726239278e-02 6.525876503926018868e-02 1.468717046623771449e-01 6.889664312464577334e-02 4.787241172609585371e-02 5.751586886230580786e-02 5.513489263383121453e-02 1.107526471052289879e-01 6.627109505108037535e-01 1.166386287342758177e+00 5.962764915400409205e-01 2.118056774762058225e-01 2.365817088756795306e-01 2.611743701760007585e-01 1.537534351826401746e-01 4.581062988522726503e-02 2.397529326611252953e-01 4.243032564606584456e-02 4.327533510880969547e-02 5.122051190565546364e-02 9.173089933577116550e-02 8.726440327515995465e-02 6.218873983172329423e-02 4.772180482519758349e-02 4.313434767172850959e-02 4.696223694702111179e-02 5.087181606887686280e-02
3.747163736727404659e-02 8.995876083914330912e-02 2.008905469950275358e-01 1.000245840948057741e-01 3.607063832132005876e-01 1.236875190581438883e-01 6.878634085796205000e-02 6.001943367816489627e-02 7.703475395097370004e-02 2.634994089735533118e-02 1.472888905282526140e-01 2.151453914136324808e-01 8.676626664884214968e-01 3.663741114929308651e-01 1.133970603492298612e-01 1.294774752221813374e-01 4.766300541587013828e-02 6.979272537329143933e-02 9.004922634491344113e-02 3.665306530026349319e-02 4.052666245292586844e-02 4.452278100594206367e-02 5.646151214833416976e-02 9.402304946741676939e-02 1.193852460663946125e-01 1.045395181719582928e-01 7.719402112876055932e-02 7.242987096858991003e-02 6.359046213022642724e-02 5.287956339330399103e-02
3.247992003117763926e-02 9.166343205709606701e-02 1.602522067617123402e-01 1.147170646200204730e-01 6.785769366318686324e-02 2.633257139123171831e-01 7.888334182710440845e-02 4.170587100411739245e-02 1.060674438062582103e-01 3.475185401069263991e-02 1.240106491750544437e-01 3.758387904048945266e-02 3.962753457588243933e-01 5.262903857164201726e-01 5.513060810209637896e-01 7.322861513255550792e-01 6.564725344424298115e-01 4.257201792684814912e-01 1.161873427774476664e+00 5.429492110520149906e-01 5.580380808028512218e-02 2.644403706187595238e-01 1.994794961926369126e-01 4.762969940080675757e-01 8.369004072067824651e-02 6.352167299949777746e-02 1.644277661953099656e-01 6.171349203125056637e-02 8.625908088814451813e-02 9.994082559628689189e-02
3.046246142410587165e-02 3.039314519195554162e-02 8.216670875006390484e-02 6.126563739091765992e-01 2.232408705097622403e-01 4.956965777941722828e-02 4.389992412307942848e-02 7.797946738862604477e-02 5.483191270187556116e-02 1.324133825468037651e-01 2.726899668641879493e-01 1.849941932564543867e-01 3.548660947011227917e-01 4.435056674815768263e-01 3.945878021792684209e-01 4.700042760306976097e-01 7.990195970516835722e-01 1.378624944634164740e+00 1.400625839670059714e+00 1.097481429467416003e+00 5.455397816483172069e-02 6.306888486967456020e-02 6.231474404111554677e-02 1.727627940923459615e-01 2.276771147112766625e-01 1.027922304548983146e+00 1.029190352484710580e+00 2.248876696860636348e-01 8.868268809003063136e-02 6.797311699074114200e-02
2.797480700712078744e-02 3.029019945143611448e-02 6.749211948508310188e-02 7.466692721397721888e-02 5.004925476615498803e-02 5.231095410456259448e-02 2.894954371881752753e-01 3.964377239293592758e-02 8.355863108726835353e-02 3.229835900459486486e-02 3.356163253676423125e-02 2.789745144966607193e-02 2.013430538367725064e-01 4.023215602104097122e-01 3.703651875790477943e-01 5.608883193287435009e-01 9.675075363208385237e-01 1.172264683508108085e+00 6.750103994567434595e-01 1.467769177201093678e-01 8.858888159953730301e-02 6.125284066421836648e-01 9.008163827105140076e-01 1.514834511612736190e+00 1.429387713280322103e+00 1.874828346516747013e+00 1.505081933593286347e+00 4.497076165441110662e-01 1.288994812635465281e-01 7.559996271604503548e-02
3.575452907305193273e-02 4.100298053507261953e-02 3.978903175397512093e-02 3.720083380627733916e-02 5.356455560675084382e-02 9.038137685894470641e-02 2.373122308811905501e-01 7.673682081512280817e-01 3.643812053572009768e-01 6.234708266002954996e-02 4.631701368990537304e-02 7.275275518389966167e-02 1.438283085446035170e-01 2.099577464524954862e-01 2.749099530274842218e-01 4.893039461102048904e-01 1.049113476584262461e+00 1.049451778559498782e+00 4.939757808487340585e-01 1.692874068293195033e-01 7.366607887641507535e-01 1.349580654410513336e+00 1.747853760153271319e+00 1.796673836600719776e+00 1.585268545408231589e+00 1.376652724890874202e+00 2.045816208276616699e+00 3.649511455457470910e-01 1.688997357853111170e-01 9.104937624025530307e-02
8.909692568343974273e-02 6.956908780484907795e-02 3.380489829904496923e-02 4.719311324011768449e-02 2.739269528926855865e-02 1.148889435992732633e-01 6.175534342044295411e-01 5.007128333552341992e-01 4.914941056714305923e-01 2.454067161760160598e-01 9.459975619060344287e-02 2.871129876915332058e-02 2.799010260439044329e-02 6.728291969141553253e-02 1.361698282029096818e-01 6.232614490416155117e-01 6.490985384862761887e-01 7.618285635695245528e-01 1.317525534628949391e-01 2.321626290131321158e-01 8.176348281809995289e-01 1.786427196668155748e+00 2.222294115520404567e+00 2.302340616542414509e+00 1.899507169248290772e+00 1.844813399316562963e+00 1.729318896305224174e+00 1.374616059694235837e+00 8.607675997523661637e-02 6.101847689699022026e-02
3.554859243948405023e-02 9.729534546358574454e-02 1.688686528257762887e-01 4.781946714730648390e-02 9.061528308162948575e-02 1.253515565601498460e-01 3.950315975482955322e-01 4.936000183957834908e-01 3.376371972914217201e-01 2.620918518067131275e-01 6.197521113836944318e-02 1.795397652922770537e-01 2.700112810843453559e-01 3.021355476219837050e-02 5.022098887926341321e-02 2.952129489651463823e-01 1.111903630643561181e-01 3.572850771529322011e-02 2.028222319060455081e-01 8.561393719132026625e-02 3.223644210957846146e-01 1.727177075125203354e+00 2.196150626413396090e+00 2.298571056044653282e+00 1.680306390271638417e+00 7.843445617365490952e-01 1.282791160306288480e+00 8.720316209068453839e-01 1.303676215754455692e-01 5.200233520367576467e-01
3.311247412641517979e-02 4.621766254099361065e-02 2.976202532653894617e-02 3.365654354491712241e-02 7.114957949733126397e-02 4.077809971285013130e-02 2.091300126979490914e-01 2.695169081996559024e-01 2.471550263403147485e-01 6.342045949059516019e-02 2.139036032200221718e-02 1.241188287203558865e-01 2.116924246998489467e-01 2.495379081837977020e-02 6.957273038300834656e-02 4.542860794164385596e-02 7.982454610040111420e-02 2.305445480146777956e-02 4.266647075471981243e-02 2.007414349499994366e-01 1.065717114490927209e+00 2.018015276892429988e+00 2.165389085831595839e+00 2.058820940904444008e+00 1.587631527213856364e+00 1.170735235659069673e+00 1.142586730434085762e+00 7.935622258170876853e-01 1.450596959371485972e-01 4.212273175612927800e-01
8.220760953519490322e-02 8.115810968531250724e-02 4.636808926802814257e-02 3.673037160634923248e-02 4.481363559987906753e-02 2.110734757799235389e-02 1.099828805003257304e-01 1.026167837451356923e-01 2.853246702781373628e-02 1.747250969932419989e-02 2.128126442638816340e-01 1.881235841555353450e-01 1.046073910625664877e-01 4.856992287537428843e-02 1.045180587797332333e-01 3.097313875026362906e-01 4.551998508231788754e-02 9.906580020573711731e-02 9.388473771556792025e-02 4.152695769122021208e-01 1.129079797747485792e+00 1.623434560755041778e+00 6.554242236684761913e-01 9.858220001830458878e-01 1.281990230982244183e+00 7.319015060415277052e-01 5.845446344198694799e-01 5.073130564513724794e-01 2.404040067380495693e-01 2.613387936096061015e-01
6.708990262193538501e-02 9.183424078398967627e-02 3.469135336346166332e-01 2.960329481765050508e-01 2.713466609286920850e-01 1.415403913224848667e-02 1.564706817936520680e-02 1.378898641011925275e-01 1.954628743326644325e-01 3.371629970688443112e-02 4.958098255201986992e-02 7.929203484299016114e-02 7.599408573788818400e-02 2.382100746668251445e-01 2.914980862624885066e-02 2.465727417300781488e-01 4.545503212164106466e-01 6.291564939820578628e-01 4.230322250071448797e-01 3.138296200857408347e-01 2.197577864721051433e-01 7.759547633824259716e-02 2.979103845661287484e-02 6.490489798332318983e-02 2.367671796253371652e-01 9.281004492613260937e-02 1.017633932226657961e-01 3.501291943298840414e-01 4.525728975852483238e-02 4.223827265541594406e-02
1.404540337307287334e-01 1.359890933022090409e-01 3.912460746512216869e-01 2.293227484846226405e-01 3.782424927226973876e-01 2.859039427990021087e-01 1.242954332104852060e-02 4.952337862850391542e-02 4.664135041736242049e-02 2.019624043416933662e-02 5.001267556232538714e-02 9.234135355813680168e-02 1.005058803716032401e-01 4.639252651005668637e-01 3.780470609911316948e-02 1.363968203679652436e-01 4.922272655451253587e-01 9.040067966159039958e-01 1.009128666756337944e+00 8.625726629907568555e-01 1.920321394586032293e-01 4.920766628880673954e-02 6.043720744877797979e-02 1.387913902605957261e-01 2.750580757319814884e-01 9.380013792901939484e-02 4.021817477889365611e-01 1.645960491984232998e-01 6.153709511688372491e-02 5.906502799906893086e-02
1.749037506763514160e-01 2.897780363561891850e-02 2.197700995356766662e-01 9.490191709934601982e-02 1.203517504692398765e-01 2.657126673403120143e-01 3.531240509780809167e-01 4.071273862465881604e-02 2.302916173801740699e-02 2.626697459120018105e-02 4.771191379438340791e-02 8.142359372020116504e-02 7.570114875752814720e-02 3.621335142211651315e-01 6.999404723414498486e-02 2.143644644890849160e-01 3.685606278432487226e-01 8.378724530501884260e-01 1.044411868903346141e+00 8.774610466341746795e-01 4.616572812256294900e-01 4.390971867938251449e-01 2.981340519697829317e-01 5.144107469297479890e-02 2.442391640114680296e-01 1.573938892123482036e-01 1.683762871499703828e-01 2.815630141697849087e-01 4.924112114815575730e-02 4.450538742396030478e-02
9.670847287296180372e-02 3.607634244088277903e-02 4.619848365415803459e-01 4.953281946869573238e-01 3.405701574090196082e-02 2.402979405762795118e-02 3.783565501967613431e-01 1.606474866178171923e-01 2.347443024600718020e-01 2.997252263210802847e-01 2.807838704947047612e-02 3.373156721320046819e-02 4.442938096754890653e-02 8.626563877445060646e-02 4.336509117209632613e-01 9.059571052929255019e-02 6.717151264152589063e-02 2.906394496613749490e-01 3.588313057119029703e-01 2.996348790160038300e-01 2.827177008096178334e-01 5.323933094576435709e-02 8.829847621607353481e-02 1.436514237257230930e-01 9.038529723979558950e-02 1.323568798233419053e-01 3.630602348767338339e-01 2.856429624242357579e-01 5.728953381892649271e-02 5.003504439601053067e-02
3.460299001203338831e-02 1.571615043172647566e-02 1.999560139097810926e-02 3.714374905327690740e-02 1.953456274069166956e-02 3.158370941491947526e-01 1.533086636019014015e-01 1.119921220285305802e-01 3.507804574987971602e-01 3.549848349996129193e-02 9.220170834879001798e-02 3.415009064012502343e-02 5.060521370418931408e-02 9.315773876606521509e-02 3.857488433397338046e-01 5.360600025735726137e-02 4.004580944448002944e-01 1.867591941477129425e-01 2.716334960926192199e-01 4.582159224959879706e-01 6.639317774054467880e-02 1.871114169970029550e-01 9.644879670196773724e-02 4.477747138567128582e-01 2.857357004829680913e-01 3.155486758096855970e-01 1.922823973938907471e-01 2.866481396662025061e-01 4.668442829465115906e-01 7.959690321182198713e-02
3.507152563010756258e-02 2.813726084625760987e-02 1.466953178430979374e-02 4.526511609600878949e-01 4.714019890882462649e-01 1.862569798788378528e-01 1.262110586264256762e-01 1.318215826300104532e-01 1.469628157841820215e-01 5.821568458782575561e-01 1.707219349010571097e-01 1.709225727469905198e-01 1.375313140215922159e-01 1.395140332679996598e-01 3.513646428346399730e-01 2.378454689601763317e-01 1.672823823509307917e-01 1.047358595412381105e-01 9.147325473659548289e-02 6.873789161916571411e-02 5.509222380032954836e-02 8.047434242467500776e-02 1.229094733716321608e-01 2.868596041262591045e-01 4.899958537621731391e-01 2.208904235720865195e-01 3.391035259534083690e-01 2.355625927060190083e-01 2.438245995891205886e-01 1.610859389145919696e-01
4.765581190313732118e-02 2.481776784564505151e-02 1.507066365109937037e-02 2.236608306469765883e-02 2.095233613562744179e-02 4.597353857751348416e-01 3.487925909227724414e-02 2.724100617670223781e-02 2.023463170757704988e-01 1.465719365448397149e-01 5.494418184654002030e-02 1.274969073930119767e-01 3.203402840828075693e-01 2.933244962890096952e-01 8.230381618669999066e-02 6.231767319751126827e-02 1.896258185909581728e-01 2.263894708708548698e-01 1.033603983748215271e-01 4.595497070616309104e-02 4.466414261362245536e-02 6.973436885794001561e-02 1.058140905182954339e-01 3.226915602325832744e-01 3.258577075047847105e-01 7.714381521259039420e-02 8.588008933034746439e-02 1.107874242126160730e-01 3.616709138327732775e-01 7.412657337254550949e-02
6.407535744395276289e-02 5.539938779740798125e-02 1.663391340222662024e-02 5.676252117406463404e-02 6.823278194026384524e-02 1.284935091207818347e-01 9.044436274706431356e-02 5.105525194728204319e-01 2.011551544340076103e-01 1.166608868406187882e-01 3.540714436059841375e-02 4.531448428035465131e-02 4.855951715218693315e-02 1.659976071699973132e-01 1.901301105183866302e-01 8.029157709761589046e-02 6.666828618059987555e-02 7.253212166766515034e-02 9.860152053016560392e-02 5.727385063429920459e-02 4.061291379897151443e-02 6.045162902843435188e-02 6.874326630997230902e-02 1.147784337746393102e-01 3.580793566549003160e-01 5.651252732675067503e-02 8.225855737281757840e-02 1.350474166250759667e-01 1.633750854121976681e-01 3.248846092112933626e-01
3.481266375560188031e-02 8.652173926936890247e-02 2.574637257118214673e-02 2.761937995066367224e-02 1.350715906185120108e-01 1.433114124416618174e-01 1.008875288332660158e-01 3.576847332211207653e-01 2.755804081524115268e-01 2.570794505540826003e-01 1.054644927190380721e-01 5.316381452249172024e-02 3.186745495262863215e-02 4.984417612265182318e-02 2.269239913247687590e-01 5.935398489774144914e-02 1.600526725610019185e-01 7.910010835573808019e-02 1.501641063983142343e-01 2.200352347838249456e-01 5.674761679217352889e-02 7.939106663161615840e-02 6.910221356849732821e-02 7.600918491416079614e-02 1.009470712390789227e-01 7.749884135614590330e-02 9.150226810947383049e-02 1.129414299522723819e-01 1.524829420411031866e-01 3.749297031823687343e-01
