2.188605250818989134e+01 3.314529890091604614e+01 2.862912790403456853e+01 3.590945020476281258e+01 2.713752970260034658e+01 6.002906111929702604e+01 6.045977529926990712e+01 1.667123492067336201e+02 3.083501007614181617e+02 1.398283621297798049e+02 6.583578932987344956e+01 1.521487668835708362e+01 9.197448044282532820e+00 3.637747019266983273e+01 4.513758063766046291e+01 1.062057430759841381e+01 4.071497455992202674e+01 7.848096044693673434e+01 7.889545492921001824e+01 3.047192227935241249e+01 2.474921000595211495e+01 3.641027531678135976e+00 2.865272872255268943e+00 1.165550317298987792e+01 2.317790594521294523e+01 1.874974486576439858e+01 8.979068339912059216e+00 8.047496358248024118e-01 7.807423354608308275e-01 1.004787002606895463e+00
1.643250242164825892e+01 3.762767720170242569e+01 6.770705446104204839e+01 5.489054868954212907e+01 3.804144584069196355e+01 1.716269354983158735e+02 8.357713239412288431e+01 1.074431944040253626e+02 7.221081069009525777e+01 6.276737193562426853e+01 4.634716650235085922e+01 9.406803217973838116e+00 1.303495292633398250e+01 3.116895202321489222e+01 4.576712207920900966e+01 3.114703410271660999e+01 4.209643072826534649e+01 1.528458045097140712e+02 1.294965155222803617e+02 4.325771682294382003e+01 1.564885725775205927e+01 3.604018231214879187e+00 7.752224987682104995e+00 7.100124417252370534e+00 6.513060502006045915e+00 9.144551140287685342e+00 3.422347550022713847e+00 8.684399770563122622e-01 1.221720755412598391e+00 1.214584807337376615e+00
1.940795514037537259e+02 2.056245343015578158e+02 4.369114805665337258e+02 3.525551465051607352e+02 7.524691963461145860e+02 7.729400266184330803e+01 1.479506466844134138e+01 1.646660477140318335e+01 2.785966550561319650e+02 8.752207312533153072e+01 2.461262495006903350e+02 1.733287817945864617e+02 6.695761256949873541e+01 1.013612503374932601e+02 2.011434379571535658e+01 8.857489910436572700e+01 6.508300945552453243e+01 1.491538893123060348e+02 5.634509941493104179e+02 1.052721803084600367e+02 1.031870207970440489e+01 3.107954534165759064e+00 4.921051275789466217e+00 1.804617472450710469e+00 1.142313192559919477e+00 8.125525372207005326e-01 7.831686682169263225e-01 5.844412792056187245e-01 9.444598095152183515e-01 1.020979423960485910e+00
9.334496174033627369e+01 2.778949217082054588e+02 6.118950367832092070e+02 4.897072084342206608e+02 2.027875615596302623e+02 3.134739592891823179e+01 2.496362528632646871e+01 1.719566424787030812e+01 1.089494096040996851e+01 1.034999116550402505e+02 6.820500384114100711e+01 1.407758091195503596e+02 6.665562646587633822e+01 4.671288624377652354e+01 1.442141942857459114e+01 1.158917437467071920e+01 2.622439213013243631e+01 5.372596718935304239e+01 4.220640550052017659e+01 3.974095275180920339e+01 1.886866697337087118e+01 6.793676115918311886e+00 2.233004245139423638e+00 4.566441257359536543e+00 9.102130702361979075e-01 7.227098149631174806e-01 6.724754716720580117e-01 5.948225888626115232e-01 1.118668607718525498e+00 1.162605571166441365e+00
5.608442223700701135e+01 1.828739340404665086e+02 5.099694475160343927e+02 1.973766163323591627e+02 1.134264227565169563e+02 1.628260337754897691e+01 2.462725977012521383e+01 1.371935892706262905e+01 6.528953921617700829e+00 2.279316645492514795e+02 2.846952876481586827e+02 2.463689266014393979e+02 3.755941017469164933e+01 3.277798324614185788e+01 1.625281770429285189e+01 6.431669836237631444e+00 7.360351274451718950e+01 4.524014098438405540e+01 7.831392249461094934e+01 4.845067599684010418e+01 3.578818521153255006e+01 1.064870538248555576e+01 2.488341023035964739e+01 7.253980940205583039e+00 1.555456858863613512e+00 9.152002333039936932e-01 6.887433134437286331e-01 7.460575192502933994e-01 1.081275080144817879e+00 3.806922297178894077e+00
5.821033942340837086e+01 6.545578104437217348e+01 2.935464084250390897e+02 2.343344320683781916e+02 9.245706620834559430e+01 9.668687200887898570e+00 1.149100231358171875e+01 1.212313008218388788e+01 1.141140043303492391e+01 3.383824148690546849e+02 2.593478483937758483e+02 1.353529198298035112e+02 1.569325096550002385e+01 4.979038715559321204e+00 4.029435329340684824e+00 7.087705738842066339e+00 3.887471956293310882e+01 1.060619051487197950e+01 3.611420661815098043e+01 1.319067664145913454e+02 1.738864952212625212e+02 1.116966992441817297e+02 3.007946358684086618e+01 4.156473876683926427e+00 2.222698401165641435e+00 2.292164047979156294e+00 1.545890674545995047e+00 9.980231823860588047e-01 1.218090965862452357e+00 2.102689258954579810e+00
8.155725470199334026e+00 1.392434363763357830e+01 1.484047777935649037e+01 7.544887101907222871e+01 3.615097359097618579e+01 5.870179508442399197e+01 8.627556937187523545e+01 4.796459804271491123e+01 5.623857329184553322e+01 6.317743144981288594e+01 4.698903690326132931e+01 1.878893213205977020e+01 7.731192657764832887e+00 3.165792472082477271e+00 1.782699533727301944e+00 3.429202655171225800e+00 2.094679082597216890e+01 1.021611961503998600e+01 5.384375521507343620e+01 7.689613281006155887e+01 3.855869349289771719e+01 1.004049922114371185e+01 4.288162936264663827e+00 3.610857756171756527e+00 1.453741641241188765e+00 1.637084056712737157e+00 1.555078868112321322e+00 1.262970612712718932e+00 1.357721373192886105e+00 3.099993317924047531e+00
1.664399613962820013e+01 3.193683624887173877e+01 1.895797594815778098e+01 4.146198541066146959e+01 6.456105151730311320e+01 7.234207073235984353e+01 6.331965809838369807e+01 5.923386671794936120e+01 4.735382467148808416e+01 2.564463791158313555e+01 1.000773381241816118e+01 3.007327402058272625e+01 6.412737331448925104e+00 2.207527927703674564e+00 2.354586903268835130e+00 4.566950657006323411e+00 3.950007307175272331e+01 6.604763239480128334e+01 6.056663184440283487e+01 4.527085842528697412e+01 1.339464660303449861e+01 6.836575616131285393e+00 2.510481971282378932e+00 2.090230653842966024e+00 1.053369509142606075e+00 1.191376662536905329e+00 1.973707367639006449e+00 2.355721263243935937e+00 2.245098240536449019e+00 6.336730659651117037e+00
4.231719714222239759e+01 2.854890595965780165e+01 1.705706469796569991e+01 1.011510906465864252e+02 6.737432996169513899e+01 2.873829098867774690e+01 9.264941686358528727e+01 4.187555823084852591e+01 3.551914380071761457e+01 3.395233138159553476e+01 2.949408557202163195e+01 3.818470509075027053e+01 8.310924860544758985e+01 5.509569579990679244e+01 8.362342598499473922e+00 7.904934228906109084e+00 3.602252936885501811e+01 1.149702454026502210e+02 1.194168499746444780e+02 2.109272481579647263e+01 3.580523308909513425e+00 2.984714005616463606e+00 3.052055092972962846e+00 1.982555115249707400e+00 1.210860368641272222e+00 1.982858774539104640e+00 7.939425629662081541e+00 1.533632225277951378e+01 4.250142452981637575e+01 2.016791018667473878e+01
6.884978643986062252e+01 4.532860783177073927e+01 7.364149252042501814e+01 7.075825699165619653e+01 6.442225097349904672e+01 1.293772797942869168e+01 6.052904188237052097e+01 2.632801920045062261e+01 1.135237042095916493e+01 4.157556892318060804e+00 6.003247291414300690e+01 5.816297233017895962e+01 1.217576075388111434e+02 1.297418681198158765e+02 6.108573394014551639e+01 6.690509068453474129e+01 3.737127415795844172e+02 4.082585170964134136e+02 1.742261692624435909e+02 8.292209718659941586e+01 4.369741029548879219e+00 2.233729418655435506e+00 2.464283652176785466e+00 2.710690493214286345e+00 1.542947044877404306e+00 2.095520108497590517e+00 2.080298480471844869e+01 3.431361543525322588e+01 4.113122523955389909e+01 1.041359408609184634e+01
5.797912160975366191e+01 3.049954861170957088e+01 6.891555192065392532e+01 6.007262307986042060e+01 7.909867440043731790e+01 7.434003502252195972e+00 6.347201764233664889e+00 5.702754180226475178e+00 3.706904011159158685e+00 3.262877080738707747e+01 5.106810205818460986e+02 8.492061707780355846e+02 1.717832332862103613e+03 8.155858796964871544e+02 1.451272788572730974e+02 2.758032289894379687e+02 5.256136823545505194e+02 1.516311187563631506e+02 3.814972259518162190e+01 8.062334977896234989e+00 2.898739563139337783e+00 2.142359690296109953e+00 2.707125743587724287e+00 3.814715403617110034e+00 4.138229391662764378e+00 2.327802368810767408e+00 3.844516735512875982e+00 2.976032658084062810e+00 2.588181474761597656e+00 1.803757852582641874e+00
1.097308987048549334e+01 6.518460411302347879e+00 5.771284811320995800e+01 5.751997234400929671e+01 4.589592294384399906e+01 1.078590001397082077e+01 4.294191100031097719e+00 2.878225097152666834e+00 3.739657100734353534e+00 6.854628416806163216e+01 1.651821550793432607e+02 1.065524502695395768e+03 1.850454859631596264e+03 9.133941260892406717e+02 3.149176529918148617e+02 3.393680807675279993e+02 3.749093489660238561e+02 2.243791622281801494e+02 5.613212522005406413e+01 1.625061437308681889e+01 2.493245855859763438e+00 2.307556550316574473e+00 2.717640229010470421e+00 4.913948300451282947e+00 4.748277965135031309e+00 3.452630511077978248e+00 2.706220272806250104e+00 2.410529010355664692e+00 2.550609166466045075e+00 2.695812480226432939e+00
2.149878242287819319e+00 5.613706733593487819e+00 1.369163873599471160e+01 3.907397055410979192e+01 2.589750295136000346e+01 8.443572320470227766e+00 4.503908166668406210e+00 3.963955355963360461e+00 5.289378439631230222e+00 3.687361168093823238e+01 1.210303034981722625e+01 3.627019606733332466e+02 1.457054827307438700e+03 5.835461847429514819e+02 1.724814546011634775e+02 1.881586952989527788e+02 6.785385826908668605e+01 9.810584890404686575e+01 1.106110285147956063e+02 4.150103550119574436e+01 2.810481670722948078e+00 2.574984808044866291e+00 3.186744782307270984e+00 5.497027138889709619e+00 7.233275741852070340e+00 6.886235593135767274e+00 5.180772817918699147e+00 4.685333674670030035e+00 3.595315806923246704e+00 2.805276876541058950e+00
1.753470279848243774e+00 5.086115701757883301e+00 9.274122245606871928e+00 6.767163969610210827e+00 4.040405345958924421e+00 1.645510649963988925e+01 6.076517760520986400e+01 5.701577661160862931e+01 8.095829677979208938e+00 2.409058701572615036e+00 9.460234742566916211e+00 6.291396451328382966e+01 7.029574292066190537e+02 8.740685441806724612e+02 8.665107872496020036e+02 1.092992537547969732e+03 9.367485873013827131e+02 5.811013223519978510e+02 1.524259228348628767e+03 6.938511779188063429e+02 5.726188475599124672e+01 1.657770070274595042e+01 1.265713384532864261e+01 3.178134691196890671e+01 7.419961737990897177e+01 7.019564310236756910e+01 1.951728634311949122e+02 6.506694819977724364e+01 5.283214344406744090e+00 5.305472631340163225e+00
1.611275152319233683e+00 1.640612917251444536e+00 4.539646836713419731e+00 3.413610110835189460e+01 1.254025477666889188e+01 3.023865594873247353e+00 4.175153022977792716e+01 1.299243932934370775e+02 9.424072782551321836e+01 9.618339979649537241e+00 2.046028496242064421e+01 3.298300321978204579e+02 6.752507205298591089e+02 7.839531725459244171e+02 6.535765319556825261e+02 7.340626277972151001e+02 1.167596358006318951e+03 1.884729434522104839e+03 1.809728251325650945e+03 1.374528919339995809e+03 5.833702990068459826e+01 6.100487786090123166e+01 5.505262054007665995e+01 1.708155711364153149e+02 2.414868385675010245e+02 1.229562599848963146e+03 1.243345411500089085e+03 2.582459436537769193e+02 5.830103541887980967e+00 3.613098031730371140e+00
1.447698073510983452e+00 1.606717152604626886e+00 3.717647956500425899e+00 4.164121569770347975e+00 2.809640351603682085e+00 3.255662097727594961e+00 2.385782096502367011e+01 7.018988199430305031e+01 1.519674249299327471e+02 5.571803859162378103e+01 5.942512160670678156e+01 5.436682453158581296e+01 4.149705227435889583e+02 7.705453722165202635e+02 6.646799568970450309e+02 9.448614128564322527e+02 1.484140839149063595e+03 1.648498238705502445e+03 8.825461916563162958e+02 1.827574480646228494e+02 1.087135417559471620e+02 7.480785831996297475e+02 1.091052210982224096e+03 1.791464463642665578e+03 1.642475416452822174e+03 2.129178417550417180e+03 1.729403826892250436e+03 5.113234659197015617e+02 8.854985473183971223e+00 4.055890303163586452e+00
1.821386396780688921e+00 2.155024628022259581e+00 2.139158731762627497e+00 2.080967687920288967e+00 3.271527201409058616e+00 6.970908017717398764e+00 4.124672086182313251e+02 1.407829276672898686e+03 7.061017684587642407e+02 1.255978715365513665e+02 9.866103277428655360e+01 1.660694977175724603e+02 3.273985300016962015e+02 4.406618364312681706e+02 5.354474499712021043e+02 8.883525423534806578e+02 1.690996951691073491e+03 1.528231023137007924e+03 6.586335999267618035e+02 2.108281484856736654e+02 8.947735819894746783e+02 1.599361524176405965e+03 2.028085969576987736e+03 2.020359626317878337e+03 1.742586943569540836e+03 1.508573495895775977e+03 2.277910234918039350e+03 4.061742902363811254e+02 1.308697234988104974e+01 5.456363064940516594e+00
4.502140090239890924e+00 3.636977997484672986e+00 1.925163536520091201e+00 3.127834074057348257e+00 4.285119578506070326e+01 2.197918182075019331e+02 1.221942107502636873e+03 1.005607089032981889e+03 1.016555229780259310e+03 5.285600647360170115e+02 2.056438742377010271e+02 6.099457862187517776e+01 5.984869056929530018e+01 1.396099181832144041e+02 2.892110791964078658e+02 1.231713087697452011e+03 1.114973590710465032e+03 1.139237165182296394e+03 1.759440889658708898e+02 2.852573530636477130e+02 9.864146146027098894e+02 2.077062973260256967e+03 2.508795488472987927e+03 2.508853977457610199e+03 2.037470515331327988e+03 1.987987512354740829e+03 1.905434071705862834e+03 1.513548874722237315e+03 6.702342874863573741e+01 4.337038349260292591e+01
2.037974983239972282e+00 5.852853463047248184e+00 1.124173237226297672e+01 8.278827623305200234e+01 1.989281718145455216e+02 2.885550418484716602e+02 9.122786346462332858e+02 1.152430037625033265e+03 8.129751089857422812e+02 6.466344335590964647e+02 1.409534260073795906e+02 1.458452487227083516e+01 2.165728163529790962e+01 5.538346232723344542e+01 1.104325226026359132e+02 5.990204487804787732e+02 1.995112775193633183e+02 5.609058205070175518e+01 1.664677714412695764e+01 1.115710368825658634e+02 4.064518584807856314e+02 2.067812098223635076e+03 2.515028171448411740e+03 2.509356829751707664e+03 1.773290645645029599e+03 8.125531650142952458e+02 1.324731538889492867e+03 9.098291564840770889e+02 8.184779552058432728e+01 3.171789929771183836e+01
5.284252210195948152e+01 7.263092885666490872e+01 5.213759777875577583e+01 7.055571571132429654e+01 1.832814402313202322e+02 1.095051107083018422e+02 5.744682958750904618e+02 7.580662430939992191e+02 7.178589968772589600e+02 1.689097082440010809e+02 4.256035205105527552e+01 9.101585865814030285e+00 1.524006209576838700e+01 4.074051689446648084e+01 1.477044437900291882e+02 9.110172282223288676e+01 1.465147158844095259e+02 3.820775891132594637e+01 6.425408784338786461e+01 2.807308398024077292e+02 1.412588979776643100e+03 2.516808930386911470e+03 2.561213865469117991e+03 2.283580893262116660e+03 1.660783007433778721e+03 1.172903811138426590e+03 1.118602591458740335e+03 7.536554821115937557e+02 6.748481202999829520e+01 2.369904231319734933e+01
1.578703004665674143e+02 1.580318235392452380e+02 8.972521748717791468e+01 7.241461046002427793e+01 1.070507478401832202e+02 6.089864357078491253e+01 3.588556105478897393e+02 3.337459760376029863e+02 9.477550294738162506e+01 4.930439017580827255e+01 1.639024176355111706e+01 1.270961298246227145e+01 7.188270878991795065e+00 3.677374945654186433e+00 8.851611014471069794e+00 2.795752256765792509e+01 8.908762413687307458e+01 1.817826541119792410e+02 1.574841773816354475e+02 6.410021559862079812e+02 1.605835327189088730e+03 2.155229880534048334e+03 8.200342027077092553e+02 1.127472309607381703e+03 1.344486806646916875e+03 7.157987513940872759e+02 5.162517652011496239e+02 4.225551912700983621e+02 1.537010698576454715e+01 1.378866384395202793e+01
1.341685268446226189e+02 1.688859868547301062e+02 2.782229402687083564e+01 2.182002536874502141e+01 2.062388827919080825e+01 3.297457788748674545e+01 4.918351356728907575e+01 1.292601582198908972e+01 1.736543082469554378e+01 2.601809762897574707e+00 3.297480029861795447e+00 4.856021953247910972e+00 5.056373480069956017e+00 1.669573560044482718e+01 4.397195035457647805e+01 5.389739726767846832e+02 9.297664737880309076e+02 1.213957032998517661e+03 7.495643785082088471e+02 5.113934961119362583e+02 3.265240538678164057e+02 1.063487006275750417e+02 3.785422495046738334e+01 7.417535978582029088e+01 2.452912028033202034e+02 7.683091998772687248e+01 6.708404795890555761e+01 2.246429526877810190e+01 2.545703886030613816e+00 2.086255327901129775e+00
2.955936932756051192e+02 2.449936244482517225e+02 2.913010295109485170e+01 1.407199187711364274e+01 2.344401772309309706e+01 1.952666021205416058e+01 3.154949467259587692e+01 3.544322177751817904e+00 3.101449324487411285e+00 1.291543385087459583e+00 2.962714160094983562e+00 5.416124006485294018e+00 6.774161843315873455e+00 3.385583398510124198e+01 5.197046756287257097e+01 3.069348052438117520e+02 1.015608977076875590e+03 1.721898869746166383e+03 1.777919873726094465e+03 1.399463978225308892e+03 2.657164905457720465e+02 5.289480993166124279e+01 5.987557247682880046e+01 1.368558976031403915e+02 2.845327230802637928e+02 7.885663110604862425e+01 2.875773116222520187e+01 1.062460287781545354e+01 3.285255237037311815e+00 2.937637763527810364e+00
3.929619320950123438e+02 5.317455288875337516e+01 1.581156847117039810e+01 5.698005549831281158e+00 7.233421843810675433e+00 1.685633262189335824e+01 2.271427187068117348e+01 2.664888011049000305e+00 1.516850738112651253e+00 1.688111909910496644e+00 2.896752377078540164e+00 4.795557795215335872e+00 5.092725274670500291e+00 2.615819933936074904e+01 9.505974042914485267e+01 4.317432346642957555e+02 7.650541470325367754e+02 1.610116976787058320e+03 1.856698142457479435e+03 1.426329710544153386e+03 6.319256304203311174e+02 3.236044601420626066e+01 2.094390145607281539e+01 4.330714257699997916e+01 2.394952379603140571e+02 1.381177678920660696e+02 1.204927360785956978e+02 2.213187206310544752e+01 3.100587926678642692e+00 2.290520832050993327e+00
2.364060248724017299e+02 7.666118217569636784e+01 3.117966886826052786e+01 3.124636498487865666e+01 7.648181705834073796e+01 5.537561515419827174e+01 2.395817229291160544e+01 1.030434323557518539e+01 1.603539626933411810e+01 2.009009268958153882e+01 1.811570238583859460e+00 1.985911767998797428e+00 2.903706450120171922e+00 6.098668934059521263e+00 3.446181919123952753e+01 1.319991430718766594e+02 1.228409395441280054e+02 4.862718645203825076e+02 5.779323974619320552e+02 4.511746017815904679e+02 3.341535968590584957e+02 3.847982010541740294e+01 5.445960478985558240e+00 1.047970081267380138e+01 4.590400948096122136e+01 1.133458787321475825e+02 2.995328925289635436e+02 1.628720955560443429e+02 3.912913001153032866e+00 2.795762865194098445e+00
8.581601999881146980e+01 3.562049671376948368e+01 3.973651548956563317e+01 7.171261570884868775e+01 4.304290774472656267e+01 2.038037630886431373e+01 9.789753911417538035e+00 7.232133330130098514e+00 2.383900791314492551e+01 8.875687809601512868e+01 5.848744772743463827e+00 1.963581002732763148e+00 3.126528147737446695e+00 6.345576321932364650e+00 2.810455290597423428e+01 4.718511874334920009e+01 2.996980112706436472e+01 1.384714779529041628e+01 2.047175570192442962e+01 3.445418382719832096e+01 5.544940734200483945e+01 1.164637694091579512e+01 5.654155592074141090e+00 2.851856175784033809e+01 6.888411701157467348e+01 2.422700165003787021e+01 8.211388895262864196e+01 8.847093435005528761e+01 3.034978524151706125e+01 4.428679931358511013e+00
8.709680854413487339e+01 7.309334753271701857e+01 3.719766572658058124e+01 2.917250481922150840e+01 2.982581644964819390e+01 1.181982644327484877e+01 8.169938343040477946e+00 8.811268499092868467e+00 1.012253131451230992e+01 3.883928728327371260e+01 1.062087290388940453e+01 9.827851291672821787e+00 8.741534328880554483e+00 1.016347243408415935e+01 2.755605906353110868e+01 1.817661542761019433e+01 1.176585786470360162e+01 6.783729894866837640e+00 5.777051131858872424e+00 4.259809432339100255e+00 3.240484351126293738e+00 4.562907280537626065e+00 7.061372315705146008e+00 1.732265433608743166e+01 2.986236508518908295e+01 1.408302570195709968e+01 2.202360624406331269e+01 1.414227983206072281e+01 1.381722796327473901e+01 8.621721452607550518e+00
1.182369085370455082e+02 6.445015513668363383e+01 3.826107496573325761e+01 5.590432568414028935e+01 5.401553077023413607e+01 3.098254078484439589e+01 1.107383015507276411e+02 8.836536758838096262e+01 1.358842548172548348e+01 9.477827448551323641e+00 3.276963799634560637e+00 7.327403482790291633e+00 2.051688386591735735e+01 2.130823087334659505e+01 6.210165735568828893e+01 4.426830452353507894e+01 1.346869346167120796e+01 1.547719876263020922e+01 6.934748672572327521e+00 2.932076159316323594e+00 2.607283733396495329e+00 3.909967177306576502e+00 5.987049230780615794e+00 1.829005531970889820e+01 1.836241119810144085e+01 4.306246269645370717e+00 4.692860176645228698e+00 5.922244057306562226e+00 1.891450419845521580e+01 3.832360714492216935e+00
1.589870306507287410e+02 1.439042033528502316e+02 4.565296392603640641e+01 1.668905631229224014e+02 2.131109309558046618e+02 4.244979575446512854e+02 2.985814517391256118e+02 3.573065783310548227e+01 1.339011474389451095e+01 7.448226847208686330e+00 2.130225511308678765e+00 2.591599087963802006e+00 3.066906140844335216e+00 1.167045079940448815e+01 1.392424388766870003e+01 6.033553127837908647e+00 5.722223604969236987e+00 6.722416864621330923e+00 8.938917918825151077e+00 4.707920297477052429e+00 2.531370011842450474e+00 3.446160995776676117e+00 3.875572127813580181e+00 6.377368884469728272e+00 1.953232833096110710e+01 3.007034104135836383e+00 4.271168760644276752e+00 6.987948834496464201e+00 8.364966504255175295e+00 1.655482248998206529e+01
8.714932456613638578e+01 2.274617069035924715e+02 7.161449851076037021e+01 8.218032354357895031e+01 4.346127391174911736e+02 4.822751752293229401e+02 3.351879611278461653e+02 2.415896384716392831e+01 1.758480666963453132e+01 1.596079800958726835e+01 6.320621556978307964e+00 3.032758834209476007e+00 1.856811086184236181e+00 3.102984655478778109e+00 1.426910260971904520e+01 4.033139307387572536e+00 1.389001313803032645e+01 8.055978454116404919e+01 1.367011430077677971e+02 1.817911697373295965e+01 3.477603951905562596e+00 4.413053913200768008e+00 3.761527520457954132e+00 4.088987758406469553e+00 5.335760558612658855e+00 4.027338137322104217e+00 4.667749381394971309e+00 5.751081716255878717e+00 7.752032888307786251e+00 1.893769414405575802e+01
