2.724023637373214068e-01 3.950198320479131331e-01 3.326514181542173376e-01 4.100772513090604754e-01 2.861118753110528656e-01 5.935716034769954463e-01 5.388839691793154696e-01 3.189213188383530767e-02 4.676649031567819970e-02 5.499305779641391889e-02 6.321476053808882112e-01 1.620249871111163198e-01 1.051125664793689518e-01 4.147701847089185212e-01 5.127109704327851292e-01 1.215003727759342705e-01 4.563491843634253087e-01 1.380965700867676713e-02 7.162463171551716398e-03 3.334288907816014835e-01 3.126890379597285774e-01 4.687457299316145215e-02 3.601884175091524254e-02 1.446168720016839659e-01 2.813184557156659937e-01 2.208637018891925208e-01 1.015989445685801795e-01 8.872274327217986520e-03 8.395917103318160588e-03 1.046014135144318798e-02
1.795154541674931492e-01 3.831210593161245015e-01 6.729433645566568201e-01 5.056100514967171167e-01 3.472896535966391030e-01 8.283114893146087399e-02 3.300781523001833362e-02 2.589463740604599010e-02 1.258557614609086273e-02 4.941574031048991400e-01 3.946485034788985713e-01 8.520093920953225597e-02 1.261693756557818458e-01 3.230548228884440043e-01 4.688449966315185180e-01 3.338361138199461564e-01 4.230383080188082068e-01 3.271903454653476984e-02 1.053781142299400203e-02 3.980275033978641908e-01 1.789796631777717528e-01 4.491873883470805934e-02 9.335268607853221268e-02 8.384658739274324091e-02 7.440223403372038524e-02 9.986970456241957284e-02 3.512399171654455310e-02 8.890516709901269063e-03 1.258970773580042092e-02 1.251974704384629412e-02
4.992406790372434788e-02 6.454142190325394546e-02 1.324172372978139056e-01 9.673766096775357481e-02 1.734662975985304112e-01 2.967662459069255951e-02 1.454209174123801684e-01 1.514823923237668679e-01 6.647222537711497403e-02 1.780538853289529919e-02 4.913739963666430982e-02 6.053813720646789021e-02 5.828897186474785164e-01 8.040648768824663895e-02 1.934779208441947396e-01 5.163412976935366494e-02 6.474085653807766239e-01 3.125094272398707546e-02 5.833487481629238969e-02 1.185059674162149829e-02 1.126240296235948152e-01 3.713597261204959477e-02 5.651674868721539430e-02 1.971825749972793210e-02 1.172522724265660440e-02 7.728873401324979145e-03 6.904837558900946831e-03 5.420650332583940370e-03 9.237101026502636189e-03 1.034435969394627980e-02
2.140323722340230217e-02 5.789946225729985380e-02 8.071508784848820117e-02 6.506052800475917164e-02 3.969304020621023527e-02 2.958016047702796691e-01 2.919506602256182193e-01 1.799482733042349902e-01 9.677806066560795673e-02 1.366361563509197428e-02 7.482200954264857720e-03 4.427332626764954315e-02 5.727451951413039533e-01 4.591762551573082551e-01 1.425358100674317674e-01 1.201268406601471994e-01 2.620828673547459520e-01 5.125897174196971662e-01 3.997397208065918695e-01 3.696975102940951441e-01 2.040937383704805319e-01 7.907796402977050609e-02 2.655136920076409113e-02 5.242744512049634514e-02 9.565453948655740571e-03 6.813102257807648193e-03 5.836188144037125942e-03 5.536370413933398502e-03 1.123542761252501257e-02 1.220158063227046001e-02
5.673711888230608125e-01 7.895505564302611468e-02 9.125296210674670172e-02 2.439092396306089677e-02 2.443181700527898015e-02 1.717080386625697008e-01 2.973915353191888822e-01 1.661259864249908791e-01 6.060670649951118566e-02 3.553419069779570338e-02 3.344776795032299715e-02 6.809832219598023484e-02 3.450937636930114238e-01 3.552564952229441686e-01 1.844217977075944537e-01 7.424621849421335351e-02 3.860337630660230779e-02 4.934653421515478589e-01 2.329830623920567390e-02 4.608812855085332449e-01 3.283174805871099111e-01 1.023966016427711734e-01 2.614438530035607111e-01 8.620579401419441179e-02 1.726553198984844689e-02 9.104070047017456466e-03 6.298467072927360633e-03 7.276282673275487681e-03 1.136619844951165456e-02 4.174347374261241916e-02
6.503997090781552526e-01 6.062124619312755369e-01 7.495233471782766776e-02 4.610769120696111417e-02 3.618745633539060397e-02 9.922792620936397856e-02 1.274950998395347201e-01 1.352157093479257888e-01 1.121961962335059626e-01 1.614493494523102368e-01 8.435452450450794948e-02 4.874781244671019115e-02 1.540798634252784349e-01 5.814669569845269670e-02 4.883383052856696965e-02 8.538302996897388641e-02 4.646159061845883675e-01 1.195559494531991812e-01 3.780654284783872554e-01 3.778069318344001726e-02 2.768551746729996932e-02 2.289050062266433441e-02 3.221849449836430290e-01 5.025867091120064106e-02 2.574766202623372108e-02 2.381423718107795323e-02 1.478492852382701055e-02 1.017866899282701340e-02 1.341399360471834216e-02 2.405199755100764780e-02
1.054178032078567501e-01 1.593059248848811282e-01 1.529482788001854388e-01 4.201887026539618403e-02 3.409250687646514510e-01 5.752689855712594946e-01 9.752778242027260180e-02 5.211207094477153801e-01 5.915017704171723345e-01 6.241235033982879266e-01 4.418274932148987810e-01 1.867731367812383858e-01 8.524755734673829244e-02 3.958698460538950109e-02 2.333169289313596559e-02 4.351644303811381259e-02 2.546283534988609820e-01 1.184751653253699327e-01 5.751445536263859459e-01 3.577227749600460360e-02 3.726080399621283235e-01 1.030098652771396228e-01 4.762802829017437345e-02 4.536283811943658817e-02 1.743187160598709193e-02 1.775714922899400763e-02 1.568404019487468215e-02 1.358641442976412511e-02 1.571830282688941108e-02 3.695236349790986113e-02
2.284440865758546602e-01 4.225050943636849965e-01 2.200678472170917443e-01 4.158774304876423078e-01 6.091901604742154808e-01 5.396971821140279096e-02 6.346222841063722253e-01 6.310917128926520903e-01 5.499581073527448627e-01 3.023979596704779449e-01 1.184185591636676693e-01 3.489175595872859303e-01 7.468388196879700847e-02 2.606145796042099588e-02 2.973183242257605718e-02 5.690862142951554764e-02 4.494965125664336369e-01 7.030491923795626485e-01 6.154755756377509046e-01 4.680658707741179314e-01 1.489844635288258001e-01 8.516593410604761383e-02 3.372628259207598872e-02 2.805210424724784157e-02 1.331705387397744481e-02 1.397843236457015255e-02 2.263679154514306596e-02 2.887618102149758920e-02 2.804532075098787464e-02 7.962186045448957361e-02
5.778129986341813407e-01 3.716976859758316931e-01 1.960542388741400299e-01 9.136805257103471078e-02 4.713849892572959110e-02 2.808912890322064482e-01 1.351476412143832739e-01 4.634780388997577494e-01 4.262572098122857644e-01 4.202727353215757744e-01 3.647782735139257215e-01 4.465824719890661987e-01 5.085523304255526456e-02 6.082383390336572049e-01 9.516142728195645106e-02 8.141640816401314595e-02 3.361145610188187027e-01 5.466075177222829568e-02 4.984643048053776643e-02 2.019476890974195582e-01 3.890193527697453219e-02 3.927878588519262415e-02 4.234412948945543570e-02 2.755827503458938357e-02 1.614373468444219722e-02 2.474436412522423856e-02 9.823690439035000221e-02 1.929709450867617970e-01 5.361009862623477007e-01 2.549304699496397486e-01
9.293775025886560348e-01 5.877390770544629328e-01 1.967483604868645874e-01 1.127487243007372353e-01 6.189449976504904916e-01 1.265589281692509616e-01 6.541367192722875590e-01 2.964152455546975040e-01 1.404561934912889609e-01 4.958779371863988872e-02 6.616063160822652778e-01 5.534256303105903330e-01 4.045974911334020846e-02 3.426488776851212281e-02 5.892947586279311256e-01 1.344089086082322568e-02 5.306462669319018249e-02 5.913385952246009297e-02 2.709228236159676173e-02 1.721416081484672400e-02 4.824058563486618295e-02 3.021931911779354718e-02 3.437959444810823051e-02 3.772393322530100818e-02 2.112951045091936500e-02 2.719030971467232063e-02 2.632023772831438291e-01 4.362546367066825748e-01 5.219850427221776057e-01 1.316858734819786880e-01
7.884754831306313161e-01 3.966697800376824401e-01 8.351168961386035150e-01 6.815633546323878189e-01 1.568128123662504703e-01 8.188541442011600113e-02 7.523725137180600764e-02 6.922692596422355682e-02 4.596795515817539424e-02 3.546191861438400816e-01 1.056382214932633373e-01 1.349460163311346772e-01 2.009014739444847653e-01 1.094940055480138619e-01 2.012782773572203282e-02 3.851364378522950660e-02 5.708980571890813482e-02 2.692038587377160522e-02 3.310583105173456331e-01 8.071817138337990249e-02 3.300236089400220701e-02 2.922199861179877040e-02 3.741817124968815217e-02 5.230647699034157716e-02 5.607694788853203466e-02 3.066470911315461248e-02 4.954219450673514463e-02 3.818064583801983325e-02 3.313402652121599096e-02 2.299102001258727587e-02
1.542380704425518889e-01 8.831427833753960344e-02 7.496162376557831131e-01 7.103163538358927553e-01 5.530022471980077237e-01 1.290014974733156849e-01 5.571520144101456407e-02 3.798334486221675854e-02 4.595019557810085808e-02 2.022278577415358852e-02 3.340116618393914466e-02 1.059349876302036336e-01 1.808177812787351568e-01 9.307383785078460203e-02 3.333629236206859386e-02 3.737834583517297971e-02 4.134373436094274101e-02 4.250081823775830187e-02 5.516020862207111630e-01 1.829603816622373536e-01 3.144400268626448142e-02 3.166777113186973469e-02 3.721272408225432399e-02 6.637624968940883385e-02 6.303718142108312439e-02 4.492985126779174693e-02 3.453826080265241794e-02 3.080979031825078693e-02 3.285045015568356652e-02 3.471411669571583536e-02
3.207580596723149519e-02 8.049478623884429029e-02 1.880514686492177345e-01 5.182580736285054002e-01 3.371829393391818641e-01 1.095639106882561747e-01 5.855433615189670205e-02 5.110623736370026315e-02 6.374025422840064181e-02 4.102081427295311000e-01 1.133876458128117576e-01 3.853301457689751325e-02 1.445219196354494140e-01 5.671932139081561908e-02 1.778255642752725116e-02 2.053071751208708842e-02 7.599313206394990410e-03 1.675773205235739360e-02 2.634599374483662798e-02 3.835303677369172881e-01 3.003626584715135203e-02 3.267217408383716465e-02 4.097253581493348618e-02 6.766852922286752114e-02 8.539905259510582880e-02 7.439530281642649234e-02 5.513843092530282264e-02 5.100583138760722557e-02 4.378680576323742968e-02 3.543597105593129098e-02
2.696257306221738759e-02 7.688647418290095459e-02 1.349750606489777960e-01 9.611405848524176565e-02 5.632521803577437286e-02 2.221237742292662409e-01 7.547893343633340635e-01 6.618365751643642270e-01 8.812535547303006200e-02 2.709785611007119177e-02 9.534809756412961079e-02 5.040294607245136005e-01 6.545388971209731288e-02 8.092378876127091780e-02 8.632279260325935455e-02 1.167000688668295011e-01 1.053314264056188776e-01 6.859103941313551833e-02 2.078309109117386366e-01 1.241613348722339499e-01 5.385890324425650633e-01 1.955522172570771100e-01 1.454058199098557103e-01 3.414666276146062773e-01 1.954853474465893109e-02 1.217431068423904632e-02 3.497836435489069806e-02 5.696416235242427462e-01 5.852990719844124168e-02 6.605834095800014460e-02
2.476069799669901317e-02 2.479475786528622869e-02 6.671350401608985847e-02 4.936655884101678327e-01 1.785228926680720862e-01 4.093432640377412529e-02 5.024308504596519676e-01 9.187512844155022729e-02 2.844505792107606540e-02 1.025865375915372829e-01 2.106484295193281342e-01 5.117750853649318671e-02 6.585307459740512293e-02 6.766216304227323786e-02 6.130472263376902237e-02 7.435075165433389921e-02 1.274208417966852247e-01 2.212855871792574203e-01 2.266579536439097819e-01 2.276438170603574118e-01 5.188539380623403696e-01 5.778709826192744980e-01 4.766687724643585700e-01 3.817069363704922447e-02 4.193202202449657773e-02 1.558702190341582638e-01 1.870777569770801785e-01 4.494288938674926431e-02 5.981953504732510918e-02 4.483403898391581655e-02
2.233703997020632798e-02 2.420086046055025530e-02 5.409550067350338276e-02 5.961095493126245676e-02 3.977380530864235014e-02 4.192677338098026174e-02 2.319871702096376054e-01 1.562722094389764477e-02 1.806312494149433373e-02 5.233935838791358153e-01 5.649622547010778595e-01 4.444114448000063833e-01 3.429529260025387244e-02 6.094285252241490175e-02 5.712160812500459428e-02 8.797672273351653249e-02 1.531902249300118868e-01 1.873787601275954395e-01 1.091256567725219506e-01 2.653791333640129896e-02 1.869461394328479631e-02 1.357412002682966690e-01 1.784225569800540756e-01 2.534472615196813328e-01 2.172537085774659815e-01 2.804995995380714091e-01 2.216170360841563935e-01 7.129950370957731376e-02 8.673274821379210742e-02 5.031467664727285599e-02
2.808012575011459636e-02 3.218877004037927481e-02 3.134498623163212150e-02 2.938121343220314804e-02 4.211293198124452936e-02 7.025392068102916110e-02 4.331846314054888653e-02 1.287425004077971114e-01 7.219616487035891705e-02 1.643807327483521111e-02 1.633190351026098802e-02 2.514508030037542266e-02 3.801646393667890145e-02 4.018484869403315257e-02 4.196814493346350677e-02 7.576983517059979190e-02 1.647294309811212776e-01 1.673618136728685646e-01 7.992948620997247788e-02 2.751601900270631354e-02 1.175715339541846399e-01 2.110874197721282208e-01 2.679227312474711242e-01 2.726723422767620697e-01 2.378866684194628212e-01 2.032603421809114075e-01 2.958334399460226249e-01 6.531841371634582172e-02 1.198662815448265917e-01 6.446675777660058893e-02
6.906286294398214509e-02 5.374748426269268520e-02 2.623372401327385764e-02 3.674933055529328030e-02 4.340985412121561304e-01 2.559013776839194620e-02 9.873720291341231414e-02 7.868616249255189210e-02 7.721764029919324368e-02 3.815133725318339136e-02 2.070384489631677330e-02 5.237612968411028413e-01 5.043335897549119373e-01 1.991931171784721774e-02 2.917831481003982028e-02 9.506943311929241802e-02 1.128174166716088556e-01 1.381385111799947052e-01 2.422237348751472494e-02 3.868127505169938196e-02 1.296618814197991743e-01 2.769578214586041476e-01 3.373172718935198988e-01 3.460898914512210434e-01 2.824120967871094345e-01 2.678113452591766031e-01 2.445978454602626695e-01 2.385355719311107181e-01 6.097390110316144307e-01 5.027160144813130893e-01
2.778975784838932234e-02 7.625073329264328570e-02 1.312656885989494648e-01 1.632697584955973558e-02 2.000263129098263370e-02 2.577994426292147534e-02 6.071501355884792450e-02 7.618934344524053159e-02 5.232342785962958154e-02 4.910392340432992442e-02 1.691966304249883229e-02 1.422987309624147434e-01 2.187174820133921394e-01 5.106004215749971875e-01 1.587511125516812699e-02 4.418481206663369548e-02 2.339063457866166068e-02 4.800364565114418891e-01 1.508729691594900002e-01 1.727171587899020005e-02 5.069768992876260566e-02 2.686259814084397402e-01 3.382793464777257841e-01 3.493945382938967170e-01 2.504652591041405252e-01 1.134134503676405004e-01 1.801575404118110901e-01 1.782892817763419568e-01 6.152419664839732516e-02 3.658598181679590944e-01
5.834826357521805118e-01 1.906454355116924890e-02 5.198026630075814891e-01 9.007156961708097376e-03 1.309035092059082465e-02 7.401956887734776648e-03 3.794045313173361605e-02 4.067178609877970807e-02 4.610186634023973051e-02 1.588174219943542034e-02 3.835392441952104603e-01 9.799733838287827403e-02 1.707426167207694578e-01 4.100422581036919922e-01 2.395675028357229994e-02 7.230533481345524996e-03 1.771839610019019726e-02 3.705668527057617845e-01 5.981398534210740081e-01 3.959393863859660828e-02 1.654319319883995332e-01 3.140463954507933808e-01 3.381584631514765737e-01 3.158720644130876276e-01 2.365001457101156279e-01 1.686772381512701424e-01 1.598741279777039226e-01 1.472953959102689669e-01 6.413117300927445585e-01 2.799277020667625404e-01
2.404742315113446091e-02 3.066602138837825481e-02 1.258372359148819154e-02 1.078894584556762057e-02 1.222320547513211682e-02 5.035720454479932773e-01 3.072048469489819036e-02 2.154911522418262795e-02 6.154780703675864426e-03 4.237984831106820782e-01 1.707139573501486596e-01 1.502043587055508778e-01 8.370734884256898767e-02 3.836136644721876987e-02 8.052872865298726923e-02 2.276714610716763232e-01 8.624990406174306776e-03 2.280063053430173015e-02 2.128067121443861717e-02 7.760376587019685024e-02 1.711561115696910995e-01 2.639924840436322362e-01 1.084480525280556440e-01 1.595819908923716002e-01 1.908500763524637323e-01 1.305254891689340002e-01 1.085731323847400759e-01 1.186801060784974382e-01 1.564183386998837799e-01 1.701761103043888390e-01
1.031059399533328265e-02 1.779704443227923469e-02 2.623172112787635069e-01 2.240348749711813525e-01 2.095347032798267339e-01 3.090510173625019008e-01 4.385007889947531434e-01 1.106560960193526122e-01 1.553916082351836092e-01 2.691344069482400070e-02 3.979770110890060164e-02 6.257038813435898683e-02 5.936753802130281810e-02 1.854405640937633326e-01 4.059569063509263498e-01 5.544022148265803640e-02 6.588747863664748405e-02 8.843797027297338464e-02 6.020983390269263325e-02 4.552313372112897633e-02 4.160719700824003220e-02 2.707568119222972941e-02 3.266061383575273869e-01 1.899808823020127449e-02 3.556750931627824380e-02 1.920566249027102351e-02 6.215209783824205969e-01 2.267350608293016434e-01 2.913723457555108393e-02 2.715731834031001948e-02
2.677448971737217409e-02 3.263786626511063632e-02 3.009115965823904726e-01 1.744003504560442119e-01 2.909033313019297462e-01 2.306830608195044874e-01 3.657756608041851654e-01 4.077154946891311388e-02 3.645759483867148237e-02 1.575372597453451179e-02 3.895209449571638421e-02 7.189268154771329133e-02 7.807048531066078378e-02 3.602530480781027666e-01 4.627519310172684142e-01 2.955668036831537310e-02 6.950451805658681981e-02 1.283742239806179020e-01 1.443032682943163059e-01 1.256662046400206789e-01 4.064638336372423250e-02 5.364900558977508949e-01 6.378841592253019499e-01 5.486126633499881916e-02 6.082929490044005488e-02 1.998189412837827333e-02 2.709306855879373699e-01 1.101979778455506320e-01 4.071343172823233686e-02 3.886817696916402415e-02
3.371798195812825139e-02 4.892851618682595993e-01 1.712957549947751179e-01 7.282698813744731270e-02 9.265965257197103511e-02 2.121296994122820745e-01 2.888213663704107814e-01 3.307019343277931706e-02 1.785478922770429230e-02 2.030060790759885547e-02 3.683083486466488116e-02 6.293124246476769490e-02 5.851546246106693883e-02 2.796957208313721743e-01 2.198131434433578044e-02 4.607149459214255477e-02 5.298596994746768152e-02 1.202010243576996512e-01 1.492521512737933487e-01 1.269690889171681825e-01 1.182467219382483808e-01 3.353324206081582104e-01 2.322259527452206485e-01 4.139265685191987898e-01 1.011683155202123957e-01 4.905554106577709322e-02 3.622138839636452473e-02 1.926632248955530979e-01 3.338380432272660542e-02 2.990150363619864873e-02
2.323723196155701859e-02 1.279598888914372339e-02 3.826673857839443249e-01 4.058195009059278879e-01 1.737060666092380551e-02 6.740679026247183847e-01 2.949068462351425723e-01 1.228868077840998135e-01 1.799859603603541358e-01 2.297945341510304607e-01 2.152662006389084379e-02 2.605489265393314685e-02 3.457906437326965787e-02 6.804363779546541979e-02 3.527515995472330079e-01 4.717063633269506090e-02 2.775025092768241067e-02 5.786990018552976706e-02 6.281441885245138412e-02 7.150236380887318999e-02 8.890957447497715993e-02 4.175590949979778865e-01 6.791551847988805402e-02 1.180477921822103288e-01 4.798848537374307277e-01 1.238585191943762931e-01 8.262441992559363402e-02 7.188590519543094914e-02 3.966167836989660522e-02 3.422774293454413502e-02
7.002189444195241162e-03 3.769817307427304476e-01 4.934305953988972759e-01 9.410612335879167123e-01 5.415744267106680221e-01 2.463207953388549254e-01 1.190926426840843017e-01 8.523780262263290497e-02 2.683594693167506429e-01 9.183267846183278127e-03 7.124050926784225579e-02 2.730609660027738181e-02 4.176441551886989068e-02 8.000927294985721305e-02 3.411325295501691501e-01 5.657335702355873464e-01 3.294081043633909078e-01 1.408175950743155158e-01 1.963260092303266979e-01 3.316188413074625529e-01 5.845422552577730357e-01 1.388469657668129909e-01 7.296798613922719778e-02 3.539167453919353501e-01 8.101694183586864995e-01 2.510030407723974899e-01 7.011167229973241932e-02 1.001102159515609019e-01 3.264702000580302910e-01 5.488174196379880937e-02
9.803331224852877834e-03 1.383448306424601287e-02 4.850419470125469368e-01 3.905196105342868540e-01 3.827646081355464136e-01 1.436994244491696104e-01 9.510305037798172378e-02 1.001350447659651866e-01 1.123870694016508021e-01 4.456759075342353049e-01 1.328806463047492170e-01 1.422412168988430592e-01 1.190062822263050629e-01 1.329470221577322420e-01 3.564509519068185806e-01 2.346914552063475989e-01 1.461171666584580864e-01 8.034364797866759556e-02 6.675901161586002275e-02 4.955324680793792014e-02 3.988746582256604001e-02 5.875377284614905632e-02 9.111267787455959444e-02 2.188520743099821309e-01 3.755514066513268023e-01 1.693397590429051303e-01 2.477977492925436120e-01 1.676365405804582653e-01 1.707264476108878437e-01 1.111885079811968796e-01
1.072928289685722014e-02 7.482133176948321251e-01 4.738068378238969314e-01 7.090565619792073004e-01 6.287303773394413708e-01 3.452178944549817441e-01 6.199236040879133741e-03 5.187866574088552916e-03 1.548941229728398039e-01 1.123325924642232521e-01 4.294076450163880621e-02 1.065407179068296878e-01 2.803229917102631474e-01 2.812408996934157024e-01 8.142325787294547590e-01 5.741665059537335303e-01 1.640758151314485325e-01 1.737985099371686659e-01 7.540273012592527135e-02 3.281033344181012029e-02 3.200074054877155572e-02 5.029702023690418161e-02 7.710957358896468328e-02 2.367107296772969494e-01 2.402176920386988324e-01 5.678999505264025610e-02 6.243444896962124790e-02 7.886910770387470238e-02 2.532713543472498441e-01 5.119129833042171396e-02
1.434760054463465190e-02 2.013208930633523380e-02 5.425411664193692252e-01 2.282265311678671749e-02 1.551846827713799365e-02 2.214868775424863601e-02 1.470436588001874240e-02 3.867314777352450772e-01 1.537436013132115475e-01 8.929875164910663909e-02 2.744122880121327782e-02 3.763276106291783829e-02 4.222069428603354019e-02 1.542653552239272030e-01 1.822647540368360630e-01 7.501133856898012375e-02 5.685515984630862274e-02 5.520987258324854680e-02 7.160117530348748816e-02 4.076579639468348726e-02 2.897533626195686329e-02 4.326977623948934093e-02 4.943693985694761622e-02 8.302753017817511572e-02 2.604362890003947273e-01 4.118228622761940100e-02 5.965058293014601637e-02 9.613291582916309863e-02 1.143148155399288934e-01 2.243262477980413061e-01
5.334670702066029134e-03 2.202905563428898816e-02 8.313813626767129206e-01 7.342726043470943799e-03 1.832189678049771925e-02 1.918705732892420773e-02 1.519759055278520864e-02 2.665409107349493434e-01 2.066934620542495993e-01 1.936092888802526113e-01 8.005873034659370668e-02 4.155678795163254835e-02 2.672405477383488562e-02 4.235279392594508419e-02 1.920662855069649178e-01 4.913692090981942179e-02 1.243510789850443554e-01 2.200508250931172000e-02 3.694602627370465603e-02 1.560887274247671763e-01 4.039565847048564445e-02 5.662576320479656422e-02 4.939964586501977700e-02 5.460803766475785803e-02 7.278005525441760826e-02 5.592920781324960122e-02 6.570732867949073686e-02 7.977271279394197723e-02 1.058611390385161694e-01 2.569548514547476681e-01
