2.395084704226529693e-01 3.457018872859896619e-01 2.911312884964992187e-01 3.589235262503014945e-01 2.504331064097339299e-01 5.194652003860145140e-01 4.714455657478213713e-01 1.365696689405570229e-02 1.937373789799329282e-02 2.595819898612663698e-02 5.612370773526108580e-01 1.450205768773467907e-01 9.459666857460230505e-02 3.730777842012928947e-01 4.608526088708350676e-01 1.091164786867852149e-01 4.121716992265883062e-01 5.971845503898802823e-03 2.602409075607489426e-03 3.052180554583162064e-01 2.839552248393406031e-01 4.222153510882133837e-02 3.216165238510326069e-02 1.281725922102942838e-01 2.481829216393096615e-01 1.940165642969506332e-01 8.886133319671921105e-02 7.759635829680630592e-03 7.343112926800965563e-03 9.149627119357722077e-03
1.565694610499214767e-01 3.318045219339950669e-01 5.827348538149537127e-01 4.377533635065914419e-01 3.006255107519487657e-01 3.437287680049432720e-02 1.328483155763500977e-02 1.106242702223058684e-02 4.784351990822187650e-01 4.342825305281058368e-01 3.477775777734763429e-01 7.594571436510909324e-02 1.133515735401512542e-01 2.903432965920758613e-01 4.213693424551180344e-01 3.000711157613967783e-01 3.821724690216292686e-01 1.484731605223540279e-02 3.714477265725406839e-03 3.634273379037120666e-01 1.622055957669132908e-01 4.040573560889516858e-02 8.328995414977510836e-02 7.429683320781992062e-02 6.564645481663058946e-02 8.775468965059424198e-02 3.072908741000803662e-02 7.776834853452208908e-03 1.101235582649104892e-02 1.095150722145499071e-02
1.704127020618797714e-02 2.355079693406062630e-02 4.768601803900523323e-02 3.351554003372676088e-02 5.589319517944593696e-02 1.159792259916801044e-02 1.246045302130989879e-01 1.306312715110280187e-01 2.873321802294460242e-02 8.629625433735407108e-03 2.035547083708365984e-02 2.789869221785425124e-02 5.228848173079466699e-01 3.898792721747709744e-02 1.738634310390416715e-01 2.480569486903500681e-02 5.850849890529824515e-01 1.417430712985253555e-02 2.319629092189010380e-02 5.231071860369094009e-03 1.018622419513876554e-01 3.335268784858085034e-02 5.037432870815992947e-02 1.746647501604137523e-02 1.034708142808197368e-02 6.795134463348628980e-03 6.046439815212295912e-03 4.744336524741469933e-03 8.081956084923083705e-03 9.048806807062478863e-03
7.154443215344803535e-03 1.853063525875434450e-02 1.767521960994965224e-02 1.422885309019251629e-02 1.228196793939683416e-02 2.553610786109576369e-01 2.517511283369042174e-01 1.549156396181443351e-01 8.315377162120174415e-02 4.733804941652460310e-03 4.382025253875452275e-01 1.981100117454401635e-02 5.130643876297744654e-01 4.105675851964150080e-01 1.271397587877112489e-01 1.069181310169512733e-01 2.341404868976510179e-01 4.595398886737446786e-01 3.595426341649735624e-01 3.329476280305599944e-01 1.826832320862742109e-01 7.033771300066757326e-02 2.345533345392503827e-02 4.609979294633648889e-02 8.396052804694246335e-03 5.971397280688892951e-03 5.109239290246997238e-03 4.841945785126847493e-03 9.817573016454483187e-03 1.065295775157453634e-02
4.961454981432805167e-01 3.387401095528689426e-02 2.822954006987508924e-02 5.380123662694957613e-03 8.423106576119358466e-03 1.494270220008337147e-01 2.584699803717268596e-01 1.440837747128460022e-01 5.240506121450708849e-02 1.310834066530059544e-02 1.084470199710562896e-02 2.982362364127380538e-02 3.087125822910521955e-01 3.160456029077891582e-01 1.630823101297216304e-01 6.523956104562117497e-02 1.834843090120159836e-02 4.362299348206631344e-01 1.069257336232298967e-02 4.092397425273153200e-01 2.899766869413985537e-01 8.996753540553681372e-02 2.283324325575069591e-01 7.510329202354956712e-02 1.504848428281004707e-02 7.942305693372888817e-03 5.503367916314307745e-03 6.349677667605913012e-03 9.907155754688704713e-03 3.634277551018341018e-02
5.747874266493858686e-01 5.358224809689763335e-01 3.126977250640759765e-02 1.990612728049093519e-02 1.996422635179990329e-02 8.840593208092199784e-02 1.126631103854129068e-01 1.182999189739795121e-01 9.786191907905079923e-02 7.031890314051882085e-02 3.420739338378651906e-02 2.058800789270506457e-02 1.375765089301967115e-01 5.144114257592723172e-02 4.278224447217408855e-02 7.404163855970247177e-02 4.031675555142438805e-01 1.041084048922668037e-01 3.303158349183130116e-01 1.671453886235976447e-02 1.106736238750462807e-02 1.005231646242489042e-02 2.781936966054232019e-01 4.338956663182093332e-02 2.228750083065568141e-02 2.067474222987661717e-02 1.287914439290573781e-02 8.855972837211957896e-03 1.165963198282736479e-02 2.088848191202419616e-02
9.642490883276931546e-02 1.462876427323135387e-01 1.414531978680792779e-01 3.206894209397338769e-02 3.296157652294935403e-01 5.470539519455718258e-01 6.515797529536641874e-02 4.623486674870401769e-01 5.203535121520400653e-01 5.510753084333240848e-01 3.919562757435945399e-01 1.666666945192308846e-01 7.601237018668297041e-02 3.488355897189909793e-02 2.030674846208026241e-02 3.739211717501534499e-02 2.186026743492965607e-01 1.019309773272938230e-01 4.958915074210608620e-01 1.625453099530107387e-02 3.204955321845415761e-01 8.833663881850181698e-02 4.072861589864562593e-02 3.886595502771781480e-02 1.500031236042300570e-02 1.534439107969993651e-02 1.360818434814047538e-02 1.178009190144122843e-02 1.362588545577250732e-02 3.204373412811635513e-02
2.141188712722441045e-01 3.982415215861206947e-01 2.097822248148466240e-01 4.186289506005902439e-01 6.256510838934912222e-01 6.789388053771135967e-01 5.919041083203508968e-01 5.653211846596453150e-01 4.888851336835317585e-01 2.691087581165461651e-01 1.056033560887541384e-01 3.120373863929131741e-01 6.671622550598721446e-02 2.310079934701932472e-02 2.614078978119493968e-02 4.960053798012368370e-02 3.914418997548316792e-01 6.129550882969014847e-01 5.371710793293746899e-01 4.086789344931536783e-01 1.297266894258933267e-01 7.396539166161378298e-02 2.921714794835651371e-02 2.428745317281678223e-02 1.153206222869732588e-02 1.210478304593249829e-02 1.960319086677009964e-02 2.502751104976174909e-02 2.433734592154273429e-02 6.920941843605979416e-02
5.515348933397367093e-01 3.624277679930509311e-01 1.995817434931921597e-01 1.722487108403006340e-01 6.862920903612964585e-01 2.832793439013203685e-01 9.108477390134493701e-02 4.201819394184183043e-01 3.825088563526708452e-01 3.766419062196906808e-01 3.267281522741979360e-01 4.000740935575144430e-01 2.426522144567887229e-02 5.423707839831609645e-01 8.516167108132990937e-02 7.246560440005567205e-02 2.985975795009235267e-01 2.503514239674476533e-02 2.239652387573117659e-02 1.782544505137630964e-01 3.426819803805571107e-02 3.452931426770143586e-02 3.714676365583990253e-02 2.410603092329941660e-02 1.407017570801374906e-02 2.148053725751891685e-02 8.497732578488155497e-02 1.673038023981057998e-01 4.659255856322014888e-01 2.221774709834550554e-01
9.015863487841597745e-01 5.814003405525969281e-01 8.813002475885081122e-01 7.828112127723746427e-01 6.666640841130553330e-01 1.276504354585401013e-01 6.085893229024905704e-01 2.709112949922145019e-01 1.272099330588722099e-01 4.474419667718335797e-02 5.951780874440579794e-01 4.964477659384284869e-01 1.768616439644589422e-02 1.429886147132009531e-02 5.328707193430977096e-01 5.311106654557952167e-01 2.269789025367398641e-02 1.922667756626367935e-02 9.362574782480042809e-03 6.952567422944514255e-03 4.296384823473137909e-02 2.687787713660734490e-02 3.053591698145877165e-02 3.334549206696613838e-02 1.854531562877442807e-02 2.367831877644148778e-02 2.275578972838418201e-01 3.784726935592492292e-01 4.544684200077948044e-01 1.150691751707626775e-01
7.640532753848808811e-01 3.921664044386972137e-01 8.514325305826651036e-01 7.024827366705140852e-01 1.438607236707293013e-01 7.987507828323407721e-02 7.024244546777244635e-02 6.374842294916416297e-02 4.233452320802404134e-02 3.271557223591480823e-01 5.995457836449874511e-02 4.616010155735075782e-02 5.367123107398791976e-02 3.315984249735638018e-02 8.690281604875905661e-03 1.629469288495968490e-02 2.165677385276608760e-02 9.625128862578498368e-03 2.980143296181357315e-01 7.258627738468399759e-02 2.965417788467065649e-02 2.624276631003118893e-02 3.358978706134780473e-02 4.671897865816863893e-02 4.969544563129968395e-02 2.692932215510777244e-02 4.312560333235301163e-02 3.331637333516655752e-02 2.899945981944216170e-02 2.018321036307868868e-02
1.469411727537669188e-01 8.498910524233936614e-02 7.288227459377362161e-01 6.925936356178803432e-01 5.378313815994216762e-01 1.238750882661794617e-01 5.199582308629200483e-02 3.497444486628120686e-02 4.276665576937099117e-02 6.674696012246915666e-01 2.027580354455288045e-02 2.604705395610345045e-02 4.196756168180764551e-02 2.177461644441446020e-02 7.871070790762909122e-03 1.080849711091852287e-02 1.189421911085243588e-02 1.677282979191297568e-02 4.992459410241317230e-01 1.654843936648257574e-01 2.842506872721276695e-02 2.862336684240619766e-02 3.366143746822224114e-02 5.989845918819852733e-02 5.662648407489970920e-02 4.012076730546732667e-02 3.061397961575199056e-02 2.727446058007296920e-02 2.907947354228792788e-02 3.073452051273954655e-02
2.966666596970633438e-02 7.515259387349461362e-02 1.774834010389442496e-01 4.936371748726021136e-01 3.221103928172556197e-01 1.038312446921354909e-01 5.445665647816849697e-02 4.711655721924854628e-02 5.949383393496159717e-02 3.860836285647715749e-01 1.065703735617426207e-01 1.110893854769410931e-02 3.717470932378155735e-02 1.333124009181668214e-02 4.217219269530613455e-03 5.941037528485133834e-03 4.915622291192717763e-01 6.259771028140397042e-03 1.046987489601663816e-02 3.487066529535648995e-01 2.729965286927462167e-02 2.969651561173156443e-02 3.730235309464730725e-02 6.199301198587961470e-02 7.840469023552197603e-02 6.821147978245718779e-02 4.986265302715335579e-02 4.575226549106785334e-02 3.918025740296943865e-02 3.162608005521519439e-02
2.442280696872649315e-02 6.991551240303676973e-02 1.239117731834940145e-01 8.901516042537002682e-02 5.254502762302692975e-02 2.074608359667051427e-01 6.997395698352943949e-01 6.112175281488421152e-01 8.145852856400859210e-02 2.512070051715579316e-02 8.846312518079305076e-02 4.664884796121851473e-01 1.701801117965567878e-02 1.910989448067139732e-02 2.057542438295320922e-02 3.395916427121286468e-02 3.053874111409298625e-02 1.976963796188738881e-02 5.663169868347487507e-02 4.143059747151604799e-02 4.919550211627459757e-01 1.786174827076077998e-01 1.330367413876479832e-01 3.156403099824848235e-01 6.315021913084262195e-01 5.335045714299481157e-01 1.470510248809658513e-02 5.170836779102550018e-01 5.289886476345482397e-02 5.938811252672981239e-02
2.239785100393584458e-02 2.252742500870145992e-02 6.102764368130462330e-02 4.542339583843176265e-01 1.651876361374460533e-01 3.793757740811045526e-02 4.657668364808139616e-01 4.998725749883334984e-02 1.428812917251224071e-02 9.459623758696915352e-02 1.945071862360024106e-01 1.987154648825753545e-02 1.901789813111313607e-02 1.578848078394089541e-02 1.443612132021985725e-02 1.766300667700345522e-02 3.058156423677277358e-02 5.362007878827244195e-02 5.544244383243521895e-02 7.075405519296100454e-02 4.746844999908142460e-01 5.287273929317439780e-01 4.365006245038826060e-01 1.845129116180543177e-02 2.123103508014522259e-02 7.268384725636410637e-02 6.702873585608724871e-02 1.554120182274194850e-02 5.399407863928074730e-02 4.027142532906701627e-02
2.024629769145024419e-02 2.207210312160329604e-02 4.965084351372144739e-02 5.493503724115087611e-02 3.679042411072573626e-02 3.879578619951887936e-02 2.146070913796305490e-01 5.739710599127144652e-01 6.959270624389617306e-03 4.822219566251205736e-01 5.206250363264591785e-01 4.095673724688456696e-01 9.091936453303698512e-03 1.398426418939530125e-02 1.322975054576627785e-02 2.055429420987455597e-02 3.630555211813095429e-02 4.506519803634036897e-02 2.662960611300992098e-02 7.339184235534920026e-03 5.947218286952665398e-03 4.507406909904240755e-02 5.546900430103953589e-02 6.841492255436057435e-02 5.330668593412735828e-02 6.837065875730624631e-02 5.363541010154438543e-02 2.022267923422489677e-02 7.773076746579918317e-02 4.495573168834555294e-02
2.557920368764237534e-02 2.953950812318478433e-02 2.882732158386467486e-02 2.707144249646721915e-02 3.881425293775180724e-02 6.466146927013981249e-02 1.578839697873715350e-02 4.284627803369837895e-02 2.598145139095362974e-02 5.838829968065899385e-03 6.523746217931852658e-03 1.000367448937069213e-02 1.349759048295000666e-02 1.156959942737072200e-02 9.544011976233413366e-03 1.737056542370321935e-02 3.851839473356711424e-02 3.997024913057169865e-02 1.946833242928666316e-02 6.794670393608445366e-03 2.906233124213516636e-02 5.215972862146223826e-02 6.614145724067703458e-02 6.711833514873663531e-02 5.815344380803175867e-02 4.917448901621937485e-02 7.077015797640069661e-02 2.016344806975377962e-02 1.067675233302631532e-01 5.733205825869200356e-02
6.315060542596338811e-02 4.954964824454994449e-02 2.416553316626915068e-02 3.380579175486000953e-02 3.982541605158334552e-01 8.705580372226739971e-03 2.357237576906667104e-02 1.815115502113733362e-02 1.783285072216149111e-02 8.718304476683379906e-03 6.736137919504271883e-03 4.802825141955160970e-01 4.613795170397857470e-01 7.683667304094675583e-03 9.086246088638602614e-03 2.136384523946704278e-02 2.955787444097565317e-02 3.834949304347676224e-02 6.822803121676963324e-03 1.002149463871851269e-02 3.204789492549425800e-02 6.854429832528585731e-02 8.357312549639173138e-02 8.537685231914549089e-02 6.896543554635857498e-02 6.435889675941916521e-02 5.787779876368216725e-02 7.059051081393753757e-02 5.402536853718972187e-01 4.454365303531719888e-01
2.529540825400567600e-02 7.010276557920776253e-02 1.220767509899499670e-01 9.252492910587469324e-03 1.071161596192077466e-02 7.984692973162186083e-03 1.356954232785959231e-02 1.704391432659153882e-02 1.170938503406205276e-02 1.354691192460368530e-02 6.358008979982795496e-03 1.302036291222248565e-01 1.994650603674538447e-01 4.631453247581230892e-01 5.999535301694034622e-03 9.733644643308610872e-03 7.228487309736133029e-03 4.334663415994807756e-01 1.365709845630271591e-01 5.272518839022281682e-03 1.224299071915164842e-02 6.506099200559117834e-02 8.214661807808096294e-02 8.490296419583170939e-02 6.067782886885406818e-02 2.727079082506702473e-02 4.293826023076184606e-02 5.979282976441720188e-02 3.078176983332383404e-02 3.248233744596130124e-01
5.287426524957246077e-01 9.068759982112359341e-03 4.840639231574322965e-01 6.079961974874772412e-01 7.103048395118444734e-03 2.023410005055368242e-03 1.026552435861727806e-02 8.791374020427272090e-03 1.253957911373304243e-02 5.644809321700651125e-03 3.505449086477099296e-01 8.953702671998114981e-02 1.552984876633777545e-01 3.699803840935084187e-01 9.509136216130644262e-03 1.826132203658759404e-03 5.764108077327658591e-03 3.316192865647906163e-01 5.368155472281437302e-01 1.188100866536292467e-02 3.895359880029997807e-02 7.435321774766183445e-02 8.046570185393479846e-02 7.562468297629344749e-02 5.683277945574456702e-02 4.057931892634532994e-02 3.840307696234642604e-02 4.805951306051714500e-02 5.702621084147051489e-01 2.489315040312862493e-01
9.071576696911672066e-03 1.353014188408455630e-02 7.009729902634253065e-03 6.200328629330340187e-03 7.046450137833054107e-03 4.599097691442503577e-01 1.140959544954523765e-02 6.990960647773520643e-03 2.035627253069699234e-03 3.868830109781490334e-01 1.558815832399720047e-01 1.371637707704123632e-01 7.597483863156391515e-02 3.444153823932078612e-02 7.156460504759526442e-02 2.003740938483720424e-01 2.550036247037485836e-03 7.546304891772290767e-03 6.979529285228328744e-03 2.222241483945673612e-02 3.921614253584260190e-02 6.486872134720519933e-02 2.678840504876821293e-02 3.980568530227277663e-02 4.554675005034544699e-02 3.935065588686987442e-02 3.626692655453523512e-02 4.631461718448915549e-02 1.392025322517146668e-01 1.514538055024165775e-01
2.269452069939122130e-03 5.923471605763042623e-03 2.396162577817530503e-01 2.047657538810736255e-01 1.915380230596241684e-01 2.822791041812563462e-01 4.000777409522843220e-01 1.008724304814330036e-01 1.416170754827454081e-01 2.454309863591522256e-02 3.630996990743471514e-02 5.710098807754351857e-02 5.382679634994336215e-02 1.661932547170157648e-01 3.598323927153854185e-01 1.818323116008599763e-02 1.514880211393324592e-02 1.903153151860545109e-02 1.321039940711173435e-02 1.015260473422313972e-02 1.206005262907322052e-02 1.073544421795386700e-02 2.886823504880651758e-01 7.043041757657790558e-03 8.434332733255845913e-03 6.924006294988370447e-03 5.530929139208380363e-01 2.018752725138036885e-01 2.595806161493536060e-02 2.420281891348147543e-02
7.447085614437431479e-03 1.249642683735331487e-02 2.755804401420945959e-01 1.598358049758994981e-01 2.667087806073581979e-01 2.111828777521231604e-01 3.343100392356829764e-01 3.718803089364901282e-02 3.321561113500664381e-02 1.435504330444481620e-02 3.549655178378464948e-02 6.550703438510900589e-02 7.076757316536651243e-02 3.236314119359940400e-01 4.121866038621980755e-01 9.182573657647626758e-03 1.478981140354087252e-02 2.783493759388553854e-02 3.187473153630125677e-02 2.822617858438952396e-02 1.336315755336121673e-02 4.764198066604820037e-01 5.647561374982934534e-01 2.327560269056008421e-02 1.972655187571319829e-02 7.132698961979641594e-03 2.410790337046466170e-01 9.825011335569720783e-02 3.637805615607563742e-02 3.479549630605822952e-02
9.505510143511027715e-03 4.482068106819382391e-01 1.574292562091619829e-01 6.856209087908919642e-02 8.796708815894870026e-02 2.010243217262041582e-01 2.649971545268021145e-01 3.020087606423667650e-02 1.630060077997417742e-02 1.852875164838025529e-02 3.357447831977813241e-02 5.728790743672317748e-02 5.305345325515627847e-02 2.519210310463437796e-01 9.791713069778218426e-03 1.535769664558675300e-02 1.139634238979934239e-02 2.629180875760873254e-02 3.319175359220342264e-02 2.866664952127967111e-02 4.380159688072448460e-02 2.987065112644856080e-01 2.058268231270362347e-01 3.667080668531929044e-01 4.332125205670259160e-02 1.993522268880658713e-02 1.393605706580639675e-02 1.717478279882806991e-01 2.987386503237873803e-02 2.685546140890961164e-02
8.129655342253962538e-03 5.986021861227927739e-03 3.543095668466356152e-01 3.863833022409858819e-01 9.236158402694468750e-01 6.470651435805973017e-01 2.712375513492340517e-01 1.123698658485067642e-01 1.714850036479245721e-01 2.184192145725519785e-01 2.035290617581421782e-02 2.370957321401355108e-02 3.136464863069109155e-02 6.145219021944193366e-02 3.172931619579841822e-01 2.254787841948787189e-02 1.228576054496463565e-02 2.003388105484954149e-02 1.990765917586214545e-02 2.695206421898307600e-02 3.812191140872928791e-02 3.730643471593688698e-01 6.024466213940633114e-02 1.045930986538035207e-01 4.252246898131924469e-01 6.197362106824051003e-02 3.079886501693482673e-02 3.211397308773424053e-02 3.549354390190761349e-02 3.080147132067944868e-02
4.555039061661144383e-03 3.544680656004625119e-01 4.675672325736384138e-01 8.964977552052845189e-01 5.186840387983099321e-01 2.366057225192193525e-01 1.094567217266586429e-01 7.798635633058456640e-02 2.553320121051564362e-01 9.663652814411324288e-01 6.710998363695110103e-02 2.485266409134881394e-02 3.788520754075098973e-02 7.231653675798906111e-02 3.072999149757466020e-01 5.082646713164445940e-01 2.971269034794751240e-01 1.275477245516856428e-01 1.784990043060301068e-01 3.014530133774704912e-01 5.281587519997810176e-01 1.246184934798661714e-01 6.503374127937436300e-02 3.147708829885017545e-01 7.195731103205745827e-01 2.226005576355946647e-01 3.449407480910115370e-02 5.169810858819707394e-02 2.921397899508670903e-01 4.941566382431401144e-02
6.716277865318958512e-03 8.115628748643751722e-01 4.612118004045411279e-01 3.632080222729583419e-01 3.542244893002751138e-01 1.321749042002193231e-01 8.835579951734090498e-02 9.293716953338754250e-02 1.082214854088377337e-01 4.229802095764977343e-01 1.247690622788710374e-01 1.294063120716923421e-01 1.079592749962841464e-01 1.201874190932548658e-01 3.211730420626162652e-01 2.109029448994167721e-01 1.318244946943250839e-01 7.278664640869746127e-02 6.070686935240338783e-02 4.508459592218263395e-02 3.614700464131404695e-02 5.301680164072315737e-02 8.185048435677678980e-02 1.958570227056360691e-01 3.348501004651415758e-01 1.504629474871873596e-01 2.197068516841851060e-01 1.492957806132396703e-01 1.528382229546172977e-01 1.001336777228259006e-01
7.537864518961438082e-03 7.072017385116989852e-01 4.500641975364743086e-01 6.549260029687890006e-01 5.773030377813349601e-01 3.161488837492546500e-01 3.134199263694960238e-03 9.028476929710063104e-01 1.437217328595650490e-01 1.026201925470619503e-01 3.915398822564150616e-02 9.691216513877569383e-02 2.542961206478476788e-01 2.542452658571168200e-01 7.336172879039185579e-01 5.159764209159727333e-01 1.480307318648673709e-01 1.574585289642701502e-01 6.857004503406452511e-02 2.987439413211101166e-02 2.908119562211180717e-02 4.561464283832908362e-02 6.977951267508236688e-02 2.131475810125296466e-01 2.150814212743170639e-01 5.055405247389788137e-02 5.538556399956801740e-02 7.026786132677785568e-02 2.268608078136683526e-01 4.611944818393094031e-02
5.086833856850258087e-03 9.331668661085935554e-03 5.042421015714327881e-01 1.272268825951137182e-02 7.885125462568672375e-03 6.674581481044205948e-03 6.817983261982770229e-03 3.568603648678381202e-01 1.422201227079350205e-01 8.131075087072714425e-02 2.497067331531101220e-02 3.422205852558599798e-02 3.829832035692873338e-02 1.394567492466465553e-01 1.642136511991159897e-01 6.741224860346914372e-02 5.129588849416632373e-02 5.001372680412197180e-02 6.510751977330661577e-02 3.714763215570675986e-02 2.640849831761529765e-02 3.943473102135180985e-02 4.504417862432427699e-02 7.518886839223601348e-02 2.340901310205213415e-01 3.672204722978041763e-02 5.294966255628833635e-02 8.570035030577401181e-02 1.024796023330512285e-01 2.022354035360990343e-01
1.167307340250999708e-03 8.380446784933746202e-03 7.715291523756344638e-01 8.935291600724063477e-01 8.009789349069613290e-03 3.990027392984030891e-03 4.132906734034320732e-03 2.407740973219751057e-01 1.862543250666728600e-01 1.750463312888584089e-01 7.260699585223939767e-02 3.779895830560026093e-02 2.424638017734068521e-02 3.823074778605967811e-02 1.725168886235620147e-01 4.395513528197516478e-02 1.120034280617111244e-01 9.619463880662502964e-03 1.606250010879015783e-02 1.428419541177493590e-01 3.697399920582025712e-02 5.182841304747348721e-02 4.520875467808915110e-02 4.969825481067746686e-02 6.579134263948879791e-02 5.021448067049240349e-02 5.876984093129084680e-02 7.166181259233009304e-02 9.562035758375445060e-02 2.334337735622852850e-01
