8.460961039205606993e-03 1.238155562485276570e-02 1.082541777210241363e-02 1.373580830773105457e-02 1.040830607060768895e-02 2.277321473807369587e-02 2.239392434666750281e-02 6.012689165992719798e-02 1.087674845769855819e-01 4.924600368894191393e-02 2.315110628978604354e-02 5.321374655464377462e-03 3.117919313617403560e-03 1.149223929250146187e-02 1.326581800493677535e-02 2.896574541470524518e-03 1.003194404035212192e-02 1.714554406244941931e-02 1.518093248215809758e-02 5.234572550576652682e-03 4.190418675928855863e-03 7.358682011919281951e-02 5.723975424354692254e-02 1.790399704994374754e-03 3.296257501617379931e-03 2.448885831945908902e-03 1.524523787082134318e-01 1.345662928223477842e-02 1.275527508355437170e-02 1.591438409567745571e-02
6.609691871504461483e-03 1.441018508007051169e-02 2.603212345444761919e-02 2.116824206930873267e-02 1.474356684741168211e-02 6.595538578733928237e-02 3.127300322617847239e-02 3.866822470060583827e-02 2.503885748195510547e-02 2.141621050913304972e-02 1.542666918524823565e-02 3.041608386423561884e-03 4.045622421278651307e-03 9.191466267303050053e-03 1.271965128775254771e-02 8.149557041479089242e-03 9.886774876401278889e-03 3.145574707371473488e-02 2.313985738361254429e-02 6.811132238297101793e-03 2.406626437641386489e-03 6.866939454955656164e-02 1.445937214669174020e-01 1.271123161872583507e-01 1.103516067242232279e-01 1.458257905814054900e-01 5.119655267531427606e-02 1.327080542432195268e-02 1.891239182175695477e-02 1.895300735997083180e-02
8.010753783838858721e-02 7.931231609554467710e-02 1.679503964779037739e-01 1.355047806494077411e-01 2.898532072211867927e-01 2.953356194593457010e-02 5.514759883826624888e-03 5.829323027697706078e-03 9.318020783897967840e-02 2.849689281364213567e-02 7.730499757671663308e-02 5.166121974034698638e-02 1.900523284126843376e-02 2.781056666277249845e-02 5.284879721063341119e-03 2.217947785008613990e-02 1.454229839307531226e-02 2.892308265701231534e-02 9.350426791298499518e-02 1.515769219723298727e-02 1.429226727981729173e-03 5.560774113999182588e-02 8.520569792664396680e-02 2.967208915449915871e-02 1.754105964385418645e-02 1.155295801323303131e-02 1.022726534329902390e-02 8.118600242255660099e-03 1.381916227127249000e-02 1.566935424245210692e-02
3.699384013102042373e-02 1.025390112401750736e-01 2.253770518784677657e-01 1.806282175203761109e-01 7.490270484078867530e-02 1.160548343920387096e-02 9.254553379058247028e-03 6.142632761469597746e-03 3.739302187701911643e-03 3.507884568117546759e-02 2.263525156810887451e-02 4.534166935945578569e-02 2.054733156115862505e-02 1.371600541739515303e-02 4.000608715926275843e-03 3.021419323435482404e-03 6.173374866708662007e-03 1.122128690321096134e-02 7.782166666919536173e-03 6.488940396552537668e-03 2.896986448097775731e-03 1.273983555913069110e-01 3.996624834025837986e-02 7.677815134267299002e-02 1.419966972113241924e-02 1.038564535801016729e-02 8.828753275902963618e-03 8.390333746430266373e-03 1.680124594121621545e-02 1.857214377451311960e-02
2.133254088284518984e-02 6.393162188547077407e-02 1.780174711623747075e-01 6.894759687492950373e-02 3.983851501079074126e-02 5.825261277732116799e-03 8.954962546783698518e-03 4.990462498314313620e-03 1.950223792449142235e-01 8.056761862133786367e-02 1.009038639889043854e-01 8.684643300343160288e-02 1.282451171804344613e-02 1.055902221763717341e-02 4.872390439538172233e-03 1.716967583600949310e-01 1.864842422661759300e-02 1.049804772335215242e-02 1.664279799916545607e-02 9.336273776790261422e-03 6.298828330056327127e-03 1.704715352534037429e-03 3.612588024848560186e-03 1.286903923191871635e-01 2.554066108486408027e-02 1.382004054051887490e-02 9.515796214647409199e-03 1.110496456852787250e-02 1.720179265898936355e-02 6.468284506274965540e-02
2.122877865144802770e-02 2.153293944206501054e-02 9.635410551866457896e-02 7.701530570637410422e-02 3.061781439655943474e-02 3.293303437990960803e-03 4.039953276560961405e-03 4.356140069721077535e-03 4.087101287132735225e-03 1.242471053416794452e-01 9.747993133778382058e-02 5.176918716816403254e-02 5.884297009092692016e-03 1.511351390564664721e-01 1.166707683322656952e-01 1.930400052810364864e-01 1.045083315473099156e-02 2.692377222193916616e-03 8.662540830642559767e-03 2.940157827844951458e-02 3.495528942404561162e-02 2.013301519062443701e-02 4.822707347809575273e-03 7.748694623848864649e-02 3.823312316117101484e-02 3.617214248103515356e-02 2.231712185233416385e-02 1.558398328752520420e-02 2.038408978983405340e-02 3.773963757866950763e-02
2.499271480365614084e-01 4.528522223342554623e-03 4.777683022546352389e-03 2.417534647164301664e-02 1.157030942382995808e-02 1.931418135745737591e-02 2.959371588915797949e-02 1.704305067072420243e-02 2.039844772813608278e-02 2.388209850922118349e-02 1.844793514889721958e-02 7.641668208081190197e-03 2.522552552947995297e-01 9.976008461270780003e-02 5.310847953796661580e-02 9.547342003932962617e-02 5.956359603834287739e-03 2.811128744795138735e-03 1.431893539477002361e-02 1.939157786337317863e-02 8.692541692922623603e-03 2.005067466592590220e-03 9.022995219670983114e-02 7.032192973488668453e-02 2.611657871949166904e-02 2.691388014242325488e-02 2.333277838204341273e-02 2.060765613266220958e-02 2.385015371057827224e-02 5.850885081993138781e-02
6.386252865872530174e-03 1.153317285695131672e-02 6.716301700903315464e-03 1.442236099651553367e-02 2.198077583104059846e-02 2.474399834377516080e-02 2.209940251437300315e-02 2.099870480457301236e-02 1.699488820072362835e-02 9.589055981814557580e-03 3.879071462376916697e-03 1.204198791287626295e-02 2.079598006398548082e-01 6.967231067725064564e-02 7.183063954758364678e-02 1.335578735158888253e-01 1.218392690683244017e-02 1.943814813592114124e-02 1.704749913511596771e-02 1.203721093028823144e-02 3.193841683664198385e-03 1.593428992401478839e-01 5.422938614027715543e-02 4.224776055736536445e-02 1.991887058243206610e-02 2.093961288478432547e-02 3.221006424678642815e-02 4.126483509778142156e-02 4.197591572963037254e-02 1.266255426336201917e-01
1.697253495141656798e-02 1.103692094941928145e-02 6.439246962510964192e-03 3.710569614808735539e-02 2.392304616170374404e-02 1.011771830557852553e-02 3.281040485174647331e-02 1.477658070188271611e-02 1.245781862544713056e-02 1.236525853712353018e-02 1.108150347064764535e-02 1.466884851643894538e-02 3.193256531397421077e-02 2.065396150188027538e-02 2.596284519348955877e-01 2.383287071103025179e-01 1.180982351652484080e-02 3.571184262472857501e-02 3.513659831106195897e-02 5.829281122264455030e-03 9.078729384800554580e-02 7.091361336703230767e-02 6.736826343700383357e-02 4.138815483384682831e-02 2.398329527669899180e-02 3.691155300286640822e-02 1.384646836674416903e-01 2.140922723885325778e-03 6.619847993193266229e-03 3.499571249198182420e-03
2.834943949184298359e-02 1.839108703317773180e-02 2.930095872029678944e-02 2.713835666461800536e-02 2.362088548734174800e-02 4.652100763925939159e-03 2.167009495155110960e-02 9.220006909287885646e-03 3.862032563005072736e-03 1.249165700412023655e-01 2.131487452776341732e-02 2.076662375346349093e-02 4.388495150762638380e-02 4.730332449770358744e-02 2.247249854094532720e-02 2.438726881093972870e-02 1.296745935081938805e-01 1.337024669970411639e-01 5.355356880050436696e-02 2.372397044716445871e-02 1.129098033398434758e-01 5.400381585204668683e-02 5.542519661484590632e-02 5.819279998503516793e-02 3.180128572349520677e-02 4.099138493380226345e-02 2.920448023246706611e-03 5.347355492015056985e-03 7.075846683273405088e-03 1.966796452635808864e-03
2.377191817223875403e-02 1.237606279005604333e-02 2.754401088169430856e-02 2.326904454227137972e-02 2.932981556813208518e-02 2.239942698104744334e-01 1.910131472727265023e-01 1.685770141464914273e-01 1.071334486964022614e-01 1.083629448481644025e-02 1.698585301169446560e-01 2.823281657028237079e-01 5.823298017307519947e-01 2.871086548045622688e-01 5.296535048903139309e-02 1.028975424703941488e-01 1.897123475601867892e-01 5.226245490848457909e-02 1.245631664369761457e-02 2.274554019508722158e-01 7.807250531901678559e-02 5.444473031144045350e-02 6.455238294492825213e-02 8.786223416382417384e-02 9.251585903747759632e-02 4.993723263597686646e-02 7.890147920143870952e-02 6.397314851112370637e-02 5.793758688474027335e-02 4.195251289834206476e-02
4.407467022998029678e-03 2.054325480448213059e-01 2.266228240530498983e-02 2.204074892649464379e-02 1.702921457614926803e-02 3.878857206204580632e-03 1.282304892034213384e-01 8.324873335380603145e-02 1.040193070177500984e-01 2.128036713980088757e-02 5.150608888399040020e-02 3.347665220494070448e-01 5.985730261214871062e-01 3.107194098682676264e-01 1.126091875506710083e-01 1.265616900208768325e-01 1.390182822063550927e-01 8.190285136411183664e-02 2.015815780060999790e-02 5.660427720533879950e-03 7.295736061946597739e-02 6.473223423482588057e-02 7.306717404028226226e-02 1.294775181787892471e-01 1.232826523821533848e-01 8.752560788844900019e-02 6.681556708041089254e-02 6.057138350965592111e-02 6.468357194544745170e-02 6.906641452014698757e-02
6.771578139676132091e-02 1.746954662594725760e-01 5.271575530375680572e-03 1.483851449906209777e-02 9.596772249394886628e-03 2.532938824667264055e-01 1.308456121339879319e-01 1.102893261519975743e-01 1.400856852706812705e-01 1.068549151715189778e-02 3.555200587485753301e-03 1.072463004987688484e-01 4.482548802871754168e-01 1.912854170310132607e-01 6.018717869385313557e-02 6.945179381639983440e-02 2.556266499656482949e-02 3.742067545177047566e-02 4.255994200934763022e-02 1.589891819241162629e-02 8.831498545349994456e-02 7.920701087517559302e-02 9.532080980229645784e-02 1.635510687904065397e-01 2.146072850975064283e-01 2.019704406890489579e-01 1.495940333245588116e-01 1.350869590560203337e-01 1.020300421033391303e-01 7.806062669428491529e-02
5.387897143521987869e-02 1.550922172383730757e-01 3.469163572052009863e-03 2.077064824918187780e-01 1.229610557387339348e-01 5.716708963746174044e-03 1.921955882790367734e-02 1.616258608604996191e-02 2.025702755749662354e-01 6.224383059245541805e-02 2.612072288466888836e-03 1.743522686077627129e-02 2.044102402269698526e-01 2.753806445058286645e-01 2.936732282115295800e-01 3.958658204119688273e-01 3.551208737831981210e-01 2.292004248987734027e-01 6.229586856128913608e-01 2.903450925686138495e-01 2.403397688927239040e-02 6.948201241417699403e-03 5.169425202126190846e-03 1.301115732602173107e-02 3.021060614957550572e-02 2.819513520992265182e-02 7.691243514148218829e-02 2.468543395463058260e-02 1.657876358918120852e-01 1.588097360975800620e-01
4.834728914438809338e-02 4.867453939437883098e-02 1.354581700558549484e-01 1.196954587572706709e-02 4.305075640564958069e-03 8.768772732768331801e-02 1.281304507642027496e-02 3.685504212421214509e-02 2.478428688151123119e-02 2.563046924917583742e-03 5.481522877811341801e-03 8.637652228518605257e-02 1.820523479609329476e-01 2.299731823516207585e-01 2.073971137386564079e-01 2.503272855289355725e-01 4.256376964254734996e-01 7.329176127821290798e-01 7.463318127252713818e-01 5.922386818505508410e-01 2.546769268772250405e-02 2.670409609714952115e-02 2.355155289609710267e-02 7.397475358852260985e-02 1.062317347784552113e-01 5.428485042096095059e-01 5.432431365977576920e-01 1.082630657616718561e-01 1.939490441207405436e-01 1.156504854140119054e-01
4.221891477680039112e-02 4.615105467480493801e-02 1.072395724726492999e-01 1.197575256342952865e-01 7.990856752325103951e-02 9.149135555077481108e-02 7.022858792512956180e-03 1.970969200226845713e-02 4.087006449102904143e-02 1.469452280182800309e-02 1.520097771559269020e-02 1.318302032892223336e-02 1.020829738695959166e-01 2.070200764142614835e-01 1.937048242681003452e-01 2.969708956632481911e-01 5.111276977599513716e-01 6.202862330076270858e-01 3.604495017070732388e-01 7.947670978278137399e-02 4.791702569734604400e-02 3.293271637357596537e-01 4.770622824788748328e-01 8.032038877876347405e-01 7.561445869793130825e-01 9.870565994426994116e-01 7.957779361887535874e-01 2.267456256239979151e-01 3.061935274223026027e-01 1.379137505598315716e-01
5.109180196502204757e-02 5.935461075474631615e-02 5.972666394135346668e-02 5.781438962076555776e-02 8.929395691100221188e-02 1.871099397071958326e-01 1.144614696017861866e-01 3.820961918857540551e-01 1.867537530158115133e-01 3.200542099287208980e-02 2.376336476247781909e-02 3.683094045077550671e-02 7.267219703363242411e-02 1.074473745504521682e-01 1.420737071371256655e-01 2.551870290256551543e-01 5.475129249443168034e-01 5.552672925081362232e-01 2.659288944522223419e-01 9.219503280934240874e-02 3.961795794255888459e-01 7.136059099169922426e-01 9.101186293553020779e-01 9.405486354235146340e-01 8.351333008534389535e-01 7.269395651008749848e-01 1.083149794423487577e+00 1.889283040025534488e-01 5.979074858256886588e-03 1.946987529000458461e-01
1.222590344358727987e-01 9.647282820872706000e-02 5.150765343414433206e-02 8.264860487850421433e-02 1.103604402495611536e-02 5.581406095416617530e-02 3.107255484506347698e-01 2.526110514501020421e-01 2.487815594619923187e-01 1.246565249679439102e-01 4.561010144814599265e-02 1.221973626373364791e-02 1.195529446603226659e-02 3.092782161136476207e-02 6.976238786971324102e-02 3.219666053049891064e-01 3.378616042472868952e-01 3.983408132992455886e-01 7.004583380997594921e-02 1.244933027097535061e-01 4.384649519832487519e-01 9.411231166470145348e-01 1.155880597162476375e+00 1.209767843003371590e+00 1.012122669242507822e+00 9.841971677357376214e-01 9.212101184046883606e-01 7.303021215402909494e-01 3.240558411776010145e-02 2.136125570037937862e-02
5.491604831898508343e-02 1.529229920359860551e-01 2.899657042444507473e-03 2.008287953560257758e-02 4.460313252796744427e-02 6.305412384261882552e-02 1.989318822008826482e-01 2.475238653063025762e-01 1.702172686639059074e-01 1.322939231419719974e-01 2.776889620067787834e-02 2.713739074999776089e-03 4.129218912191318612e-03 1.171850569378571870e-02 2.551156355882602117e-02 1.511035406051615126e-01 5.766190552756812748e-02 1.859055577924349084e-02 6.263405193587869360e-03 4.550164617876522460e-02 1.718197347091183214e-01 9.093315612598927844e-01 1.147779554731394924e+00 1.211036381832246045e+00 8.935005267077010815e-01 4.169068675319987372e-01 6.776074511753150675e-01 4.651097103337328287e-01 4.194160172824928923e-02 1.655725030618803578e-02
1.432470604343751702e-02 1.819216121045940521e-02 1.213857562324448074e-02 1.500374352895215285e-02 3.524973645352322271e-02 2.020856497030074084e-02 1.042393803817111830e-01 1.342717960660803067e-01 1.241264110186213604e-01 2.924887303275166411e-02 7.341578904624918890e-03 1.547475848878281665e-03 2.724360668514142370e-03 8.114398421812366383e-03 3.241236409024578907e-02 2.193921198491547569e-02 4.007241870616240487e-02 1.187174525203253325e-02 2.224579368506547639e-02 1.048234555075268776e-01 5.610124574761723437e-01 1.060509487738224399e+00 1.139841727796510717e+00 1.091013805972768091e+00 8.438679948801071085e-01 6.216075716278320895e-01 6.041704323040923974e-01 4.070848164526322810e-01 3.665259293899794657e-02 1.304770937204704356e-02
4.017757093906174082e-02 3.642784307654460541e-02 1.869553602962771566e-02 1.338750626539178534e-02 1.730167324836127257e-02 9.264171992061311436e-03 5.287220541622732195e-02 4.713073530068458139e-02 1.296563881707750270e-02 7.059157159136263994e-03 2.438766996799095720e-03 1.940692675393811129e-03 1.450233900092029737e-01 7.900659072685059514e-02 1.806426139539485300e-03 6.227000825212268206e-03 2.216678293318768284e-02 5.043053346643103230e-02 4.837049940486973232e-02 2.153253571064710492e-01 5.878284251994720933e-01 8.553004549798929324e-01 3.500442104362281315e-01 5.283432477238141356e-01 6.850496865674122748e-01 3.892685597451630564e-01 2.913367908369512982e-01 2.392890164659761676e-01 8.771217739191521784e-03 7.928899531517761765e-03
3.253489455216972137e-02 3.712053067194450579e-02 5.457326837300167759e-03 3.752401330679048207e-03 3.051445158841234288e-03 4.543668407263088543e-03 6.496305872941929641e-03 1.619975854727097537e-03 2.097201818497893087e-03 4.637812541783568887e-02 6.018181714484049927e-02 9.070581975678021491e-02 9.970628107249036864e-02 2.952261960172540729e-03 8.630661292997492129e-03 1.148956314952240543e-01 2.177240509486272346e-01 3.132494032415107377e-01 2.127272066155497243e-01 1.602940529666482261e-01 1.142552037573499879e-01 4.120839759768004512e-02 1.605120124604576121e-02 3.472549952100065229e-02 1.261904124390064164e-01 4.284334365942573525e-02 3.967517873877871026e-02 1.340690579195532792e-02 1.052780310154595167e-01 8.611910116642179647e-02
6.906100253861888194e-02 5.278356262426368850e-02 5.674050788623269045e-03 2.421964674680587848e-03 3.504478753930805913e-03 2.722886249111661737e-03 4.205319775143916833e-03 6.269222168960555952e-02 5.344918274589881974e-02 2.297318478874900427e-02 5.410631870799059717e-02 1.016745854966959739e-01 1.347994685327417452e-01 6.024036069048617492e-03 1.032238775239739843e-02 6.698467554528723944e-02 2.420529911023375502e-01 4.485762223480672661e-01 5.056905586346615022e-01 4.412636970854446616e-01 9.527691786109263039e-02 2.151555407071667481e-02 2.686538329703754002e-02 6.577923130637450266e-02 1.466933074726176622e-01 4.335289121556661074e-02 1.670594657657534232e-02 6.300790204920294832e-03 1.367230510743682459e-01 1.227441912004906127e-01
8.635293440095752338e-02 1.092327208297346960e-02 3.003994123941841447e-03 1.185328644551277844e-01 1.404377265022871413e-01 2.357707817992349322e-03 3.028610034070719492e-03 4.690923707179167623e-02 2.615328938139858603e-02 3.004115969886401311e-02 5.291741412680822654e-02 8.990192141422047312e-02 1.016424857205398546e-01 4.645838346788410712e-03 1.904167015079174380e-02 9.601074371824118436e-02 1.839726174715640428e-01 4.204471219405173654e-01 5.253972606087602415e-01 4.474452457702922104e-01 2.276999380062276479e-01 1.333132444491248389e-02 9.573665202332033372e-03 2.069904378166282505e-02 1.191870361836618875e-01 7.141978709615975918e-02 6.453047774369982670e-02 1.216832146069213305e-02 1.218032981472404186e-01 9.363621143598424568e-02
4.812694033835123592e-02 1.481483685846447795e-02 5.709991066060037847e-03 5.249819805995099842e-03 1.147174099079966564e-02 7.784329947057629789e-03 3.203656671238394333e-03 1.809828996691758007e-01 1.928217165347065982e-03 2.536756773861456940e-03 3.287504484758083101e-02 3.689287528483087275e-02 5.757394287323844284e-02 1.306874482599282294e-01 6.857062634056177927e-03 2.946384623544832243e-02 2.960173681222580747e-02 1.261798827544964308e-01 1.612473701477079302e-01 1.398712413373771890e-01 1.203186599858714900e-01 1.584410377249279023e-02 1.948473755975093646e-01 4.838128791190248433e-03 2.138889922049497933e-02 5.340505531652284255e-02 1.437119720576432169e-01 8.100832294854172499e-02 1.443453559935946040e-01 1.090613132611028269e-01
1.724222973166096573e-02 6.800043281978578047e-03 7.199899688673455124e-03 1.198368492388740200e-02 6.438474526466158449e-03 2.864589002872083498e-03 1.776289357410741898e-01 1.268743486016578603e-01 2.854169844170207412e-03 1.114793456710526896e-02 1.057181667829836802e-01 3.629123615076179643e-02 6.148815858912062143e-02 1.353082987855740993e-01 5.566487378944855700e-03 1.053030488241218227e-02 7.286851576567245775e-03 3.628753998064730875e-03 5.742308668522279856e-03 1.060567678970858289e-02 1.939182629303454544e-02 4.539181614433311293e-03 1.950651137808119273e-01 1.233557578125602655e-02 3.020058467175584793e-02 1.075809372083620305e-02 3.723900857705895323e-02 4.178687539274037605e-02 1.484801230496862919e-02 1.672072291380083398e-01
1.748153509375355297e-02 1.394943473127189040e-02 6.737113013221985441e-03 4.879709861298077433e-03 4.467900689443774984e-03 1.665363800157245366e-03 1.483754549670230349e-01 1.545374641065376808e-01 1.725416789766368031e-01 4.881228948183539973e-03 1.385343100261280432e-03 1.321835631765281953e-03 1.713967902007041966e-01 1.746461999205518390e-03 5.398796530381902437e-03 4.013043267027668198e-03 2.837088664476346105e-03 1.808351943047552812e-01 1.605514533220645801e-01 1.237110409682352086e-01 9.845008548543084104e-02 1.438158831408397342e-01 2.287950484859027633e-01 6.887319869241399599e-03 1.246990118784224374e-02 6.151064683741822199e-03 1.003766911001757398e-02 6.694628858139598654e-03 6.760292726821492959e-03 3.229185237284928900e-01
2.368414635834025991e-02 1.228060282203359901e-02 6.924050814382956207e-03 9.357320835194995329e-03 8.086267755695861204e-03 4.359864919786915656e-03 1.479715671326402651e-02 1.111030247566852092e-02 1.632130084387300398e-03 1.673214619154465843e-01 5.924157885695334469e-02 1.351461946568831285e-01 3.070256186530478069e-03 3.661342770485694932e-03 1.217218986571053096e-02 9.768641308589372588e-03 3.240223783413190631e-03 4.019675067886325365e-03 1.919074446995459038e-01 8.391856797548429003e-02 7.623330309807947736e-02 1.163824136350194993e-01 1.810106966932941153e-01 6.618657939741199800e-03 7.264585066837884672e-03 1.483031411739664240e-01 1.673536379543467401e-01 2.122943083884707149e-01 9.226751908819812859e-03 1.411836040361179045e-01
3.179184255279235427e-02 2.735841334718102508e-02 8.224694831342780482e-03 2.784013698554456406e-02 3.176299072864377515e-02 5.944947659618619873e-02 3.980202259189933450e-02 4.490505156497382432e-03 1.612028789131664253e-03 1.315646128655854619e-01 3.858756567582832114e-02 4.791164969655694467e-02 6.027014072968435443e-02 2.007594685529759393e-03 2.730705784478044528e-03 1.446957225650553069e-01 1.436743818484729207e-01 1.744436800470391402e-01 2.395414715778429737e-01 1.313387209664527433e-01 7.126133331089376521e-02 9.651545136470410235e-02 1.081584686313971366e-01 1.907220478379502426e-01 7.307623336992854698e-03 1.025976516758473345e-01 1.520360756690161408e-01 2.480673181737238220e-01 2.910681890570571695e-01 8.277214605176984666e-03
1.740164043819660347e-02 4.307207899036544219e-02 1.275355584775713681e-02 1.352729465580284479e-02 6.447452405577461243e-02 6.777624665230723433e-02 4.518322393967072470e-02 3.102158728507694099e-03 2.189641919439546617e-03 2.107836921142785831e-03 1.190890188820577233e-01 5.876897167264143185e-02 3.818304112276920542e-02 6.870492391976504298e-02 3.025983074935689916e-03 1.016797086605107925e-01 3.646877459703204080e-03 2.332490035714452487e-02 4.343944676604161864e-02 6.085570832113434796e-03 1.069601064698855186e-01 1.349709661087168389e-01 1.144871145849702537e-01 1.317709836715944272e-01 1.834906319121407114e-01 1.461816516025695456e-01 1.764135472166049878e-01 2.182370061207805079e-01 2.852519032735365001e-01 1.051932061840427785e-02
