4.561771092600639954e-01 1.483285201897042473e-03 5.901984867809301205e-01 1.618747670230758287e-03 5.573652727797973050e-01 2.636539364525446964e-03 2.570503521668402076e-03 6.841941658268642541e-03 1.226719998721479375e-02 5.425893300918406721e-03 2.487187186661042604e-03 2.759180026198249647e-01 1.621016709192242555e-01 1.159065165965773598e-03 1.316217171110240945e-03 1.664934652870265486e-01 9.625491359857264121e-04 1.619982151302505743e-03 1.412365043656239492e-03 4.799092193569153789e-04 3.028432970248384204e-01 4.415694749521564128e-02 3.447017786929442579e-02 1.372270778461015528e-01 2.642471268615320112e-01 2.057948754767319199e-01 9.453277827172322512e-02 8.326446322818563048e-03 7.874055444305159968e-03 9.800429483141491482e-03
3.550361158252621219e-01 1.775726661237328821e-03 3.194519840400049729e-03 2.586530352869612082e-03 1.793325922145408337e-03 7.948412448779177200e-03 3.718575669613990563e-03 4.534185363987740594e-03 2.892631413042595894e-03 2.414374213671899132e-03 1.690710581137139278e-03 1.654141360733865918e-01 2.209110606444701641e-01 9.317964616113894472e-04 1.262138078823177474e-03 7.906290907303601236e-04 9.403227842485529803e-04 2.937262887133397071e-03 2.120682050121750969e-03 6.125253601025291159e-04 1.824185455233702791e-01 4.112788241437717596e-02 8.677095684244812146e-02 7.683496349596682928e-02 6.719051589710944850e-02 8.929291680969378420e-02 3.150183581136187932e-02 8.164547284539956998e-03 1.163353311225065294e-02 1.165655696408656079e-02
1.008703795658560422e-02 1.000353993906609971e-02 2.117643719684943887e-02 1.707790738101195790e-02 3.651191923156905939e-02 3.683609911083860280e-03 3.094117391667950412e-01 3.266471395723714588e-01 1.096093056422452541e-02 3.273735253336163952e-03 8.633611638533288113e-03 5.574357108681568355e-03 1.983854699541433200e-03 2.828272800102934591e-03 3.116657423855513365e-01 2.133937578714991106e-03 1.367871604762172302e-03 2.663821942400288693e-03 8.422728247553752656e-03 1.333792817058433592e-03 1.140662856317130186e-01 3.323529640130426510e-02 5.094231723913358878e-02 1.785289318611518392e-02 1.062515904293640130e-02 7.028963204139379931e-03 6.244205050400897933e-03 4.966405527756450645e-03 8.470771183703330529e-03 9.624974756203016554e-03
4.632316151077642621e-03 1.281343037210835346e-02 2.816624517475588632e-02 2.257500799262975033e-02 9.362776279058614495e-03 1.435857323621544078e-03 5.222740456936000308e-01 3.468611409564395509e-01 2.083297348423063522e-01 4.024451931161377241e-03 2.546351138130700971e-03 4.973232733009925501e-03 2.189759632471919779e-03 1.419085402527169200e-03 2.312276943195682444e-01 1.785064030912825450e-01 3.811911254133485416e-01 1.041525200476563261e-03 7.063934404407254874e-04 5.756782460938618005e-04 2.201908038424187364e-01 7.601652623985065416e-02 2.390618724457892197e-02 4.618512923287513422e-02 8.580858604415226437e-03 6.299707277037611478e-03 5.371909856880921486e-03 5.108916204487210823e-03 1.023914392695660092e-02 1.132933774760867124e-02
2.652147077940607625e-03 7.895492645511379207e-03 2.198762692840358635e-02 8.517047822726202949e-03 4.921597235311821888e-03 3.328438082105287799e-01 5.052226340040347763e-01 2.785584694311838971e-01 1.264518941961803311e-01 9.204679533635580502e-03 1.139831360533759275e-02 9.672342568693119078e-03 1.395677481901835609e-03 1.112627688158239307e-03 2.739949104622990683e-01 1.026503656901035094e-01 1.789357582419327060e-03 9.857445740040940256e-04 1.529570139240238541e-03 8.401815229902803803e-04 5.557674363270897816e-04 1.266982295882951859e-01 2.829951379968574376e-01 7.740483247596272043e-02 1.541529440166558920e-02 8.369742272922406356e-03 5.781023184030096435e-03 6.732988188310662717e-03 1.040966012269981672e-02 3.907204757293600977e-02
2.615850704342158675e-03 2.623534624339850935e-03 1.174162903670735239e-02 9.386246694610970304e-03 3.731681123890849983e-03 1.907718332804716199e-01 2.283927193675868161e-01 2.408726540387662041e-01 2.191531577590592472e-01 1.412491504086870950e-02 1.104310529588778747e-02 5.828577205095396112e-03 2.996507928892323536e-01 9.200150846545883387e-02 7.054276576362122908e-02 1.158580549444280794e-01 1.010856457279422742e-03 1.605672547311471077e-01 8.022316266153771370e-04 2.668642946868803999e-03 3.117749364118350009e-03 1.763032980469371805e-03 3.617422728188466330e-01 4.659172729419842202e-02 2.305200048013199970e-02 2.187713108329643677e-02 1.353881068059025958e-02 9.406124577824172273e-03 1.224305313936762188e-02 2.256028591570890737e-02
1.659401751549371695e-01 2.664222218214371551e-01 2.812380583313905391e-01 2.916352345997742703e-03 1.393169680681198780e-03 2.300031259718903192e-03 3.462940182764806616e-03 1.959738281373329949e-03 2.304434567153819738e-03 2.705803364611552003e-03 2.092157599544629092e-03 3.767748912345871282e-01 1.543725389934907377e-01 6.074037088943667895e-02 3.216067566399682248e-02 5.746731665806065203e-02 3.399385114300575994e-01 1.615147700948504350e-01 1.337821273144735017e-03 1.776803174913230794e-03 7.839990245954689581e-04 1.347396898893417627e-01 5.400540069064364845e-02 4.227377967862595148e-02 1.573381285420229203e-02 1.625844099604411078e-02 1.413327827829854652e-02 1.237813044730921852e-02 1.421085980484799484e-02 3.459625770230671804e-02
3.435583422641773077e-01 1.413287372883059983e-03 3.733345405351421453e-01 1.743249072440171583e-03 2.635591011623914133e-03 2.932869572372848177e-03 2.585115664082427746e-03 2.424513821737403051e-03 1.936692463788478166e-03 5.042611106460070935e-01 1.987054618128574202e-01 1.357628791140060194e-03 1.270901143597141514e-01 4.233622841609024912e-02 4.339848699329396792e-02 8.020811786895812312e-02 1.220179312154689088e-03 1.913446514460491856e-03 1.648924446973391638e-03 1.143603890613967104e-03 1.979018785233587208e-01 9.511386566371062001e-02 3.254436876697688191e-02 2.541204534110433344e-02 1.199165229995308515e-02 1.262304453302949721e-02 1.943895159876889503e-02 2.466150617201183504e-02 2.484848885946046304e-02 7.426873025224683955e-02
2.095901347077404851e-03 5.699869853469339276e-01 3.355283926689771601e-01 4.457065973487080515e-03 2.835595011858403798e-03 5.370090600181335327e-01 3.822419629606459059e-03 1.706123180588554888e-03 1.425373991490111979e-03 1.404314834898829148e-03 1.248687058638219124e-03 1.637656827153643243e-03 3.518616083669799839e-03 2.234087961624857052e-03 1.563928521358509405e-01 1.426980193476024839e-01 1.210112148335702178e-03 3.612792711726619133e-03 3.506742284648331140e-03 3.372517208993838778e-01 5.438502064657555618e-02 4.256746569084633031e-02 4.052509113859561335e-02 2.490411962994853318e-02 1.442542515441688766e-02 2.219970831609689027e-02 8.323845878519045560e-02 1.689987609718049677e-01 5.518330496597787307e-04 2.459530847781969398e-01
3.453745875579014926e-03 2.238824199782019856e-03 3.543341063939275080e-03 3.235400246641784508e-03 2.762660858941488363e-03 2.419378328303170289e-01 2.506051998393954774e-03 5.011057580390329003e-01 2.154395657125985075e-01 7.899019498953388507e-02 2.380697482413013377e-03 2.286897015999557557e-03 4.771957941081367630e-03 5.091748484954581808e-03 2.393880549678501640e-03 2.567623317744918265e-03 1.354776989807545892e-02 1.385883489269751356e-02 5.497580353581400445e-03 2.399693463159121350e-03 6.818122920819860711e-02 3.258585172960651311e-02 3.340715109182383624e-02 3.501736831296203833e-02 1.910372767305371436e-02 2.458829446656453366e-02 2.310311633914513552e-01 3.988879947876523557e-01 5.979663907496051041e-04 1.319468672532798370e-01
2.862155811223434255e-03 1.489377914742510750e-03 3.295731893733268043e-03 2.760216455433680150e-03 3.420191057956059599e-03 1.394783994944586158e-01 1.200018559770817950e-01 1.069003718476052439e-01 6.854758752979846215e-02 1.213343231167774349e-03 1.872203216848682822e-02 3.061081490076569128e-02 6.246276240736060859e-02 3.070799032887053595e-02 5.649946948973769666e-03 1.093392555007820233e-02 2.011236027293217266e-02 5.523994457151352316e-03 1.310204347850956515e-03 1.379134078343775827e-01 4.725484582193480859e-02 3.289086293883023565e-02 3.889260270393552626e-02 5.277154276840504560e-02 5.539401815342672591e-02 2.981229964727861309e-02 4.694001091046462459e-02 3.756550691659329977e-02 3.358319593186434582e-02 2.398938228780502641e-02
2.187749536822317653e-01 1.285136053115881749e-01 2.696454308006988442e-03 2.607659590660347908e-03 1.994432845038182633e-03 2.033220879578450380e-01 8.053028120289047742e-02 5.259334924599784467e-02 6.610867988503101034e-02 2.343586945252628707e-03 5.587305782766082730e-03 3.574785337818620068e-02 6.342664154593527504e-02 3.300764900524294498e-02 1.199036000293489217e-02 1.350726464412753403e-02 1.487558717820590404e-02 8.780370022147595405e-03 2.162351569964819122e-03 2.968363453794137796e-01 4.392389406832600263e-02 3.890497774508564627e-02 4.383103519833236872e-02 7.737227931580757667e-02 7.333369253920808684e-02 5.182867821034401606e-02 3.935099359702799726e-02 3.510928363506726768e-02 3.689909730565568702e-02 3.874833481892330650e-02
4.238582548623930774e-02 1.094224827869403199e-01 2.668324998185011010e-01 1.750242870530040575e-03 4.947038602295747989e-01 1.582640983345140473e-01 8.194684319228497105e-02 6.925097660831683322e-02 8.818419052226493526e-02 1.155229444805502565e-03 2.017508542541411043e-01 1.128851389861203550e-02 4.696119253605423455e-02 2.019035667626505395e-02 6.399246087642799195e-03 7.436967696176330182e-03 2.756622200294124841e-03 4.061339063605175562e-03 4.644239690187248158e-03 1.734563685465041446e-03 5.285039584550557668e-02 4.732737903728296419e-02 5.685969371054398064e-02 9.711310351507546068e-02 1.267009059736326493e-01 1.185688746276132716e-01 8.723134823580563912e-02 7.736023238126933654e-02 5.732715473502290882e-02 4.298716841855430154e-02
3.378175211822646157e-02 9.732337050238687448e-02 1.782408149899239458e-01 1.301080221182803753e-01 7.693861845168926961e-02 3.055890416481068517e-01 2.162618764516370615e-03 1.770638725564231903e-03 1.263120353863587952e-01 3.841873109449232132e-02 1.521099398007118020e-01 1.808021284185720896e-03 2.116067482508534464e-02 2.889643060332424893e-02 3.119120508507351730e-02 4.255508138316232980e-02 3.860768546459417139e-02 2.518016537618757503e-02 6.908622608696127210e-02 3.235175709504679864e-02 2.660483582540764703e-03 3.294992831124515242e-01 2.476614252987299758e-01 1.403536723428611219e-03 3.231807194107374007e-03 2.982808659538970300e-03 7.995571490924762575e-03 2.438956289702873606e-03 9.178364263292690395e-02 8.587480625568529036e-02
3.046899263225138349e-02 3.068735799144664544e-02 8.520476943539247172e-02 1.388178172138826308e-03 2.323671390485282373e-01 5.484173010148350735e-02 1.431205463256253300e-03 4.039556705591888439e-03 2.663899348007525529e-03 1.541145655973256701e-01 3.266769793582650627e-01 8.895098980660046811e-03 1.866955994219926876e-02 2.391383401954916624e-02 2.185238292145727859e-02 2.671949504281444579e-02 4.610784479121422114e-02 8.052621699113132747e-02 8.305869145196669023e-02 6.636064276274386553e-02 2.836133963088544475e-03 2.952266579036370332e-03 2.580568489975878978e-03 8.028300334724252155e-03 1.139950147114755785e-02 5.740089605592208627e-02 5.628413510770933353e-02 1.072619014459373979e-02 1.060816575789809979e-01 6.197834718718528424e-02
2.676444321256106484e-02 2.924406636323253345e-02 6.768868197917730922e-02 7.530626438675788736e-02 5.007932654080658741e-02 5.725318419190807140e-02 4.073157995831038769e-01 2.162410758576913550e-03 4.437425127835471425e-03 1.568036407217790820e-03 1.592974611221780693e-03 1.347152669103217825e-03 1.035922173610178375e-02 2.128967037600097700e-02 2.017440392349527378e-02 3.131487877209606502e-02 5.490460042086689474e-02 6.783258164959392322e-02 4.005372152237924449e-02 8.903219642449595669e-03 5.324818901865441961e-03 3.627043922381920082e-02 5.201256242741430363e-02 8.637617705659597633e-02 7.990414236650375535e-02 1.020188856517550008e-01 8.021781034052705150e-02 2.214675187477147672e-02 1.656844454216447049e-01 7.363695566436703754e-02
3.248963996472722937e-02 3.771849265116395539e-02 3.780683043100734053e-02 3.641678822375930824e-02 5.599178685031291208e-02 1.171484395337217960e-01 1.253395189945760539e-02 4.176790919451445899e-02 2.032536731052217438e-02 3.419890569739107104e-03 2.482943636414435083e-03 3.729834909313415377e-03 7.285729932444013832e-03 1.091393285612738892e-02 1.460453891853619179e-02 2.651753975814165332e-02 5.824736330437142034e-02 6.039758623173006880e-02 2.948523800365356051e-02 1.031706706372467058e-02 4.390321151291890628e-02 7.827202343343464541e-02 9.874345656917703218e-02 1.001926746510216765e-01 8.676454045901794976e-02 7.330210419822630330e-02 1.056803176529512028e-01 1.811771252839012442e-02 2.450995241025821503e-01 1.035766910342270641e-01
7.794919501638455928e-02 6.141418044806248866e-02 3.269002167795526798e-02 5.217588922544017654e-02 1.183801155916340987e-03 5.972454507656743336e-03 3.345343969665455497e-02 2.726043655602685550e-02 2.679914262344491524e-02 1.322423362695522922e-02 4.736023682457329159e-03 1.226085757641118268e-03 1.184893959216641026e-03 3.101730703083681578e-03 7.067370707883952746e-03 3.285355066439756694e-02 3.549426603989037921e-02 4.299930287577701654e-02 7.732913725446120823e-03 1.388868191620055807e-02 4.841145736293567953e-02 1.027991434097566270e-01 1.248365512662640980e-01 1.275771425234803191e-01 1.032879778087911482e-01 9.634736652241486510e-02 8.665510176833397804e-02 6.867778319692563471e-02 3.045424872177394677e-03 2.005526209746750447e-03
3.526688659422166222e-02 9.791422692902265745e-02 1.845529773422331377e-01 2.155107385917417236e-03 4.645116625924136655e-03 6.541949789363651728e-03 2.077798506717836585e-02 2.596070011724772517e-02 1.786565704306890615e-02 1.375228887261544311e-02 2.841246904146134660e-03 1.989317744269910870e-01 2.974461424354133410e-01 1.167628282851084984e-03 2.545495232807170292e-03 1.508388753122360919e-02 5.906492543015468694e-03 1.954417179815363080e-03 3.125095280511520079e-01 4.959650072382876078e-03 1.868687342583424255e-02 9.863320395813178487e-02 1.240574573478964993e-01 1.279982821632373868e-01 9.135543422742639641e-02 4.092112926420201496e-02 6.407124187265622606e-02 4.397434609567628383e-02 3.964968647983782221e-03 1.565040541291515697e-03
1.607298589081835889e-03 2.003454571581191664e-03 1.300263651866161814e-03 1.559975627859655663e-03 3.550172625938174432e-03 2.024252628732219322e-03 1.050080740498290401e-02 1.359297313554997527e-02 1.261091523690030178e-02 2.960578878235952012e-03 7.392163655950521753e-04 1.198126560241584426e-01 2.042447223247105537e-01 8.006490297884151812e-04 3.174172575933826949e-03 2.132007016215215368e-03 3.984417495465662935e-03 1.209552740658748982e-03 2.320469787559223049e-03 1.112218752100525669e-02 5.995268168263385294e-02 1.140236890659399455e-01 1.231958158044655083e-01 1.153876115481116682e-01 8.622094063957400079e-02 6.116716620042941810e-02 5.745591652007931566e-02 3.871034426996206729e-02 3.485032359145358739e-03 4.937189229243363342e-01
4.447683013722855336e-03 3.933747380372925456e-03 1.947629822497298335e-03 1.342376351780866315e-03 1.666693303074137742e-03 8.868564162555543249e-04 5.088974244825196155e-03 4.556950123578739839e-03 1.259951366866121072e-03 6.927101169469690629e-04 2.039093822186670846e-01 1.597889136356789863e-01 9.292392567937303449e-02 4.949288634113781227e-02 1.235842585324041648e-01 4.001618563643258852e-01 2.123405065432007986e-03 4.943455194615363132e-03 4.849410978589615770e-03 2.203074067937797406e-02 6.119685862086973044e-02 9.051987360121610537e-02 3.761492528171142546e-02 5.569145900619121986e-02 6.993020705921954017e-02 3.838073048932043319e-02 2.783170912709933068e-02 2.285786759141386626e-02 3.225372685794274386e-01 2.941496840950649783e-01
3.577657432327359388e-03 3.975396841561865298e-03 4.043458017753405742e-01 2.945650351703938963e-01 2.556488616908217382e-01 4.253012740570524960e-04 6.108649337786803803e-04 1.474034208472836394e-01 1.947351668812566938e-01 3.019691875385330584e-02 3.923344726334824367e-02 5.913400678388436305e-02 6.413655672744962566e-02 2.217297840486760485e-01 8.148414401861062747e-04 1.061574430196830093e-02 2.048071980751373783e-02 3.004275838416854000e-02 2.079048513114763880e-02 1.599080838172305466e-02 1.168330013976226489e-02 4.316430048691352606e-03 1.721277804402756000e-03 3.667666052994044031e-03 1.296249222906296558e-02 4.271868353387646249e-03 3.853403125543070334e-03 4.876901218466634380e-01 5.587654065347725379e-02 4.566167969508218294e-02
7.579244546732521841e-03 5.646717573501317498e-03 4.214841459929697387e-01 1.895105686420546498e-01 2.905564404529538125e-01 2.333829749825016842e-01 3.966946774861810948e-04 4.043371570922525693e-02 3.465021106204392576e-02 1.489134741079823493e-02 3.505889218642097016e-02 6.584377155542776860e-02 8.633240371166175930e-02 5.811317083439036368e-04 9.858885369672214238e-04 6.330388990012482744e-03 2.314120227593992329e-02 4.342668976165112160e-02 4.957003239898416513e-02 4.402486121994477614e-02 9.759403920124205822e-03 2.260764000415627778e-03 2.894862010403683340e-03 7.023275097768612481e-03 1.536073778066960466e-02 4.447640134586844374e-03 6.135276217032880064e-01 2.366967209557958585e-01 7.433162905191449676e-02 6.645154146613803381e-02
9.363673800868299937e-03 1.155332506468682982e-03 2.245326360372029151e-01 7.592783949081723105e-02 8.924859000885199123e-02 2.002074864105038432e-01 2.640224517491143730e-01 3.019029966134624890e-02 1.690523117073926967e-02 1.938716025533611734e-02 3.409264015852755958e-02 5.782525249004608070e-02 6.481701172088022433e-02 3.534972420558613604e-01 1.836690585009258248e-03 9.256073605153984293e-03 1.782007183997768099e-02 4.093777036722039825e-02 5.132607018062201182e-02 4.428632443981662947e-02 2.317407094929961262e-02 1.393349320824365445e-03 4.456785784797007710e-01 2.211852294534751885e-03 1.258924708796517467e-02 7.453558580094535660e-03 6.659014292487121754e-03 4.461877508437429585e-01 6.779678447405815267e-02 5.168101522840055917e-02
5.129848763666325709e-03 1.546467198798723514e-03 5.865674882656304791e-04 4.110942391841193588e-01 1.095396622797003422e-03 7.343422629367370776e-04 2.777598006053786928e-01 1.161320651134480630e-01 1.764880123101326137e-01 2.279877869060158990e-01 2.106510933042905764e-02 2.357613195127757424e-02 3.656274277325917421e-02 8.229580222159056657e-02 6.674097869974023522e-04 2.892605772199222016e-03 2.897775735478120250e-03 1.229889561069262907e-02 1.563384032881437458e-02 1.368745696167828450e-02 1.212540528754704056e-02 1.640320109799742014e-03 1.157001632239827993e-01 2.192340750787091508e-01 2.267434517284624886e-03 5.641602114744329391e-03 1.510391165261326663e-02 8.426686802945592900e-03 8.220232175622163573e-02 6.135684752547287263e-02
1.832457488806788675e-03 7.082146368659052605e-04 7.388969193337827741e-04 1.197106513852171832e-03 6.144229633391421743e-04 2.412197315031460176e-01 1.134134458323031447e-01 8.136151622300465125e-02 2.612977819670360136e-01 1.047358103209517291e-03 6.764924058504954985e-02 2.315310381168356885e-02 3.900541405130754369e-02 8.523105006622715141e-02 4.022423265840383011e-01 1.039157185295867380e-03 4.705634022276020123e-01 2.233552253219044936e-01 3.378091151437965789e-01 1.030857997701652672e-03 1.932559815314584435e-03 2.286816729596567455e-01 1.153920447434131497e-01 5.849644679352125065e-01 3.181561729515568898e-03 4.735107335716425836e-01 3.938626347089757736e-03 4.366784707251691530e-03 6.269578762790770643e-01 9.485320414426413882e-02
1.857440592828789013e-03 1.452641972395455564e-03 6.912556236234141879e-04 3.825994968102670590e-01 3.650781899354081372e-01 1.402764633562779140e-01 9.473957943683915250e-02 9.910530570336083256e-02 1.109841115927005517e-01 4.390892067546626754e-01 1.227454703860272334e-01 1.156065267426766019e-01 1.087189535558113762e-01 1.350020609742611233e-01 3.898263864114075994e-01 2.724146328139868123e-01 1.830978996667814718e-01 1.088523387264880848e-01 9.507256127597162043e-02 7.262062734907995254e-02 5.787661611683130730e-02 8.468302544490609318e-02 1.349537046751302927e-01 3.384873767807382028e-01 5.967145544414022007e-01 2.870774107472273129e-01 4.586648342608010132e-01 2.902675027723630730e-01 2.877873433208709697e-01 1.831643436204983821e-01
2.515880645838405177e-03 1.278718720892236399e-03 7.102861228264601258e-04 9.340737078101606344e-04 7.708686622118829509e-04 3.673328409194582811e-01 1.394245632465729865e-03 1.042744794256001643e-03 1.493682788065882616e-01 1.073749390951823784e-01 3.790657169967988349e-02 8.621575521612132031e-02 2.551064906694541223e-01 2.828305895505387468e-01 1.188141757762502899e-03 9.640578341275044157e-04 2.090116786927436188e-01 2.471536729544447364e-01 1.136230908332597211e-01 4.924822712593043827e-02 4.477008088182175827e-02 6.840103408641264038e-02 1.064721460955487947e-01 3.403090648859197764e-01 3.585446284174997889e-01 8.781177959305314085e-02 9.893371417508430021e-02 1.236914562649321092e-01 3.891619851749941184e-01 8.011605047079475850e-02
3.371385064731603504e-03 2.843866392342906009e-03 8.420031503821864350e-04 2.772713396072214957e-03 3.022442776906400942e-03 5.596587196605100345e-03 3.742543206703733208e-03 4.011828485413306833e-01 1.472790354964008674e-01 8.437643704975927861e-02 2.468278081261504261e-02 3.056084086021402038e-02 3.822370474965657017e-02 1.548303788477555509e-01 1.968030030161857513e-01 8.997178904773964203e-02 8.790289561262208673e-02 1.049832957517004423e-01 1.418272777339510127e-01 7.705913096107649962e-02 4.180976317696367267e-02 5.662879198922565055e-02 6.346336601275635869e-02 1.121558316828694807e-01 3.702888297886127167e-01 6.070042728303443047e-02 8.986526257874932755e-02 1.445509221422799084e-01 1.673989737788049714e-01 3.370092018535185696e-01
1.827321950061332797e-03 4.427473792987318517e-03 1.287027920695714596e-03 1.324239980245194535e-03 6.055497157810477322e-03 6.271943954054071298e-03 4.148439035943495869e-03 2.740393229043964762e-01 1.966637412289813647e-01 1.851208259907036469e-01 7.577854234314761184e-02 3.740705927087660532e-02 2.420170341490653076e-02 4.326960754631216377e-02 2.120590058560674618e-01 6.326024670061246302e-02 2.257674990261427372e-01 2.343449843476355654e-03 4.362708659487754201e-03 3.221930342243062295e-01 6.294387878290023941e-02 7.942522256447288875e-02 6.736915875952528832e-02 7.755652901821820377e-02 1.080275938967134308e-01 8.608391772045503876e-02 1.034919861810010000e-01 1.261991928457461554e-01 1.628171029722177698e-01 4.044538043850821607e-01
