4.761258901436526969e-03 6.977742014291533554e-03 6.151388216524276628e-03 7.852918777228887551e-03 6.044269734162711211e-03 1.339603098292465114e-02 1.343424499403583945e-02 3.675953567307192749e-02 6.727113296714956614e-02 3.062159581138210879e-02 1.430598565025907945e-02 3.295360076356729749e-03 1.949097547763128154e-03 7.289471184783238682e-03 8.475740997910714836e-03 1.854605141437508245e-03 6.560063674052177447e-03 1.159462061862979489e-02 1.058005507945030364e-02 3.743442521514790157e-03 2.993085738511818035e-03 4.511242699631101477e-04 1.191036151664798606e-02 1.324059518546794089e-03 2.298075822462941620e-03 1.714278020772989951e-03 7.591654296018704754e-04 2.790492117508482431e-03 2.722602797602930932e-03 3.440596162926048279e-03
3.724208361079210921e-03 8.187093675302100151e-03 1.478126777303602132e-02 1.218283149633041067e-02 8.535036964554701053e-03 3.846323797019074453e-02 1.843827065155079908e-02 2.366313521740328468e-02 1.563385042113635964e-02 1.354839769581758606e-02 9.641760785402820125e-03 1.903192117797957968e-03 2.554312159348503131e-03 5.884314028068446736e-03 8.290420657712918584e-03 5.336499917649121377e-03 6.651134015824775036e-03 2.202416372448123133e-02 1.680383493173870021e-02 5.096211511802891531e-03 1.791974368242083742e-03 4.203507185252473833e-04 8.906540580339761173e-04 7.566492840537043579e-04 5.890183446975133345e-04 7.350722696603327177e-04 1.064532089403804130e-02 2.832103811196798847e-03 4.124559221834816873e-03 4.136514535754394831e-03
4.458358229328020228e-02 4.482912918139083519e-02 9.492378323070378709e-02 7.743843323455854022e-02 1.639473416025536145e-01 1.676346463137379922e-02 3.141084461689818471e-03 3.432074196073422925e-03 5.608501172826697856e-02 1.740053246776706447e-02 4.722312035428014726e-02 3.180501509154069067e-02 1.185378325709680707e-02 1.757880742464663568e-02 3.424940421943843162e-03 1.457947612673444332e-02 9.903577518297615109e-03 2.053670966952607368e-02 6.934422153369879105e-02 1.168456549780712631e-02 1.107283677904979252e-03 3.318093551874286436e-04 5.159730005536159380e-04 6.749654632208360212e-03 3.916070462728211445e-03 2.552332796417308008e-03 2.229085950141400027e-03 1.788340796567594896e-03 3.056178923196962993e-03 3.430354840982343702e-03
2.092798667901950987e-02 5.934746414756883470e-02 1.304201184597425234e-01 1.055243253638245421e-01 4.282449439372133793e-02 6.640049963648923109e-03 5.295067989989559604e-03 3.637700419914977577e-03 2.273830669273741584e-03 2.174487789403850915e-02 1.419674365827517867e-02 2.848172177813372563e-02 1.303952157519811320e-02 8.741814091572649298e-03 2.603671324852596322e-03 2.000705903631083346e-03 4.219023787175498093e-03 7.972273893197394726e-03 5.694688005780611066e-03 4.900533920753868435e-03 2.198872628327283585e-03 7.650025649575637821e-04 8.695645835803218412e-03 4.646805399231583502e-04 3.229271811761237794e-03 2.352099995252356947e-03 1.970039880646250186e-03 1.868473296600699999e-03 3.691379401803161764e-03 4.017935735064166909e-03
1.213046396423952608e-02 3.732055546984658356e-02 1.044051617973933699e-01 4.045380626723869832e-02 2.280765236678439570e-02 3.341926752510139976e-03 5.195212675723188608e-03 2.940564741434231830e-03 1.401123726081218365e-03 4.996977195178606279e-02 6.405102707253719496e-02 5.465733635892665310e-02 8.112380250997412723e-03 6.693850541176634208e-03 3.134084978728874076e-03 1.168185285800534684e-03 1.259778161944515029e-02 7.298341513463860696e-03 1.179082817729666492e-02 6.819222697067086995e-03 4.701065741628858083e-03 1.316452878732144198e-03 2.854091673533633387e-03 7.879359471968456130e-04 5.758678125315446969e-03 3.174392283751584134e-03 2.176080810241334471e-03 2.511510461675850112e-03 3.832153851772673262e-03 4.132196119158617741e-04
1.214574073476141700e-02 1.260807520977900130e-02 5.661048117575383926e-02 4.537030000765029242e-02 1.783190920021859860e-02 1.933173218010467804e-03 2.403072693347841834e-03 2.622954511471372891e-03 2.530620770749843641e-03 7.803034582267628916e-02 6.228876882088846267e-02 3.274287284579622398e-02 3.727598554261003349e-03 1.215286681757555241e-03 9.187712890106347358e-04 1.497870165730119186e-03 7.028227105871600287e-03 1.851002517208279055e-03 6.019993350008165205e-03 2.088854009786545590e-02 2.530449449124598169e-02 1.484808665725477310e-02 3.632399860625112539e-03 4.810116184006682852e-04 8.536652125534685553e-03 8.381081119746707636e-03 5.214133058153463084e-03 3.583333785750350813e-03 4.507066037918999214e-03 8.118902334627494874e-03
1.709051943664217357e-03 2.684985355201979784e-03 2.842931977403060327e-03 1.442298866427605894e-02 6.906027377664868475e-03 1.160509929597839350e-02 1.795667893106296306e-02 1.043297940538559336e-02 1.270099309731157616e-02 1.498211681715714075e-02 1.167971952413300596e-02 4.811319953553515327e-03 2.018508785615102073e-03 8.935191634786510346e-04 7.013093254063150483e-03 7.936956672379107255e-04 3.975078950975296718e-03 1.902541098672398808e-03 9.768613458529386978e-03 1.341863614069436009e-02 6.138197074519569953e-03 1.540892335581235196e-03 6.422600243152808749e-04 5.561377457418078835e-04 5.898828965829037464e-03 6.278666756508454426e-03 5.548717515747880052e-03 4.772254989323986528e-03 5.199544892258512255e-03 3.991394347115802786e-04
3.775494584428751819e-03 6.870742525182099193e-03 4.028788824618052822e-03 8.703493049084668268e-03 1.342627492229486567e-02 1.528536301746283126e-02 1.375143320830130717e-02 1.315803324659036919e-02 1.061824788916915577e-02 6.000622054018001604e-03 2.437321542500313874e-03 7.603982081046047059e-03 1.667765327542683820e-03 8.110986518437586848e-03 9.164748891281963503e-03 1.137418995775284995e-03 8.076216981405072437e-03 1.313236436946289137e-02 1.163091116161840688e-02 8.278654682656113803e-03 2.235653240012453694e-03 1.119598069806935700e-03 1.043425701136230579e-02 9.105825819264079871e-03 4.563781477457046383e-03 4.722252109587907892e-03 7.069823262755734958e-03 8.183004305815085727e-03 7.816313799920321034e-03 8.028629502166508046e-04
1.031780847072691180e-02 6.789137820050771856e-03 3.971162795595511649e-03 2.309361162106040796e-02 1.498412087838004066e-02 6.386650549006915242e-03 2.065674161143361137e-02 9.345640981665605251e-03 7.792585379321781761e-03 7.751097065733850849e-03 6.979523659369078065e-03 9.318751421147158931e-03 2.097898003939191805e-02 1.429138814084909143e-02 2.115294662438890836e-03 1.873848626717361607e-03 7.898540758905957943e-03 2.442825961155094261e-02 2.428920289124343254e-02 4.042394140666942873e-03 7.109921794959881943e-04 6.850079471751387324e-04 7.660564511550081940e-04 8.791088303790316541e-03 5.302982911820590742e-03 7.747722373297815691e-03 9.488095080621263347e-04 1.811893260777741599e-03 5.372454254855647468e-03 2.717134791865663274e-03
1.763693831003961682e-02 1.161656767972711786e-02 1.845858083043414727e-02 1.739084413211260463e-02 1.517564425863969502e-02 2.994703622169202911e-03 1.374188867200179173e-02 5.846525302067746670e-03 2.415718912004506062e-03 9.187284199055046306e-04 1.362428140931041393e-02 1.353274505667221780e-02 2.876230290541086088e-02 3.091652380152232205e-02 1.457851341997061685e-02 1.596783981280873108e-02 8.689382620218151498e-02 9.131773966918023400e-02 3.684092727540105167e-02 1.643662772835998917e-02 1.046304724365345554e-03 9.512472065603041343e-03 1.046802927835935489e-02 5.782931626504286219e-04 6.362031638163311888e-03 8.111098726572844170e-03 2.702755021859222159e-03 4.342465925523854818e-03 5.975752502573363975e-03 1.641457151716603285e-03
1.481617951415395255e-02 7.871230479130056704e-03 1.752339883012542926e-02 1.511954155386476505e-02 1.907516772419809090e-02 1.744818436717707763e-03 1.437283484798332909e-03 1.235524602651398183e-03 7.559759400886012417e-04 6.870844343290967784e-03 1.098570826139203260e-01 1.872450179682883242e-01 3.881437738517140024e-01 1.894591242490739624e-01 3.452232376693295524e-02 6.745807500879505425e-02 1.270276648575719147e-01 3.543990931629375368e-02 8.473222671753162516e-03 1.806351653735291905e-03 8.924298650333715695e-04 9.417577475315346003e-03 8.210424838998031660e-04 7.648995483875437994e-04 7.455970111243278827e-04 8.971458252211643794e-03 6.499840919055683772e-04 5.968388743299757500e-04 1.008835391318904477e-02 7.443262610160527974e-03
3.117665452020136965e-03 1.829589764885929939e-03 1.434809060213013653e-02 1.431291741361153010e-02 1.112269070713926659e-02 2.516886440902435951e-03 9.507421723823122808e-04 5.980533532547637398e-04 7.246537727937792887e-04 1.370684936060546748e-02 3.386294255246950768e-02 2.256384411817757008e-01 4.043287480800907274e-01 2.055740818185761709e-01 7.251235846163232857e-02 8.049617755918020423e-02 8.938517032560686082e-02 5.297297584075106452e-02 1.305051826341560757e-02 3.961290316220530787e-03 1.052427890654113359e-02 1.023280938776607515e-02 7.640498313952591046e-04 9.534272839085302211e-04 9.404879158356200652e-04 6.544094869685841654e-04 5.652319942349438549e-04 1.060460691428830385e-02 1.115964037646469294e-02 6.567698191969011503e-04
8.345150393510457690e-03 1.878916537748588720e-03 3.329984881386399004e-03 9.543338854247972874e-03 6.249762988039417495e-03 1.954217340693471111e-03 9.738656436188511140e-04 7.888688614453735542e-04 9.832716642018369483e-04 7.084661802948284161e-03 2.376452562716014228e-03 7.192504997890222795e-02 3.011280767941711956e-01 1.258664275714544700e-01 3.850096712476900468e-02 4.343986168460296088e-02 1.607435886416811247e-02 2.371189982509997601e-02 2.711468498481939271e-02 1.073319660926102051e-02 8.259486231324028420e-04 7.685418264600547703e-04 8.752220217537100971e-04 1.263632367479513609e-03 1.648589433905080053e-03 1.537281824370254502e-03 1.253533589395837075e-03 1.301216393470073368e-03 1.013377761247820407e-03 7.124620192201326163e-04
7.282811348668980986e-03 2.347958218185010239e-03 2.541147047258870539e-03 1.637344608911096453e-03 9.760668234548136027e-04 3.762246125611392721e-03 1.274828374738680090e-02 1.082235479668003722e-02 1.407187330564736022e-03 8.619330424513889019e-03 1.763679630579962580e-03 1.177016545481909642e-02 1.375632481286277464e-01 1.799918318916732818e-01 1.853520881697139355e-01 2.419682142481874854e-01 2.181092916812159554e-01 1.427128611487465948e-01 3.928234831958329343e-01 1.831178465246243170e-01 1.510688510532519520e-02 4.381581626667588325e-03 3.325084793708760894e-03 8.435290070013427149e-03 1.983458602082102673e-02 1.880747547148071616e-02 5.195895259636593155e-02 1.717387271918681749e-02 1.359980256956561063e-03 1.287778783798983239e-03
6.937824768776080543e-03 6.515609883927083769e-03 1.458936314108112437e-03 7.802108891205822121e-03 2.840795475532616014e-03 6.543631979487083512e-04 8.474869397103431193e-03 2.452186287635025122e-02 1.675706245627755359e-02 1.729627793688906772e-03 3.710893094802210617e-03 5.867905505597698773e-02 1.238804810153910640e-01 1.521293319436128055e-01 1.328178364762856722e-01 1.552108816863767282e-01 2.653201986137991852e-01 4.616920993327163769e-01 4.727221973556754997e-01 3.727552514204959810e-01 1.601918907241402928e-02 1.686718153574910672e-02 1.530174451758193471e-02 4.846622004225145663e-02 7.041624746277364011e-02 3.639992484020028729e-01 3.671001101204408035e-01 7.452943207305005868e-02 1.635340622188454288e-03 9.621918123715689306e-04
6.521198936106579157e-03 6.760252793526843641e-03 1.545539141243280163e-03 1.113465166549433864e-03 6.226445114657354297e-04 6.563614775140194819e-04 4.625782320358219277e-03 1.307063988100529671e-02 2.694627247076291504e-02 9.725537191207203960e-03 1.019842626674751646e-02 9.116994686468711528e-03 7.076597270116599669e-02 1.386356404020526178e-01 1.250495940677167628e-01 1.856710451828717245e-01 3.221326333488563343e-01 3.933744877120315397e-01 2.281027514916290910e-01 4.994281574940816204e-02 3.046432298795693702e-02 2.132131068322167256e-01 3.178552340746076954e-01 5.364023884507563844e-01 5.067339562089310245e-01 6.663414376060106115e-01 5.369727405608714088e-01 1.535474365079663728e-01 2.591088434304697312e-03 1.155823496560943022e-03
7.989236547251256718e-03 8.998236345162984734e-03 8.657595482873321757e-03 8.037023258875588411e-03 6.679088985405514690e-04 1.296500731593312750e-03 7.557568625799628015e-02 2.523169477478084954e-01 1.222014906922275629e-01 2.125923183430367819e-02 1.609130976410515224e-02 2.573640482496641207e-02 5.083601641753375533e-02 7.263608809925249654e-02 9.313048611147506373e-02 1.623574686551809421e-01 3.500989252242067140e-01 3.524687092643147834e-01 1.669128326227239389e-01 5.767429600189861311e-02 2.547125816023713130e-01 4.738833183584502673e-01 6.230535243607554508e-01 6.413606199163851551e-01 5.647645589579335379e-01 4.901231177348855939e-01 7.274326491772489245e-01 1.259100009972096146e-01 3.976980267698283431e-03 1.649787457481399983e-03
1.557456452400085307e-03 1.413837766879949337e-03 7.794744708310282107e-03 7.770803533357164596e-04 7.961159057184884202e-03 3.761306837170589473e-02 2.084547982033968516e-01 1.686332858036071747e-01 1.641454322503063112e-01 8.349094806819100378e-02 3.120250309306711947e-02 8.638394814187471543e-03 8.444584623651303981e-03 2.103581099901582693e-02 4.623208883778540113e-02 2.070646242549100402e-01 2.170110462239524252e-01 2.517369106520288002e-01 4.378110625259789418e-02 7.791080934130951985e-02 2.839977150561796004e-01 6.311001965677288661e-01 7.978312141623554732e-01 8.264518920393669754e-01 6.786373297090444456e-01 6.555377922078280406e-01 6.109339193660383582e-01 4.778581924286188221e-01 2.097731625239166592e-02 1.364109687802802541e-02
7.868784454932969963e-03 1.148923265728488520e-03 2.069409489386478309e-03 1.445035956217684790e-02 3.120269341252701611e-02 4.397224777285100444e-02 1.362195775297826705e-01 1.673832156634874890e-01 1.128694860563571462e-01 8.880572421026791674e-02 1.883975425878420609e-02 1.878001573622007552e-03 2.858202510599624872e-03 7.940211347972490202e-03 1.704992961120910949e-02 9.904063339213441119e-02 3.761556587945803776e-02 1.193844643764423348e-02 3.991277919644270998e-03 2.908498288950352520e-02 1.119859773233055356e-01 6.025810965494733384e-01 7.690451717911727103e-01 8.054014253443673166e-01 5.886316164548601737e-01 2.742207399559630776e-01 4.479447713777860440e-01 3.033411403931656203e-01 2.714113203304618915e-02 1.051436108027112466e-02
1.016395433875073168e-02 1.319229323099749794e-02 8.651242254679331403e-03 1.084524003500195871e-02 2.565877632453949023e-02 1.453353720012437802e-02 7.295497427643420074e-02 9.196041785792509471e-02 8.262227998338932122e-02 1.955209103511242746e-02 4.938437987784085811e-03 1.055699862082666108e-03 1.864025569523586551e-03 5.495638939198687310e-03 2.177310546847309111e-02 1.460376933326556353e-02 2.650278971776628620e-02 7.781159872939671235e-03 1.458084841238317143e-02 6.910760904961821272e-02 3.700399451100077064e-01 6.942666928941484406e-01 7.381596288439326026e-01 7.026686131229803456e-01 5.438865888699692119e-01 4.025024811251632917e-01 3.938981414313078022e-01 2.623534417749193715e-01 2.344919733228773007e-02 8.219461702057355781e-03
2.891000859458338693e-02 2.682026466283261856e-02 1.382884131822180278e-02 9.998088656164569321e-03 1.302529199340361245e-02 6.848254669994870147e-03 3.770395022909432681e-02 3.262228109160150713e-02 8.646840454815216126e-03 4.697510201610636399e-03 1.628300501654391264e-03 1.308864572360920672e-03 8.028263797302633746e-04 4.610336833292150052e-04 1.236128125899371840e-03 4.301208078561659723e-03 1.534159827606180158e-02 3.477753957296680909e-02 3.330517931517249647e-02 1.470277366141513609e-01 3.904141253979892534e-01 5.482893871993096413e-01 2.162937103369861058e-01 3.262784703727117375e-01 4.288489021682231339e-01 2.472400312551756851e-01 1.870365969516937787e-01 1.536621100218002745e-01 6.225032724801013613e-03 5.726904974891896920e-03
2.381200421410283735e-02 2.770597569118374986e-02 4.082190553242553629e-03 2.830697722678827011e-03 2.330992036554924065e-03 3.402160280012203088e-03 4.679328979099621651e-03 1.126966466400496861e-03 1.422580782439399191e-03 2.277513453739083143e-04 3.074909590952649573e-04 4.707453349229125984e-04 5.394014582913274217e-04 2.016745175923786732e-03 5.965368002770393696e-03 8.094319451730423720e-02 1.554604133589500559e-01 2.240358642739169459e-01 1.523435410674380264e-01 1.123876614623752351e-01 7.619788052767643982e-02 2.602896252339686328e-02 9.682021505148616369e-03 2.121282346530212540e-02 7.847820202713717830e-02 2.702640732527709574e-02 2.506808169902355332e-02 8.525080318508628310e-03 1.020318278055704943e-02 9.579523220258130689e-03
5.004791114522792045e-02 3.871391421399684313e-02 4.143400402528044958e-03 1.789778864694920165e-03 2.634641714101155444e-03 2.019197762933618544e-03 3.058647458151599399e-03 3.204527978317558349e-04 2.761619223838209891e-04 4.718883972335112705e-03 2.998318022710423202e-04 5.513494832240005503e-04 7.369820808027249294e-04 4.175856330013788358e-03 7.234804238175540983e-03 4.759463731613251813e-02 1.749017138250641423e-01 3.260087581906328524e-01 3.685791546861815204e-01 3.138441301681606510e-01 6.408153620460396716e-02 1.374428663211794965e-02 1.654548251211892390e-02 4.135831851546381555e-02 9.348727537326330383e-02 2.797789294629276710e-02 1.065883440295098405e-02 4.057548083389084063e-03 1.860267795600387087e-03 1.732838418244431276e-03
6.235878532654626216e-02 7.954589025131289168e-03 2.166052668883772063e-03 7.111359216053208133e-04 8.089183559806057203e-04 1.749942058309169116e-03 2.228364977590307355e-03 9.643996309210074377e-03 5.470005191687535642e-03 6.298011308620466049e-03 1.106201004433385315e-02 5.182350741543698472e-04 5.743702498796286445e-04 3.251041011149711450e-03 1.332598528889180310e-02 6.737837799032252162e-02 1.316593496343589631e-01 3.046099804794397681e-01 3.848736162428975649e-01 3.229074790800728345e-01 1.567001340504475260e-01 8.785205569412521398e-03 6.122794711836178523e-03 1.348613465876481905e-02 7.859878532939244822e-02 4.807549079491950372e-02 4.327489222540949199e-02 8.124613405568333405e-03 1.496280805282969003e-03 1.057773288998616577e-02
3.436497342109300773e-02 1.063113871555441785e-02 4.071411372100755197e-03 3.793653110002401848e-03 8.399611383513038571e-03 5.688638312072430599e-03 2.347809893259834770e-03 9.559557083069299046e-04 1.436016611178027053e-03 1.955952686302554235e-03 6.826973904511851772e-03 7.673560284872374231e-03 3.347653565364679356e-04 7.563475060990301844e-04 4.822508285070575308e-03 2.054388416317090224e-02 2.097569790577295812e-02 9.042749211956295496e-02 1.170947669132093721e-01 1.011205004149570985e-01 8.396735171111385787e-02 1.071918170305736356e-02 1.643165356843856147e-03 3.264121417882051481e-03 1.455328019722656845e-02 3.700313134118655284e-02 9.947471958659087621e-02 5.620522364036906887e-02 1.761672781768220189e-03 1.367787770241087790e-03
1.228583843053564217e-02 4.872353848805706551e-03 5.149670089888614202e-03 8.662671316848676029e-03 4.705948953009079366e-03 2.086715803739703536e-03 9.452055529389686607e-04 6.536874776189552545e-04 2.059557970765825852e-03 8.162592395260893224e-03 6.110855365953492442e-04 7.401526320182058236e-03 3.604130414338422173e-04 7.845216806107092227e-04 3.911630729074612456e-03 7.299810925612056078e-03 5.096496068515117030e-03 2.562052102057451458e-03 4.103200369039253573e-03 7.578572751679886303e-03 1.356062640339997412e-02 3.126326982648333815e-03 1.636535000660027531e-03 8.504646738076625245e-03 2.082816949592320235e-02 7.488990436062722446e-03 2.595148137431588231e-02 2.939150698108623783e-02 1.040646915006443116e-02 1.563887167833384693e-03
1.245476166015013417e-02 9.985391173977228169e-03 4.819624435918034959e-03 3.514266746789344170e-03 3.246717901710342771e-03 1.205181987279673426e-03 7.871431008514207699e-04 7.958194106896662127e-04 8.750395606554542275e-04 3.539651320096533042e-03 1.052439464263057534e-03 1.004908382095049714e-03 9.764602204480925729e-04 1.263581229776559707e-03 3.858316381799610680e-03 2.828994532190035570e-03 2.011276551319915278e-03 1.261900972424324485e-03 1.163692703354028473e-03 9.249245032625494009e-04 7.574195914582510349e-04 1.139882566962193170e-03 1.876916476976492982e-03 4.867757851838683258e-03 8.721252159161353018e-03 4.246491320713711472e-03 6.831448041790667662e-03 4.655836464590771238e-03 4.745083579370016139e-03 3.048393756659155841e-03
1.693014436258814467e-02 8.812859342291578038e-03 4.955920279216642806e-03 6.723476653949527274e-03 5.875060011922219813e-03 3.162003712813278491e-03 1.067726535372599123e-02 7.976731795605854561e-03 1.171406796058581954e-03 8.818809581201624524e-04 3.190018243652378740e-04 7.386503737312969785e-04 2.244388980085000942e-03 2.650759748215060149e-03 8.689188944324962444e-03 6.874965738420515948e-03 2.294514953508534818e-03 2.868456321380124033e-03 1.391761330042763775e-03 7.060511347736753672e-04 6.551340049273026312e-04 1.014732812312380082e-03 1.432062634625765572e-03 4.752880111626264781e-03 5.124922156019290874e-03 1.280856802548882524e-03 1.463019262135537967e-03 1.950895969604187104e-03 6.528402717956415663e-03 1.359180503202061597e-03
2.280201475741917144e-02 1.971308389049418811e-02 5.923129325135219163e-03 2.009851110886541614e-02 2.326795978300453399e-02 4.363670632234157437e-02 2.899383525797260067e-02 3.249659901451078074e-03 1.164012719306107158e-03 6.989262889595569076e-04 8.010286547889079733e-03 2.939499595566132041e-04 3.661561664933573722e-04 1.555139522729678207e-03 1.958761001126733958e-03 9.408501431824659034e-04 9.780809573404108167e-04 1.277792385859185349e-03 1.838629213535504427e-03 1.094288507341690045e-03 8.181300990387828029e-03 8.224811486839955776e-04 8.269213515684805922e-04 1.523785715810835458e-03 5.211699715124444229e-03 8.839527228650835696e-04 1.343622878233013268e-03 2.324145441473988993e-03 2.942448439044358013e-03 5.956861850580036886e-03
1.249792725531735128e-02 3.114204293383170119e-02 9.263280779095757131e-03 9.878437103152015036e-03 4.785035428213424424e-02 5.061849418751804969e-02 3.364455095953589048e-02 2.307458770980998306e-03 1.630047773124116296e-03 1.597596966632425751e-03 6.630427065213421621e-04 3.791859699791708051e-04 7.050947083377482119e-03 4.410507917956353109e-04 2.112195367705761110e-03 6.598227618914042540e-04 2.535581204986402278e-03 1.668565080334688186e-02 3.121408909284544703e-02 4.736714524717305572e-03 9.261135364232603046e-04 1.183039270860990200e-03 8.961996855962400203e-04 1.071924161487173600e-03 1.547623120297390463e-03 1.281881798901509089e-03 1.589171586323202129e-03 2.040609938389286067e-03 2.884320492010612486e-03 7.206032257414591614e-03
