3.901808039360423752e-01 5.553029023218863935e-01 4.641387284442181071e-01 5.721899608833255213e-01 3.970905325936642805e-01 4.397885191118428710e-02 3.121205282020321492e-02 8.419010839320245632e-02 1.526948306774427166e-01 6.912078803785479120e-02 4.558275392096664685e-02 2.346189784147316160e-01 1.564873915298239659e-01 5.755115523189904270e-01 5.332986595150005643e-02 1.636243135563878737e-01 6.866041399011519886e-01 3.543588765081254893e-02 2.616295608695412556e-02 5.253904613168469684e-01 4.889838929508716903e-01 7.435631658153597778e-02 5.706477745602631796e-02 2.272739301071222406e-01 4.378506894119162940e-01 3.406352033671069535e-01 1.551188028276727360e-01 1.356327962176407005e-02 1.286264478921664810e-02 1.606074035728604493e-02
2.526422461216416560e-01 5.274704215241657890e-01 1.151469170792620289e-01 7.171455875311887052e-02 4.696026000713375281e-01 1.335116778477060673e-01 5.303119438430178162e-02 6.598516469073098523e-02 3.929382064732472174e-02 3.108813878908751535e-02 3.003712986787379982e-02 1.193021349345049081e-01 1.827131503769472143e-01 4.404165677669081846e-01 5.248751306946248391e-02 4.489082843003125989e-01 2.658158378445775460e-02 6.418177622891377276e-02 3.990518356042077608e-02 1.678623810494765320e-02 2.806446331239969005e-01 7.127752309029827815e-02 1.481814543239825255e-01 1.320713208317945975e-01 1.162179476525344590e-01 1.547553853797356826e-01 5.392738388106117081e-02 1.364735806857973570e-02 1.934237984922049583e-02 1.924615729472171910e-02
1.508651721067692519e-01 1.482790018175743352e-01 2.775606647579264008e-01 2.083505153834110390e-01 4.837641719615088376e-01 7.781207820600609393e-02 2.019792178163825613e-01 2.119269640031379576e-01 1.816191690722924468e-01 4.265184163692857522e-02 1.144634485438594668e-01 8.617941591251893074e-02 4.191265103333902120e-02 7.538700358111834199e-02 2.719114145709409236e-01 6.444828927468994328e-02 3.454018279554060128e-02 4.932820377865428790e-02 1.521329007720488569e-01 3.365711148004914277e-02 1.760139905178363107e-01 5.885804238940849087e-02 8.983578966064205418e-02 3.111261297654753163e-02 1.834492491110451332e-02 1.200336838190300438e-02 1.064485473819426486e-02 8.349392482850558767e-03 1.422493265133407438e-02 1.591222730599845328e-02
5.106170017762735880e-02 1.454500870205589769e-01 3.186625750504454291e-01 2.586262693127301393e-01 1.308570969291570907e-01 4.096873321892325337e-01 4.078021340881936019e-01 2.533813966477314050e-01 1.372450866005391623e-01 5.432825693488526481e-02 3.258868213156339982e-02 7.761518901484927568e-02 5.524634341594281128e-02 5.697193153495701268e-02 2.098366414599688867e-01 1.814266888198450833e-01 3.870679109110113369e-01 1.911720786667200217e-02 1.255461817007523170e-02 5.676746603471575225e-01 3.134595434329632280e-01 1.248395071797388095e-01 4.201564838655932888e-02 8.258298668598949843e-02 1.499974560461361447e-02 1.063028968222797487e-02 9.071475238816260889e-03 8.605254537003817830e-03 1.748093028614047112e-02 1.896657679561058324e-02
2.925584969087493062e-02 9.020745987982964342e-02 2.520942766348513442e-01 9.797629835174284652e-02 7.533869544196777901e-02 2.388069825526855372e-01 4.171421950527336442e-01 2.349401526191814693e-01 8.636913950642878535e-02 1.293348645754993642e-01 1.458311932266163069e-01 1.645424630536991006e-01 5.007821367966220905e-01 5.187001422559712749e-01 2.724841746706463397e-01 1.128462331598835966e-01 7.536139210202257022e-02 3.768247199096744909e-02 3.623377659706188830e-02 2.290119122995031356e-02 5.071552888795070047e-01 1.610929127297754671e-01 4.110975569124544204e-01 1.354919849893176098e-01 2.712854842559599480e-02 1.428822771790671728e-02 9.884105950332192081e-03 1.143241491250766677e-02 1.790347272049613511e-02 6.578875532436201379e-02
4.178842308300560748e-02 4.430533177499917236e-02 1.671114302864524781e-01 1.368375710836611525e-01 6.223529784608609200e-02 1.350573189342160474e-01 1.713762025646888287e-01 1.827906305798117637e-01 1.482865598552663700e-01 1.916203453829263548e-01 1.599954549118758618e-01 1.198244318971329880e-01 2.340504381659943844e-01 8.790431988257922657e-02 7.363807187562178280e-02 1.283961671099829449e-01 6.905781041420530064e-01 1.745388133646381401e-01 5.423551805793548342e-01 6.778567803788264345e-02 7.910730584591384174e-02 7.047613300592124597e-02 5.039941898848413482e-01 7.880809239011268841e-02 4.052347276004378274e-02 3.756481420002488053e-02 2.339378866050047939e-02 1.615701771581650251e-02 2.139485572237841138e-02 3.845298338918849007e-02
1.347454027167454271e-01 2.034519192390059350e-01 2.009461102482580364e-01 6.825887968728021338e-02 4.488390227549453604e-01 4.087173068071537491e-02 6.400305134273283347e-02 3.615868670171271115e-02 4.786159574251983712e-02 5.440613114965992675e-02 5.650308426037804754e-02 2.809610516632183308e-01 1.308999596955745248e-01 6.049809413899644855e-02 3.541049987134912286e-02 6.495483377690927651e-02 3.720698886251049831e-01 1.685895263357233553e-01 3.018780249723140852e-02 4.519238114794743577e-02 5.612405422766348906e-01 1.599909977217778556e-01 7.418498499693290671e-02 7.103691489646823953e-02 2.748283493573114300e-02 2.813611354196528247e-02 2.498970799865626868e-02 2.176864970838701674e-02 2.535683142705903031e-02 5.990408568982850263e-02
2.899440886339568757e-01 5.361620762103237459e-01 2.885948364425950374e-01 5.670974723220124636e-01 5.421123911063494005e-02 4.776939850165574236e-02 4.984737212163536935e-02 6.292289435268552666e-02 7.827642203321025227e-02 4.035779948151411167e-01 1.695762605344934282e-01 5.215562862184035531e-01 1.125656182085820189e-01 3.913665799680374896e-02 4.444340964243718994e-02 8.572255115424944061e-02 6.591149269455808257e-01 6.731457633923504380e-02 3.102635525395096294e-02 2.782186990605623952e-02 2.245993028101586630e-01 1.325502545028340862e-01 5.289254818050202062e-02 4.422898903523964087e-02 2.108529907466299633e-02 2.219170740886090495e-02 3.607527362253801911e-02 4.642175276959204649e-02 4.549667555004058284e-02 1.300258155359953482e-01
6.836903488416689045e-01 4.408083076429516467e-01 2.483774566007348750e-01 1.004481469876055827e-01 5.589518655421300136e-02 3.523518834895713603e-01 1.001492080372828886e-01 5.834152004724235674e-01 5.628801286802668224e-01 5.760319000094509256e-01 5.276051028220105632e-01 6.653559095039097704e-01 1.014899319201238159e-01 4.003377664860188756e-02 1.413191439121870840e-01 1.235185084149907631e-01 4.970504430626353498e-01 8.433727486463651890e-02 5.656337784799234103e-02 2.950198978164448316e-01 5.895065527240378467e-02 6.154118706715614590e-02 6.691846283129465611e-02 4.373482660706779629e-02 2.566857530413733240e-02 3.938637565426594822e-02 1.568694073200121442e-01 3.119464196175334436e-01 8.754064909071738176e-01 4.194771149006752409e-01
1.217887162650935773e-01 8.130321748345151200e-02 8.383235716642035984e-02 4.723976078232002690e-02 4.572867974803090235e-02 1.679394742202440782e-01 8.432997429756114438e-02 4.000513088316329235e-01 1.950363825546608254e-01 7.032750587641015128e-02 9.159928747829471085e-02 5.849809126661276171e-02 8.685560250855654807e-02 7.166061379919039243e-02 3.540672182580451716e-02 4.211170042154604998e-02 2.115863213340311300e-01 2.295846157646345698e-01 9.850855262693695991e-02 5.507983606027572199e-02 7.524786131571051251e-02 4.767063210170334464e-02 5.474881451316711972e-02 6.026650089353034756e-02 3.374159996002166345e-02 4.340234143722054155e-02 4.204642104616631570e-01 7.064412952006237090e-01 8.551011025638786123e-01 2.179248167375578693e-01
6.260619110179192759e-02 4.129953573682550449e-01 5.503421506164398597e-02 3.501987186604107322e-02 6.184882826160646024e-02 1.053137912738888460e-01 1.041475881062378650e-01 9.569455486032293901e-02 6.624680866288094883e-02 5.214954129660467341e-01 2.776921982389009558e-01 4.014437134445301147e-01 8.258891005378041772e-01 4.035969750477369500e-01 7.373229661306571203e-02 1.443113303932357927e-01 2.697677554242705056e-01 8.141212268561089094e-02 5.056765136155163542e-01 1.232110661503826171e-01 5.173854025562302228e-02 4.629489845634836981e-02 5.988702922821217273e-02 8.398802545592784496e-02 8.999761975081382870e-02 4.917983140149706500e-02 7.948351549378493419e-02 6.210474627424045907e-02 5.460967964217434273e-02 3.835743914399582233e-02
1.848032081137940819e-01 1.016790925106889620e-01 1.077408021177784364e-01 1.043456565481602621e-01 8.479410606221818303e-02 1.730474992327847295e-01 8.027790877766625977e-02 5.559139717507754347e-02 6.803224657105090556e-02 5.750310391713196745e-02 1.111362327474595124e-01 4.886675730073806734e-01 8.574036672250968660e-01 4.400443601750942957e-01 1.569256827975259172e-01 1.758994291808357868e-01 1.940079530706114164e-01 1.251921380123510452e-01 4.129296122830250493e-02 2.812206476959701051e-01 4.948654063778824136e-02 5.027371655978675469e-02 5.954031907397955292e-02 1.067003692173519314e-01 1.015662922239957133e-01 7.249200352813062187e-02 5.582747653950975719e-02 5.041139826926756273e-02 5.463641002963506854e-02 5.856455444877603500e-02
4.416630242346531593e-02 1.069218926648240475e-01 2.453996522262413826e-01 6.636372461261410560e-01 4.436508143272642202e-01 1.467768300194071673e-01 8.079367919609635462e-02 7.007303591783582697e-02 9.221584573148360053e-02 6.301242138163808404e-01 1.759562735374887443e-01 1.603527432805408326e-01 6.380506884634662423e-01 2.711080992262860367e-01 8.442507543022639838e-02 9.694143544907442289e-02 3.564930093058066990e-02 5.211838860850727395e-02 7.375626010791819231e-02 5.917845059957704823e-01 4.718844334662046502e-02 5.163543592121810216e-02 6.547886827052602776e-02 1.089052632420285521e-01 1.381455966133920688e-01 1.208048084748975237e-01 8.916665853601830893e-02 8.359459958973097793e-02 7.339090231211731208e-02 6.062786895474581855e-02
3.841354619287130207e-02 1.092058748733124307e-01 1.935708852780346489e-01 1.388584962660574240e-01 8.206423143718538649e-02 3.157029767006842014e-01 8.249686377220591393e-02 4.446218720916650380e-02 1.281664253805369080e-01 4.194889296011636293e-02 1.488852990228449746e-01 2.849848008948356604e-02 2.911604314211165279e-01 3.903290034923462826e-01 4.122014639515428902e-01 5.516601233002103033e-01 4.937716430288661140e-01 3.194658663120782394e-01 9.121398366758775023e-01 4.272294782382418110e-01 4.599813606114803305e-02 3.055923061786406936e-01 2.303151272190061549e-01 5.486271945556939755e-01 6.700707840715905417e-02 4.864926995597756293e-02 1.240452021591666176e-01 4.811536859261599658e-02 9.905757663326643370e-02 1.143367569851978099e-01
3.597759567585605278e-02 3.608948583544872857e-02 9.798814021504138883e-02 7.311859446531604467e-01 2.660630710825763745e-01 5.925845467407165473e-02 6.910477638881930007e-01 8.339208924752047891e-02 4.243385266422655677e-02 1.547487491372538659e-01 3.176902541916946099e-01 1.394541701749180407e-01 2.597266491141539402e-01 3.276415095866068161e-01 2.940550721159417291e-01 3.531282626048702356e-01 5.999033498002273035e-01 1.033708009578299780e+00 1.048897971863591350e+00 8.205404642724182240e-01 4.230470509248825811e-02 4.977441381190945979e-02 4.988876262912019660e-02 1.344368624790823474e-01 1.734320321720174418e-01 7.571067711618515439e-01 7.570174961036478800e-01 1.693241629937093096e-01 1.019081703283956364e-01 7.792382609875643518e-02
3.289257676386076606e-02 3.574080025882192535e-02 8.012120889753325537e-02 8.878683747726744124e-02 5.950095070792640189e-02 6.249531314724486586e-02 3.482596977501583591e-01 4.091552820480420100e-02 6.238912017936875526e-02 2.454717115625390522e-02 2.549220060306289087e-02 2.072895037246866301e-02 1.465162131479847418e-01 2.954402380086443847e-01 2.743891687073573560e-01 4.190108942339653142e-01 7.232882980760232394e-01 8.763405586944581493e-01 5.046618543772855014e-01 1.096284372300631998e-01 6.589592530349394628e-02 4.534346768265319905e-01 6.632805639206400539e-01 1.116503495496804277e+00 1.056543957263613276e+00 1.388647903293295904e+00 1.115976213580762044e+00 3.392807294648502725e-01 1.487154266155381876e-01 8.712478222719927112e-02
4.178909059942348403e-02 4.807776325379339161e-02 4.674152524343790083e-02 4.377737567121127438e-02 6.306965764940455910e-02 1.060963701793679048e-01 1.790667384029587805e-01 5.703427904859647013e-01 2.677484656276043484e-01 4.565491983978536839e-02 3.378374221371716057e-02 5.260580492768278382e-02 1.039785835983899898e-01 1.531695945925380942e-01 2.023380164949604432e-01 3.630357988697880400e-01 7.807538026262325070e-01 7.825300574645414065e-01 3.689600139439350723e-01 1.263888446925418574e-01 5.471457167841061731e-01 9.967487944764019669e-01 1.283458252619528173e+00 1.323842109018944502e+00 1.174873055355473372e+00 1.025008332152083534e+00 1.524884431542586904e+00 2.752792595578033574e-01 2.047115056556667312e-01 1.105936175776959102e-01
1.031351652106426015e-01 8.073470272733909714e-02 3.941221336059889946e-02 5.514307712004714451e-02 2.158334020149164575e-02 8.576213268668946010e-02 4.546197790265817940e-01 3.675395187860011070e-01 3.605400969124966659e-01 1.793579096204503398e-01 6.997076818634222206e-02 2.194247003436073165e-02 2.134235746154444086e-02 5.081057816832044299e-02 9.954727316996619946e-02 4.586028086430660733e-01 4.804545595767197308e-01 5.695149935700863919e-01 9.879303663805122371e-02 1.740501122913221399e-01 6.064455778433461841e-01 1.316953281864771119e+00 1.628207012131001719e+00 1.696487423774726722e+00 1.411598677680912628e+00 1.376915424219538275e+00 1.291538148487474391e+00 1.036165807059855171e+00 1.161898719347023018e-01 8.584415157827622878e-01
4.070894560924003674e-02 1.117580707149111036e-01 1.947696432918190890e-01 3.676126198232442660e-02 6.651493446623879535e-02 9.132491635186792966e-02 2.884479860515639094e-01 3.611480731449415726e-01 2.474538642353633355e-01 2.110229257077699538e-01 5.172157682737202333e-02 2.110625697095035169e-01 3.215629744422189851e-01 3.010255303254908560e-02 4.704347638479991489e-02 2.153596101163290366e-01 9.094365616794555796e-02 2.953607984735293762e-02 2.361969775133668237e-01 6.385584403761629391e-02 2.388595348987972433e-01 1.277727916078407411e+00 1.622080193484905619e+00 1.703003609082775816e+00 1.248981399912805434e+00 5.827245061311732144e-01 9.513524598996956350e-01 6.480939131039886725e-01 1.624717464157658109e-01 6.239016890280235650e-01
2.449622658465974712e-02 3.502935279920491723e-02 2.249325397322468958e-02 2.492652770152111244e-02 5.119847631339492083e-02 2.946081128199622839e-02 1.516731779201161701e-01 1.962774628271877209e-01 1.806844477412249128e-01 5.292426204250379879e-02 5.736130240871439856e-01 1.472760479553504032e-01 2.541014984194717719e-01 6.153262931487021303e-01 6.708714920953254279e-02 3.326031614178744100e-02 6.622878337032082896e-02 5.752540485483456090e-01 3.532867816858769466e-02 1.486403110285254292e-01 7.876288947678683483e-01 1.496066864503896365e+00 1.610098920053677274e+00 1.530796925685829368e+00 1.177402800347354006e+00 8.650413258568843133e-01 8.410248193531150163e-01 5.918776429592925714e-01 1.309262329791323065e-01 4.801689473123439966e-01
5.723957977901826533e-02 5.784307394762558396e-02 3.420029666059849760e-02 2.806667653323645720e-02 3.752264205730010405e-02 1.740620157875149773e-02 8.924670847974938703e-02 7.568909356303923919e-02 2.131660388030655329e-02 1.525269225542300912e-02 2.526403710862496488e-01 2.245820849380904816e-01 1.256824305876014514e-01 5.765488498733849915e-02 1.224779407899447142e-01 3.514339523392139841e-01 3.697774525398977996e-02 8.023938608429784236e-02 7.584272905806643816e-02 3.020580329017435450e-01 8.279617241845881326e-01 1.228121384907295610e+00 4.993334972905915659e-01 7.490995818016935592e-01 9.473567594488968568e-01 5.374352103811292913e-01 4.346730905149833735e-01 3.839797800998104305e-01 2.696351870261489148e-01 2.931378916954259783e-01
4.672813717244989062e-02 6.726351825807196094e-02 3.933639533937328125e-01 3.378409260786975898e-01 3.141338977615729111e-01 4.564626741510856567e-01 1.652990799887523940e-02 1.629383222388406938e-01 2.276597532314349748e-01 3.937274404481107964e-02 5.832435059083038165e-02 9.354506339890993061e-02 8.892641615284940793e-02 2.757789779381092377e-01 2.325625700351855937e-02 1.764902430166833402e-01 3.244658148935750663e-01 4.488740953484499641e-01 3.034498509706802793e-01 2.266987394985645055e-01 1.604846835890920420e-01 5.888269773491535547e-02 4.959429232197450910e-01 4.961619712100953650e-02 1.753438682494151413e-01 7.072681174402191406e-02 7.989048764161309213e-02 3.899048062998879405e-01 5.054858171168086223e-02 4.714019630421610596e-02
9.929379472672920925e-02 1.026389254646973420e-01 4.477644332813288108e-01 2.632000421075700314e-01 4.407528219846826301e-01 3.425097747111948698e-01 5.379201537466955507e-01 5.953456741658474244e-02 5.454833143296366343e-02 2.359731475112827187e-02 5.853307742102611261e-02 1.078472852059980808e-01 1.169299190172997382e-01 5.367406228177253880e-01 3.058243092899646381e-02 9.739890938127762632e-02 3.529806443663242588e-01 6.508943425280717676e-01 7.291723251802388894e-01 6.270287592003223054e-01 1.439586251288588470e-01 4.048431824411290875e-02 5.892093386205239647e-02 1.301548698002665538e-01 2.441131313729706098e-01 7.239075738661535087e-02 4.531580001557469761e-01 1.854367109235096067e-01 6.950381833973409695e-02 6.658328678009098334e-02
1.248835210575128390e-01 2.267436395195997559e-02 2.541297272360714676e-01 1.096917790312896407e-01 1.385131710065477251e-01 3.158772270364123003e-01 4.258849282046453522e-01 4.976069594743661589e-02 2.694452679587891128e-02 3.064957028785269058e-02 5.562854226652631101e-02 9.467865096801447722e-02 8.782752881235168785e-02 4.196652658059825125e-01 5.704775915368806571e-02 1.593848512770223713e-01 2.668102843244151701e-01 6.075750871543581511e-01 7.571136485822552720e-01 6.383467168238433631e-01 3.913512342141330924e-01 5.129240255143968641e-01 3.526399489455040448e-01 6.325922006534789865e-01 2.703448866969216935e-01 1.492541791600742462e-01 1.339336188089159385e-01 3.196526520716635456e-01 5.603141481680452146e-02 5.051739627473029320e-02
7.838687805972711919e-02 3.515226590495471037e-02 5.532845875441919636e-01 5.921532434691313407e-01 3.162056114212170865e-02 2.292489837399961164e-02 4.369708886855407926e-01 1.868252786016882383e-01 2.736239843607952693e-01 3.484400000620521132e-01 3.257884759805234481e-02 3.909024032000368160e-02 5.149195005039650108e-02 1.004541761449648796e-01 5.058807625952945752e-01 7.446724329149430333e-02 5.135070283935890684e-02 2.226708313247549587e-01 2.701951504706526230e-01 2.235465412166456334e-01 2.459827032967768223e-01 6.513963872021072410e-01 1.037495972210394635e-01 1.695481609944352319e-01 6.863892360003823745e-01 1.256723148279175473e-01 2.839649578580599187e-01 2.368896742357586016e-01 6.548856273343409140e-02 5.704883316085058304e-02
2.845463129358333232e-02 5.614553891737612545e-01 7.188486373487522618e-01 4.505144913425053466e-02 7.786279274428139496e-01 3.666492812792296330e-01 1.764474231916335900e-01 1.298870734007687155e-01 4.087564798374333508e-01 3.023834875614365286e-02 1.069900930246700937e-01 3.959534846735469210e-02 5.878670351218473478e-02 1.098013408952683151e-01 4.587342350281981007e-01 5.416035930421463779e-02 4.749337883759044976e-01 2.189684127405853165e-01 3.144341945829191576e-01 5.273173072009149642e-01 5.973274294998510980e-02 2.172192816469394883e-01 1.119664591673022180e-01 5.209643341656369220e-01 2.770987703473066777e-01 3.662246516736105684e-01 1.679890997690602905e-01 2.583814004068070158e-01 5.351538838503643314e-01 9.091864583057565619e-02
2.935526841554651767e-02 3.488959651216517327e-02 6.898682995800383688e-01 5.584339610482625949e-01 5.463871251400739260e-01 2.167964217026130402e-01 1.451506106269274399e-01 1.526497902356998004e-01 1.711359187114537272e-01 6.766028705645198427e-01 1.982354531490138905e-01 1.984437951640753151e-01 1.603565512211430899e-01 1.646530143947673996e-01 4.423281102820698640e-01 3.014385847431076404e-01 2.080378600619484375e-01 1.240043455634065872e-01 1.065408184900984850e-01 7.932926386362816606e-02 6.354249934111873277e-02 9.295453681098989063e-02 1.425118906785881046e-01 3.326275160251975782e-01 5.671114154099524685e-01 2.546793046823133677e-01 3.903702896955800195e-01 2.716118330893252941e-01 2.804976431252179658e-01 1.844162783856035104e-01
3.422526774535898653e-02 2.519013120510154788e-02 6.907386519878357944e-01 2.495831839518784095e-02 1.658343238564140981e-02 5.234356442472979376e-01 2.628188463988983398e-02 2.112600584673705525e-02 2.358191967040131343e-01 1.705303567445818069e-01 6.387598628579220505e-02 1.480396576020840405e-01 3.737399446359189192e-01 3.475610179456929405e-01 1.154987407193959065e-01 7.435569730346627271e-01 2.358312448140184869e-01 2.682942438587381240e-01 1.204113550807818095e-01 5.307258361874800379e-02 5.158062591974515304e-02 8.067612746155569670e-02 1.228271347820616005e-01 3.756483891018569943e-01 3.783000331245620074e-01 8.937643894024573099e-02 9.925190127957232711e-02 1.282746683981942915e-01 4.184456138495750155e-01 8.527600239901786394e-02
4.600753872073045508e-02 4.858166949022725556e-02 7.845697543719627465e-01 5.169712630567249723e-02 4.828521308637471338e-02 9.113612072445399781e-02 6.648235690655625307e-02 5.897743076447337085e-01 2.342380349858216304e-01 1.357277547575990451e-01 4.114911783078769453e-02 5.260946392424700052e-02 5.667843821401592763e-02 1.962220934455323473e-01 2.352269260319649058e-01 9.986069903824236482e-02 8.251271314501509857e-02 8.568953756161708235e-02 1.147353585449456814e-01 6.621362357185940628e-02 4.710579203482258281e-02 7.028204173079785622e-02 8.019753306187982211e-02 1.340225369412857692e-01 4.167359789575136308e-01 6.568754491548929597e-02 9.548422088380895123e-02 1.569208854268631936e-01 1.897955367795064185e-01 3.755056961023121587e-01
2.503029460537029363e-02 6.897924782694418722e-02 2.063638369078643273e-02 2.220086221039663937e-02 9.421459986437143164e-02 9.966176643391468082e-02 7.220923259801788341e-02 4.070683867433393943e-01 3.152756777167796676e-01 2.949398002407180308e-01 1.213370800220281293e-01 6.131204550619057808e-02 3.700047322432963720e-02 5.877513202518776236e-02 2.692995998236366595e-01 7.074415048367228842e-02 1.885344977153773360e-01 6.598123892637203225e-02 1.219620984447001844e-01 2.527912375981596904e-01 6.534949154439426144e-02 9.154670616107205006e-02 7.980199145325957144e-02 8.786338479595717788e-02 1.164249439609450071e-01 8.938371544269549385e-02 1.054971834819937032e-01 1.303517877679062908e-01 1.763966609528189455e-01 4.320219153456442140e-01
