6.400461273755821481e-03 9.314282722070596141e-03 8.156341748027590502e-03 1.036451972144902117e-02 7.864342867989499580e-03 1.723156940939469042e-02 1.697319669577546444e-02 4.565036405674634951e-02 8.272240266824391897e-02 3.731601066373248926e-02 1.747782268476041553e-02 5.354068139943561899e-01 3.186879721804943832e-01 8.619063795415913415e-03 9.920135261648997671e-03 3.277861692187707954e-01 7.514850035854172064e-03 1.294619761086324844e-02 1.156049323732357553e-02 4.012709009580525329e-03 3.195237115414389061e-03 8.789234232041510941e-02 6.822010817354345891e-02 2.691063187513708654e-01 2.503714142236444177e-03 4.071044215483788919e-01 1.883475921183816459e-01 1.665145310354674765e-02 1.574834301620838331e-02 1.954125657540123351e-02
6.241654215773990710e-01 1.076552476403008773e-02 1.946318027164290268e-02 1.583879828559739411e-02 1.103970562696577999e-02 4.947034898819585580e-02 2.352038675020561020e-02 2.916417734771109896e-02 1.893869787785302378e-02 1.624717017798079158e-02 1.169792398742267384e-02 3.171012025642758747e-01 4.310716463765851825e-01 6.908128707133414682e-03 9.513594126097441733e-03 6.066368867841480036e-03 7.395818345215038163e-03 2.373688752148234160e-02 1.762988871949268052e-02 5.230001505340746426e-03 3.659417668164414161e-01 8.233839356447480995e-02 1.731827217100750382e-01 1.518214527553910231e-01 1.330739677081660133e-01 1.789645227007721218e-01 6.320869594526337676e-02 1.635559273929620971e-02 2.325121549031642504e-02 2.322570929545366911e-02
6.027917564848425669e-02 5.834142510288350958e-02 1.235660296347075998e-01 9.971355553108682268e-02 2.133358859095706717e-01 2.177746612276885985e-02 5.173346366969837629e-01 5.515361708370347671e-01 6.948979000837034181e-02 2.156944618018925841e-02 5.892068955883357495e-02 3.930428397564414422e-02 1.441351535419601454e-02 2.095142498775003082e-02 3.952643839868994272e-03 1.647829828070834779e-02 1.085856783111474252e-02 2.180347663792694957e-02 7.125741453480163856e-02 1.166040887994637155e-02 2.296692275669234562e-01 6.697176549672742563e-02 1.026393590556617941e-01 3.562432451583548432e-02 2.127902702365954551e-02 1.427275642500864909e-02 1.250122787019593458e-02 9.925643244720613184e-03 1.689743491698542099e-02 1.916150072009628613e-02
2.814273606442815878e-02 7.713972862185336510e-02 1.695114254993277114e-01 1.358220576919747513e-01 5.631037099902645726e-02 8.726134853257582619e-03 6.963720639993731254e-03 5.977846371040108631e-01 3.624615558781618674e-01 2.672926743315927334e-02 1.733623938439364867e-02 3.475725728441653173e-02 1.572240879587855772e-02 1.039107279644068543e-02 4.499543365402305373e-01 3.485048176211340554e-01 4.593952713923785645e-03 8.414047110570465129e-03 5.884968660079586446e-03 4.944149062459556737e-03 2.207822333539793350e-03 1.523314119256032884e-01 4.790847322760358185e-02 9.247890165406694174e-02 1.732943106539387018e-02 1.285733023372935373e-02 1.087805674643432113e-02 1.033803531944581244e-02 2.070389358767874347e-02 2.289104992995286830e-02
1.641365701990943685e-02 4.922422088219944453e-02 1.370339748443506755e-01 5.306252655927615192e-02 3.065277825019935634e-02 5.788420386687056496e-01 6.867462008624813062e-03 4.930050674675942046e-01 2.258385121051774969e-01 6.183706908490795018e-02 7.766000480174897747e-02 6.700044846980972302e-02 9.890072286158712797e-03 8.052092154280448069e-03 5.316596720737667425e-01 1.998263231769772386e-01 1.396123017076611461e-02 7.900031850836083946e-03 1.259281840639069235e-02 7.101978676262874803e-03 4.810165144780596293e-03 2.544440267940498157e-01 2.788558585462239461e-03 1.562561691845823775e-01 3.135470812382660372e-02 1.712050226023693542e-02 1.182325485954692328e-02 1.378245721543921477e-02 2.132834287467708437e-02 8.012888838042506179e-02
1.651909553532477856e-02 1.696290551953419379e-02 7.588825425697570681e-02 6.064351990588581764e-02 2.410317512397038356e-02 3.406632788024715475e-01 4.113040557281413268e-01 4.374898604411374681e-01 4.015754791760757780e-01 9.599025245052170141e-02 7.534766603216977443e-02 4.020607260592649890e-02 5.788185919062616147e-01 1.777721153973754464e-01 1.369359925756052365e-01 2.267571267978229499e-01 7.945427288761592460e-03 3.205180579766938043e-01 6.623254953191611005e-03 2.256533874457312266e-02 2.704437200739763167e-02 1.571072099143181605e-02 3.798268796590499336e-03 9.515329183417424452e-02 4.721053887521807491e-02 4.484413646814064403e-02 2.773132775711755621e-02 1.932191735352294451e-02 2.522112766606827983e-02 4.660385224137271465e-02
2.966879002841392721e-01 4.827878350369858573e-01 5.105856315959074188e-01 1.932050298185826812e-02 9.260679658376267526e-03 1.539068786842338193e-02 2.338462950918025057e-02 1.335768107811114574e-02 1.586109667137729218e-02 1.850185524148830266e-02 1.429707409976530182e-02 5.961325802541641607e-03 2.983463065639646028e-01 1.173502048925758184e-01 6.259066265519110106e-02 1.133200863613015030e-01 4.605787398842559749e-03 3.255629651764549992e-01 1.109452465824636337e-02 1.506553921472590998e-02 6.826598740079851263e-03 2.774764860505654074e-01 1.114918702790134858e-01 8.726217661532181813e-02 3.240019058542163016e-02 3.337100939778876035e-02 2.890537191878084222e-02 2.545102167444864005e-02 2.936657004599799170e-02 7.182319954016683217e-02
4.896077607637855378e-03 8.937589721060467535e-03 5.255221876152782294e-03 1.138711321482899393e-02 1.750634066743868636e-02 1.962957921807635675e-02 1.731023967594897545e-02 1.624017299006599510e-02 1.297801723411122141e-02 7.363727720831382030e-03 3.743542213302694099e-01 9.392587852588290750e-03 2.467719427503710095e-01 8.227497190130547700e-02 8.466132945801893572e-02 1.574272894403040690e-01 9.408550649573702018e-03 1.501423880620343827e-02 1.316830780911738136e-02 9.315496853326358725e-03 3.993112189643268639e-01 1.927832279908153756e-01 6.629476108858596561e-02 5.185242136877015601e-02 2.444945709827768890e-02 2.570233910406547265e-02 3.953391620983207067e-02 5.065016066905879411e-02 5.152532505510490357e-02 1.554180506192238409e-01
1.298156656018778846e-02 8.393447973885040381e-03 4.943063933617947853e-03 2.889036991062078619e-02 1.892587584095672265e-02 7.985682290912171979e-03 2.551698526965569258e-02 1.132775428009517339e-02 9.412836899506969723e-03 9.448040838425153520e-03 8.553058806145508522e-03 1.144050740569924583e-02 2.502206866248335090e-02 1.613263471574103922e-02 3.067035525921563144e-01 2.804955055659666407e-01 9.163124000429307553e-03 2.768866395757339088e-02 2.721814527539681561e-02 4.517288282443512534e-03 1.082589302771904405e-01 8.526714009018779294e-02 8.173792563960831370e-02 5.037483036556238136e-02 2.918958875184463411e-02 4.493093137512205876e-02 1.686171303542975120e-01 3.467419962355913210e-01 5.261276887530407301e-03 2.811421851957820843e-03
2.241026630782743528e-02 1.450824612026175783e-02 2.297140438541388219e-02 2.119486319886116146e-02 1.862994368037969653e-02 4.623717314175506132e-01 1.683133603438816822e-02 7.058997935571425034e-03 3.899564016344188588e-01 1.461886428904575763e-01 1.644328146346307057e-02 1.618037774639684290e-02 3.441565543979074882e-02 3.717487255915488675e-02 1.768157568232649884e-02 1.920004474023876903e-02 1.019856966546271587e-01 1.049949586089298365e-01 4.197078948249625269e-02 1.857475686586309432e-02 1.351365636758575517e-01 6.504309311726158560e-02 6.723784384102221567e-02 7.067483523317816263e-02 3.855467946846086180e-02 4.963362973024965097e-02 2.261780912542324384e-03 4.195156929283008415e-03 5.627043721876900245e-03 2.798940880495848216e-01
1.877443065190070176e-02 9.793329760832272107e-03 2.189501895736876286e-02 1.843881653559387851e-02 2.318267430319222167e-02 2.683926291190240621e-01 2.270995054520890122e-01 1.988340848635032354e-01 1.254573213847557100e-01 8.288043592648839872e-03 1.309942890988631814e-01 2.194800731491566570e-01 4.561572195631529159e-01 2.263697838776285998e-01 4.198933987499326587e-02 8.201430285103963880e-02 1.513103985668487750e-01 4.166186719093808999e-02 9.918011553689709547e-03 2.735581014998869076e-01 9.429775392166918346e-02 6.605340350641819569e-02 7.874230709647855875e-02 1.070783927143231645e-01 1.123215692264336457e-01 6.042669391284699598e-02 9.525230112736969568e-02 7.760668320462668635e-02 7.062599387174556265e-02 5.145449940670571154e-02
4.190146506063605614e-01 2.465042312500470567e-01 1.794016521747108031e-02 1.749291140716529441e-02 1.347344726698933119e-02 3.902437712869843423e-01 1.528479402744416515e-01 9.867836957667694420e-02 1.226417894638566208e-01 1.630582892819024132e-02 3.969082150261891984e-02 2.595966181516800586e-01 4.677207312313658161e-01 2.447606098596579183e-01 8.935551583516110341e-02 1.010914576582086638e-01 1.113952912507749082e-01 6.578302487370610296e-02 1.622150866239569639e-02 5.947272437464927730e-01 8.846169382713223173e-02 7.878544367629494727e-02 8.928115378438426786e-02 1.580516527844283980e-01 1.500055839253607859e-01 1.061850871427667542e-01 8.091449999084798783e-02 7.389937824676154343e-02 7.930660307891088112e-02 8.497090544959876035e-02
8.081894997944324976e-02 2.087833934530874402e-01 5.138122047045274865e-01 1.177971448669945173e-02 7.614471124193630466e-03 3.045356710329205630e-01 1.567092308573307946e-01 1.315882463984849871e-01 1.665334645920288903e-01 8.212941231835167027e-03 3.900692775694997172e-01 8.296537746113981371e-02 3.492923099778916796e-01 1.505332786531740630e-01 4.780090720543312549e-02 5.562905588221633835e-02 2.059726097022179098e-02 3.031099216721851175e-02 3.464055488172627928e-02 1.299258333377520738e-02 1.075084243748917617e-01 9.669576289901946065e-02 1.167134373648328477e-01 2.000780062000859227e-01 2.618573850858040841e-01 2.458353703252015854e-01 1.818658494340916476e-01 1.657119827983253302e-01 1.258034806435286979e-01 9.634024134479962642e-02
6.409434936660318716e-02 1.846540919440251005e-01 3.415925694095405252e-01 2.512338859948434755e-01 1.484072311708131697e-01 5.886242493928549591e-01 1.507141741272011864e-02 1.256954863722630628e-02 2.424714465355075343e-01 7.436350560986119962e-02 2.964292590780458481e-01 1.346616431885123283e-02 1.589303070204761692e-01 2.164893633844115761e-01 2.334241209688365792e-01 3.178541668568490852e-01 2.876638286039282510e-01 1.871827122380013420e-01 5.125988597632791244e-01 2.403044463240266992e-01 1.994976073879622600e-02 6.785009864467467233e-01 5.116614186238332973e-01 1.086289995328132765e-02 2.518190896579355909e-02 2.344626286587385075e-02 6.387273435539439492e-02 2.075781260374644221e-02 2.055730823052878686e-01 1.966288022691075610e-01
5.779468764033127148e-02 5.828777956930293602e-02 1.632613326220668792e-01 9.474211278183566204e-03 4.478697717767022857e-01 1.056416203144199401e-01 1.005484142516758182e-02 2.877253760161786050e-02 1.925473517306410670e-02 2.987893614201851955e-01 4.242629377110545413e-03 6.687901117160366393e-02 1.417490112518278167e-01 1.806736864640689499e-01 1.643234120886136740e-01 1.998885626044273889e-01 3.436320173179654436e-01 5.981378579135698814e-01 6.152515900365689294e-01 4.919594060661067192e-01 2.122403244900614161e-02 2.232850940183302157e-02 1.975824479090739286e-02 6.211187230126114650e-02 8.914987105081631502e-02 4.549569852519066426e-01 4.551204306535031607e-01 9.145216329075619988e-02 2.397472731234840948e-01 1.425312409731835372e-01
5.043550419342410218e-02 5.533242483168768211e-02 1.293953176837173147e-01 1.447334461277475504e-01 9.649776858260339374e-02 1.103064891038655765e-01 5.513240586858524431e-03 1.544475091712883830e-02 3.197359462348690895e-02 1.147091938589065233e-02 1.181920813008097149e-02 1.024873225070395237e-02 7.969266301791075313e-02 1.624863730090073122e-01 1.527440323438936098e-01 2.351160004146718163e-01 4.100171881370123783e-01 5.043061718650704295e-01 2.967447637558310869e-01 6.604503789900707800e-02 3.997203725549029751e-02 2.758156976437500796e-01 4.011825290904745822e-01 6.763360640575757365e-01 6.367290347608374201e-01 8.296684875146922433e-01 6.669556645726764099e-01 1.902561966522711978e-01 3.752765126309819954e-01 1.685232706255234691e-01
6.113644208950717862e-02 7.133017324941122450e-02 7.196857012250419683e-02 6.983160474614524826e-02 1.078651151006698311e-01 2.257405795982550534e-01 8.982882526152169422e-02 3.001794563965834994e-01 1.468363358063038693e-01 2.510553822513110836e-02 1.855046676280647580e-02 2.873689596332672236e-02 5.686453373916979664e-02 8.421223688860746126e-02 1.114364852827031682e-01 2.002351918005618459e-01 4.361910995453865958e-01 4.496286322060301099e-01 2.185895818165299875e-01 7.662524355458062708e-02 3.307604206816432413e-01 5.985224660842405342e-01 7.669731558153145556e-01 7.941081250097343780e-01 7.046544771152165598e-01 6.098091370413918355e-01 9.017719599190707758e-01 1.572029954737102775e-01 5.558805566396104458e-01 2.360211595361351167e-01
1.469942921636435973e-01 1.166397670822253846e-01 6.219959518072729066e-02 9.986903048970857677e-02 8.625129525566894301e-03 4.360765465123067619e-02 2.434419544830341287e-01 1.983613107393925601e-01 1.956758009509996787e-01 9.786228590020371043e-02 3.566519234140108630e-02 9.555273020797812669e-03 9.367821442600496318e-03 2.420156840079871335e-02 5.445663615156476345e-02 2.506690263706119470e-01 2.675316654760052093e-01 3.213183166960241754e-01 5.749140627142136639e-02 1.034699917113542644e-01 3.663005550487769546e-01 7.903217886963385119e-01 9.757699237447164942e-01 1.023738862940584360e+00 8.538160721599848957e-01 8.211485511864973219e-01 7.584080575427790682e-01 6.012715057871526048e-01 2.668044166982168341e-02 1.758702063175325916e-02
6.585899791489623067e-02 1.846590844397545117e-01 3.497564608157319732e-01 1.575833664837245421e-02 3.484472322920081910e-02 4.914619858209957892e-02 1.548529498300630081e-01 1.923495310224852262e-01 1.319929771718118816e-01 1.024571942924314416e-01 2.151471967494797063e-02 3.824963705172361172e-01 3.222076844292189914e-03 9.160529985016742371e-03 1.994666366166395269e-02 1.178843836715214727e-01 4.580163023657592841e-02 1.504436020937024651e-02 6.408303745315482303e-01 3.791733315698133516e-02 1.433574002188034435e-01 7.597175584791687752e-01 9.602892532377925727e-01 1.016134332161988674e+00 7.486138604738989955e-01 3.475491758677117238e-01 5.609009947335192869e-01 3.849785965973380186e-01 3.471340442574374213e-02 1.370280429181196941e-02
1.129738831004160893e-02 1.440363742308166731e-02 9.574474077279598871e-03 1.177754086149356526e-02 2.752599974011400719e-02 1.568785427813353117e-02 8.041902329519898251e-02 1.029288798158414231e-01 9.462805541048741054e-02 2.237568998423276195e-02 5.640895630096518301e-03 2.270612246613400442e-01 3.912039676411892541e-01 6.323750851416631152e-03 2.531000572260744957e-02 1.711325867879530740e-02 3.181281970221874755e-02 9.594649136962361824e-03 1.828358824968552912e-02 8.701329089777874726e-02 4.647471161058007172e-01 8.767980620091639921e-01 9.406353227543020612e-01 9.037963475840617988e-01 7.017215414973713150e-01 5.174789375066015662e-01 5.027246033165817529e-01 3.387135593320120264e-01 3.049493319200686364e-02 1.085510891001106003e-02
3.162756683717719841e-02 2.874478669139424528e-02 1.473134149518828817e-02 1.052135441522241907e-02 1.354979358937463511e-02 7.183487479040885637e-03 4.054125244362785652e-02 3.573833286687089911e-02 9.744298652507654007e-03 5.345071932500075271e-03 1.858168867683456871e-03 2.982189402063297745e-01 1.757567533744125998e-01 9.565585574891564968e-02 2.434274646405924780e-01 4.863426194733184126e-03 1.757030874927503414e-02 4.056601356992983742e-02 3.945893176608778613e-02 1.768671850781990684e-01 4.805439460705260846e-01 6.959333590151363103e-01 2.835048466685363144e-01 4.311280044019693003e-01 5.645058992809413034e-01 3.234734166544783185e-01 2.435161998987347143e-01 2.000019462868695141e-01 7.344412623287803754e-01 6.700099328420143774e-01
2.566098468627139167e-02 2.946152521158999782e-02 4.317004178050637755e-03 2.959031766676837455e-03 2.399131495168501348e-03 3.535334751260429086e-03 4.986915814275949370e-03 2.769050312654185997e-01 1.570931605322985116e-03 5.612972840321072548e-02 7.280045329161857759e-02 1.096952395001673242e-01 1.205142762045511295e-01 4.262420307150990850e-01 6.696020722477248610e-03 8.970455309415203971e-02 1.722884144103397075e-01 2.511148291558714107e-01 1.726161361636635583e-01 1.307087826667309161e-01 9.259000248179212467e-02 3.319313146192403446e-02 1.285136437005198438e-02 2.808840680515637192e-02 1.035128033899226779e-01 3.560491096652283749e-02 3.330070948062113789e-02 1.125358287472307504e-02 1.267981558792739272e-01 1.037104670226296904e-01
5.552574646759383253e-02 4.310822454021270150e-02 4.541571727917734225e-03 3.640197426673458247e-01 2.768392302540517106e-03 2.131982394057891500e-03 3.250251362701642600e-03 7.632764829504981585e-02 6.479233678706998456e-02 2.782734988577888896e-02 6.548867137940417305e-02 1.229608019071645186e-01 1.628856916974300295e-01 4.644782974313772968e-03 7.995380398964968549e-03 5.212034024669549154e-02 1.914511031944447494e-01 3.603563547423257463e-01 4.120439343683416911e-01 3.618311242499243630e-01 7.773156136646081071e-02 1.747007237909174032e-02 2.171626358266888837e-02 5.357658985409574637e-02 1.207396044030372984e-01 3.604403928148156022e-02 1.400139054003280911e-02 5.249613611719646800e-01 1.656022312235739813e-01 1.486446683545018521e-01
7.185910236171502707e-02 9.184506249804668537e-03 4.410512264219847989e-01 1.467369953657338411e-01 1.728919045926399500e-01 3.864767581199286539e-01 2.353793182746951110e-03 5.721840530391154866e-02 3.174652310481622386e-02 3.642680535043551354e-02 6.410798375928959680e-02 1.088195192650580068e-01 1.228530260664265072e-01 3.577023654237170003e-03 1.472257868315616884e-02 7.451609937282654972e-02 1.452724514068201300e-01 3.372637998800229742e-01 4.279097980297066894e-01 3.669369308600356483e-01 1.859981665882452506e-01 1.085153466824774655e-02 7.768563259631665156e-03 1.687414215046216873e-02 9.779874321354825595e-02 5.898295310899931421e-02 5.358122813218472308e-02 1.011658728109979082e-02 1.474791968209452353e-01 1.132982955945619902e-01
3.987791194553205743e-02 1.230291055234990216e-02 4.771637822392480952e-03 4.203928387559162719e-03 9.165465257073433097e-03 6.161795236839453724e-03 2.500113403713986708e-03 2.209547574463695541e-01 3.333532328996468008e-01 4.308937015063402654e-01 3.987983009189297046e-02 4.471265503803754926e-02 6.962868095268830160e-02 1.575737649566710252e-01 5.287626752986569062e-03 2.278948556179557702e-02 2.327191063315872666e-02 1.007479075691610354e-01 1.305912374736201420e-01 1.139876366333987812e-01 9.778349048558690471e-02 1.284628048887069031e-02 2.335700162769029919e-01 4.433206395418188284e-01 1.736117337316481213e-02 4.343485452831922361e-02 1.171216574664070142e-01 6.614750880463102223e-02 1.732506958692971721e-01 1.308076398720440792e-01
1.417274655165207987e-02 5.609973332426662455e-03 6.041891747914658779e-03 9.602963733612851840e-03 5.151223791142166449e-03 4.679621925831913831e-01 2.177480813213975852e-01 1.548783976957876507e-01 2.174598530330278633e-03 8.506264624234540286e-03 1.282935363841343213e-01 4.400080102413392313e-02 7.437405957680132129e-02 1.631216881783865702e-01 4.288511910150602513e-03 8.134507792339311372e-03 5.718803082276992245e-03 4.500410607492041914e-01 4.639838757772506497e-03 8.621900419410459537e-03 1.573299465213149131e-02 4.671869128925361103e-01 2.340262004222981029e-01 9.971036452674891457e-03 2.440545242577316434e-02 8.691773974761894325e-03 3.009507678928909774e-02 3.383910225604218336e-02 1.204645894033251965e-02 1.996792270066038433e-01
1.436179978887836342e-02 1.152173315941123870e-02 5.649120109429664645e-03 3.909742674960916056e-03 3.574838086810323140e-03 2.721052352527156271e-01 1.818798532644694821e-01 1.886399904987314802e-01 2.098844689669926433e-01 3.724592667722825910e-03 2.327858112976237681e-01 2.197060460105749180e-01 2.073093153338073646e-01 2.583855784027084268e-01 4.159504725165671934e-03 3.100297921565338486e-03 3.609009905353189329e-01 2.193738274625462448e-01 1.956263950143475872e-01 1.507745947947168874e-01 1.195492184606101738e-01 1.740227669635837360e-01 2.759097413946888233e-01 6.891318055036397272e-01 1.008452642528712140e-02 5.798573725949592861e-01 8.112018293182369361e-03 5.952344076774774839e-01 5.982028821778794248e-01 3.856299884178205351e-01
1.944705546694044940e-02 1.015520692081865566e-02 5.801371282622935083e-03 7.496308467748647245e-03 6.470351223895218391e-03 3.453199003768041113e-03 1.154982753371508811e-02 8.555721588681054063e-03 2.824761185994504320e-01 2.032363943898911618e-01 7.189102995040719257e-02 1.638530548639612616e-01 2.356465636649498607e-03 2.814893718527278210e-03 9.378317695092348860e-03 7.548057335507436447e-03 4.120623003273354290e-01 4.982015541553648230e-01 2.338404332955594800e-01 1.023530388060512886e-01 9.280271066997351770e-02 1.414102620816175826e-01 2.195225708527720476e-01 5.364624826278465916e-03 5.879763264936509887e-03 1.777037218557809273e-01 1.999666717888060607e-01 2.536785247696838885e-01 7.486175581947806211e-03 1.686509149337018232e-01
2.631190973792718255e-02 2.280349366596604380e-02 6.852108565582938106e-03 2.228409554941526705e-02 2.541199388021431887e-02 4.708138143041434159e-02 3.106717879750636735e-02 3.458421645221827941e-03 2.786043575457931021e-01 1.597335691482877351e-01 4.681324739294394355e-02 5.808180285958283728e-02 7.289209108309820107e-02 2.963569225104737415e-01 3.780835419958273325e-01 1.734948036212913824e-01 1.733336611257857429e-01 2.116959010901986460e-01 2.919980244333485464e-01 1.603261791985270968e-01 8.697730668852014790e-02 1.177878084302918099e-01 1.319775836997917617e-01 2.314323943586089893e-01 5.919960606400665945e-03 1.230637257786676708e-01 1.816634431807357952e-01 2.964944639690423323e-01 3.479127428266122757e-01 7.092963246201204885e-01
1.443798011273544554e-02 3.616541605875814303e-02 1.031281067201114329e-02 1.077204530076925071e-02 5.147942478004207539e-02 5.366959707040439009e-02 3.534321267093042812e-02 2.396613582826339836e-03 3.738518674734978564e-01 3.518002941571671260e-01 1.439719321576901634e-01 7.114083810223875703e-02 4.616925121958967426e-02 8.284635535770712433e-02 4.077416035925955362e-01 1.220966545804566955e-01 4.451858389408887007e-01 1.875554997339515251e-02 3.542492790438295236e-02 4.995991329455047418e-03 1.305627746888387564e-01 1.647547603232033808e-01 1.397508023925245757e-01 1.600649533056138774e-01 2.216937946633937284e-01 1.757301763891716273e-01 2.115335697599698972e-01 2.627681436632324230e-01 3.449027788729500665e-01 8.725445101538758380e-03
