3.123122860494268460e-01 1.166660851702436101e-02 3.612181577021280621e-01 7.302043289052079396e-03 3.291979458994556129e-01 6.863038268319817878e-03 3.911522746952490054e-03 1.054026313795619098e-02 1.908245740251552844e-02 8.604164855773428766e-03 9.219124225327272881e-03 2.061213817965008022e-01 1.311113077217077594e-01 6.879854737911031241e-03 7.116213324874210572e-03 1.379290655440658653e-01 4.157018420020443077e-03 2.563797207628161230e-03 3.996576427284459498e-03 4.553282232844895194e-01 4.226109687620476230e-01 6.415179435369849914e-02 4.923052046115985320e-02 1.948027938561368577e-01 3.712315751395698915e-01 2.865945276783666840e-01 1.301433115278577968e-01 1.142956322394243253e-02 1.088651788302866415e-02 1.366094450762455996e-02
2.036605340427575239e-01 1.174027475469089851e-02 9.370212849093905588e-03 9.723725428872590990e-03 4.224120916625256211e-03 2.306791938933992411e-02 9.343201362117865838e-03 1.141722879404554955e-02 5.868699369841682244e-03 3.821238976455124461e-03 5.820663249421159299e-03 1.044126122879635576e-01 1.525966650562622928e-01 3.633792637584701835e-01 7.698186534686703858e-03 3.787153386945573685e-01 3.888119518045551545e-03 4.713213126120887123e-03 5.826321754707286873e-03 3.696669033575772020e-03 2.430316781953397731e-01 6.158569616211419934e-02 1.282119672306398783e-01 1.134787003334139233e-01 9.877485803882993243e-02 1.305568077663856741e-01 4.546421003826598556e-02 1.154774654984023173e-02 1.641301406767382495e-02 1.638641307857550966e-02
1.954526665692803492e-02 1.905860902640856003e-02 3.017771017576125966e-02 2.450509418637889653e-02 6.994183778748766511e-02 1.958964047240402406e-02 1.790428387343066807e-01 1.885361785520229261e-01 3.787050233900373514e-02 5.873286373390450635e-03 1.513236144265658195e-02 1.281138470153382614e-02 7.606407069712986177e-03 1.603514953904217055e-02 2.340378001815937581e-01 1.524181081474908217e-02 7.035496753503516117e-03 7.031093670487896519e-03 1.335920888676930297e-02 5.214438679467753822e-03 1.500515080445694038e-01 5.076255060215961040e-02 7.785612043701714557e-02 2.686780044221415142e-02 1.567137534745418476e-02 1.018831754724439272e-02 9.047411913520687909e-03 7.104729220583655240e-03 1.211072947655611118e-02 1.356865125706952120e-02
6.550131556920940623e-03 1.839683360889051572e-02 4.036003405506956299e-02 3.259443040283202531e-02 2.417574907335936704e-02 3.615223210217633487e-01 3.615155330161539116e-01 2.259073663803181087e-01 1.233800256558317404e-01 7.997808463742853494e-03 3.969447319781027259e-03 7.837321551711410456e-03 1.080134312416064155e-02 1.481788321229690099e-02 1.815369078659899160e-01 1.571463692316906746e-01 3.361375725210588583e-01 2.711388058273739039e-03 1.146638534596563152e-03 1.698664861265217901e-03 2.635416010579171298e-01 1.051516353280049221e-01 3.628866608580049585e-02 7.103073047325232647e-02 1.280374129846287463e-02 9.031396270424983316e-03 7.700490926718019970e-03 7.310458743744159722e-03 1.484642622981000720e-02 1.613672244473387044e-02
3.742308334642592462e-03 1.132288700003906100e-02 3.156092654793030139e-02 1.224814540069422628e-02 1.519393026017074565e-02 2.106013762439525872e-01 3.701927022869543338e-01 2.103038612560477749e-01 7.816464136739281754e-02 2.101887154866524665e-02 1.809046543933427384e-02 2.194684575798995507e-02 9.425102606944284200e-03 4.474956561649617859e-01 2.362065827493011749e-01 9.492692804257538142e-02 1.136228260684446316e-02 3.174251559515635108e-03 3.539350092632008969e-03 2.052622333734409072e-03 1.977151387893754785e-03 1.375446913080347056e-01 3.544078425562426360e-01 1.161548481957881129e-01 2.311382398406660460e-02 1.211804943932798598e-02 8.353525640439944666e-03 9.681462075629252914e-03 1.517271831347995724e-02 5.591843733334637967e-02
8.302897838872671035e-03 8.819422012476187123e-03 2.787096116081572150e-02 1.670492548050786161e-02 9.914585103307190991e-03 1.182684880936087646e-01 1.525654078277278725e-01 1.645189915798389857e-01 1.351150291273909010e-01 2.905960747628434648e-02 2.565007035390130113e-02 2.245531305981671513e-02 2.028727411857858542e-01 7.608744227431310514e-02 6.392069534388720997e-02 1.078547375741294861e-01 8.679886235639307918e-03 1.426341046370711574e-01 2.395827498132112061e-03 4.570148059206500385e-03 8.342453466578584470e-03 1.404199828828541462e-02 4.343246420361687177e-01 6.749253187233751616e-02 3.449093825747279879e-02 3.181971653192035981e-02 1.971540453654990060e-02 1.364764216615102152e-02 1.807843779783369770e-02 3.263161129813647171e-02
1.140896406832375837e-01 1.718912765613900551e-01 1.688035511145168643e-01 9.067143973712625885e-03 2.613320202241089033e-03 6.785116074639893115e-03 1.454419516204696200e-02 8.200720095224600659e-03 1.045053901102967545e-02 1.064867880553584632e-02 1.374507811711662107e-02 2.456059740678459002e-01 1.143260812409161442e-01 5.298013641425502324e-02 3.085174168753880564e-02 5.331167078418700550e-02 3.015738990963207633e-01 1.350163133628007328e-01 3.865775465815990061e-03 5.498004359891535756e-03 4.363080830367098949e-03 1.366754557618121424e-01 6.378743003972542347e-02 6.080845876808954609e-02 2.337405476095649054e-02 2.378042191566930724e-02 2.081615013094478134e-02 1.806909590432912924e-02 2.079761968065430358e-02 4.964694488911712555e-02
2.361872055596534736e-01 4.353544985149885305e-01 2.406808621216436628e-01 7.000168729121874177e-03 5.846516319183668597e-03 6.609547867163982453e-03 6.002942589145534268e-03 3.823941010259651174e-03 5.901702469953514461e-03 3.327736580251561826e-01 1.412309953533695261e-01 4.457801825366268789e-01 9.675152809420493882e-02 3.438626742258274471e-02 3.885114128950076934e-02 7.181410862379521143e-02 7.728689167178552644e-03 8.327905871606039109e-03 4.960439885629167739e-03 4.847724761870948577e-03 1.925781649232514714e-01 1.126605091831955063e-01 4.527042490610095476e-02 3.774835878308990811e-02 1.789590558846741730e-02 1.857175701152195477e-02 2.866193706478582792e-02 3.241843074552703402e-02 3.225352497532091994e-02 9.389685363615264679e-02
2.329546451133015367e-02 3.586560397690501389e-01 2.077282505648653799e-01 1.584902760365533222e-02 7.701116433126129618e-03 3.084456362897191606e-01 1.698586343107033256e-02 7.278943645508348555e-03 8.905103413403742812e-03 1.085603654339846111e-02 4.378578712372048765e-01 1.390076861441456695e-02 1.911561659881406972e-02 8.166169357622054398e-03 1.241097754526530456e-01 1.040236643973867364e-01 3.194641003619374565e-03 6.011080497174319318e-03 8.103903536744999983e-03 2.575380184583693222e-01 5.103884273680805994e-02 5.294216466625515510e-02 5.730781030191796355e-02 3.731790908125382639e-02 2.176715817429655808e-02 3.251777826040364028e-02 1.203325504873982155e-01 2.134253648766223366e-01 9.579107237721404960e-03 2.891702320684842453e-01
1.615003710345131252e-02 1.191540053612816577e-02 1.889473779920879462e-02 7.521777571287972114e-03 8.827496589622715883e-03 1.471206285150896964e-01 1.830057254154313431e-02 3.336599184809589391e-01 1.589253340171081219e-01 5.757724748413889371e-02 1.148100577342442072e-02 8.955067864888730661e-03 7.811634293175630933e-03 1.046986311022307485e-02 5.507829686447674421e-03 5.829580458996425942e-03 2.493004538255658153e-02 2.252979252489671277e-02 1.431100372315185359e-02 1.073550928397066714e-02 6.533937255430508073e-02 4.116578274449121666e-02 4.705513786529195303e-02 5.148117509141098697e-02 2.860635835146794342e-02 3.590140474435710161e-02 3.248812296976648084e-01 4.924174550445792331e-01 9.939458797977005627e-03 1.528681165174695655e-01
1.585635337046045062e-02 3.568735469508290681e-01 1.065957159155909648e-02 4.266322427814160309e-03 1.265913066602544768e-02 9.178958837979561691e-02 9.080522976827173909e-02 8.344776107432055889e-02 5.803163535944416696e-02 4.581009733863158351e-01 4.434705012405650709e-02 4.956809855500053652e-02 1.019044547679194418e-01 4.963948422616400180e-02 9.036321179612321480e-03 1.750624167098292078e-02 3.225944502444456213e-02 8.827702093459103075e-03 3.941097891530828505e-03 1.062510468465156788e-01 4.470281011436320201e-02 3.987225481277677924e-02 5.138528891918640873e-02 7.163565764236939915e-02 7.617832126254647784e-02 4.090771768428731053e-02 6.321191243013300765e-02 4.708445364337821015e-02 4.185351183978491818e-02 2.997368787067549584e-02
1.595327223813669537e-01 8.714487711131155279e-02 1.953732554449786121e-02 1.726102975962724023e-02 1.516370210004489363e-02 1.483916289776048003e-01 6.982708004735881102e-02 4.861341874601608770e-02 5.847820458573751989e-02 9.309534931862543244e-03 1.319185241220282613e-02 6.096447428776197164e-02 1.028029347370175706e-01 5.282073126938607865e-02 1.887694276197639937e-02 2.108926525466202698e-02 2.317874294037718455e-02 1.360709584094073679e-02 6.440080684521060431e-03 2.392799129044373141e-01 4.226430522916896360e-02 4.301250636068665312e-02 5.078254856082449475e-02 9.067339189774756281e-02 8.597648611811947728e-02 6.106967659983936897e-02 4.674160437737667761e-02 4.245775458194225860e-02 4.638202989125637943e-02 5.037405243779553843e-02
3.789672909529785694e-02 9.091710910541070390e-02 2.027789235269905066e-01 3.200037436806464630e-02 3.632570148904041840e-01 1.247815480492208695e-01 6.957966259714011559e-02 6.082853821554137091e-02 7.818543602791638847e-02 4.114643938243576007e-03 1.490201558532147086e-01 2.078451587824001190e-02 7.462656895453156913e-02 3.178762535014316437e-02 9.941550272045296399e-03 1.143833367245226766e-02 4.227525362681129259e-03 6.211576336500682256e-03 1.124091479732858626e-02 5.408076912298426416e-03 4.001206286766623849e-02 4.388093919506375756e-02 5.552433416815077960e-02 9.237243595532439178e-02 1.172572880103185389e-01 1.026720383673593862e-01 7.585491105973175829e-02 7.144668712558134571e-02 6.290007698744565223e-02 5.243570165463969091e-02
3.285241914931618518e-02 9.264835609654664683e-02 1.616745896993374010e-01 1.155850544234736654e-01 6.827512378623291911e-02 2.651429772605151669e-01 1.956937355379703702e-02 6.653368425193266662e-03 1.070369137644779645e-01 3.496372159411835490e-02 1.244735448411765644e-01 4.234896907871921017e-03 3.311875352631165476e-02 4.467121213823589676e-02 4.758584622125743707e-02 6.417993593371144889e-02 5.814722144806828280e-02 3.800450025643007518e-02 1.044804493309577503e-01 5.059778056523198814e-02 8.538877519075043637e-03 2.582741631581315089e-01 1.944452757326043946e-01 4.648953208248892688e-01 1.537691777488939607e-02 8.684929962656341013e-03 2.004165058650314926e-02 9.860279897979168026e-03 8.546164787236323890e-02 9.921733780345536047e-02
3.075853411333747886e-02 3.065733140752133212e-02 8.277025128975126766e-02 6.167491237524718173e-01 2.245789430287303545e-01 4.989386788507045589e-02 9.610319669244304919e-03 8.320982592509677811e-03 6.579391480178741793e-03 1.329628813635798101e-01 2.733372592396776102e-01 2.016494532323014760e-02 2.898865101226899554e-02 3.687813617495416113e-02 3.342242462427316707e-02 4.052409100939478870e-02 6.989829749427531325e-02 1.221944845123332374e-01 1.258683810292018923e-01 9.992802527583305450e-02 7.265814200930970426e-03 9.879433938391225800e-03 1.099813173075128020e-02 2.562433285033882679e-02 2.877704366932868491e-02 9.363169974787201311e-02 9.367941995906056696e-02 2.641310000286205273e-02 8.819204952789680418e-02 6.769409460076263041e-02
2.807956108196926065e-02 3.038416687383245496e-02 6.776533027492034900e-02 7.504382625075332880e-02 5.034394856329189177e-02 5.264949130497481589e-02 2.911129355464312507e-01 3.662751839301626143e-03 8.125104906877551533e-03 3.797546138782223295e-03 3.957430550006644891e-03 2.813820906254007031e-03 1.604522094882332786e-02 3.277126455135770389e-02 3.083501988512518319e-02 4.761607407539620446e-02 8.363021947960987135e-02 1.032389581747884255e-01 6.064311176810922854e-02 1.340502115575886027e-02 8.095878029947378707e-03 5.582480904842214431e-02 8.149752377435467987e-02 1.382956126419372378e-01 1.316756108272231773e-01 1.732061419751387277e-01 1.393180589847110296e-01 4.887498450597268368e-02 1.288616891591923830e-01 7.564631301399185603e-02
3.551429140030317594e-02 4.074097983861478534e-02 3.978430705949050072e-02 3.735614714759247224e-02 5.392151359267925020e-02 9.092752280244678631e-02 2.454996864067083423e-02 6.970453209709502607e-02 3.023860319075109479e-02 5.097388592924528491e-03 3.710864778334496163e-03 5.675140592099970141e-03 1.118663261422988241e-02 1.672417641714416675e-02 2.238692343483198594e-02 4.067643775248778321e-02 8.938250015921495040e-02 9.196308557212229395e-02 4.444601059737572635e-02 1.550919742003803448e-02 6.739721220813296720e-02 1.230019653466496443e-01 1.587129949417146746e-01 1.653829073046571563e-01 1.477714136444955029e-01 1.290204822176524435e-01 1.921456320118450911e-01 3.798787550702981131e-02 1.696472347772430278e-01 9.152283239496128431e-02
8.754292299920823917e-02 6.845177421747433710e-02 3.358736794816270105e-02 4.722640110030202482e-02 4.263219893549356418e-03 1.133537252820901800e-02 5.221733515780248303e-02 4.070127902073158305e-02 3.970113800229348872e-02 1.959274128195691300e-02 8.698974239162238567e-03 3.383073202940094747e-03 3.281306710421290265e-03 7.080866382381846569e-03 1.084180605992796781e-02 5.074812858108916636e-02 5.460710974250643224e-02 7.007904664301875530e-02 1.245263095442918772e-02 2.229322004936666601e-02 7.492684435943856858e-02 1.636332742028573373e-01 2.037842351834320553e-01 2.148637738781936923e-01 1.800444124052892059e-01 1.757077159586832305e-01 1.647297292002098124e-01 1.370419698787118112e-01 1.681500562850113054e-02 1.289421747464664786e-02
3.473600618505314624e-02 9.530251025757816019e-02 1.666427353377252230e-01 6.566192854492627039e-03 7.885440313380075866e-03 9.701885540142885650e-03 3.058549127362861914e-02 3.805920695686960953e-02 2.592206748620624196e-02 1.995130107587184121e-02 6.641788951574856270e-03 1.788945835535167006e-01 2.691192121251323455e-01 4.332946463495688724e-03 3.931439509169957179e-03 2.370221235700806922e-02 9.231106777346053185e-03 3.263960199111812753e-03 2.002743358054719924e-01 8.112422844098268054e-03 2.923476626402337492e-02 1.575729543915190267e-01 2.018696727466186558e-01 2.145250453829027626e-01 1.588119304135797716e-01 7.457528765829227191e-02 1.218834958615981207e-01 8.319710263383751914e-02 2.950960327671504901e-02 5.182143889454974284e-01
4.190266436278971066e-03 6.773591977993573959e-03 4.047026225137390944e-03 3.612956437985234519e-03 5.213078097659326268e-03 2.959359329473071169e-03 1.516962438685066222e-02 1.948265858332248052e-02 1.783642511938310707e-02 6.121015236615900967e-03 3.547223819253446722e-03 1.228137445194766308e-01 2.095503210287054385e-01 4.384077315881074882e-03 6.813289880554663190e-03 4.188675528230127384e-03 7.113213052909492934e-03 2.087080389846944928e-03 3.926635920227541238e-03 1.859891829969019181e-02 9.501886330445728779e-02 1.825073670704869810e-01 1.987794684573437609e-01 1.918292309528768780e-01 1.495748876416217454e-01 1.110050293508966224e-01 1.084714118707212349e-01 8.499364093255969144e-02 3.899641634789993011e-02 4.137824320159218527e-01
6.447945355863740451e-03 7.816914488558321730e-03 5.689091236293522362e-03 5.298169082686590356e-03 5.850372804790349331e-03 2.071225168344082920e-03 8.121441956888936220e-03 8.855567449800863175e-03 2.636337256081306649e-03 2.196341309144679566e-03 2.093360809061646233e-01 1.847075746401500296e-01 1.027668870279958013e-01 4.786376668864542744e-02 1.033232547098729137e-01 3.070283179877334456e-01 3.917140152291363059e-03 8.048503178138684613e-03 7.834669381466558696e-03 3.546310932454270481e-02 9.863912469804451966e-02 1.453365974187069698e-01 6.009484992273766979e-02 9.179686870111999908e-02 1.204818151624648531e-01 6.918725886229726285e-02 6.605489743108798606e-02 6.647548569365589743e-02 2.326998368099541525e-01 2.531001023867463506e-01
5.178966203969291235e-03 1.110943115901517030e-02 3.366203520756224088e-01 2.873409686086404458e-01 2.633920904783217942e-01 2.476710196809207842e-03 1.770700484779169984e-03 1.349319171875551227e-01 1.918315753939232593e-01 3.305163673564935622e-02 4.852717558748371324e-02 7.749816844279461270e-02 7.431337926003117600e-02 2.336042776171113888e-01 5.476938453729545027e-03 2.173708726654835846e-02 3.810406257974318506e-02 4.978637698758235641e-02 3.431334084173955079e-02 2.616832013181691341e-02 1.894535890966823899e-02 6.916435795309722884e-03 2.733199148637208403e-03 6.023495418437204395e-03 2.216457614613141780e-02 1.230777547736058158e-02 1.771342011660306803e-02 3.362244719637857981e-01 4.347333081663657534e-02 4.060108356674902580e-02
1.084500474224681620e-02 1.860329738404393335e-02 3.817115150360761433e-01 2.229696044139142241e-01 3.664453900953929533e-01 2.772447785925011288e-01 2.086626264386887229e-03 4.834090328778053308e-02 4.570557487969301169e-02 1.977820951272694222e-02 4.893896129739684631e-02 9.028771301605478805e-02 9.826001535058169478e-02 4.541594331254452666e-01 7.643808211903824548e-03 1.020384881975934868e-02 3.766113517568047547e-02 7.080468494994002215e-02 8.078442781100923786e-02 7.118959799195576088e-02 1.970757084461904896e-02 7.100391674264369332e-03 8.807753507297805956e-03 1.763948145896716141e-02 2.569959617599221549e-02 1.231678116728211758e-02 3.883796360619908294e-01 1.593813364545444977e-01 5.972456854142255828e-02 5.747882593088019659e-02
1.348873565865244678e-02 4.310594085474341204e-03 2.155636568612535886e-01 9.234680705630352038e-02 1.162696440338722714e-01 2.567054827392712402e-01 3.423874763750842098e-01 3.963524826822903413e-02 2.252040801428023195e-02 2.568851468562743934e-02 4.665613150484847899e-02 7.961916462125501193e-02 7.399095940589540954e-02 3.538814374450436340e-01 1.423689742425107360e-02 2.220309164675201771e-02 2.811288214502858165e-02 6.514634130408683554e-02 8.259012218325148535e-02 7.139787836690442147e-02 4.699789389132762174e-02 4.322387377512282303e-01 2.941246798205738866e-01 8.394175216299671130e-03 2.737171481462946296e-02 2.007450115686611539e-02 2.862666903035258198e-02 2.743970743582724303e-01 4.823357754683748472e-02 4.380895521584759339e-02
7.432350217672441597e-03 4.738347204932553958e-03 4.554615356753428101e-01 4.820380107313313456e-01 5.735083140237292459e-03 4.342142989548791222e-03 3.662348269314201210e-01 1.561830991063014318e-01 2.286937871551767976e-01 2.922615843522675672e-01 2.740273634880557863e-02 3.297786867086394125e-02 4.340599280333554827e-02 8.411684266633512319e-02 4.220395623612309688e-01 1.583019814723858262e-02 7.546800744455667460e-03 3.485609948804167801e-02 4.044905176584724649e-02 3.185633924599703265e-02 3.950843703057932421e-02 1.168578564543148839e-02 8.635032650318086311e-02 1.395788721048990544e-01 2.105154941651409678e-02 1.568928792885983248e-02 5.189972020287567100e-02 6.413019059690312773e-02 5.653668855321299092e-02 4.976462291998179355e-02
2.656184942700228445e-03 1.848922767885676291e-03 3.322420307391939567e-03 6.875892621066897331e-03 3.409403285410543376e-03 3.042590861868132990e-01 1.483448350304331920e-01 1.088366816165423356e-01 3.415439612692137694e-01 6.940949276231935840e-03 8.995123712752033096e-02 3.336678250081268060e-02 4.940236500250203000e-02 9.073497002388224153e-02 3.748646442117324340e-01 1.316897717799106818e-02 3.896932159080598868e-01 1.819477422242632980e-01 2.641806757527177529e-01 4.449606585204705089e-01 1.442636302788183160e-02 1.822425787070928727e-01 9.388193764676762421e-02 4.350638755165108229e-01 1.010858477673336198e-01 3.064500518467362378e-01 5.449003833396452723e-02 9.662965894556556357e-02 4.626661275055903300e-01 7.953326956752851395e-02
2.691249978709705452e-03 2.121085622849165891e-03 1.451754547539034490e-03 4.403401712876763296e-01 4.540662072408728767e-01 1.795916909340828926e-01 1.221155416764420493e-01 1.279914015573582198e-01 1.430352278194052251e-01 5.674355559693413653e-01 1.665472555229960960e-01 1.669024863483216659e-01 1.341657512762994831e-01 1.357584266512822102e-01 3.409713420853669463e-01 2.303942467165266128e-01 1.627022358015713932e-01 1.019880257716457433e-01 8.893407222326740746e-02 6.673316174481801200e-02 5.354651703776790173e-02 7.824182205731436412e-02 1.194050802704647307e-01 2.786477474663966447e-01 4.766584982424835193e-01 2.152621246720234360e-01 3.318600692432984722e-01 2.320868250137519684e-01 2.418582923311350108e-01 1.610444501898902481e-01
3.653256720273910518e-03 1.868669740905366024e-03 1.490240572971214626e-03 2.732125937928801644e-03 2.842467279206561080e-03 4.428755845451226580e-01 3.765174556337875546e-03 3.337098922478778842e-03 1.971841887223786394e-01 1.430504526104038887e-01 5.364699134248532286e-02 1.244943867922299330e-01 3.124559197493063101e-01 2.853995008203360495e-01 2.218961561859671139e-02 1.646789214143003569e-02 1.844311885473403079e-01 2.204138454773210132e-01 1.004700696751241462e-01 4.459208336935584910e-02 4.335557652946953056e-02 6.767685378960117126e-02 1.025890216989956416e-01 3.130911012407719407e-01 3.170411955003372695e-01 7.528156358510311452e-02 8.416286069320612351e-02 1.091676928747285780e-01 3.586314248093183110e-01 7.408616011760520148e-02
4.902004459352531443e-03 4.162894969658226425e-03 1.206273212407670990e-03 3.947906811786439443e-03 5.112956056356999027e-03 9.515839284154406497e-03 8.391184507530076442e-03 4.947445462404178596e-01 1.958559637684525734e-01 1.137883120670114961e-01 3.456312016158703815e-02 4.424093684823023065e-02 4.736224528757300434e-02 1.615211754509435493e-01 1.846148451547358904e-01 7.780789408783971017e-02 6.480326473792197284e-02 7.052039728793139950e-02 9.569711775921914410e-02 5.549670273521761094e-02 3.934646067790685542e-02 5.852282221775928495e-02 6.645095716482492254e-02 1.111353643608587738e-01 3.480514763120641231e-01 5.513569009920678277e-02 8.061223582881821281e-02 1.330395821860414773e-01 1.619072569602307277e-01 3.245500787290483968e-01
2.634570317002675986e-03 6.445744301139644250e-03 1.850210054072784147e-03 1.911496105009259910e-03 8.974880117760472564e-03 9.353610513930408696e-03 8.476742808272753199e-03 3.445310063854862270e-01 2.660219487531618188e-01 2.488745132392431170e-01 1.023870544453021059e-01 5.174996534820726357e-02 3.105164747244172629e-02 4.857988426893707079e-02 2.211956402470970917e-01 5.782786631002183320e-02 1.563239776148646898e-01 1.468329928715542826e-02 2.899464381427108856e-02 2.140833143120839943e-01 5.524822127189701892e-02 7.726349800358550679e-02 6.720531268995999508e-02 7.403754276122979927e-02 9.865732341754693269e-02 7.598457033945563155e-02 9.006656029353250770e-02 1.116245554313027577e-01 1.512594687920001679e-01 3.740526626556152090e-01
