3.330592681306862035e-01 4.835125336444336952e-01 4.105266123253855648e-01 5.102818963612119063e-01 3.587994719883045303e-01 7.482532402587260822e-01 6.811736692658804104e-01 7.185400230196904714e-03 9.075398433588378888e-03 1.630836711531340535e-02 8.183351717696116800e-01 2.119764347083288314e-01 1.382293492923990230e-01 5.410877828039960535e-01 6.636262349281547568e-01 1.560351802026499202e-01 5.868174831532833036e-01 3.544623442952319139e-03 1.288063553733815409e-03 4.303218909319328489e-01 4.027226044431795327e-01 6.015984287886858017e-02 4.599382844769576290e-02 1.840750887482814901e-01 3.592252948120722156e-01 2.838995883217108052e-01 1.312411647289494221e-01 1.155761918497982647e-02 1.103060338769382143e-02 1.386215346777968510e-02
2.196821135293050287e-01 4.705698193141553687e-01 8.301341359852678625e-01 6.265041799498577424e-01 4.359241982102880497e-01 2.540018394509716698e-02 1.003003656997278510e-02 6.425632731038024084e-03 7.015481449826087568e-01 6.340775174625252752e-01 5.057638593622041379e-01 1.099792047655934052e-01 1.634765269865467163e-01 4.169929849213308004e-01 6.031889971123906014e-01 4.288221322200819752e-01 5.450038484852791631e-01 9.424332721449412906e-03 1.795060166318262779e-03 5.139768614242443689e-01 2.307390371040628219e-01 5.774653041417250610e-02 1.195011421446959127e-01 1.070536274302006513e-01 9.572115828405586280e-02 1.298629564862702757e-01 4.603214583798896642e-02 1.170381082939595495e-02 1.664853993941194099e-02 1.663394353667847769e-02
8.431573177925770837e-03 1.332524529990980651e-02 2.651992287288402333e-02 1.795744694015131981e-02 4.219712993519123684e-02 8.688234620902812733e-01 1.840551872619576868e-01 1.925342832955642403e-01 1.741360012977272859e-02 4.944251335415621694e-03 1.098171676218918924e-02 1.695971525566432325e-02 7.453989443467392562e-01 2.526671776541340037e-02 2.484271054854962357e-01 1.754071760999305341e-02 8.494220571941385467e-01 1.110331114261104042e-02 1.624343074461585476e-02 3.258487367403084534e-03 1.454143857488977842e-01 4.784452070985194955e-02 7.257247397458148341e-02 2.530869252346553203e-02 1.521136359260611727e-02 1.017449524218727065e-02 9.181050398853057848e-03 7.211313930514256371e-03 1.229493717719155541e-02 1.377866069204301651e-02
3.475026648091147138e-03 8.852232763884413866e-03 2.343033976221513791e-03 1.890315393223270402e-03 9.394089072871373430e-03 3.730338781845350948e-01 3.713646194943167611e-01 2.297088026064037225e-01 1.244016390317325693e-01 1.928898578819564615e-03 6.401254320351154048e-01 1.166365280592962690e-02 7.359108332103720951e-01 5.923463648235863799e-01 1.855894093756103591e-01 1.705088696608719201e-01 3.868349951988349078e-01 7.626960092038290728e-01 5.388613492400309291e-01 4.820016921811635102e-01 2.650940344468772358e-01 1.022424290843012978e-01 3.416181066886147394e-02 6.753924234629067602e-02 1.248174691873430407e-02 9.011538692409341161e-03 7.799974972585771785e-03 7.392995143448501637e-03 1.498847222216930127e-02 1.626407595748325871e-02
7.051357982573527305e-01 2.230619150338884055e-02 1.251450474729142240e-02 7.157399631454299058e-04 4.420010355019546137e-03 2.166994026249168814e-01 3.801500679583239561e-01 2.150149760766483231e-01 7.920936016989883754e-02 6.172895125050263838e-03 3.326173533474593470e-03 1.709399856192455464e-02 4.467631787854920988e-01 4.629075268893606543e-01 2.438241770629637761e-01 1.070302398274383116e-01 1.260012323631394704e+00 7.367838485835745965e-01 1.063964913652831919e-02 6.100397216031701042e-01 4.290143426535444893e-01 1.330431850573717822e-01 3.375922694516861888e-01 1.116970274679392749e-01 2.262706901660146291e-02 1.206342207169012332e-02 8.426457043626151347e-03 9.720572257982782946e-03 1.515917364520618336e-02 5.558695316879642273e-02
8.214071308776154101e-01 7.734170203873477201e-01 3.598533559778883950e-02 2.591837823015688547e-02 1.988088375986278578e-02 1.290056917182778595e-01 1.665140029094297203e-01 1.773831632749599263e-01 1.494596792244909933e-01 4.781899955853369938e-02 2.112339737409007351e-02 1.270147796120153078e-02 2.012099164410651175e-01 7.662798542010360037e-02 6.533643244398960881e-02 1.234175124863668010e-01 6.869671199092410863e-01 1.762060965699018267e-01 5.337540090933610148e-01 1.923572836464360059e-02 1.459699781248924647e-02 7.589178342282018076e-03 4.187367021008903678e-01 6.549402566465199749e-02 3.386862895968115184e-02 3.161079029804694795e-02 1.979050099450244127e-02 1.359901785488997449e-02 1.788360207637928675e-02 3.200426177217191581e-02
1.395260356695047221e-01 2.139462089777428300e-01 2.105867615289151729e-01 9.935666861184940801e-01 4.954445065200565601e-01 8.126078286976705645e-01 5.033032135886252728e-02 6.956831243048838820e-01 7.981025362960757485e-01 8.344629961990027711e-01 5.854987794251991229e-01 2.456947173719049582e-01 1.120723613142216579e-01 5.255576984798774470e-02 3.148040351702804940e-02 6.052408728455421771e-02 3.551359036399892033e-01 1.648762456238582752e-01 8.039839760893870979e-01 1.089350270233228946e+00 5.183653674452703974e-01 1.369013811485461640e-01 6.230235150801353983e-02 5.936782479442514332e-02 2.298389750301942785e-02 2.359118117986915356e-02 2.098790460496112106e-02 1.815713184089822255e-02 2.097440372506835168e-02 4.924087684819078437e-02
3.046799323157756145e-01 5.708023670118691495e-01 3.059438765841256402e-01 6.256383007760242254e-01 9.380769368972798894e-01 1.013844827204760213e+00 8.733200139262383699e-01 8.358966057103937031e-01 7.350161125125115325e-01 4.006398555321427080e-01 1.557928583119655430e-01 4.562820139633375627e-01 9.757222641071994218e-02 3.426536659659582679e-02 3.937753112052092691e-02 7.626826624152646672e-02 6.022536723298921313e-01 9.426436840739220724e-01 8.391176988091599842e-01 6.398914963956219282e-01 2.032105984047679059e-01 1.121968564962545767e-01 4.395542293915156301e-02 3.652496542192658346e-02 1.739234008211733989e-02 1.832140082321816882e-02 2.978159908479350443e-02 3.826514381060289877e-02 3.742631394806562872e-02 1.070001163020148083e-01
7.718754848811251179e-01 5.102082079138350323e-01 2.869703775149826663e-01 1.822714465995599331e-01 1.036607742252546149e+00 4.271669980751269247e-01 7.481370377425421159e-02 6.155881280393182831e-01 5.648250319946462872e-01 5.526284440847455404e-01 4.769281196641592668e-01 5.818997908350914683e-01 1.653132454677681829e-02 7.933609115730868577e-01 1.254160328660533508e-01 1.076271213991126241e-01 4.431415945309093996e-01 1.836900841963705344e-02 1.694062463283784598e-02 2.642761232560308926e-01 5.075141126626631083e-02 5.104967899946385307e-02 5.488181701605086144e-02 3.568538667614271076e-02 2.089632399572549648e-02 3.203154131635599366e-02 1.273121925204451221e-01 2.535792991940130636e-01 7.150124003658023808e-01 3.452286222619278533e-01
1.261592610483719845e+00 8.172248357240952110e-01 1.266274055885504568e+00 1.186438978656155552e+00 1.053939652943138183e+00 2.057701904538938309e-01 8.944413722467385863e-01 3.927814083730175598e-01 1.847758493210399366e-01 6.473113182982553893e-02 8.609665832408244235e-01 7.191121615020431568e-01 1.119569036694319578e-02 8.511173020227431191e-03 7.691317254847027662e-01 7.664876058195717601e-01 1.097584526107137082e-02 8.284967711920235289e-03 4.599310043678571727e-03 4.136131841518444693e-03 6.161103746976666351e-02 3.876336307445170382e-02 4.433344772329131378e-02 4.862592323030361097e-02 2.715553320734907447e-02 3.484362358679923832e-02 3.368962013843007641e-01 5.690538188647767948e-01 6.953324591180758407e-01 1.795399785252444480e-01
1.074964428620007295e+00 5.560315934011774708e-01 1.236067973095430705e+00 1.060331380021473757e+00 1.388790408581103808e+00 1.279300237890267922e-01 1.038776116787274578e-01 9.186529134416250575e-02 6.043632314115056359e-02 4.656419480786360143e-01 3.644362930025053793e-02 2.156358683369745052e-02 1.435226955072865102e-02 1.178488497324732542e-02 3.953012666835144934e-03 7.202342701952434145e-03 7.332488835950484903e-03 4.557767612142770396e-03 4.190002613908739293e-01 1.019437603759860006e-01 4.189246559060613023e-02 3.729564403940457268e-02 4.808132027004168030e-02 6.725509148834506179e-02 7.191418660845311228e-02 3.919954536754792496e-02 6.321856293582996111e-02 4.974974073558807719e-02 4.421483787114625225e-02 3.154969960028101983e-02
2.076463398192997800e-01 1.213153713504475373e-01 1.061761954188025436e+00 1.042132214224850806e+00 8.289095371168363480e-01 1.958144808899173195e-01 7.672556799388784154e-02 4.982878585503185132e-02 5.990677413451668543e-02 9.341994523747870760e-01 1.237918270073197144e-02 4.562230280599271701e-03 5.058013810744254810e-03 2.626632132157013903e-03 9.522072281256325869e-04 2.358819466634989610e-03 2.572747065689654465e-03 8.148652494727563755e-03 6.998917571256118020e-01 2.318581993744101566e-01 4.000234832063078588e-02 4.046473623612069359e-02 4.780022679824674769e-02 8.552713306092425694e-02 8.133657144177046383e-02 5.798347057355195122e-02 4.457313555061319377e-02 4.055110206495786407e-02 4.423392081526306835e-02 4.801409276023260037e-02
4.196795556051385878e-02 1.074198669079580587e-01 2.574005822766157192e-01 7.236044322656047800e-01 4.769647894662106813e-01 1.536894606413843900e-01 7.871633886334317154e-02 6.646098328983529591e-02 8.252083880635407986e-02 5.334864229707323435e-01 1.478245737864264941e-01 3.383174046614772883e-03 7.752238649138662799e-03 1.563608504941618868e-03 5.001644403826721597e-04 1.272362117126628897e-03 6.905898569767264794e-01 2.726528352014112935e-03 5.378292627626908573e-03 4.886058157540364988e-01 3.837351813148816987e-02 4.188050918864098804e-02 5.277980630071521517e-02 8.819227587390343626e-02 1.122092471606513375e-01 9.819491330018317865e-02 7.227974531597361474e-02 6.773745961003531380e-02 5.944914771724410518e-02 4.939133339918424376e-02
3.453286794883247968e-02 9.909394270403305838e-02 1.763674057164102416e-01 1.270031733154374232e-01 7.507524440598264959e-02 2.973055808183816540e-01 9.899869086734944812e-01 8.523224759945193796e-01 1.120175276758664795e-01 3.441566004284923180e-02 1.212387985370899091e-01 6.434488266501439124e-01 3.567041495477278092e-03 2.182714396432533163e-03 2.398018206011394600e-03 7.211159182410398390e-03 6.366120528240626006e-03 4.034639460936833427e-03 1.272473187744934189e-02 1.593121912300301049e-02 6.914130847681878578e-01 2.515935139457232683e-01 1.878389008224707890e-01 4.479530812063048928e-01 9.012609358126018044e-01 7.652739374689858654e-01 7.141777971239948036e-03 7.638574131746261875e-01 8.011824167359618554e-02 9.279237925640804185e-02
3.119956426987106901e-02 3.139870091214939929e-02 8.544819650325864713e-02 6.380314939325477663e-01 2.328682211480834763e-01 5.352838916620407395e-02 6.530079157740682483e-01 3.610094016182884696e-02 9.109988250275240923e-03 1.292348009608081105e-01 2.661751676127421251e-01 9.859960573739988757e-03 5.702829229148865219e-03 1.754230381697209065e-03 1.638759377077791783e-03 2.049707326606674436e-03 3.619105252944908140e-03 6.462265844602748874e-03 6.806900258488067165e-03 2.316748398195334069e-02 6.683456656908582927e-01 7.467395020833063057e-01 6.184712956868555489e-01 9.615079371010443188e-03 1.028566842782203082e-02 2.837896047946512554e-02 2.532535434987723960e-02 7.156027903788679881e-03 8.255529031323667610e-02 6.321390659080386443e-02
2.777983145822893185e-02 3.030683169986368025e-02 6.887892910082996090e-02 7.675176875379158270e-02 5.173670852384994190e-02 5.444315176552316088e-02 2.953257560547871141e-01 7.862287118120042662e-01 2.912899905897960856e-03 6.576975413298823403e-01 7.126053343951007646e-01 5.655354426317625860e-01 2.196889984201979510e-03 1.511194033796771363e-03 1.459484783658804991e-03 2.316679549276513470e-03 4.205447396473034269e-03 5.364378854958952100e-03 3.257033401485187867e-03 1.693169400117754912e-03 2.061181660793671121e-03 1.714264182137508960e-02 1.847317688741806352e-02 1.494059287725822693e-02 7.107024985921654193e-03 9.304007617150123963e-03 7.435363634504699171e-03 6.407430306563059209e-03 1.207378902585894281e-01 7.105002315027719728e-02
3.492679095850539234e-02 4.028086777445955002e-02 3.956310724741655960e-02 3.748661188585688392e-02 5.403420102691910976e-02 8.926578472258456243e-02 6.093187207400881968e-03 1.293816487242076957e-02 9.462292323943341521e-03 2.541735201450220048e-03 3.299215682284871703e-03 5.136353320141083534e-03 6.089950967187689537e-03 3.558329898047395395e-03 1.022121567020483051e-03 1.900726116271014669e-03 4.364590633196059610e-03 4.704112117957943637e-03 2.373589084625832117e-03 8.507524928309535394e-04 3.674125175664435129e-03 6.645274229595151544e-03 8.482978437969627972e-03 8.889034765718431888e-03 7.992031152856985884e-03 6.973387272818329721e-03 1.036409036423985297e-02 8.476519178964542905e-03 1.682158818368539865e-01 9.113172912109240853e-02
8.666795844270219762e-02 6.767842989979674928e-02 3.294092201134130038e-02 4.613365467429068195e-02 5.441434414647956519e-01 3.790196353356182438e-03 3.326436793228497099e-03 1.873459435778976768e-03 1.816160073035427572e-03 8.815631219512758219e-04 2.567995221949153500e-03 6.639082985904732892e-01 6.415648385831470568e-01 3.864847958814483786e-03 3.388813395823790046e-03 2.284100103809692459e-03 6.742407794734919108e-03 9.930943395316600003e-03 1.746617596233287139e-03 1.730142404234059688e-03 4.069442890079720369e-03 8.799629491808191178e-03 1.083746962127005338e-02 1.155419189665097407e-02 9.800539661645289377e-03 9.591105215302191817e-03 9.001512770686869933e-03 2.842841022820290914e-02 8.624927153008242753e-01 7.113656707558384529e-01
3.559762012128341729e-02 9.790116285259685414e-02 1.710935222547577406e-01 6.185288108331573470e-03 5.858214460743067439e-03 2.958075602601121894e-03 1.326104628342772603e-03 1.645444529010703979e-03 1.116482858015809248e-03 3.636147025061826910e-03 2.996597574307336212e-03 1.784425106327991450e-01 2.757185624367722854e-01 6.452264385221246901e-01 3.059963144890767966e-03 1.063645863021487172e-03 2.780956614790567206e-03 6.143286799143250487e-01 1.940275994514372437e-01 1.778130825833593512e-03 1.562703583496692509e-03 8.450645917114923619e-03 1.085497201627852980e-02 1.168795431586173647e-02 8.750708236069406482e-03 4.128559534274739429e-03 6.760514045779292269e-03 3.083482326655108061e-02 2.485935463411593355e-02 5.167381104245759582e-01
7.591671833542568137e-01 9.930643546090855978e-01 6.987265652711207586e-01 8.540648632888138136e-01 7.277672276947719752e-03 5.694217123613606229e-04 2.820153563536257745e-03 7.911841759845626492e-04 3.377467214338143904e-03 2.490210270387373595e-03 4.733334427939192568e-01 1.216699523949022199e-01 2.135173776906747478e-01 5.174998729718063295e-01 5.290564074510988729e-03 4.776692279398814440e-04 2.583761374988812094e-03 4.787212797398480157e-01 7.749226901169156134e-01 4.151346416168800145e-03 4.982564111092782633e-03 9.726488500699317225e-03 1.076889579732838095e-02 1.057431361149877708e-02 8.353219137328501270e-03 6.246204523837791713e-03 6.132893123132348440e-03 2.338596321418990459e-02 9.038102840036659202e-01 3.945474975518066252e-01
1.113802779049135813e-02 1.461143860381087026e-02 9.540661911544906157e-03 9.080430667007084455e-01 6.682811333683582808e-03 6.257095489915331932e-01 5.565644266113270976e-03 2.871430664995724621e-03 8.497038260573006258e-04 5.177781526045506233e-01 2.092838871731394768e-01 1.850023554160318828e-01 1.042152083025069953e-01 4.850040085054404398e-02 1.035034962195904018e-01 2.980642219781914903e-01 1.054130518520009392e-03 3.631852388033267928e-03 3.205293081088295918e-03 7.640667113855288337e-03 5.060787267421932439e-03 1.289149741418055620e-02 9.924090721132261539e-03 1.477228116061652004e-02 2.732256501235446472e-02 2.296523070719449014e-02 2.376436509625196383e-02 2.958042167280051232e-02 2.199788599243006071e-01 2.393503959620700283e-01
2.474407013436128269e-04 2.665145602247326068e-03 3.381236609200088394e-01 2.903853211200545514e-01 2.724820925611342037e-01 3.870205889197039784e-01 5.432896243658691393e-01 1.359898903888314969e-01 1.896993037987644570e-01 3.290957414299569561e-02 4.873161670847268867e-02 7.692391722324182224e-02 7.376872401373946175e-02 2.343494128211044414e-01 5.225207825019978491e-01 9.295213922877715307e-03 3.102736726186322482e-03 2.264852600808071621e-03 1.606942545659816902e-03 1.267972768125361300e-03 4.546062032628032240e-03 6.690651944022149231e-03 4.268055949915824931e-01 8.219436617229872732e-01 5.219460884216393232e-03 8.993499476693318506e-01 8.706215821421690038e-01 3.166652852899758397e-01 4.070644587176382168e-02 3.797984422926713177e-02
2.244481276628742042e-03 6.441927262873913679e-03 3.742396524114048328e-01 2.200289752751659056e-01 3.710759405440609560e-01 2.919534686678086355e-01 4.570620978282162183e-01 5.043170875688661459e-02 4.475706567515791434e-02 1.936246719338355349e-02 4.794871641747446706e-02 8.869187333425138098e-02 9.698523951351784023e-02 4.526556021468342572e-01 5.883619305069309746e-01 4.087381996153801114e-03 1.666713805093357221e-03 3.188956084019330291e-03 3.728608266971439756e-03 3.414771710268148155e-03 6.215129913356196890e-03 6.971176075992704391e-01 8.270946220319177478e-01 1.620514154999776191e-02 1.369965755163526228e-02 4.730148917681349305e-03 3.700190048654476982e-01 1.505933531625477106e-01 5.583708709827946148e-02 5.353316050045630464e-02
2.923147110930094609e-03 5.948174590744226276e-01 2.109957638676647207e-01 9.351093818990884043e-02 1.225044254671312782e-01 2.794562074788065620e-01 3.649599690472081215e-01 4.122078162657982769e-02 2.209283922620875612e-02 2.514658873396415778e-02 4.563081417968928299e-02 7.799068860420019234e-02 7.273817790449182974e-02 3.494480006200673672e-01 6.051611756048493052e-03 7.365590529060876690e-03 1.253586211976364957e-03 2.925554174023065838e-03 3.781900199510464938e-03 3.403174760996901475e-03 2.382178081447235835e-02 4.347766993585510109e-01 2.996216910210702800e-01 5.369958307340841897e-01 2.873887135358933406e-02 1.272656005293642395e-02 8.397718845522020650e-03 2.584727005157830271e-01 4.510823512647926109e-02 4.070376528587739406e-02
3.591742020062361693e-03 3.509018728323998366e-03 4.705103545644330199e-01 5.244282873077630303e-01 1.296185570988054536e+00 9.085048429360192968e-01 3.768090860050525293e-01 1.546831990708008309e-01 2.342814702063341636e-01 2.983129973388100598e-01 2.781699481531566681e-02 3.244010083906107011e-02 4.302706686181268642e-02 8.459229519838369626e-02 4.385059079648094826e-01 1.480747755292425791e-02 7.635620715388281680e-03 9.596619968712413046e-03 8.225465331786776385e-03 1.444912536725228777e-02 2.391557424664448456e-02 5.409531615094492762e-01 8.759552952662286174e-02 1.523380510470496718e-01 6.207403694617076306e-01 4.605305608399004602e-02 1.773731607399415405e-02 2.238442885742336977e-02 5.285175653760569581e-02 4.609766592062572443e-02
2.472254073546328000e-03 4.643581714542337480e-01 6.199578824426661416e-01 1.216215428760709427e+00 7.293927109904436712e-01 3.328996975011559445e-01 1.523422676942989273e-01 1.075516561937046311e-01 3.494475753785905581e-01 1.321788842587523494e+00 9.183911536540162457e-02 3.404855698479268555e-02 5.198639498051099705e-02 9.935745516943628175e-02 4.228146063957310963e-01 7.003525354784667645e-01 4.119633401383302473e-01 1.786190325238082577e-01 2.533096101396072886e-01 4.323342290078874273e-01 7.606307501620661604e-01 1.801914055092775635e-01 9.437303227604670885e-02 4.569186599998654730e-01 1.045150645166394998e+00 3.235992685845598404e-01 2.554069033951768958e-02 3.984307142202997420e-02 4.326397478367879912e-01 7.358023716829478755e-02
3.982836476896826731e-03 1.063126157114031356e+00 6.116170368813810265e-01 4.929283575666369988e-01 4.983832475848226640e-01 1.859672311264803923e-01 1.229621865851570628e-01 1.281465205046115052e-01 1.481083871420293963e-01 5.785542950980925303e-01 1.707414031126152920e-01 1.772820269234439139e-01 1.480946041587320461e-01 1.649899652688172347e-01 4.414803018190579520e-01 2.903345742884517744e-01 1.826971758739686646e-01 1.018919893433477275e-01 8.613094279072164294e-02 6.460617630279227863e-02 5.194430992689341720e-02 7.638948287999926257e-02 1.181664301314128279e-01 2.832673494263069913e-01 4.853057781293824702e-01 2.185069125446616467e-01 3.203557629869029921e-01 2.194208797587004212e-01 2.261922974585965918e-01 1.490144298600624140e-01
4.325930472225562873e-03 9.264371384351026695e-01 5.969451886435905852e-01 8.890846264487742845e-01 8.124236401193107859e-01 4.446408512036473248e-01 1.850777947379699060e-03 1.244590005611269090e+00 1.967182649849980869e-01 1.403818682088002201e-01 5.358587213323739301e-02 1.327687983233333535e-01 3.488149172580075619e-01 3.489949122790667602e-01 1.008464279635351790e+00 7.103772957840436275e-01 2.051830234222072891e-01 2.204369579452664096e-01 9.729410981611294473e-02 4.278364067049927194e-02 4.169852371466559876e-02 6.547354643582135869e-02 1.002295429074766542e-01 3.070409052861174937e-01 3.108844089718831305e-01 7.331431081336521605e-02 8.069295324213274223e-02 1.031848482694559255e-01 3.353150459932828786e-01 6.853834546156045704e-02
2.275403348130878786e-03 5.473020177526670763e-03 6.698403777516569457e-01 8.254681819961164763e-03 4.858319174294171809e-03 2.729558108074306867e-03 3.702998741680544985e-03 4.931119758093653882e-01 1.951985357868424587e-01 1.114365470987560836e-01 3.421257302201483746e-02 4.691396606605773706e-02 5.255598988970803381e-02 1.914195485259628793e-01 2.257116974963028211e-01 9.279099400063348102e-02 7.110016544326519528e-02 7.002254071339206187e-02 9.236981956677393912e-02 5.313803021043654595e-02 3.774398400655515351e-02 5.633346566780211145e-02 6.431846589501598321e-02 1.078584060496374231e-01 3.374636054225866322e-01 5.317515001750044296e-02 7.702563942994836155e-02 1.256912009432173960e-01 1.513341279059699507e-01 3.001670909659914788e-01
1.141143885226386071e-04 4.192556699233042188e-03 1.036507689837093737e+00 1.228657640137717166e+00 3.657819785667602679e-03 3.645816085321233985e-04 1.462922600465838474e-03 3.434782120223728863e-01 2.652104009088612768e-01 2.470217732622140006e-01 1.015624513209785196e-01 5.249246117819723889e-02 3.358789585028898461e-02 5.290087682734314484e-02 2.387844439289877052e-01 6.082339296312275212e-02 1.554229983260263237e-01 5.672542905437665851e-03 9.339654717286018093e-03 2.030215657062814649e-01 5.254286575807146087e-02 7.364135851582392922e-02 6.422697689994721904e-02 7.098784738656445381e-02 9.456638741004436133e-02 7.259513361998468084e-02 8.545922482470166837e-02 1.049654053713580254e-01 1.409609125370422100e-01 3.456954538817549327e-01
