1.030166994985170711e-02 1.517710447343870346e-02 1.310472125852596599e-02 1.638967451483757526e-02 1.236038227700010823e-02 2.701174195533629849e-02 2.686482173361827777e-02 7.292392896494744037e-02 1.324157384248824121e-01 5.904800519942443593e-02 2.700152073323875898e-02 6.086321226353214389e-03 3.551965086105827139e-03 1.332117270785956181e-02 1.553558370584925442e-02 3.410530927875076411e-03 1.214843033055299469e-02 2.167172686239775964e-02 1.999853409442840443e-02 7.140486020337270638e-03 5.650178146103061565e-03 8.406984144514849247e-04 1.948582497974309449e-02 2.492230942584735751e-03 4.501692224230214971e-03 3.474412340930353033e-03 1.590588354149801049e-03 4.820877684350707501e-03 4.643972801568668762e-03 5.792154199000908513e-03
8.146845811354806038e-03 1.803140159134223458e-02 3.221706205418594510e-02 2.627258282885133744e-02 1.821031381826209578e-02 8.104328213647982171e-02 3.832687702758823256e-02 4.853709864245475680e-02 3.167340507294823942e-02 2.716527494164495959e-02 1.912520205555818392e-02 3.728046536514784473e-03 4.932553295271036031e-03 1.119172144779800870e-02 1.551489842767708911e-02 9.819171904851117447e-03 1.221568076302394570e-02 4.058108900814736547e-02 3.109059436836699233e-02 9.442854816421552416e-03 3.275945302008027686e-03 7.557212850127359568e-04 1.580634799723911041e-03 1.369132456077188720e-03 1.117623871193392047e-03 1.458096987036801989e-03 1.832194328587525775e-02 4.834561745195568687e-03 6.980206535070819333e-03 6.940626034822045508e-03
9.853503816405970173e-02 9.989917736187076125e-02 2.114401459410102380e-01 1.723597274980520899e-01 3.646163749761792694e-01 3.685697092923399809e-02 6.774452871706170172e-03 7.268436837000243934e-03 1.168247025419951596e-01 3.628759901012943573e-02 9.853998716905058852e-02 6.619530014021904329e-02 2.429647731652781126e-02 3.482681276608184939e-02 6.546762306650956605e-03 2.681523478342263608e-02 1.803298176213312745e-02 3.730885833158494730e-02 1.255735735465876024e-01 2.101203846464750127e-02 1.956384378782594514e-03 5.747647048974660958e-04 8.778290015849910368e-04 1.047162077460026680e-02 6.241727768405363509e-03 4.188989448603663499e-03 3.777719224261350071e-03 3.017093338714259103e-03 5.133453952039477262e-03 5.738156017740516854e-03
4.615159406084817090e-02 1.323957749477192858e-01 2.909621219053160623e-01 2.353969510851856295e-01 9.554512594774733358e-02 1.458746241647014899e-02 1.132732601348661501e-02 7.588206768631769461e-03 4.633006107599126067e-03 4.441500713377875831e-02 2.906647653101009782e-02 5.833098821440057397e-02 2.637515881417324889e-02 1.714340412335627409e-02 4.937598375521864112e-03 3.658891822535744430e-03 7.623530389345475888e-03 1.432992958671357869e-02 1.018256974688575879e-02 8.704487510652952550e-03 3.862352832032934623e-03 1.325607093851252204e-03 1.337496649957496328e-02 8.065827014866875548e-04 5.128891453226359226e-03 3.830305702211545850e-03 3.297944470334056560e-03 3.111550172009834581e-03 6.116194131174496756e-03 6.624843234412527634e-03
2.668802646616603991e-02 8.332641159480887183e-02 2.331072042544612422e-01 9.031983645820633455e-02 5.093106141971923129e-02 7.313809551728180612e-03 1.098570348987799004e-02 6.018875313619502683e-03 2.780474317753729805e-03 9.936789075322341458e-02 1.276396990373424023e-01 1.090882850213355654e-01 1.603648802464302178e-02 1.289949103035787324e-02 5.874310498320800197e-03 2.125344519562364851e-03 2.263111185927414726e-02 1.301497844386893289e-02 2.089174563208956448e-02 1.202143387727752470e-02 8.268673594589359341e-03 2.304458681964318897e-03 4.973026673301174545e-03 1.387492908380034756e-03 9.192876327266077952e-03 5.159983574397989173e-03 3.607586645155945026e-03 4.131126944261084843e-03 6.253518492804602258e-03 7.659342447424215489e-04
2.666127649709889094e-02 2.819473290780130648e-02 1.265932977638022372e-01 1.014525432070184502e-01 3.987635965734756538e-02 4.215039844846454366e-03 5.023494112247068287e-03 5.268792914324534928e-03 4.893928750817544068e-03 1.511788052557225537e-01 1.209515837142079026e-01 6.371381483300812831e-02 7.206277332475453067e-03 2.292614523976003321e-03 1.695551669301521543e-03 2.700123758332680524e-03 1.257109062192821036e-02 3.280025991602606664e-03 1.058148821199580460e-02 3.656275204449281613e-02 4.456384153498936518e-02 2.624372723333077972e-02 6.431997774190158224e-03 8.572942563811638932e-04 1.369789019574265895e-02 1.361078294660975595e-02 8.573958087438110151e-03 5.829911653232496861e-03 7.255954080495619941e-03 1.293726651720109554e-02
3.741026961759946583e-03 5.995081530982901072e-03 6.340470397755459606e-03 3.213186494702872237e-02 1.536973916634064297e-02 2.510179414714186485e-02 3.709207556354624652e-02 2.063074445914575561e-02 2.408674578595327784e-02 2.845522898647635454e-02 2.222636153587234306e-02 9.175133550554864098e-03 3.828553970984441019e-03 1.659806602449981393e-03 1.194857474995546232e-02 1.426097293564732504e-03 7.103963997779726494e-03 3.364215766826644544e-03 1.710533530924251630e-02 2.339972945504018714e-02 1.083119755081198878e-02 2.730894949737706651e-03 1.137791044658612504e-03 9.850701310667232292e-04 9.505152180282385593e-03 1.018903335629683070e-02 9.059229588829256427e-03 7.688298939046139986e-03 8.268256140885698810e-03 7.005696615193373082e-04
8.213856691459360537e-03 1.514973793320795528e-02 8.832830538109124816e-03 1.897311825514760852e-02 2.909923915321910998e-02 3.229110725575651264e-02 2.798466915553034229e-02 2.584595237595426961e-02 2.016754049307518601e-02 1.140385068439687608e-02 4.634761158545727157e-03 1.446739221698061309e-02 3.156682551516150088e-03 1.398745102981201194e-02 1.561397052448850950e-02 2.060866814411977267e-03 1.461006620753309629e-02 2.358252926009379857e-02 2.074105192627489352e-02 1.470059612145935106e-02 3.980132415307449829e-03 1.983360234254907557e-03 1.660391798112590203e-02 1.448581430903882715e-02 7.294189452724122481e-03 7.583647905871422797e-03 1.139292557792805256e-02 1.299407781638344840e-02 1.223534318341110323e-02 1.389447206078129205e-03
2.223666738924299016e-02 1.473173092049926032e-02 8.531966414188392120e-03 4.910716130876836838e-02 3.153069989521582739e-02 1.315244850491716425e-02 4.139080727114193003e-02 1.823103022913899821e-02 1.482247999425956829e-02 1.473379205146328752e-02 1.325745060236428394e-02 1.767295397567048704e-02 3.959216043797607332e-02 2.671944448705148439e-02 3.919666520634393705e-03 3.443690396583422905e-03 1.447235728895426496e-02 4.455846719103757902e-02 4.410382097508382809e-02 7.305263650883511359e-03 1.269057286340410451e-03 1.199271116447244660e-03 1.316840630072580376e-03 1.391736466775136960e-02 8.415279097736819841e-03 1.231826898187294086e-02 1.688415745525282318e-03 3.185508161480131439e-03 9.271207707455932437e-03 4.599957055722480453e-03
3.746453982403236127e-02 2.468809398843435296e-02 3.876437154419021258e-02 3.601017261419125343e-02 3.094735077241048474e-02 6.003272067551858673e-03 2.707913779066227489e-02 1.132505218355692352e-02 4.600640514574350602e-03 1.746241146278227751e-03 2.582561155442272480e-02 2.556553888321200924e-02 5.416032827143214823e-02 5.803327568150649929e-02 2.726372819335908665e-02 2.971707730214736762e-02 1.613943714897939918e-01 1.692804536537110827e-01 6.812352128105551852e-02 3.021482795915218789e-02 1.873191906135017893e-03 1.535667059860981905e-02 1.660242901367306803e-02 9.909170845880449149e-04 1.003063656801411567e-02 1.277481690780191484e-02 4.727179265489346409e-03 7.485283814694440943e-03 1.005115897962260453e-02 2.702628522476261362e-03
3.092821930377749953e-02 1.641875591671548146e-02 3.613048758426452844e-02 3.076324492468723165e-02 3.822271087485458463e-02 3.450174374143727147e-03 2.811134017475551677e-03 2.390534349062300914e-03 1.446037758425547685e-03 1.307831700120063757e-02 2.078677622789797119e-01 3.521399721829857055e-01 7.291937225245693766e-01 3.578390036261234197e-01 6.554544537161664797e-02 1.286094296463516085e-01 2.421165009140961721e-01 6.744864578751526285e-02 1.609126331039190810e-02 3.397197261529300190e-03 1.621848201457560439e-03 1.538200641854446833e-02 1.423221737904430172e-03 1.331122672417861313e-03 1.301243089196849013e-03 1.412401721686689510e-02 1.123125340202269992e-03 1.002507480418766972e-03 1.515545067091564162e-02 1.096689873905442626e-02
6.351649311685388447e-03 3.738322250164801287e-03 2.922752084398680741e-02 2.885710576347024284e-02 2.216244795731160677e-02 4.966870181341395858e-03 1.861456757260663295e-03 1.161715427920389891e-03 1.396364657979661189e-03 2.616312190398570325e-02 6.400641773734984386e-02 4.222498772770164610e-01 7.588475239176500908e-01 3.930893510199265917e-01 1.412550710851585567e-01 1.596933871996719934e-01 1.773421994372113286e-01 1.047746437408545866e-01 2.572200801470901285e-02 7.721677499881352165e-03 1.792359070044972566e-02 1.711966193861615831e-02 1.385939599104765675e-03 1.734463982978324279e-03 1.696421832782614826e-03 1.171316688383685278e-03 9.940232252539458330e-04 1.638068663121918997e-02 1.687417964232105355e-02 1.054908536609704172e-03
1.534800448041485389e-02 3.751497774768481046e-03 6.705241687320154589e-03 1.907539536552214227e-02 1.238615912018154255e-02 3.848625991841237229e-03 1.908483593060609617e-03 1.538450284975018427e-03 1.905421707187629878e-03 1.355544134820156794e-02 4.487151634206032295e-03 1.340275056500129791e-01 5.651853880074856340e-01 2.439207676645477330e-01 7.701002275313398315e-02 8.963499787374114292e-02 3.314944721110896220e-02 4.863866386980614243e-02 5.530978880683582594e-02 2.163606881135897095e-02 1.623361726754656486e-03 1.479901414067784880e-03 1.655401990735299710e-03 2.371432332330824459e-03 3.053904149129170898e-03 2.807495505669515071e-03 2.239899784038595822e-03 2.236741369319398837e-03 1.683787523589822931e-03 1.146046243470807925e-03
1.323792522761659159e-02 4.577831081692114966e-03 5.029559497904004771e-03 3.244950216549862161e-03 1.924395977440350415e-03 7.397408164763252802e-03 2.502186321438404706e-02 2.120550764861724169e-02 2.747533063175775728e-03 1.492900660478573872e-02 3.330672717947287358e-03 2.183182503177290984e-02 2.581999001958059647e-01 3.538767007964354061e-01 3.810432137469921265e-01 5.196312106594035418e-01 4.674742904889779282e-01 3.033786547197367955e-01 8.282366595155438160e-01 3.818918144692434735e-01 3.093935373399072861e-02 8.807418412413994466e-03 6.554743297358108650e-03 1.629319570522486105e-02 3.754855397991110899e-02 3.489183612432301268e-02 9.429999160558387439e-02 3.002926461458034837e-02 2.285525767488403616e-03 2.076405668410855228e-03
1.268066988100441210e-02 1.195013807308644739e-02 2.904751939007598361e-03 1.561114193890303717e-02 5.634921932942206328e-03 1.296808638153784145e-03 1.683622524960608213e-02 4.883035225675069063e-02 3.336571399388553461e-02 3.383400489226121369e-03 7.125563102222694407e-03 1.105537287979850986e-01 2.356654065879487392e-01 3.020118342564869773e-01 2.748804026873045148e-01 3.346229293726028509e-01 5.707944644486203645e-01 9.858362539609172304e-01 1.001701300242104464e+00 7.806916910179780844e-01 3.282320102139105883e-02 3.379564066309868192e-02 2.995945574773390199e-02 9.289170582332803572e-02 1.322371274710598121e-01 6.697967392577218737e-01 6.608710346957229476e-01 1.300483710269216275e-01 2.760222666799621704e-03 1.567754089118174841e-03
1.200121490180345099e-02 1.247061283444115057e-02 3.098321268813854657e-03 2.234383093800139039e-03 1.242138403961787251e-03 1.313940719577269718e-03 9.321562536413540573e-03 2.649560028766804326e-02 5.483589532987905718e-02 1.944543853440557427e-02 2.000905776998085014e-02 1.752323366676280039e-02 1.368631421390560654e-01 2.775787738442511143e-01 2.590069305672764166e-01 3.974818607365934175e-01 6.882007985084164225e-01 8.353645806033952459e-01 4.813495484935585988e-01 1.040494125228036554e-01 6.171868272562264224e-02 4.199283371322864999e-01 6.083722364600377963e-01 1.005297401818509462e+00 9.325499794112120933e-01 1.203731226516453034e+00 9.519055384892451954e-01 2.666185009884620705e-01 4.401093589491227552e-03 1.918431352856754838e-03
1.478658956238739115e-02 1.668268875734412252e-02 1.588246447244806916e-02 1.460196669755649095e-02 1.343386501779530919e-03 2.623485532702495449e-03 1.544978458179617486e-01 5.205046250869557189e-01 2.536381424378086891e-01 4.338542598486992002e-02 3.223721638450589844e-02 5.050870480458689166e-02 1.000070805311994437e-01 1.467132081089054241e-01 1.930022486083310396e-01 3.448366961985741552e-01 7.426863793676133918e-01 7.445245085843570365e-01 3.508813205898548282e-01 1.195448829821190162e-01 5.102697948432540764e-01 9.177419092161924752e-01 1.166773579362688107e+00 1.176377618932977764e+00 1.019369930970687177e+00 8.703531896567413551e-01 1.271333690898602375e+00 2.177351822689790606e-01 6.802138833456310152e-03 2.790178644530072471e-03
3.220565957602655911e-03 2.936607307183691611e-03 1.428665428977607919e-02 1.582316066698138610e-03 1.611769008712820445e-02 7.680736132414316131e-02 4.314048039949128777e-01 3.532009753086819970e-01 3.467343156444464003e-01 1.737276517933183662e-01 6.383065992743368333e-02 1.732835276923424053e-02 1.690655803213219135e-02 4.281921068055765528e-02 9.562572648889032523e-02 4.345723614912118116e-01 4.557336692759750285e-01 5.278246139241492552e-01 9.153784084644535357e-02 1.604965521321197464e-01 5.625519220982466706e-01 1.202776319802840721e+00 1.463745270136295407e+00 1.485113560326190463e+00 1.202513884795979981e+00 1.145167703863783304e+00 1.053697050448773265e+00 8.240439160683472597e-01 3.616012021155019796e-02 2.350273102065875835e-02
1.412655967241637639e-02 2.356230539412928777e-03 4.218411878975905117e-03 2.927475218881618255e-02 6.301044061738206303e-02 8.969237585328651563e-02 2.824191735965926320e-01 3.528905520118498784e-01 2.414159903671135310e-01 1.877692401974446479e-01 3.933835384197770929e-02 3.868069861184052476e-03 5.828126990680029644e-03 1.609970142765236936e-02 3.436814353093676361e-02 1.984650816998557721e-01 7.543450464870123107e-02 2.397255844135807307e-02 8.018500155572420851e-03 5.798155869853239414e-02 2.180592842421819610e-01 1.146051921581520361e+00 1.428642523018744059e+00 1.466859498573469534e+00 1.052444207691400457e+00 4.809191352646918216e-01 7.727889934186104037e-01 5.233627394224907858e-01 4.682823234887583536e-02 1.814444093590711349e-02
1.987296567065560682e-02 2.603875442776649660e-02 1.714424203548795683e-02 2.158593211095141337e-02 5.138992036785406531e-02 2.957832909033912897e-02 1.516742123774351969e-01 1.955536476700620585e-01 1.793705659366675864e-01 4.212365243866628833e-02 1.055421284767186357e-02 2.237248304134094919e-03 3.871848892893534934e-03 1.108231359455299180e-02 4.268174525091310983e-02 2.786317286078473371e-02 5.064787604361932483e-02 1.492794464912959584e-02 2.808432057421284336e-02 1.331215819197776318e-01 7.080113564669294757e-01 1.319065884306678482e+00 1.392210780420017224e+00 1.299102313479711501e+00 9.813366457763577078e-01 7.087064769728211866e-01 6.796325541686423222e-01 4.527010480148508376e-01 4.046340888153620446e-02 1.418595341959057177e-02
5.424871187562071290e-02 5.084590542188532208e-02 2.655076504468534618e-02 1.947291870230061228e-02 2.578933700082543592e-02 1.389240934590799635e-02 7.865171664121131667e-02 7.011770320128733747e-02 1.910346039996588946e-02 1.034326300051937458e-02 3.572334492538557608e-03 2.859270374030939595e-03 1.697323789913427134e-03 9.231723989614814630e-04 2.350739315521522665e-03 7.787907339991201154e-03 2.786845269799682542e-02 6.358890627212693269e-02 6.130459326636582967e-02 2.728796731977432000e-01 7.326612674471908448e-01 1.040309677988485726e+00 4.148508865273706769e-01 6.126097623491574273e-01 7.809643166819976168e-01 4.368934934780273616e-01 3.225265574963087634e-01 2.648747015700422258e-01 1.068293956817319493e-02 9.820294725031432706e-03
4.420078407578263702e-02 5.198460966548686807e-02 7.785045686382821226e-03 5.495001673225161608e-03 4.614973901821754938e-03 6.914104246141624353e-03 9.795442016715923475e-03 2.433568866081204686e-03 3.154579984494081547e-03 5.039684273849311938e-04 6.789320155756171146e-04 1.038001829870886621e-03 1.144577267405988115e-03 4.008353065545151861e-03 1.113263311042237032e-02 1.421803028745759756e-01 2.741751984967001343e-01 3.979580588681148057e-01 2.725421972111259916e-01 2.032759174557293158e-01 1.403941352257144781e-01 4.890666913412097805e-02 1.856480665157378071e-02 3.984272809086614187e-02 1.427851901871393658e-01 4.765530921139648352e-02 4.309122971839433186e-02 1.462232282188868047e-02 1.619644607121127969e-02 1.518775831055188021e-02
9.457932651092709753e-02 7.400295268778402102e-02 8.046708004111675916e-03 3.532087535280625107e-03 5.289177527198725588e-03 4.140225149495750830e-03 6.413891143737491217e-03 6.875851006016970007e-04 6.013420042146910317e-04 8.646653550848626066e-03 6.460010156915857232e-04 1.187835129984484697e-03 1.539900537773019988e-03 8.251094902788563140e-03 1.353675668570170250e-02 8.446687692066476294e-02 3.111949598063384892e-01 5.827788830930603625e-01 6.619362381028081055e-01 5.661911834250584752e-01 1.162763462560151007e-01 2.512098725132234575e-02 3.049963215574007236e-02 7.504011532230299431e-02 1.658874723400335371e-01 4.855560216510185906e-02 1.814743051204532887e-02 6.846670432132035029e-03 3.071915399384628383e-03 2.838095470947207127e-03
1.196752952563011480e-01 1.544577929133680513e-02 4.279570438054723473e-03 1.427040166692821301e-03 1.647452867443048585e-03 3.620727080620890406e-03 4.683157246752814654e-03 1.740062991372692131e-02 9.958716144960109290e-03 1.141916385808753980e-02 1.997976791107297645e-02 1.089434758899593143e-03 1.179011123891463486e-03 6.393311770769812170e-03 2.505764110889191140e-02 1.212427658530638303e-01 2.367633363805239366e-01 5.481603346309641411e-01 6.925764531576239502e-01 5.792816735270165385e-01 2.792269957528696334e-01 1.557462730191842663e-02 1.081169089988944475e-02 2.355337665930185356e-02 1.355129824412951156e-01 8.181217054636986952e-02 7.265684570031544220e-02 1.342633297937652001e-02 2.413615505553481054e-03 1.615872365530536189e-02
6.686772196226108134e-02 2.096638567835993477e-02 8.178031039968109220e-03 7.744607402292134207e-03 1.736911665902910254e-02 1.188495252214339000e-02 4.948096629143079565e-03 2.033080240606071135e-03 3.070649953316930986e-03 4.123777846128753345e-03 1.219499009854907098e-02 1.363977390051838122e-02 6.761910351401312878e-04 1.481883814976223254e-03 9.131244494995782376e-03 3.760178025747585445e-02 3.818088744232887854e-02 1.637356919408714806e-01 2.108934730431049065e-01 1.801047812863685038e-01 1.467396860434296568e-01 1.840022006382052711e-02 2.774224044771398008e-03 5.479100823212406865e-03 2.434792799782658362e-02 6.168540948610654051e-02 1.644965607115890238e-01 9.075437640038531983e-02 2.760299893792277949e-03 2.097461860547526150e-03
2.396057739056011576e-02 9.634966013687473047e-03 1.037476641517349682e-02 1.774116716380579398e-02 9.761567057214466311e-03 4.368857828068285244e-03 1.996149855992493480e-03 1.393048992342280643e-03 4.412512761197982629e-03 1.726250914990505939e-02 1.267958970678912702e-03 1.311656931763961753e-02 7.250390331216834778e-04 1.535470698946633144e-03 7.422970631840842756e-03 1.343647238537291205e-02 9.315356579703195500e-03 4.648734846517351728e-03 7.391487002791540840e-03 1.348492759041477855e-02 2.366384905099856370e-02 5.352697761893311472e-03 2.750775829369368763e-03 1.420063719349841033e-02 3.464902796602026963e-02 1.241295494385391725e-02 4.262999296660722331e-02 4.697175346897676518e-02 1.620414475329570031e-02 2.376321816873152703e-03
2.429325778527814325e-02 1.975032192165105185e-02 9.711486059816693342e-03 7.198706368696657434e-03 6.736325496140473795e-03 2.523811610781047203e-03 1.662591140255397512e-03 1.696095711933362201e-03 1.874512082251918003e-03 7.492126116857724012e-03 2.194676670276442861e-03 2.074413183629912703e-03 1.969253743704067749e-03 2.471848718480548074e-03 7.318310941188180957e-03 5.205293112350831489e-03 3.675511087852192764e-03 2.289310618443199125e-03 2.096028329359894173e-03 1.649992428392971135e-03 1.333240831917047913e-03 1.980677591457147713e-03 3.219044204193412077e-03 8.260160822598762442e-03 1.465658056779821708e-02 7.069852282080651973e-03 1.122107272289188384e-02 7.439157129992427474e-03 7.386793295118421893e-03 4.630720635461479939e-03
3.302432709252110798e-02 1.743365098703047664e-02 9.987550424626854065e-03 1.377492247413258063e-02 1.219107238086996996e-02 6.621772519914310984e-03 2.255280156052617141e-02 1.700173146368976623e-02 2.509454825735264391e-03 1.861842973276740506e-03 6.660768387924705233e-04 1.526420048884570774e-03 4.532951026230525905e-03 5.183927271918852518e-03 1.647704759673394165e-02 1.264938186740597291e-02 4.192976336439588163e-03 5.203509697855890521e-03 2.506647972831529611e-03 1.258198464437301203e-03 1.159473103205353392e-03 1.783965396737500261e-03 2.508691588795970272e-03 8.201358096435103565e-03 8.702435671362140912e-03 2.141627247247427940e-03 2.402476159209737151e-03 3.116411567590388672e-03 1.015982028764145575e-02 2.064083754409588595e-03
4.447950090425344116e-02 3.898853476470522800e-02 1.192185835604789995e-02 4.109362483563751278e-02 4.815404310579816938e-02 9.106250506126620237e-02 6.099283506380167447e-02 6.895455126264751246e-03 2.482217045252178411e-03 1.470579497804249281e-03 1.425267970181819110e-02 6.010656604509663969e-04 7.342376174284527632e-04 3.027420926692886774e-03 3.713970158266825458e-03 1.731369161439884861e-03 1.787065464209123622e-03 2.317064201292539684e-03 3.310182565503267532e-03 1.956757984270106766e-03 1.332576514641741969e-02 1.468835903322000900e-03 1.481183174268183717e-03 2.674490014070241787e-03 8.942528197394316106e-03 1.484184794786788620e-03 2.205621668879025141e-03 3.711417073189638653e-03 4.577371531245436748e-03 9.043153423456332454e-03
2.437261208796697928e-02 6.141191585378887735e-02 1.846466253767050161e-02 1.985895360080846411e-02 9.685629431462258743e-02 1.025130883558022371e-01 6.810144994788883133e-02 4.669976336765357949e-03 3.298262503435700401e-03 3.220180713863465306e-03 1.334114999740322605e-03 7.543625519904810593e-04 1.227797127681812955e-02 8.575679252840424710e-04 4.057712896564255774e-03 1.247931547914966953e-03 4.741658538390087878e-03 3.085906853431535229e-02 5.716083717194049563e-02 8.605184028559104831e-03 1.681399402350561159e-03 2.147137019011467231e-03 1.632216837965927252e-03 1.920415754834892044e-03 2.720700630819101323e-03 2.212289233824246085e-03 2.690774399982566976e-03 3.379932582429616243e-03 4.676670609103661565e-03 1.145127471045153875e-02
