24.1255182191489 24.1255182191489 24.1255182191489 24.1255182191489 24.1255182191489 24.1255182191489 24.1255182191489 24.1255182191489 24.1255182191489 24.3645283302994 24.6196349751102 24.8738070396545 25.0394539416741 25.0377785826662 25.0361050243653 25.0344332667852 25.0568132008483 25.0886519264825 25.1223486586255 25.1640977491583 25.2374524129678 25.3098800259115 25.3813820906692 25.3083802142945 25.1292542602453 24.9501280171398 24.7710014852912 24.6594536300651 24.5479552018675 24.4355396561742
24.1255182191489 24.1255182191489 24.1255182191489 24.1255182191489 24.1255182191489 24.1255182191489 24.1255182191489 24.1255182191489 24.1255182191489 24.4127931489673 24.7164427527222 25.0191580192897 25.2137299795089 25.2120548875918 25.2103815960943 25.2087101050308 25.157203457892 25.091948655022 25.028551375787 24.9989816732119 25.1208825016689 25.2418565201 25.3619052308445 25.3066778405417 25.1275537370959 24.9484293446071 24.7693046633897 24.7067386104538 24.643789851972 24.5799242144147
24.1255182191489 24.1255182191489 24.1255182191489 24.1255182191489 24.1255182191489 24.1255182191489 24.1255182191489 24.1255182191489 24.1255182191489 24.4619942893627 24.8141858619966 25.165443340504 25.3880060539603 25.3863312291283 25.3846582044294 25.382986979877 25.2557342414416 25.0933878913632 24.9328985820815 24.8347921618392 25.0052381644077 25.1747575977726 25.3433519639329 25.304975756147 25.1258535029891 24.9467309608026 24.7684244188166 24.7549424821989 24.7405424024477 24.7252256820226
24.2965768709249 24.2948807160672 24.2931863608944 24.2914938054194 24.2898030496559 24.2630994482741 24.2168467753435 24.1715345472826 24.127161262388 24.4285459125113 24.7442786566796 25.0609464255952 25.2763021376746 25.3193523486107 25.3614690273976 25.4026536758745 25.3026175008441 25.162824223032 25.0221031293498 24.9348000237103 25.0740483252752 25.2142235357835 25.3553241529474 25.303273961095 25.1241535579111 24.9450328657128 24.7684884042671 24.7684884042671 24.7684884042671 24.7684884042671
24.4708497913123 24.4691539069732 24.4674598220318 24.4657675365015 24.4640770503956 24.4096534953285 24.3148581095866 24.2210029243001 24.1280864381053 24.3843824421183 24.6515677989384 24.9196879374232 25.120999905761 25.2125939991184 25.3032548029341 25.3929838187077 25.3397777999598 25.2485312225199 25.1563570704716 25.1005549223613 25.1912563309205 25.2828844076075 25.3754376504749 25.3015724553722 25.1224539018478 24.9433350593232 24.7684884042671 24.7684884042671 24.7684884042671 24.7684884042671
24.6451227483651 24.6434271345393 24.641733319824 24.6400413042328 24.6383510877792 24.5552673892456 24.4119302805546 24.2695331279225 24.1280744303259 24.3392821907118 24.5579211507463 24.777494649381 24.9666308243717 25.1067678101737 25.2459717490243 25.3842441420827 25.3778675811034 25.3351667136737 25.2915385128799 25.2653833832511 25.3075388892085 25.3506208224963 25.3946276815064 25.2998712389643 25.120754534785 24.9416375416195 24.7684884042671 24.7684884042671 24.7684884042671 24.7684884042671
24.7684884042671 24.7661420144281 24.7529858265244 24.7407720510159 24.7294991869706 24.6356663341055 24.4804068694177 24.3232688963692 24.1642554172833 24.3289594035787 24.497373803717 24.6667242983537 24.8370093860967 25.0082275655314 25.1803773352198 25.353457193701 25.3928888964087 25.4003993094043 25.4069808312236 25.4114585893853 25.4114585893853 25.4114585893853 25.4114585893853 25.3003497706458 25.1239285834876 24.9465869260142 24.7758131125905 24.7725783454474 24.770262853844 24.7688651363792
24.7684884042671 24.757227550434 24.6955302105558 24.6347750379116 24.5749605319096 24.5172703647945 24.4590962025215 24.3990440203654 24.3373288609206 24.4562617603476 24.5761320119845 24.6969381148033 24.8186785677523 24.9413518697565 25.0649565197184 25.1894910165174 25.2585596073911 25.314613484523 25.3697387119744 25.4114585893853 25.4114585893853 25.4114585893853 25.4114585893853 25.3298499729523 25.2019755180733 25.0731808322961 24.9475368442301 24.8957570024189 24.8448961971913 24.7949529274866
24.7684884042671 24.7473693261644 24.6371318236671 24.5278362432604 24.4194810846932 24.4007541860379 24.4396633470272 24.476694976575 24.5122381039558 24.5826280883169 24.6539551812495 24.7262178820652 24.7994146900525 24.8735441044768 24.9486046245802 25.0245947495818 25.1251590536204 25.2297554052924 25.3334233487618 25.4114585893853 25.4114585893853 25.4114585893853 25.4114585893853 25.3602722357064 25.2809435230784 25.2006948189507 25.118341846913 25.0180179201899 24.9186127911122 24.8201249589586
24.7684884042671 24.7365675821485 24.5777909061342 24.4199559070855 24.2630610850907 24.2861173188047 24.4221078244106 24.5562212869807 24.6862105671675 24.7080586259884 24.73084354976 24.7545638381339 24.7792179907387 24.8048045071797 24.8313218870392 24.8587686298765 24.9926869983929 25.1458248352625 25.2980345053895 25.4114585893853 25.4114585893853 25.4114585893853 25.4114585893853 25.3916163239701 25.3608323638179 25.3291286515472 25.2882283547926 25.1393613326605 24.9914128692529 24.844381464189
24.6865698945902 24.6335794809272 24.4843847522546 24.3342462023739 24.1831653314731 24.2365736817981 24.4156758897418 24.5947783922587 24.7684884042671 24.7684884042671 24.7684884042671 24.7684884042671 24.7580887075369 24.7351333153383 24.713108544315 24.6920128943667 24.8426367073577 25.0234076352291 25.2041770563259 25.3383126452023 25.3399727484028 25.3416310536725 25.3432875609988 25.3449422703681 25.3465951817672 25.3482462951829 25.3382190597571 25.1940648150106 25.0480748647281 24.9002522099463
24.5498875747561 24.4685138528757 24.3678597443699 24.266262060062 24.1637222997991 24.2383064144434 24.4174067751853 24.5965074304854 24.7684884042671 24.7684884042671 24.7684884042671 24.7684884042671 24.7360270781574 24.6645307664092 24.5939648336112 24.5243277800026 24.6700716497953 24.850840464417 25.0316077725373 25.1640343781994 25.1656942163711 25.1673522568993 25.169008499771 25.1706629449723 25.1723155924907 25.1739664423126 25.1713169193974 25.1242507145016 25.0753492815965 25.0246156210394
24.4122611352746 24.3043915787112 24.2522771014073 24.1992192936887 24.1452196550624 24.2400388522161 24.4191373660698 24.598236174468 24.7684884042671 24.7684884042671 24.7684884042671 24.7684884042671 24.7130333402958 24.5929970978349 24.4738909921165 24.3557135237204 24.497506264274 24.6782729659662 24.8590381614291 24.9897560746692 24.9914156478175 24.9930734236093 24.9947294020313 24.9963835830705 24.9980359667133 24.9996865529469 25.0062512652154 25.0562711217355 25.1044562277391 25.1508095829031
24.2736908168847 24.141212417942 24.1376365831284 24.1331176632692 24.1276571575316 24.2417709951306 24.4208676624107 24.5999646242206 24.7684884042671 24.7684884042671 24.7684884042671 24.7684884042671 24.6891077316316 24.5205325470415 24.3528872570038 24.1861703624384 24.3249405508123 24.5057051398942 24.68646822302 24.8154777346162 24.8171370427463 24.8187945538068 24.8204502677849 24.8221041846666 24.8237563044394 24.8254066270894 24.8430216289759 24.9901255689859 25.1353952359368 25.2788336288252
24.3858893124036 24.282977276108 24.2812858931866 24.279596306807 24.2779085169822 24.3665530027964 24.5027641736458 24.6399142798514 24.7684884042671 24.7684884042671 24.7684884042671 24.7684884042671 24.719821708793 24.616757357486 24.5118328244701 24.4050511081701 24.4837290557824 24.5875584096514 24.6932431382249 24.7684884042671 24.7684884042671 24.7684884042671 24.7684884042671 24.7923004597769 24.8251253500252 24.8570313959395 24.9015998514036 25.0473350054631 25.1939883876532 25.3415584983505
24.5228651009484 24.4572508699853 24.4555597572367 24.4538704407425 24.4521829205166 24.5097047503275 24.5973766991361 24.6859873390256 24.7684884042671 24.7684884042671 24.7684884042671 24.7684884042671 24.7662430894058 24.7602582076806 24.7524136285976 24.7427123499025 24.7460973588044 24.7528463732384 24.7614502795975 24.7684884042671 24.7684884042671 24.7684884042671 24.7684884042671 24.8274722442067 24.9088377998028 24.9892847503548 25.0710586630086 25.1682511146234 25.26636155551 25.3653884863856
24.6607846390451 24.6315245004654 24.6298336578837 24.62814461127 24.6264573606374 24.6519177995248 24.6910515146256 24.7311236765497 24.7684884042671 24.7684884042671 24.7684884042671 24.7684884042671 24.8145276635751 24.9056202748416 24.9948536730666 25.0822308553154 25.0066105209315 24.9162811726413 24.8278062335315 24.7684884042671 24.7684884042671 24.7684884042671 24.7684884042671 24.8635644991625 24.99346973179 25.1224565986468 25.2395997538118 25.2882504916535 25.3378189799266 25.3883037196874
24.7684884042671 24.7713778341047 24.7811680116782 24.7900175854562 24.7979280535744 24.7990466520028 24.7973632623876 24.7956816685067 24.7933083738883 24.7850369541138 24.7777010380248 24.7712991273636 24.8566989147693 25.0312518589329 25.2067346058864 25.3831456569654 25.2381542061007 25.0632183144454 24.8873550230302 24.7684884042671 24.7684884042671 24.7684884042671 24.7684884042671 24.9003585905403 25.0790209114104 25.2565467064912 25.4072233578878 25.4073333703755 25.408360894471 25.4103044315707
24.7684884042671 24.7854462884571 24.8437722838607 24.9011579204761 24.9576046960987 24.9733214345765 24.9716383139697 24.969956988811 24.9623108276858 24.9055026866116 24.8496298057334 24.7946906871339 24.8332707773105 24.9592841831539 25.0862271496428 25.2140981784529 25.1071864965659 24.9807905780628 24.8534675011578 24.7684884042671 24.7684884042671 24.7684884042671 24.7684884042671 24.865821012215 24.9970247720511 25.1291469967705 25.2415940299677 25.2432394433652 25.2448830610353 25.2465248829653
24.7684884042671 24.8004567462007 24.9073175719226 25.0132382838454 25.1182203794249 25.1475962537161 25.1459134021131 25.1442323456709 25.1303783007016 25.0250344259486 24.9206255679203 24.8171502290387 24.8089113170882 24.886386172617 24.9647903466652 25.0441223412486 24.9771460846488 24.8992891512311 24.8205053007526 24.7684884042671 24.7684884042671 24.7684884042671 24.7684884042671 24.8303630895776 24.9130264459193 24.9966080278961 25.0673136220081 25.0689587724274 25.0706021274067 25.0722436869326
24.7684884042671 24.8164089669339 24.9718036357148 25.1262584356683 25.2797748639099 25.3218711094165 25.3201885268114 25.3185077390803 25.2975110315496 25.1436324104852 24.9906885626922 24.8386779909324 24.7836207717172 24.8125580646848 24.8424244340631 24.8732183822079 24.8480327337574 24.8187137976121 24.7884681857292 24.7684884042671 24.7684884042671 24.7684884042671 24.7684884042671 24.7939850574415 24.82810899822 24.8631509254026 24.8930331775988 24.8946780650455 24.896321157339 24.8979624544659
24.6753625055829 24.7337986096003 24.9145688266294 25.0953375447955 25.276104763772 25.343906922786 25.3683676540975 25.3918908651902 25.3901023312736 25.2326722051185 25.0743087568115 24.9150134838916 24.8414373080686 24.8397675568484 24.8380996003091 24.836433438464 24.8347690713264 24.8331064989099 24.8314457212276 24.8235525204696 24.8054520698924 24.7882753563431 24.7720208823969 24.7684884042671 24.7684884042671 24.7684884042671 24.7684884042671 24.7684884042671 24.7684884042671 24.7684884042671
24.5010889260185 24.5612616242943 24.7420297274997 24.9227963321146 25.1035614378122 25.2055915463623 25.2785864304497 25.3506440384831 25.3956661867751 25.2867727886604 25.1769463115531 25.0661882526532 25.0157141137612 25.01404462952 25.0123769396729 25.0107110442334 25.0090469432143 25.0073846366294 25.0057241244916 24.9794823368049 24.9128454059487 24.8471319715656 24.7823405365699 24.7684884042671 24.7684884042671 24.7684884042671 24.7684884042671 24.7684884042671 24.7684884042671 24.7684884042671
24.3268153098819 24.388724306451 24.569490296152 24.7502547875354 24.9310177802738 25.0682134873341 25.1897415373234 25.3103325554055 25.4021646927682 25.3418070354521 25.2805165422852 25.218294710128 25.1899909559617 25.1883217386945 25.1866543155347 25.184988686495 25.1833248515891 25.1816628108304 25.1800025642321 25.1344887994826 25.0193163754488 24.9050672073503 24.7917397984412 24.7684884042671 24.7684884042671 24.7684884042671 24.7684884042671 24.7684884042671 24.7684884042671 24.7684884042671
24.1525416571792 24.2161866560908 24.3969505326069 24.577712911078 24.7584737911765 24.9317725063703 25.1018327356404 25.2709561771321 25.4095976106665 25.3977747071603 25.3850192109276 25.3713326184889 25.3642678346647 25.3625988843662 25.3609317278878 25.3592663652431 25.3576027964453 25.3559410215076 25.3542810404434 25.2885721442689 25.1248652139055 24.9620812989565 24.8002189030169 24.7684884042671 24.7684884042671 24.7684884042671 24.7684884042671 24.7684884042671 24.7684884042671 24.7684884042671
24.1255182191489 24.1892087197759 24.368282072108 24.5473557200533 24.7264296632978 24.9055039015272 25.084578434428 25.2636532616857 25.4114585893853 25.4114585893853 25.4114585893853 25.4114585893853 25.4114585893853 25.4114585893853 25.4114585893853 25.4114585893853 25.4114585893853 25.4114585893853 25.4114585893853 25.3522178345068 25.2046449056414 25.0561504155694 24.9067358609981 24.8526817062723 24.8215542088756 24.7913455843739 24.7684884042671 24.7684884042671 24.7684884042671 24.7684884042671
24.1255182191489 24.190944400661 24.3700159105607 24.549087716059 24.7281598168422 24.9072322125958 25.0863049030063 25.2653778877595 25.4114585893853 25.4114585893853 25.4114585893853 25.4114585893853 25.4114585893853 25.4114585893853 25.4114585893853 25.4114585893853 25.4114585893853 25.4114585893853 25.4114585893853 25.3708538028281 25.2718173576858 25.1718595915632 25.0709820008278 24.9867629639003 24.9071003942642 24.828356458096 24.7684884042671 24.7684884042671 24.7684884042671 24.7684884042671
24.1255182191489 24.1926797856331 24.3717494534144 24.5508194167799 24.7298896754154 24.9089602290076 25.088031077242 25.267102219805 25.4114585893853 25.4114585893853 25.4114585893853 25.4114585893853 25.4114585893853 25.4114585893853 25.4114585893853 25.4114585893853 25.4114585893853 25.4114585893853 25.4114585893853 25.3904127988046 25.3399118506637 25.2884898217514 25.2361482080956 25.1199255027274 24.991728847319 24.8644505859691 24.7684884042671 24.7684884042671 24.7684884042671 24.7684884042671
24.1526195723719 24.2171038480773 24.3880576486776 24.5599523337838 24.732786407755 24.9106879507771 25.0897569571494 25.2688262578362 25.4114585893853 25.4114585893853 25.4114585893853 25.4114585893853 25.4114585893853 25.4114585893853 25.4114585893853 25.4114464899101 25.4113771131926 25.4114585893853 25.4114585893853 25.4108945866975 25.4089281490896 25.4060408709016 25.4022342478219 25.2521695574549 25.0754398024883 24.8996282021881 24.7684884042671 24.7684884042671 24.7684884042671 24.7684884042671
24.3268934078289 24.373899854574 24.4963215901895 24.6196839651558 24.7439854841722 24.9124153779189 25.0914825427433 25.270550001867 25.4114585893853 25.4114585893853 25.4114585893853 25.4114585893853 25.4114585893853 25.4114585893853 25.4114585893853 25.4098959734597 25.3612937704351 25.3136163565562 25.2668622365525 25.2418702565291 25.2435253250836 25.2451786011593 25.2468300847433 25.0961499892945 24.9187254736775 24.7412988768812 24.6104479087767 24.6120904297029 24.6137311580583 24.6153700938294
