22.5457314796894 22.5457314796894 22.5457314796894 22.5457314796894 22.5457314796894 22.5457314796894 22.5457314796894 22.5457314796894 22.5457314796894 22.5457314796894 22.5457314796894 22.5457314796894 22.581384602457 22.6856473401855 22.7908425372858 22.8969686908857 22.9244267591358 22.9260949152347 22.9277612705728 22.9413408245806 23.01469548839 23.0871231013338 23.1586251660915 23.1261248102745 23.0166543327408 22.9062625261404 22.7949508935575 22.9007904865051 23.0106405677015 23.1214095673001
22.5457314796894 22.5457314796894 22.5457314796894 22.5457314796894 22.5457314796894 22.5457314796894 22.5457314796894 22.5457314796894 22.5457314796894 22.5457314796894 22.5457314796894 22.5457314796894 22.5652116747846 22.6209272915511 22.6775751253158 22.7351536735458 22.7501496546607 22.751817544817 22.7534836344998 22.7762247486341 22.8981255770911 23.0190995955223 23.1391483062667 23.1534924628438 23.0925709618793 23.0307283713406 22.9679661939731 23.0277855201716 23.0890861944372 23.1513055483978
22.5457314796894 22.5457314796894 22.5457314796894 22.5457314796894 22.5457314796894 22.5457314796894 22.5457314796894 22.5457314796894 22.5457314796894 22.5457314796894 22.5457314796894 22.5457314796894 22.548104846618 22.555274333165 22.5633757943536 22.5724077279914 22.5758725135903 22.5775401378096 22.579205961842 22.6120352372615 22.78248123983 22.9520006731949 23.1205950393552 23.1817830070953 23.1694094917787 23.1561151263638 23.1420293841571 23.1538616990189 23.166613957334 23.1802846566548
22.5457314796894 22.5457314796894 22.5457314796894 22.5457314796894 22.5457314796894 22.5457314796894 22.5457314796894 22.5457314796894 22.5457314796894 22.5457314796894 22.5457314796894 22.5457314796894 22.5457314796894 22.5457314796894 22.5457314796894 22.5457314796894 22.5457314796894 22.5457314796894 22.5457314796894 22.580407576797 22.7595268207782 22.9386463550317 23.1177661792432 23.1887016648076 23.1887016648076 23.1887016648076 23.1887016648076 23.1887016648076 23.1887016648076 23.1887016648076
22.5457314796894 22.5457314796894 22.5457314796894 22.5457314796894 22.5457314796894 22.5457314796894 22.5457314796894 22.5457314796894 22.5457314796894 22.5457314796894 22.5457314796894 22.5457314796894 22.5457314796894 22.5457314796894 22.5457314796894 22.5457314796894 22.5457314796894 22.5457314796894 22.5457314796894 22.5821164810158 22.7612338753945 22.940351560031 23.1194695346115 23.1887016648076 23.1887016648076 23.1887016648076 23.1887016648076 23.1887016648076 23.1887016648076 23.1887016648076
22.5457314796894 22.5457314796894 22.5457314796894 22.5457314796894 22.5457314796894 22.5457314796894 22.5457314796894 22.5457314796894 22.5457314796894 22.5457314796894 22.5457314796894 22.5457314796894 22.5457314796894 22.5457314796894 22.5457314796894 22.5457314796894 22.5457314796894 22.5457314796894 22.5457314796894 22.5838250946627 22.7629406397527 22.9420564750869 23.1211726003503 23.1887016648076 23.1887016648076 23.1887016648076 23.1887016648076 23.1887016648076 23.1887016648076 23.1887016648076
22.5457314796894 22.5457314796894 22.5457314796894 22.5457314796894 22.5457314796894 22.5457314796894 22.5457314796894 22.5457314796894 22.5457314796894 22.5457314796894 22.5457314796894 22.5457314796894 22.5457314796894 22.5457314796894 22.5457314796894 22.5457314796894 22.5457314796894 22.5457314796894 22.5457314796894 22.5843570440578 22.7587424970487 22.9340526277404 23.1102859345381 23.1785115558739 23.1828591908385 23.186284845329 23.1887016648076 23.1887016648076 23.1887016648076 23.1887016648076
22.5457314796894 22.5457314796894 22.5457314796894 22.5457314796894 22.5457314796894 22.5457314796894 22.5457314796894 22.5457314796894 22.5457314796894 22.5457314796894 22.5457314796894 22.5457314796894 22.5457314796894 22.5457314796894 22.5457314796894 22.5457314796894 22.5457314796894 22.5457314796894 22.5457314796894 22.5747632490637 22.7006026657916 22.8273665197309 22.9550533096263 23.0354332166835 23.0883254713097 23.1402959851509 23.1887016648076 23.1887016648076 23.1887016648076 23.1887016648076
22.5457314796894 22.5457314796894 22.5457314796894 22.5457314796894 22.5457314796894 22.5457314796894 22.5457314796894 22.5457314796894 22.5457314796894 22.5457314796894 22.5457314796894 22.5457314796894 22.5457314796894 22.5457314796894 22.5457314796894 22.5457314796894 22.5457314796894 22.5457314796894 22.5457314796894 22.5642433971349 22.6415377675634 22.7197563347311 22.7988975977232 22.8932766121415 22.99471249672 23.0952268801854 23.1887016648076 23.1887016648076 23.1887016648076 23.1887016648076
22.5457314796894 22.5457314796894 22.5457314796894 22.5457314796894 22.5457314796894 22.5457314796894 22.5457314796894 22.5457314796894 22.5457314796894 22.5457314796894 22.5457314796894 22.5457314796894 22.5457314796894 22.5457314796894 22.5457314796894 22.5457314796894 22.5457314796894 22.5457314796894 22.5457314796894 22.5527977242282 22.5815480380673 22.6112223081912 22.641819034025 22.7520415073284 22.9020200324038 23.0510772960203 23.1887016648076 23.1887016648076 23.1887016648076 23.1887016648076
22.6276499893663 22.6490667123866 22.6473742487214 22.645683582746 22.6439947144731 22.6256267606543 22.5978002921718 22.5709131471797 22.5457314796894 22.5457314796894 22.5457314796894 22.5457314796894 22.5457314796894 22.5457314796894 22.5457314796894 22.5457314796894 22.5457314796894 22.5457314796894 22.5457314796894 22.5457314796894 22.5457314796894 22.5457314796894 22.5457314796894 22.6658205729235 22.8449280350927 23.0240357861773 23.1887016648076 23.1887016648076 23.1887016648076 23.1887016648076
22.7643323092004 22.8233401598017 22.8216479663309 22.8199575702623 22.8182689716096 22.7690702307893 22.6927042788063 22.6172774059961 22.5457314796894 22.5457314796894 22.5457314796894 22.5457314796894 22.5457314796894 22.5457314796894 22.5457314796894 22.5457314796894 22.5457314796894 22.5457314796894 22.5457314796894 22.5457314796894 22.5457314796894 22.5457314796894 22.5457314796894 22.6675200537396 22.8466256684498 23.0257315720613 23.1887016648076 23.1887016648076 23.1887016648076 23.1887016648076
22.9019587486819 22.99761364384 22.9959217205577 22.9942315943908 22.9925432653528 22.9115746344805 22.7866701877149 22.6627045758215 22.5457314796894 22.5457314796894 22.5457314796894 22.5457314796894 22.5457314796894 22.5457314796894 22.5457314796894 22.5457314796894 22.5457314796894 22.5457314796894 22.5457314796894 22.5457314796894 22.5457314796894 22.5457314796894 22.5457314796894 22.6692192453397 22.8483230129054 23.0274270693579 23.1887016648076 23.1887016648076 23.1887016648076 23.1887016648076
23.0405290670718 23.171887164497 23.1701955113976 23.1685056551271 23.1668175956985 23.0531402111867 22.8796982581023 22.7071948956083 22.5457314796894 22.5457314796894 22.5457314796894 22.5457314796894 22.5457314796894 22.5457314796894 22.5457314796894 22.5457314796894 22.5457314796894 22.5457314796894 22.5457314796894 22.5457314796894 22.5457314796894 22.5457314796894 22.5457314796894 22.6709181477384 22.8500200684735 23.0291222780816 23.1887016648076 23.1887016648076 23.1887016648076 23.1887016648076
23.0541867975988 23.1887016648076 23.1887016648076 23.1887016648076 23.1887016648076 23.070717040755 22.8916222197342 22.7125271041983 22.5457314796894 22.5457314796894 22.5457314796894 22.5457314796894 22.5457314796894 22.5457314796894 22.5457314796894 22.5457314796894 22.5457314796894 22.5457314796894 22.5457314796894 22.5457314796894 22.5457314796894 22.5457314796894 22.5457314796894 22.6488047054399 22.7950798894105 22.9422742065741 23.0729881875103 23.0746346528721 23.0762793213587 23.0779221929568
23.0559275803499 23.1887016648076 23.1887016648076 23.1887016648076 23.1887016648076 23.0689854875137 22.8898925124381 22.710799242862 22.5457314796894 22.5457314796894 22.5457314796894 22.5457314796894 22.5457314796894 22.5457314796894 22.5457314796894 22.5457314796894 22.5457314796894 22.5457314796894 22.5457314796894 22.5457314796894 22.5457314796894 22.5457314796894 22.5457314796894 22.6153312450477 22.7130639174687 22.8117154837785 22.8987079254009 22.9003541277636 22.9019985335382 22.9036411427116
23.0576680667153 23.1887016648076 23.1887016648076 23.1887016648076 23.1887016648076 23.0672542290875 22.8881630996428 22.709071675712 22.5457314796894 22.5457314796894 22.5457314796894 22.5457314796894 22.5457314796894 22.5457314796894 22.5457314796894 22.5457314796894 22.5457314796894 22.5457314796894 22.5457314796894 22.5457314796894 22.5457314796894 22.5457314796894 22.5457314796894 22.5809370249703 22.6301281744719 22.6802379785755 22.7244276268212 22.7260735661903 22.7277177092582 22.7293600560121
23.0594082567093 23.1887016648076 23.1887016648076 23.1887016648076 23.1887016648076 23.0713775276496 22.9000083844348 22.7277025398984 22.5705514493106 22.5622800295361 22.5549441134471 22.5485422027859 22.5457314796894 22.5457314796894 22.5457314796894 22.5457314796894 22.5457314796894 22.5457314796894 22.5457314796894 22.5457314796894 22.5457314796894 22.5457314796894 22.5457314796894 22.5457314796894 22.5462728950117 22.5478419253032 22.5501472917762 22.5517929681569 22.5534368485235 22.5550789328625
23.0611481503464 23.1887016648076 23.1887016648076 23.1887016648076 23.1887016648076 23.1035852705931 22.9807544991917 22.8569872704188 22.7395539031081 22.6827457620338 22.6268728811557 22.5719337625562 22.5457314796894 22.5457314796894 22.5457314796894 22.5457314796894 22.5457314796894 22.5457314796894 22.5457314796894 22.5457314796894 22.5457314796894 22.5457314796894 22.5457314796894 22.5457314796894 22.5457314796894 22.5457314796894 22.5457314796894 22.5457314796894 22.5457314796894 22.5457314796894
23.0628877476412 23.1887016648076 23.1887016648076 23.1887016648076 23.1887016648076 23.136731324978 23.0624379374984 22.9872083365782 22.9076213761239 22.8022775013709 22.6978686433425 22.594393304461 22.5457314796894 22.5457314796894 22.5457314796894 22.5457314796894 22.5457314796894 22.5457314796894 22.5457314796894 22.5457314796894 22.5457314796894 22.5457314796894 22.5457314796894 22.5457314796894 22.5457314796894 22.5457314796894 22.5457314796894 22.5457314796894 22.5457314796894 22.5457314796894
23.0646270486081 23.1887016648076 23.1887016648076 23.1887016648076 23.1887016648076 23.1708154514062 23.1450584602091 23.1183654994847 23.0747541069719 22.9208754859074 22.7679316381145 22.6159210663547 22.5457314796894 22.5457314796894 22.5457314796894 22.5457314796894 22.5457314796894 22.5457314796894 22.5457314796894 22.5457314796894 22.5457314796894 22.5457314796894 22.5457314796894 22.5457314796894 22.5457314796894 22.5457314796894 22.5457314796894 22.5457314796894 22.5457314796894 22.5457314796894
23.0086776104033 23.0972670524693 23.0989565442959 23.1006442415887 23.1023301443352 23.1211499982082 23.1456107295198 23.1691339406125 23.1673454066959 23.0099152805407 22.8515518322338 22.6922565593139 22.6186803834909 22.6170106322707 22.6153426757314 22.6136765138862 22.6120121467487 22.6103495743322 22.6086887966498 22.6070298137148 22.6053726255408 22.6037172321403 22.6020636335271 22.6004118297146 22.5987618207155 22.5971136065434 22.5929099238061 22.5779549367415 22.563916793983 22.5507939979729
22.9010133528182 22.9229932024832 22.9246824241746 22.9263698516195 22.9280554848046 22.9828346217846 23.055829505872 23.1278871139054 23.1729092621974 23.0640158640826 22.9541893869754 22.8434313280755 22.7929571891834 22.7912877049423 22.7896200150952 22.7879541196557 22.7862900186366 22.7846277120517 22.7829671999138 22.7813084822367 22.7796515590331 22.7779964303168 22.7763430961009 22.7746915563982 22.7730418112223 22.7713938605863 22.7576403730078 22.6941477548385 22.6315717422254 22.56991083795
22.7914641130919 22.7487193159303 22.7504082674919 22.7520954250941 22.7537807887234 22.8454565627564 22.9669846127456 23.0875756308278 23.1794077681904 23.1190501108744 23.0577596177075 22.9955377855502 22.9672340313839 22.9655648141168 22.963897390957 22.9622317619173 22.9605679270113 22.9589058862527 22.9572456396544 22.9555871872296 22.9539305289918 22.9522756649541 22.9506225951298 22.9489713195321 22.9473218381743 22.9456741510691 22.921454451496 22.8094251894352 22.6983122941979 22.5881142689051
22.6800303724596 22.5744453928163 22.5761340742536 22.5778209620186 22.5795060560973 22.7090155817926 22.8790758110626 23.0481992525544 23.1868406860888 23.1750177825825 23.1622622863498 23.1485756939112 23.1415109100869 23.1398419597884 23.1381748033101 23.1365094406653 23.1348458718676 23.1331840969299 23.1315241158657 23.129865928688 23.1282095354106 23.1265549360463 23.1249021306084 23.1232511191104 23.1216019015651 23.1199544779859 23.0843523932531 22.9237874742613 22.7641386833768 22.6054045240617
22.6611140354675 22.5457314796894 22.5457314796894 22.5457314796894 22.5457314796894 22.6827469769494 22.8618215098502 23.040896337108 23.1887016648076 23.1887016648076 23.1887016648076 23.1887016648076 23.1887016648076 23.1887016648076 23.1887016648076 23.1887016648076 23.1887016648076 23.1887016648076 23.1887016648076 23.1887016648076 23.1887016648076 23.1887016648076 23.1887016648076 23.1887016648076 23.1887016648076 23.1887016648076 23.1488806900489 22.9698000416009 22.7907191053918 22.6116378817347
22.6593765121644 22.5457314796894 22.5457314796894 22.5457314796894 22.5457314796894 22.6844752880181 22.8635479784286 23.0426209631818 23.1887016648076 23.1887016648076 23.1887016648076 23.1887016648076 23.1887016648076 23.1887016648076 23.1887016648076 23.1887016648076 23.1887016648076 23.1887016648076 23.1887016648076 23.1887016648076 23.1887016648076 23.1887016648076 23.1887016648076 23.1887016648076 23.1887016648076 23.1887016648076 23.1471910742673 22.9681122686079 22.7890331752012 22.6099537943607
22.6576392850883 22.5457314796894 22.5457314796894 22.5457314796894 22.5457314796894 22.6862033044299 22.8652741526642 23.0443452952272 23.1887016648076 23.1887016648076 23.1887016648076 23.1887016648076 23.1887016648076 23.1887016648076 23.1887016648076 23.1887016648076 23.1887016648076 23.1887016648076 23.1887016648076 23.1887016648076 23.1887016648076 23.1887016648076 23.1887016648076 23.1887016648076 23.1887016648076 23.1887016648076 23.1455017465476 22.9664247833626 22.7873475324443 22.6082699941062
22.6783599776839 22.5711434394068 22.5694558384127 22.5677700299442 22.5660860140143 22.7024737612964 22.8755016951695 23.0494663234248 23.1887016648076 23.1887016648076 23.1887016648076 23.1887016648076 23.1887016648076 23.1887016648076 23.1887016648076 23.1887016648076 23.1887016648076 23.1887016648076 23.1887016648076 23.1887016648076 23.1887016648076 23.1887016648076 23.1887016648076 23.1887016648076 23.1887016648076 23.1887016648076 23.1438127068755 22.9647375858511 22.7856621771071 22.6065864809571
22.8215798226102 22.7454175452479 22.7437302143517 22.7420446756935 22.7403609292877 22.8394152227936 22.9639103820508 23.0893419916065 23.1887016648076 23.1887016648076 23.1887016648076 23.1887016648076 23.1887016648076 23.1887016648076 23.1887016648076 23.1887016648076 23.1887016648076 23.1887016648076 23.1887016648076 23.1887016648076 23.1887016648076 23.1887016648076 23.1887016648076 23.1887016648076 23.1887016648076 23.1887016648076 23.1421239552377 22.9630506760593 22.7839771091755 22.6049032548999
