2.590490401127565345e-01 1.076630252274865356e-02 3.025799547602541772e-01 6.681912468652344284e-03 2.737645503530567459e-01 6.251027877247758956e-03 3.580598502493026296e-03 9.612911001845324266e-03 1.733875511441105091e-02 7.673093770286104620e-03 7.962991664395291380e-03 1.615263920328298963e-01 1.016607973921817287e-01 5.765851760529581808e-03 5.990650998315086122e-03 1.074784745678438874e-01 3.496438850623231290e-03 2.174323206037583403e-03 3.315989774394384644e-03 3.448476376808802257e-01 3.212815141702928812e-01 4.895524342836089088e-02 3.771590647270630509e-02 1.545308266188613333e-01 3.117037308376063298e-01 2.537833314857008693e-01 1.209090914264618899e-01 1.081645934626190853e-02 1.048853838376638363e-02 1.339748343868549067e-02
1.733403559756657997e-01 1.123390945895758573e-02 8.982430736889448347e-03 9.263853673931040159e-03 4.027749280854515598e-03 2.186958264093311066e-02 8.846713920857268015e-03 1.077154694403438528e-02 5.533019249371397795e-03 3.518410874033120212e-03 5.144316285819081416e-03 8.272434613861391617e-02 1.188486933871153173e-01 2.830796916034692967e-01 6.487381374112550364e-03 2.950863867558738418e-01 3.266224264689262993e-03 3.991075968957804795e-03 4.830381005639226843e-03 3.000980659456420774e-03 1.845438886771898768e-01 4.690263159777882662e-02 9.793895377792125045e-02 9.024540627842349283e-02 8.394762441899326910e-02 1.180889073158882946e-01 4.348144045190148466e-02 1.115588460937349743e-02 1.601330014648061698e-02 1.614715645360311272e-02
1.895712736442459884e-02 1.903091673604918183e-02 3.027662203808218280e-02 2.457199062563196826e-02 6.977246933701006237e-02 1.935204976741745561e-02 1.599635699437507164e-01 1.686722736353711838e-01 3.726575018111084880e-02 5.591341142894006196e-03 1.383707222300860872e-02 1.123065062866466027e-02 6.467657438851022282e-03 1.357234334115333188e-02 1.825770183563028282e-01 1.283047305562719231e-02 5.889702606772521248e-03 5.880500239709234543e-03 1.122083654644123220e-02 4.254418311614934639e-03 1.137960550980668117e-01 3.857911893733928510e-02 5.929265282241251434e-02 2.142432867678957520e-02 1.348700391617219975e-02 9.416494081097808236e-03 8.901800531532980468e-03 7.004087588412982388e-03 1.196331886348895451e-02 1.343307019253460292e-02
6.385344442777223135e-03 1.846156494482247348e-02 4.050327144584918437e-02 3.270909487106959251e-02 2.406253909829112608e-02 3.227199689090077817e-01 3.223472021053063186e-01 2.013000661035518057e-01 1.099158260402892107e-01 7.568117703875925500e-03 3.633289495425137162e-03 6.911433786993042595e-03 9.199790102705752981e-03 1.264571499838213105e-02 1.442281946470932719e-01 1.254854117214914688e-01 2.671295147269666659e-01 2.330135818018342839e-03 9.891325316696176085e-04 1.434949748100218525e-03 2.059085088100114924e-01 8.235106401883666993e-02 2.848496979724297884e-02 5.796988118367830262e-02 1.113083086663908122e-02 8.340282230678260425e-03 7.508970829350114853e-03 7.119922738414369463e-03 1.443971489603437623e-02 1.567464656943505161e-02
3.646088520300808534e-03 1.134855116490916631e-02 3.163336721937965584e-02 1.227615439088280969e-02 1.507142667026304013e-02 1.874783197637766297e-01 3.282921682521064977e-01 1.858823053138672077e-01 6.888662974002296435e-02 1.967687756032994797e-02 1.647325575403564904e-02 1.917530500282354361e-02 8.035044384626410449e-03 3.583364668225437200e-01 1.919219802679711095e-01 7.823072720896029342e-02 1.007483427321624950e-02 2.813356105080890533e-03 3.134873677863065419e-03 1.807134227533315060e-03 1.735396404848830619e-03 1.119796562628253833e-01 2.895389059334589898e-01 9.757470537569205848e-02 2.027566397337713169e-02 1.109132706895489713e-02 7.954076830924510649e-03 9.184752732984316492e-03 1.433829940300218077e-02 5.264131305739490341e-02
8.003681727279042882e-03 8.726154411039768050e-03 2.768430399224789534e-02 1.665582662056665914e-02 9.831234790698327453e-03 1.049848765977011295e-01 1.345867900695827679e-01 1.443180012177804339e-01 1.179194389045294389e-01 2.703231313339168884e-02 2.309346673557131219e-02 1.945343135746558857e-02 1.606384495576222149e-01 6.177125216033612504e-02 5.318638645019638234e-02 9.193800006906155398e-02 7.949764645182896480e-03 1.207565144680752267e-01 2.188437111510666260e-03 4.210103072777626569e-03 7.655461575016750050e-03 1.278824688167855099e-02 3.689605432556548603e-01 5.830073493878951130e-02 3.052251169128150296e-02 2.885844531680963748e-02 1.830542164638205432e-02 1.258956032998973483e-02 1.656564389107629751e-02 2.970782978441483674e-02
9.767363308177548498e-02 1.505459997781938009e-01 1.482618632219275812e-01 8.866015114935156538e-03 2.576031038701588269e-03 6.604171553373433708e-03 1.392627714688210970e-02 7.753179559153237400e-03 9.744804341288647656e-03 9.724525218064512117e-03 1.218530345469543037e-02 1.961243947112747688e-01 9.073717618912141569e-02 4.342129180717297504e-02 2.611657556564631402e-02 4.661931039335796834e-02 2.638232250540671342e-01 1.173902983711998665e-01 3.629408319507710853e-03 5.147056812894146641e-03 4.083596586237381657e-03 1.191032790358503568e-01 5.594482568449141852e-02 5.371643556539229536e-02 2.080295541975855228e-02 2.133210544234250688e-02 1.881091788908648491e-02 1.618277450065219725e-02 1.845871943654862554e-02 4.368283546737447565e-02
1.910711360906428291e-01 3.591578224933585362e-01 2.007956945877140131e-01 6.520815723655245220e-03 5.532861765365388283e-03 6.238095849419251875e-03 5.599472932711118713e-03 3.549532486082754550e-03 5.364521100832019516e-03 2.746662432875191517e-01 1.144229045847488246e-01 3.535523248865983792e-01 7.639341720376789657e-02 2.774946369996111190e-02 3.204277422694494504e-02 6.052885082867759392e-02 7.016769053513896397e-03 7.561972741324694477e-03 4.510922632952228499e-03 4.387865549302416394e-03 1.616893618899190310e-01 9.494772351377891995e-02 3.831295235098064467e-02 3.212286427149784601e-02 1.532333518282642457e-02 1.600556125413625866e-02 2.485845865042188643e-02 2.813711699083769682e-02 2.801072200256163325e-02 8.161429792971440500e-02
1.948547483592375645e-02 2.777836561291975870e-01 1.640500566568954266e-01 1.405463556929086727e-02 6.975295967343731439e-03 2.545161655231003017e-01 1.521679135312707480e-02 6.462761838026350597e-03 7.822756764287456394e-03 9.440123574237332948e-03 3.495330809043405984e-01 1.178722299178784280e-02 1.618159766087809079e-02 7.010198596196568280e-03 9.982857271700520951e-02 8.466759152923052090e-02 2.822356064484758068e-03 5.348417277311172564e-03 7.160811605978298355e-03 2.085273110713790901e-01 4.142674390922449629e-02 4.307378994999842142e-02 4.674195361788915926e-02 3.057461412438573084e-02 1.793359939485409532e-02 2.694452593230348136e-02 1.003181701893256089e-01 1.797833333492815100e-01 8.740163254055584308e-03 2.485439269809935070e-01
1.279287488639534349e-02 9.513866635100327526e-03 1.547665277573919557e-02 6.365841831327406775e-03 7.651913904202551145e-03 1.172358369397906996e-01 1.579100530060710897e-02 2.645387571001465710e-01 1.257225859728061113e-01 4.545694417491294437e-02 9.745327322697970585e-03 7.575596554047363089e-03 6.662094012031123842e-03 8.914964506116673792e-03 4.694972793908930297e-03 4.985700673164919668e-03 2.140732232384061351e-02 1.938865942952706922e-02 1.221662910898262989e-02 9.108730823727106268e-03 5.120306574998537835e-02 3.229727233265126951e-02 3.695614256832766703e-02 4.060600270269705547e-02 2.270146339092227530e-02 2.866800467345635706e-02 2.613229241508459033e-01 4.035486138394126510e-01 8.898424767664473919e-03 1.300539381236546221e-01
1.230091215268769821e-02 2.552040253832071337e-01 8.526873712177694339e-03 3.526223517113905286e-03 1.062092002280641545e-02 7.092687031801185593e-02 7.000925454797121694e-02 6.422965058940971472e-02 4.462024095432691462e-02 3.536847743010962941e-01 3.733887343125372182e-02 4.211705358926669251e-02 8.661860517623938549e-02 4.216851969272959050e-02 7.675370308893278946e-03 1.487629418367437083e-02 2.741017638291161004e-02 7.496366575006684595e-03 3.310631557669239423e-03 8.177903768230160297e-02 3.440922548918377150e-02 3.069062814310539317e-02 3.954332095106760647e-02 5.532260393089813433e-02 5.916433812621985783e-02 3.195659194022103938e-02 4.974897098248350774e-02 3.791774950058911242e-02 3.451440344957437678e-02 2.532914016529853179e-02
1.137682721721226531e-01 6.235556669327278062e-02 1.545840947955736538e-02 1.387402017175185832e-02 1.237211534717216725e-02 1.115484718585736251e-01 5.237973838835366380e-02 3.640349659556645773e-02 4.374935787540985138e-02 7.617970120876825860e-03 1.096319229614772447e-02 5.143953568595020787e-02 8.736609133852997477e-02 4.503616793451618167e-02 1.615542907066400830e-02 1.812430023041175509e-02 1.991774227345953496e-02 1.168091598836127308e-02 5.467018810462893549e-03 1.856611483258094886e-01 3.279258614402127264e-02 3.337019081131905457e-02 3.938955729559934921e-02 7.044785569493045019e-02 6.697285506141453792e-02 4.769600493754432013e-02 3.667071525971751095e-02 3.411624744846920854e-02 3.819171689700379818e-02 4.253429675805411175e-02
2.708155177170676678e-02 6.509267992515258006e-02 1.461566470414775165e-01 2.531392331736748852e-02 2.654860456708973970e-01 9.133052197723570687e-02 5.083717348392600976e-02 4.437389635318762793e-02 5.700146597168147256e-02 3.310178051609607638e-03 1.121309063796674249e-01 1.743249354874158719e-02 6.351370977757861414e-02 2.723984503460899140e-02 8.580905377607875306e-03 9.947541696644043516e-03 3.675516337608328212e-03 5.392424037338107261e-03 9.670332680020652869e-03 4.633891395556034333e-03 3.131212949016697750e-02 3.433421708569409092e-02 4.343414244869747698e-02 7.222378474491825129e-02 9.160375941335899275e-02 8.012181165957661666e-02 5.926451198944065329e-02 5.725457235814766094e-02 5.170020533677407992e-02 4.423502295248910032e-02
2.352932837812039824e-02 6.637084557059401424e-02 1.156528032132485423e-01 8.257245524535619663e-02 4.873228150326931740e-02 1.890904716393984053e-01 1.516524788355801644e-02 5.160567260705166241e-03 7.622913507352518936e-02 2.544421285475354996e-02 9.256456932245656077e-02 3.527954463861565290e-03 2.827564507124585846e-02 3.852615998985504941e-02 4.146305847674128936e-02 5.650908970588976177e-02 5.117086279927513665e-02 3.337712148954555258e-02 9.157894287450309145e-02 4.426672946655885177e-02 7.397704322077030582e-03 2.039343909255190990e-01 1.534857696162424956e-01 3.657896836254493911e-01 1.311710845377063277e-02 7.383890788585672181e-03 1.698810131419328101e-02 8.517094062602670670e-03 7.009702957014880831e-02 8.362601594088088508e-02
2.259774344731326282e-02 2.246686184437183403e-02 6.008924486731696823e-02 4.436871814970697603e-01 1.601508501266521167e-01 3.546577651025012434e-02 7.438900050920101495e-03 6.492997833559327817e-03 5.122859172183342677e-03 9.667811632198373972e-02 2.034725232850310983e-01 1.687030810275926690e-02 2.483921986817640495e-02 3.183502323191401973e-02 2.907227546772671312e-02 3.552691537405943539e-02 6.134039735965046009e-02 1.072496791970146413e-01 1.104935432454839661e-01 8.770506410531667130e-02 6.315852160979237157e-03 8.549759982708451597e-03 9.482259988980872717e-03 2.211059274618033116e-02 2.484736968083988209e-02 8.121592141915491558e-02 8.121881862478425029e-02 2.322441776009439088e-02 7.290398941543609068e-02 5.727079561031175187e-02
2.125649668375495516e-02 2.287757599917551732e-02 5.011218636058360765e-02 5.453792173167848478e-02 3.598177173121785283e-02 3.743196417986233843e-02 2.069164003561993481e-01 2.876960513036285784e-03 6.383048585624933637e-03 3.039386455470194370e-03 3.242245225932010450e-03 2.369886223648886604e-03 1.379854641062057061e-02 2.827408157803528929e-02 2.669278679327425491e-02 4.136345760738334432e-02 7.285553374274669758e-02 9.019242367022270446e-02 5.313398752588861795e-02 1.175652091560909322e-02 7.071034313523286673e-03 4.854177498361382515e-02 7.052645455948508557e-02 1.202379069998702615e-01 1.154169509581039477e-01 1.530243042880668758e-01 1.241384131520632123e-01 4.397941480408525117e-02 1.079397195148311256e-01 6.438037832969795149e-02
2.773886671145630450e-02 3.155077565446141874e-02 3.000071315043508630e-02 2.744743113749715038e-02 3.864627093919361517e-02 6.467341292177522516e-02 1.925544083919287358e-02 5.490612965345336577e-02 2.395402942053842868e-02 4.137225024611132160e-03 3.086545817973497096e-03 4.839331907822982254e-03 9.656551902200898388e-03 1.442502399039093629e-02 1.929207331336545844e-02 3.502565799265684732e-02 7.732307393556836494e-02 7.998382303802079041e-02 3.887216344329245260e-02 1.359127376912297111e-02 5.866073829119438504e-02 1.062844198984120025e-01 1.360896678549388672e-01 1.434475900714486385e-01 1.305901459319606384e-01 1.161706735950179398e-01 1.759862821509620701e-01 3.495342286330963000e-02 1.439073704979983159e-01 7.828090171618466708e-02
7.015595712796375560e-02 5.423463681666459285e-02 2.578153416576867835e-02 3.513063882471856303e-02 3.363304227725026890e-03 8.935947811264560378e-03 4.142741641631375593e-02 3.238247489101055837e-02 3.169958656326264668e-02 1.602001962503539143e-02 7.251459223146549012e-03 2.871627847549608915e-03 2.815702598664195262e-03 6.071117849994784633e-03 9.327296360214896651e-03 4.346408844532988203e-02 4.703589815246889128e-02 6.070848500991631730e-02 1.087194085480592577e-02 1.951735977214485995e-02 6.504291130383114961e-02 1.405951379176956229e-01 1.731552032069841596e-01 1.859513581768154900e-01 1.604848606218178819e-01 1.613302887592563406e-01 1.551124003505670867e-01 1.289026238138054892e-01 1.560244726424691447e-02 1.195412153029197337e-02
2.799451626076376876e-02 7.569404370368995605e-02 1.293777582131492576e-01 5.476593861293125448e-03 6.478646702507664251e-03 7.950113513054702860e-03 2.511762791203742129e-02 3.132404484302701853e-02 2.141589149636915351e-02 1.676766801352017056e-02 5.626282044211412987e-03 1.399560530576813289e-01 2.129046554478634390e-01 3.760946906047219710e-03 3.465009822982761598e-03 2.090650934206371089e-02 8.172671525630824732e-03 2.898927593409717559e-03 1.619406974631659446e-01 7.271239892842742969e-03 2.611556101976493516e-02 1.400765445393740982e-01 1.785055474154843558e-01 1.920130496207067827e-01 1.447569579034376774e-01 6.923380360458314398e-02 1.149325408521564007e-01 7.845110155703240162e-02 2.737422453307352538e-02 4.455236989881052878e-01
3.750635957077774665e-03 5.939381187941995821e-03 3.499786415482022874e-03 3.089921411869809773e-03 4.434894867366837197e-03 2.510411264267002097e-03 1.289903937411669525e-02 1.661039769733878291e-02 1.526390586922162472e-02 5.246090349979936653e-03 3.040317614847448408e-03 9.698884545443990646e-02 1.673356715309429199e-01 3.863843249554098358e-03 6.117033047610463334e-03 3.794613335082673046e-03 6.467617033268856577e-03 1.903049145087260105e-03 3.595253076638549317e-03 1.709008617087741377e-02 8.743842013636833610e-02 1.679404752799797673e-01 1.828498320742143191e-01 1.774411102036239363e-01 1.393665073750142147e-01 1.041670096455005051e-01 1.023804324657067305e-01 7.997720278659463389e-02 3.614813877291040561e-02 3.561320864149209453e-01
5.854208672317558031e-03 6.916920955579158349e-03 4.979593832609040781e-03 4.596229319503853349e-03 5.052782736968837972e-03 1.799910177658963981e-03 7.144257877588869841e-03 7.777217216403156143e-03 2.317197146716027788e-03 1.921649340186149316e-03 1.661760023458682956e-01 1.472335861890093911e-01 8.283652889113454765e-02 3.925894284528963496e-02 8.626180759113469265e-02 2.609432461971696315e-01 3.670677788430670805e-03 7.562071260423199569e-03 7.372797067975537903e-03 3.349143045671926916e-02 9.361049063815113369e-02 1.385489227904996290e-01 5.752300284796468821e-02 8.771285644689653938e-02 1.147074179681416284e-01 6.561154775902877656e-02 6.212841758918477564e-02 6.233270649578649680e-02 2.005440313444834255e-01 2.181254409810210459e-01
4.639754592943807175e-03 9.669484774286005863e-03 2.675919801118123442e-01 2.300429074306309385e-01 2.123488824647500328e-01 2.184870917911570752e-03 1.574932578677694546e-03 1.083900858452503113e-01 1.538791122427893565e-01 2.649924842574518172e-02 3.888581727294779938e-02 6.206938136724724636e-02 6.012441110884164663e-02 1.927040769036699464e-01 5.026230762639118110e-03 2.056984116589473041e-02 3.607165102174672566e-02 4.717503102421883449e-02 3.251323477791449867e-02 2.488817513466712664e-02 1.816317646662913426e-02 6.681415423673116132e-03 2.659427998404946189e-03 5.825166023695526121e-03 2.122668325416407487e-02 1.156903353435560777e-02 1.642909483551737923e-02 2.880424834638206644e-01 3.721915441902350768e-02 3.474967467557324441e-02
9.450221580478314690e-03 1.580556444362866617e-02 3.013852482595490434e-01 1.801624059219279483e-01 3.029747333045602620e-01 2.288469580043452078e-01 1.862725888919928522e-03 3.909369042180009524e-02 3.664210964986888003e-02 1.584553999081965078e-02 3.918055976501824689e-02 7.224643009976351726e-02 7.918154206241215243e-02 3.708817579807911491e-01 6.916584762189970786e-03 9.509318873711378531e-03 3.494554134769078946e-02 6.545547129292907107e-02 7.449507431418789238e-02 6.574148410291659472e-02 1.822252590926389665e-02 6.556519026284489578e-03 8.182116571361326002e-03 1.637787499952482462e-02 2.389856461974175852e-02 1.128653566776506752e-02 3.252320622429381025e-01 1.330987415071428481e-01 4.972697833859350547e-02 4.773022736491603496e-02
1.142985180526669489e-02 3.575845636492385512e-03 1.691005590838936257e-01 7.534112510690360587e-02 9.862349966937322687e-02 2.168622444372778069e-01 2.839077815618841205e-01 3.226002018184713493e-02 1.804324729294178725e-02 2.056564901501482800e-02 3.732271238450597661e-02 6.365324794645341178e-02 5.939248987980402794e-02 2.862199870940611013e-01 1.272348148330798047e-02 2.016497100193753028e-02 2.556610567200228237e-02 5.885535183288797406e-02 7.420578950852083078e-02 6.407953078693580384e-02 4.216738291623546575e-02 3.550217515785058509e-01 2.420258297632113531e-01 7.513673711724559723e-03 2.458445496775180789e-02 1.792848195682890389e-02 2.534735376331914355e-02 2.233205257087674256e-01 3.905248654521190077e-02 3.529169268420285360e-02
6.127373185341336223e-03 3.856858992650474740e-03 3.551110356011018543e-01 3.972805244323420193e-01 5.444653526335261652e-03 4.073368642791707836e-03 3.081775537353734218e-01 1.279216339803004310e-01 1.831266178659461674e-01 2.338278594988911774e-01 2.190566522436812949e-02 2.634228226430165853e-02 3.470510202436021679e-02 6.741209154551838778e-02 3.392083314712773801e-01 1.405384644141121318e-02 6.677754833647057790e-03 3.052992867240302693e-02 3.517401540139408062e-02 2.764846026876243562e-02 3.422529128038659385e-02 1.009016901501304068e-02 6.900607072614786675e-02 1.115489073630768213e-01 1.819276303459421359e-02 1.363661070560009438e-02 4.490017629928638038e-02 5.470580872403207201e-02 4.448244605083914727e-02 3.886607090721519442e-02
2.180265517082795659e-03 1.503482497570220264e-03 2.838125720874188403e-03 6.200056228540210858e-03 3.247115820467689953e-03 2.641996357550575047e-01 1.251929113155131890e-01 8.924753239640051405e-02 2.734389636102512178e-01 6.007632968121170633e-03 7.188912047286279139e-02 2.664652419834300304e-02 3.945299802174300624e-02 7.252239499218073038e-02 3.000571313099197335e-01 1.161453048975431487e-02 3.111422919190255931e-01 1.445796020093712830e-01 2.089837781184600285e-01 3.512967055102028668e-01 1.232684594764322725e-02 1.440782782740195056e-01 7.423488277138659552e-02 3.440364500558544258e-01 8.640065246331263271e-02 2.423294233628075223e-01 4.641855795916027122e-02 8.140902786431190863e-02 3.595342740383032920e-01 6.127586980272868578e-02
2.208490629115346209e-03 1.748010517542577516e-03 1.255773032016951115e-03 3.639916590217259773e-01 3.976940029108214092e-01 1.559044970625395043e-01 1.030336855546917646e-01 1.049344335092673719e-01 1.145167617087781420e-01 4.538843342779864121e-01 1.331000181935775850e-01 1.332861794966201385e-01 1.071377648609231348e-01 1.085011808897074354e-01 2.729251513148051034e-01 1.847926212841399518e-01 1.298865800149079930e-01 8.102429969601060433e-02 7.033655613501722803e-02 5.267119221512356342e-02 4.229011483462908477e-02 6.182294428661920527e-02 9.436632668578574801e-02 2.202542478137893001e-01 3.768706967092048665e-01 1.702165643908822301e-01 2.619205816696281164e-01 1.817509768556508365e-01 1.878958949998136008e-01 1.240574596196559604e-01
2.997115438518529931e-03 1.540888507037689635e-03 1.289841889791245796e-03 2.487111675641683842e-03 2.725144999295646322e-03 3.843840247179493019e-01 3.495673577933945848e-03 2.992766680434058059e-03 1.578616671277107142e-01 1.144168423696069609e-01 4.287025120628246838e-02 9.941941633662186584e-02 2.495101771863959261e-01 2.280992325299935897e-01 1.952922540246940925e-02 1.452789853456347945e-02 1.472232865022276016e-01 1.750972150334255961e-01 7.945558563577527489e-02 3.518943840104708787e-02 3.422510139543636504e-02 5.343798147610130667e-02 8.101261336416014369e-02 2.472856255793420832e-01 2.505734917721609833e-01 5.951355485568874532e-02 6.640566777936954268e-02 8.546832124708411693e-02 2.785228510740074825e-01 5.705822414100557988e-02
4.040486574822074739e-03 3.446484447463966580e-03 1.059214377839277606e-03 3.677865928537219116e-03 5.016351261699796005e-03 9.252068264560726202e-03 7.857524690093160846e-03 4.069633537408957613e-01 1.574642598250950154e-01 9.130068120047769853e-02 2.768354953195033621e-02 3.538499457978461216e-02 3.785706712644124061e-02 1.291383785279737739e-01 1.477766448361886309e-01 6.239495254075396596e-02 5.172522380459006197e-02 5.601919455958801614e-02 7.568039597565466570e-02 4.378773294916161324e-02 3.104256844225066619e-02 4.616993287453094452e-02 5.241642800950294806e-02 8.771459128115548232e-02 2.749803206746268547e-01 4.357829729796872803e-02 6.359855561778220145e-02 1.041497317527266681e-01 1.257130482174138308e-01 2.499061738917488229e-01
2.242083119810592620e-03 5.467598164698050933e-03 1.650498328880603766e-03 1.793000661332699430e-03 8.846162957614138456e-03 9.229221512634302321e-03 8.164814251701768208e-03 2.958855187776515683e-01 2.258725634994829257e-01 2.093189693138758078e-01 8.531829629051720931e-02 4.273454743235502451e-02 2.542184547120330054e-02 3.945485220345045646e-02 1.783770254644570785e-01 4.635196493710289078e-02 1.245646841039761143e-01 1.268954825180007746e-02 2.481976472834233893e-02 1.680358715718514584e-01 4.335866034631806476e-02 6.063408731260697820e-02 5.273876925778501340e-02 5.815169708605472804e-02 7.757793095297499386e-02 5.977676720891703793e-02 7.075925376711533765e-02 8.717120092155478117e-02 1.173218532169413159e-01 2.882561464935575191e-01
