3.639559403179497110e+01 5.640414875875568157e+01 4.973807435534497756e+01 6.314539860953139794e+01 4.980600206955512022e+01 1.006862362507181956e+02 1.178689795680624854e+02 1.510000705261165876e+02 6.656780700216976356e+02 1.371123679782571116e+02 1.249798119791388871e+02 2.605816513700387915e+01 1.537001528038617337e+01 5.942598362930123557e+01 7.397079121268389201e+01 1.772908236405929827e+01 7.083257488856939688e+01 1.403042243040789003e+02 1.464584649577172399e+02 5.793253564066020544e+01 4.495014661201331307e+01 6.303384424310817025e+00 4.845550837856454685e+00 1.970791620511896269e+01 3.916945831054065508e+01 3.159135818721161826e+01 1.500011796709947909e+01 1.341778035455417850e+00 1.302575634279190542e+00 1.672081157370030935e+00
2.289599039726687479e+01 4.274315589038900498e+01 4.607192471717775106e+01 1.611281840182199332e+01 2.946803673839614390e+01 1.179727160682406151e+02 1.656019458888655151e+02 5.295223667032941250e+01 7.613710243175435721e+01 2.997285591046626863e+01 5.290814822232698589e+01 7.716738124580722058e+00 2.059219466991632430e+01 4.857048585267723695e+01 7.474070717336128666e+01 5.169806022002946833e+01 7.266325132029669476e+01 2.724461274490595315e+02 2.397381149882801594e+02 8.374144863857934240e+01 2.964699456572251535e+01 6.294909030703566444e+00 1.314422694649666923e+01 1.207923148164659999e+01 1.111348131988859222e+01 1.556998141759989451e+01 5.759092067857613628e+00 1.453342906356231090e+00 2.047731454954544894e+00 2.033794434745684665e+00
3.553320595887063291e+02 4.271877036622596506e+02 1.016767194214441133e+03 8.251330991745429628e+02 1.586155508677409216e+03 7.156401283065646624e+01 2.835289397645316001e+01 1.919926283006489953e+01 5.759114504685787779e+02 8.139173828621005669e+01 5.372483440139392314e+02 2.993317205209986014e+02 1.280632310332086945e+02 1.757158535631463678e+02 3.421890685035115354e+01 1.518001804468352987e+02 1.146110039003607994e+02 2.724417111055526561e+02 1.068870554096606384e+03 2.088367038119280892e+02 2.023621962112699180e+01 5.609868672224169295e+00 8.432236264224965083e+00 3.046948870148407096e+00 1.916234429435845765e+00 1.347823617263409490e+00 1.288520338121935893e+00 9.684562980033512014e-01 1.580914562700006076e+00 1.710181244182265914e+00
1.169385371332874399e+02 1.782546540147910719e+02 4.423211860117287415e+02 2.941416777942557133e+02 1.269177735952875423e+02 2.681298379057822245e+01 4.538363598916843955e+01 2.045547588919516357e+01 7.645781576108564792e+00 3.311692276751625030e+01 3.669457886814906544e+01 6.232463943236274417e+01 6.658733997409177618e+01 7.537994457915439739e+01 2.452721194232039181e+01 1.982734138731138529e+01 4.555085508087458379e+01 9.515511817091802982e+01 7.790034045673223773e+01 7.596472612958930881e+01 3.742665031634523842e+01 1.334546625067441639e+01 4.169901033333741402e+00 8.342017374016702291e+00 1.532352867077982683e+00 1.180825781227994087e+00 1.091492660265320769e+00 9.791825175696935446e-01 1.877313301008024515e+00 1.951370099830290528e+00
1.075187204217222927e+02 4.208797047400456108e+02 1.434947369374217942e+03 5.593772883192098107e+02 2.410268066599432757e+02 3.184146904644875775e+01 4.617389969757007862e+01 2.587561217108627076e+01 1.425248559365351930e+01 5.524882358185834619e+02 8.117529390708455139e+02 5.498532649777606593e+02 7.318341188667960751e+01 5.921677909839768006e+01 2.848189963880001940e+01 1.099649480178072380e+01 1.267784112793129054e+02 7.875193502781043264e+01 1.414237920569055404e+02 8.814781272417798164e+01 6.581180864152899801e+01 2.006870445095884037e+01 4.801388187392858953e+01 1.353581219338196462e+01 2.615981934404294940e+00 1.495142007694651554e+00 1.119733497525447374e+00 1.225600875256295019e+00 1.809644163075351475e+00 6.364906148436144662e+00
9.550373040690516291e+01 6.843581926897135759e+01 2.414757116121901959e+02 1.967711268723278408e+02 1.036870799520213779e+02 9.539246864333293274e+00 1.077918013427719757e+01 1.284734479955154995e+01 1.098094954541187462e+01 2.886201055991699604e+02 2.113909725706137692e+02 1.107606208747990024e+02 2.183581314813920571e+01 8.567872691963858145e+00 6.951173236519810672e+00 1.197643436296760200e+01 6.584985870723919277e+01 1.796158910624741267e+01 6.252735647850902012e+01 2.284151697122824203e+02 3.063716452240471426e+02 2.028276027724395192e+02 5.566401420979320847e+01 7.508370597524292478e+00 3.706664684834176882e+00 3.723519171589090959e+00 2.508125142881604042e+00 1.636458928696716164e+00 2.037703210183954283e+00 3.506401126183560812e+00
1.600799817315332874e+01 2.834230374484804926e+01 3.161082049223853829e+01 1.661940378874426472e+02 8.114376713571354571e+01 1.329948786143844472e+02 1.893722456850780134e+02 1.083619060815188817e+02 1.285964070845982690e+02 1.457429860317109274e+02 1.084914308324045749e+02 3.888489974662577708e+01 1.472692888284960944e+01 5.509916202732094703e+00 3.017025772307236675e+00 5.774201264748437978e+00 3.525431348895409656e+01 1.704449209739426152e+01 9.028431734324924207e+01 1.291104662096128095e+02 6.575389974105164015e+01 1.765584714254621090e+01 7.617574080804502046e+00 6.216333773875980739e+00 2.384648083665928731e+00 2.642989956624140380e+00 2.525329120985779774e+00 2.075362262315079587e+00 2.273019826794912657e+00 5.152647152590706270e+00
2.701918668975384463e+01 4.646453678468558479e+01 2.161081247128137761e+01 3.793046846210420142e+01 4.828745840220126695e+01 4.717656112485146025e+01 4.254743932461770584e+01 3.727217646963302400e+01 4.930412712087384364e+01 3.571123808690656176e+01 1.596470241950548008e+01 5.100463144552031736e+01 1.098240431236111014e+01 3.774294724390625522e+00 3.975855443701888703e+00 7.690360279239051522e+00 6.633642575203568015e+01 1.092465191848123993e+02 1.003409863063357790e+02 7.596208851847438837e+01 2.304245131157185966e+01 1.182558776351019603e+01 4.264442574642270500e+00 3.498748364432216817e+00 1.734695417316303612e+00 1.940650269655327609e+00 3.294037600720376435e+00 4.046838706725701229e+00 3.838489262398407043e+00 1.066490240028171499e+01
9.740257716458863513e+01 7.002950655906198563e+01 4.132595325770031280e+01 2.605009594976907579e+02 1.718395152981009630e+02 7.676589634896812697e+01 2.342218730161156373e+02 1.005771033363284630e+02 7.704693402018008896e+01 6.605626668543354185e+01 5.370852732811934516e+01 6.855885678058965027e+01 1.459746923561223753e+02 9.846082650185090301e+01 1.473341824244158715e+01 1.359211582320411793e+01 5.911120558871067487e+01 1.871098173401711051e+02 1.917129208606602049e+02 3.499627592736882775e+01 6.080989842319045380e+00 5.042624852748316400e+00 5.113084901287348494e+00 3.320366370190342309e+00 2.010302839710377043e+00 3.237733478534942311e+00 1.333002890545623664e+01 2.584973730787233848e+01 7.092967005299831840e+01 3.341310459567022662e+01
7.894715849781727002e+01 4.187044171191485020e+01 5.463803527520352077e+01 4.562369714280471555e+01 3.671363584748144149e+01 9.462420224682151826e+00 6.539689749213654579e+01 2.785166729381143114e+01 1.920738425220086043e+01 7.845555725741181874e+00 9.201876175382840017e+01 1.173788422193335919e+02 2.013850254088092981e+02 2.573304613983693230e+02 8.638335966985165726e+01 1.175021661482776665e+02 5.856700413729934098e+02 6.917180631907228872e+02 2.776926265216152387e+02 1.388170723777530782e+02 7.434555101190754911e+00 3.719090007371627316e+00 4.088341189054485625e+00 4.524358444693270087e+00 2.580172838824196457e+00 3.420892098128951009e+00 3.397351202203731191e+01 5.613151299313643960e+01 6.704545414478297971e+01 1.693631014734403806e+01
1.334891630785885468e+02 7.993634378106698080e+01 1.882678328533138483e+02 1.838622622820385004e+02 2.024594169230715579e+02 1.713369293942142590e+01 1.440194263904403371e+01 1.268051930871137856e+01 7.405265657601040274e+00 6.382355599883131703e+01 6.588729700930095987e+02 2.121144965681507074e+03 1.468536992602497321e+03 1.992180375905308438e+03 1.526710997532542251e+02 5.107347481423749400e+02 7.322310968942663294e+02 2.748444411295812984e+02 6.038055206472358805e+01 1.355784230544320934e+01 4.895921239448836282e+00 3.534753994284547840e+00 4.467514884821280674e+00 6.354649186690287443e+00 6.955727321390695828e+00 3.867178719886872784e+00 6.298716329439084660e+00 4.817111622549017369e+00 4.181732230188186961e+00 2.917295713370124055e+00
1.670297702071101753e+01 6.226007529555792175e+00 5.209847647253361913e+01 3.974309362060781581e+01 4.166089624160646565e+01 1.456170730899349763e+01 8.492909620159476702e+00 5.393181184337443312e+00 6.877569129942568082e+00 1.328749924780719880e+02 1.696374685027853104e+02 3.113585376967325828e+03 1.846998601427724907e+03 2.660716535954516530e+03 2.102167495625562310e+02 6.361648125806935923e+02 5.121462437953133531e+02 3.995986044070228331e+02 9.295288756548167441e+01 2.826648225600412090e+01 4.274918213979446158e+00 3.819282155412849988e+00 4.518693226701989474e+00 8.271822732669154021e+00 8.116828861641179671e+00 5.987579182219499252e+00 4.729528066325134006e+00 4.126743133212244175e+00 4.256284462376854094e+00 4.427096981299946776e+00
4.281059568808885274e+00 1.211722042345469141e+01 2.995130486108988066e+01 8.969562312640996993e+01 5.703378799031793278e+01 1.800234312929140046e+01 8.671738937417298843e+00 7.144605747647755578e+00 9.585264731750278600e+00 7.118773146309769118e+01 1.678358826295513140e+01 8.813279494955165774e+02 1.363072073535370009e+03 1.626941287928044858e+03 9.692430450344426163e+01 3.874345385051331618e+02 8.360488321747740770e+01 1.963035746884080481e+02 1.976655027398443281e+02 7.856158263041075429e+01 4.745398462317449884e+00 4.438631169264473542e+00 5.424464221643060746e+00 9.416327219645166835e+00 1.243077975723286954e+01 1.176238613518907528e+01 8.899376379591933173e+00 8.044234781527334732e+00 6.034977238994513549e+00 4.547605708967374483e+00
3.216193910124601985e+00 9.568763092272469351e+00 1.448126070000332177e+01 9.262483752421694305e+00 5.961279631202690332e+00 3.041905113183159060e+01 1.112848773328977643e+02 1.021625576462415665e+02 1.459318236219148446e+01 4.463211074235715614e+00 1.695678008973819928e+01 1.378184869866466613e+02 7.469183110340047733e+02 2.211872270090485017e+03 5.249942825190712483e+02 2.416197087608887614e+03 6.650071882058985011e+02 1.341332080766537729e+03 1.287181763454921565e+03 1.396768708748095833e+03 7.843763436945845058e+01 2.887128471155068610e+01 2.205675014616421592e+01 5.551728496688971148e+01 1.325667131781247576e+02 1.227260385986206614e+02 3.498193332487726366e+02 1.136285797394328370e+02 8.858193173311210700e+00 8.517526156109273217e+00
2.791530271694205645e+00 2.996988183805380679e+00 8.397077896693684096e+00 6.340995419689042478e+01 2.318741513614153149e+01 5.601380920481849657e+00 7.620273075780553995e+01 2.353776391057185435e+02 1.736539961375244445e+02 1.849187409225451617e+01 3.892052785817522675e+01 6.997366412820977075e+02 7.131407012960721659e+02 1.840579065677471363e+03 3.424111012038531499e+02 1.900326561046833831e+03 6.689559015791260208e+02 5.333685049559026993e+03 1.249307151283971052e+03 2.872359727565609774e+03 6.747361624934819702e+01 9.362569815175331200e+01 7.072654902454432602e+01 1.324923675451230736e+02 2.571408896251624583e+02 9.994352191435718851e+02 1.202057889126346709e+03 3.523881690331072036e+02 9.433424218662485927e+00 5.739142232462615567e+00
2.364092154637203791e+00 2.729748291844988461e+00 6.550197041267871612e+00 7.350736343701635533e+00 5.000469259937014854e+00 6.141147202174273900e+00 4.487667010702410408e+01 1.289767356880134059e+02 2.807073534285110554e+02 1.074779892452004049e+02 1.103828334101998081e+02 1.122085007221607782e+02 4.978077085812518590e+02 1.653193289491530550e+03 4.122013242191194422e+02 2.452354398921413122e+03 9.252210408881080639e+02 4.629506320344446067e+03 4.915407903257513453e+02 3.686441327637211316e+02 1.464382339165868814e+02 1.416446559786542821e+03 2.161979934296588453e+03 3.487180657202219209e+03 3.291607953450194600e+03 4.567382272997527252e+03 3.455975428401449790e+03 9.039709538475366344e+02 1.463839255530135830e+01 6.438509145609273787e+00
2.941652822412520685e+00 3.557666672887038750e+00 3.655729975011457800e+00 3.675077497799941639e+00 6.131096413979806314e+00 1.364641738538814408e+01 7.928193530258643023e+02 2.759125363373500022e+03 1.349512100507588457e+03 2.466837067756611646e+02 1.897967005288370217e+02 3.346501151529782305e+02 5.130654873436100161e+02 9.003576970119275984e+02 3.498992423495034814e+02 2.224299018884647012e+03 1.071395831863913145e+03 3.787465496470944345e+03 4.398555371227758997e+02 4.035795721699663545e+02 9.378010435770950153e+02 1.168881547064292135e+03 1.111832607313738663e+03 1.065018812783071553e+03 8.008381126732654138e+02 7.576076452974164113e+02 1.012084720344005746e+03 3.096107351181992726e+02 1.768385081965623939e+01 8.653458694685649988e+00
7.358202274342205307e+00 5.996604052264253859e+00 3.295894745451445562e+00 5.696110435051080501e+00 8.083460724500332617e+01 4.190438795357041499e+02 2.194214872121744520e+03 1.771363894173241533e+03 1.761379354959042303e+03 1.024828787682441316e+03 3.927223489099260973e+02 1.215070687639791061e+02 1.086692536306253629e+02 2.779067108804584905e+02 2.882658998759423525e+02 2.654590394797626232e+03 7.208250526281706243e+02 2.412562799184885080e+03 2.133324875874396866e+02 5.353909368541606000e+02 1.915445465688119384e+03 4.930341708149017904e+03 6.991339102081950841e+03 6.837765571469409224e+03 4.926613604344844134e+03 4.644206414772887001e+03 3.896713163933755823e+03 2.761824993024582909e+03 1.037413263354044801e+02 6.804652299372490631e+01
3.390694940696082238e+00 9.863237371633962525e+00 1.968133396972960725e+01 1.518326952119296038e+02 3.721333441510748230e+02 5.499582799566738913e+02 1.746496041500443653e+03 2.347607589625490164e+03 1.567206787147622890e+03 1.273463643100708623e+03 2.787586257342503586e+02 3.012036974789839761e+01 4.356981159861746278e+01 1.095760250866882473e+02 1.511562971254849685e+02 1.183671871649681407e+03 2.265255089466607501e+02 1.090728014461968343e+02 2.463574285336580516e+01 1.389653923025370261e+02 2.152966503079918255e+02 9.209661379673482315e+02 1.349163833948820866e+03 1.329207821917542105e+03 8.028569820342551111e+02 3.454520930018658191e+02 5.753742821495729913e+02 7.460587981192646794e+02 1.056784598596272815e+02 4.894401856686465635e+01
8.947934004592534052e+01 1.229029010883781439e+02 9.051681742093524008e+01 1.273402037026665994e+02 3.403149672788820226e+02 2.082776789679127774e+02 1.082120008710524871e+03 1.414218285410501721e+03 1.357745330604582477e+03 3.367004284313228482e+02 8.738421531309191437e+01 1.928934800423664342e+01 3.220481847222750105e+01 8.270994871861111619e+01 2.718346817791410217e+02 1.707616145205630858e+02 2.741802740301474728e+02 7.520076704396527134e+01 1.221275193772396221e+02 5.303898122790699290e+02 2.993989992796434763e+03 6.103368073278173142e+03 6.596751263372147150e+03 5.365715967991628531e+03 3.491558902074576054e+03 2.234163987286511656e+03 1.960802004612607561e+03 1.262147422377499652e+03 1.059756497448435084e+02 3.633950891680737527e+01
2.651490754025236924e+02 2.641780280532323104e+02 1.542361192153795457e+02 1.314699282994828877e+02 2.024061108820902177e+02 1.202228503880843675e+02 7.273552977805386490e+02 6.775889610508024816e+02 1.970322351322945735e+02 1.052141716472204962e+02 3.553755297107078093e+01 2.679578034525769681e+01 1.530800254591334664e+01 7.647161984080964814e+00 1.716911577154787594e+01 4.458948517933706768e+01 1.103481777766904202e+02 1.868772216056669038e+02 1.892779561664248149e+02 7.836762161444589765e+02 1.515546564874735168e+03 1.664075895303131119e+03 5.661846434984501002e+02 8.278039126230557940e+02 1.224108307779285042e+03 6.916754849235080655e+02 5.923170597649502724e+02 5.610991868148628328e+02 2.261211233059433212e+01 2.083221583735438998e+01
2.220077884739208116e+02 2.780095943325700318e+02 4.740059890693125055e+01 3.951397003806314245e+01 3.914050091397394482e+01 6.697272211204867176e+01 1.035255310651553486e+02 2.767192902555362011e+01 3.882407762754464642e+01 5.733178444708377341e+00 6.998983866552634048e+00 9.917600031149218509e+00 1.045882729056412686e+01 3.530544769827636742e+01 9.015519336289614216e+01 1.166924409808309747e+03 2.127312853841686774e+03 2.973934000343054777e+03 1.874586078176149840e+03 1.168793361779049292e+03 7.019594266672320373e+02 1.901026134562267202e+02 7.416299406656439430e+01 1.283165218684687261e+02 4.078223939046093847e+02 1.263599571294529369e+02 1.071201530056393665e+02 3.477249653818676478e+01 3.827288998224271488e+00 3.010381043299362513e+00
4.857535046518994477e+02 4.015945545518983977e+02 5.020469507652410357e+01 2.527529338638944978e+01 4.395340796095810276e+01 3.825111009661964800e+01 6.335938172725118989e+01 7.269745775769110629e+00 6.151316016647381701e+00 2.451882311621452981e+00 5.381093003606785885e+00 1.033967097054064688e+01 1.377170349964085005e+01 6.932302078154889102e+01 9.595675423869334963e+01 3.913721818268358561e+02 6.896911496794250525e+02 1.229027959432915395e+03 1.308229932321708020e+03 1.005472163516335968e+03 2.987969731402602065e+02 8.544692948748382832e+01 9.327952458880935183e+01 1.936264375635130932e+02 3.911226011178364388e+02 1.068329452846172387e+02 4.035344076109328881e+01 1.513123178059116469e+01 4.643137352258115413e+00 4.103569923282774035e+00
6.389659801188388428e+02 8.624189298175937779e+01 2.717210098799702322e+01 1.000457788138283455e+01 1.281396608359969846e+01 3.013804869710125445e+01 4.026573657448152233e+01 4.654633847456828732e+00 2.528432717428990451e+00 2.815778948458203423e+00 4.962825169674855985e+00 8.778760535182613012e+00 1.009879650026071829e+01 5.288979072090605626e+01 1.885179042722749045e+02 9.151370293492184373e+02 1.738569501795478118e+03 4.181507315335660678e+03 5.028824852384680526e+03 3.293310008557361925e+03 1.265653023112754454e+03 5.605179440227020393e+01 3.232759774314570933e+01 6.199469851111996377e+01 3.365668340803886167e+02 1.920587772147666215e+02 1.640079776015892605e+02 3.020517487318940653e+01 4.295799396189278418e+00 3.156447398942876958e+00
3.829220577865800692e+02 1.243043367131235328e+02 5.291431589885930009e+01 5.360428711967474413e+01 1.330143170144044120e+02 9.550488245420933708e+01 4.053609593652315368e+01 1.707365466631943463e+01 2.626094456868040439e+01 3.277782774032062463e+01 2.981731239056118365e+00 3.480491874668735441e+00 5.434215590781425576e+00 1.202190748908215312e+01 6.444839184577044477e+01 2.178112960636868536e+02 1.459551383264627020e+02 3.920200518580487028e+02 3.750792334920317899e+02 4.098431995066938498e+02 4.541030605064380552e+02 6.421343995923774628e+01 8.240384817344677870e+00 1.473599895507173230e+01 6.301431113491776870e+01 1.512043404042068175e+02 4.007900284669414646e+02 2.194694473187809933e+02 5.354006301461900819e+00 3.855059968572176921e+00
1.363555290262207507e+02 5.707389835811394363e+01 6.651711542094763274e+01 1.219912930001669622e+02 7.490694417665613969e+01 3.504954987285303503e+01 1.643433729831045298e+01 1.188663222591339874e+01 3.899344486893301109e+01 1.444382889772666658e+02 9.688068748346315928e+00 3.500913383521136346e+00 5.711899839946076085e+00 1.192319356982725509e+01 5.267013865838102049e+01 8.815239746987259650e+01 5.847991507285438217e+01 2.784759152954352501e+01 4.104030973480267619e+01 6.675970839356816100e+01 1.014680825546654575e+02 1.970616740566554981e+01 8.410177522344248757e+00 4.037261578810983309e+01 9.610019131713873719e+01 3.303302022577109653e+01 1.110138418530102058e+02 1.191249126524857047e+02 4.116419387936152674e+01 6.057631510290486077e+00
1.359897306514258162e+02 1.161257049255459606e+02 6.133562747907030399e+01 4.923755422196970244e+01 5.157901555098987245e+01 2.010401041579583037e+01 1.362430887677937719e+01 1.448180575526317426e+01 1.655538902881469099e+01 6.319855195347986410e+01 1.783717778038593949e+01 1.826471957667459378e+01 1.601362335622010491e+01 1.808748259032456218e+01 4.783584457978815863e+01 3.112370988725458432e+01 1.995911657347491541e+01 1.140825385390946423e+01 9.616595922693424114e+00 7.077409160004577870e+00 5.286974230047780665e+00 7.137886555961039825e+00 1.032422255634285335e+01 2.437529249695595013e+01 4.176745751405520934e+01 1.953000123342892280e+01 3.037013385677541777e+01 1.902271232445227866e+01 1.846705122865148851e+01 1.153077677890344788e+01
1.822435655359660700e+02 1.012341008747580986e+02 6.250184988765610683e+01 9.319099203301620093e+01 9.271732237178352420e+01 5.284118070887369356e+01 1.860579861808764122e+02 1.458219273830312659e+02 2.208698779505053267e+01 1.536068374717238427e+01 5.557356195084786066e+00 1.366654743238167313e+01 3.757992404458664026e+01 3.753441235584080715e+01 1.067854978114466178e+02 7.497414342878522575e+01 2.248865403319725687e+01 2.544903105441060376e+01 1.129832086123029988e+01 4.759318829012976870e+00 4.162534820870617658e+00 6.051977443810239166e+00 8.857956682507817092e+00 2.597502775188740287e+01 2.590863661475732727e+01 6.017644464363220536e+00 6.454108981400792366e+00 7.836421688499433102e+00 2.447728959406106242e+01 4.977669160905191958e+00
2.428051918365449637e+02 2.238448169710036950e+02 7.393976507076943960e+01 2.762897158028208651e+02 3.651318793194345744e+02 7.268552557354228156e+02 5.043279767791241284e+02 5.923498243801910235e+01 2.179713389831803738e+01 1.211597497795981937e+01 3.565811944859047067e+00 4.788070179193328002e+00 5.610578291692796427e+00 2.028436105144422186e+01 2.362537754165625969e+01 9.976223452733826491e+00 8.978343996696196427e+00 1.024851808368172179e+01 1.363962304541528248e+01 7.219566641404915330e+00 3.964159010226286917e+00 5.293927261548493135e+00 5.767751948819409336e+00 9.143153884304989987e+00 2.770675956297071707e+01 4.175469275107301925e+00 5.737966472727101142e+00 9.062778732237992685e+00 1.060322811709966118e+01 2.107212627596397070e+01
1.317479674541958730e+02 3.498798706057532399e+02 1.135272834866908909e+02 1.318292747806335399e+02 7.166503403414633340e+02 7.965952309411360375e+02 5.483990739362022850e+02 3.894449964302219058e+01 2.800936495462944720e+01 2.548860359027904465e+01 1.020294200507848181e+01 5.104803819919766283e+00 3.335313718408014161e+00 5.418076779703970836e+00 2.452674710202115449e+01 6.808593010591197370e+00 2.201392713837499926e+01 1.226804014846906341e+02 2.077483857788839146e+02 2.786619042510201893e+01 5.474208021962996717e+00 6.831115937546218930e+00 5.726369982800188829e+00 5.987203389093866512e+00 7.688512101344630700e+00 5.629417522863875867e+00 6.290705164164203111e+00 7.541736272807390229e+00 9.871516868598224193e+00 2.423622892246890359e+01
