3.112420536933364901e-02 4.611397530491979230e-02 4.018398833052981567e-02 5.071597519722179787e-02 3.859815748073489039e-02 8.485260946706407736e-02 8.464124799482200534e-02 2.303811127271653270e-01 4.194042544911701365e-01 1.877883182320977673e-01 8.606993191189028780e-02 1.943847832590350072e-02 1.136707664173223706e-02 4.266960573457893868e-02 4.980317939711104147e-02 1.093992891135235623e-02 3.867654192753230274e-02 6.827108136689355455e-02 6.227254739792857652e-02 2.199979480640704144e-02 1.739225879710137868e-02 2.590042965498796663e-03 6.540180126522332493e-02 7.832976230114809327e-03 1.442016985030021049e-02 1.080384233601267008e-02 4.429100361617427026e-03 1.370321130151682699e-02 1.202139472387293677e-02 1.365890005894518193e-02
2.467841247286687786e-02 5.453734330238874800e-02 9.790176073654044409e-02 8.022885828107313710e-02 5.588032079295400523e-02 2.500173469772977719e-01 1.188563397211519351e-01 1.512878207271283748e-01 9.914738935968882283e-02 8.552599796356727402e-02 6.002477809365859562e-02 1.161500599999393951e-02 1.534392496052644148e-02 3.510506426816227543e-02 4.910342646712073655e-02 3.137040096676402962e-02 3.892693787061924510e-02 1.284465588247557799e-01 9.764709997681683684e-02 2.945730856925688965e-02 1.023154449593871064e-02 2.368454884759478660e-03 4.955484939440307247e-03 4.389303181496290868e-03 3.598925082186293575e-03 4.345110453547917223e-03 4.904287314073172560e-02 1.230827137946653889e-02 1.689451652053079039e-02 1.596049125177625982e-02
2.960768265837988578e-01 2.929140953867263031e-01 6.203302638671925884e-01 5.060789389283966155e-01 1.071339282458178443e+00 1.088611445326132937e-01 2.017162893158789758e-02 2.180011948082191675e-02 3.524321645317457508e-01 1.120550802520271227e-01 3.038734511536018701e-01 2.011400440187649519e-01 7.345381514228539743e-02 1.069592235730653096e-01 2.044741326975704071e-02 8.532225101757107133e-02 5.751147068760109615e-02 1.186177362888779924e-01 3.976864230366286557e-01 6.635691941004130678e-02 6.200990664460896001e-03 1.830159427343034263e-03 2.802805028567560003e-03 3.738316533307554923e-02 2.207188054994106696e-02 1.286205130864258132e-02 8.700907415409343121e-03 6.896486310040037329e-03 1.163438532332458294e-02 1.288065294583480916e-02
1.386690897869920502e-01 3.870312680296430496e-01 8.505498837606598750e-01 6.881945880089943568e-01 2.792896929367857384e-01 4.292188954913399995e-02 3.369505879721797215e-02 2.279788507007483866e-02 1.403968182817728026e-02 1.381205353797331503e-01 9.009003245199680154e-02 1.767987552492751857e-01 7.920248261404873313e-02 5.268133917328445687e-02 1.553572148538906114e-02 1.179403068510525079e-02 2.470318093585636282e-02 4.642143278865793615e-02 3.295252581773523703e-02 2.813611134945693398e-02 1.247881060496438752e-02 4.284231938673380667e-03 4.728807147199653310e-02 2.644444906568767240e-03 1.803080475596714402e-02 1.195141618653777077e-02 8.136590541850596478e-03 7.700031913566359257e-03 1.517653868486025688e-02 1.647976037971307650e-02
8.021104465174301590e-02 2.431952970527015978e-01 6.803594513847783798e-01 2.636197925818988819e-01 1.486294172536902214e-01 2.152677809636804537e-02 3.280064006681260996e-02 1.821070550181838957e-02 8.516648511692599677e-03 3.123333390787258468e-01 3.987483315456339383e-01 3.307153279222170839e-01 4.804828315620147949e-02 3.993840156745406822e-02 1.871581589483641700e-02 6.931318982857297833e-03 7.426153533662185890e-02 4.280721764254753064e-02 6.883610542457557768e-02 3.963830709211967757e-02 2.719050793325817478e-02 7.561173126948453511e-03 1.625541100084114052e-02 4.546751404657219109e-03 3.218366270991371986e-02 1.683092732575599063e-02 1.035167202519263890e-02 1.192427002395503310e-02 1.815528348602419434e-02 2.058148052325380669e-03
8.015161464046227646e-02 8.211270596008019007e-02 3.686930808467806520e-01 2.954882045683697722e-01 1.161358915820400323e-01 1.240902036154687207e-02 1.505538527307723022e-02 1.605773834234842240e-02 1.515492545700720256e-02 4.803188263507845446e-01 3.807649138788591903e-01 1.932584902054048648e-01 2.159006369331101932e-02 7.195970282739464104e-03 5.474042959394435567e-03 8.812695114393562928e-03 4.101992442792867788e-02 1.075527316265963498e-02 3.484961581574254341e-02 1.207535918345758186e-01 1.467678315945967760e-01 8.620541928401057041e-02 2.106035165652311858e-02 2.790151956943866425e-03 4.776267102965792849e-02 4.591163729367937762e-02 2.763268885147788373e-02 1.896578201273893538e-02 2.381792132992325770e-02 4.284455888362886239e-02
1.127904704701325478e-02 1.774781611128255915e-02 1.873336454269645956e-02 9.473479155514832883e-02 4.521264043580580649e-02 7.467771600407183130e-02 1.125798425074106546e-01 6.381869895875459664e-02 7.589040873168405310e-02 9.123011889197096824e-02 7.026327679737481846e-02 2.782881308120770114e-02 1.150309850462864249e-02 5.261241683828719179e-03 4.097772512785226307e-02 4.577067696521033326e-03 2.264144863130958946e-02 1.078516549643938893e-02 5.514465843741623435e-02 7.572725193799752230e-02 3.498473756150919517e-02 8.836911147464619753e-03 3.693653430739270074e-03 3.199303846913176437e-03 3.311807261877801334e-02 3.521241885186349174e-02 3.107159514113235974e-02 2.668638180602368390e-02 2.903813049818650127e-02 2.298637182730431990e-03
2.409729365627934564e-02 4.476968179573018181e-02 2.631598816691371398e-02 5.686091437847200225e-02 8.751578611385964213e-02 9.832256178428110116e-02 8.684151174920395899e-02 8.166913496801014860e-02 6.483991050020962432e-02 3.641985227345603815e-02 1.451286135186062067e-02 4.389793258008720112e-02 9.525848672883821533e-03 4.669223029174979223e-02 5.330497569812233521e-02 6.691807181709483535e-03 4.730319115529575680e-02 7.659330090836374838e-02 6.756427050618686592e-02 4.799250034962333072e-02 1.299206726535272888e-02 6.500717911326559829e-03 5.934477406814019085e-02 5.178378548473839410e-02 2.598331806824139001e-02 2.689542265613859007e-02 4.025117843867909856e-02 4.633595048140619344e-02 4.391050288820509684e-02 4.601679979055353295e-03
6.345465638716436818e-02 4.197903663403193542e-02 2.465466534577703817e-02 1.444811949797953354e-01 9.438353201103322210e-02 4.002465210223891956e-02 1.281146761228239006e-01 5.739222398483620480e-02 4.741354672429848316e-02 4.650878018475126940e-02 4.114910727681297259e-02 5.379569062852081196e-02 1.202013454378129675e-01 8.291120460214440602e-02 1.238619444862960016e-02 1.103209760730747453e-02 4.638681031474844313e-02 1.428611902650805399e-01 1.414318024025027487e-01 2.343028691970096972e-02 4.090519717688598580e-03 3.901001543603315434e-03 4.314694978132746668e-03 4.902855496687831549e-02 2.965398730038673256e-02 4.338673760172380434e-02 5.466958142139660345e-03 1.050903512511104643e-02 3.102883164430272900e-02 1.545404922920484703e-02
1.121942158059944239e-01 7.336689286321981807e-02 1.126357173278033086e-01 1.039070336188176180e-01 9.112572267473516285e-02 1.802597949146260425e-02 8.252997996186821339e-02 3.503689384541723573e-02 1.444274297350683044e-02 5.434613787756299025e-03 7.971139367162785594e-02 7.828180183517194357e-02 1.655436466036888654e-01 1.786322634648196128e-01 8.456854059191393214e-02 9.299766223254263275e-02 5.046061027285493328e-01 5.278243108200765255e-01 2.118440519371153630e-01 9.374445705522652106e-02 5.857213689214457210e-03 5.183220924513452788e-02 5.613477070111783790e-02 3.116769357126833451e-03 3.415877767472636634e-02 4.366778402648996416e-02 1.497073796083283996e-02 2.464791751826744121e-02 3.413502525118933956e-02 9.244550113819881287e-03
9.490441764143242587e-02 5.022315017330082620e-02 1.083333707261754375e-01 8.975654321554263348e-02 1.105102053496052061e-01 1.011720856042271424e-02 8.350370462821155720e-03 7.192808342071768668e-03 4.408480175590812067e-03 3.996208217721421152e-02 6.370615360077843681e-01 1.082457675474547187e+00 2.242861757430063996e+00 1.098686950385213246e+00 2.010109143753068817e-01 3.945117195227587636e-01 7.400959538175890806e-01 2.052953563381617608e-01 4.877075732779818928e-02 1.028204115662851442e-02 4.954372892912437855e-03 5.054223861660825379e-02 4.342345281321439293e-03 4.038099982543124841e-03 3.969328644788360991e-03 4.711640958190310702e-02 3.503843789682257494e-03 3.315788037071046822e-03 5.581696733580723130e-02 4.065683731942685425e-02
1.987328367239963797e-02 1.165012651255892609e-02 8.899135657697310187e-02 8.553637807318789643e-02 6.347104270240397361e-02 1.418147051475718984e-02 5.370383075432100077e-03 3.386750114906363074e-03 4.112776819383079895e-03 7.795032863399520284e-02 1.937043547482958095e-01 1.297937118460580574e+00 2.342784559871215588e+00 1.203888537833468719e+00 4.293856049145170495e-01 4.821469357260323441e-01 5.333884435279889757e-01 3.140449036260676841e-01 7.683362074534391684e-02 2.307108506116250374e-02 5.858581241480016744e-02 5.609168406076882329e-02 4.188459292367214919e-03 5.214972788978677540e-03 5.155520015237634313e-03 3.592758200890126298e-03 3.105658792881729312e-03 5.807028808536816161e-02 6.158275905525716076e-02 3.600966692470175968e-03
5.173893962411358488e-02 1.192956909487165144e-02 2.075130217952515094e-02 5.773798717615626075e-02 3.598166021054707842e-02 1.106450894688604594e-02 5.529780739473196850e-03 4.492320866308878100e-03 5.608058393604273273e-03 3.987374583011674828e-02 1.340737156474667777e-02 4.117569706518436901e-01 1.750332224699028494e+00 7.447168685263139132e-01 2.319495151018873269e-01 2.665315546032732685e-01 9.821383228035299173e-02 1.437779067085099560e-01 1.631363024843641152e-01 6.391136381126119592e-02 4.838551437839636038e-03 4.433711425314411196e-03 4.971851059131070054e-03 7.140226248559706189e-03 9.290243802734705209e-03 8.632385452267330589e-03 7.009619686602015613e-03 7.309525800428850681e-03 5.654013410088429628e-03 3.849976176882766426e-03
4.515232881610674320e-02 1.485777764912106502e-02 1.590273150237699051e-02 1.007486180842911104e-02 5.738066909897657220e-03 2.175487935407622447e-02 7.394893923883416598e-02 6.297250997373354808e-02 8.191974564656062663e-03 4.751951349936764379e-02 9.852143127199021119e-03 6.706150464478752293e-02 8.022984007533070505e-01 1.076482875906711545e+00 1.136597403645169369e+00 1.521302043916394897e+00 1.364452907238911994e+00 8.847670257621473855e-01 2.413753011198605414e+00 1.114847602839957874e+00 9.100200680867928660e-02 2.610052953135301793e-02 1.957393557810257340e-02 4.917723898181744491e-02 1.146890428365367476e-01 1.078543476034453941e-01 2.955639635322087067e-01 9.704914541784638582e-02 7.544609915784190532e-03 6.851377401883636253e-03
4.216362081524616806e-02 3.959099884197715691e-02 8.958725278068352046e-03 4.736155436375663608e-02 1.668535309022890073e-02 3.815152824556071031e-03 4.972911627937030843e-02 1.447805174468240752e-01 9.917039567091982810e-02 9.892188470915849394e-03 2.084868050440285073e-02 3.351573645150220937e-01 7.239473260827603562e-01 9.121568780605161519e-01 8.170331037277814845e-01 9.794956436301829328e-01 1.665629600271585797e+00 2.872614123542659215e+00 2.915175898067782878e+00 2.277071079516661989e+00 9.673766357867302768e-02 1.006453338893621152e-01 9.016783066278050152e-02 2.835183701885736207e-01 4.099403301790956466e-01 2.108913696381795155e+00 2.115063472931520305e+00 4.245090048485472556e-01 9.102372055782018828e-03 5.139567834294069860e-03
3.848450480003429847e-02 3.983140479442347226e-02 9.246391584650372891e-03 6.594089541015443409e-03 3.641029302423158184e-03 3.848549829926725153e-03 2.738837120377746875e-02 7.809687784290367252e-02 1.617338340340281067e-01 5.624391143398332904e-02 5.774922245122510178e-02 5.229571965755086538e-02 4.142667353369724470e-01 8.315272998912588420e-01 7.684210373673897587e-01 1.168699324207016943e+00 2.016751266075630600e+00 2.441686708542739837e+00 1.403621579214905601e+00 3.041732569962152244e-01 1.828399189167149996e-01 1.260577724372165198e+00 1.850512691576178703e+00 3.113949155331123819e+00 2.948375004787129328e+00 3.880189448284051323e+00 3.117964471836637053e+00 8.787938797587135920e-01 1.450439891523184685e-02 6.265906796641268484e-03
4.644835044186321898e-02 5.190754235979500031e-02 4.897281139377621106e-02 4.531168017378129492e-02 3.894446916321472017e-03 7.649831356479581262e-03 4.516333386375476211e-01 1.525593678194586689e+00 7.432112080240802499e-01 1.242591333575124024e-01 9.182996685841918194e-02 1.483086945029585824e-01 2.981967068502682783e-01 4.358625913089543835e-01 5.716294383202492613e-01 1.019078463817812974e+00 2.185804824305557226e+00 2.182749800657298067e+00 1.025082310434889843e+00 3.502609198140433922e-01 1.519473782309644916e+00 2.776819014168795619e+00 3.586139794024653771e+00 3.698031391390293798e+00 3.282337160061768344e+00 2.851641638342313545e+00 4.193960754978014016e+00 7.166666584230652060e-01 2.228531176758095228e-02 9.072813410586483968e-03
9.425641762826767259e-03 8.470986017991745040e-03 4.354925916322785473e-02 4.445332909193887468e-03 4.611850787395163631e-02 2.219524697827384152e-01 1.249537789497756402e+00 1.025661045960339690e+00 1.006159202790401386e+00 4.919010297026817358e-01 1.794093628505984972e-01 5.008164147791371174e-02 4.970303980649232178e-02 1.263683249289030419e-01 2.834504291038921764e-01 1.295260985065820769e+00 1.350580228169536490e+00 1.555062542297533490e+00 2.683456382558890296e-01 4.718968776706577439e-01 1.684999557892972177e+00 3.668853652200630755e+00 4.545152103382125830e+00 4.736604893019952911e+00 3.930977668150387405e+00 3.769840073011351933e+00 3.411790351670746180e+00 2.667919791960520648e+00 1.170425784114168533e-01 7.603357194732004998e-02
4.561331087380236793e-02 6.810976937698311195e-03 1.195365087321382906e-02 8.188226319843183720e-02 1.770825887590678216e-01 2.532928491816028860e-01 7.991056877977105177e-01 1.000304036853034484e+00 6.835453312027227613e-01 5.230510382862161300e-01 1.101226641848541965e-01 1.106850456547842435e-02 1.705842849173123954e-02 4.810360161982968341e-02 1.046950958754013505e-01 6.154762951789751746e-01 2.324355398675926332e-01 7.327794109181956506e-02 2.433741918696685769e-02 1.760996703335343527e-01 6.724574976903129331e-01 3.587771599278279488e+00 4.539151286989021372e+00 4.748202098756246770e+00 3.449733280315191664e+00 1.577048561645534530e+00 2.500762112622546329e+00 1.693449547532458688e+00 1.515177614308025611e-01 5.869752020874063891e-02
5.975953376796273864e-02 7.672266393647927951e-02 4.971281271848178307e-02 6.159607406278359842e-02 1.443178518992229709e-01 8.298530176075205600e-02 4.258627353592969733e-01 5.494597087116311895e-01 5.032089870611602400e-01 1.176672822626476517e-01 2.962661362057206205e-02 6.341113459559510890e-03 1.129877354136652433e-02 3.364357479595388167e-02 1.337103786300946617e-01 8.925063206245285874e-02 1.609475988185458950e-01 4.698656808806649793e-02 8.758576433695673680e-02 4.144810993178512093e-01 2.229980341687528345e+00 4.201871096342356893e+00 4.484690939157537137e+00 4.224087984061130285e+00 3.205635225018808931e+00 2.311338355049930904e+00 2.200727811916785903e+00 1.465758571994538739e+00 1.310088515478881055e-01 4.592174466291763096e-02
1.666700863362174656e-01 1.528501646233485500e-01 7.890561356873132537e-02 5.716652022557343338e-02 7.470991577472745060e-02 4.006203235280980657e-02 2.266446261718341737e-01 2.018564337718986024e-01 5.486076050764472634e-02 2.941053429230860300e-02 1.008192577552130542e-02 8.031897188050817621e-03 4.949592914671281478e-03 2.852734001633856244e-03 7.537316501269940988e-03 2.530905156775367995e-02 8.961872689889385790e-02 2.022694015364617515e-01 1.929416553487188213e-01 8.553493472771792616e-01 2.313170504885833534e+00 3.307532105305403647e+00 1.327993831985799567e+00 1.971328373434717562e+00 2.522583217126039834e+00 1.414810225748923678e+00 1.045487825846894481e+00 8.588748648547309683e-01 3.477468253220344918e-02 3.198874930293017782e-02
1.343235661610026332e-01 1.548859668010437451e-01 2.315389939511775311e-02 1.631467319637069577e-02 1.366642263312503255e-02 2.037768329356255334e-02 2.870884422379439346e-02 7.093255920153375069e-03 9.147288287841587318e-03 1.446442696216761149e-03 1.928494737095435901e-03 2.916446789738523331e-03 3.340083334413423803e-03 1.246302167955393690e-02 3.604485232865729805e-02 4.661772136479856998e-01 8.878561895317103048e-01 1.272650110801610612e+00 8.610936132288583567e-01 6.386654814859775708e-01 4.432108145292678048e-01 1.550414801799844811e-01 5.908492037856916818e-02 1.277413498235319966e-01 4.616200024300041171e-01 1.553821605509476400e-01 1.414898816183824681e-01 4.805081545881681460e-02 5.675318352300572078e-02 5.323105367870799992e-02
2.770956485489181054e-01 2.150397387157185480e-01 2.342391721334902144e-02 1.044929944313439767e-02 1.585919661271006920e-02 1.235937504408625952e-02 1.893543814972715317e-02 2.001743020040115239e-03 1.731149560417417303e-03 2.756668124382459853e-02 1.850328611628621056e-03 3.382544338952651018e-03 4.500134935491176096e-03 2.533515558248015942e-02 4.337446024509258868e-02 2.796939592065627034e-01 1.019922618745781495e+00 1.888476656906502793e+00 2.121738394839618902e+00 1.809075255511167546e+00 3.746720922215880933e-01 8.157980656779099948e-02 9.978094181228154558e-02 2.471091196288384695e-01 5.496679981984904373e-01 1.619073731785263537e-01 6.085256951681847215e-02 2.304924373665029336e-02 1.049804532887415286e-02 9.735242044841512302e-03
3.525687528930704362e-01 4.547737978957989979e-02 1.222352245639200634e-02 4.213719279357985847e-03 4.964496442722633393e-03 1.089054797375533200e-02 1.394289759808753880e-02 5.651760203852240760e-02 3.151801703308916569e-02 3.629688469088790392e-02 6.377105974085092721e-02 3.147314374427594846e-03 3.460302114179217032e-03 1.934331511344484708e-02 7.839349628211442211e-02 3.922055157414103821e-01 7.612031362035398541e-01 1.750241171638930116e+00 2.198253240825315036e+00 1.841144543447666759e+00 8.983303038076208002e-01 5.068777023212626964e-02 3.557937779804865724e-02 7.793066362687889326e-02 4.501018424743837287e-01 2.728222928546661930e-01 2.433676400260022243e-01 4.528267545226788426e-02 8.261049083917547733e-03 5.836318194178573282e-02
2.054102794576275759e-01 6.408655151423375829e-02 2.297392705854719996e-02 2.285574499845568000e-02 5.181821329259783671e-02 3.561694596392118994e-02 1.483358862826688294e-02 5.928468246524339243e-03 8.616384449400073947e-03 1.174137465055356475e-02 3.905636620013328009e-02 4.415743892056476355e-02 1.993729126065515306e-03 4.413790804329988798e-03 2.759395126167324061e-02 1.154586718026973102e-01 1.175476151843982964e-01 5.055817774427058264e-01 6.533809351471948634e-01 5.627237908096224261e-01 4.658030638299931470e-01 5.931600157291706810e-02 9.079122972276327391e-03 1.800290289213524880e-02 8.009588550495222448e-02 2.031908681023928964e-01 5.436156626034083228e-01 3.030665614208806202e-01 9.379059465061635389e-03 7.198282419503689022e-03
7.416872650929581812e-02 2.960540192216783856e-02 2.907032666110403313e-02 5.238825313204513445e-02 2.897894203232966384e-02 1.305994701831210067e-02 5.984419172310929784e-03 4.054977085494756647e-03 1.231171365127963283e-02 4.888839946393559732e-02 3.660754597652734598e-03 4.256810549906148156e-02 2.140302010438781093e-03 4.553592052840571731e-03 2.217380137171263976e-02 4.042181405258511717e-02 2.819595661929408248e-02 1.416945026725632481e-02 2.269535141136028514e-02 4.182658641091577256e-02 7.443929685545770669e-02 1.707458080510781268e-02 8.897223997294017445e-03 4.616646028640600252e-02 1.129694134110992287e-01 4.058739364809653416e-02 1.400653392078835824e-01 1.561746771227198738e-01 5.447549038850935110e-02 8.070935437861213868e-03
7.522974516520039567e-02 6.062433545515109878e-02 2.721519332392279694e-02 2.126778821726068788e-02 1.998269161576457856e-02 7.545212892473330407e-03 4.983519495266726558e-03 4.934985648977670454e-03 5.230947297599848958e-03 2.120727097056769594e-02 6.315031386931538489e-03 6.048962519786663106e-03 5.801647417902577181e-03 7.332179757796066649e-03 2.186591800387186618e-02 1.566245990479432984e-02 1.112695057200837473e-02 6.978852215447761860e-03 6.436518180817610464e-03 5.108560662041300091e-03 4.167448501601687949e-03 6.250246810633363487e-03 1.025558039168919175e-02 2.652626308974954938e-02 4.741328363833552384e-02 2.303631360828791233e-02 3.686518529563286017e-02 2.473504734021241686e-02 2.483556297921378844e-02 1.573002904855260592e-02
1.023153834511489890e-01 5.346026450076530462e-02 2.799315151698418547e-02 4.071752201762231238e-02 3.613896346764212258e-02 1.980143995264064746e-02 6.759457466486594457e-02 4.944766311743462039e-02 7.003050526684192166e-03 5.279331272403578815e-03 1.915036216492229911e-03 4.447970064356009980e-03 1.333834572809282012e-02 1.537805497844088945e-02 4.923296443421059515e-02 3.806242182510641281e-02 1.269390962846665000e-02 1.586376263664173239e-02 7.698010498970907049e-03 3.901067189264873988e-03 3.612457123328752066e-03 5.584601598371827583e-03 7.869333002931102466e-03 2.601238366677988828e-02 2.793222296899775664e-02 6.955146741263414090e-03 7.893858286655112966e-03 1.036303168607284261e-02 3.416430642411803775e-02 7.012547589589392116e-03
1.365794326951428050e-01 1.185495415755968007e-01 3.348929933944208570e-02 1.217868710477476857e-01 1.427346947659468290e-01 2.724293016955516844e-01 1.832358977568332714e-01 2.018098773267594861e-02 6.993275611732897162e-03 4.195993489526023308e-03 4.584416309991715122e-02 1.766116373552042464e-03 2.172723695727614510e-03 9.014714942271441489e-03 1.109904301456416005e-02 5.209332432538296524e-03 5.411024800626369410e-03 7.066585647228073447e-03 1.016961764154517174e-02 6.051912424831237466e-03 4.480751406393239378e-02 4.547365320854534175e-03 4.573141343987738652e-03 8.377962290955963398e-03 2.848127381223937438e-02 4.804700546445589589e-03 7.248645263266789186e-03 1.234416017381517044e-02 1.539654847419241745e-02 3.073043916536710718e-02
7.070993723355530058e-02 1.778330466667250864e-01 5.295805960884477498e-02 5.974110876974327716e-02 2.881773512611661703e-01 3.057553227243638982e-01 2.063922494052065626e-01 1.427308576544666571e-02 1.008472359534713994e-02 9.826787380250470022e-03 4.056839226371638032e-03 2.303464867159515060e-03 4.100193345968378145e-02 2.596563103305115847e-03 1.214047814279529611e-02 3.686304515014983407e-03 1.415835333871900276e-02 9.321907328793369030e-02 1.746698793385672854e-01 2.652503298634451001e-02 5.185032889587791460e-03 6.622457688277881734e-03 5.019459061240801045e-03 5.976143927629719299e-03 8.584147842172677387e-03 7.076769387741049452e-03 8.715163358800709359e-03 1.104722503032834480e-02 1.542077316350554464e-02 3.806831320562160947e-02
