25.7390200475907 25.6815439350865 25.783926266243 25.8872485840459 25.991509385811 26.0854141048391 26.1685293220455 26.2507000545216 26.3319278046514 26.316771614064 26.2929808030852 26.2673163498618 26.2494649016142 26.2494649016142 26.2494649016142 26.2494649016142 26.114319714617 25.9351957927721 25.7560715796691 25.6360423573694 25.8151671520456 25.9942922370363 26.1734176120278 26.3120417561473 26.4215122336809 26.5319040402814 26.6432156728643 26.5373760799166 26.4275259987203 26.3167569991217
25.4322845569875 25.3280078395423 25.3818443870631 25.4366206765493 25.4923352056578 25.5892255228278 25.7208840354075 25.8515983082859 25.981369843504 26.059565939628 26.132866061843 26.2042930285881 26.2494649016142 26.2494649016142 26.2494649016142 26.2494649016142 26.1126043870429 25.9334823157009 25.7543599531157 25.6377521333911 25.8168750775212 25.995998311952 26.1751218363687 26.2846741035779 26.3455956045425 26.4074381950812 26.4702003724487 26.4103810462502 26.3490803719846 26.286861018024
25.1246033915637 24.9735267631434 24.9788185175999 24.9850497693606 24.9922190164198 25.0939774443356 25.2741782619917 25.4534350849556 25.6317494149302 25.8042337166601 25.9746227910059 26.1431391966208 26.2494649016142 26.2494649016142 26.2494649016142 26.2494649016142 26.1108893510267 25.9317691298739 25.7526486174918 25.6394616187977 25.8185827126963 25.9977040968812 26.1768257710379 26.2563835593265 26.268757074643 26.282051440058 26.2961371822647 26.2843048674028 26.2715526090878 26.2578819097669
25.1172075744584 24.9635245313777 24.9635245313777 24.9635245313777 24.9635245313777 25.0374279625219 25.1719775930497 25.3074661633688 25.4438921714475 25.5812541152315 25.7195504926426 25.8587798015795 25.9634848742657 26.0082096429539 26.0519990796467 26.0948546861703 26.0279368758314 25.9291360497727 25.8284780832898 25.765302389665 25.8663417073622 25.9692327527346 26.0739725215072 26.1169624675092 26.1186172262204 26.120270184939 26.1219213436518 26.1235707023459 26.1252182610079 26.1268640196244
25.1154635305066 24.9635245313777 24.9635245313777 24.9635245313777 24.9635245313777 25.0114425366231 25.0974473358537 25.1843908307339 25.2722715195721 25.3610879006537 25.450838472241 25.5415217325726 25.6339064946832 25.7271748787182 25.819508173652 25.9109078809718 25.9296947127596 25.9279851719584 25.9244189735292 25.9208252715839 25.9247723878069 25.9305707503751 25.9382173556945 25.9426833978052 25.9443378925987 25.9459905876871 25.9476414830564 25.9492905786941 25.9509378745866 25.9525833707211
25.1137197831003 24.9635245313777 24.9635245313777 24.9635245313777 24.9635245313777 24.9845166259755 25.0219775840907 25.0603769937317 25.0997133535469 25.1399851621619 25.1811909181789 25.2233291201764 25.305261229024 25.447072238434 25.5879484016207 25.7278912197299 25.8333111856476 25.9286909497002 26.0222145388857 26.0744955319886 25.9813524272363 25.8900600875349 25.8006155099706 25.7684042915578 25.7700585224392 25.7717109539023 25.7733615859335 25.77501041852 25.7766574516486 25.7783026853059
25.1002226208561 24.9635245313777 24.9635245313777 24.9635245313777 24.9635245313777 24.9635245313777 24.9635245313777 24.9635245313777 24.9635245313777 24.9733889177221 24.9824061406951 24.9904893614883 25.0627274565311 25.2322718794217 25.402749691551 25.5741593914719 25.7464994777134 25.9197684487824 26.0939648031619 26.1918359105752 26.0191116209523 25.8454608545498 25.6708851129498 25.6064947164959 25.6064947164959 25.6064947164959 25.6064947164959 25.6064947164959 25.6064947164959 25.6064947164959
25.0588530240172 24.9635245313777 24.9635245313777 24.9635245313777 24.9635245313777 24.9635245313777 24.9635245313777 24.9635245313777 24.9635934830984 25.0220885338681 25.0796483247452 25.1362743564575 25.218672895643 25.3396727081617 25.4616056673364 25.5844702720594 25.7082650212001 25.8329884136048 25.9586389480973 26.027151584729 25.902973066319 25.7778683119066 25.651838822733 25.606494716496 25.6064947164959 25.6064947164959 25.6064947164959 25.6064947164959 25.6064947164959 25.6064947164959
25.0184284732933 24.9635245313777 24.9635245313777 24.9635245313777 24.9635245313777 24.9635245313777 24.9635245313777 24.9635245313777 24.9646875358928 25.0717239217417 25.1778252910352 25.282993144161 25.3736853119848 25.446141503977 25.5195306000595 25.5938510994649 25.6691015014029 25.7452803050595 25.8223860095985 25.8633932792691 25.7877595421143 25.7111998097158 25.6337155829751 25.6064947164959 25.6064947164959 25.6064947164959 25.6064947164959 25.6064947164959 25.6064947164959 25.6064947164959
24.978948727887 24.9635245313777 24.9635245313777 24.9635245313777 24.9635245313777 24.9635245313777 24.9635245313777 24.9635245313777 24.9667181111393 25.1222948428507 25.2769368013263 25.4306454866132 25.5277649432929 25.55167850435 25.5765247269497 25.6023021106647 25.6290091550443 25.6566443596153 25.6852062238807 25.7005607582437 25.673470812639 25.645455112532 25.6165151584844 25.6064947164959 25.6064947164959 25.6064947164959 25.6064947164959 25.6064947164959 25.6064947164959 25.6064947164959
24.9635245313777 24.9635245313777 24.9635245313777 24.9635245313777 24.9635245313777 24.9802054146401 25.0063466102962 25.0315502802051 25.0596754011723 25.2120856144445 25.3654327426946 25.5197152855997 25.6064947164959 25.6064947164959 25.6064947164959 25.6064947164959 25.6064947164959 25.6064947164959 25.6064947164959 25.6064947164959 25.6064947164959 25.6064947164959 25.6064947164959 25.6064947164959 25.6064947164959 25.6064947164959 25.6051119113904 25.5884586284816 25.5727221553432 25.5579009916072
24.9635245313777 24.9635245313777 24.9635245313777 24.9635245313777 24.9635245313777 25.0110364709747 25.0857174191773 25.1594610856636 25.2335022119353 25.3373706307133 25.4421757208696 25.5479159824216 25.6064947164959 25.6064947164959 25.6064947164959 25.6064947164959 25.6064947164959 25.6064947164959 25.6064947164959 25.6064947164959 25.6064947164959 25.6064947164959 25.6064947164959 25.6064947164959 25.6064947164959 25.6064947164959 25.6005759542834 25.5353794436903 25.4710995042544 25.4077346359478
24.9635245313777 24.9635245313777 24.9635245313777 24.9635245313777 24.9635245313777 25.0428066303546 25.1660263423806 25.2883090167038 25.4063926651162 25.4617202784799 25.5179843196405 25.5751832889549 25.6064947164959 25.6064947164959 25.6064947164959 25.6064947164959 25.6064947164959 25.6064947164959 25.6064947164959 25.6064947164959 25.6064947164959 25.6064947164959 25.6064947164959 25.6064947164959 25.6064947164959 25.6064947164959 25.5951218799789 25.4813831307639 25.3685607141106 25.2566531303306
24.9635245313777 24.9635245313777 24.9635245313777 24.9635245313777 24.9635245313777 25.0755156533165 25.2472731406968 25.4180938343695 25.5783469994239 25.5851347961997 25.5928587772085 25.6015174431475 25.6064947164959 25.6064947164959 25.6064947164959 25.6064947164959 25.6064947164959 25.6064947164959 25.6064947164959 25.6064947164959 25.6064947164959 25.6064947164959 25.6064947164959 25.6064947164959 25.6064947164959 25.6064947164959 25.5887499225892 25.4264699235611 25.2651060185161 25.104656708107
24.9635245313777 24.9744414992815 25.0177119355778 25.0600413287216 25.1014311775534 25.2045593150252 25.3407704858746 25.4779205920802 25.6064947164959 25.6064947164959 25.6064947164959 25.6064947164959 25.6064947164959 25.6064947164959 25.6064947164959 25.6064947164959 25.6064947164959 25.6064947164959 25.6064947164959 25.6064947164959 25.6064947164959 25.6064947164959 25.6064947164959 25.5826826609862 25.5498577707379 25.5179517248236 25.4733832693595 25.3276481153 25.1809947331099 25.0334246224126
24.9635245313777 24.9874214377712 25.0792288100658 25.1700953842544 25.2600226588376 25.3477110625563 25.4353830113649 25.5239936512544 25.6064947164959 25.6064947164959 25.6064947164959 25.6064947164959 25.6064947164959 25.6064947164959 25.6064947164959 25.6064947164959 25.6064947164959 25.6064947164959 25.6064947164959 25.6064947164959 25.6064947164959 25.6064947164959 25.6064947164959 25.5475108765564 25.4661453209603 25.3856983704083 25.3039244577545 25.2067320061397 25.108621565253 25.0095946343775
24.9635245313777 25.0013438048793 25.1416871252146 25.2810898924724 25.4195536048139 25.4899241117536 25.5290578268544 25.5691299887785 25.6064947164959 25.6064947164959 25.6064947164959 25.6064947164959 25.6064947164959 25.6064947164959 25.6064947164959 25.6064947164959 25.6064947164959 25.6064947164959 25.6064947164959 25.6064947164959 25.6064947164959 25.6064947164959 25.6064947164959 25.5114186216006 25.3815133889731 25.2525265221162 25.1353833669513 25.0867326291095 25.0371641408365 24.9866794010757
24.9556816817343 25.0162083601723 25.2050866408441 25.3930246134485 25.580023775808 25.6370529642316 25.6353695746164 25.6336879807355 25.6313146861171 25.6230432663427 25.6157073502536 25.6093054395925 25.6064947164959 25.6064947164959 25.6064947164959 25.6064947164959 25.6064947164959 25.6064947164959 25.6064947164959 25.6064947164959 25.6064947164959 25.6064947164959 25.6064947164959 25.4745153305862 25.2959622093527 25.1184364142718 24.9677597628753 24.9676497503875 24.9666222262921 24.9646786891924
24.9212145636036 25.0320148632314 25.269427116788 25.5058993072704 25.74143293216 25.8113277468053 25.8096446261985 25.8079633010398 25.8003171399146 25.7435089988404 25.6876361179623 25.6326969993627 25.6064947164959 25.6064947164959 25.6064947164959 25.6064947164959 25.6064947164959 25.6064947164959 25.6064947164959 25.6064947164959 25.6064947164959 25.6064947164959 25.6064947164959 25.472817873984 25.2937251826876 25.1146322025886 24.9635245313777 24.9635245313777 24.9635245313777 24.9635245313777
24.8876904363582 25.0487630736531 25.334708312897 25.6197137340419 25.9037808342284 25.985602565945 25.983919714342 25.9822386578997 25.9683846129304 25.8630407381774 25.7586318801491 25.6551565412676 25.6064947164959 25.6064947164959 25.6064947164959 25.6064947164959 25.6064947164959 25.6064947164959 25.6064947164959 25.6064947164959 25.6064947164959 25.6064947164959 25.6064947164959 25.4711207064985 25.2920298601471 25.1129387250074 24.9635245313777 24.9635245313777 24.9635245313777 24.9635245313777
24.8551090593431 25.066452751051 25.400929989037 25.7344676538812 26.0670672423844 26.1598774216453 26.1581948390402 26.1565140513091 26.1355173437785 25.981638722714 25.828694874921 25.6766843031613 25.6064947164959 25.6064947164959 25.6064947164959 25.6064947164959 25.6064947164959 25.6064947164959 25.6064947164959 25.6064947164959 25.6064947164959 25.6064947164959 25.6064947164959 25.469423828116 25.2903348263954 25.1112455359005 24.9635245313777 24.9635245313777 24.9635245313777 24.9635245313777
24.9520335464289 25.1523098023969 25.4590881617114 25.767748745991 26.0782885604401 26.1647774893277 26.16645980294 26.1681403219649 26.1484627882777 25.9927095919329 25.8360212788088 25.6783993464309 25.6064947164959 25.6064947164959 25.6064947164959 25.6064947164959 25.6241331866036 25.6416886877541 25.6583195492068 25.6615588326984 25.6434583821212 25.626281668572 25.6100271946257 25.4795284924833 25.3148558221868 25.1492651159391 25.0107029754944 24.9957479884298 24.9817098456713 24.9685870496612
25.16048114116 25.2978610599685 25.5075685760621 25.7191578269045 25.9326258183804 25.9905025605228 25.9921846051476 25.9938648554719 25.9797509088725 25.8725341724414 25.764382562677 25.6552975767662 25.6064947164959 25.6064947164959 25.6064947164959 25.6064947164959 25.6711511199376 25.7372429093254 25.802410300016 25.8174886490337 25.7508517181775 25.6851382837944 25.6203468487987 25.5160497390161 25.3999163531828 25.2828651706087 25.1754334246962 25.1119408065268 25.0493647939137 24.9877038896384
25.3679861515367 25.4415290864725 25.5541677335942 25.6686876252849 25.785085768109 25.8162275951725 25.8179093708151 25.8195893524444 25.8119736434294 25.7532923796755 25.6936764860171 25.6331274593013 25.6064947164959 25.6064947164959 25.6064947164959 25.6064947164959 25.7190954411001 25.8337225316663 25.9474254645188 25.9724951117114 25.8573226876776 25.7430735195791 25.62974611067 25.5534906797573 25.4858955909025 25.4173829444993 25.3392475031843 25.2272182411235 25.1161053458863 25.0059073205935
25.5745488181746 25.5833143626408 25.5988861145338 25.6163386208521 25.6356688888391 25.6419525932827 25.6436340999485 25.6453138128878 25.6451307533681 25.634983975308 25.6239028107545 25.6118887562148 25.6064947164959 25.6064947164959 25.6064947164959 25.6064947164959 25.767965913555 25.931127318494 26.093364806685 26.1265784564977 25.9628715261343 25.8000876111853 25.6382252152457 25.5918510799398 25.5727933008312 25.5528182033493 25.5021454449414 25.3415805259497 25.1819317350651 25.02319757575
25.6064947164959 25.6064947164959 25.6064947164959 25.6064947164959 25.6064947164959 25.6064947164959 25.6064947164959 25.6064947164959 25.6064947164959 25.6064947164959 25.6064947164959 25.6064947164959 25.6064947164959 25.6064947164959 25.6064947164959 25.6064947164959 25.784435658128 25.9635134116838 26.1425914561419 26.1902241467356 26.0426512178702 25.8941567277982 25.744742173227 25.6906880185011 25.6595605211044 25.6293518966027 25.5666737417372 25.3875930932893 25.2085121570801 25.0294309334231
25.6064947164959 25.6064947164959 25.6064947164959 25.6064947164959 25.6064947164959 25.6064947164959 25.6064947164959 25.6064947164959 25.6064947164959 25.6064947164959 25.6064947164959 25.6064947164959 25.6064947164959 25.6064947164959 25.6064947164959 25.6070680813125 25.7861437010185 25.9652196119267 26.1442958137234 26.2088601150569 26.1098236699146 26.009865903792 25.9089883130567 25.8247692761292 25.745106706493 25.6663627703248 25.5649841259556 25.3859053202962 25.2068262268896 25.027746846049
25.6064947164959 25.6064947164959 25.6064947164959 25.6064947164959 25.6064947164959 25.6064947164959 25.6064947164959 25.6064947164959 25.6064947164959 25.6064947164959 25.6064947164959 25.6064947164959 25.6064947164959 25.6064947164959 25.6064947164959 25.6087776753193 25.7878514527063 25.9669255212818 26.145999880731 26.2284191110334 26.1779181628925 26.1264961339802 26.0741545203244 25.9579318149562 25.8297351595479 25.7024568981979 25.5632947982359 25.3842178350509 25.2051405841327 25.0260630457945
25.6018509867325 25.6064947164959 25.6064947164959 25.6064947164959 25.6064947164959 25.6064947164959 25.6064947164959 25.6064947164959 25.6064947164959 25.6064947164959 25.6064947164959 25.6064947164959 25.6064947164959 25.6064947164959 25.6064947164959 25.6104748783487 25.7894774370134 25.9686311397622 26.1477036571784 26.2489008989263 26.2469344613184 26.2440471831304 26.2402405600507 26.0901758696838 25.9134461147171 25.7376345144169 25.5616057585638 25.3825306375394 25.2034552287954 25.0243795326455
25.5725336308682 25.6064947164959 25.6064947164959 25.6064947164959 25.6064947164959 25.6064947164959 25.6064947164959 25.6064947164959 25.6064947164959 25.6064947164959 25.6064947164959 25.6064947164959 25.6064947164959 25.6064947164959 25.6064947164959 25.6106333729149 25.7411012635815 25.8724942345536 26.0048107902467 26.0798765687579 26.0815316373124 26.0831849133882 26.0848363969721 25.9341563015233 25.7567317859063 25.57930518911 25.4133251982793 25.2793337688574 25.1444265415267 25.0086050120686
