9.697402014192980924e-03 1.430568540789695087e-02 1.234102301615750200e-02 1.542069740231650360e-02 1.161951306455826990e-02 2.540113928599858906e-02 2.529740785502532924e-02 6.876005397879338121e-02 1.250235520801961930e-01 5.574565293837146357e-02 2.548334565171580038e-02 5.741973241025877250e-03 3.354303764099337073e-03 1.262708410442456991e-02 1.478298066999018424e-02 3.258040668755913735e-03 1.164783902821778933e-02 2.084172416792302862e-02 1.927751357940849994e-02 6.891886072031234121e-03 5.446876322837711226e-03 7.790533157761017017e-04 5.930971334294326538e-04 2.316346510737658706e-03 4.374012442179608939e-03 3.330936977239306891e-03 1.489225128149614021e-03 1.291642745788052751e-04 1.203321494642453009e-04 1.467714935859975082e-04
7.702248860145261521e-03 1.708685861709074300e-02 3.051051426844629197e-02 2.486560813094046418e-02 1.722459267409626876e-02 7.671981990446287425e-02 3.635523539193032116e-02 4.613412552094330044e-02 3.016411887527771507e-02 2.581630517604181774e-02 1.813122151757638745e-02 3.525981592300623559e-03 4.664303953771322189e-03 1.062032881473687351e-02 1.477577484502942858e-02 9.385506785692152021e-03 1.171853308179001199e-02 3.905043831021944717e-02 2.998992088844695814e-02 9.123628554327713885e-03 3.166169559079538669e-03 7.018585086013047090e-04 1.443890946626884926e-03 1.248556524052342595e-03 1.062010574701407941e-03 1.370133077281577997e-03 4.672501170607105177e-04 1.215034844409024781e-04 1.739555618279128575e-04 1.740378933726426146e-04
9.355867405753334753e-02 9.516902788203811248e-02 2.014130943535187290e-01 1.641720527783760986e-01 3.472594763913810501e-01 3.514928666044088434e-02 6.476472726704892921e-03 6.965382729012285432e-03 1.122117120865728096e-01 3.471036625051372032e-02 9.383255354603313447e-02 6.276546258452081473e-02 2.300690075813976998e-02 3.308589878598992146e-02 6.239098795191471911e-03 2.564012236226462585e-02 1.730491088922424259e-02 3.591808168030730108e-02 1.212081208282190375e-01 2.032629045479383834e-02 1.895989857989263021e-03 5.439935222521418085e-04 8.150748638323804598e-04 2.765086527087309387e-04 1.582198666844395179e-04 1.006187735010047340e-04 8.609799356857523198e-05 7.036115528917354154e-05 1.231813441711427422e-04 1.424179059329729686e-04
4.403082908505297904e-02 1.268422708065162496e-01 2.787428557726425171e-01 2.255001043313512310e-01 9.152279493436170366e-02 1.397323061993696429e-02 1.085175383705843516e-02 7.271369386020073294e-03 4.441010130645716043e-03 4.243543734549434093e-02 2.767118500365789435e-02 5.533270525399600070e-02 2.498772079259446721e-02 1.627803917232762201e-02 4.698994372101607947e-03 3.490227747368388790e-03 7.302123671268387871e-03 1.378295820310563614e-02 9.830556612550861439e-03 8.431659153692009842e-03 3.753194592385507029e-03 1.268755243122317517e-03 3.905513929780644183e-04 7.292669520905363002e-04 1.296781437803437380e-04 9.091566662411302657e-05 7.443613126720068540e-05 7.307618533092084681e-05 1.516447497296917815e-04 1.716260975125703109e-04
2.557333639093318373e-02 8.022764681015277788e-02 2.244284441973553312e-01 8.695337046008619342e-02 4.903016220638067163e-02 7.031999314423015984e-03 1.053916518131826040e-02 5.761481797381677768e-03 2.655648785558196220e-03 9.472191671662533174e-02 1.214009292417074087e-01 1.034924427360108673e-01 1.519655367352768308e-02 1.223717347488852136e-02 5.579001391974877135e-03 2.020986577472376564e-03 2.162220599500525725e-02 1.250137862293844784e-02 2.016546264349969309e-02 1.165763137927360027e-02 8.055305377199260125e-03 2.228229489348944586e-03 4.815616156173090079e-03 1.268765191220646345e-03 2.416832806029074699e-04 1.252794730764518504e-04 8.295269475839748814e-05 9.949634573704483937e-05 1.593243446319428510e-04 6.122736445196518256e-04
2.564840802103941428e-02 2.726052385454204655e-02 1.223942906237009826e-01 9.808391965250258526e-02 3.855073215221736793e-02 4.065865973902817870e-03 4.825075612627714033e-03 5.037073315863734892e-03 4.655123929576744299e-03 1.437487178003946098e-01 1.149233655164705326e-01 6.046293881741515025e-02 6.830349949730368450e-03 1.987197085843060967e-03 1.456314808496010594e-03 2.305795828464855118e-03 1.198013622125763608e-02 3.145937770578512583e-03 1.021024839100327132e-02 3.548882083914708246e-02 4.351950162368652814e-02 2.577978647892743141e-02 6.353040366340978289e-03 7.883014792769621254e-04 3.731263436145280986e-04 3.376576206448702916e-04 1.999439550859267480e-04 1.432317301937814007e-04 1.936025312911094081e-04 3.658838424429773097e-04
3.600335049672932081e-03 5.799494206906048374e-03 6.135957787493011815e-03 3.110641311241761631e-02 1.488402483955096438e-02 2.424628482267698892e-02 3.563143720437525475e-02 1.969094514914704677e-02 2.282237409173518486e-02 2.699043944430427541e-02 2.109518680638852034e-02 8.707822893903498576e-03 3.545538772633573862e-03 1.326272556548290611e-03 6.719167223857845954e-04 1.152296186300521153e-03 6.760365646716559596e-03 3.224027369181315696e-03 1.650175731726145206e-02 2.272799556445349173e-02 1.059813889735689539e-02 2.526492360247905699e-03 9.761346389546945220e-04 7.360961108532188511e-04 2.623182947689777183e-04 2.579737879077529761e-04 2.136554800365274688e-04 1.933734968019795123e-04 2.302847004812800288e-04 5.763902229315013594e-04
7.842607125515552516e-03 1.453328209263387780e-02 8.489169033900808778e-03 1.826653660802226090e-02 2.806117492693328483e-02 3.108210628193249989e-02 2.680394127546146740e-02 2.461179532722846189e-02 1.907859797461300758e-02 1.080089669128886723e-02 4.393489026257323127e-03 1.371827032043509281e-02 2.920804273087051605e-03 9.439357577088302708e-04 9.365389140345149570e-04 1.682053386568824671e-03 1.397879341988418796e-02 2.268176683622044956e-02 2.004752650183485793e-02 1.428391742490694484e-02 3.891632046612109042e-03 1.812620587718774719e-03 6.038187361749877214e-04 4.553401126582587942e-04 2.060929111604645474e-04 2.069334852584038455e-04 3.049949717406481267e-04 4.012704777644740995e-04 4.194681346797848377e-04 1.286212166942514185e-03
2.104292940290621722e-02 1.399404325297503617e-02 8.136730152234620747e-03 4.700117423983210529e-02 3.027724825559903118e-02 1.261575529361509858e-02 3.952233961648414506e-02 1.731885967786993274e-02 1.399941910369687480e-02 1.393544144178247499e-02 1.255442518258209628e-02 1.675249505271514047e-02 3.666480009263370365e-02 2.364241762731870630e-02 3.465702724395042407e-03 3.150726060500574563e-03 1.391804188692710373e-02 4.298945326836988573e-02 4.267989653277063505e-02 7.094288393732659133e-03 1.102000438581913089e-03 8.348978234909336729e-04 7.729652966162276970e-04 4.584665591559374648e-04 2.550567513450413375e-04 3.758834520354326645e-04 1.357982365633306817e-03 2.874776836968096719e-03 8.633025145741582765e-03 4.401506145480167317e-03
3.516369337343934476e-02 2.322031244754135457e-02 3.665939758536887472e-02 3.424053827648926296e-02 2.958177678356870011e-02 5.737442490694954871e-03 2.577668559720950811e-02 1.073062058747990821e-02 4.337290821546819879e-03 1.649372924114198653e-03 2.443882833466559656e-02 2.423320012006128718e-02 5.149055488925324831e-02 5.544605614592358622e-02 2.617314237824215281e-02 2.866628641581489209e-02 1.559407606292967652e-01 1.637254082674255984e-01 6.594782946238537946e-02 2.929826488043188459e-02 1.411237404103296914e-03 6.543058735822342110e-04 6.516061837024564535e-04 6.609623561529756738e-04 3.470475574107410041e-04 4.285673024841088106e-04 3.877932549573423395e-03 6.972268017358532362e-03 8.983195351073417975e-03 2.418605289897413687e-03
2.893865145121926261e-02 1.537975796701326198e-02 3.405577326412594780e-02 2.915089164436357461e-02 3.641519374927570940e-02 3.287444003148323659e-03 2.669345921079421119e-03 2.260995249109277929e-03 1.362218820699914604e-03 1.235380793079039925e-02 1.969041134216529820e-01 3.344457048615273043e-01 6.952518559602212100e-01 3.430366330805947883e-01 6.315371679537296057e-02 1.245367804036697501e-01 2.346006997355153112e-01 6.534287949782037475e-02 1.558293483088323515e-02 3.093881716304673710e-03 1.025849460624556194e-03 6.934178761784851172e-04 7.977516478721784036e-04 1.052278785080231534e-03 1.069007019475412892e-03 5.542883807202491665e-04 8.414045241728301643e-04 6.928735082811516427e-04 6.327565496531625550e-04 4.579086298680688154e-04
5.212689159480018118e-03 3.113498849088635039e-03 2.753556212987348303e-02 2.731704025663465873e-02 2.106991659295688948e-02 4.721026039991599137e-03 1.764259346591472979e-03 1.097671364763108757e-03 1.315384768636080086e-03 2.474521569582769850e-02 6.077837509679957784e-02 4.025048779068070570e-01 7.263374269283300322e-01 3.779216424962772991e-01 1.363811498804115285e-01 1.548100828674323637e-01 1.720209259788843259e-01 1.016278775807823859e-01 2.494315429261653727e-02 7.018136586955451596e-03 1.018953610762738087e-03 8.879017884180897885e-04 9.808663214521836076e-04 1.698815761399466483e-03 1.574283224725824644e-03 1.080141729563861537e-03 7.962000495562015362e-04 7.160383350432797996e-04 7.604765475321946609e-04 7.991373820660828756e-04
9.714905389945606646e-04 2.540117256232888362e-03 6.296398457795338022e-03 1.803162770830919054e-02 1.175142313767835352e-02 3.650199990918773056e-03 1.805930524559240091e-03 1.452377616838300845e-03 1.758843147199831919e-03 1.258002463875237432e-02 4.198715902676963992e-03 1.282197409121591802e-01 5.430556717414941614e-01 2.351939228387729952e-01 7.450265873863341770e-02 8.699255125208191219e-02 3.219304863640331388e-02 4.724529755859513402e-02 5.372736797854135715e-02 2.000239781306145312e-02 1.312058843856781822e-03 1.159890502573836506e-03 1.379371737524189836e-03 2.323654690033713846e-03 2.986950045738784656e-03 2.739051704631735064e-03 1.973970296425206234e-03 1.740896947577675853e-03 1.292765318107282459e-03 9.544179615581147545e-04
7.502228695292830363e-04 2.177699667116417184e-03 4.123788896974065962e-03 3.061639822832754303e-03 1.821652034020973965e-03 6.999806909728290005e-03 2.363492396732490633e-02 1.999343136724654121e-02 2.535950909599661574e-03 7.753892824928900005e-04 3.116711679227242033e-03 2.096347071322638908e-02 2.490892788388906764e-01 3.422139371249339757e-01 3.693537040131882887e-01 5.047512669816485165e-01 4.544520830496229791e-01 2.950838844895719015e-01 8.059180776865613183e-01 3.718886286480851400e-01 3.018695375975132336e-02 8.610384273995930551e-03 6.422424673703601948e-03 1.595623764653532686e-02 3.669932166010451968e-02 3.402363149230905326e-02 9.173964116190473639e-02 2.919966517872479850e-02 2.221842030802571779e-03 2.019719528376757826e-03
6.810374119090533123e-04 6.912107859989923908e-04 1.953047644909787321e-03 1.472403900860609453e-02 5.335085694441320248e-03 1.227896763381806141e-03 1.592729276061653418e-02 4.614918776019371477e-02 3.093025356815069793e-02 3.148989235220811620e-03 6.673097731375554967e-03 1.062236884963512762e-01 2.273797785646043401e-01 2.919836267214374614e-01 2.662455222333567351e-01 3.246437000603524248e-01 5.544071115044330034e-01 9.584725128597403332e-01 9.747462345269060080e-01 7.604512200246333897e-01 3.202584275786593548e-02 3.303433051629256489e-02 2.934168497707567366e-02 9.086819185805185273e-02 1.290113767852245075e-01 6.515927820118143643e-01 6.411648529335682856e-01 1.261214423229119752e-01 2.676594252706303821e-03 1.520916656790816373e-03
6.014867714260725782e-04 6.624663057740766414e-04 1.541234278387026155e-03 1.704600131713922663e-03 1.114727437507941803e-03 1.245603909814263933e-03 8.837372603583299249e-03 2.511790711094230924e-02 5.200142053627714728e-02 1.851705841345062734e-02 1.913482542578307660e-02 1.683491628327058245e-02 1.319311712475613185e-01 2.680555611442044239e-01 2.505064465579662225e-01 3.849551924305738559e-01 6.675108380921550566e-01 8.113963948468974063e-01 4.681553934799593253e-01 1.013255426022188072e-01 6.019254030360757235e-02 4.102194014040491110e-01 5.953798184209398991e-01 9.818793582055710401e-01 9.076152533665410305e-01 1.167365158392791757e+00 9.202116031099376592e-01 2.576967571567448934e-01 4.254140634251568805e-03 1.854869491333677178e-03
7.371368665858976568e-04 8.616450462366830694e-04 8.439002580468419994e-04 7.950143968610160839e-04 1.190807572438273756e-03 2.490038928001778260e-03 1.467865922442266602e-01 4.949677590968812324e-01 2.414440536355965949e-01 4.141161479081848645e-02 3.085401662539552850e-02 4.849934506312535143e-02 9.628782762963661312e-02 1.414986668849380347e-01 1.864039375914696428e-01 3.334456993482838305e-01 7.193905941367673140e-01 7.224820032450839369e-01 3.410876021958932913e-01 1.163819086725386281e-01 4.974019196304668156e-01 8.958470175579712480e-01 1.140669769345476370e+00 1.146947308506321095e+00 9.896690079824537190e-01 8.414849794234289249e-01 1.224981830496302493e+00 2.098086382633270186e-01 6.555019351646971561e-03 2.689101729468039090e-03
1.750782994805515948e-03 1.389466879853073654e-03 7.202502121753606929e-04 1.118221580477820947e-03 1.435994521742721408e-02 7.305464029201816367e-02 4.108784603251856571e-01 3.368431771550585152e-01 3.311078683629738451e-01 1.661161045782752754e-01 6.112344799129548756e-02 1.662792605665561543e-02 1.625868689526811448e-02 4.125188947522064747e-02 9.225260265666943016e-02 4.197659697933346368e-01 4.409903285245246884e-01 5.117822373043792172e-01 8.894297727065186843e-02 1.562071550438225154e-01 5.480723738451559468e-01 1.173049859783497295e+00 1.429142186465553133e+00 1.445133254078968754e+00 1.164544733050642655e+00 1.104081559632478005e+00 1.012379650549951382e+00 7.917486440630321365e-01 3.474392694354224570e-02 2.258279014665433293e-02
7.598357587237057620e-04 2.114938463607053155e-03 3.886001624349707823e-03 2.703030210866749772e-02 6.030629334252547019e-02 8.578757097743233695e-02 2.700035468710920150e-01 3.372269596178381068e-01 2.306311503568006238e-01 1.795806469880259770e-01 3.767611613070120241e-02 3.711280402055555042e-03 5.604389415355763224e-03 1.551532520005750523e-02 3.318293904025795826e-02 1.919148374984482874e-01 7.307262308316558874e-02 2.326307908834991320e-02 7.795979937368814269e-03 5.645205553986122615e-02 2.124270776930344273e-01 1.117119518098916409e+00 1.393474382828340685e+00 1.427156905309035828e+00 1.020330408775429465e+00 4.646977211186550383e-01 7.446538846532503308e-01 5.042907464494660319e-01 4.512042582918966704e-02 1.748209068519994414e-02
1.867605393240429762e-02 2.448350900734684935e-02 1.651693647755810013e-02 2.079194036171718926e-02 4.947719899471377664e-02 2.843535879300480851e-02 1.454985467725020687e-01 1.871566447368484820e-01 1.713340468447266396e-01 4.028604742957958562e-02 1.010819172741574817e-02 2.146059474994561553e-03 3.722817957779728584e-03 1.068415694844529473e-02 4.123612416321825735e-02 2.696354490606629392e-02 4.909975353958313804e-02 1.449683536149207717e-02 2.731972650130908009e-02 1.296587208131565194e-01 6.897596522829253507e-01 1.285302610764959219e+00 1.356788250200806401e+00 1.263906946695757538e+00 9.525942162039281458e-01 6.862623247999088960e-01 6.566110264970412835e-01 4.373254516623522603e-01 3.907050826980670855e-02 1.369667297320934299e-02
5.240493968677915892e-02 4.912200364374173789e-02 2.568127094150659748e-02 1.885241589748866756e-02 2.498297339009562454e-02 1.342089926865341031e-02 7.568147434034298848e-02 6.718830132347135276e-02 1.823811503532509273e-02 9.888898034639851883e-03 3.420402850651671402e-03 2.742097152067260457e-03 1.632278696055149527e-03 8.904279643122061001e-04 2.272427878278048419e-03 7.540261518510634094e-03 2.703223521272627924e-02 6.179284962134167641e-02 5.967742959482513765e-02 2.659483933494738439e-01 7.140838515046942225e-01 1.013737461116632099e+00 4.040976968274382908e-01 5.962053908452612516e-01 7.590525176520753758e-01 4.238913645477170311e-01 3.123456155280581736e-01 2.536921818210977064e-01 9.248503148051890124e-03 8.288317357955442971e-03
4.268755058857214707e-02 5.021624353144358427e-02 7.539650616364575002e-03 5.333739616717168321e-03 4.488536310120676970e-03 6.703986984149042962e-03 9.449499581773502729e-03 2.335494028836356938e-03 2.980542734089705777e-03 4.762626243156941686e-04 6.417743743711279685e-04 9.957791891844125151e-04 1.101277567676330537e-03 3.869871632994023938e-03 1.077589989712609067e-02 1.378788272966693651e-01 2.663060291650509170e-01 3.871219429149284630e-01 2.655012881650026246e-01 1.981917726650849476e-01 1.368349613630389927e-01 4.763152392454805123e-02 1.806126363317311911e-02 3.874438337135194949e-02 1.387632266980566853e-01 4.626179832468041431e-02 4.177207989965377177e-02 1.399021039503330933e-02 1.597473511365672108e-03 1.306174306490050360e-03
9.106220429485131773e-02 7.128446994896427136e-02 7.783478414572292219e-03 3.429998890195811237e-03 5.155372970190644048e-03 4.024679434661666659e-03 6.150974102105842903e-03 6.510295446637974796e-04 5.432578890286179820e-04 2.396089744054705499e-04 5.803782135455168734e-04 1.110956406489262572e-03 1.483055667898269077e-03 7.979152847250701661e-03 1.313524188070903063e-02 8.218871235301347666e-02 3.030865980273458327e-01 5.679794410121515869e-01 6.454431110984923947e-01 5.519844656082952827e-01 1.131968845657809614e-01 2.441195568776002855e-02 2.957808373185906101e-02 7.272593324094621392e-02 1.607063495349463911e-01 4.701091637771150078e-02 1.755806430997265341e-02 6.536423646752428929e-03 2.056948845388475652e-03 1.849364347828078665e-03
1.149456979084197555e-01 1.485361877710137529e-02 4.135584120069239582e-03 1.386451221011459917e-03 1.609040267115499807e-03 3.528512181628933389e-03 4.494612645993345881e-03 4.967373733431809397e-04 2.695052038776367940e-04 3.146608688006246224e-04 5.651539812534476246e-04 9.730390329772182654e-04 1.107270569930786852e-03 6.192094488453216659e-03 2.436888339853557350e-02 1.183170429109294403e-01 2.311452132726558584e-01 5.351699220198455897e-01 6.761349638805845830e-01 5.649437787148690049e-01 2.716170342882855970e-01 1.510701754342044269e-02 1.045605629633417598e-02 2.276256037147339831e-02 1.309383319420441560e-01 7.903152608637356580e-02 7.016817963513100054e-02 1.295117112664005005e-02 1.830728060715013745e-03 1.369663201965819633e-03
6.408950971598333102e-02 2.012460680838508431e-02 7.898299898359313273e-03 7.527894815377681424e-03 1.699692818154034668e-02 1.161115551365829446e-02 4.757844151733026973e-03 1.924190866104022804e-03 2.857871756719235993e-03 3.734570612676595212e-03 3.497130731218467707e-04 3.947003413944702010e-04 6.204993046661224591e-04 1.437198583566117946e-03 8.897915995854020071e-03 3.678133857341751856e-02 3.735114086975314246e-02 1.601416273994437645e-01 2.061628709572408957e-01 1.757347185462108108e-01 1.426417210076129372e-01 1.781681735999181282e-02 2.676230491775926767e-03 5.281884928476046626e-03 2.347134088821265993e-02 5.946399969475058001e-02 1.585705805980452965e-01 8.746513664859650872e-02 2.106459722393189734e-03 1.521237456993156795e-03
2.295667976607492985e-02 9.245517272943471615e-03 1.001945016927527007e-02 1.724733069642541555e-02 9.556297469535188563e-03 4.270213389679582139e-03 1.942228808323575662e-03 1.348572232094504995e-03 4.251817003008999916e-03 1.648863250224025939e-02 1.125801528234532129e-03 3.876254925448907812e-04 6.637925536821617139e-04 1.489751833647167453e-03 7.237281499150696393e-03 1.315137049598093244e-02 9.118118580017752287e-03 4.549236529430968588e-03 7.229062544506531518e-03 1.316409620498377835e-02 2.302226538066526676e-02 5.189154258698218738e-03 2.657484833601813333e-03 1.370272982748548495e-02 3.341179977684659991e-02 1.196214961858579548e-02 4.106375913102400244e-02 4.524944505331104233e-02 1.560358155151038949e-02 2.288565382626234299e-03
2.327513713620829247e-02 1.895314151833171409e-02 9.379499855671264222e-03 6.998783206337406103e-03 6.595048506811319530e-03 2.466722209193861638e-03 1.617627222141691714e-03 1.641922624805434473e-03 1.806337118997284122e-03 7.215406786234048950e-03 2.045386404050178030e-03 1.942822296696278522e-03 1.862238104895019538e-03 2.398451560069324914e-03 7.135604038062169120e-03 5.095016480906697232e-03 3.597706840780395821e-03 2.240307153283012560e-03 2.049205109560215624e-03 1.610142112656208534e-03 1.297426978038982879e-03 1.923744305745572975e-03 3.120432498954222797e-03 7.994837305183940049e-03 1.415988977312412390e-02 6.818405032940032251e-03 1.080878888421177644e-02 7.167615876120555021e-03 7.119168737955007369e-03 4.464413108529582432e-03
3.164008700310383393e-02 1.673106295185358694e-02 9.646762010577458746e-03 1.339328767840098668e-02 1.193616576114365883e-02 6.471739741575969693e-03 2.194196562308553533e-02 1.645789242151256965e-02 2.418174933668653173e-03 1.756277696261209159e-03 6.297563276922375818e-04 1.448601552168616701e-03 4.373983563597511233e-03 5.029903792925475778e-03 1.606537952072075240e-02 1.238141818332236938e-02 4.104198214136673545e-03 5.092081540076785415e-03 2.450175821205117545e-03 1.089747809568635721e-03 1.001344336074519274e-03 1.548128388588902336e-03 2.440200862813911905e-03 7.962952451160205253e-03 8.423912898857069051e-03 2.067079948675679124e-03 2.314216527782802721e-03 3.002693970256957966e-03 9.791946198589697795e-03 1.989995967624143616e-03
4.262999265860643872e-02 3.743211919428311718e-02 1.151810714681153654e-02 3.996181338486808066e-02 4.714782485652786043e-02 8.900319070652025488e-02 5.935527022449192669e-02 6.677803067796070358e-03 2.393265685042478795e-03 1.387619902637856695e-03 4.112344759901461833e-04 5.142200934485889477e-04 6.558708197861033880e-04 2.769176344899236704e-03 3.620963946797837660e-03 1.694618170551327784e-03 1.749215972008109129e-03 2.267352434232192127e-03 3.234091677556171027e-03 1.749023460892310368e-03 9.370334167034574235e-04 1.281052383436789236e-03 1.444673019931153567e-03 2.604872730014089373e-03 8.673474324790857864e-03 1.433649959473352930e-03 2.124616099048441502e-03 3.576023549231893695e-03 4.411696935956946168e-03 8.718666635019698199e-03
2.340903153633613551e-02 5.908960971411304081e-02 1.786444765544359728e-02 1.932631738187368803e-02 9.478790910459536367e-02 1.002527849419426048e-01 6.644563105626995203e-02 4.545086468594332005e-03 3.201812783425847259e-03 3.055306349303731593e-03 1.264986335413142201e-03 6.297817841022498647e-04 4.175025932566152624e-04 7.773896722333809061e-04 3.944936932485864148e-03 1.215795764796378771e-03 4.622474509027092726e-03 3.009138095982321834e-02 5.568798565969210190e-02 7.692212907554482441e-03 1.469725486201417302e-03 1.868354099281188977e-03 1.588482107872531222e-03 1.867120772616605133e-03 2.637190073773228172e-03 2.138141410011701760e-03 2.594592746980422561e-03 3.255972356879134090e-03 4.501723924303186949e-03 1.101649390137001035e-02
