2.174667818696969946e-03 3.152551599588817362e-03 2.794776962456081530e-03 3.595158846813380910e-03 2.761641832852739474e-03 6.104678435977172433e-03 6.046922945681883210e-03 1.635654618629917012e-02 2.981242527156062472e-02 1.364866669745582947e-02 6.488291871750061224e-03 1.507657679794492753e-03 8.890246432243910455e-04 3.271084824344304247e-03 3.769269052019885800e-03 8.216693563019730837e-04 2.897165105081427224e-03 5.076934228935621289e-03 4.613239944740952017e-03 1.624490597510251698e-03 1.290572470577169058e-03 1.847228088040410053e-04 1.281192406106750406e-02 5.349040509783165118e-04 9.620359557024090033e-04 6.982976451537395261e-04 2.982085121007819746e-04 2.898051142479843040e-03 2.769611976199873489e-03 3.488763356129478965e-03
1.688714146413603694e-03 3.634989868859672506e-03 6.612789028416925056e-03 5.415385182250395321e-03 3.798779050931894510e-03 1.715417343785147555e-02 8.228885618601536334e-03 1.029851236658040764e-02 6.752879150212171520e-03 5.823706599676794007e-03 4.227785218765444525e-03 8.399522045334380758e-04 1.125168827457791480e-03 2.573189272689337288e-03 3.585110798790271201e-03 2.313187313921048413e-03 2.873047886897671724e-03 9.425656367281629727e-03 7.168161000362348323e-03 2.172227516833986731e-03 7.665196116725585349e-04 1.697266960497085197e-04 3.506585171588970894e-04 2.926172318315386741e-04 2.346781372530670306e-04 2.849882792968749779e-04 1.105778148346643272e-02 2.881447807713499471e-03 4.130673500585995903e-03 4.166493596168433476e-03
2.033317320168740588e-02 1.980322110039238123e-02 4.194957963028945330e-02 3.386176520542256291e-02 7.247636884446245764e-02 7.448843468775813437e-03 1.413318020705956910e-03 1.519328570718886991e-03 2.472239103658578283e-02 7.599902234513950319e-03 2.070335915603247964e-02 1.389004271089349860e-02 5.150539410986315278e-03 7.655631367021749345e-03 1.478434272219349317e-03 6.308840756793037546e-03 4.255893684170271828e-03 8.774806983483533773e-03 2.955768366670485231e-02 4.978385927165708026e-03 4.720892290121411999e-04 1.353312975700071100e-04 2.034827170781821530e-04 6.929552072627249981e-03 4.011719839099331213e-03 2.584232799090439327e-03 2.234468688332188861e-03 1.778871367313936223e-03 3.036877849001074631e-03 3.454193280413399899e-03
9.478396638055656964e-03 2.590597585857046595e-02 5.693333253944683758e-02 4.562371110486576620e-02 1.891675041118882558e-02 2.957136157727773083e-03 2.397183061899147045e-03 1.617967675113573004e-03 1.001969833230543280e-03 9.469057777438172341e-03 6.152527288192942249e-03 1.240924024443097393e-02 5.669650682523750228e-03 3.827078735870036164e-03 1.129676575560194804e-03 8.641586728223598539e-04 1.808998576484606175e-03 3.387956210606369277e-03 2.428556626028724637e-03 2.088437355798736239e-03 9.420059328295892799e-04 3.174666374027915986e-04 9.413588694972066517e-03 1.754074466104297192e-04 3.267133904606548712e-03 2.348112397899327925e-03 1.959310148730538867e-03 1.863520289077596733e-03 3.734957470061933509e-03 4.132682030316108500e-03
5.521998230628309169e-03 1.636926394324734330e-02 4.557407669233235620e-02 1.764883694999344263e-02 1.019633274087232595e-02 1.504595819827659817e-03 2.350662517427073734e-03 1.331063050704319600e-03 6.224613189736459334e-04 2.206983104079725255e-02 2.794254254675266474e-02 2.431224077776557996e-02 3.620544237227600257e-03 2.996014255221954650e-03 1.390510763656742409e-03 5.084253479183729971e-04 5.456165355928957982e-03 3.139277898759547901e-03 5.090867708874765966e-03 2.916364918974560794e-03 1.992347945357873795e-03 5.476188745669694500e-04 1.182177091993912889e-03 3.028096160742477358e-04 5.875144454182042349e-03 3.147176593470928443e-03 2.144528450952484268e-03 2.501409347836557745e-03 3.873484095811132420e-03 1.364449636641113959e-04
5.555522830296063044e-03 5.592507373536764054e-03 2.502131285508441688e-02 1.999656402932670912e-02 7.948681781740286195e-03 8.625814178554833556e-04 1.074195733563876971e-03 1.175204083924520984e-03 1.118122906112805921e-03 3.449875092450793712e-02 2.746784913978896417e-02 1.480116580484510877e-02 1.696181756164507042e-03 5.018327023032750130e-04 3.701890114725183995e-04 5.838592346074046244e-04 3.047962993439808262e-03 7.967043684479928941e-04 2.599937228491338344e-03 8.943716764716157577e-03 1.078196401474119763e-02 6.320367027843339092e-03 1.546603837517088794e-03 1.872346037667381468e-04 8.793732111300729334e-03 8.292366376204849190e-03 5.100127948215215853e-03 3.556398582260591849e-03 4.646140646041478119e-03 8.592596899954747097e-03
7.790246367523981103e-04 1.196091150983513707e-03 1.262260325640664465e-03 6.388781099540543837e-03 3.058389403703488940e-03 5.143828417082122774e-03 7.977841333970723744e-03 4.647405611376370822e-03 5.623504114658849778e-03 6.702677854828580084e-03 5.269030057555099643e-03 2.220118420835664151e-03 9.148639571323550611e-04 3.444474834333805706e-04 1.145771746251028449e-02 2.950934638995209177e-04 1.734261864633833243e-03 8.252948283214781022e-04 4.236342531247288060e-03 5.783777326793896126e-03 2.630282256615412359e-03 6.183926449748214328e-04 2.360227615608493875e-04 1.744254909379655983e-04 6.009843751213810731e-03 6.207923571241507829e-03 5.397955884619184616e-03 4.759347186897692344e-03 5.498890740756771228e-03 1.347035221490302040e-02
1.731584759134619303e-03 3.115505982470283264e-03 1.817737407029997206e-03 3.911175438294557140e-03 5.973581023339837384e-03 6.755069439789438204e-03 6.067156877504528006e-03 5.794119949521869470e-03 4.710688464725838742e-03 2.701132466046592996e-03 1.109799221513896057e-03 3.497082088126358956e-03 7.478054678453926758e-04 1.515726908042230349e-02 1.561037888010410532e-02 4.354881104974102010e-04 3.601690428498051551e-03 5.786451759108945589e-03 5.109706878105101102e-03 3.638482088061265919e-03 9.818906847962099917e-04 4.526030979823407636e-04 1.251855946383782087e-02 9.806469803317119371e-03 4.618655360323793528e-03 4.854693077600287510e-03 7.473561946423828289e-03 9.581873682366615769e-03 9.753307481677580756e-03 3.260193026125418874e-04
4.707007054876428086e-03 3.054035996840420188e-03 1.787421909206298332e-03 1.033743939002728165e-02 6.692026211260439922e-03 2.833581269532186447e-03 9.177486732785289369e-03 4.126630578578645119e-03 3.473136278614185474e-03 3.496935345308691857e-03 3.176707559785355191e-03 4.259778273609240822e-03 9.361777448139759622e-03 6.087448680042784749e-03 8.996813353103259945e-04 8.139796463677818287e-04 3.535777338995661767e-03 1.076065866493832422e-02 1.065712035199505546e-02 1.784417631571793943e-03 2.775209147482499790e-04 2.095008777245843082e-04 1.923960168340680267e-04 9.696866586856889639e-03 5.600320681149659890e-03 8.599789854246149556e-03 3.231308707830224890e-04 7.007271594201280873e-04 2.173089676826803814e-03 1.152370073092696609e-03
8.052996370186076003e-03 5.222103794626014803e-03 8.351730345166624367e-03 7.774835807841277285e-03 6.808603645078359530e-03 1.337578338905510934e-03 6.178059945331076941e-03 2.606454392857529296e-03 1.083185461614497459e-03 4.125212699999089355e-04 6.124413917123377668e-03 6.032498838307858748e-03 1.288125657059446469e-02 1.401553476795337413e-02 6.712493949443529805e-03 7.334016595162117999e-03 3.923487033895010911e-02 4.071424832058286036e-02 1.642031745938351411e-02 7.351117680587642561e-03 3.569082081126599909e-04 1.251309924197441595e-02 1.306917741247617254e-02 1.660238771670006076e-04 7.474785743017655498e-03 9.595673156594410058e-03 9.540468328068857969e-04 1.760164005214928358e-03 2.346058926428423383e-03 6.567983874738139889e-04
6.772630500568365373e-03 3.525338268482836046e-03 7.913248012531385114e-03 6.750252793743616829e-03 8.600444431579104543e-03 7.855567484644600858e-04 6.522577085975079809e-04 5.575388917832475085e-04 3.416184356385731967e-04 3.107475244879180903e-03 4.916785654930271032e-02 8.245004655648906222e-02 1.714464267822154442e-01 8.507894775494689865e-02 1.577334780663897096e-02 3.074815649920857596e-02 5.707443340349314248e-02 1.584646789775687181e-02 3.808489920416180743e-03 7.652764330186108323e-04 2.566958711963089764e-04 1.262663651895247138e-02 2.017053723685325413e-04 2.664139900006322120e-04 2.704972895053234911e-04 1.170156384681614835e-02 2.126488152244431417e-04 1.806351732015937001e-04 1.378740924862894082e-02 1.006791678030913469e-02
1.242189523261102296e-03 7.268755368203998549e-04 6.473201288623674048e-03 6.397710745451376871e-03 5.026039550882036543e-03 1.146114032291800904e-03 4.366479821242695201e-04 2.729243709755727076e-04 3.274863813396910951e-04 6.192266673659161530e-03 1.509029974097358430e-02 9.874559194081128366e-02 1.770023105126682372e-01 9.156116196221128489e-02 3.302974448602900848e-02 3.690874953339258469e-02 4.084726477374538145e-02 2.430514519395538323e-02 6.043268585673423898e-03 1.718723338021969915e-03 1.649237260869278882e-02 1.483117966880337889e-02 2.456530334912043582e-04 4.288787282513368887e-04 4.009365746221276697e-04 2.779418478990926538e-04 2.074112590803114139e-04 1.430936323383560221e-02 1.544852728307311712e-02 2.285546854411191274e-04
1.439257607932036692e-02 6.010731612434150328e-04 1.497792218967158818e-03 4.310481802817408593e-03 2.850746331430451148e-03 8.923379232077391972e-04 4.429715486130836842e-04 3.571088954407961339e-04 4.330858870939474441e-04 3.154456749626377392e-03 1.054163212904949201e-03 3.194660851310202054e-02 1.330755090672139374e-01 5.602453777182227201e-02 1.737737812912085178e-02 1.975169086233606944e-02 7.335531495727696041e-03 1.087277784942937767e-02 1.251948030579108292e-02 4.739885918154165649e-03 3.183958764129446212e-04 2.848508929203661310e-04 3.417722433827656624e-04 5.862709295725293665e-04 7.675459120930333817e-04 7.173737275940716800e-04 5.267464859333237728e-04 4.794592275276814337e-04 3.631279046666591116e-04 2.768012660705462054e-04
1.135230595079338156e-02 5.179157482080397725e-04 9.809327869203371669e-04 7.348939971915151520e-04 4.426952814993807741e-04 1.721127970833253445e-03 5.767280386191903606e-03 4.837573556649868954e-03 6.129491525091039809e-04 1.385166305254826799e-02 7.837630028722241977e-04 5.244220279404554139e-03 6.089948966005143127e-02 8.012299543559345261e-02 8.340869849766474609e-02 1.097009426609204252e-01 9.951657551887085895e-02 6.522804927843085798e-02 1.799320333725715482e-01 8.504227789889189093e-02 7.139097932164807647e-03 2.095203884116009045e-03 1.584311966395266901e-03 4.033260232080504437e-03 9.447197894858497258e-03 8.898463635007783021e-03 2.456917037449237937e-02 8.145671656207286587e-03 6.391962144797139070e-04 5.976379253076779564e-04
1.025091842053620431e-02 1.033770183795973061e-02 4.573270004203444715e-04 3.505446567852280558e-03 1.291688664466145338e-03 2.997382689250339570e-04 3.842529269303901571e-03 1.100993601928060110e-02 7.386382499570008989e-03 7.677351475893376366e-04 1.650619105134151473e-03 2.615743932811846750e-02 5.462146045062436783e-02 6.720681641424476604e-02 5.900800023898333108e-02 6.931003293635241980e-02 1.191172250468876537e-01 2.081709445587700269e-01 2.150401819503761081e-01 1.730783230925271865e-01 7.559637270121856434e-03 8.058477036205356075e-03 7.233348861429936619e-03 2.292673855453028486e-02 3.310849972989398510e-02 1.702348461087893616e-01 1.719964854413043032e-01 3.525809477828349692e-02 7.756613882240548721e-04 4.517215029877221454e-04
9.029621922043288770e-03 9.925102225445042725e-03 3.536045391995484388e-04 3.988079998160912925e-04 2.666912323487864223e-04 3.012528818069232792e-04 2.100487610796717731e-03 5.862839993847390567e-03 1.211671312028280920e-02 4.394202734778824421e-03 4.587770633854757439e-03 4.018730792948481054e-03 3.088468590076674791e-02 6.096794682300811508e-02 5.551169011724712415e-02 8.279188549387800355e-02 1.438696627090897406e-01 1.769248119851062895e-01 1.041546877609858535e-01 2.330055383809558414e-02 1.432203520989208320e-02 1.004313146305764737e-01 1.485686318414853602e-01 2.512633381222700302e-01 2.361921137497891843e-01 3.082236674951069899e-01 2.491883214348200593e-01 7.234131680026104072e-02 1.238571120988592351e-03 5.501745619353471664e-04
1.103385496246870982e-02 1.293741794389489941e-02 1.314518386575583980e-02 1.284116859499707594e-02 2.843716668876114365e-04 5.906533444492255555e-04 3.414350684227936139e-02 1.132357376631704382e-01 5.514659777065898660e-02 9.562307611600946028e-03 7.192469193542591621e-03 1.130804767829099965e-02 2.217951473533989054e-02 3.189758370397221404e-02 4.101503841484249041e-02 7.162743794766146532e-02 1.549920445450700124e-01 1.590322513148600958e-01 7.704863488795100912e-02 2.711325659963599588e-02 1.192420961063173634e-01 2.198862098451743741e-01 2.871885539055606396e-01 2.967413598340864489e-01 2.613480219111852243e-01 2.259597663393758671e-01 3.354903211907505067e-01 5.906358247337809009e-02 1.887020005016845766e-03 7.891263884612618757e-04
3.850895759611658309e-04 3.017287960736998753e-04 1.144159812602144576e-02 2.556484532565070637e-04 3.339492625884260546e-03 1.679133350411072742e-02 9.252102117333002584e-02 7.459286829663760998e-02 7.312757087652692334e-02 3.716119440513049321e-02 1.381321549633881575e-02 3.767655157579910888e-03 3.671374125132341806e-03 9.243845048684216914e-03 2.028686900291228751e-02 9.107230033513508127e-02 9.629390517850984488e-02 1.146782401010785490e-01 2.036655777483823912e-02 3.674426408181592080e-02 1.328474150175664170e-01 2.927091725431331115e-01 3.691051808108337662e-01 3.846146801261721704e-01 3.171566621931855012e-01 3.044349992793390358e-01 2.822071552042391129e-01 2.238146061203546699e-01 9.936994203321463173e-03 6.555136087854481972e-03
1.216108480179435916e-02 4.748263763693547058e-04 8.828463178981620692e-04 6.147061635047162964e-03 1.371602912315803349e-02 1.916407282565362954e-02 5.936516788196361666e-02 7.255058052426449633e-02 4.917530151153176599e-02 3.873714536609722259e-02 8.248676083309836385e-03 8.185348277199648278e-04 1.245647245980990902e-03 3.483170078295130204e-03 7.470618603546804598e-03 4.358876323661887292e-02 1.679089082871051616e-02 5.469961132125679068e-03 1.860628625486608276e-03 1.363254996975228617e-02 5.186330705198771707e-02 2.766917477554803328e-01 3.522332686393818690e-01 3.719681357213261430e-01 2.741322107118181473e-01 1.278658775933936287e-01 2.079263146459711664e-01 1.427184237615600482e-01 1.286956272669604467e-02 5.080446875341842160e-03
4.409402483871211961e-03 5.649512849744843697e-03 3.785622636148515581e-03 4.694377272438253826e-03 1.105367953058096660e-02 6.217893244083679861e-03 3.118719218895960738e-02 3.903363400560707491e-02 3.520506253393067969e-02 8.405876830385926313e-03 2.138274531665674064e-03 4.568374516995491060e-04 8.086605173793210257e-04 2.403433666058421916e-03 9.576994240191923774e-03 6.464860078429626733e-03 1.193360444654199479e-02 3.572433270126097564e-03 6.757607019949924201e-03 3.189015035262685038e-02 1.687226133657646066e-01 3.156169220506755413e-01 3.359981425888299844e-01 3.238461691904120365e-01 2.535572978162573543e-01 1.891050251383067371e-01 1.857804885150020624e-01 1.251750877210633939e-01 1.127017717603614327e-02 4.011924467942414030e-03
1.273868925536461236e-02 1.162426399159054678e-02 5.984138749015714860e-03 4.293807066791939346e-03 5.554294513153669281e-03 2.892767916510638297e-03 1.586979191653505733e-02 1.358238392934904386e-02 3.607893794822558502e-03 1.990025908851623601e-03 6.962870414913336671e-04 5.610285929454890234e-04 3.460109127274044009e-04 2.001380023487022472e-04 5.396190942806344858e-04 1.877220800839562173e-03 6.756219470531737645e-03 1.552805888105275416e-02 1.503350900972758725e-02 6.655945430585501199e-02 1.762475119406443080e-01 2.490187555273855047e-01 9.907167244915518478e-02 1.515932933595179333e-01 2.016772229922330073e-01 1.175224116840781485e-01 8.979901211301727360e-02 7.375471593049637287e-02 2.703444468523671842e-03 2.443760636856280068e-03
1.039341363095009317e-02 1.190308240378815802e-02 1.755792522441851876e-03 1.210564886660562374e-03 9.864934342316299988e-04 1.426863750217663603e-03 1.956791668151122363e-03 4.673532504795691565e-04 5.830529196379640074e-04 9.419741139471735731e-05 1.272524223155260630e-04 1.990353094065745471e-04 2.312497720861041921e-04 8.764954390833342834e-04 2.604398759048772577e-03 3.520583192154878166e-02 6.748243013625347675e-02 9.811718057391249914e-02 6.729082008896890288e-02 5.026592757308170900e-02 3.442865999413650957e-02 1.193847953803843162e-02 4.473378147059027359e-03 9.836496031837119874e-03 3.688865255053136449e-02 1.291681655013584076e-02 1.226772470071146870e-02 4.150179967789017696e-03 4.724075733801276576e-04 1.935327863495250877e-02
2.179163525863991174e-02 1.665919111998774571e-02 1.796850951194922099e-03 7.696518090008265013e-04 1.117585323517411144e-03 8.495220050409178943e-04 1.270661543853115073e-03 1.310126272135896715e-04 1.069778494095157084e-04 4.978273449030988680e-03 1.159090147181248218e-04 2.246762820357213171e-04 3.141199619386727247e-04 1.805036263158526751e-03 3.133903952022607832e-03 2.059371477620440191e-02 7.540325388170529552e-02 1.414655215663345733e-01 1.613168255432177178e-01 1.400588277947560634e-01 2.931443500234713617e-02 6.419981957431288716e-03 7.777265461748261374e-03 1.924645489188183886e-02 4.386035102388449736e-02 1.324359431693002478e-02 5.197010390673008004e-03 1.970720836188802252e-03 6.221341179165516214e-04 5.646431167092873975e-04
2.691951715194514788e-02 3.395146621588181896e-03 9.366056586231103365e-04 3.039167534055469289e-04 3.410256264395555652e-04 7.301813521479641033e-04 9.177852829718613926e-04 1.037192754658738079e-02 5.726412117673385961e-03 6.598550318352030403e-03 1.165719777156314432e-02 1.994274550258812455e-04 2.371567559017516511e-04 1.404782239646461131e-03 5.809704408311458165e-03 2.955705873540234729e-02 5.754456926189094323e-02 1.334825946478415959e-01 1.691193846024400815e-01 1.439108494140652617e-01 7.159185667729478508e-02 4.099157389498476849e-03 2.880336433677611017e-03 6.260372073807815921e-03 3.649352390835366999e-02 2.213931957397410194e-02 2.024367445076271851e-02 3.855319878524577585e-03 5.624252704776453501e-04 2.150120239236345127e-02
1.482295943870080498e-02 4.536346187931339022e-03 1.753041847490808755e-03 1.616929166633440142e-03 3.546673431640284466e-03 2.391020329804837731e-03 9.734887741581208561e-04 3.902122683337806751e-04 5.735206650934365942e-04 7.595752599946739743e-04 7.325091055481569580e-03 8.222796369179451864e-03 1.340876245266838863e-04 3.257931266767485749e-04 2.100151535726612999e-03 9.065373263991913233e-03 9.288937911311537232e-03 4.032556519624945490e-02 5.240686182078510558e-02 4.563236046911483407e-02 3.868578722164842804e-02 5.023859498158461841e-03 7.748259087611430876e-04 1.512567463705336967e-03 6.708161424096852066e-03 1.680526645176028469e-02 4.548775427388013215e-02 2.602002510309285241e-02 6.565122747308356748e-04 4.948269975361162861e-04
5.300105177035630347e-03 2.077165621386854906e-03 2.204588956225475484e-03 3.680129436488912588e-03 1.984085523905641975e-03 8.782497201388816867e-04 3.979620742077679373e-04 2.742435976647157017e-04 8.536596472581388980e-04 3.356334669277925929e-03 2.312051901879916369e-04 8.108649429942485151e-03 1.431312028836126968e-04 3.369808999154901789e-04 1.706459395127822619e-03 3.238546813800216584e-03 2.288972056230747718e-03 1.162392747818468547e-03 1.872863333615080225e-03 3.480516117788668914e-03 6.302866606417056178e-03 1.461896654872927659e-03 7.647778617093761765e-04 3.924719005202040312e-03 9.591162177947743644e-03 3.410498689302395633e-03 1.183336121774766075e-02 1.350275112157742728e-02 4.879198712232764475e-03 7.511377927416583705e-04
5.373123637475347297e-03 4.261134382873680432e-03 2.062939711488074365e-03 1.498581759924062827e-03 1.376882618035901598e-03 5.105420688891102420e-04 3.323097050513339722e-04 3.339167979374153806e-04 3.626764443686283012e-04 1.469691164783454209e-03 4.195899039563505796e-04 4.024966049812856795e-04 3.992548286192288244e-04 5.341881291140341366e-04 1.655082861342749940e-03 1.234301714209844626e-03 8.913629682916950157e-04 5.669164779168174399e-04 5.274563122384213565e-04 4.229831038482836361e-04 3.480683916162488037e-04 5.246128130838163513e-04 8.596588780079493465e-04 2.208836942030492721e-03 3.980211104159452756e-03 1.954248252013312571e-03 3.190178495909769089e-03 2.163611799618236388e-03 2.221846226356637404e-03 1.451123013828525040e-03
7.278820081576039408e-03 3.751431610079453485e-03 2.120236910885494371e-03 2.873767466483510835e-03 2.492051969310278645e-03 1.336476861853399915e-03 4.497805045608331900e-03 3.346080445686600013e-03 4.882229264025373262e-04 3.594700771746612731e-04 1.296022214531956625e-04 3.002177761244025685e-04 9.375419894333645188e-04 1.119910568312846872e-03 3.731664290939556722e-03 3.005202975616444623e-03 1.018216749010898616e-03 1.288065232656733852e-03 6.307574758180395022e-04 2.849572520128173690e-04 2.634725792203300660e-04 4.092844253051275893e-04 6.474635867084518187e-04 2.139846247435791410e-03 2.330522537671279263e-03 5.875874131796783887e-04 6.829608722483811959e-04 9.070019441147099664e-04 3.032941450356279114e-03 6.410523615001435414e-04
9.780241029086762794e-03 8.369330502800843841e-03 2.522397294886186657e-03 8.563855548839127349e-03 9.805007249358784621e-03 1.826147353703866383e-02 1.213028730454568382e-02 1.356591221499091945e-03 4.837875210532111112e-04 2.835523212649703135e-04 8.626365510892717442e-03 1.066509989621610018e-04 1.407811038340042536e-04 6.140802160070165565e-04 8.371354753076301961e-04 4.083715120847125624e-04 4.286277334056611812e-04 5.548621475586370090e-04 8.042146561746375561e-04 4.440865082845652650e-04 1.657067732167117474e-02 3.259686018416324592e-04 3.658225977372543008e-04 6.788071682141582274e-04 2.356216569649588304e-03 4.030119899383583317e-04 6.207150351960240287e-04 1.069950253623241834e-03 1.342476721710930167e-03 2.767103505152814901e-03
5.395237539831843933e-03 1.331959719639998381e-02 3.958045038337424694e-03 4.214914339929825768e-03 2.017895670890576879e-02 2.121814536755919217e-02 1.412972972140542904e-02 9.687152229718651308e-04 6.819544198181782917e-04 6.527363369985396489e-04 2.712148854361752623e-04 1.356773523126283531e-04 8.518135593658495222e-03 1.767139872168718901e-04 9.252688314886601834e-04 2.937085183461136451e-04 1.139608023826441975e-03 7.420330808502105698e-03 1.403367278000658414e-02 1.981169044153839078e-03 3.834159273315548757e-04 4.835778060453374723e-04 4.099682837395391636e-04 4.937154807584218270e-04 7.217269788829415098e-04 6.005281426002724316e-04 7.519318923888853971e-04 9.668240085337272442e-04 1.351597118212104123e-03 3.428785001026086500e-03
