2.446719067696006330e-03 3.564283910199139271e-03 2.664742417274274487e-03 3.343635572387583695e-03 2.524354367440196679e-03 5.521542080056993963e-03 5.481578855337433664e-03 1.484107886623406078e-02 2.693695334789392160e-02 1.201319699318067168e-02 8.540124451372140685e-03 7.849860844736375465e-02 4.896083701994209669e-02 4.299452173029499197e-03 3.670594014377956838e-03 5.278837777337053866e-02 2.987620884397444460e-03 4.267297250664462034e-03 3.907374042173083518e-03 1.609708128657926385e-03 1.516799098409071572e-03 2.480874111699337900e-02 1.953386637958815994e-02 7.586539215368333366e-02 1.894424785652237949e-03 1.166747872893144355e-01 5.565439557602310655e-02 4.878197618918818021e-03 4.624906425588481799e-03 5.776372107783148829e-03
8.195457036647312010e-02 4.189055663924074260e-03 6.644570121895410249e-03 5.406500105265059537e-03 3.752908608840034924e-03 1.860383382096960150e-02 9.731825566837841793e-03 1.211899699820472888e-02 7.194163312009364472e-03 5.564213522108233528e-03 5.785248794059789923e-03 4.101979368122833647e-02 5.868281503895930035e-02 3.473041777058235094e-03 3.589619749197670105e-03 2.311899803185783579e-03 2.926748791004514776e-03 7.916220606386399281e-03 6.012183219786399087e-03 2.226618302927166077e-03 9.346349825982812332e-02 2.368890040199245206e-02 5.073302278491768208e-02 4.404393271063826443e-02 3.914270381406177030e-02 5.274016351330691743e-02 1.934754082972191952e-02 4.912417828779959243e-03 6.959674589374569877e-03 6.924832181488204362e-03
2.346028056808843396e-02 2.333358284987225792e-02 4.410719553982858643e-02 3.586021137322310121e-02 7.611387846103268018e-02 8.590022911714820936e-03 6.974775709015748615e-02 7.324597400551895177e-02 2.903827862558714529e-02 8.019186250112284378e-03 2.137427407136484672e-02 1.577146421441687554e-02 5.786068924883232614e-03 9.228550846536943270e-03 1.754131781911590733e-03 7.492393226226064760e-03 4.230740848298163680e-03 7.229161570599688599e-03 2.409946941904417619e-02 4.988782312721425777e-03 5.892457272504669774e-02 1.958189343192704573e-02 3.065711507115632256e-02 1.073076534779732194e-02 6.404694274099779171e-03 4.260898560407590067e-03 3.841038416895540836e-03 3.013433794857845165e-03 5.125980455819377501e-03 5.730238116823362093e-03
9.760017634496456415e-03 2.789739332637849317e-02 6.118646359831131365e-02 4.941881695642624805e-02 2.263631272044083417e-02 3.857944449750791167e-03 4.876586132784943226e-03 3.069522979456051296e-03 4.800616751710922586e-02 1.017548641606209198e-02 5.956306294603282495e-03 1.178401918528170292e-02 5.294065284122225455e-03 6.191176002843130736e-03 6.801179313326194409e-02 5.980440673034950749e-02 2.077179702182115149e-03 2.797474742311589248e-03 1.978162987492024672e-03 1.826383624194969149e-03 1.059931490598479660e-03 3.972726201651015365e-02 1.367726310597490273e-02 2.681693512454081524e-02 5.222691865663017623e-03 3.787787990320985298e-03 3.274939742219957085e-03 3.093608638650787498e-03 6.254051581484012905e-03 6.765187216742267994e-03
5.695844162433497462e-03 1.775770065486145452e-02 4.954139705822659112e-02 1.921052677675252202e-02 1.333390082278201015e-02 8.123900263001855582e-02 5.595005657299350482e-03 7.696387638956525556e-02 2.977537503764068547e-02 2.422707280388513087e-02 2.633914940680799274e-02 2.564700137478695408e-02 4.565520626767639520e-03 6.847825853120071207e-03 8.882062788685435306e-02 3.609970950023876080e-02 7.974369656303206474e-03 2.899313954433522383e-03 4.694520574855540543e-03 2.373745602621437148e-03 1.929809276707291407e-03 5.214492538883517408e-02 1.600530578956708277e-03 4.261931726303966328e-02 9.448369966175049553e-03 5.088291512868371030e-03 3.553076094349696089e-03 4.081616526942860590e-03 6.342550130249195728e-03 2.317050861534227305e-02
7.611051184707546755e-03 8.254371357668077377e-03 3.214172527435331383e-02 2.340406445495117962e-02 1.068830840404502193e-02 4.741568716822278096e-02 5.888349268789921237e-02 6.136938715563440561e-02 5.098724710849212444e-02 3.485427301594731797e-02 2.515747824916501202e-02 1.749776355636196296e-02 7.783516354315828112e-02 2.903653157679935565e-02 2.406735789728161115e-02 4.044522406997448638e-02 4.648115083376483207e-03 5.396102799532270788e-02 2.681255176289054111e-03 7.359123532777174341e-03 1.062934837383897914e-02 6.909158294471083248e-03 2.333705860632976931e-03 2.535074948598932051e-02 1.415460828160284429e-02 1.337189024394835890e-02 8.370145515602910036e-03 5.722160453540198026e-03 7.487841481157417149e-03 1.335061487112423895e-02
4.522898958496791855e-02 6.843075138795731704e-02 6.900221307628226497e-02 7.482596897648097559e-03 3.636347541906433199e-03 7.051974856125250470e-03 1.211560549604960221e-02 6.589141766720152393e-03 6.465246057461793150e-03 7.104700752174513030e-03 5.240619179501515394e-03 3.081100352482271480e-03 4.402818111592082112e-02 2.071683245247442004e-02 1.193650308805772539e-02 2.003489919438422237e-02 2.608127714081474088e-03 5.103485826476694687e-02 4.289529088898134772e-03 6.135144139849901118e-03 3.971301382257527712e-03 5.402464360166107232e-02 2.538000837018650202e-02 2.389680208468262373e-02 9.682808022896198172e-03 9.985310466004381630e-03 8.792856612074509068e-03 7.507616316207973810e-03 8.491289713388963309e-03 1.997943078240155615e-02
2.300461425879866267e-03 4.525691853944519352e-03 2.272607551180991746e-03 4.394710219944863126e-03 6.244593160098036062e-03 6.907060596087756001e-03 5.927593887640066582e-03 5.407034338442748451e-03 4.164847621797539839e-03 2.714648597944409325e-03 5.174352310017100304e-02 4.535127431228374965e-03 3.729024625272487486e-02 1.362560836890655894e-02 1.531545918837813776e-02 2.756483160970584975e-02 4.579821033013963504e-03 5.391690034241013868e-03 4.767942229573210976e-03 4.172757891025809587e-03 7.701384663619544046e-02 4.581476212936205078e-02 1.856067594110339877e-02 1.556003816156325235e-02 7.386047895576120827e-03 7.613044910766762589e-03 1.166539361238613098e-02 1.311832269513895505e-02 1.249478414301596375e-02 3.600675216642918591e-02
4.612306644827880373e-03 3.067712545704064184e-03 1.791881035525485708e-03 1.038230970601216642e-02 7.582823898934887286e-03 3.156534099651546466e-03 9.878081193746031732e-03 4.648507576077727695e-03 3.884345467293378890e-03 4.405549079148080374e-03 3.273232836565362174e-03 4.765874590165364300e-03 9.707440520001874365e-03 7.735909689117866084e-03 4.970118572748886965e-02 4.157447924911469861e-02 3.689364843991606736e-03 9.270156508336908907e-03 9.149781753684190638e-03 2.288893678743009457e-03 2.066190936664822828e-02 2.166669533893175389e-02 2.357662600789610721e-02 1.537462345715126175e-02 8.930636889708619755e-03 1.236660673211083770e-02 4.348251549065677152e-02 7.821338014900706959e-02 3.678164419318782647e-03 1.555940313782986154e-03
7.630050481651433347e-03 5.031808202987141446e-03 7.999656352250590630e-03 7.515574304534387851e-03 8.169063396010435227e-03 6.145745083093622635e-02 1.017133658542170548e-02 4.388471511054158752e-03 5.924539104301866643e-02 2.166027036799229866e-02 5.436795732423691484e-03 5.248808085183862340e-03 1.121039596896441018e-02 1.352868684920452771e-02 6.845531803621747458e-03 7.455009227336492801e-03 3.633160639645089535e-02 3.574410566513471638e-02 1.558812455161042929e-02 9.494511126856374980e-03 2.669431114858591622e-02 1.692181850556526146e-02 1.934111978350299202e-02 2.111958169495753782e-02 1.165922471487166115e-02 1.382179578993005149e-02 2.232190464319892646e-03 2.953295854373789043e-03 3.877833931080305972e-03 5.762437205322657602e-02
1.054551217497173496e-02 5.386178771876545465e-03 8.408450435277587884e-03 6.384282481307176210e-03 1.236406751175783691e-02 3.841600338943199078e-02 3.652486950824207490e-02 3.265506878793372758e-02 2.187647368191507347e-02 4.158599785213895443e-03 4.342338163062522266e-02 7.167183219308104203e-02 1.500113836321141370e-01 7.525222408033821475e-02 1.407814657045777795e-02 2.804100143882350821e-02 5.234524051171704495e-02 1.443813941660368645e-02 4.658555159398129232e-03 4.459309088142593414e-02 1.869118350822068786e-02 1.660214070866019437e-02 2.131464276915168848e-02 2.957204972158535006e-02 3.124417302076025818e-02 1.619905034060509577e-02 2.381337878715632586e-02 1.760934402663386772e-02 1.600332744470032639e-02 1.157931238525142584e-02
6.580498235457001022e-02 3.586604979142643534e-02 1.182626748030716178e-02 8.462682831137727235e-03 7.694100229755211108e-03 6.005829853676040303e-02 2.852368621563699039e-02 1.952185538053639868e-02 2.289517050359878014e-02 7.393651818414262791e-03 1.336855660594288113e-02 8.798235282151126158e-02 1.561802431203426489e-01 8.269539156539577884e-02 3.039270004277950382e-02 3.496968014752516174e-02 3.878468741369411193e-02 2.286421025375204308e-02 7.768267304135558458e-03 1.032630895533948323e-01 1.815895475356779989e-02 1.837657883799184710e-02 2.159778385809540610e-02 3.825734360688702596e-02 3.593383751463524733e-02 2.524723095474933066e-02 1.911848253890136365e-02 1.711235191502902611e-02 1.846232156684568526e-02 1.971765638778995647e-02
1.540905098508757974e-02 3.624327536528006849e-02 7.959338942021584873e-02 9.603390672922170954e-03 6.517955263048464710e-03 4.947501937462024657e-02 2.823458339024823016e-02 2.473177467967380833e-02 3.140338612547985409e-02 4.064249159485080337e-03 6.033647961825541750e-02 2.918670293655516168e-02 1.167912200018658003e-01 5.140515088673328764e-02 1.656814812400864492e-02 1.963979804457402500e-02 7.299820196233172340e-03 1.074349263776322450e-02 1.523415358622677226e-02 6.542975757433525975e-03 1.764741190011990049e-02 1.922888839903941910e-02 2.398168016781312278e-02 3.942134741010532017e-02 4.933422130773792991e-02 4.306227270787593708e-02 3.138362775481530476e-02 2.917020599355944765e-02 2.532637183932024555e-02 2.076270668159604579e-02
1.312651426394013943e-02 3.603957461856550221e-02 5.592556236243878542e-02 3.857096407484306849e-02 2.277804774584617220e-02 9.983723173216255131e-02 1.204728060712937678e-02 6.558557365950849066e-03 4.376149940342896616e-02 1.420999860419098863e-02 5.067556592817088618e-02 4.789179147022123821e-03 5.348453406552255984e-02 7.471590667403425756e-02 8.204812794950640253e-02 1.138927913685550408e-01 1.034976208092960870e-01 6.765225902474801545e-02 1.859717389534101539e-01 8.794372850642495631e-02 1.038401817885799445e-02 1.160946546848588418e-01 8.585399709668656287e-02 7.268660584996684479e-03 1.298122555548531475e-02 1.059789083232063819e-02 2.628694673156856815e-02 1.063351740803257679e-02 3.469871368854452603e-02 3.965326721477626520e-02
1.249393656035235889e-02 1.209106315125223034e-02 2.896463649568086982e-02 1.528165272740283388e-02 7.491264745421594151e-02 1.883444412850915697e-02 6.098024995950146639e-03 1.059314212746631859e-02 8.054883157914494510e-03 5.464854989354274439e-02 1.713222389141311544e-03 2.347757366441597521e-02 4.823200779610097716e-02 6.294962925447987467e-02 5.835157856643506669e-02 7.224523934930560110e-02 1.249581292812025346e-01 2.185741970469331774e-01 2.250739606771804957e-01 1.779925431821252069e-01 9.755686512438776700e-03 1.171608042050025118e-02 1.012764829784523930e-02 2.512894564353043703e-02 3.059270009730506376e-02 1.537959455229485350e-01 1.506813166689554007e-01 3.484181434704755609e-02 3.557505740756559259e-02 2.696640481469404771e-02
1.174603859060219420e-02 1.244689041959523047e-02 2.424720273816889302e-02 2.555209193210500329e-02 1.656648883149478696e-02 1.994690625317617483e-02 2.185497643663589663e-03 5.304828946876594641e-03 1.188579963218881416e-02 4.273480421843843351e-03 4.419456962108173938e-03 3.502465887132156543e-03 2.752543997055503441e-02 5.691375861273212378e-02 5.411029698120562587e-02 8.439498566083997178e-02 1.486699280938480194e-01 1.837785522721095965e-01 1.079672785190692041e-01 2.376048702922473055e-02 1.421399315552786084e-02 9.725537853164588353e-02 1.412633050443267146e-01 2.333238139213577866e-01 2.151655086097436220e-01 2.751428093006350051e-01 2.158389221194955410e-01 6.671859403951486966e-02 5.124565721409603952e-02 2.983212721081925436e-02
1.537261352192405457e-02 1.747040243691412240e-02 1.628576652561671695e-02 1.462597111053365491e-02 2.118053515193424677e-02 3.715261551464606182e-02 3.250626236147104858e-02 1.045048880906847694e-01 5.116396530361325135e-02 8.713675020270162871e-03 6.427775120288458169e-03 9.954582681608252492e-03 1.977228821772323078e-02 2.957335376366653293e-02 3.958154297562013063e-02 7.181519999382050823e-02 1.582356799441992645e-01 1.628363853314173659e-01 7.873541626410295036e-02 2.735645015281577136e-02 1.173750216174568456e-01 2.118167551388037695e-01 2.703534704488086415e-01 2.725475965124086186e-01 2.346521667544183287e-01 1.982651860699625734e-01 2.866940357076493417e-01 5.226381936096149983e-02 6.655478317359588003e-02 3.575299592712630897e-02
3.880826011421437127e-02 3.044048758252089829e-02 1.458189654460431001e-02 2.019823133585613509e-02 4.070685704485768434e-03 1.627722911497956129e-02 8.685793832341773268e-02 7.052885955418097819e-02 6.966701557886537111e-02 3.465797405445034118e-02 1.372477211530714197e-02 3.699980417078313575e-03 3.610194804195666386e-03 8.500334222986960508e-03 1.928460188225414665e-02 8.899178879020799848e-02 9.599638702302339122e-02 1.184044691372853481e-01 2.114103211656724948e-02 3.780164264527598877e-02 1.293385925211013032e-01 2.776801079653751780e-01 3.397833035539711832e-01 3.446619147121952054e-01 2.770314431829236090e-01 2.602803837816229926e-01 2.363259718949475008e-01 1.901255641073312519e-01 9.965068197906939637e-03 6.815746580431956969e-03
1.528997152552867902e-02 4.227713009220000068e-02 7.342438955947043489e-02 7.802994303712154113e-03 1.297989410359770383e-02 1.748012506564134566e-02 5.518475406708506226e-02 6.900282386507614052e-02 4.726593300647695395e-02 3.664534961508270072e-02 9.292290832143059245e-03 7.618731106926987517e-02 1.836869580569985838e-03 4.199616181690242478e-03 6.921408070186691949e-03 4.062349924511696880e-02 1.586026012707953889e-02 5.374992487340868492e-03 8.813279123479846044e-02 1.350914813824274745e-02 4.951399375915480766e-02 2.615143464833649678e-01 3.281469229231060436e-01 3.383066915373699191e-01 2.426696971482619480e-01 1.104373648955822296e-01 1.762181351739039170e-01 1.198544835252349783e-01 1.077130832183104472e-02 4.196659341203461471e-03
5.205233931487657055e-03 7.735549834569701959e-03 4.876620285724394578e-03 5.166113722140780289e-03 9.996974933722790543e-03 5.697304151451118397e-03 2.906877693541249849e-02 3.724357557198591101e-02 3.404224472418761888e-02 8.023393769388719593e-03 3.284423120568169020e-03 5.204842269280249983e-02 8.886932901033950394e-02 3.758406391316219605e-03 9.344833581545393744e-03 5.899525890328049214e-03 1.059801457058313738e-02 3.340989595415934810e-03 6.389719431018018453e-03 3.049577140891509414e-02 1.582751079917254500e-01 2.970053914848489462e-01 3.160116681822828788e-01 2.977652350816424320e-01 2.266175531986649727e-01 1.643288898513972918e-01 1.577223044888842463e-01 1.119003783118587003e-01 1.609617076143079334e-02 6.239145140570520262e-03
1.116736313888745842e-02 1.028926808085663634e-02 5.305577289960736534e-03 3.826910595201072664e-03 4.974323570147294073e-03 2.637447504605667809e-03 1.539703753332877581e-02 1.350620008314315675e-02 3.769398484650591987e-03 2.136206333229217092e-03 1.373901968219304499e-03 7.921627310854818804e-02 4.386124297577458780e-02 1.994155343296355465e-02 4.188119865826658156e-02 1.631947180494467157e-03 5.739937129919636324e-03 1.337327690758390204e-02 1.314689779819652564e-02 5.939086265835005068e-02 1.610274112750565145e-01 2.311292837234172892e-01 9.315669780628912933e-02 1.398330000334964129e-01 1.808332760210633605e-01 1.022972074022656386e-01 7.608114308708030515e-02 6.852629513644488413e-02 8.916633708933970059e-02 9.724686764552462059e-02
8.992674015690408154e-03 1.039745531617748860e-02 1.888101533773053854e-03 1.368878138007360986e-03 1.166159834455752489e-03 1.308123616847279864e-03 1.997286676502401433e-03 5.889792114328111505e-02 7.140232024564946477e-04 1.407423399111992941e-02 2.079233254880050522e-02 3.305749462453021897e-02 3.079135882464741417e-02 9.426617801141007336e-02 3.275880545503614613e-03 2.964866520189349264e-02 5.590250624512362043e-02 8.255653977045571135e-02 5.750616064578477349e-02 4.361179635915428399e-02 3.056443268347821055e-02 1.080466036659859588e-02 4.147473927127819440e-03 9.044230127978215156e-03 3.300427325351474456e-02 1.120408783415833935e-02 1.245636873273047590e-02 6.076526035640424268e-03 1.711709562082202110e-02 1.601926337007552117e-02
1.895919138620339242e-02 1.616326498441257239e-02 2.267655711672537672e-03 9.070779182784567685e-02 1.708658524884820555e-03 9.371404877400287469e-04 1.536545924371635497e-03 2.083388452232518701e-02 1.957132790754158302e-02 8.491180055827498088e-03 2.137204724524831290e-02 3.888063396177316583e-02 3.989890711785271105e-02 3.388546683526841123e-03 3.653933958493632388e-03 1.701723094308453532e-02 6.352284875732502889e-02 1.207519731543441888e-01 1.392764552664306210e-01 1.212493742337667907e-01 2.535689972090595171e-02 5.570225789688733505e-03 6.834515123697097912e-03 1.696024756655871435e-02 3.797723802236705609e-02 1.126241709450871362e-02 5.176883443176260625e-03 6.186761014815578275e-02 2.340912542318137127e-02 2.256664575637328321e-02
2.359218752342508163e-02 3.343130216457813626e-03 9.088608174507387116e-02 3.787124072689749404e-02 4.851286531391943435e-02 1.069004413078883803e-01 1.193025569445989829e-03 1.704544925443728792e-02 9.894174475246188261e-03 1.130600394085184285e-02 2.050019391056905407e-02 3.438271114443398196e-02 2.997432290981626515e-02 2.188889578956014059e-03 5.559168947696650938e-03 2.456587232834623116e-02 4.853864822543155905e-02 1.138204177490814012e-01 1.456742471219585056e-01 1.237389023180392594e-01 6.070033980601025753e-02 3.964096126677906298e-03 3.061557362713191420e-03 6.436848925691431716e-03 3.336867599386344335e-02 1.853606751196839111e-02 1.971637257953282735e-02 5.395850198997262891e-03 1.874690478024585230e-02 1.694965479551745549e-02
1.297340679119976005e-02 4.540810842199908930e-03 1.958423926493498175e-03 2.026937230170766484e-03 4.411469496056902480e-03 3.015559276588870852e-03 1.388225581477564759e-03 6.663998350489717948e-02 1.002061039591080893e-01 1.282384981786434397e-01 1.210185107263164750e-02 1.432810732107646021e-02 1.808215073379573767e-02 3.385354535790215808e-02 2.426748732636573209e-03 7.642053501970950263e-03 8.369563721015936195e-03 3.614856863583008895e-02 4.689601151371555754e-02 3.847591993840750874e-02 3.685055398337394594e-02 6.679979792748518691e-03 3.191354057507213987e-02 5.151084983659749705e-02 5.965629020844749608e-03 1.371442271378243462e-02 3.679716084270225757e-02 2.456156773561437440e-02 2.091302985383250088e-02 1.827084953134717679e-02
4.637024018109575478e-03 1.850443178895071509e-03 2.012516062584500734e-03 3.463581959737388818e-03 2.020393822359916811e-03 1.003503279673289075e-03 6.487837406082191949e-02 4.719751313779363411e-02 1.351506042195198005e-03 5.152534290089051151e-03 3.868908459394349714e-02 1.412608645259827780e-02 2.072376517316542807e-02 3.613896159918519868e-02 2.367084831009452425e-03 4.136489557297760161e-03 4.102959668866038717e-03 7.706020201264740521e-02 3.650268145745333686e-03 5.586674635252889161e-03 1.076630299879166239e-02 7.259219396943959735e-02 3.459407545233138259e-02 9.002230689296522592e-03 1.556018585086940860e-02 3.474496603065172981e-03 1.687803183634466186e-02 2.700252854772300024e-02 1.874079387738249863e-02 2.804845608295693932e-02
4.699471346727452509e-03 3.793000370562450447e-03 1.883263710280159596e-03 1.405782850042404256e-03 1.400458388474149374e-03 7.880750351363896566e-02 5.390744697001290803e-02 5.641447358910959414e-02 6.177959980745097862e-02 2.147317575606722158e-03 7.089007739761678251e-02 6.449069977736535120e-02 5.162969642257905084e-02 5.133582405349734756e-02 2.094751742982188091e-03 2.591565457024206341e-03 6.830321425972867011e-02 4.340543454711719845e-02 3.812671483211208662e-02 2.844099490927776835e-02 2.226231682041570487e-02 3.128007707494553230e-02 4.403329544866020628e-02 9.433212684175476537e-02 1.135464193495302684e-02 7.043642976805293554e-02 1.029009592956358320e-02 8.095496825659316553e-02 8.399744617160921634e-02 5.529625447646253911e-02
6.383185002973169875e-03 3.346688370762921239e-03 1.936789928753941768e-03 2.691558368968279685e-03 2.525100929215719735e-03 1.403937809452605488e-03 4.902491609622806369e-03 4.138758567915437961e-03 8.522787149067495571e-02 6.210197989030229876e-02 2.265710943601085062e-02 4.788634305369125765e-02 3.020851026772606446e-03 3.058675019450372585e-03 8.742527078301566557e-03 9.255644378464071217e-03 7.786301112128002355e-02 9.428517814219312954e-02 4.321400470096808250e-02 1.904523068114551132e-02 1.809463519677603077e-02 2.737005458889206141e-02 3.908591753043070410e-02 1.043227914002818751e-01 9.660859162502874811e-03 2.430133208059322147e-02 2.997875321258383977e-02 3.796814647284004612e-02 1.212007411888847003e-01 2.462454629806749840e-02
8.604764220046832307e-03 7.490568114378438544e-03 2.311358541139300806e-03 8.026616761173773623e-03 9.442396633471366110e-03 1.762046463270592472e-02 1.159718702523574937e-02 1.696044568775553632e-03 8.589063196889393237e-02 5.032842802294148349e-02 1.499877064026371165e-02 1.710465256993015659e-02 1.854926996175561282e-02 6.590059361884213762e-02 7.720047805825420995e-02 3.291606080732153994e-02 2.765855790746373638e-02 3.024778313724618348e-02 4.049956598128874596e-02 2.329116166105320990e-02 1.635031139022396357e-02 2.409551461187680113e-02 2.608845458458685512e-02 3.856422684860105060e-02 1.487740809715839413e-02 1.884711458405805354e-02 2.890082174975863727e-02 4.615958018480047914e-02 5.178599397934204734e-02 1.004002369269032385e-01
4.759987896153602960e-03 1.190511644267886610e-02 3.594537990922702913e-03 3.879669701150897411e-03 1.891860215762575584e-02 1.982413093245450134e-02 1.301570801715236023e-02 1.103877925334611088e-03 1.156968113924508740e-01 1.092312903697258142e-01 4.463873505915745554e-02 2.221598518226340288e-02 1.322587431427479573e-02 2.081305099628774635e-02 9.474328804781237401e-02 2.478339313227342217e-02 6.741153631247887024e-02 1.425151517517737540e-02 1.881381459724562263e-02 5.097360815079133092e-03 2.289633987407153903e-02 3.193339310697183159e-02 2.698467157231843744e-02 2.666927367838780455e-02 3.431870150466546227e-02 2.695296634738427941e-02 3.297843256054680539e-02 3.951467520789117560e-02 4.867302997730567349e-02 2.267782234633719529e-02
