5.902018753580263490e-03 8.746284796345824356e-03 7.663417223946357611e-03 9.724506352791373320e-03 7.439354005757491291e-03 1.643457660670791243e-02 1.646892618506656109e-02 4.503614334399723418e-02 8.238783974175618863e-02 3.679170310916602543e-02 1.684312021790523861e-02 3.801599178652421539e-03 2.227553010091699350e-03 8.428160776588889194e-03 9.914653684312109416e-03 2.194864374370184088e-03 7.925738546153703740e-03 1.435568915607936605e-02 1.343929510255935378e-02 4.854079017963443959e-03 4.080087052003297104e-03 1.983418388107398983e-02 1.543256173760481145e-02 1.709856453026001744e-03 3.099300510609101153e-03 2.413724320844931690e-03 1.115563434832243751e-03 3.978792268119608205e-03 3.878154511532707661e-03 4.892119072213412662e-03
4.736369605312183012e-03 1.059127910129349474e-02 1.905697347412729781e-02 1.565075290886872375e-02 1.092629839243111634e-02 4.913104264976956431e-02 2.353202257658758637e-02 3.017587299338560583e-02 1.993080232398213025e-02 1.696857770697913700e-02 1.184880479741380610e-02 2.293151977248230038e-03 3.033958282995120621e-03 6.962057303161942393e-03 9.763892750538167783e-03 6.254821739620881720e-03 7.956084396987495380e-03 2.708727647537414671e-02 2.124161135013749244e-02 6.574881209994913253e-03 2.454873045913806388e-03 1.899843671141782792e-02 1.275512912154063566e-03 1.008982980744674339e-03 7.897383063980121121e-04 1.034748591016106329e-03 1.510657122208936519e-02 4.021636322488938639e-03 5.857152555438610922e-03 5.872824023546408326e-03
5.814648811241857063e-02 5.983544485592291740e-02 1.266403151452151765e-01 1.032503855351707828e-01 2.185005376093033247e-01 2.231416110826049334e-02 4.176604519003414458e-03 4.559697425740269136e-03 7.451023329996075972e-02 2.275604718576388838e-02 6.069435011335194696e-02 4.011310831419354073e-02 1.465845649412510047e-02 2.131026050436548441e-02 4.063823508200793341e-03 1.691031877964990077e-02 1.172656707028164706e-02 2.509398367914686401e-02 8.723401584683154741e-02 1.498530065697396656e-02 1.460719368293881800e-03 1.566075954217007252e-02 2.478622198151439818e-02 8.716047444148606119e-03 5.202277352143088070e-03 3.476728962293008408e-03 3.145548936857590384e-03 2.528351425908536600e-03 4.328625955849893167e-03 4.865764748926574255e-03
2.765804423447013743e-02 8.076325927777409930e-02 1.774442988210940264e-01 1.435315021310420158e-01 5.825148065626868654e-02 8.967535246182064754e-03 7.065625896930242608e-03 4.797126764716665506e-03 2.966036434420128796e-03 2.798308237296356568e-02 1.800873484372252781e-02 3.557381728976750229e-02 1.600960077876878093e-02 1.052240699284734925e-02 3.066380558388791863e-03 2.300352700998124431e-03 4.927287987227600696e-03 9.559670146005524657e-03 7.007959534987618679e-03 6.149646388845251936e-03 2.792922686974079818e-03 1.003310230568866396e-03 1.108171369784536828e-02 2.220749051125150281e-02 4.276846986753670907e-03 3.166319872741403790e-03 2.725186856639267869e-03 2.591328236914409045e-03 5.271915945955708144e-03 5.736951869891745992e-03
1.625557667589623903e-02 5.181983239080856923e-02 1.449277627387431100e-01 5.614439668118710591e-02 3.165811892660487514e-02 4.572311347710193881e-03 6.933049579300922492e-03 3.830513762192045823e-03 1.782329719306192982e-03 6.285157960524852261e-02 7.962639733430036670e-02 6.713112376524223157e-02 9.823798866269021698e-03 8.810876419859045572e-03 4.089277666285786629e-03 1.509181541558351179e-03 1.451882956260665616e-02 8.580080602524667657e-03 1.415165090515846033e-02 8.342900799548254309e-03 5.810590247240383574e-03 1.642613518346194542e-03 3.853691837458590556e-03 1.110793254722242107e-03 7.712897329326351588e-03 4.219812241695253957e-03 2.936512558298775329e-03 3.399334407055643048e-03 5.322225779211681163e-03 1.958559421647053031e-02
1.651184760590587372e-02 1.787886214284694839e-02 8.025563457021850367e-02 6.430554328948742682e-02 2.527343481560293675e-02 2.679114462534129288e-03 3.205738160387890980e-03 3.371672125415573797e-03 3.136663635686560286e-03 9.592326457898901759e-02 7.592648439993412990e-02 3.956481694868082405e-02 5.062865493745839947e-03 1.813909273310009007e-03 1.764417681066074092e-02 2.019330312120195745e-03 8.518570223402705671e-03 2.135661775927473385e-03 7.050370469114782858e-03 2.491251191418887914e-02 3.094709897828696460e-02 1.924405627638184346e-02 5.337157005487657563e-03 2.082364873323305429e-02 1.150171664294694085e-02 1.100083799271014441e-02 6.865487957462747953e-03 4.731834668520282401e-03 6.235632132225857500e-03 1.121503981078252922e-02
2.319929487252555666e-03 3.807830390289658126e-03 4.035459206536964535e-03 2.049106509539498633e-02 9.820045202113094826e-03 1.607400247495278586e-02 2.377586065131009202e-02 1.321626484718652940e-02 1.540003395894657887e-02 1.806905254561027088e-02 1.400336356426694524e-02 5.732411532742221622e-03 2.738995413856955361e-03 1.548638804926026451e-02 8.930764165591379908e-03 1.513926128023261944e-02 4.769237605383654620e-03 2.169143979775230678e-03 1.123034585376932008e-02 1.567087634959330941e-02 7.445899918868817587e-03 2.031030706805206885e-03 2.023031998353315430e-02 1.959633835604647142e-02 7.928534536208276667e-03 8.139170109634786751e-03 7.136683465603753038e-03 6.152442407130845684e-03 6.860850314775854622e-03 1.632735701872304462e-02
4.916482240934703409e-03 9.223458978222787846e-03 5.420597493991430316e-03 1.173623558479215331e-02 1.814258342913781935e-02 2.027709995156635331e-02 1.766457636354539298e-02 1.637615388655665888e-02 1.281072497029845519e-02 7.198916617554635550e-03 2.904634396466038073e-03 8.996064172675082363e-03 2.266815417526389480e-03 1.032631653321274857e-02 1.166031223133476812e-02 1.423342370820743870e-03 9.929251628338194025e-03 1.534061200453832111e-02 1.363747138008800444e-02 1.019064452586485904e-02 3.247917433665134957e-03 2.101517971264831378e-03 1.462954915865388901e-02 1.270296020206065045e-02 6.068821112004352258e-03 6.105832526484027654e-03 9.072157309755182406e-03 1.050879234303610764e-02 1.017499476545044058e-02 1.154916177028593146e-03
1.287432483009302679e-02 8.622465551860891350e-03 5.061703691785280831e-03 2.953341703746973843e-02 1.922550967514292594e-02 8.111607444715448340e-03 2.575132402657062669e-02 1.143392171730321649e-02 9.458635115950396813e-03 9.352846376208177187e-03 8.362722592005001829e-03 1.094530007490723648e-02 2.465284768930924367e-02 1.702361040334912645e-02 2.537549179620601433e-03 2.255556795168386138e-03 9.456376944566732834e-03 2.920400519436569184e-02 2.901789541318549465e-02 5.367524971521988111e-03 1.604432082332220982e-02 1.690869698998519188e-02 1.876671489394194509e-02 1.249553469914273934e-02 7.308529078933017481e-03 1.005789331986059985e-02 1.231511252992099729e-03 2.331156349681375028e-03 6.928442424352292822e-03 3.510623500174674724e-03
2.107044353331083766e-02 1.395895473313301174e-02 2.228995857439835387e-02 2.108754815087766216e-02 1.847855578008682567e-02 3.643085985492613629e-03 1.664369533265233972e-02 7.317209055954710349e-03 3.055202370049444997e-03 1.672502916367183193e-02 1.621268223585607682e-02 1.577760457554013701e-02 3.363543793634087703e-02 3.685475489289720408e-02 1.769178091138041628e-02 1.969826331581009046e-02 1.069236958979713770e-01 1.116351298756690646e-01 4.476007768297210476e-02 2.315819571716917769e-02 2.111285911320215369e-02 1.347599202497041897e-02 1.543052023704889752e-02 1.678146611450097650e-02 9.286252726288270892e-03 1.111824502231866310e-02 4.096052726606761070e-03 6.393774933673966772e-03 8.169289991476667845e-03 2.149479946209617749e-03
1.728600765410462023e-02 9.200674583554115452e-03 2.061704492702879851e-02 1.788447068200140974e-02 2.268486727040030723e-02 2.392529606105928044e-03 2.258371049927328667e-03 2.097007337062551605e-03 1.667489180803030310e-02 9.034758893662548848e-03 1.310945947014155177e-01 2.189439148162572180e-01 4.568469768629160321e-01 2.289073964075815648e-01 4.277470695723503691e-02 8.561938212115101365e-02 1.607819902662226130e-01 4.448283007664723815e-02 1.054588816913971071e-02 2.513867415363271914e-03 1.460976307425028604e-02 1.317073105818224871e-02 1.652590883386610351e-02 2.232676125866650541e-02 2.339901280621027937e-02 1.264452523220148915e-02 1.980964374653336815e-02 1.499696115955896636e-02 1.366656211950372304e-02 1.001463436903296880e-02
3.600505124340381679e-03 2.120831785856984626e-03 1.679549476026056740e-02 1.688563498636680427e-02 1.322538514178143651e-02 3.496246343589325123e-03 2.053372384157719707e-02 1.448171343255498164e-02 1.757967688918402743e-02 1.803346106243585573e-02 4.040863904334900808e-02 2.672323718776979939e-01 4.833692462910050280e-01 2.531263625701604125e-01 9.191972774989311257e-02 1.049680377683482602e-01 1.165156628793090898e-01 6.866122605793943678e-02 1.680874983946601189e-02 5.439582017397161934e-03 1.415518694238535047e-02 1.451386391734746199e-02 1.654390495850116896e-02 2.824140302315740741e-03 2.162890005229815490e-03 1.956466001207442240e-02 1.565161703226596035e-02 1.433224208850250765e-02 1.560172339608951325e-02 1.690773243463784131e-02
1.029092127919590226e-02 2.163997330886743321e-03 3.879496869684640348e-03 1.180800034674941469e-02 7.828046358260386597e-03 2.876830038687647195e-03 1.651370043277232804e-03 1.876386720838230104e-02 1.559989073045903434e-03 9.020177015786827457e-03 2.866020737264415256e-03 8.626201723229776075e-02 3.656138156233200709e-01 1.579369780989356986e-01 4.990846992436121649e-02 5.813997844234349011e-02 2.155614613990360431e-02 3.169962017908453666e-02 3.611590713021814447e-02 1.444549236045948246e-02 1.365398114790606666e-02 1.493337958243913695e-02 1.809735503335081763e-02 2.230559443039717774e-03 2.505702299825825902e-03 2.559955385039389304e-03 2.086101661305156830e-03 2.134325240476866569e-03 2.042431745375353908e-02 1.684371222110324362e-02
8.963341590863789857e-03 2.733275396118040566e-03 3.010641388484145125e-03 2.044468537670958343e-03 1.607475634694776126e-02 4.961120522879729385e-03 1.682826643475287057e-02 1.390434807089332980e-02 1.827869847576822724e-03 1.101631519182373099e-02 2.148201147373874145e-03 1.428746211918603855e-02 1.695824980402659554e-01 2.301611244953470914e-01 2.456674069842607055e-01 3.320903852842753690e-01 3.006440980913344108e-01 1.966032412027749476e-01 5.404970491358370710e-01 2.532323731739311579e-01 2.195514318122536793e-02 6.963340463263422569e-03 5.210638960765299858e-03 1.237058866198532947e-02 2.672394771086421261e-02 2.512812989559749452e-02 6.875724158861148960e-02 2.406501335782210496e-02 2.804259981629709728e-03 2.835348510153016741e-03
8.817239184760078050e-03 8.414614051199816036e-03 2.259269336997262942e-03 1.392894049644879256e-02 4.596187699508446668e-03 1.356242968779929232e-02 1.092908883234225241e-02 3.038762106349923026e-02 2.100319649557312596e-02 2.152143320238368400e-03 4.579512700962669845e-03 7.174321418354961954e-02 1.534255892030230994e-01 1.955237860843405395e-01 1.770131682716801214e-01 2.142996093981680839e-01 3.679343552213092949e-01 6.402339768105647089e-01 6.551144018076904274e-01 5.158944499534541261e-01 2.211409142890221127e-02 2.321034288590574646e-02 2.096990504234639077e-02 6.576952234002138298e-02 9.443700079114165924e-02 4.825798026332296375e-01 4.806443923216618397e-01 9.556942037595267392e-02 3.023842284649500261e-03 2.158291827771990565e-02
8.653573117386589506e-03 9.125013838107811845e-03 1.783008432986132180e-02 1.841245956532438707e-02 1.207162441789054637e-02 1.460698547265451216e-02 6.049494979309479742e-03 1.658801814415172479e-02 3.479082077559023101e-02 1.236984185180221157e-02 1.276444250091537252e-02 1.121624136983943518e-02 8.784710934475417621e-02 1.784752712187397394e-01 1.668356062919175431e-01 2.564691400461032722e-01 4.465785185215883635e-01 5.451513613942322589e-01 3.157801563985279114e-01 6.898117792274302551e-02 4.186558026064361032e-02 2.913765695085810403e-01 4.317272611477495081e-01 7.194224256673930062e-01 6.696114664412882167e-01 8.677739802415772585e-01 6.895510381738841899e-01 1.945155395625568495e-01 4.699274076390004377e-03 2.480516549962695841e-02
1.151740717910937524e-02 1.313122999193890722e-02 1.223889995647267116e-02 1.103096038007414861e-02 1.600119961398041579e-02 1.816515238907347781e-03 9.692685933649719532e-02 3.280125276211017238e-01 1.623386119536537608e-01 2.762081628859072713e-02 2.042149116162068206e-02 3.186333337478958194e-02 6.326838593201089544e-02 9.366983657141575437e-02 1.243453094484765625e-01 2.242164738336300256e-01 4.850603244910906553e-01 4.881943127654869707e-01 2.308996563937368574e-01 7.952287811743970203e-02 3.486075421986848943e-01 6.435385901325125779e-01 8.393699521228360494e-01 8.505912584019906797e-01 7.357733305659461820e-01 6.276897579225296786e-01 9.176972640525478120e-01 1.578321446809065332e-01 5.952982750040201713e-03 2.589651134912269396e-03
2.933574670313980268e-02 2.302839432960173544e-02 1.099721441844449081e-02 1.532905853997760560e-02 1.045413682189654837e-02 4.811276328910123190e-02 2.685059206292356726e-01 2.239224307283149140e-01 2.233513254381383484e-01 1.106286308222258208e-01 4.019794008393055146e-02 1.079988778376479372e-02 1.057143429387571304e-02 2.720027068651742139e-02 6.170855661510947499e-02 2.851299608802023156e-01 2.998266158391519332e-01 3.478961648574778187e-01 6.044289160286790002e-02 1.071475386409105196e-01 3.869853082684350243e-01 8.518587305405094234e-01 1.066514827569548851e+00 1.084271694851487666e+00 8.721809251213886727e-01 8.264489027023295131e-01 7.586434351095013850e-01 5.934986130733004295e-01 2.605961090313185791e-02 1.694634192918093030e-02
1.172678446917951520e-02 3.255920667445864891e-03 3.802997694938257782e-03 1.891677594300228762e-02 4.004310248176833065e-02 5.602398278721613251e-02 1.778111333977490383e-01 2.240390935480630896e-01 1.543681145536884292e-01 1.193538775618483705e-01 2.486890163284281516e-02 2.433155001203074312e-03 3.690773812231643112e-03 1.037046003016088916e-02 2.251596769224203931e-02 1.322813961368010938e-01 5.036228252064423733e-02 1.600688219462610001e-02 5.355518209538213253e-03 3.900134026770030876e-02 1.498367697032121360e-01 8.042339146479321466e-01 1.023610545486430157e+00 1.057604026530347241e+00 7.603509146277901420e-01 3.487084039834860150e-01 5.625429026159310952e-01 3.809806921737227126e-01 3.408895063630942163e-02 1.320881545216273482e-02
1.314861206002773675e-02 1.713330122719868356e-02 1.109544648860109027e-02 1.390039262558472218e-02 3.291508976772535705e-02 1.887342521195317646e-02 9.648498530813136298e-02 1.241069980206291334e-01 1.136458163908390939e-01 2.669748197418331248e-02 6.692254967257927310e-03 1.419312739078865647e-03 2.543229004458680970e-03 7.393273589499941602e-03 2.891073726067069222e-02 1.886457772563673169e-02 3.431125500076413065e-02 1.010239470042470847e-02 1.897529566249591543e-02 9.023175919597928307e-02 4.860300777562032715e-01 9.170897698510964702e-01 9.803781379822855691e-01 9.249562478385056075e-01 7.066409057715621334e-01 5.163635184585122495e-01 5.002591920760238731e-01 3.332244485488302099e-01 2.978865475486195194e-02 1.044362070591400675e-02
3.641223685171969537e-02 3.381468853961337034e-02 1.762242410019526292e-02 1.289024404780196413e-02 1.701256222596405493e-02 9.056438038737743904e-03 5.054969495066462259e-02 4.443808338308018885e-02 1.213425523827866594e-02 6.790838955694754667e-03 2.374774870485299796e-03 1.887058948180132985e-03 1.131873211270501998e-03 1.504875565085573609e-02 1.619385803143122415e-03 5.359288638297132409e-03 1.916014076030465516e-02 4.362895626670885291e-02 4.195632122849498463e-02 1.866539877102381118e-01 5.029935903138421649e-01 7.171365164359626565e-01 2.871973518187483365e-01 4.311745310345357352e-01 5.607289893059133057e-01 3.199153883419655897e-01 2.400598117402322762e-01 1.980607763858076853e-01 8.374197343307382413e-03 7.773898080590038555e-03
2.979440383145518303e-02 3.469125644623587829e-02 5.202969724474526374e-03 3.677196175731666829e-03 3.090975167616141165e-03 4.568049857895079870e-03 6.447885483792744135e-03 1.606226726327745873e-03 2.099127455728303296e-03 1.107734476171657809e-02 1.538769246672257521e-02 7.214907196455259833e-04 7.700774849747897988e-04 2.746539646973401600e-03 7.744295594406032206e-03 9.881102205417882645e-02 1.902430117088523553e-01 2.753880310554269739e-01 1.880994347880994289e-01 1.399775281297817586e-01 9.654306225775033390e-02 3.358420597932738894e-02 1.273507032552476624e-02 2.784429436428703664e-02 1.021864541622959921e-01 3.491190083134666083e-02 3.219863523857532245e-02 1.293071634982315664e-02 1.433114203640525192e-02 1.347859106228894641e-02
6.272969463086759678e-02 4.865013226412547714e-02 5.319097244112361463e-03 2.349895969245198273e-03 3.542955597998521770e-03 2.746270151255060001e-03 4.279854150548342492e-03 1.640226706901056625e-02 1.527873633118907379e-02 6.693862740630895231e-03 1.567695002084176087e-02 8.375343438656444222e-04 1.008799953056932529e-03 5.510361328454545758e-03 9.213523004393703655e-03 5.855831033358280258e-02 2.155923869720469954e-01 4.030418795519227215e-01 4.569797946616278028e-01 3.904444304043613312e-01 8.020338584577155205e-02 1.733598540000569344e-02 2.106745589068261676e-02 5.255041536626856025e-02 1.181662113543563847e-01 3.517812926808622925e-02 1.335432343394011775e-02 6.268410028346185076e-03 1.980918474852268532e-02 1.921370261741732824e-02
7.829338742034740173e-02 1.003323127477357378e-02 2.801419513421821855e-03 9.438809499240401668e-04 1.103338254331885995e-03 2.410479140741761655e-03 3.162840197193957006e-03 1.340968034415436147e-02 7.643259630737427902e-03 8.801872368121885920e-03 1.532303713834225374e-02 8.139253212111933426e-04 8.275279465883255119e-04 4.503974988090297948e-03 1.700292907529513467e-02 8.367835073936610857e-02 1.635658556609770886e-01 3.786939477533737275e-01 4.787395326494217618e-01 4.006954745509950788e-01 1.935082612316003370e-01 1.082012047119686529e-02 7.534041697002721166e-03 1.655474090620656646e-02 9.620853904910395271e-02 5.868192162964614572e-02 5.273180658340514970e-02 1.203354962405057092e-02 1.576671144156168922e-02 1.435567057576173956e-02
4.322799402989145612e-02 1.346412679627936523e-02 5.307026267728835039e-03 5.092517086055380234e-03 1.162620912618489953e-02 7.938850774239279359e-03 3.277815454330590839e-03 1.334695794330437038e-03 2.001000049329614786e-03 2.697915579960913444e-03 9.349002824540098011e-03 1.082414889606475410e-02 1.374213867791103556e-02 1.109352545258264185e-03 6.170323634028296138e-03 2.578052961582629962e-02 2.627090011677973153e-02 1.130223762096220913e-01 1.460301588619439261e-01 1.250931068621403131e-01 1.022999058530030120e-01 1.288697963516607405e-02 1.952424615106152775e-03 3.867800721284972518e-03 1.723339076634564787e-02 4.379776585649127613e-02 1.175977180575036862e-01 7.080662296513254295e-02 1.744588544148067966e-02 1.528548578561513861e-02
1.545906321955403152e-02 6.176596427271328904e-03 6.723007146357280923e-03 1.165567002636347729e-02 6.533995013927048658e-03 2.919905448759122293e-03 1.322629701397504175e-03 9.143211937142991077e-04 2.872534291570957854e-03 1.125656630104431011e-02 8.384328637746393375e-04 1.038700445782964055e-02 1.517845288771828283e-02 1.150776540020508184e-03 5.009134868777275103e-03 9.192069868616448494e-03 6.401453290999950356e-03 3.210050553279850203e-03 5.548549789248377433e-03 1.089426158469952895e-02 2.132528397890395833e-02 4.544584725874753484e-03 2.171835111380607860e-03 1.003309020804631253e-02 2.449468557057087048e-02 8.795831125057095370e-03 3.035792583237555478e-02 3.499913974307537062e-02 1.627308254319297098e-02 2.162300130468622350e-02
1.567120163275932329e-02 1.266210811723689558e-02 6.293949705423241593e-03 4.730165634020068802e-03 4.509802264011851698e-03 1.686605740975085201e-03 1.101507466874230515e-03 1.113119106504025088e-03 1.220327731654943879e-03 4.996864482180094630e-03 1.469359566263588046e-03 1.515930272662542686e-03 1.397298592010849140e-03 1.743725108415019156e-03 4.939000631769064828e-03 3.561146167590728464e-03 2.525773009155584965e-03 1.582681137597605680e-03 1.926531022549602149e-03 2.161926018539507555e-02 1.748058636623115239e-02 2.350429486355432723e-02 3.437387718700309850e-03 5.870217301616755499e-03 1.134923869333561222e-02 6.280420402425503611e-03 1.005393789407089088e-02 6.210019993331217410e-03 6.914479030488712534e-03 4.461283438403700410e-03
2.130044018586468510e-02 1.117789711920875485e-02 6.473694784005164064e-03 9.052817870843356957e-03 8.163246568557156954e-03 4.424897544416822939e-03 1.494074752935739200e-02 1.115695988197481364e-02 1.633671391914042403e-03 1.249483935481900728e-03 1.684295795562899128e-02 1.160699278756283743e-03 3.312673189698416183e-03 3.645216835769489808e-03 1.112895929138031301e-02 8.660147761859755822e-03 2.882238273249038054e-03 3.598894423211127652e-03 2.269842901111841608e-03 1.439461435335303609e-02 1.414277908425951545e-02 2.080235905875243638e-02 4.328186174924217831e-03 7.739855407278436149e-03 7.828662489511717740e-03 1.880904545858541263e-02 2.155939102834077137e-02 3.401096669307050475e-03 8.349086706434307240e-03 1.597739145058113541e-02
2.871966425952871341e-02 2.502550111858137596e-02 7.737039682718057677e-03 2.703915119840425568e-02 3.227352780265850540e-02 6.092123645048751895e-02 4.047960714407281696e-02 4.535761913493895243e-03 1.620203371638183950e-03 9.888732012299952627e-04 1.127632100080527833e-02 1.325947750806915834e-02 1.400351143400759002e-02 2.370463372725491701e-03 3.140523781896835571e-03 1.347699051313245482e-03 1.366524951610119517e-03 1.601945032232126491e-03 2.659967691495656802e-03 2.540803548573558005e-03 1.280617831870330299e-02 1.858720962020364229e-02 1.949066950140273397e-02 4.391920204120105045e-03 1.218348861215566049e-02 1.408172601328440063e-02 2.043029867664530874e-02 5.388507779124038569e-03 3.747438245492854848e-03 7.366199418589926967e-03
1.587163467618877416e-02 3.975452696552472798e-02 1.209017276631875991e-02 1.318593212584885828e-02 6.533829577908939479e-02 6.935564064878196877e-02 4.604786433318786704e-02 3.154937741917079441e-03 2.222320755013396706e-03 2.159404183823994839e-03 1.077521341405538076e-03 1.740367876990195350e-02 9.903454432877449934e-03 1.429406399442794372e-02 3.511786811905555621e-03 1.718140233660254285e-02 3.609357511586499395e-03 2.130441717296617521e-02 3.998855197177262483e-02 8.850321120011838544e-03 1.824988093362111055e-02 2.532358253166921980e-02 2.107059746439007147e-02 2.028045286755269030e-02 3.596811748971368537e-03 2.019290620740330292e-02 2.349021246511448849e-02 4.586205963904501672e-03 3.409570944745320391e-03 8.220418440071977292e-03
