1.103819588810080361e-02 1.633192110362481630e-02 1.431992014253570880e-02 1.822191292132096380e-02 1.384788138191969317e-02 3.037835785651234188e-02 2.994358906678988921e-02 8.059565383535538530e-02 1.461665260551123779e-01 6.544511154651409812e-02 3.032046839731253329e-02 6.855611826358822686e-03 3.976969984211028986e-03 1.471471042966370282e-02 1.705461442491860991e-02 3.739287946797090374e-03 1.308178685733116936e-02 2.264518035104944732e-02 2.032709966140651067e-02 7.095746292314979511e-03 5.685830458564047202e-03 7.131694105620856039e-02 5.560449760610748637e-02 2.497617534678641359e-03 4.772954460828872716e-03 3.664839627148215335e-03 1.645892509014247130e-03 1.461748599791053843e-02 1.395556500190472775e-02 1.754094865165332570e-02
8.814321459131390854e-03 1.943655687793968689e-02 3.515819752473345328e-02 2.862738330873325701e-02 1.996590488126993163e-02 8.955893833419353856e-02 4.263679966011711675e-02 5.294775375123500494e-02 3.444413095506127648e-02 2.907206890260651336e-02 2.052780292752156427e-02 3.939555412140980165e-03 5.145392459291724813e-03 1.173785534134652933e-02 1.631911174786437879e-02 1.051032645880692340e-02 1.290720328459636981e-02 4.170168129536928892e-02 3.119480604622201433e-02 9.321616142789146409e-03 3.297879955237290397e-03 6.666964706690674258e-02 1.514665741098865110e-03 1.321716477934220969e-03 1.142645554491867211e-03 1.486237383420026910e-03 5.576517229431084827e-02 1.451976475761391355e-02 2.078675386442346146e-02 2.093019162700732877e-02
1.085071957732710313e-01 1.084409170665053407e-01 2.296202976640027704e-01 1.852561324738931370e-01 3.962740676968244946e-01 4.049222980241964226e-02 7.604043034926453656e-03 8.088036837332770665e-03 1.301744537515951428e-01 3.929618345693424580e-02 1.042383167544352340e-01 6.727041289252216894e-02 2.410637035697423686e-02 3.544457375350960893e-02 6.768802576091152191e-03 2.858804191517958296e-02 1.901169924891200555e-02 3.849704687984169260e-02 1.269646804561050946e-01 2.095811947679460802e-02 1.979807649707909095e-03 5.411521865511777218e-02 8.302788869473148869e-02 2.977969054139740362e-02 1.837708257042839147e-02 1.247366801488798520e-02 1.124954640695930569e-02 8.947069334142170732e-03 1.525894870369377994e-02 1.733659928770041672e-02
5.040891898942375521e-02 1.411743188598854337e-01 3.102743830577289752e-01 2.486524985112105735e-01 1.031034451805028646e-01 1.599593690649250485e-02 1.279117739464143318e-02 8.516991969237800927e-03 5.203390794031798224e-03 4.832467152887480466e-02 3.059214483999559905e-02 5.941240165401640710e-02 2.634971291241292729e-02 1.776125660483875504e-02 5.233260167256146428e-03 3.994980965672328965e-03 8.268591349220075215e-03 1.525142536799075146e-02 1.074828814514272417e-02 9.097979238590915216e-03 4.083796692706021664e-03 1.367387752330545591e-03 3.990866763990860711e-02 7.847751153138471381e-02 1.498105929512204976e-02 1.121031267305979025e-02 9.677094873538407208e-03 9.203301100679878166e-03 1.844275313324082038e-02 2.040165940482161974e-02
2.925309443432409784e-02 8.869518137572474092e-02 2.469522998864634999e-01 9.563914970916620462e-02 5.525700620987068074e-02 8.074156406884960488e-03 1.240063433548558962e-02 6.906280065431027668e-03 3.177990299208470829e-03 1.106837242654989395e-01 1.365968093293413455e-01 1.145081649687860609e-01 1.665621516121677456e-02 1.393038482494819881e-02 6.530584141394438560e-03 2.408014579493130553e-03 2.565578121271152451e-02 1.459831503166638886e-02 2.340800608010822070e-02 1.328141415355038428e-02 9.045372770366197357e-03 2.475038943981428333e-03 5.308660016068032089e-03 1.389579070387905735e-03 2.708377821639133126e-02 1.485008137115333138e-02 1.033095877697500463e-02 1.205671080652646887e-02 1.867697173487867235e-02 7.023336545032353440e-02
2.931179136909202454e-02 3.012710878795029842e-02 1.347987863378304896e-01 1.077347079137514763e-01 4.282706498800417649e-02 4.592204138863493525e-03 5.604864408824444984e-03 6.015374607579416881e-03 5.619525526773442789e-03 1.702054337944745588e-01 1.321781609206507113e-01 6.879827332170093679e-02 7.749349700665783200e-03 2.343586484204378349e-03 1.161648828066217387e-01 2.830623564080070407e-03 1.473020638804284702e-02 3.821968663151629770e-03 1.238707346318758742e-02 4.240746685020750639e-02 5.110299118247105948e-02 2.986979313389985513e-02 7.269494176225781840e-03 8.218635109160291052e-02 4.072286044370380942e-02 3.868638007801324108e-02 2.395781354293066018e-02 1.672113642617522808e-02 2.186049063044228150e-02 4.045330806386999989e-02
4.043489305425360288e-03 6.331350472219843435e-03 6.689673652543129921e-03 3.389741804941147352e-02 1.624441478721135382e-02 2.698882471613124265e-02 4.099825918609215775e-02 2.341989820742023526e-02 2.781732047967842500e-02 3.254155768897616652e-02 2.497946856832006235e-02 1.019714042109003821e-02 4.156313250745589244e-03 9.883338245975149816e-02 5.360260356091681166e-02 9.783836569702948627e-02 8.529125857991254681e-03 4.043282456780972027e-03 2.068454748794717676e-02 2.820114215446535566e-02 1.285220880041796666e-02 3.018288272564284992e-03 9.672843612907780497e-02 7.545815803018177115e-02 2.789609452284557908e-02 2.863615905639492129e-02 2.474788294670499794e-02 2.184091420150401433e-02 2.525579200339574115e-02 6.190308641346498747e-02
8.515563770162784540e-03 1.561218959239867206e-02 9.152032033451693721e-03 1.977932703639116371e-02 3.034631462563700324e-02 3.407580470567206365e-02 3.016353255148396251e-02 2.841495158871851223e-02 2.280629423397179806e-02 1.286743594745704510e-02 5.177468552643263791e-03 1.587393845935344133e-02 3.360675933606487292e-03 6.809801871428734776e-02 7.143138123648928861e-02 2.076360554808855292e-03 1.717807152051155362e-02 2.750797874114926933e-02 2.421468776619974464e-02 1.720599837257617837e-02 4.638561725646136308e-03 2.129829274919092449e-03 5.720482501129768582e-02 4.461716994100952544e-02 2.095478560712671703e-02 2.196363723930988554e-02 3.372535064164822877e-02 4.336656998316039402e-02 4.426623045056928690e-02 1.526135978341267669e-03
2.149877028058440331e-02 1.420130210216971958e-02 8.419065379162773977e-03 4.927214474067394268e-02 3.224528149252595122e-02 1.365864302879532879e-02 4.397056807676787138e-02 1.966869925280920542e-02 1.646786494562497982e-02 1.634920573501594254e-02 1.458421950587237594e-02 1.913926668541352308e-02 4.168214844842890732e-02 2.742716370028254816e-02 4.105354220712297691e-03 3.760991930850967908e-03 1.632762949473960321e-02 4.952704284794805928e-02 4.888249604613360833e-02 8.155240174581074655e-03 9.177384909720238959e-02 7.243572543151537146e-02 6.957294763692010997e-02 4.284183853616103932e-02 2.478072205096598299e-02 3.810574448434068950e-02 1.465367525010843799e-03 3.197586450380262690e-03 9.979268256154590067e-03 5.322136377787154739e-03
3.506855654935980837e-02 2.276286009136883892e-02 3.644454517413760197e-02 3.434426557858340223e-02 3.064341579741432231e-02 6.094135907119984687e-03 2.834691300139114550e-02 1.203577322174108170e-02 5.029332609714401436e-03 1.182250621042534727e-01 2.767559983993196290e-02 2.684335495638310448e-02 5.684151119324908075e-02 6.204231681307509350e-02 2.984641392231319329e-02 3.281618968348862242e-02 1.752247020264058042e-01 1.811326421403595677e-01 7.274500435636613305e-02 3.239735210567702695e-02 1.112955699158007794e-01 5.377261580621801873e-02 5.579113349782111042e-02 5.883668745426723357e-02 3.220320216155629633e-02 4.160569379839403753e-02 4.245225230308719185e-03 7.895679978570038435e-03 1.060858185300758358e-02 2.993181096184969851e-03
2.953431576581971862e-02 1.534836793299798607e-02 3.407035589458956570e-02 2.889663641134406630e-02 3.711200490562384380e-02 3.435400434998707540e-03 2.888523598597678849e-03 2.498793942292144073e-03 1.002167230876430809e-01 1.395493768615780998e-02 2.189320090986980050e-01 3.640165255410728884e-01 7.537350169253935750e-01 3.747977961977982941e-01 6.969146284856353457e-02 1.365216083792723245e-01 2.525314626368541648e-01 6.973502677649312531e-02 1.666226160219322003e-02 3.324433002464937011e-03 7.572339090358519431e-02 5.324551980439404253e-02 6.371732890216422196e-02 8.720493324836335602e-02 9.218926094582076403e-02 4.998705701052095357e-02 7.947404382273405565e-02 6.561045783171454149e-02 6.047278725751033951e-02 4.454406789603829880e-02
5.457357367100396442e-03 3.193647601451240787e-03 2.801256279380918285e-02 2.735317535197011318e-02 2.139511463221339255e-02 4.907739029945061560e-03 1.182414016194620887e-01 7.686039324486888813e-02 9.616818836838007811e-02 2.723916019613533898e-02 6.629561436038541866e-02 4.334710479451220344e-01 7.798450587901240016e-01 4.071473521117491279e-01 1.483542344883291009e-01 1.675791250471823091e-01 1.847049274396818097e-01 1.091635017367840466e-01 2.695243307922845152e-02 7.605481184877329465e-03 7.079642413992236205e-02 6.320272665496592945e-02 7.179678217475876645e-02 1.837233150535485084e-03 1.730948335448095898e-03 8.707339609143141534e-02 6.685152987319446793e-02 6.183537380862531851e-02 6.748552382880565470e-02 7.373353528598508566e-02
6.108956683485773642e-02 2.664631445405034674e-03 6.516327138162338918e-03 1.843290038390521524e-02 1.205441128966821748e-02 3.777075970137659840e-03 1.887192143294341229e-03 1.010615495153754789e-01 1.868079600280394539e-03 1.361563994618943292e-02 4.569288888554108238e-03 1.394802472381384828e-01 5.877366615291010898e-01 2.515652199175540948e-01 7.941491302343087200e-02 9.196631450841838418e-02 3.399007450497283644e-02 4.996128673490993904e-02 5.705019634828725761e-02 2.141517967042398662e-02 8.595840527492631944e-02 7.742001695464356681e-02 9.358052455382290247e-02 2.558080053798671150e-03 3.352214774740616340e-03 3.133789605462596398e-03 2.300042293531579657e-03 1.372835369336279088e-01 1.062885262343586240e-01 8.366135547825165331e-02
4.848766124769315206e-02 2.316057409766492277e-03 4.291600118541573708e-03 3.147800881167408214e-03 1.122590114082361451e-01 7.234160896252334397e-03 2.433674758498454577e-02 2.048738351490517542e-02 2.603821598470795577e-03 5.722761309407300295e-02 3.354242974795288226e-03 2.279740642788173621e-02 2.699363589623220427e-01 3.634588736320386593e-01 3.882294688298128515e-01 5.248005711344634339e-01 4.732498818162873544e-01 3.070354885611870643e-01 8.386629446172871871e-01 3.927605618490355721e-01 3.268247118700283449e-02 9.500639822882742808e-03 7.109894744514367974e-03 1.795594448026108236e-02 4.178806407300258985e-02 3.910182553588068682e-02 1.071943725047594109e-01 3.528171887289743153e-02 2.765807975212915097e-03 2.607633610841370801e-03
4.352801173731707385e-02 4.385775834520962146e-02 1.988032344095451605e-03 1.497723075848712664e-02 5.440778211921674934e-03 8.031722574957868288e-02 1.626673472188482419e-02 4.684951201247881253e-02 3.155531705921557628e-02 3.272479829556847707e-03 7.052797132340245072e-03 1.131333252414400969e-01 2.409067672839239060e-01 3.040755203653240368e-01 2.742817278823516114e-01 3.313752488636753091e-01 5.667287746906995993e-01 9.819236590746586169e-01 1.005963167036677097e+00 8.028301237860132611e-01 3.470790890547786889e-02 3.659628435193883200e-02 3.246761034502756299e-02 1.023010878961075898e-01 1.472390547809271366e-01 7.544455244274449468e-01 7.590279634898495775e-01 1.548946546154741644e-01 3.409088782420914739e-03 1.240751291021299774e-01
3.842308352760063356e-02 4.205786678166040238e-02 9.770604287967230017e-02 1.093481794424394221e-01 7.315195766022367097e-02 8.383626568881738517e-02 8.935699141609415239e-03 2.511678056433648554e-02 5.217767624007534077e-02 1.881235016526514384e-02 1.960589330453001156e-02 1.730529658368546581e-02 1.353254089256421822e-01 2.741580026443687368e-01 2.563069434187671414e-01 3.926740377260190540e-01 6.796963142669618652e-01 8.302862009753277928e-01 4.857747430016081669e-01 1.078311185673205552e-01 6.541781873522022062e-02 4.525210199862325644e-01 6.599640564391846542e-01 1.115261238579069891e+00 1.054058016854895863e+00 1.384028489967599196e+00 1.125640276980110377e+00 3.269705727290710406e-01 5.621414327481023994e-03 1.476636226412101072e-01
4.770206394257954507e-02 5.539714281113534977e-02 5.517590573174964430e-02 5.312773552794505805e-02 8.184407233227147804e-02 2.500893940068839305e-03 1.459778471773935105e-01 4.882711160071975254e-01 2.391917230621248835e-01 4.109679575008974572e-02 3.073212297356632886e-02 4.847254491191244075e-02 9.655468318847554299e-02 1.425520799615069001e-01 1.882043419828953457e-01 3.376493703542895464e-01 7.277990608308210208e-01 7.428604863395650293e-01 3.583647536860868899e-01 1.251982407000851449e-01 5.418675802155112908e-01 9.831607555935435450e-01 1.263278632007145186e+00 1.311390949155791352e+00 1.172716387676911332e+00 1.032537483026343850e+00 1.564082801032158798e+00 2.761162819610678554e-01 8.849950319001341492e-03 3.714518242650672545e-03
1.759942208676770108e-03 9.248785262262561313e-02 4.835868083913880122e-02 7.655008572564464542e-02 1.410087910070130859e-02 7.130174008477746517e-02 3.974336503560881306e-01 3.237128666236185337e-01 3.195674588177617181e-01 1.605850920363243728e-01 5.918028465630051360e-02 1.613455787234705299e-02 1.593261867987439198e-02 4.116684886299043500e-02 9.276403554912833471e-02 4.281875313184293486e-01 4.503761624100244276e-01 5.336094068297629889e-01 9.449375501320061987e-02 1.693252715129281438e-01 6.009872737110459884e-01 1.300068331591402115e+00 1.609464934225224741e+00 1.694012962160413860e+00 1.433910941683039564e+00 1.425052902665992383e+00 1.368505841701540549e+00 1.085078678942367647e+00 4.816786167997844093e-02 3.177237932073538607e-02
5.349990606468083693e-02 2.112531749044846939e-03 3.841376767790614585e-03 2.624689534917892808e-02 5.789841597972328335e-02 8.152702257498858907e-02 2.563938243348521939e-01 3.181523757785567064e-01 2.184659427112725649e-01 1.709359125693454828e-01 3.631219482337488813e-02 3.605984939382730035e-03 5.548860527667603265e-03 1.584032216615025371e-02 3.470976760920387733e-02 2.069774008576696356e-01 7.904471359466086477e-02 2.552780807985680078e-02 8.633997654011314749e-03 6.297880203560618506e-02 2.383062776308992881e-01 1.264023694199091441e+00 1.599357756527499230e+00 1.700840455378823224e+00 1.273238128867497654e+00 6.073727643392911046e-01 1.009929755964475540e+00 6.932005596711753315e-01 6.250856762285182666e-02 2.467597329244817020e-02
1.983912599618739211e-02 2.480565705691675088e-02 1.639183462818443598e-02 2.007117704001004990e-02 4.675057888131863709e-02 2.659150400316392937e-02 1.360201638789014789e-01 1.738116077651402636e-01 1.597705787012108081e-01 3.809753400194443307e-02 9.689782416465942544e-03 2.070762626147244160e-03 3.694459164677323625e-03 1.114989527206100908e-02 4.511891152603626776e-02 3.091586618318748272e-02 5.646170653281253060e-02 1.672480378701549086e-02 3.136919148211333302e-02 1.478566445066677171e-01 7.886153497178504113e-01 1.486209693991257463e+00 1.593056089669045994e+00 1.539772139251695648e+00 1.211704727366422318e+00 9.109128564802413397e-01 9.028246316988423059e-01 6.083013026423211844e-01 5.476825533983086663e-02 1.949613082477709425e-02
5.676274682575718072e-02 5.033439093246564605e-02 2.576170374369035967e-02 1.839688556315910439e-02 2.371212006796426242e-02 1.254511188061342881e-02 7.058655771188618311e-02 6.206947614862221713e-02 1.690302557910677156e-02 9.307343459990961160e-03 3.252009681107392858e-03 2.620131388043857399e-03 1.623773636655819440e-03 7.888283223664610544e-02 2.573844208586134955e-03 9.026445142537274646e-03 3.210984044578645002e-02 7.298200573832314131e-02 6.998492139916957788e-02 3.106224833913289740e-01 8.405425654808753588e-01 1.213050247077055444e+00 4.926951260216355655e-01 7.516121136635957045e-01 9.913370379893898798e-01 5.737630784474959666e-01 4.365362176210565992e-01 3.585397162285751671e-01 1.314206989064027088e-02 1.187967679542795835e-02
4.532896259180920623e-02 5.052699751901403025e-02 7.507555732542510983e-03 5.215733086412181405e-03 4.285289316624507280e-03 6.309902806853000257e-03 8.855593301048013052e-03 2.170245349852084268e-03 2.771680359965594115e-03 4.419573938462192930e-02 5.781368991437098315e-02 9.406385847882923774e-04 1.094388121108964178e-03 4.159698662389143403e-03 1.239676585360271685e-02 1.680502017975891715e-01 3.182588421183042415e-01 4.575258656248533118e-01 3.107117893645707229e-01 2.332257193938550022e-01 1.643595111110192908e-01 5.864764521765233884e-02 2.261625507305097330e-02 4.938611661307247547e-02 1.821616189485408266e-01 6.278572609161948981e-02 5.888363335614909405e-02 1.990756179392509997e-02 1.117801092536002960e-01 9.147730264628421704e-02
9.202758170589794839e-02 6.927799447267642130e-02 7.634593823185329212e-03 3.350910380737419370e-03 4.986884951179647654e-03 3.846879392571718285e-03 5.824351423652142194e-03 6.059833232528227809e-02 5.108685696479796368e-02 2.205376427847153056e-02 5.218239806319374674e-02 1.046282923116685030e-03 1.461354803439340877e-03 8.403926022148946670e-03 1.460666579075659520e-02 9.610160246767338044e-02 3.470089652287178250e-01 6.428005832879666315e-01 7.251453179482078015e-01 6.309389812482961712e-01 1.348483966865418326e-01 3.016402900846484533e-02 3.733407481105151249e-02 9.186489179741690048e-02 2.066423072523975168e-01 6.160000767522384735e-02 2.390757654625009360e-02 9.024284110186870517e-03 1.403646482029951015e-01 1.261064647690497698e-01
1.119367364971026735e-01 1.413443125498485553e-02 3.968968900781601888e-03 1.338134988902176014e-03 1.564908181374782652e-03 3.387525552487393246e-03 4.264043408270497618e-03 4.597209544001570891e-02 2.528544746188956388e-02 2.906785181917150018e-02 5.125239378820371089e-02 9.153947303753462873e-04 1.085020965010516283e-03 6.415834627568508912e-03 2.652080667716569251e-02 1.348926055414245706e-01 2.583659827947049070e-01 5.908750732175221954e-01 7.412196262940868863e-01 6.310051147948367856e-01 3.182313817570686654e-01 1.847798412849359362e-02 1.316869253957387090e-02 2.851881551646816282e-02 1.648758641445910444e-01 9.920033568738306773e-02 8.994983128604250311e-02 1.698221062752138660e-02 1.218683356617634161e-01 9.375114223830714744e-02
6.257302473634207551e-02 1.931738331797722141e-02 7.438396199413447457e-03 7.205658233413269817e-03 1.678683473772456941e-02 1.138566064149286461e-02 4.588343090003035342e-03 1.822885591387219143e-03 2.656569781691302517e-03 3.485105830953524365e-03 3.198365122270868666e-02 3.579447241540903435e-02 5.587256125317313638e-02 1.460631011284966663e-03 9.392320658124279908e-03 4.047628940820482968e-02 4.069779972717001842e-02 1.741821007558204959e-01 2.242178899783315027e-01 1.949059272197180559e-01 1.663560937879087487e-01 2.175229039791003183e-02 3.379317395337134728e-03 6.595690384741794386e-03 2.918744395534406816e-02 7.295172677814862339e-02 1.965422771674851243e-01 1.109805288461340467e-01 1.416143911006254863e-01 1.071015365936671543e-01
2.248714929441279764e-02 8.889997383847951865e-03 9.362239020630588882e-03 1.644748827221453880e-02 9.453017367548451066e-03 4.203840729588286841e-03 1.881237760478016510e-03 1.281902136668997862e-03 3.947363419031155868e-03 1.535972304799013491e-02 1.049037495920665270e-03 3.521841876629064338e-02 5.960265642290768495e-02 1.503039791133753194e-03 7.587343147974275059e-03 1.436765117339307632e-02 9.954128398295132574e-03 4.983120884874280357e-03 7.952068190351227472e-03 1.473692996018915666e-02 2.677712222435228023e-02 6.231831689275725214e-03 3.271822455543035336e-03 1.681306926933570645e-02 4.111979695525687373e-02 1.463308231552479764e-02 5.063297084794012026e-02 5.691986794771729252e-02 2.026689510184916457e-02 1.631385380064862278e-01
2.280375287636210099e-02 1.823075591602185339e-02 8.763864684041715314e-03 6.701563371823465905e-03 6.563980043791080646e-03 2.443467257208428983e-03 1.570715425410772670e-03 1.560667188549182951e-03 1.676860053150398865e-03 6.725157568539639683e-03 1.903643634801597141e-03 1.812264122911310966e-03 1.787867957695105786e-03 2.382561168720078327e-03 7.358769825971733097e-03 5.475468852587364252e-03 3.875640427477098932e-03 2.430084073909014649e-03 2.239387173109578990e-03 1.216668041119985111e-01 9.660022768222902012e-02 1.407982009861413475e-01 3.663345394348758652e-03 9.431388857912916673e-03 1.702777899779853860e-02 8.376918450584360312e-03 1.364826502006308805e-02 9.119259674419424172e-03 9.227690602797773700e-03 5.940029043187337703e-03
3.090087067017468353e-02 1.604450656063011876e-02 9.010566177359749518e-03 1.285900679087253855e-02 1.188741100647914065e-02 6.395631398427373271e-03 2.125728176797964455e-02 1.563731217001609886e-02 2.257099199757043630e-03 1.644740228205355224e-03 5.769790204912145920e-02 1.351652819908911226e-03 4.198157865174601336e-03 4.994787928059398092e-03 1.659123633015282054e-02 1.332853275000100632e-02 4.426440105282281393e-03 5.520689867424705480e-03 2.677770845508616136e-03 8.257056506335018475e-02 7.491883149968633915e-02 1.142392336429278177e-01 2.748633997742217731e-03 9.108604476108757633e-03 9.949799087610100221e-03 1.442713366589747082e-01 1.625516171619441064e-01 3.822325877573752931e-03 1.259458712368434138e-02 1.377737474353782077e-01
4.136153714148623622e-02 3.564867156801256043e-02 1.073177492669979277e-02 3.835649954677126938e-02 4.674714338072337438e-02 8.733427607313699881e-02 5.734756946717045611e-02 6.347299887726629009e-03 2.240270667970420231e-03 1.299129313548701104e-03 3.765164384114523533e-02 4.653970451890375448e-02 5.846020061430864945e-02 2.739754380504362888e-03 3.722874665544482521e-03 1.811059918867321487e-03 1.863074034120456180e-03 2.377912300834992155e-03 3.413914785236754623e-03 1.878049391155244170e-03 7.014812123351323037e-02 9.500104989178130566e-02 1.064515259823000798e-01 2.880612047397510672e-03 1.003975139297837854e-02 9.987817156029538124e-02 1.476756467022584951e-01 4.508402912374049470e-03 5.574007469357255933e-03 1.132383627050373605e-02
2.256498009839513763e-02 5.577104909117265585e-02 1.697245386079208884e-02 1.894485790593948560e-02 9.536363984816213779e-02 1.010639617207225172e-01 6.719783568831602660e-02 4.601257030256399039e-03 3.228929930665229084e-03 3.055876517297188930e-03 1.254746491045554638e-03 5.830048457565501635e-02 3.761357127835826542e-02 6.753510376879452715e-02 4.166730579359846989e-03 9.977940041746355404e-02 5.010826720038934201e-03 3.216234919444882490e-02 6.023647432732320145e-02 8.470306760172132202e-03 1.053838339288271087e-01 1.329807934398240798e-01 1.127980440511319182e-01 1.293802798065588622e-01 3.105031070568371743e-03 1.424243882383397497e-01 1.713836878659039664e-01 4.117511333479699498e-03 5.681540627408250901e-03 1.422822582691043655e-02
