3.274174820879971470e-01 4.911751443206033296e-02 3.809656989536501781e-01 3.971688497288809738e-02 3.466843476121201917e-01 5.163029027622498268e-02 4.335875788822584481e-02 1.175437421980809888e-01 2.138069389304286805e-01 9.601995016333889077e-02 5.847734205763273352e-02 2.100599831035743770e-01 1.334665820809082803e-01 3.628234246030147270e-02 4.045948233170099106e-02 1.456489926180465078e-01 2.762502347483356685e-02 3.443274380009162666e-02 3.562402494141992532e-02 4.863550578807582792e-01 4.508544193173362746e-01 6.834677435116796873e-02 5.236784591145438733e-02 2.089921773805471228e-01 4.053733085355745169e-01 3.184462600460674087e-01 1.467727687729536157e-01 1.294160865225758676e-02 1.237377198962778119e-02 1.558430302490047305e-02
2.157981028704661075e-01 5.253582428637124102e-02 6.398075369813066571e-02 5.764508398325816213e-02 3.340305655231543686e-02 1.607286317083746197e-01 7.207095423525815281e-02 9.042966533672447405e-02 5.498752986339316279e-02 4.380921850092976688e-02 3.908852999653250615e-02 1.069926217372982324e-01 1.554070429657337937e-01 3.749251975598973385e-01 4.191646322985295714e-02 3.998476398113785524e-01 2.699423990704068188e-02 6.452012386488727158e-02 5.470394405599794674e-02 2.130370441085823255e-02 2.594207956675607107e-01 6.572903092275682313e-02 1.368219767889861938e-01 1.222081042589499150e-01 1.083267450698966322e-01 1.457731287330189807e-01 5.150163727527064944e-02 1.311471868753703168e-02 1.869042828764494457e-02 1.870809911468914247e-02
1.674716068622499332e-01 1.683445801222978599e-01 3.286449769866343629e-01 2.679972080565609649e-01 6.175996529519677258e-01 9.553508512444118528e-02 1.879863675769101738e-01 1.978295355050429249e-01 2.465649845427674569e-01 6.008989952463241607e-02 1.584815693855057828e-01 1.122701639281564190e-01 4.961481580473902503e-02 8.777439697417920017e-02 2.442389055357500616e-01 7.861214348114663186e-02 4.355407810706243832e-02 6.738277361530957410e-02 1.956966527632785224e-01 4.050489982734124111e-02 1.601963807576771703e-01 5.426927910658812387e-02 8.336455912385161426e-02 2.904262363110599390e-02 1.725801621154038692e-02 1.142613837726125930e-02 1.028772985054291975e-02 8.091132694397632288e-03 1.381525304647865035e-02 1.550102146240326002e-02
7.100120992920626317e-02 2.037530599832823863e-01 4.471125998471610075e-01 3.627853987006131598e-01 1.768430039125240827e-01 3.804091716546150193e-01 3.785679104452270294e-01 2.355271209306560309e-01 1.280570036179519700e-01 7.575215946323464455e-02 4.533358839356151082e-02 8.908912396960325109e-02 5.958775009702900471e-02 6.080340296181910298e-02 1.891431185245618096e-01 1.649754427350913766e-01 3.547704716983627327e-01 2.614828931861419917e-02 1.628930594489634218e-02 1.586495984960639358e-02 2.828565787574041646e-01 1.131630948452855001e-01 3.914581795617495114e-02 7.730752553703998387e-02 1.413684760894705524e-02 1.011580980307062901e-02 8.729088532281515170e-03 8.292026280907921140e-03 1.685420479520816431e-02 1.832706158150503375e-02
4.090398484574862131e-02 1.275181233157137162e-01 3.561423038937391872e-01 1.383258247365354854e-01 1.006762810418165288e-01 2.218934864093380088e-01 3.867269569808132745e-01 2.176954504467809859e-01 8.015819420047118338e-02 1.775539231427778752e-01 2.017304995705895554e-01 1.864335957298836055e-01 4.367121227301223874e-02 4.627100177357708066e-01 2.463040961635998838e-01 9.965746937197100808e-02 6.104992281567400703e-02 2.600173589149645109e-02 3.727024810545080669e-02 2.147883172126647394e-02 1.637243461634100769e-02 1.490556682880739559e-01 3.855718934547830434e-01 1.272457278490466970e-01 2.555659419754427453e-02 1.352817029046503479e-02 9.407102570288540869e-03 1.089591512426813479e-02 1.706934833867758405e-02 6.285316208329093379e-02
5.330221480580465965e-02 5.681046804030878694e-02 2.233368302297200070e-01 1.635316230278208161e-01 7.353739871464523570e-02 1.248238590097559275e-01 1.589481157359518559e-01 1.690442331864748238e-01 1.368837252988293340e-01 2.631791504502055123e-01 2.143051529010345513e-01 1.342380025468979388e-01 2.082333650485528598e-01 7.891312953383786133e-02 6.689683438125366977e-02 1.137376771659087682e-01 4.017889436905068556e-02 1.516974309807439802e-01 2.081867742200481028e-02 6.172281064650086968e-02 8.327810828098425322e-02 7.434791195124733354e-02 4.756500050979470817e-01 7.432189642960390641e-02 3.816806509349182641e-02 3.539426933097924999e-02 2.203814610629620252e-02 1.522986903654741098e-02 2.014478496948362771e-02 3.628583317138738690e-02
1.209798231806984842e-01 1.841499610169360923e-01 1.807424917691366761e-01 6.250539595861867581e-02 2.502073707270156128e-02 4.815058436617567633e-02 8.366988736897693069e-02 4.695195424362914871e-02 5.705870786652866844e-02 6.295124776993991922e-02 6.241640979064523587e-02 2.521675715473187807e-01 1.175386376780229170e-01 5.506971865690623441e-02 3.239737013774444951e-02 5.650568402988311728e-02 3.205751880417431199e-01 1.438333283247384686e-01 3.385327576696675611e-02 4.695107849843490472e-02 2.659589079293951316e-02 1.491654695782229922e-01 7.020331921466380076e-02 6.719554274272665495e-02 2.586499890428713491e-02 2.634829240631060554e-02 2.309051428885828400e-02 1.999508848100033098e-02 2.296498301330967065e-02 5.466975428561121619e-02
2.490869957286302450e-01 4.660390972857835767e-01 2.578356375971955217e-01 4.143026766856283682e-02 5.017992545751195216e-02 5.648680962653856996e-02 5.007739048753573341e-02 4.182635682582652725e-02 4.041926008901272627e-02 3.376294209822532366e-01 1.443053570698486776e-01 4.559884829305124176e-01 9.922429494717240062e-02 3.564368299257630879e-02 4.065177114326671420e-02 7.577934537349292898e-02 3.968838028810214857e-02 5.339683727032687455e-02 4.100575342886337432e-02 3.284621943899932589e-02 2.076461074873159895e-01 1.223408808046069496e-01 4.951106542237629360e-02 4.144434870667200455e-02 1.968591803028570467e-02 2.046507806419051514e-02 3.165307247162414683e-02 3.580862413289968849e-02 3.558386010868010846e-02 1.033956379988695412e-01
8.505064484385191359e-02 3.747864153320094593e-01 2.181630643175876960e-01 9.918679311499764562e-02 5.773686165329178221e-02 3.250033685848844889e-01 9.589421506840455078e-02 4.143816347150440504e-02 4.117339943884874842e-02 4.581010869039682520e-02 4.453089775162581421e-01 5.657771571553921186e-02 9.509628528955402227e-02 5.106634712223319383e-02 1.296555741465623968e-01 1.096518510928759377e-01 2.676753294580588166e-02 7.262514701454425570e-02 7.845844244008315371e-02 2.751368967027902901e-01 5.481921349555382572e-02 5.718257222799119632e-02 6.226668379822865307e-02 4.070092633999904119e-02 2.380384075476142669e-02 3.566883707693134509e-02 1.324880816401317329e-01 2.351067950138889251e-01 3.887125509205107549e-02 3.179489776915257471e-01
8.338313284036838469e-02 5.836532977342466511e-02 9.219793475808410466e-02 5.994278331496320777e-02 5.913924816421713138e-02 1.525902642182012381e-01 8.099126311657962873e-02 3.375299249371927490e-01 1.583289327025056148e-01 5.791567977254774569e-02 6.027991165160475479e-02 5.323785415929917220e-02 8.471827848781481041e-02 9.703406191202371134e-02 4.771082246335607568e-02 5.219647801311155799e-02 2.661544032524196246e-01 2.693511875836572256e-01 1.235808017084434607e-01 6.691007534780210597e-02 6.986175437375027886e-02 4.419936521325987244e-02 5.076294006075295073e-02 5.578651250576363574e-02 3.113363638601728337e-02 3.926608759752612393e-02 3.572209983441714254e-01 5.411756990080437424e-01 4.042754671147178597e-02 1.676195601483993214e-01
7.349496922200769722e-02 3.614972731524269678e-01 6.740166870053873605e-02 4.537549570459263604e-02 7.681408459388824883e-02 9.438632587153612807e-02 9.266095506305448148e-02 8.439119417509372001e-02 5.806556867151350942e-02 4.618393044753962284e-01 3.621475375778517858e-01 5.479681523948677357e-01 1.133950361699739284e+00 5.581744399506360921e-01 1.026637854854829529e-01 2.023302925979275080e-01 3.785978072325223431e-01 1.048478619778357435e-01 2.991482789159820993e-02 1.133291215736940000e-01 4.780711788404168328e-02 4.276884241341862708e-02 5.531508908625416832e-02 7.746620789719139977e-02 8.281273914830233895e-02 4.472540443425941648e-02 6.950620308669747116e-02 5.168866202711585450e-02 4.590608185902137622e-02 3.285487253526382656e-02
1.610286565059814989e-01 8.808054576222852650e-02 8.173725403916067000e-02 7.676095022471740581e-02 6.499793501976884602e-02 1.522550222701792577e-01 7.130057324211958036e-02 4.939413858554002335e-02 5.911919740542441459e-02 5.497761496145282117e-02 1.111278895959954133e-01 6.694592100062636275e-01 1.185705589352277656e+00 6.092066787397749650e-01 2.174849585634359983e-01 2.441356483860125381e-01 2.697356262928797266e-01 1.588186307417968068e-01 4.739745589332022835e-02 2.568867439419328380e-01 4.548841057750463435e-02 4.642071013153691722e-02 5.497753057574550350e-02 9.845350051380022394e-02 9.362090697104014092e-02 6.669082159794140208e-02 5.118432246380197337e-02 4.653572326093149969e-02 5.098577086122221130e-02 5.558217157853417856e-02
3.820856910155485953e-02 9.177332115244785093e-02 2.055971490738665586e-01 9.892090412741399996e-02 3.720067857076552187e-01 1.278091379051128074e-01 7.110235798473174551e-02 6.203227515904889688e-02 7.961242524195483172e-02 2.642795504295551018e-02 1.546959801192655526e-01 2.190379157566345047e-01 8.878134823708996315e-01 3.756520153223463776e-01 1.164973390397930075e-01 1.332619693044306275e-01 4.909425299226280459e-02 7.193111630076733098e-02 9.295184221756243315e-02 3.787937584375060396e-02 4.338481826117976392e-02 4.768734278046530412e-02 6.050670739128564263e-02 1.007417329244263415e-01 1.278640626548444015e-01 1.119185237100572550e-01 8.267219153638019624e-02 7.815589350368874755e-02 6.926355447056969927e-02 5.819499129389909403e-02
3.310500327811542742e-02 9.345302533189578376e-02 1.637911814689724799e-01 1.175608042411178944e-01 6.974304004425133097e-02 2.710433990444257590e-01 7.824297705448238216e-02 4.134713197515150346e-02 1.095012662466830766e-01 3.632345716821361314e-02 1.310371436248338461e-01 3.856308515252145075e-02 4.078887610204701142e-01 5.413634128869206918e-01 5.664725175208200625e-01 7.512361663480366936e-01 6.739343659480934168e-01 4.375089594365613177e-01 1.195260548676301271e+00 5.590722828916210307e-01 5.759879656362536238e-02 2.826464952596436375e-01 2.133072280692158151e-01 5.092822822262141891e-01 8.661458962899101777e-02 6.567808694018881233e-02 1.701337265926779474e-01 6.449508536187338603e-02 9.408441080171102422e-02 1.104931616540757722e-01
3.123847832316035272e-02 3.117251418968913085e-02 8.434812151314820261e-02 6.293981220611510885e-01 2.295481027940530494e-01 5.100197523378349057e-02 4.350257253358927323e-02 7.718410171695300193e-02 5.439354181509854780e-02 1.382078926487886050e-01 2.875121491571825394e-01 1.892542170464394102e-01 3.642528127649565239e-01 4.555339206093060866e-01 4.054398553870047772e-01 4.829232746603283610e-01 8.212495906245191879e-01 1.417519413436227449e+00 1.440614431669532625e+00 1.129276161566795889e+00 5.624548916818170735e-02 6.511770637288093189e-02 6.442568498609954619e-02 1.786486616739336175e-01 2.355633164620188347e-01 1.063904811513745718e+00 1.067410333430659941e+00 2.354109748554267523e-01 9.695660312088170973e-02 7.523380677232548164e-02
2.888909894128599554e-02 3.128457047107723044e-02 6.963684280501314383e-02 7.695170071372778309e-02 5.151390435574430826e-02 5.383636995502490835e-02 2.981920665726206510e-01 3.925367779659487411e-02 8.290749870389516052e-02 3.235248410386172557e-02 3.390279299730265816e-02 2.837377427772992330e-02 2.056246227741557187e-01 4.121541584179098106e-01 3.805487981727079250e-01 5.779217599715781306e-01 9.968768449437759305e-01 1.207337735975035464e+00 6.948002175708174466e-01 1.510408575086490401e-01 9.125214855070724884e-02 6.315523304743917432e-01 9.296829267545896336e-01 1.566251796982284894e+00 1.482152314345622113e+00 1.950933039467104724e+00 1.573054652909719797e+00 4.734946409264823020e-01 1.414874739948353000e-01 8.369786036996111622e-02
3.719488421516072008e-02 4.265903900125108533e-02 4.125806930044721016e-02 3.844682250199292495e-02 5.516967005854666456e-02 9.304129903016239433e-02 2.348678764792262452e-01 7.603785105677958178e-01 3.616848411255040308e-01 6.225884023754213459e-02 4.652728469404221467e-02 7.348911327329514520e-02 1.460968088221993588e-01 2.145296822440543594e-01 2.824774106525617667e-01 5.054129264321657322e-01 1.083324024491547188e+00 1.082492011902944640e+00 5.088120567797286276e-01 1.742162414845990492e-01 7.589647045703146189e-01 1.391950621236117680e+00 1.804809411689886733e+00 1.860476460213153160e+00 1.650048198933369958e+00 1.442829533626659888e+00 2.160854015720244714e+00 3.871364474793691501e-01 1.862652209670664638e-01 1.008663283810486005e-01
9.311546227432521139e-02 7.269000382104581770e-02 3.519171941045390328e-02 4.892751343289269972e-02 2.717467083080559592e-02 1.137262885096116394e-01 6.118502589916623435e-01 4.967410735932546451e-01 4.884051948820047895e-01 2.446948200988145472e-01 9.470537713683016556e-02 2.887547343979715228e-02 2.833006538348532138e-02 6.865664059284001808e-02 1.399464131346250251e-01 6.450680501967269720e-01 6.715182823424086234e-01 7.870647071318228605e-01 1.358398042107924752e-01 2.390128988099501361e-01 8.426693447156057282e-01 1.843367637331258635e+00 2.295907257096229781e+00 2.388113404499348391e+00 1.986118226115838770e+00 1.950854392056332376e+00 1.850958380648942470e+00 1.471469941111974045e+00 9.241252127580104614e-02 6.555347791818685876e-02
3.696825554487078586e-02 1.009911104402652221e-01 1.754728042614355221e-01 4.780276455570127425e-02 9.032686430980879644e-02 1.248671312880709761e-01 3.936331171201543633e-01 4.920121395336866654e-01 3.367616912158173936e-01 2.622256461015544104e-01 6.225592513230375491e-02 1.880118196694026689e-01 2.843900175310499212e-01 3.092557580152407309e-02 5.168406655123973514e-02 3.055760618057403177e-01 1.151270810445648857e-01 3.698338994315242961e-02 2.174295670120908741e-01 8.848271018954925737e-02 3.332540354860297205e-01 1.786095893956638925e+00 2.271972044412143621e+00 2.386236704293860811e+00 1.755481781973096567e+00 8.263085031741073117e-01 1.363157848887553980e+00 9.267246769997141698e-01 1.391021746413074467e-01 5.718817332030504685e-01
3.293098873352925948e-02 4.585099799279005600e-02 2.968458125130649106e-02 3.368726593684605308e-02 7.133795235336948259e-02 4.088780054803042852e-02 2.095472785645691449e-01 2.698534342524449015e-01 2.473732388127257709e-01 6.368894191722788978e-02 2.157895234206264057e-02 1.302093409902151389e-01 2.233497167907416703e-01 2.561024811938953857e-02 7.169416608738066188e-02 4.699819861662863502e-02 8.263948463362540131e-02 2.387590606518094627e-02 4.418643154736917600e-02 2.078366054277263342e-01 1.103065369262502982e+00 2.088286115480639360e+00 2.240266127049217904e+00 2.136651187502507376e+00 1.655593079996003691e+00 1.227572927877593312e+00 1.204246769040453247e+00 8.367605252689991335e-01 1.537278954325458913e-01 4.588520580889600686e-01
8.102793236482160044e-02 7.972806850362895714e-02 4.605484469168547035e-02 3.683359930205536148e-02 4.526063164248154969e-02 2.130823328197242045e-02 1.107212636948802509e-01 1.031393651037525450e-01 2.864305689758886442e-02 1.760261569119872180e-02 2.231207014670697764e-01 1.976344522584329577e-01 1.105231577250690572e-01 5.165787222728272787e-02 1.115861788893430379e-01 3.310627684649307678e-01 4.706575113658065246e-02 1.025161081526326790e-01 9.721628775232461772e-02 4.300126964236105631e-01 1.168486675220328674e+00 1.679138577081332739e+00 6.775331586001338557e-01 1.021906816625951731e+00 1.333241272128557142e+00 7.633059146336131917e-01 6.112301024258814941e-01 5.308117591690223458e-01 2.592829433718828458e-01 2.818901316044901129e-01
6.606574873585718821e-02 9.033067084097856636e-02 3.578798529606030954e-01 3.083988796559179457e-01 2.854713479628313566e-01 1.440033340801866353e-02 1.583429530492044823e-02 1.444723290003808724e-01 2.044028540611999567e-01 3.532050953315778868e-02 5.203144469587998866e-02 8.335063789144327162e-02 8.032867758973839811e-02 2.533912299429099679e-01 3.009684198700573673e-02 2.542877806721383083e-01 4.695695221043835188e-01 6.507496049124139592e-01 4.379243577618581185e-01 3.248623772252036135e-01 2.272681808612463938e-01 8.017747332203108146e-02 3.075766876219066664e-02 6.713648526577624398e-02 2.452748753557573436e-01 9.631507920177240223e-02 1.057231118030291794e-01 3.742255173453084560e-01 4.838396713885516343e-02 4.515623406459241818e-02
1.389573481917252551e-01 1.347444110208877444e-01 4.053210489453268339e-01 2.397083043348312015e-01 3.994817629689031424e-01 3.021483282739263476e-01 1.265137764072434695e-02 5.200524567675653825e-02 4.885397182202110694e-02 2.117900375669258192e-02 5.250903882518528909e-02 9.705398050927621645e-02 1.061674549337798951e-01 4.931609227961900044e-01 3.902554995011581207e-02 1.407650743738131927e-01 5.088220585373433025e-01 9.354431826211957457e-01 1.044623558129737395e+00 8.924314872473878557e-01 1.985306658323187090e-01 5.087403944100921116e-02 6.240915612784977973e-02 1.432585102107367947e-01 2.836173519028046819e-01 9.679139735004783918e-02 4.279712352273956077e-01 1.751555431365330040e-01 6.550030602514239630e-02 6.286141979288752124e-02
1.732544100473330517e-01 2.874196464899641396e-02 2.281864309735688046e-01 9.952296393614668002e-02 1.275804690190475432e-01 2.817141540836078928e-01 3.730538824374715068e-01 4.285111839420249064e-02 2.416226438153053213e-02 2.757426519901616524e-02 5.011594133763977443e-02 8.556690730426155800e-02 7.990226520717635950e-02 3.845920372035630530e-01 7.218876160653134311e-02 2.214419756538969219e-01 3.809427594954895024e-01 8.665159509140153427e-01 1.079870483155922489e+00 9.061856588561704173e-01 4.762442099431414277e-01 4.688171559723906534e-01 3.181493664280192757e-01 5.297981126072683761e-02 2.510105543795591032e-01 1.617235639538990577e-01 1.731197712653597121e-01 2.988063588990996777e-01 5.226805090527328335e-02 4.723446152256310926e-02
9.535567514352408236e-02 3.558466872680789844e-02 4.796571679541653532e-01 5.210668124519350908e-01 3.506721537235026748e-02 2.475365027151276570e-02 4.007359443542127808e-01 1.694560381405897653e-01 2.466956307381529545e-01 3.149626332807977103e-01 2.950472146244448313e-02 3.544023863710842048e-02 4.684942545319649432e-02 9.150566723024383675e-02 4.623432871151373913e-01 9.370665855045562376e-02 6.942508311867864879e-02 3.003953012166993841e-01 3.703831182231741570e-01 3.085823725214556501e-01 2.908553913844179606e-01 5.480528717850526033e-02 9.386432828323025557e-02 1.526146434889764369e-01 9.287593533346651109e-02 1.355813629967169698e-01 3.720321819450029821e-01 2.934144357814255089e-01 6.076465824258629744e-02 5.306283131375352791e-02
3.408136473954380408e-02 1.548154696971095964e-02 2.001374891957616309e-02 3.779276435982599491e-02 2.014087061347002300e-02 3.359261365132238941e-01 1.624518845625347319e-01 1.181831975993144906e-01 3.687948121468731522e-01 3.610537666443870003e-02 9.689780940148931543e-02 3.587761759870750078e-02 5.334946374995939294e-02 9.878491420996460270e-02 4.111619740137334444e-01 5.552539943020924629e-02 4.286934434896878532e-01 1.996838531291280083e-01 2.897547827577050539e-01 4.876045161591714971e-01 6.834139352515246346e-02 1.987189216966734895e-01 1.023734648077340159e-01 4.751850085375398658e-01 2.939627724107357620e-01 3.347797234205540651e-01 1.975898178498557700e-01 2.949926731969881866e-01 4.953574041685963603e-01 8.444214667833420396e-02
3.454001681902064969e-02 2.767838801602258425e-02 1.464889965248744250e-02 4.765430580187690612e-01 5.017876890755512687e-01 1.980964228646472647e-01 1.337281241317803127e-01 1.390931247349475597e-01 1.545048908280654554e-01 6.119277025163568640e-01 1.794188817089366894e-01 1.795718085074283765e-01 1.450106201904336478e-01 1.479584929692162876e-01 3.745366869537365417e-01 2.547108830023565029e-01 1.791014944565554323e-01 1.120020510817283099e-01 9.758790475462368608e-02 7.316615544968387008e-02 5.859689958489226053e-02 8.553603422760966413e-02 1.305888681181293920e-01 3.046718588503778413e-01 5.201984695758901101e-01 2.344102027141277134e-01 3.598288847091584142e-01 2.500407183924081012e-01 2.587785040538285175e-01 1.709045349400490910e-01
4.693047116934933455e-02 2.441580323326287411e-02 1.505162333744297296e-02 2.271101632004484533e-02 2.157336069958572938e-02 4.889162815695498598e-01 3.566326371985039517e-02 2.773588511456072381e-02 2.127366758876329811e-01 1.540735376934771750e-01 5.774530452770047784e-02 1.339477549146692870e-01 3.377846013311427975e-01 3.110962953596602132e-01 8.484684593789823537e-02 6.457150169457781530e-02 2.030257603370873576e-01 2.420964722831398241e-01 1.102692769109695492e-01 4.892540297262112925e-02 4.753361912074196421e-02 7.419080407171883829e-02 1.125514430687698519e-01 3.430670381649251199e-01 3.461594490700952709e-01 8.190342311182484403e-02 9.115864504023930837e-02 1.176299990408481988e-01 3.840120708448533371e-01 7.866739447465385948e-02
6.315981437189960301e-02 5.455133479023210191e-02 1.660908345401012481e-02 5.753497418399296237e-02 7.007659880602448710e-02 1.318116028003249729e-01 9.244801735645215290e-02 5.390174267502053640e-01 2.116643776099615404e-01 1.227116999656980706e-01 3.722882665817105891e-02 4.761955357019542756e-02 5.121258781908435281e-02 1.760925024271507155e-01 2.027192509283564648e-01 8.599843913515242688e-02 7.138149356501974352e-02 7.756326098510604727e-02 1.051919672457092558e-01 6.099159443777315420e-02 4.325563768903319117e-02 6.438977891515765273e-02 7.322812618774825200e-02 1.221448419108560335e-01 3.806067149313492326e-01 6.002355318995184624e-02 8.734716160835256926e-02 1.434318573396482777e-01 1.735306918846209467e-01 3.448896201108732074e-01
3.456850377632917498e-02 8.575516618614500985e-02 2.584379994670270297e-02 2.806848419617272161e-02 1.386863018938647996e-01 1.472072779103230644e-01 1.035579856366760226e-01 3.801193289351834093e-01 2.925080867681751351e-01 2.724577573534625041e-01 1.115730987299106552e-01 5.612384138599389727e-02 3.369406775295767653e-02 5.293085345024683974e-02 2.420541239918521659e-01 6.359372306073468595e-02 1.714536547273051437e-01 8.188105734905813671e-02 1.552220512324399837e-01 2.344860049681223024e-01 6.048219289826700651e-02 8.461991682206666809e-02 7.365490492045490001e-02 8.092722898910229001e-02 1.073436461681686049e-01 8.234496464710554242e-02 9.719653177382198139e-02 1.199612164750615551e-01 1.619358722078668711e-01 3.977668684866583204e-01
