1.010353769929124047e-02 1.480191366091450703e-02 1.293691400888368967e-02 1.640979975079361747e-02 1.243135466709868221e-02 2.719913027690129895e-02 2.674969852509371387e-02 7.183444905518919510e-02 1.299750602532663835e-01 5.884191707772723490e-02 2.766507130666618491e-02 6.360495175230085514e-03 3.729503400431397140e-03 1.376749603567932120e-02 1.591839695323211262e-02 3.481928556853008169e-03 1.209802381267856969e-02 2.075486994560539478e-02 1.844812313801564435e-02 6.381759675913090124e-03 5.106722429560006660e-03 7.360449835489825355e-04 5.660122243451917983e-04 2.183566141411495860e-03 4.027576907761316362e-03 2.997075521084517202e-03 1.311769803455635312e-03 1.131749717132666654e-04 1.043968262983304665e-04 1.260738956073978250e-04
7.892339710489536947e-03 1.723890870621137134e-02 3.113657353799920841e-02 2.531459047990097105e-02 1.762894034651453848e-02 7.886224156998777879e-02 3.739841400696515550e-02 4.625421417601620344e-02 2.996316120892067100e-02 2.562183032923220916e-02 1.845660564505643281e-02 3.640098281590808862e-03 4.845339622314382907e-03 1.102229711304714491e-02 1.527386941499869755e-02 9.800159868516624198e-03 1.192956976452731743e-02 3.810993922999793282e-02 2.815076411906391324e-02 8.314189345223686051e-03 2.936595274608288543e-03 6.501369764663502120e-04 1.341527566295998937e-03 1.141522039726661046e-03 9.482597854634595893e-04 1.193590540586139236e-03 3.977916950439778707e-04 1.037871503785241277e-04 1.482654145653192115e-04 1.483777152664847595e-04
9.570045938634746951e-02 9.502357586547842405e-02 2.012148440342922950e-01 1.623388482562157786e-01 3.472431238430496725e-01 3.538047649794432564e-02 6.607412667113357618e-03 6.986585015176937849e-03 1.117434179393743676e-01 3.415229185258562838e-02 9.262747283808125953e-02 6.192049658914383636e-02 2.279730795527644058e-02 3.339248099879102427e-02 6.352207155426054311e-03 2.668947209587557018e-02 1.756103796211995471e-02 3.507817288942144396e-02 1.138976355195839285e-01 1.852853186247843675e-02 1.746349857737345898e-03 4.964042929175529377e-04 7.384608968518131117e-04 2.465248895840891990e-04 1.380688569430833681e-04 8.566621933952224218e-05 7.115962025104808730e-05 5.876630120185216905e-05 1.035119040973195574e-04 1.209797684751922486e-04
4.419284341727655607e-02 1.228181945727718632e-01 2.699507730033686714e-01 2.163533883248122125e-01 8.971702142964943505e-02 1.389852818205077403e-02 1.108119758163053636e-02 7.354670855521921319e-03 4.477626353276578305e-03 4.198909872839128032e-02 2.709739536556578926e-02 5.431422382339468752e-02 2.463306838535273338e-02 1.645146416985042437e-02 4.801118068680170110e-03 3.628286919444263445e-03 7.434441831859067706e-03 1.356200842527269246e-02 9.440301099070718543e-03 7.896401245050298570e-03 3.527875877156846050e-03 1.174499050360067100e-03 3.546830109611529436e-04 6.481855328404507056e-04 1.128199747073210996e-04 7.731819813352912220e-05 6.141637032316369120e-05 6.135138547348542300e-05 1.286089107395896455e-04 1.483582838021559210e-04
2.548535210729410000e-02 7.656517074325189243e-02 2.131956693942552716e-01 8.257240013983684068e-02 4.771126655187334087e-02 6.973753042767422486e-03 1.071396031474327812e-02 5.967655834038567905e-03 2.745937145466705899e-03 9.629756237982993461e-02 1.206650789201110519e-01 1.039584837347739821e-01 1.536360595333214479e-02 1.264829800403814708e-02 5.836470338944925798e-03 2.120167510666271481e-03 2.238486335906847424e-02 1.263391986384297672e-02 2.008270211094203422e-02 1.129550362356619708e-02 7.636115658615010363e-03 2.070932694983578654e-03 4.397808000111581329e-03 1.133106420614493366e-03 2.110932254436325187e-04 1.068468276430932604e-04 6.874169202206360666e-05 8.466512324409471548e-05 1.379908260240814361e-04 5.442907056938951467e-04
2.536735406635109297e-02 2.579060235568100823e-02 1.154053918210496410e-01 9.224276902870313932e-02 3.667185327167935688e-02 3.941812900541227793e-03 4.830180798817551059e-03 5.203058673292485121e-03 4.877281289407556751e-03 1.483119642605978949e-01 1.164661983258580835e-01 6.194274464178559092e-02 7.046152066875789599e-03 2.085064942873070173e-03 1.537493926168327380e-03 2.422550613839159935e-03 1.250826103297836452e-02 3.227471327450626929e-03 1.040175242030585631e-02 3.537923265861420141e-02 4.220045754940233984e-02 2.438686716795947229e-02 5.861156521663330767e-03 7.084457381270512725e-04 3.275064619322744187e-04 2.891984361474618471e-04 1.666047392011176268e-04 1.234194798761558396e-04 1.706675594251482386e-04 3.331701078859921695e-04
3.506845997047536301e-03 5.421080354640466295e-03 5.719308257985973934e-03 2.894008477654544387e-02 1.385084942324043764e-02 2.310370042655739836e-02 3.535648260443047253e-02 2.033844821441503289e-02 2.431668993074889706e-02 2.848260013823899692e-02 2.202617970348294887e-02 9.139310467535743943e-03 3.739009490878943132e-03 1.412695575814804962e-03 7.154316488139801774e-04 1.217690767616475813e-03 7.112944280244079195e-03 3.359250099420302976e-03 1.712439048531703284e-02 2.322815708199374440e-02 1.045693190488317104e-02 2.422628284838135738e-03 9.069089742135437102e-04 6.651771057863274834e-04 2.314403686575248835e-04 2.221467916682051636e-04 1.794286044330790041e-04 1.690426787943691820e-04 2.077529608794582885e-04 5.393534439747069446e-04
7.626669229095100512e-03 1.378522067045631627e-02 8.024528677615955924e-03 1.722581999075208786e-02 2.624676800380380814e-02 2.953905302480902204e-02 2.637614304774612423e-02 2.505905931358053118e-02 2.027974826319875468e-02 1.143994006961662410e-02 4.628811040552498896e-03 1.437821167077586032e-02 3.049058478748995632e-03 9.904678677543474110e-04 9.868843074354980045e-04 1.768938847865752281e-03 1.454764385977878015e-02 2.322493623545726985e-02 2.038455539440015354e-02 1.441603818856244251e-02 3.840441280283558509e-03 1.740225142243713094e-03 5.588947562052906529e-04 4.129928001986692002e-04 1.845874762857071898e-04 1.830449971357716210e-04 2.660462583229768131e-04 3.603997340329505956e-04 3.864851620238376486e-04 1.225944906608725455e-03
2.028561915494268841e-02 1.319303086533303929e-02 7.688580779199847420e-03 4.426354407235894017e-02 2.851650909087035529e-02 1.206138467338748604e-02 3.913843229934668017e-02 1.764031304363779251e-02 1.488552350817721678e-02 1.475954442453843163e-02 1.321773467044480219e-02 1.748954517150022245e-02 3.807379370339569746e-02 2.463441697784980733e-02 3.623939776271067892e-03 3.264762699343360178e-03 1.410477989931158485e-02 4.267886189363954974e-02 4.202292707030545749e-02 6.982282661685951936e-03 1.068834090910096351e-03 7.913975498512707419e-04 7.102792734194280158e-04 4.171644493675465701e-04 2.317912219827045336e-04 3.399035703408957287e-04 1.216439991365798629e-03 2.622733810758857108e-03 8.088973049499277243e-03 4.265887401986684715e-03
3.395366023053127125e-02 2.201700240371839284e-02 3.500083185859829971e-02 3.235964989788646384e-02 2.812529168246286071e-02 5.540802386491093523e-03 2.584572824809169139e-02 1.101441151398196115e-02 4.621992064642698426e-03 1.735102400524556315e-03 2.541854674774349579e-02 2.473034867019972133e-02 5.224882091608992751e-02 5.637735541751813517e-02 2.681233354757033005e-02 2.912997684689458411e-02 1.549777271156103642e-01 1.598758061933913677e-01 6.408296122367641845e-02 2.842997547271415570e-02 1.354586934040849077e-03 6.145991248075798139e-04 5.963366505760759120e-04 6.033488577119384445e-04 3.193577078604722085e-04 3.955887332553472769e-04 3.582589013005514807e-03 6.540171820199539368e-03 8.630858930108620264e-03 2.393171556798337398e-03
2.849042033878626534e-02 1.482609421941168820e-02 3.292325294060529511e-02 2.776197099299913471e-02 3.494408605346369795e-02 3.200278603895037252e-03 2.689591021652961399e-03 2.327401990857127893e-03 1.442749806451055355e-03 1.296519739024009320e-02 2.028034773539208191e-01 3.364373132930591481e-01 6.935179153829553744e-01 3.422668336691708779e-01 6.320757774300833631e-02 1.229339452393090198e-01 2.267376682428370593e-01 6.248236706345028368e-02 1.489951906359933409e-02 2.961489490909300498e-03 9.734652269509792410e-04 6.479437255668453206e-04 7.306094791784009624e-04 9.671044443454969095e-04 9.952304219831040015e-04 5.208603848844033709e-04 7.965695373896646784e-04 6.661196275751746177e-04 6.195895911558994395e-04 4.593018753136482359e-04
5.278986450183923394e-03 3.094516402712317333e-03 2.709449624572252482e-02 2.631993879864717029e-02 2.031968527455558365e-02 4.632465234653577492e-03 1.782326143160167624e-03 1.124987826633426892e-03 1.362100947308543227e-03 2.552311706182871023e-02 6.164930642174160091e-02 3.998987182890229586e-01 7.143120614249457434e-01 3.708617986683713230e-01 1.344341854981906115e-01 1.511265729355759369e-01 1.659862050290494828e-01 9.778280850230072763e-02 2.406691626532216077e-02 6.761413711684120462e-03 9.720570135426963906e-04 8.349955652345225415e-04 9.101915944506281265e-04 1.585485151314229351e-03 1.491159390723139321e-03 1.038368948192155234e-03 7.758361707318586807e-04 7.055552553034024049e-04 7.535903971921551966e-04 8.029628735722626511e-04
1.005322533995845488e-03 2.588840514786535252e-03 6.304613931884707999e-03 1.773480630839797262e-02 1.146791178315499475e-02 3.579013193265990263e-03 1.790392565794894468e-03 1.454074246771995278e-03 1.775005987935460942e-03 1.284806823390271732e-02 4.266089863087814578e-03 1.284303443977885539e-01 5.360416432425851863e-01 2.285943414378650562e-01 7.187869589193135456e-02 8.288802797300777458e-02 3.049112927159220582e-02 4.461309879025945890e-02 5.071826046877317418e-02 1.894458421395219666e-02 1.251667108188413667e-03 1.100190369887159986e-03 1.295361168485791156e-03 2.206749022144439097e-03 2.884859863319541324e-03 2.689712196778955029e-03 1.964714709062485160e-03 1.741632456716367319e-03 1.285154521301519253e-03 9.544460786069797198e-04
7.847013361219272280e-04 2.255194411085366564e-03 4.150517621780017499e-03 3.023307928556547008e-03 1.771940088500251675e-03 6.851264654062397264e-03 2.308887541801182136e-02 1.946809467256318399e-02 2.477361275977857293e-03 7.743631627052586890e-04 3.142383803975757825e-03 2.093283857545615023e-02 2.449701469833694689e-01 3.295093774345398407e-01 3.508507349002409903e-01 4.721889899452328954e-01 4.231474538984846268e-01 2.728571671274600541e-01 7.409961412002600278e-01 3.451131436002609632e-01 2.855780261326350267e-02 8.254168214575557938e-03 6.140509661633497714e-03 1.545292040676414860e-02 3.587841003897920128e-02 3.349479716707688681e-02 9.142161426824740866e-02 2.935985664943446122e-02 2.231523759391508023e-03 2.022607131383163080e-03
6.878347046397242969e-04 6.885201988446922050e-04 1.917288607987923960e-03 1.434183786551763290e-02 5.161714554236897234e-03 1.194173786244272359e-03 1.541122156929939160e-02 4.441801225584526835e-02 2.992972088929536645e-02 3.091178635024610134e-03 6.601026250605297220e-03 1.038508085233914580e-01 2.185518075405341598e-01 2.756962295901720372e-01 2.482771582197406124e-01 2.992241979279151032e-01 5.078681064788108657e-01 8.729838611214091326e-01 8.874989238896358046e-01 7.032950702331175474e-01 3.021982058868176099e-02 3.166562456557552030e-02 2.791272420119041836e-02 8.762732728658743919e-02 1.258007169196978525e-01 6.429126815367737224e-01 6.436415488672566632e-01 1.283584648605007872e-01 2.746672375771939088e-03 1.556706335585925300e-03
5.846862816013268438e-04 6.324308891426159941e-04 1.465810136835741205e-03 1.622100113675256292e-03 1.065289522129298210e-03 1.203494130012089684e-03 8.458027698532372476e-03 2.376948128450790190e-02 4.935177014340277890e-02 1.772997600048046435e-02 1.832260374720923873e-02 1.587291112403039356e-02 1.227788845634930626e-01 2.487388677651361790e-01 2.324996760751112945e-01 3.560664832088543119e-01 6.112225026532803751e-01 7.397662235423838606e-01 4.287852726323109209e-01 9.435082177729969821e-02 5.682776661413817959e-02 3.902194464014095976e-01 5.648308803122392696e-01 9.503937971466918100e-01 8.944873984955288293e-01 1.167918087617239031e+00 9.420508387859400923e-01 2.685800125141881156e-01 4.515550140916477391e-03 1.969747480811711183e-03
6.854596343596322311e-04 7.845066799743978872e-04 7.864142551417836052e-04 7.512475238943270347e-04 1.136431501821484787e-03 2.367716532808431234e-03 1.380786955376825664e-01 4.613101610272538622e-01 2.256705160587987868e-01 3.864846613030520350e-02 2.867789652312921836e-02 4.442223606947237613e-02 8.759386838169884448e-02 1.294200713920252988e-01 1.710111467156974485e-01 3.069570609279920204e-01 6.562333248027045762e-01 6.630911398896588427e-01 3.164811268010192524e-01 1.094250356329102281e-01 4.696435625569595484e-01 8.449770316109599388e-01 1.076557887050615614e+00 1.111781821351334631e+00 9.870854071941639329e-01 8.595922052548324865e-01 1.281765607464664392e+00 2.236449653237561896e-01 7.080464757971428533e-03 2.933735381095268872e-03
1.586311056950515021e-03 1.227894701703272301e-03 6.514666883216176530e-04 1.026499985055261696e-03 1.333006438580440663e-02 6.745591816550844388e-02 3.756090450199225383e-01 3.055491063763503545e-01 3.011682325992729448e-01 1.507929243581581369e-01 5.514436992430381268e-02 1.477235130331845669e-02 1.444701171002860454e-02 3.734950659712944765e-02 8.420190120415885215e-02 3.884569342033376005e-01 4.058338196307632040e-01 4.763289365266671349e-01 8.340913684483494683e-02 1.477583219327991415e-01 5.196111242845682376e-01 1.113730767728782656e+00 1.366123548576128055e+00 1.428747879582380698e+00 1.195423742113444820e+00 1.163391346344954114e+00 1.090169527775889602e+00 8.642584699406776760e-01 3.835056546469294697e-02 2.528089500675296392e-02
6.943038229518383583e-04 1.885000847029142312e-03 3.490867122844836662e-03 2.423543317016741555e-02 5.397770995062614596e-02 7.638678362999870575e-02 2.410795300417726550e-01 3.001527808140359577e-01 2.065842482154863491e-01 1.605781780851867346e-01 3.371671984452222215e-02 3.296320268952497145e-03 5.009471337104941767e-03 1.417950620213320918e-02 3.079423576414482000e-02 1.819861503399797520e-01 6.920584621414221926e-02 2.223673028190273349e-02 7.467673531206338658e-03 5.410692779021137461e-02 2.039598427665049174e-01 1.077653379634668340e+00 1.358156621034136702e+00 1.431112661810301834e+00 1.055104028772143598e+00 4.922487874576459976e-01 8.003303240224581838e-01 5.493587422866391679e-01 4.953999534508326391e-02 1.955736181670007443e-02
1.715886678849561087e-02 2.185321595461647490e-02 1.462203581001309330e-02 1.813116058360984134e-02 4.275102902102721064e-02 2.454737829499284082e-02 1.267088113259618454e-01 1.633447364570055904e-01 1.511411055734853404e-01 3.564505168299441501e-02 8.955037831351651476e-03 1.889233792657721289e-03 3.318974312353695569e-03 9.840107348111927152e-03 3.913622239399884573e-02 2.638422380796367345e-02 4.806726764498923943e-02 1.420619752402841642e-02 2.655841209051267027e-02 1.248733783762025207e-01 6.670304423180392073e-01 1.258637955454305235e+00 1.350476459288715070e+00 1.290167238828516583e+00 9.963694516557035641e-01 7.331601189054161027e-01 7.122428334254038429e-01 4.799125400198482883e-01 4.321068325202152144e-02 1.538258497646096366e-02
4.810699983896017662e-02 4.376346104942637621e-02 2.253970045963863550e-02 1.620514653599342339e-02 2.103710374843838216e-02 1.128664325477806568e-02 6.447917413411818899e-02 5.754177464837138822e-02 1.584944320552652414e-02 8.640465071434975941e-03 2.989107998715907679e-03 2.382066474895456250e-03 1.447330091373997705e-03 8.226436570904025608e-04 2.182495530402682286e-03 7.480350035092585281e-03 2.658047008325075539e-02 6.037899641285858487e-02 5.782601580867829938e-02 2.569836925644545800e-01 7.000979590663349850e-01 1.016645708076633348e+00 4.153109064614305956e-01 6.252615012748473644e-01 8.087818746411484794e-01 4.586698866624965842e-01 3.428610665048909545e-01 2.816136706132114087e-01 1.032282864730434124e-02 9.331624734967330220e-03
3.897782394011410634e-02 4.462309865915111556e-02 6.585253532810537123e-03 4.547169973208915576e-03 3.714914760864617121e-03 5.544504202050378611e-03 7.938913305230265241e-03 1.982876247464092790e-03 2.571143378258066488e-03 4.110226154742055459e-04 5.497236417625338571e-04 8.516982889685649136e-04 9.717795225076762125e-04 3.594138996212383613e-03 1.043591871736390155e-02 1.380441496139812596e-01 2.611905848802439922e-01 3.753096248158799830e-01 2.545624732943447821e-01 1.915097032830534729e-01 1.361845528660035054e-01 4.900938607064155017e-02 1.905068825096988688e-02 4.109889913879008483e-02 1.489329335642140539e-01 5.043851260493492639e-02 4.662618883674593540e-02 1.575528516927271125e-02 1.791457381268587220e-03 1.467024663547882805e-03
8.287700075425517843e-02 6.354070645242670956e-02 6.853505826700015922e-03 2.936242913380621936e-03 4.265367869809930622e-03 3.322976781605310043e-03 5.143578566900797351e-03 5.495616594356636866e-04 4.624611202060936168e-04 2.038358084892163600e-04 4.915713727091585664e-04 9.446258761503688794e-04 1.301236518420935840e-03 7.333181225240464549e-03 1.249680375179945332e-02 8.066689319391123769e-02 2.908993754448653823e-01 5.380696120354486744e-01 6.054414499429312535e-01 5.270822683509391871e-01 1.134720760859781741e-01 2.555492419471061538e-02 3.182924248316573723e-02 7.775243982480470328e-02 1.730187320578329968e-01 5.103027641131410025e-02 1.963467965531268816e-02 7.403965939465747582e-03 2.324553423125246682e-03 2.098388926860856370e-03
1.038667229440281559e-01 1.317673919752153193e-02 3.633208023192243882e-03 1.178039569560045477e-03 1.320541208737458904e-03 2.877441726095492439e-03 3.707710874957017341e-03 4.135436780050583410e-04 2.271846790139486771e-04 2.658767256018197992e-04 4.764918415255335040e-04 8.227259944722752072e-04 9.676809719859882832e-04 5.656268951089767592e-03 2.308817010520481522e-02 1.159508404431597028e-01 2.215689430577318375e-01 5.050036768822647737e-01 6.293905280631590937e-01 5.343667672138324720e-01 2.709769989912538257e-01 1.581480114782450944e-02 1.132482084626494981e-02 2.444494633148654172e-02 1.405669153024598494e-01 8.412177293060957295e-02 7.592687222525520974e-02 1.431218649309991958e-02 2.066872558270337057e-03 1.567820713635683033e-03
5.805289129776428081e-02 1.791797896211010099e-02 6.917117611067983077e-03 6.370772439765760506e-03 1.395115887680067890e-02 9.500827848581607643e-03 3.925894046226185291e-03 1.598801209824767542e-03 2.379331281133328143e-03 3.121650127250145002e-03 2.924002000013295227e-04 3.312028728569572900e-04 5.384895571757235960e-04 1.300478321704676447e-03 8.329214745010086324e-03 3.570111353350412242e-02 3.573737896712954332e-02 1.517853313078214028e-01 1.932803895639149117e-01 1.670058600538149307e-01 1.430730044008540203e-01 1.877363431364387214e-02 2.926756646633290292e-03 5.710399409510945670e-03 2.523533415257982193e-02 6.298372220740924843e-02 1.694115464186881359e-01 9.544626388740440337e-02 2.372451695852813118e-03 1.762082272897277577e-03
2.080899471707632620e-02 8.228484307374868065e-03 8.724793660606675050e-03 1.454409775997411725e-02 7.829467544700978443e-03 3.496383878185502225e-03 1.604523256855208604e-03 1.120747051397854785e-03 3.523896372240507835e-03 1.372184851694569982e-02 9.369408590488496717e-04 3.239685621446862680e-04 5.722449887405613948e-04 1.341903510964007409e-03 6.765265106841319986e-03 1.277327890800658561e-02 8.804194137973628612e-03 4.367367621266819711e-03 6.884512345683993333e-03 1.266636826409137453e-02 2.307607890719242522e-02 5.384158728670457306e-03 2.834058170739825466e-03 1.457700044857391380e-02 3.567006522475326541e-02 1.270036032004957273e-02 4.394058323431808410e-02 4.927927990761834381e-02 1.750346441106008163e-02 2.649251550573246752e-03
2.109844526455426778e-02 1.687994892620698836e-02 8.164106882936710691e-03 5.922403666346686725e-03 5.433286808465203482e-03 2.032750481053574847e-03 1.339991767664219314e-03 1.364796003667751801e-03 1.496978436248293503e-03 6.008070048923849250e-03 1.700216723151865266e-03 1.617779999251766580e-03 1.596179366179566357e-03 2.127124983377609146e-03 6.561288618835529884e-03 4.867678428088673299e-03 3.427703135633721962e-03 2.129571881452688858e-03 1.938502181811587854e-03 1.538193039005346027e-03 1.270808987764724621e-03 1.923327190717050942e-03 3.164228754403484827e-03 8.158143204432760295e-03 1.474935095428769709e-02 7.265848704138396993e-03 1.184409355268722409e-02 7.894970980220027829e-03 7.969290742979697265e-03 5.117277207465471822e-03
2.858522756186109015e-02 1.486072842801166444e-02 8.390756822812334842e-03 1.135698510480429198e-02 9.833694189459341040e-03 5.321884835070858633e-03 1.813905015316755534e-02 1.367805192359097116e-02 2.014986834904833931e-03 1.469376940647865691e-03 5.251173614466459090e-04 1.206594578898049141e-03 3.748055840660729533e-03 4.459280450637401888e-03 1.479286784271260230e-02 1.184856293066871569e-02 3.914609244786643530e-03 4.837462139344881826e-03 2.317688488864321893e-03 1.035459969359125380e-03 9.593053543831424378e-04 1.493291426788135321e-03 2.367393286646780719e-03 7.861029798628672155e-03 8.605835967073493381e-03 2.181312545139614360e-03 2.535197981897525411e-03 3.309090064944945030e-03 1.087676962036419719e-02 2.260265088368558582e-03
3.836752931124715049e-02 3.310344525126023701e-02 9.966425163339271906e-03 3.378859638097604645e-02 3.862513719442760979e-02 7.255817798224867277e-02 4.878024431826957774e-02 5.526688342248278416e-03 1.989411237521213158e-03 1.156353145652687766e-03 3.424691682281919328e-04 4.283962791539630706e-04 5.626867264659628654e-04 2.444921340615191507e-03 3.318461383499575826e-03 1.609764577363291364e-03 1.647522852580180722e-03 2.083394193532902509e-03 2.954456524210465236e-03 1.612397781142916632e-03 8.729456040041231636e-04 1.183758329983374642e-03 1.328687048471106523e-03 2.480354328176294885e-03 8.671201313495696325e-03 1.493901775074502579e-03 2.303761984988132380e-03 3.902951711843617895e-03 4.813632248227292867e-03 9.754891311762468181e-03
2.099001711919587163e-02 5.209092652611543861e-02 1.544917730457857907e-02 1.641341447030468179e-02 7.837028865328654614e-02 8.260646286353340306e-02 5.523458592477340640e-02 3.803878249878707256e-03 2.690095602141904900e-03 2.583187721513834165e-03 1.076532357621166891e-03 5.400235266643106224e-04 3.671313829738189231e-04 7.024555717928249437e-04 3.672293066620401988e-03 1.162640702976184800e-03 4.398623942228641406e-03 2.800588920856466116e-02 5.192439646883471871e-02 7.256340991982511771e-03 1.404199572674006812e-03 1.770873984951757806e-03 1.501184977557600431e-03 1.819865877541232109e-03 2.680776831439191099e-03 2.248077624038726744e-03 2.821996353448753131e-03 3.582210936246253002e-03 4.943701977176829902e-03 1.238149280994367898e-02
