#FIG 3.2  Produced by xfig version 3.2.5
Landscape
Center
Metric
A4      
100.00
Single
-2
1200 2
2 2 0 2 0 7 50 -1 -1 0.000 0 0 -1 0 0 5
	 2700 1800 3150 1800 3150 2250 2700 2250 2700 1800
2 2 0 2 0 7 50 -1 -1 0.000 0 0 -1 0 0 5
	 3150 1800 3600 1800 3600 2250 3150 2250 3150 1800
2 2 0 2 0 7 50 -1 -1 0.000 0 0 -1 0 0 5
	 4050 1800 4500 1800 4500 2250 4050 2250 4050 1800
2 2 0 2 0 7 50 -1 -1 0.000 0 0 -1 0 0 5
	 4500 1800 4950 1800 4950 2250 4500 2250 4500 1800
2 2 0 2 0 1 50 -1 20 0.000 0 0 -1 0 0 5
	 3600 1800 4050 1800 4050 2250 3600 2250 3600 1800
2 1 0 2 0 7 50 -1 -1 0.000 0 0 -1 1 1 2
	0 0 1.00 75.00 120.00
	0 0 1.00 75.00 120.00
	 5175 1845 5175 1350
2 2 0 2 0 7 50 -1 -1 0.000 0 0 -1 0 0 5
	 2700 1350 3150 1350 3150 1800 2700 1800 2700 1350
2 2 0 2 0 7 50 -1 -1 0.000 0 0 -1 0 0 5
	 3150 1350 3600 1350 3600 1800 3150 1800 3150 1350
2 2 0 2 0 7 50 -1 -1 0.000 0 0 -1 0 0 5
	 3600 1350 4050 1350 4050 1800 3600 1800 3600 1350
2 2 0 2 0 7 50 -1 -1 0.000 0 0 -1 0 0 5
	 4050 1350 4500 1350 4500 1800 4050 1800 4050 1350
2 2 0 2 0 7 50 -1 -1 0.000 0 0 -1 0 0 5
	 4500 1350 4950 1350 4950 1800 4500 1800 4500 1350
2 2 0 2 0 7 50 -1 -1 0.000 0 0 -1 0 0 5
	 2700 2250 3150 2250 3150 2700 2700 2700 2700 2250
2 2 0 2 0 7 50 -1 -1 0.000 0 0 -1 0 0 5
	 3150 2250 3600 2250 3600 2700 3150 2700 3150 2250
2 2 0 2 0 7 50 -1 -1 0.000 0 0 -1 0 0 5
	 3600 2250 4050 2250 4050 2700 3600 2700 3600 2250
2 2 0 2 0 7 50 -1 -1 0.000 0 0 -1 0 0 5
	 4050 2250 4500 2250 4500 2700 4050 2700 4050 2250
2 2 0 2 0 7 50 -1 -1 0.000 0 0 -1 0 0 5
	 4500 2250 4950 2250 4950 2700 4500 2700 4500 2250
2 1 0 2 0 7 50 -1 -1 0.000 0 0 -1 1 1 2
	0 0 1.00 75.00 120.00
	0 0 1.00 75.00 120.00
	 5130 2745 5130 2250
2 1 0 2 0 7 50 -1 -1 0.000 0 0 -1 1 1 2
	0 0 1.00 75.00 120.00
	0 0 1.00 75.00 120.00
	 3555 1125 2700 1125
2 1 0 2 0 7 50 -1 -1 0.000 0 0 -1 1 1 2
	0 0 1.00 75.00 120.00
	0 0 1.00 75.00 120.00
	 4950 1125 4095 1125
4 0 0 50 -1 2 14 0.0000 4 195 885 5265 1665 ksize_up\001
4 0 0 50 -1 2 14 0.0000 4 180 930 2700 990 ksize_left\001
4 0 0 50 -1 2 14 0.0000 4 195 1110 4005 990 ksize_right\001
4 0 0 50 -1 2 14 0.0000 4 180 945 5220 2565 ksize_bot\001
