%!PS-Adobe-2.0 EPSF-2.0
%%Title: iterator3d_plane_conventions.fig
%%Creator: fig2dev Version 3.2 Patchlevel 5-alpha7
%%CreationDate: Tue Feb 12 17:48:53 2008
%%For: arrivault@caldell (Arrivault Denis)
%%BoundingBox: 0 0 717 223
%Magnification: 1.0000
%%EndComments
/MyAppDict 100 dict dup begin def
/$F2psDict 200 dict def
$F2psDict begin
$F2psDict /mtrx matrix put
/col-1 {0 setgray} bind def
/col0 {0.000 0.000 0.000 srgb} bind def
/col1 {0.000 0.000 1.000 srgb} bind def
/col2 {0.000 1.000 0.000 srgb} bind def
/col3 {0.000 1.000 1.000 srgb} bind def
/col4 {1.000 0.000 0.000 srgb} bind def
/col5 {1.000 0.000 1.000 srgb} bind def
/col6 {1.000 1.000 0.000 srgb} bind def
/col7 {1.000 1.000 1.000 srgb} bind def
/col8 {0.000 0.000 0.560 srgb} bind def
/col9 {0.000 0.000 0.690 srgb} bind def
/col10 {0.000 0.000 0.820 srgb} bind def
/col11 {0.530 0.810 1.000 srgb} bind def
/col12 {0.000 0.560 0.000 srgb} bind def
/col13 {0.000 0.690 0.000 srgb} bind def
/col14 {0.000 0.820 0.000 srgb} bind def
/col15 {0.000 0.560 0.560 srgb} bind def
/col16 {0.000 0.690 0.690 srgb} bind def
/col17 {0.000 0.820 0.820 srgb} bind def
/col18 {0.560 0.000 0.000 srgb} bind def
/col19 {0.690 0.000 0.000 srgb} bind def
/col20 {0.820 0.000 0.000 srgb} bind def
/col21 {0.560 0.000 0.560 srgb} bind def
/col22 {0.690 0.000 0.690 srgb} bind def
/col23 {0.820 0.000 0.820 srgb} bind def
/col24 {0.500 0.190 0.000 srgb} bind def
/col25 {0.630 0.250 0.000 srgb} bind def
/col26 {0.750 0.380 0.000 srgb} bind def
/col27 {1.000 0.500 0.500 srgb} bind def
/col28 {1.000 0.630 0.630 srgb} bind def
/col29 {1.000 0.750 0.750 srgb} bind def
/col30 {1.000 0.880 0.880 srgb} bind def
/col31 {1.000 0.840 0.000 srgb} bind def
/col32 {0.612 0.000 0.000 srgb} bind def
/col33 {0.549 0.549 0.549 srgb} bind def
/col34 {0.549 0.549 0.549 srgb} bind def
/col35 {0.259 0.259 0.259 srgb} bind def
/col36 {0.549 0.549 0.549 srgb} bind def
/col37 {0.259 0.259 0.259 srgb} bind def
/col38 {0.549 0.549 0.549 srgb} bind def
/col39 {0.259 0.259 0.259 srgb} bind def
/col40 {0.549 0.549 0.549 srgb} bind def
/col41 {0.259 0.259 0.259 srgb} bind def
/col42 {0.549 0.549 0.549 srgb} bind def
/col43 {0.259 0.259 0.259 srgb} bind def
/col44 {0.761 0.761 0.761 srgb} bind def
/col45 {0.431 0.431 0.431 srgb} bind def
/col46 {0.267 0.267 0.267 srgb} bind def
/col47 {0.557 0.561 0.557 srgb} bind def
/col48 {0.443 0.443 0.443 srgb} bind def
/col49 {0.682 0.682 0.682 srgb} bind def
/col50 {0.200 0.200 0.200 srgb} bind def
/col51 {0.580 0.576 0.584 srgb} bind def
/col52 {0.455 0.439 0.459 srgb} bind def
/col53 {0.333 0.333 0.333 srgb} bind def
/col54 {0.702 0.702 0.702 srgb} bind def
/col55 {0.765 0.765 0.765 srgb} bind def
/col56 {0.427 0.427 0.427 srgb} bind def
/col57 {0.271 0.271 0.271 srgb} bind def
/col58 {0.557 0.557 0.557 srgb} bind def
/col59 {0.867 0.616 0.576 srgb} bind def
/col60 {0.945 0.925 0.878 srgb} bind def
/col61 {0.886 0.784 0.659 srgb} bind def
/col62 {0.882 0.882 0.882 srgb} bind def
/col63 {0.824 0.824 0.824 srgb} bind def
/col64 {0.929 0.929 0.929 srgb} bind def
/col65 {0.855 0.478 0.102 srgb} bind def
/col66 {0.945 0.894 0.102 srgb} bind def
/col67 {0.533 0.490 0.761 srgb} bind def
/col68 {0.839 0.839 0.839 srgb} bind def
/col69 {0.549 0.549 0.647 srgb} bind def
/col70 {0.290 0.290 0.290 srgb} bind def
/col71 {0.549 0.420 0.420 srgb} bind def
/col72 {0.353 0.353 0.353 srgb} bind def
/col73 {0.388 0.388 0.388 srgb} bind def
/col74 {0.718 0.608 0.451 srgb} bind def
/col75 {0.255 0.576 1.000 srgb} bind def
/col76 {0.749 0.439 0.231 srgb} bind def
/col77 {0.859 0.467 0.000 srgb} bind def
/col78 {0.855 0.722 0.000 srgb} bind def
/col79 {0.000 0.392 0.000 srgb} bind def
/col80 {0.353 0.420 0.231 srgb} bind def
/col81 {0.827 0.827 0.827 srgb} bind def
/col82 {0.667 0.667 0.667 srgb} bind def
/col83 {0.557 0.557 0.643 srgb} bind def
/col84 {0.953 0.725 0.365 srgb} bind def
/col85 {0.537 0.600 0.420 srgb} bind def
/col86 {0.392 0.392 0.392 srgb} bind def
/col87 {0.718 0.902 1.000 srgb} bind def
/col88 {0.525 0.753 0.925 srgb} bind def
/col89 {0.741 0.741 0.741 srgb} bind def
/col90 {0.827 0.584 0.322 srgb} bind def
/col91 {0.596 0.824 0.996 srgb} bind def
/col92 {0.549 0.612 0.420 srgb} bind def
/col93 {0.969 0.420 0.000 srgb} bind def
/col94 {0.353 0.420 0.224 srgb} bind def
/col95 {0.549 0.612 0.420 srgb} bind def
/col96 {0.549 0.612 0.482 srgb} bind def
/col97 {0.094 0.290 0.094 srgb} bind def
/col98 {0.678 0.678 0.678 srgb} bind def
/col99 {0.969 0.741 0.353 srgb} bind def
/col100 {0.388 0.420 0.612 srgb} bind def
/col101 {0.969 0.969 0.969 srgb} bind def
/col102 {0.871 0.000 0.000 srgb} bind def
/col103 {0.678 0.678 0.678 srgb} bind def
/col104 {0.969 0.741 0.353 srgb} bind def
/col105 {0.678 0.678 0.678 srgb} bind def
/col106 {0.969 0.741 0.353 srgb} bind def
/col107 {0.388 0.420 0.612 srgb} bind def
/col108 {0.322 0.420 0.161 srgb} bind def
/col109 {0.580 0.580 0.580 srgb} bind def
/col110 {0.000 0.388 0.000 srgb} bind def
/col111 {0.000 0.388 0.290 srgb} bind def
/col112 {0.482 0.518 0.290 srgb} bind def
/col113 {0.906 0.741 0.482 srgb} bind def
/col114 {0.647 0.710 0.776 srgb} bind def
/col115 {0.420 0.420 0.580 srgb} bind def
/col116 {0.518 0.420 0.420 srgb} bind def
/col117 {0.322 0.612 0.290 srgb} bind def
/col118 {0.839 0.906 0.906 srgb} bind def
/col119 {0.322 0.388 0.388 srgb} bind def
/col120 {0.094 0.420 0.290 srgb} bind def
/col121 {0.612 0.647 0.710 srgb} bind def
/col122 {1.000 0.580 0.000 srgb} bind def
/col123 {1.000 0.580 0.000 srgb} bind def
/col124 {0.000 0.388 0.290 srgb} bind def
/col125 {0.482 0.518 0.290 srgb} bind def
/col126 {0.388 0.451 0.482 srgb} bind def
/col127 {0.906 0.741 0.482 srgb} bind def
/col128 {0.094 0.290 0.094 srgb} bind def
/col129 {0.871 0.871 0.871 srgb} bind def
/col130 {0.953 0.933 0.827 srgb} bind def
/col131 {0.961 0.682 0.365 srgb} bind def
/col132 {0.584 0.808 0.600 srgb} bind def
/col133 {0.710 0.082 0.490 srgb} bind def
/col134 {0.933 0.933 0.933 srgb} bind def
/col135 {0.518 0.518 0.518 srgb} bind def
/col136 {0.482 0.482 0.482 srgb} bind def
/col137 {0.000 0.353 0.000 srgb} bind def
/col138 {0.906 0.451 0.451 srgb} bind def
/col139 {1.000 0.796 0.192 srgb} bind def
/col140 {0.161 0.475 0.290 srgb} bind def
/col141 {0.871 0.157 0.129 srgb} bind def
/col142 {0.129 0.349 0.776 srgb} bind def
/col143 {0.973 0.973 0.973 srgb} bind def
/col144 {0.902 0.902 0.902 srgb} bind def
/col145 {0.129 0.518 0.353 srgb} bind def
/col146 {0.886 0.886 0.933 srgb} bind def
/col147 {0.580 0.580 0.604 srgb} bind def
/col148 {0.859 0.859 0.859 srgb} bind def
/col149 {0.631 0.631 0.718 srgb} bind def
/col150 {0.878 0.878 0.878 srgb} bind def
/col151 {0.525 0.675 1.000 srgb} bind def
/col152 {0.439 0.439 1.000 srgb} bind def
/col153 {0.776 0.718 0.592 srgb} bind def
/col154 {0.937 0.973 1.000 srgb} bind def
/col155 {0.863 0.796 0.651 srgb} bind def
/col156 {0.251 0.251 0.251 srgb} bind def
/col157 {0.502 0.502 0.502 srgb} bind def
/col158 {0.753 0.753 0.753 srgb} bind def
/col159 {0.843 0.843 0.843 srgb} bind def
/col160 {0.745 0.745 0.745 srgb} bind def
/col161 {0.318 0.318 0.318 srgb} bind def
/col162 {0.906 0.890 0.906 srgb} bind def
/col163 {0.000 0.000 0.286 srgb} bind def
/col164 {0.475 0.475 0.475 srgb} bind def
/col165 {0.188 0.204 0.188 srgb} bind def
/col166 {0.255 0.255 0.255 srgb} bind def
/col167 {0.780 0.714 0.588 srgb} bind def
/col168 {0.255 0.271 0.255 srgb} bind def
/col169 {0.906 0.906 0.906 srgb} bind def
/col170 {0.443 0.459 0.443 srgb} bind def

end
save
newpath 0 223 moveto 0 0 lineto 717 0 lineto 717 223 lineto closepath clip newpath
-3.6 225.9 translate
1 -1 scale

% left30
<<
 /PatternType 1
 /PaintType 2
 /TilingType 2
 /BBox [-2 -4 10 5]
 /XStep 8
 /YStep 4
 /PaintProc
 {
  pop
  newpath
  .7 setlinewidth
  -2 -1 moveto
  12 6 rlineto
  stroke
 } bind

>>

matrix
makepattern
/P1 exch def

% right30
<<
 /PatternType 1
 /PaintType 2
 /TilingType 2
 /BBox [-2 -4 10 5]
 /XStep 8
 /YStep 4
 /PaintProc
 {
  pop
  newpath
  -2 5 moveto
  .7 setlinewidth
  12 -6 rlineto
  stroke
 } bind

>>

matrix
makepattern
/P2 exch def

% right45
<<
 /PatternType 1
 /PaintType 2
 /TilingType 2
 /BBox [-1 -1 9 9]
 /XStep 8
 /YStep 8
 /PaintProc
 {
  pop
  newpath
  1 setlinewidth
  -1 9 moveto
  9 -1 lineto
  stroke
 } bind

>>

matrix
makepattern
/P5 exch def

/cp {closepath} bind def
/ef {eofill} bind def
/gr {grestore} bind def
/gs {gsave} bind def
/sa {save} bind def
/rs {restore} bind def
/l {lineto} bind def
/m {moveto} bind def
/rm {rmoveto} bind def
/n {newpath} bind def
/s {stroke} bind def
/sh {show} bind def
/slc {setlinecap} bind def
/slj {setlinejoin} bind def
/slw {setlinewidth} bind def
/srgb {setrgbcolor} bind def
/rot {rotate} bind def
/sc {scale} bind def
/sd {setdash} bind def
/ff {findfont} bind def
/sf {setfont} bind def
/scf {scalefont} bind def
/sw {stringwidth} bind def
/tr {translate} bind def
/tnt {dup dup currentrgbcolor
  4 -2 roll dup 1 exch sub 3 -1 roll mul add
  4 -2 roll dup 1 exch sub 3 -1 roll mul add
  4 -2 roll dup 1 exch sub 3 -1 roll mul add srgb}
  bind def
/shd {dup dup currentrgbcolor 4 -2 roll mul 4 -2 roll mul
  4 -2 roll mul srgb} bind def
/$F2psBegin {$F2psDict begin /$F2psEnteredState save def} def
/$F2psEnd {$F2psEnteredState restore end} def

$F2psBegin
10 setmiterlimit
0 slj 0 slc
 0.06000 0.06000 sc
%
% Fig objects follow
%
% 
% here starts figure with depth 55
% Polyline
0 slj
0 slc
7.500 slw
n 5288 1394 m 6313 369 l 6313 1975 l 5288 2999 l
 5288 1394 l  cp 
% Fill with pattern background color
gs /DeviceRGB setcolorspace 1.00 1.00 1.00 setcolor fill gr

% Fill with pattern pen color
gs /DeviceRGB setcolorspace 0.00 0.00 0.00 P1 setpattern fill gr

gs col-1 s gr 
% Polyline
n 1307 2422 m 3047 2422 l 3047 815 l 1307 815 l
 cp 
% Fill with pattern background color
gs /DeviceRGB setcolorspace 1.00 1.00 1.00 setcolor fill gr

% Fill with pattern pen color
gs /DeviceRGB setcolorspace 0.00 0.00 0.00 P2 setpattern fill gr

gs col0 s gr 
% Polyline
n 8020 2105 m 9747 2105 l 10780 965 l 9040 965 l
 8007 2105 l 
% Fill with pattern background color
gs /DeviceRGB setcolorspace 1.00 1.00 1.00 setcolor fill gr

% Fill with pattern pen color
gs /DeviceRGB setcolorspace 0.00 0.00 0.00 P5 setpattern fill gr

gs col0 s gr 
% here ends figure;
% 
% here starts figure with depth 51
% Polyline
0 slj
0 slc
30.000 slw
n 3000 2375 m
 3087 2449 l gs col1 s gr 
% Polyline
7.500 slw
n 6074 1401 m
 6074 2999 l gs col0 s gr 
% Polyline
n 5357 369 m
 7099 369 l gs col0 s gr 
% Polyline
n 4332 2999 m
 6074 2999 l gs col0 s gr 
% Polyline
n 6077 3002 m
 7102 1978 l gs col0 s gr 
% Polyline
n 7099 376 m
 7099 1981 l gs col0 s gr 
% Polyline
n 6081 1387 m
 7106 362 l gs col0 s gr 
% Polyline
 [15 45] 45 sd
n 5370 1975 m
 7113 1975 l gs col0 s gr  [] 0 sd
% Polyline
 [15 45] 45 sd
n 5364 369 m
 5364 1975 l gs col0 s gr  [] 0 sd
% Polyline
gs  clippath
4291 3158 m 4291 3370 l 4372 3370 l 4372 3158 l 4372 3158 l 4332 3322 l 4291 3158 l cp
eoclip
n 4332 1394 m
 4332 3355 l gs col0 s gr gr

% arrowhead
n 4291 3158 m 4332 3322 l 4372 3158 l  col0 s
% Polyline
gs  clippath
5479 304 m 5628 155 l 5570 97 l 5421 246 l 5421 246 l 5566 160 l 5479 304 l cp
eoclip
n 4332 1394 m
 5589 137 l gs col0 s gr gr

% arrowhead
n 5479 304 m 5566 160 l 5421 246 l  col0 s
% Polyline
gs  clippath
6273 1434 m 6485 1434 l 6485 1353 l 6273 1353 l 6273 1353 l 6437 1394 l 6273 1434 l cp
eoclip
n 4339 1394 m
 6470 1394 l gs col0 s gr gr

% arrowhead
n 6273 1434 m 6437 1394 l 6273 1353 l  col0 s
% Polyline
 [15 45] 45 sd
n 4339 2992 m
 5364 1968 l gs col0 s gr  [] 0 sd
/Times-Roman ff 150.00 scf sf
6450 1565 m
gs 1 -1 sc (j) col0 sh gr
/Times-Roman ff 150.00 scf sf
5698 198 m
gs 1 -1 sc (k) col0 sh gr
/Times-Roman ff 150.00 scf sf
4469 3375 m
gs 1 -1 sc (i) col0 sh gr
/Times-Roman ff 200.00 scf sf
4413 1629 m
gs 1 -1 sc (upper_left) col0 sh gr
/Times-Roman ff 200.00 scf sf
6270 2232 m
gs 1 -1 sc (bottom_right) col0 sh gr
/Times-Roman ff 150.00 scf sf
3825 1425 m
gs 1 -1 sc (\(0,0,0\)) col0 sh gr
% Polyline
n 2466 1401 m
 2466 2999 l gs col0 s gr 
% Polyline
n 1749 369 m
 3491 369 l gs col0 s gr 
% Polyline
n 3491 376 m
 3491 1981 l gs col0 s gr 
% Polyline
n 2473 1387 m
 3498 362 l gs col0 s gr 
% Polyline
 [15 45] 45 sd
n 1762 1975 m
 3505 1975 l gs col0 s gr  [] 0 sd
% Polyline
gs  clippath
683 3158 m 683 3370 l 764 3370 l 764 3158 l 764 3158 l 724 3322 l 683 3158 l cp
eoclip
n 724 1394 m
 724 3355 l gs col0 s gr gr

% arrowhead
n 683 3158 m 724 3322 l 764 3158 l  col0 s
% Polyline
gs  clippath
1871 304 m 2020 155 l 1962 97 l 1813 246 l 1813 246 l 1958 160 l 1871 304 l cp
eoclip
n 724 1394 m
 1981 137 l gs col0 s gr gr

% arrowhead
n 1871 304 m 1958 160 l 1813 246 l  col0 s
% Polyline
 [15 45] 45 sd
n 731 2992 m
 1756 1968 l gs col0 s gr  [] 0 sd
% Polyline
 [15 45] 45 sd
n 1756 369 m
 1756 1975 l gs col0 s gr  [] 0 sd
% Polyline
n 717 3002 m
 2459 3002 l gs col0 s gr 
% Polyline
gs  clippath
2665 1429 m 2877 1429 l 2877 1348 l 2665 1348 l 2665 1348 l 2829 1389 l 2665 1429 l cp
eoclip
n 731 1389 m
 2862 1389 l gs col0 s gr gr

% arrowhead
n 2665 1429 m 2829 1389 l 2665 1348 l  col0 s
% Polyline
n 2469 3002 m
 3494 1978 l gs col0 s gr 
/Times-Roman ff 150.00 scf sf
75 1353 m
gs 1 -1 sc (\(0,0,0\)) col0 sh gr
/Times-Roman ff 150.00 scf sf
2090 198 m
gs 1 -1 sc (k) col0 sh gr
/Times-Roman ff 150.00 scf sf
861 3375 m
gs 1 -1 sc (i) col0 sh gr
/Times-Roman ff 150.00 scf sf
3122 1512 m
gs 1 -1 sc (j) col0 sh gr
/Times-Roman ff 200.00 scf sf
395 850 m
gs 1 -1 sc (upper_left) col0 sh gr
/Times-Roman ff 200.00 scf sf
2994 2684 m
gs 1 -1 sc (bottom_right) col0 sh gr
% Polyline
n 9754 1384 m
 9754 2982 l gs col0 s gr 
% Polyline
n 9037 352 m
 10779 352 l gs col0 s gr 
% Polyline
n 8012 2982 m
 9754 2982 l gs col0 s gr 
% Polyline
n 9757 2985 m
 10782 1961 l gs col0 s gr 
% Polyline
n 10779 359 m
 10779 1964 l gs col0 s gr 
% Polyline
n 9761 1370 m
 10786 345 l gs col0 s gr 
% Polyline
 [15 45] 45 sd
n 9050 1958 m
 10793 1958 l gs col0 s gr  [] 0 sd
% Polyline
 [15 45] 45 sd
n 9044 352 m
 9044 1958 l gs col0 s gr  [] 0 sd
% Polyline
gs  clippath
7971 3141 m 7971 3353 l 8052 3353 l 8052 3141 l 8052 3141 l 8012 3305 l 7971 3141 l cp
eoclip
n 8012 1377 m
 8012 3338 l gs col0 s gr gr

% arrowhead
n 7971 3141 m 8012 3305 l 8052 3141 l  col0 s
% Polyline
gs  clippath
9159 287 m 9308 138 l 9250 80 l 9101 229 l 9101 229 l 9246 143 l 9159 287 l cp
eoclip
n 8012 1377 m
 9269 120 l gs col0 s gr gr

% arrowhead
n 9159 287 m 9246 143 l 9101 229 l  col0 s
% Polyline
gs  clippath
9953 1417 m 10165 1417 l 10165 1336 l 9953 1336 l 9953 1336 l 10117 1377 l 9953 1417 l cp
eoclip
n 8019 1377 m
 10150 1377 l gs col0 s gr gr

% arrowhead
n 9953 1417 m 10117 1377 l 9953 1336 l  col0 s
% Polyline
 [15 45] 45 sd
n 8019 2975 m
 9044 1951 l gs col0 s gr  [] 0 sd
/Times-Roman ff 150.00 scf sf
9378 181 m
gs 1 -1 sc (k) col0 sh gr
/Times-Roman ff 150.00 scf sf
8149 3358 m
gs 1 -1 sc (i) col0 sh gr
/Times-Roman ff 150.00 scf sf
10337 1634 m
gs 1 -1 sc (j) col0 sh gr
/Times-Roman ff 150.00 scf sf
7500 1425 m
gs 1 -1 sc (\(0,0,0\)) col0 sh gr
/Times-Roman ff 200.00 scf sf
7125 2025 m
gs 1 -1 sc (upper_left) col0 sh gr
/Times-Roman ff 200.00 scf sf
10875 1125 m
gs 1 -1 sc (bottom_right) col0 sh gr
/Times-Roman ff 333.33 scf sf
4575 3750 m
gs 1 -1 sc (KI_PLANE) col0 sh gr
/Times-Roman ff 333.33 scf sf
975 3750 m
gs 1 -1 sc (IJ_PLANE) col0 sh gr
/Times-Roman ff 333.33 scf sf
8250 3750 m
gs 1 -1 sc (KJ_PLANE) col0 sh gr
% Polyline
30.000 slw
n 4293 1354 m
 4380 1428 l gs col4 s gr 
% Polyline
n 4380 1354 m
 4290 1428 l gs col4 s gr 
% Polyline
n 6269 1942 m
 6356 2016 l gs col1 s gr 
% Polyline
n 6356 1942 m
 6266 2016 l gs col1 s gr 
% Polyline
n 5249 1359 m
 5336 1433 l gs col1 s gr 
% Polyline
n 5336 1359 m
 5246 1433 l gs col1 s gr 
% Polyline
n 685 1354 m
 772 1428 l gs col4 s gr 
% Polyline
n 772 1354 m
 682 1428 l gs col4 s gr 
% Polyline
n 3087 2375 m
 2997 2449 l gs col1 s gr 
% Polyline
n 1260 779 m
 1347 853 l gs col1 s gr 
% Polyline
n 1347 779 m
 1257 853 l gs col1 s gr 
% Polyline
n 7973 1337 m
 8060 1411 l gs col4 s gr 
% Polyline
n 8060 1337 m
 7970 1411 l gs col4 s gr 
% Polyline
n 7967 2055 m
 8054 2129 l gs col1 s gr 
% Polyline
n 8054 2055 m
 7964 2129 l gs col1 s gr 
% Polyline
n 10721 929 m
 10808 1003 l gs col1 s gr 
% Polyline
n 10808 929 m
 10718 1003 l gs col1 s gr 
% here ends figure;
$F2psEnd
rs
end
showpage
%%Trailer
%EOF
