%!PS-Adobe-2.0 EPSF-2.0
%%Title: neighbors2d_8c.fig
%%Creator: fig2dev Version 3.2 Patchlevel 5
%%CreationDate: Wed May  7 16:30:35 2008
%%For: tremblais@moriarty (Benoit TREMBLAIS,,,,)
%%BoundingBox: 0 0 88 88
%Magnification: 1.0000
%%EndComments
%%BeginProlog
/$F2psDict 200 dict def
$F2psDict begin
$F2psDict /mtrx matrix put
/col-1 {0 setgray} bind def
/col0 {0.000 0.000 0.000 srgb} bind def
/col1 {0.000 0.000 1.000 srgb} bind def
/col2 {0.000 1.000 0.000 srgb} bind def
/col3 {0.000 1.000 1.000 srgb} bind def
/col4 {1.000 0.000 0.000 srgb} bind def
/col5 {1.000 0.000 1.000 srgb} bind def
/col6 {1.000 1.000 0.000 srgb} bind def
/col7 {1.000 1.000 1.000 srgb} bind def
/col8 {0.000 0.000 0.560 srgb} bind def
/col9 {0.000 0.000 0.690 srgb} bind def
/col10 {0.000 0.000 0.820 srgb} bind def
/col11 {0.530 0.810 1.000 srgb} bind def
/col12 {0.000 0.560 0.000 srgb} bind def
/col13 {0.000 0.690 0.000 srgb} bind def
/col14 {0.000 0.820 0.000 srgb} bind def
/col15 {0.000 0.560 0.560 srgb} bind def
/col16 {0.000 0.690 0.690 srgb} bind def
/col17 {0.000 0.820 0.820 srgb} bind def
/col18 {0.560 0.000 0.000 srgb} bind def
/col19 {0.690 0.000 0.000 srgb} bind def
/col20 {0.820 0.000 0.000 srgb} bind def
/col21 {0.560 0.000 0.560 srgb} bind def
/col22 {0.690 0.000 0.690 srgb} bind def
/col23 {0.820 0.000 0.820 srgb} bind def
/col24 {0.500 0.190 0.000 srgb} bind def
/col25 {0.630 0.250 0.000 srgb} bind def
/col26 {0.750 0.380 0.000 srgb} bind def
/col27 {1.000 0.500 0.500 srgb} bind def
/col28 {1.000 0.630 0.630 srgb} bind def
/col29 {1.000 0.750 0.750 srgb} bind def
/col30 {1.000 0.880 0.880 srgb} bind def
/col31 {1.000 0.840 0.000 srgb} bind def

end

/cp {closepath} bind def
/ef {eofill} bind def
/gr {grestore} bind def
/gs {gsave} bind def
/sa {save} bind def
/rs {restore} bind def
/l {lineto} bind def
/m {moveto} bind def
/rm {rmoveto} bind def
/n {newpath} bind def
/s {stroke} bind def
/sh {show} bind def
/slc {setlinecap} bind def
/slj {setlinejoin} bind def
/slw {setlinewidth} bind def
/srgb {setrgbcolor} bind def
/rot {rotate} bind def
/sc {scale} bind def
/sd {setdash} bind def
/ff {findfont} bind def
/sf {setfont} bind def
/scf {scalefont} bind def
/sw {stringwidth} bind def
/tr {translate} bind def
/tnt {dup dup currentrgbcolor
  4 -2 roll dup 1 exch sub 3 -1 roll mul add
  4 -2 roll dup 1 exch sub 3 -1 roll mul add
  4 -2 roll dup 1 exch sub 3 -1 roll mul add srgb}
  bind def
/shd {dup dup currentrgbcolor 4 -2 roll mul 4 -2 roll mul
  4 -2 roll mul srgb} bind def
/$F2psBegin {$F2psDict begin /$F2psEnteredState save def} def
/$F2psEnd {$F2psEnteredState restore end} def

/pageheader {
save
newpath 0 88 moveto 0 0 lineto 88 0 lineto 88 88 lineto closepath clip newpath
-253.7 228.2 translate
1 -1 scale
$F2psBegin
10 setmiterlimit
0 slj 0 slc
 0.06299 0.06299 sc
} bind def
/pagefooter {
$F2psEnd
restore
} bind def
%%EndProlog
pageheader
%
% Fig objects follow
%
% 
% here starts figure with depth 50
% Polyline
0 slj
0 slc
15.000 slw
n 4050 2250 m 4500 2250 l 4500 2700 l 4050 2700 l
 cp gs col0 s gr 
% Polyline
n 4500 2250 m 4950 2250 l 4950 2700 l 4500 2700 l
 cp gs col0 s gr 
% Polyline
n 4950 2250 m 5400 2250 l 5400 2700 l 4950 2700 l
 cp gs col0 s gr 
% Polyline
n 4050 2700 m 4500 2700 l 4500 3150 l 4050 3150 l
 cp gs col0 s gr 
% Polyline
n 4500 2700 m 4950 2700 l 4950 3150 l 4500 3150 l
 cp gs col0 s gr 
% Polyline
n 4950 2700 m 5400 2700 l 5400 3150 l 4950 3150 l
 cp gs col0 s gr 
% Polyline
n 4050 3150 m 4500 3150 l 4500 3600 l 4050 3600 l
 cp gs col0 s gr 
% Polyline
n 4500 3150 m 4950 3150 l 4950 3600 l 4500 3600 l
 cp gs col0 s gr 
% Polyline
n 4950 3150 m 5400 3150 l 5400 3600 l 4950 3600 l
 cp gs col0 s gr 
/Times-Roman ff 317.50 scf sf
5130 3015 m
gs 1 -1 sc (0) col1 sh gr
/Times-Roman ff 317.50 scf sf
5130 2610 m
gs 1 -1 sc (1) col1 sh gr
/Times-Roman ff 317.50 scf sf
4230 2610 m
gs 1 -1 sc (3) col1 sh gr
/Times-Roman ff 317.50 scf sf
4680 2610 m
gs 1 -1 sc (2) col1 sh gr
/Times-Roman ff 317.50 scf sf
4230 3015 m
gs 1 -1 sc (4) col1 sh gr
/Times-Roman ff 317.50 scf sf
4230 3465 m
gs 1 -1 sc (5) col1 sh gr
/Times-Roman ff 317.50 scf sf
4680 3465 m
gs 1 -1 sc (6) col1 sh gr
/Times-Roman ff 317.50 scf sf
5130 3510 m
gs 1 -1 sc (7) col1 sh gr
% here ends figure;
pagefooter
showpage
%%Trailer
%EOF
