%!PS-Adobe-2.0 EPSF-2.0
%%Title: fftshift2d.fig
%%Creator: fig2dev Version 3.2 Patchlevel 5-alpha7
%%CreationDate: Thu May 29 15:57:07 2008
%%For: arrivault@caldell (Arrivault Denis)
%%BoundingBox: 0 0 344 179
%Magnification: 1.0000
%%EndComments
/$F2psDict 200 dict def
$F2psDict begin
$F2psDict /mtrx matrix put
/col-1 {0 setgray} bind def
/col0 {0.000 0.000 0.000 srgb} bind def
/col1 {0.000 0.000 1.000 srgb} bind def
/col2 {0.000 1.000 0.000 srgb} bind def
/col3 {0.000 1.000 1.000 srgb} bind def
/col4 {1.000 0.000 0.000 srgb} bind def
/col5 {1.000 0.000 1.000 srgb} bind def
/col6 {1.000 1.000 0.000 srgb} bind def
/col7 {1.000 1.000 1.000 srgb} bind def
/col8 {0.000 0.000 0.560 srgb} bind def
/col9 {0.000 0.000 0.690 srgb} bind def
/col10 {0.000 0.000 0.820 srgb} bind def
/col11 {0.530 0.810 1.000 srgb} bind def
/col12 {0.000 0.560 0.000 srgb} bind def
/col13 {0.000 0.690 0.000 srgb} bind def
/col14 {0.000 0.820 0.000 srgb} bind def
/col15 {0.000 0.560 0.560 srgb} bind def
/col16 {0.000 0.690 0.690 srgb} bind def
/col17 {0.000 0.820 0.820 srgb} bind def
/col18 {0.560 0.000 0.000 srgb} bind def
/col19 {0.690 0.000 0.000 srgb} bind def
/col20 {0.820 0.000 0.000 srgb} bind def
/col21 {0.560 0.000 0.560 srgb} bind def
/col22 {0.690 0.000 0.690 srgb} bind def
/col23 {0.820 0.000 0.820 srgb} bind def
/col24 {0.500 0.190 0.000 srgb} bind def
/col25 {0.630 0.250 0.000 srgb} bind def
/col26 {0.750 0.380 0.000 srgb} bind def
/col27 {1.000 0.500 0.500 srgb} bind def
/col28 {1.000 0.630 0.630 srgb} bind def
/col29 {1.000 0.750 0.750 srgb} bind def
/col30 {1.000 0.880 0.880 srgb} bind def
/col31 {1.000 0.840 0.000 srgb} bind def

end
save
newpath 0 179 moveto 0 0 lineto 344 0 lineto 344 179 lineto closepath clip newpath
-62.3 189.7 translate
1 -1 scale

/cp {closepath} bind def
/ef {eofill} bind def
/gr {grestore} bind def
/gs {gsave} bind def
/sa {save} bind def
/rs {restore} bind def
/l {lineto} bind def
/m {moveto} bind def
/rm {rmoveto} bind def
/n {newpath} bind def
/s {stroke} bind def
/sh {show} bind def
/slc {setlinecap} bind def
/slj {setlinejoin} bind def
/slw {setlinewidth} bind def
/srgb {setrgbcolor} bind def
/rot {rotate} bind def
/sc {scale} bind def
/sd {setdash} bind def
/ff {findfont} bind def
/sf {setfont} bind def
/scf {scalefont} bind def
/sw {stringwidth} bind def
/tr {translate} bind def
/tnt {dup dup currentrgbcolor
  4 -2 roll dup 1 exch sub 3 -1 roll mul add
  4 -2 roll dup 1 exch sub 3 -1 roll mul add
  4 -2 roll dup 1 exch sub 3 -1 roll mul add srgb}
  bind def
/shd {dup dup currentrgbcolor 4 -2 roll mul 4 -2 roll mul
  4 -2 roll mul srgb} bind def
/$F2psBegin {$F2psDict begin /$F2psEnteredState save def} def
/$F2psEnd {$F2psEnteredState restore end} def

$F2psBegin
10 setmiterlimit
0 slj 0 slc
 0.06000 0.06000 sc
%
% Fig objects follow
%
% 
% here starts figure with depth 50
% Polyline
0 slj
0 slc
7.500 slw
n 1050 1350 m 1650 1350 l 1650 1950 l 1050 1950 l
 cp gs col0 s gr 
% Polyline
n 1650 1350 m 2250 1350 l 2250 1950 l 1650 1950 l
 cp gs col0 s gr 
% Polyline
n 2250 1350 m 2850 1350 l 2850 1950 l 2250 1950 l
 cp gs col0 s gr 
% Polyline
n 2850 1350 m 3450 1350 l 3450 1950 l 2850 1950 l
 cp gs col0 s gr 
% Polyline
n 1050 1950 m 1650 1950 l 1650 2550 l 1050 2550 l
 cp gs col0 s gr 
% Polyline
n 1650 1950 m 2250 1950 l 2250 2550 l 1650 2550 l
 cp gs col0 s gr 
% Polyline
n 2250 1950 m 2850 1950 l 2850 2550 l 2250 2550 l
 cp gs col0 s gr 
% Polyline
n 2850 1950 m 3450 1950 l 3450 2550 l 2850 2550 l
 cp gs col0 s gr 
% Polyline
n 1050 2550 m 1650 2550 l 1650 3150 l 1050 3150 l
 cp gs col0 s gr 
% Polyline
n 1650 2550 m 2250 2550 l 2250 3150 l 1650 3150 l
 cp gs col0 s gr 
% Polyline
n 2250 2550 m 2850 2550 l 2850 3150 l 2250 3150 l
 cp gs col0 s gr 
% Polyline
n 2850 2550 m 3450 2550 l 3450 3150 l 2850 3150 l
 cp gs col0 s gr 
% Polyline
n 1050 750 m 1650 750 l 1650 1350 l 1050 1350 l
 cp gs col0 s gr 
% Polyline
n 1650 750 m 2250 750 l 2250 1350 l 1650 1350 l
 cp gs col0 s gr 
% Polyline
n 2250 750 m 2850 750 l 2850 1350 l 2250 1350 l
 cp gs col0 s gr 
% Polyline
n 2850 750 m 3450 750 l 3450 1350 l 2850 1350 l
 cp gs col0 s gr 
/Times-Roman ff 266.67 scf sf
1950 1050 m
gs 1 -1 sc (1) col0 sh gr
/Times-Roman ff 266.67 scf sf
2550 1050 m
gs 1 -1 sc (2) col0 sh gr
/Times-Roman ff 266.67 scf sf
3150 1050 m
gs 1 -1 sc (3) col0 sh gr
/Times-Roman ff 266.67 scf sf
1350 1050 m
gs 1 -1 sc (0) col0 sh gr
/Times-Roman ff 266.67 scf sf
1350 1650 m
gs 1 -1 sc (4) col0 sh gr
/Times-Roman ff 266.67 scf sf
1950 1650 m
gs 1 -1 sc (5) col0 sh gr
/Times-Roman ff 266.67 scf sf
2550 1650 m
gs 1 -1 sc (6) col0 sh gr
/Times-Roman ff 266.67 scf sf
3150 1650 m
gs 1 -1 sc (7) col0 sh gr
/Times-Roman ff 266.67 scf sf
1350 2250 m
gs 1 -1 sc (8) col0 sh gr
/Times-Roman ff 266.67 scf sf
1950 2250 m
gs 1 -1 sc (9) col0 sh gr
/Times-Roman ff 266.67 scf sf
1200 2850 m
gs 1 -1 sc (12) col0 sh gr
/Times-Roman ff 266.67 scf sf
2400 2250 m
gs 1 -1 sc (10) col0 sh gr
/Times-Roman ff 266.67 scf sf
3000 2250 m
gs 1 -1 sc (11) col0 sh gr
/Times-Roman ff 266.67 scf sf
1800 2850 m
gs 1 -1 sc (13) col0 sh gr
/Times-Roman ff 266.67 scf sf
2400 2850 m
gs 1 -1 sc (14) col0 sh gr
/Times-Roman ff 266.67 scf sf
3000 2850 m
gs 1 -1 sc (15) col0 sh gr
% Polyline
n 4350 1950 m 4950 1950 l 4950 2550 l 4350 2550 l
 cp gs col0 s gr 
% Polyline
n 4950 1950 m 5550 1950 l 5550 2550 l 4950 2550 l
 cp gs col0 s gr 
% Polyline
n 5550 1950 m 6150 1950 l 6150 2550 l 5550 2550 l
 cp gs col0 s gr 
% Polyline
n 6150 1950 m 6750 1950 l 6750 2550 l 6150 2550 l
 cp gs col0 s gr 
% Polyline
n 4350 750 m 4950 750 l 4950 1350 l 4350 1350 l
 cp gs col0 s gr 
% Polyline
n 4950 750 m 5550 750 l 5550 1350 l 4950 1350 l
 cp gs col0 s gr 
% Polyline
n 5550 750 m 6150 750 l 6150 1350 l 5550 1350 l
 cp gs col0 s gr 
% Polyline
n 6150 750 m 6750 750 l 6750 1350 l 6150 1350 l
 cp gs col0 s gr 
% Polyline
n 4350 2550 m 4950 2550 l 4950 3150 l 4350 3150 l
 cp gs col0 s gr 
% Polyline
n 4950 2550 m 5550 2550 l 5550 3150 l 4950 3150 l
 cp gs col0 s gr 
% Polyline
n 5550 2550 m 6150 2550 l 6150 3150 l 5550 3150 l
 cp gs col0 s gr 
% Polyline
n 6150 2550 m 6750 2550 l 6750 3150 l 6150 3150 l
 cp gs col0 s gr 
% Polyline
n 4350 1350 m 4950 1350 l 4950 1950 l 4350 1950 l
 cp gs col0 s gr 
% Polyline
n 4950 1350 m 5550 1350 l 5550 1950 l 4950 1950 l
 cp gs col0 s gr 
% Polyline
n 5550 1350 m 6150 1350 l 6150 1950 l 5550 1950 l
 cp gs col0 s gr 
% Polyline
n 6150 1350 m 6750 1350 l 6750 1950 l 6150 1950 l
 cp gs col0 s gr 
/Times-Roman ff 266.67 scf sf
5850 2250 m
gs 1 -1 sc (0) col0 sh gr
/Times-Roman ff 266.67 scf sf
6450 2250 m
gs 1 -1 sc (1) col0 sh gr
/Times-Roman ff 266.67 scf sf
4650 2250 m
gs 1 -1 sc (2) col0 sh gr
/Times-Roman ff 266.67 scf sf
5250 2250 m
gs 1 -1 sc (3) col0 sh gr
/Times-Roman ff 266.67 scf sf
5850 2850 m
gs 1 -1 sc (4) col0 sh gr
/Times-Roman ff 266.67 scf sf
6450 2850 m
gs 1 -1 sc (5) col0 sh gr
/Times-Roman ff 266.67 scf sf
4650 2850 m
gs 1 -1 sc (6) col0 sh gr
/Times-Roman ff 266.67 scf sf
5250 2850 m
gs 1 -1 sc (7) col0 sh gr
/Times-Roman ff 266.67 scf sf
5850 1050 m
gs 1 -1 sc (8) col0 sh gr
/Times-Roman ff 266.67 scf sf
6450 1050 m
gs 1 -1 sc (9) col0 sh gr
/Times-Roman ff 266.67 scf sf
4500 1050 m
gs 1 -1 sc (10) col0 sh gr
/Times-Roman ff 266.67 scf sf
5100 1050 m
gs 1 -1 sc (11) col0 sh gr
/Times-Roman ff 266.67 scf sf
5700 1650 m
gs 1 -1 sc (12) col0 sh gr
/Times-Roman ff 266.67 scf sf
6300 1650 m
gs 1 -1 sc (13) col0 sh gr
/Times-Roman ff 266.67 scf sf
5100 1650 m
gs 1 -1 sc (15) col0 sh gr
/Times-Roman ff 266.67 scf sf
4500 1650 m
gs 1 -1 sc (14) col0 sh gr
/Times-Roman ff 333.33 scf sf
1350 450 m
gs 1 -1 sc (Before shifting) col0 sh gr
/Times-Roman ff 333.33 scf sf
4650 450 m
gs 1 -1 sc (After shifting) col0 sh gr
% here ends figure;
$F2psEnd
rs
showpage
%%Trailer
%EOF
