%!PS-Adobe-3.0 EPSF-3.0
%%Creator: GIMP PostScript file plugin V 1,17 by Peter Kirchgessner
%%Title: Conventions_4d_Space.eps
%%CreationDate: Mon Aug 26 14:28:25 2013
%%DocumentData: Clean7Bit
%%LanguageLevel: 2
%%Pages: 1
%%BoundingBox: 14 14 148 151
%%EndComments
%%BeginProlog
% Use own dictionary to avoid conflicts
10 dict begin
%%EndProlog
%%Page: 1 1
% Translate for offset
14.173228346456694 14.173228346456694 translate
% Translate to begin of first scanline
0 136.80000000000001 translate
133.20000000000002 -136.80000000000001 scale
% Image geometry
185 190 8
% Transformation matrix
[ 185 0 0 190 0 0 ]
% Strings to hold RGB-samples per scanline
/rstr 185 string def
/gstr 185 string def
/bstr 185 string def
{currentfile /ASCII85Decode filter /RunLengthDecode filter rstr readstring pop}
{currentfile /ASCII85Decode filter /RunLengthDecode filter gstr readstring pop}
{currentfile /ASCII85Decode filter /RunLengthDecode filter bstr readstring pop}
true 3
%%BeginData:        10259 ASCII Bytes
colorimage
JcEgkJ,~>
JcEgkJ,~>
JcEgkJ,~>
JcEgkJ,~>
JcEgkJ,~>
JcEgkJ,~>
JcEgkJ,~>
JcEgkJ,~>
JcEgkJ,~>
JcEgkJ,~>
JcEgkJ,~>
JcEgkJ,~>
JcEgkJ,~>
JcEgkJ,~>
JcEgkJ,~>
JcEgkJ,~>
JcEgkJ,~>
JcEgkJ,~>
JcEgkJ,~>
JcEgkJ,~>
JcEgkJ,~>
JcEgkJ,~>
JcEgkJ,~>
JcEgkJ,~>
JcEgkJ,~>
JcEgkJ,~>
JcEgkJ,~>
JcEgkJ,~>
JcEgkJ,~>
JcEgkJ,~>
JcEgkJ,~>
JcEgkJ,~>
JcEgkJ,~>
JcGHD!586$!5I=hJ,~>
JcGHD!586$!5I=hJ,~>
JcGHD!586$!5I=hJ,~>
JcGKE$2I-5kc56QjL\dSs*t~>
JcGKE$2I-5kc56QjL\dSs*t~>
JcGKE$2I-5kc56QjL\dSs*t~>
JcGKE"h!+bs+=5KrrAJBs*t~>
JcGKE"h!+bs+=5KrrAJBs*t~>
JcGKE"h!+bs+=5KrrAJBs*t~>
JcGKE!5ea8"[\CPs8L'os*t~>
JcGKE!5ea8"[\CPs8L'os*t~>
JcGKE!5ea8"[\CPs8L'os*t~>
JcGBB!r*&Lf`-I~>
JcGBB!r*&Lf`-I~>
JcGBB!r*&Lf`-I~>
JcGBB!l>WLf`-I~>
JcGBB!l>WLf`-I~>
JcGBB!l>WLf`-I~>
JcGBB!J+/#s*t~>
JcGBB!J+/#s*t~>
JcGBB!J+/#s*t~>
JcGBB!C;n#s*t~>
JcGBB!C;n#s*t~>
JcGBB!C;n#s*t~>
JcGEC!quuJfDg@~>
JcGEC!quuJfDg@~>
JcGEC!quuJfDg@~>
JcGKE"m1nP$&,J5s*t~>
JcGKE"m1nP$&,J5s*t~>
JcGKE"m1nP$&,J5s*t~>
JcEgkJ,~>
JcEgkJ,~>
JcEgkJ,~>
JcEgkJ,~>
JcEgkJ,~>
JcEgkJ,~>
JcEgkJ,~>
JcEgkJ,~>
JcEgkJ,~>
JcEgkJ,~>
JcEgkJ,~>
JcEgkJ,~>
JcEgkJ,~>
JcEgkJ,~>
JcEgkJ,~>
JcGEC!r]s$fDg@~>
JcGEC!r]s$fDg@~>
JcGEC!r]s$fDg@~>
JcGKE"P@H*!.ic%J,~>
JcGKE"P@H*!.ic%J,~>
JcGKE"P@H*!.ic%J,~>
JcGHD"8L7Ff%9qP~>
JcGHD"8L7Ff%9qP~>
JcGHD"8L7Ff%9qP~>
JcGBB!)V8HJ,~>
JcGBB!)V8HJ,~>
JcGBB!)V8HJ,~>
JcGNF"M/7Gs2NXiJ,~>
JcGNF"M/7Gs2NXiJ,~>
JcGNF"M/7Gs2NXiJ,~>
JcGQG!jNHZe,Op~>
JcGQG!jNHZe,Op~>
JcGQG!jNHZe,Op~>
JcGTH!kK)\df4g~>
JcGTH!kK)\df4g~>
JcGTH!kK)\df4g~>
JcGTH!Q;e$s*t~>
JcGTH!Q;e$s*t~>
JcGTH!Q;e$s*t~>
JcEgkJ,~>
JcEgkJ,~>
JcEgkJ,~>
JcG]K!<(1BJ,~>
JcG]K!<(1BJ,~>
JcG]K!<(1BJ,~>
JcG`L!kCAkcMrC~>
JcG`L!kCAkcMrC~>
JcG`L!kCAkcMrC~>
JcGcM!jEBYc2W:~>
JcGcM!jEBYc2W:~>
JcGcM!jEBYc2W:~>
Jc>iP^_FT.s*t~>
Jc>iP^_FT.s*t~>
Jc>iP^_FT.s*t~>
])N,bOd2'qs8Uf8PKM>R!U.MGs*t~>
])N,bOd2'qs8Uf8PKM>R!U.MGs*t~>
])N,bOd2'qs8Uf8PKM>R!U.MGs*t~>
\c2`P!5SU6"8kg2rL3b:~>
\c2`P!5SU6"8kg2rL3b:~>
\c2`P!5SU6"8kg2rL3b:~>
\GlRdFoMCAQ0Qiu!:n21J,~>
\GlRdFoMCAQ0Qiu!:n21J,~>
\GlRdFoMCAQ0Qiu!:n21J,~>
\Gl_r)>sN4g=-''\K:Fbs*t~>
\Gl_r)>sN4g=-''\K:Fbs*t~>
\Gl_r)>sN4g=-''\K:Fbs*t~>
\Gl]u"h;.be,KKR'ZS2nJ,~>
\Gl]u"h;.be,KKR'ZS2nJ,~>
\Gl]u"h;.be,KKR'ZS2nJ,~>
\,QM.3k!N;!m_Rr`rCP~>
\,QM.3k!N;!m_Rr`rCP~>
\,QM.3k!N;!m_Rr`rCP~>
\,QJX<RUmJr6rXbJ,~>
\,QJX<RUmJr6rXbJ,~>
\,QJX<RUmJr6rXbJ,~>
\,QIqS!<r'~>
\,QIqS!<r'~>
\,QIqS!<r'~>
\GlX)#hdc.!9_2uJ,~>
\GlX)#hdc.!9_2uJ,~>
\GlX)#hdc.!9_2uJ,~>
\c2fB?jV\XfDboj)<A[7J,~>
\c2fB?jV\XfDboj)<A[7J,~>
\c2fB?jV\XfDboj)<A[7J,~>
MuNjk)pH.uJ,~>
MuNjk)pH.uJ,~>
MuNjk)pH.uJ,~>
N;itA)8X,gJ,~>
N;itA)8X,gJ,~>
N;itA)8X,gJ,~>
MuNe?^]/f~>
MuNe?^]/f~>
MuNe?^]/f~>
JcEgkJ,~>
JcEgkJ,~>
JcEgkJ,~>
[Jp6ph#@E(qRliY~>
[Jp6ph#@E(qRliY~>
[Jp6ph#@E(qRliY~>
[f6B:@GUqb_\ph6s*t~>
[f6B:@GUqb_\ph6s*t~>
[f6B:@GUqb_\ph6s*t~>
\,QR01BZ=frrThPbe*n*~>
\,QR01BZ=frrThPbe*n*~>
\,QR01BZ=frrThPbe*n*~>
\,QQ?/1Y8hrrVmA_Rfbt~>
\,QQ?/1Y8hrrVmA_Rfbt~>
\,QQ?/1Y8hrrVmA_Rfbt~>
\,QT!o`1iPi;WfP\c70~>
\,QT!o`1iPi;WfP\c70~>
\,QT!o`1iPi;WfP\c70~>
[Jp4,Q2c@~>
[Jp4,Q2c@~>
[Jp4,Q2c@~>
[Jp4,ir9&!j0nu<~>
[Jp4,ir9&!j0nu<~>
[Jp4,ir9&!j0nu<~>
[Jp4,j8T1t)9'&aJ,~>
[Jp4,j8T1t)9'&aJ,~>
[Jp4,j8T1t)9'&aJ,~>
[Jp4,jSo:n)pPejJ,~>
[Jp4,jSo:n)pPejJ,~>
[Jp4,jSo:n)pPejJ,~>
[Jp4,jo5D]7`2V5J,~>
[Jp4,jo5D]7`2V5J,~>
[Jp4,jo5D]7`2V5J,~>
[Jp4,Q2c@~>
[Jp4,Q2c@~>
[Jp4,Q2c@~>
[Jp4,Q2c@~>
[Jp4,Q2c@~>
[Jp4,Q2c@~>
[Jp4,kl1\#]<M<c~>
[Jp4,kl1\#]<M<c~>
[Jp4,kl1\#]<M<c~>
[Jp4,l2Lgs)pPVeJ,~>
[Jp4,l2Lgs)pPVeJ,~>
[Jp4,l2Lgs)pPVeJ,~>
[Jp4,lMgpt)pPSdJ,~>
[Jp4,lMgpt)pPSdJ,~>
[Jp4,lMgpt)pPSdJ,~>
[Jp4,lMgm+`30,j~>
[Jp4,lMgm+`30,j~>
[Jp4,lMgm+`30,j~>
[Jp4,Q2c@~>
[Jp4,Q2c@~>
[Jp4,Q2c@~>
[Jp4,Q2c@~>
[Jp4,Q2c@~>
[Jp4,Q2c@~>
[Jp4,mf*=)NN3#/~>
[Jp4,mf*=)NN3#/~>
[Jp4,mf*=)NN3#/~>
[Jp4,n,EI$)pPD_J,~>
[Jp4,n,EI$)pPD_J,~>
[Jp4,n,EI$)pPD_J,~>
[Jp4,nG`R%)pPA^J,~>
[Jp4,nG`R%)pPA^J,~>
[Jp4,nG`R%)pPA^J,~>
[Jp4,nG`N``2N]d~>
[Jp4,nG`N``2N]d~>
[Jp4,nG`N``2N]d~>
[Jp4,Q2c@~>
[Jp4,Q2c@~>
[Jp4,Q2c@~>
[Jp4,Q2c@~>
[Jp4,Q2c@~>
[Jp4,Q2c@~>
[Jp4,o`"s.?DRUO~>
[Jp4,o`"s.?DRUO~>
[Jp4,o`"s.?DRUO~>
[Jp4,p&>*#(sSlVJ,~>
[Jp4,p&>*#(sSlVJ,~>
[Jp4,p&>*#(sSlVJ,~>
[Jp4,pAY30'u$ICJ,~>
[Jp4,pAY30'u$ICJ,~>
[Jp4,pAY30'u$ICJ,~>
[Jp4,pAY09];#=U~>
[Jp4,pAY09];#=U~>
[Jp4,pAY09];#=U~>
[Jp4,Q2c@~>
[Jp4,Q2c@~>
[Jp4,Q2c@~>
[Jp4,q>UHnT)X<~>
[Jp4,q>UHnT)X<~>
[Jp4,q>UHnT)X<~>
[Jp4,qYpW42>j*HJ,~>
[Jp4,qYpW42>j*HJ,~>
[Jp4,qYpW42>j*HJ,~>
[Jp4,qu6`)'>pFAJ,~>
[Jp4,qu6`)'>pFAJ,~>
[Jp4,qu6`)'>pFAJ,~>
[Jp4,r;Qi<'Y0e7J,~>
[Jp4,r;Qi<'Y0e7J,~>
[Jp4,r;Qi<'Y0e7J,~>
[Jp4,r;Qfa_4:OU~>
[Jp4,r;Qfa_4:OU~>
[Jp4,r;Qfa_4:OU~>
[Jp4,Q2c@~>
[Jp4,Q2c@~>
[Jp4,Q2c@~>
[Jp=/s8VYWs*t~>
[Jp=/s8VYWs*t~>
[Jp=/s8VYWs*t~>
[Jp@0s1]QCRK%d~>
[Jp@0s1]QCRK%d~>
[Jp@0s1]QCRK%d~>
[Jp=/ZP16Ds*t~>
[Jp=/ZP16Ds*t~>
[Jp=/ZP16Ds*t~>
[Jp:.'Y9Y2J,~>
[Jp:.'Y9Y2J,~>
[Jp:.'Y9Y2J,~>
[Jp7-d['o`~>
[Jp7-d['o`~>
[Jp7-d['o`~>
[Jp4,Q2c@~>
[Jp4,Q2c@~>
[Jp4,Q2c@~>
\GlZes8N(as*t~>
\GlZes8N(as*t~>
\GlZes8N(as*t~>
\c2fH'\r]gQ2c@~>
\c2fH'\r]gQ2c@~>
\c2fH'\r]gQ2c@~>
])Mr?'?'qN!1!S7~>
])Mr?'?'qN!1!S7~>
])Mr?'?'qN!1!S7~>
]Dhru(;'SG!!&;aJ,~>
]Dhru(;'SG!!&;aJ,~>
]Dhru(;'SG!!&;aJ,~>
])McprVlitQ2c@~>
])McprVlitQ2c@~>
])McprVlitQ2c@~>
[Jp4,Q2c@~>
[Jp4,Q2c@~>
[Jp4,Q2c@~>
^Ae5VpA4dh!1!S7~>
^Ae5VpA4dh!1!S7~>
^Ae5VpA4dh!1!S7~>
^]+AK'Zp4O!!&;aJ,~>
^]+AK'Zp4O!!&;aJ,~>
^]+AK'Zp4O!!&;aJ,~>
_#FJA'?'_H!!&;aJ,~>
_#FJA'?'_H!!&;aJ,~>
_#FJA'?'_H!!&;aJ,~>
_>aT4.D5HU!!&;aJ,~>
_>aT4.D5HU!!&;aJ,~>
_>aT4.D5HU!!&;aJ,~>
_#FE0p\t3nQ2c@~>
_#FE0p\t3nQ2c@~>
_#FE0p\t3nQ2c@~>
[Jp4,Q2c@~>
[Jp4,Q2c@~>
[Jp4,Q2c@~>
`;]kQg[tLG!1!S7~>
`;]kQg[tLG!1!S7~>
`;]kQg[tLG!1!S7~>
`W$"Q'Yj;?!!&;aJ,~>
`W$"Q'Yj;?!!&;aJ,~>
`W$"Q'Yj;?!!&;aJ,~>
`r?+G'?'MB!!&;aJ,~>
`r?+G'?'MB!!&;aJ,~>
`r?+G'?'MB!!&;aJ,~>
`r?'5]^l(&!1!S7~>
`r?'5]^l(&!1!S7~>
`r?'5]^l(&!1!S7~>
[Jp4,Q2c@~>
[Jp4,Q2c@~>
[Jp4,Q2c@~>
[Jp4,Q2c@~>
[Jp4,Q2c@~>
[Jp4,Q2c@~>
b5VLTYO;Dj!1!S7~>
b5VLTYO;Dj!1!S7~>
b5VLTYO;Dj!1!S7~>
bPqXL'ZKM?!!&;aJ,~>
bPqXL'ZKM?!!&;aJ,~>
bPqXL'ZKM?!!&;aJ,~>
bl7aM'ZKJ>!!&;aJ,~>
bl7aM'ZKJ>!!&;aJ,~>
bl7aM'ZKJ>!!&;aJ,~>
bl7]k^$Pb!!1!S7~>
bl7]k^$Pb!!1!S7~>
bl7]k^$Pb!!1!S7~>
[Jp4,Q2c@~>
[Jp4,Q2c@~>
[Jp4,Q2c@~>
[Jp4,Q2c@~>
[Jp4,Q2c@~>
[Jp4,Q2c@~>
d/O-ZId$e3!1!S7~>
d/O-ZId$e3!1!S7~>
d/O-ZId$e3!1!S7~>
dJj9Q'ZK;9!!&;aJ,~>
dJj9Q'ZK;9!!&;aJ,~>
dJj9Q'ZK;9!!&;aJ,~>
df0BR'ZK88!!&;aJ,~>
df0BR'ZK88!!&;aJ,~>
df0BR'ZK88!!&;aJ,~>
df0?M^?5Fq!1!S7~>
df0?M^?5Fq!1!S7~>
df0?M^?5Fq!1!S7~>
[Jp4,Q2c@~>
[Jp4,Q2c@~>
[Jp4,Q2c@~>
[Jp4,Q2c@~>
[Jp4,Q2c@~>
[Jp4,Q2c@~>
f)Gc_:?)9R!1!S7~>
f)Gc_:?)9R!1!S7~>
f)Gc_:?)9R!1!S7~>
fDboW'ZK)3!!&;aJ,~>
fDboW'ZK)3!!&;aJ,~>
fDboW'ZK)3!!&;aJ,~>
f`)#d'YiW,!!&;aJ,~>
f`)#d'YiW,!!&;aJ,~>
f`)#d'YiW,!!&;aJ,~>
f`)!*^u54m!3H2,oobT&a8aJJPd0l\J,~>
f`)!*^u54m!3H2,oobT&a8aJJPd0l\J,~>
f`)!*^u54m!3H2,oobT&a8aJJPd0l\J,~>
[Jp4,X8`J!10OSUq`Vdmo`'F~>
[Jp4,X8`J!10OSUq`Vdmo`'F~>
[Jp4,X8`J!10OSUq`Vdmo`'F~>
g]%9Kh#@?SWrE6t'_hTbk48P&~>
g]%9Kh#@?SWrE6t'_hTbk48P&~>
g]%9Kh#@?SWrE6t'_hTbk48P&~>
h#@Ge.Jhm#!!'P/!ogB]pAY9j'qglNnc++~>
h#@Ge.Jhm#!!'P/!ogB]pAY9j'qglNnc++~>
h#@Ge.Jhm#!!'P/!ogB]pAY9j'qglNnc++~>
h>[P]'ZSr.!!'M."+h\aqtL*lH5G9(s*t~>
h>[P]'ZSr.!!'M."+h\aqtL*lH5G9(s*t~>
h>[P]'ZSr.!!'M."+h\aqtL*lH5G9(s*t~>
hZ!Yt'YiH'!Pg%j!!36.R.pU^Rf^\#s*t~>
hZ!Yt'YiH'!Pg%j!!36.R.pU^Rf^\#s*t~>
hZ!Yt'YiH'!Pg%j!!36.R.pU^Rf^\#s*t~>
hZ!WLbM<+!Y8bcsrr`0qJ*cq0"1#g@>k%cD~>
hZ!WLbM<+!Y8bcsrr`0qJ*cq0"1#g@>k%cD~>
hZ!WLbM<+!Y8bcsrr`0qJ*cq0"1#g@>k%cD~>
\GlW2+4dq$!T`G;rrp*Hs1AR$nc++~>
\GlW2+4dq$!T`G;rrp*Hs1AR$nc++~>
\GlW2+4dq$!T`G;rrp*Hs1AR$nc++~>
iVroBgA_5I+5!Un#.U`6s8FF#nc++~>
iVroBgA_5I+5!Un#.U`6s8FF#nc++~>
iVroBgA_5I+5!Un#.U`6s8FF#nc++~>
ir9(j([TrW!hCXpX8`OBA-oXCs1Ks&N;E/GJ,~>
ir9(j([TrW!hCXpX8`OBA-oXCs1Ks&N;E/GJ,~>
ir9(j([TrW!hCXpX8`OBA-oXCs1Ks&N;E/GJ,~>
j8T1b'ZSr.!g+hgOoKq~>
j8T1b'ZSr.!g+hgOoKq~>
j8T1b'ZSr.!g+hgOoKq~>
jSo;9'YrN(!f\epOT0h~>
jSo;9'YrN(!f\epOT0h~>
jSo;9'YrN(!f\epOT0h~>
j8T,8h#@G+0BnPtJ,~>
j8T,8h#@G+0BnPtJ,~>
j8T,8h#@G+0BnPtJ,~>
^Ae7Y2t)e,J,~>
^Ae7Y2t)e,J,~>
^Ae7Y2t)e,J,~>
kPkS2rS7DTrbFRaNW4M~>
kPkS2rS7DTrbFRaNW4M~>
kPkS2rS7DTrbFRaNW4M~>
kl1^o'\D1@"8uk"oSig#~>
kl1^o'\D1@"8uk"oSig#~>
kl1^o'\D1@"8uk"oSig#~>
l2Lgh'ZSu/"8c:loo&j#~>
l2Lgh'ZSu/"8c:loo&j#~>
l2Lgh'ZSu/"8c:loo&j#~>
lMgqS)o:A1"8c1sq253&~>
lMgqS)o:A1"8c1sq253&~>
lMgqS)o:A1"8c1sq253&~>
l2LbSh>[TP9iUtGs*t~>
l2LbSh>[TP9iUtGs*t~>
l2LbSh>[TP9iUtGs*t~>
`W$&78mhLPs*t~>
`W$&78mhLPs*t~>
`W$&78mhLPs*t~>
mJd42nD+$Go0@*jL];l~>
mJd42nD+$Go0@*jL];l~>
mJd42nD+$Go0@*jL];l~>
mf*@,)9CY6"7\NmreCH'~>
mf*@,)9CY6"7\NmreCH'~>
mf*@,)9CY6"7\NmreCH'~>
n,EI%)pI.<!pqglK`?Q~>
n,EI%)pI.<!pqglK`?Q~>
n,EI%)pI.<!pqglK`?Q~>
nG`Rf28S,K!p_RsKE$H~>
nG`Rf28S,K!p_RsKE$H~>
nG`Rf28S,K!p_RsKE$H~>
n,ECdh>[Q=.Yr]VJ,~>
n,ECdh>[Q=.Yr]VJ,~>
n,ECdh>[Q=.Yr]VJ,~>
bPqY).$]A`J,~>
bPqY).$]A`J,~>
bPqY).$]A`J,~>
oD\j0dG4a'h'/8<rrE(L~>
oD\j0dG4a'h'/8<rrE(L~>
oD\j0dG4a'h'/8<rrE(L~>
o`#!1)8b50!o"oqJcGcMJ,~>
o`#!1)8b50!o"oqJcGcMJ,~>
o`#!1)8b50!o"oqJcGcMJ,~>
p&>*+)pR4=!n/0gJcG`LJ,~>
p&>*+)pR4=!n/0gJcG`LJ,~>
p&>*+)pR4=!n/0gJcG`LJ,~>
p&>%u_VP4nd2fQEs8DtJ~>
p&>%u_VP4nd2fQEs8DtJ~>
p&>%u_VP4nd2fQEs8DtJ~>
d/O0h)7G+rr;V9~>
d/O0h)7G+rr;V9~>
d/O0h)7G+rr;V9~>
df0E\`Z2dFs82hH~>
df0E\`Z2dFs82hH~>
df0E\`Z2dFs82hH~>
q>UK4UYYqPiC+X%JcGTHJ,~>
q>UK4UYYqPiC+X%JcGTHJ,~>
q>UK4UYYqPiC+X%JcGTHJ,~>
qYpW/)pR4="-XUknU^`:s*t~>
qYpW/)pR4="-XUknU^`:s*t~>
qYpW/)pR4="-XUknU^`:s*t~>
qu6`0)pR1<"?ulCMsGroqu;0~>
qu6`0)pR1<"?ulCMsGroqu;0~>
qu6`0)pR1<"?ulCMsGroqu;0~>
qu6\U_qb7npP7OTs7lVE~>
qu6\U_qb7npP7OTs7lVE~>
qu6\U_qb7npP7OTs7lVE~>
JcEgkJ,~>
JcEgkJ,~>
JcEgkJ,~>
JcEgkJ,~>
JcEgkJ,~>
JcEgkJ,~>
JcEgkJ,~>
JcEgkJ,~>
JcEgkJ,~>
JcEgkJ,~>
JcEgkJ,~>
JcEgkJ,~>
ec,lfMi3^]O-BQos8;nI~>
ec,lfMi3^]O-BQos8;nI~>
ec,lfMi3^]O-BQos8;nI~>
ec,h5S*U(B/=(kequ;0~>
ec,h5S*U(B/=(kequ;0~>
ec,h5S*U(B/=(kequ;0~>
f)Gs2RK*<]5C7t]qYu'~>
f)Gs2RK*<]5C7t]qYu'~>
f)Gs2RK*<]5C7t]qYu'~>
f)Grtp](1l@/b`WqYu'~>
f)Grtp](1l@/b`WqYu'~>
f)Grtp](1l@/b`WqYu'~>
eGfXMDFjVTs7u\F~>
eGfXMDFjVTs7u\F~>
eGfXMDFjVTs7u\F~>
eGfT-2"Q:uq#>j~>
eGfT-2"Q:uq#>j~>
eGfT-2"Q:uq#>j~>
ec,fK-0bI0a+=9es*t~>
ec,fK-0bI0a+=9es*t~>
ec,fK-0bI0a+=9es*t~>
f)Grc)r1Jnh6MV3qYu'~>
f)Grc)r1Jnh6MV3qYu'~>
f)Grc)r1Jnh6MV3qYu'~>
fDc*$(s;mYpf$m;s8)bG~>
fDc*$(s;mYpf$m;s8)bG~>
fDc*$(s;mYpf$m;s8)bG~>
f`)3F(e0:6CEQ`1s7u\F~>
f`)3F(e0:6CEQ`1s7u\F~>
f`)3F(e0:6CEQ`1s7u\F~>
JcEgkJ,~>
JcEgkJ,~>
JcEgkJ,~>
JcEgkJ,~>
JcEgkJ,~>
JcEgkJ,~>
JcEgkJ,~>
JcEgkJ,~>
JcEgkJ,~>
JcEgkJ,~>
JcEgkJ,~>
JcEgkJ,~>
JcEgkJ,~>
JcEgkJ,~>
JcEgkJ,~>
JcEgkJ,~>
JcEgkJ,~>
JcEgkJ,~>
JcEgkJ,~>
JcEgkJ,~>
JcEgkJ,~>
JcEgkJ,~>
JcEgkJ,~>
JcEgkJ,~>
JcEgkJ,~>
JcEgkJ,~>
JcEgkJ,~>
JcEgkJ,~>
JcEgkJ,~>
JcEgkJ,~>
JcEgkJ,~>
JcEgkJ,~>
JcEgkJ,~>
JcEgkJ,~>
JcEgkJ,~>
JcEgkJ,~>
JcEgkJ,~>
JcEgkJ,~>
JcEgkJ,~>
%%EndData
showpage
%%Trailer
end
%%EOF
