#FIG 3.2  Produced by xfig version 3.2.5
Landscape
Center
Metric
A4      
100.00
Single
-2
1200 2
6 1755 2205 3195 3645
2 2 0 2 0 7 50 -1 -1 0.000 0 0 -1 0 0 5
	 1800 2250 2250 2250 2250 2700 1800 2700 1800 2250
2 2 0 2 0 7 50 -1 -1 0.000 0 0 -1 0 0 5
	 2250 2250 2700 2250 2700 2700 2250 2700 2250 2250
2 2 0 2 0 7 50 -1 -1 0.000 0 0 -1 0 0 5
	 2700 2250 3150 2250 3150 2700 2700 2700 2700 2250
2 2 0 2 0 7 50 -1 -1 0.000 0 0 -1 0 0 5
	 1800 2700 2250 2700 2250 3150 1800 3150 1800 2700
2 2 0 2 0 7 50 -1 -1 0.000 0 0 -1 0 0 5
	 2250 2700 2700 2700 2700 3150 2250 3150 2250 2700
2 2 0 2 0 7 50 -1 -1 0.000 0 0 -1 0 0 5
	 2700 2700 3150 2700 3150 3150 2700 3150 2700 2700
2 2 0 2 0 7 50 -1 -1 0.000 0 0 -1 0 0 5
	 1800 3150 2250 3150 2250 3600 1800 3600 1800 3150
2 2 0 2 0 7 50 -1 -1 0.000 0 0 -1 0 0 5
	 2250 3150 2700 3150 2700 3600 2250 3600 2250 3150
2 2 0 2 0 7 50 -1 -1 0.000 0 0 -1 0 0 5
	 2700 3150 3150 3150 3150 3600 2700 3600 2700 3150
-6
6 4005 2205 5445 3645
2 2 0 2 0 7 50 -1 -1 0.000 0 0 -1 0 0 5
	 4050 2250 4500 2250 4500 2700 4050 2700 4050 2250
2 2 0 2 0 7 50 -1 -1 0.000 0 0 -1 0 0 5
	 4500 2250 4950 2250 4950 2700 4500 2700 4500 2250
2 2 0 2 0 7 50 -1 -1 0.000 0 0 -1 0 0 5
	 4950 2250 5400 2250 5400 2700 4950 2700 4950 2250
2 2 0 2 0 7 50 -1 -1 0.000 0 0 -1 0 0 5
	 4050 2700 4500 2700 4500 3150 4050 3150 4050 2700
2 2 0 2 0 7 50 -1 -1 0.000 0 0 -1 0 0 5
	 4500 2700 4950 2700 4950 3150 4500 3150 4500 2700
2 2 0 2 0 7 50 -1 -1 0.000 0 0 -1 0 0 5
	 4950 2700 5400 2700 5400 3150 4950 3150 4950 2700
2 2 0 2 0 7 50 -1 -1 0.000 0 0 -1 0 0 5
	 4050 3150 4500 3150 4500 3600 4050 3600 4050 3150
2 2 0 2 0 7 50 -1 -1 0.000 0 0 -1 0 0 5
	 4500 3150 4950 3150 4950 3600 4500 3600 4500 3150
2 2 0 2 0 7 50 -1 -1 0.000 0 0 -1 0 0 5
	 4950 3150 5400 3150 5400 3600 4950 3600 4950 3150
-6
6 6255 2205 7695 3645
2 2 0 2 0 7 50 -1 -1 0.000 0 0 -1 0 0 5
	 6300 2250 6750 2250 6750 2700 6300 2700 6300 2250
2 2 0 2 0 7 50 -1 -1 0.000 0 0 -1 0 0 5
	 6750 2250 7200 2250 7200 2700 6750 2700 6750 2250
2 2 0 2 0 7 50 -1 -1 0.000 0 0 -1 0 0 5
	 7200 2250 7650 2250 7650 2700 7200 2700 7200 2250
2 2 0 2 0 7 50 -1 -1 0.000 0 0 -1 0 0 5
	 6300 2700 6750 2700 6750 3150 6300 3150 6300 2700
2 2 0 2 0 7 50 -1 -1 0.000 0 0 -1 0 0 5
	 6750 2700 7200 2700 7200 3150 6750 3150 6750 2700
2 2 0 2 0 7 50 -1 -1 0.000 0 0 -1 0 0 5
	 7200 2700 7650 2700 7650 3150 7200 3150 7200 2700
2 2 0 2 0 7 50 -1 -1 0.000 0 0 -1 0 0 5
	 6300 3150 6750 3150 6750 3600 6300 3600 6300 3150
2 2 0 2 0 7 50 -1 -1 0.000 0 0 -1 0 0 5
	 6750 3150 7200 3150 7200 3600 6750 3600 6750 3150
2 2 0 2 0 7 50 -1 -1 0.000 0 0 -1 0 0 5
	 7200 3150 7650 3150 7650 3600 7200 3600 7200 3150
-6
4 0 1 50 -1 0 20 0.0000 4 225 165 1980 2565 4\001
4 0 1 50 -1 0 20 0.0000 4 225 165 2430 2565 3\001
4 0 1 50 -1 0 20 0.0000 4 225 165 2835 2565 2\001
4 0 1 50 -1 0 20 0.0000 4 225 165 2835 3015 1\001
4 0 1 50 -1 0 20 0.0000 4 225 165 2430 3015 0\001
4 0 1 50 -1 0 20 0.0000 4 240 165 1980 3015 5\001
4 0 1 50 -1 0 20 0.0000 4 225 165 1980 3465 6\001
4 0 1 50 -1 0 20 0.0000 4 225 165 2430 3465 7\001
4 0 1 50 -1 0 20 0.0000 4 225 165 2835 3465 8\001
4 0 1 50 -1 0 20 0.0000 4 240 165 5085 3015 9\001
4 0 1 50 -1 0 20 0.0000 4 225 330 4995 2565 10\001
4 0 1 50 -1 0 20 0.0000 4 225 330 4590 2565 11\001
4 0 1 50 -1 0 20 0.0000 4 225 330 4095 2565 12\001
4 0 1 50 -1 0 20 0.0000 4 225 330 4140 3015 22\001
4 0 1 50 -1 0 20 0.0000 4 225 330 4140 3465 23\001
4 0 1 50 -1 0 20 0.0000 4 225 330 4590 3465 24\001
4 0 1 50 -1 0 20 0.0000 4 240 330 5040 3465 25\001
4 0 1 50 -1 0 20 0.0000 4 240 330 7245 2565 19\001
4 0 1 50 -1 0 20 0.0000 4 225 330 7245 3015 18\001
4 0 1 50 -1 0 20 0.0000 4 225 330 7290 3465 17\001
4 0 1 50 -1 0 20 0.0000 4 225 330 6840 3465 16\001
4 0 1 50 -1 0 20 0.0000 4 225 330 6840 3015 13\001
4 0 1 50 -1 0 20 0.0000 4 225 330 6345 3015 14\001
4 0 1 50 -1 0 20 0.0000 4 240 330 6345 3465 15\001
4 0 1 50 -1 0 20 0.0000 4 225 330 6840 2565 20\001
4 0 1 50 -1 0 20 0.0000 4 225 330 6345 2565 21\001
4 0 0 50 -1 0 20 0.0000 4 225 420 2250 3960 z-1\001
4 0 0 50 -1 0 20 0.0000 4 150 150 4635 3915 z\001
4 0 0 50 -1 0 20 0.0000 4 225 495 6795 3915 z+1\001
