0 1
1 1
2 -1
3 2
4 -3
5 4
6 1
7 -8
8 8
9 5
10 -20
11 16
12 -1
13 18
14 -48
15 32
16 -7
17 56
18 -112
19 64
20 1
21 -32
22 160
23 -256
24 128
25 9
26 -120
27 432
28 -576
29 256
30 -1
31 50
32 -400
33 1120
34 -1280
35 512
36 -11
37 220
38 -1232
39 2816
40 -2816
41 1024
42 1
43 -72
44 840
45 -3584
46 6912
47 -6144
48 2048
49 13
50 -364
51 2912
52 -9984
53 16640
54 -13312
55 4096
56 -1
57 98
58 -1568
59 9408
60 -26880
61 39424
62 -28672
63 8192
64 -15
65 560
66 -6048
67 28800
68 -70400
69 92160
70 -61440
71 16384
72 1
73 -128
74 2688
75 -21504
76 84480
77 -180224
78 212992
79 -131072
80 32768
81 17
82 -816
83 11424
84 -71808
85 239360
86 -452608
87 487424
88 -278528
89 65536
90 -1
91 162
92 -4320
93 44352
94 -228096
95 658944
96 -1118208
97 1105920
98 -589824
99 131072
100 -19
101 1140
102 -20064
103 160512
104 -695552
105 1770496
106 -2723840
107 2490368
108 -1245184
109 262144
110 1
111 -200
112 6600
113 -84480
114 549120
115 -2050048
116 4659200
117 -6553600
118 5570560
119 -2621440
120 524288
121 21
122 -1540
123 33264
124 -329472
125 1793792
126 -5870592
127 12042240
128 -15597568
129 12386304
130 -5505024
131 1048576
132 -1
133 242
134 -9680
135 151008
136 -1208064
137 5637632
138 -16400384
139 30638080
140 -36765696
141 27394048
142 -11534336
143 2097152
144 -23
145 2024
146 -52624
147 631488
148 -4209920
149 17145856
150 -44843008
151 76873728
152 -85917696
153 60293120
154 -24117248
155 4194304
156 1
157 -288
158 13728
159 -256256
160 2471040
161 -14057472
162 50692096
163 -120324096
164 190513152
165 -199229440
166 132120576
167 -50331648
168 8388608
169 25
170 -2600
171 80080
172 -1144000
173 9152000
174 -45260800
175 146227200
176 -317521920
177 466944000
178 -458752000
179 288358400
180 -104857600
181 16777216
182 -1
183 338
184 -18928
185 416416
186 -4759040
187 32361472
188 -141213696
189 412778496
190 -825556992
191 1133117440
192 -1049624576
193 627048448
194 -218103808
195 33554432
196 -27
197 3276
198 -117936
199 1976832
200 -18670080
201 109983744
202 -428654592
203 1143078912
204 -2118057984
205 2724986880
206 -2387607552
207 1358954496
208 -452984832
209 67108864
210 1
211 -392
212 25480
213 -652288
214 8712704
215 -69701632
216 361181184
217 -1270087680
218 3111714816
219 -5369233408
220 6499598336
221 -5402263552
222 2936012800
223 -939524096
224 134217728
225 29
226 -4060
227 168896
228 -3281408
229 36095488
230 -249387008
231 1151016960
232 -3683254272
233 8341487616
234 -13463453696
235 15386804224
236 -12163481600
237 6325010432
238 -1946157056
239 268435456
240 -1
241 450
242 -33600
243 990080
244 -15275520
245 141892608
246 -859955200
247 3572121600
248 -10478223360
249 22052208640
250 -33426505728
251 36175872000
252 -27262976000
253 13589544960
254 -4026531840
255 536870912
256 -31
257 4960
258 -236096
259 5261568
260 -66646528
261 533172224
262 -2870927360
263 10827497472
264 -29297934336
265 57567870976
266 -82239815680
267 84515225600
268 -60850962432
269 29125246976
270 -8321499136
271 1073741824
272 1
273 -512
274 43520
275 -1462272
276 25798656
277 -275185664
278 1926299648
279 -9313976320
280 32133218304
281 -80648077312
282 148562247680
283 -200655503360
284 196293427200
285 -135291469824
286 62277025792
287 -17179869184
288 2147483648
289 33
290 -5984
291 323136
292 -8186112
293 118243840
294 -1083543552
295 6723526656
296 -29455450112
297 93564370944
298 -218864025600
299 379364311040
300 -485826232320
301 453437816832
302 -299708186624
303 132875550720
304 -35433480192
305 4294967296
306 -1
307 578
308 -55488
309 2108544
310 -42170880
311 511673344
312 -4093386752
313 22761029632
314 -91044118528
315 267776819200
316 -586290298880
317 959384125440
318 -1167945891840
319 1042167103488
320 -661693399040
321 282930970624
322 -73014444032
323 8589934592
324 -35
325 7140
326 -434112
327 12403200
328 -202585600
329 2106890240
330 -14910300160
331 74977509376
332 -275652608000
333 754417664000
334 -1551944908800
335 2404594483200
336 -2789329600512
337 2384042393600
338 -1456262348800
339 601295421440
340 -150323855360
341 17179869184
342 1
343 -648
344 69768
345 -2976768
346 66977280
347 -916844544
348 8307167232
349 -52581629952
350 240999137280
351 -819082035200
352 2095125626880
353 -4063273943040
354 5977134858240
355 -6620826304512
356 5429778186240
357 -3195455668224
358 1275605286912
359 -309237645312
360 34359738368
361 37
362 -8436
363 573648
364 -18356736
365 336540160
366 -3940579328
367 31524634624
368 -180140769280
369 757650882560
370 -2392581734400
371 5742196162560
372 -10531142369280
373 14743599316992
374 -15625695002624
375 12315818721280
376 -6992206757888
377 2701534429184
378 -635655159808
379 68719476736
380 -1
381 722
382 -86640
383 4124064
384 -103690752
385 1589924864
386 -16188325888
387 115630899200
388 -601280675840
389 2334383800320
390 -6880289095680
391 15547666268160
392 -27039419596800
393 36108024938496
394 -36681168191488
395 27827093110784
396 -15260018802688
397 5712306503680
398 -1305670057984
399 137438953472
400 -39
401 9880
402 -746928
403 26604864
404 -543921664
405 7120429056
406 -63901286400
407 411402567680
408 -1960212234240
409 7061349335040
410 -19502774353920
411 41626474905600
412 -68822438510592
413 87841744879616
414 -85678155104256
415 62646392979456
416 -33221572034560
417 12060268167168
418 -2680059592704
419 274877906944
420 1
421 -800
422 106400
423 -5617920
424 156900480
425 -2677768192
426 30429184000
427 -243433472000
428 1424085811200
429 -6254808268800
430 21002987765760
431 -54553214976000
432 110292369408000
433 -173752901959680
434 212364657950720
435 -199183403319296
436 140552804761600
437 -72155450572800
438 25426206392320
439 -5497558138880
440 549755813888
441 41
442 -11480
443 959728
444 -37840704
445 857722624
446 -12475965440
447 124759654400
448 -898269511680
449 4808383856640
450 -19570965872640
451 61508749885440
452 -150732904857600
453 289407177326592
454 -435347548798976
455 510407471005696
456 -461013199618048
457 314327181557760
458 -156371169312768
459 53532472377344
460 -11269994184704
461 1099511627776
462 -1
463 882
464 -129360
465 7537376
466 -232581888
467 4393213440
468 -55381114880
469 492952780800
470 -3220624834560
471 15871575982080
472 -60144919511040
473 177570714746880
474 -411758179123200
475 752567256612864
476 -1083059755548672
477 1219998345330688
478 -1062579203997696
479 700809813688320
480 -338168545017856
481 112562502893568
482 -23089744183296
483 2199023255552
484 -43
485 13244
486 -1218448
487 52915456
488 -1322886400
489 21262392320
490 -235521884160
491 1884175073280
492 -11249633525760
493 51314117836800
494 -181798588907520
495 505874334351360
496 -1112923535572992
497 1940482062024704
498 -2676526982103040
499 2901009890279424
500 -2439485589553152
501 1557990796689408
502 -729869562413056
503 236394999971840
504 -47278999994368
505 4398046511104
506 1
507 -968
508 155848
509 -9974272
510 338412800
511 -7038986240
512 97905899520
513 -963996549120
514 6988974981120
515 -38370843033600
516 162773155184640
517 -541167892561920
518 1423506847825920
519 -2978414327758848
520 4964023879598080
521 -6573052309536768
522 6864598984556544
523 -5579780992794624
524 3454150138396672
525 -1572301627719680
526 495879744126976
527 -96757023244288
528 8796093022208
529 45
530 -15180
531 1530144
532 -72864000
533 1999712000
534 -35340364800
535 431333683200
536 -3812168171520
537 25227583488000
538 -128055803904000
539 507344899276800
540 -1588210119475200
541 3959937231224832
542 -7897310717542400
543 12604574741299200
544 -16047114509352960
545 16168683558666240
546 -12717552782278656
547 7638169839206400
548 -3380998255411200
549 1039038488248320
550 -197912092999680
551 17592186044416
552 -1
553 1058
554 -186208
555 13034560
556 -484140800
557 11038410240
558 -168586629120
559 1826663915520
560 -14613311324160
561 88826010009600
562 -418884762992640
563 1555857691115520
564 -4599927086776320
565 10898288790208512
566 -20758645314682880
567 31782201792135168
568 -38958828003262464
569 37917148110127104
570 -28889255702953984
571 16848641306132480
572 -7257876254949376
573 2174833999740928
574 -404620279021568
575 35184372088832
576 -47
577 17296
578 -1902560
579 98933120
580 -2967993600
581 57417185280
582 -768506941440
583 7465496002560
584 -54454206136320
585 305707823923200
586 -1345114425262080
587 4699925501706240
588 -13159791404777472
589 29693888297959424
590 -54121865370664960
591 79611518093623296
592 -94086339565191168
593 88551849002532864
594 -65416681245114368
595 37078280867676160
596 -15554790998147072
597 4547580092481536
598 -826832744087552
599 70368744177664
600 1
601 -1152
602 220800
603 -16839680
604 682007040
605 -16974397440
606 283420999680
607 -3363677798400
608 29544303329280
609 -197734422282240
610 1030300410839040
611 -4246086541639680
612 13999778090188800
613 -37217871599763456
614 80146421910601728
615 -140025932533465088
616 198181864190509056
617 -226089827240509440
618 205992953708019712
619 -147682003796361216
620 81414437990301696
621 -33284415996035072
622 9499780463984640
623 -1688849860263936
624 140737488355328
625 49
626 -19600
627 2344160
628 -132612480
629 4332007680
630 -91365980160
631 1335348940800
632 -14192851599360
633 113542812794880
634 -701176668487680
635 3405715246940160
636 -13192098584985600
637 41159347585155072
638 -104129631497486336
639 214414709191868416
640 -359663383160553472
641 490450067946209280
642 -540731503483551744
643 477402588661153792
644 -332442288460398592
645 178383666978750464
646 -71116412084551680
647 19826393672056832
648 -3448068464705536
649 281474976710656
650 -1
651 1250
652 -260000
653 21528000
654 -947232000
655 25638412800
656 -466152960000
657 6034375680000
658 -57930006528000
659 424820047872000
660 -2432653747814400
661 11057517035520000
662 -40383975260160000
663 119536566770073600
664 -288405684905574400
665 568855350917201920
666 -917508630511616000
667 1206989963132928000
668 -1287455960675123200
669 1102487181118668800
670 -746299014911098880
671 390051749953536000
672 -151732604633088000
673 41341637204377600
674 -7036874417766400
675 562949953421312
676 -51
677 22100
678 -2864160
679 175668480
680 -6226471680
681 142642805760
682 -2267654860800
683 26261602959360
684 -229402825850880
685 1550816764231680
686 -8271022742568960
687 35307132656025600
688 -121927298105475072
689 343202765037633536
690 -791226079003017216
691 1497374084994957312
692 -2325467328969441280
693 2954711429749407744
694 -3052314510011400192
695 2537416650697736192
696 -1670981696800948224
697 851219911991623680
698 -323291602938232832
699 86131342873460736
700 -14355223812243456
701 1125899906842624
702 1
703 -1352
704 304200
705 -27256320
706 1298568960
707 -38091356160
708 751438571520
709 -10569685401600
710 110453212446720
711 -883625699573760
712 5534287276277760
713 -27599562520657920
714 110998240572211200
715 -363391162981023744
716 974811214980841472
717 -2151307508923236352
718 3912256800501530624
719 -5857924621071810560
720 7196878820173938688
721 -7207116201141469184
722 5821132316306571264
723 -3732015143555432448
724 1854172428616335360
725 -687924843080843264
726 179299560164687872
727 -29273397577908224
728 2251799813685248
729 53
730 -24804
731 3472560
732 -230181120
733 8823609600
734 -218825518080
735 3770532003840
736 -47400973762560
737 450309250744320
738 -3318068163379200
739 19339597295124480
740 -90506257697341440
741 343923779249897472
742 -1069985090999681024
743 2740848508964700160
744 -5799989102841430016
745 10149980929972502528
746 -14670560671893028864
747 17446072150359277568
748 -16951649052980674560
749 13313246329414090752
750 -8315250199102488576
751 4031636460170903552
752 -1461981029035147264
753 372954344141619200
754 -59672695062659072
755 4503599627370496
756 -1
757 1458
758 -353808
759 34201440
760 -1758931200
761 55738575360
762 -1189089607680
763 18110749409280
764 -205255159971840
765 1784244201062400
766 -12170423603036160
767 66278757110906880
768 -292010755966894080
769 1051238721480818688
770 -3114781396980203520
771 7633004526852636672
772 -15512235006184390656
773 26157886481016815616
774 -36538000163959996416
775 42099260501860024320
776 -39724430422267920384
777 30358507802383613952
778 -18484672826821312512
779 8751197763422650368
780 -3103261618234982400
781 775182085861146624
782 -121597189939003392
783 9007199254740992
784 -55
785 27720
786 -4180176
787 298584000
788 -12341472000
789 330302668800
790 -6148711219200
791 83622472581120
792 -860819570688000
793 6886556565504000
794 -43680444501196800
795 223063771919155200
796 -927945291183685632
797 3172462533961318400
798 -8970411302925107200
799 21065998156546703360
800 -41174450942341283840
801 66986333633926660096
802 -90522072478279270400
803 101150170056700723200
804 -92762107173949931520
805 69032265803869716480
806 -41000982113813528576
807 18964376555880448000
808 -6579477580611584000
809 1610036866784952320
810 -247697979505377280
811 18014398509481984
812 1
813 -1568
814 409248
815 -42561792
816 2356099200
817 -80421519360
818 1849694945280
819 -30408171847680
820 372500105134080
821 -3505883342438400
822 25943536734044160
823 -153639646113300480
824 738138299805204480
825 -2907129303848189952
826 9459706464902840320
827 -25573827132702851072
828 57644231319277797376
829 -108506788365699383296
830 170510667431813316608
831 -223143405458418565120
832 242024770535669366784
833 -215882722150283476992
834 156549204434560745472
835 -90753161991049707520
836 41032014729995878400
837 -13934137247084314624
838 3341670923508908032
839 -504403158265495552
840 36028797018963968
841 57
842 -30856
843 4998672
844 -383707584
845 17053670400
846 -491145707520
847 9848101109760
848 -144438816276480
849 1605819780956160
850 -13898323250380800
851 95567517969285120
852 -530343064145756160
853 2404221890794094592
854 -8986721141657698304
855 27889824232730787840
856 -72213652421952405504
857 156462913580896878592
858 -283999910365325426688
859 431543407341905903616
860 -547436980973537853440
861 576811648245288665088
862 -500797710104436670464
863 354099390982935019520
864 -200470700537979863040
865 88643507040603340800
866 -29478311360953581568
867 6931039826523193344
868 -1026820715040473088
869 72057594037927936
870 -1
871 1682
872 -470960
873 52559136
874 -3123514368
875 114528860160
876 -2831986360320
877 50104374067200
878 -661377737687040
879 6717522904350720
880 -53740183234805760
881 344774682051870720
882 -1798824428096716800
883 7715573085436379136
884 -27433148748218236928
885 81353475598164426752
886 -202071536163182608384
887 421432615527493140480
888 -738510488162464169984
889 1086230220142230372352
890 -1336898732482745073664
891 1369506018640860807168
892 -1158144624643434086400
893 798951943956919746560
894 -441973415805955604480
895 191221151328290996224
896 -62298293645416071168
897 14366482811311882240
898 -2089670227099910144
899 144115188075855872
900 -59
901 34220
902 -5940592
903 488825856
904 -23300699136
905 720203427840
906 -15512073830400
907 244647564410880
908 -2928575256330240
909 27333369059082240
910 -203047884438896640
911 1219892428249497600
912 -6001870746987528192
913 24417867312530456576
914 -82756121729167261696
915 234920603618281259008
916 -560605985907262095360
917 1126865141420311707648
918 -1908564383666834243584
919 2719897421257998598144
920 -3250609113210778812416
921 3239809747386158284800
922 -2670388640269803192320
923 1798374588451819356160
924 -972590338652514549760
925 411920614017535574016
926 -131527627117355335680
927 29759786337664237568
928 -4251398048237748224
929 288230376151711744
930 1
931 -1800
932 539400
933 -64440320
934 4101166080
935 -161130258432
936 4272393216000
937 -81128521728000
938 1150672866508800
939 -12574673417011200
940 108406921352970240
941 -750870450929664000
942 4238609284595712000
943 -19719314579411435520
944 76268883373279150080
945 -246865719056498950144
946 671912743399745126400
947 -1542644587342017331200
948 2992240771003087585280
949 -4903358987475898859520
950 6776693574998742269952
951 -7870724245062418432000
952 7637764119415750656000
953 -6139729224496526131200
954 4038722592709594316800
955 -2136401828633320095744
956 886139521680487219200
957 -277421737046022553600
958 61609242902428385280
959 -8646911284551352320
960 576460752303423488
961 61
962 -37820
963 7019392
964 -617706496
965 31503031296
966 -1042463944704
967 24056860262400
968 -406904607866880
969 5229920989347840
970 -52482715893104640
971 419861727144837120
972 -2721633330108825600
973 14479089316178952192
974 -63856496471353327616
975 235293888475725561856
976 -728652041731279159296
977 1904431472706752348160
978 -4212154316104346370048
979 7893045925673009414144
980 -12526615396209796317184
981 16803996263208263352320
982 -18981258237510995148800
983 17945916879101304504320
984 -14077833037444871618560
985 9050035524071703183360
986 -4684724271284175765504
987 1903806670478329774080
988 -584603260429709344768
989 127469883853094518784
990 -17582052945254416384
991 1152921504606846976
992 -1
993 1922
994 -615040
995 78479104
996 -5336579072
997 224136321024
998 -6357321105408
999 129242242252800
1000 -1964482082242560
1001 23034515395706880
1002 -213372353139179520
1003 1590593905219338240
1004 -9681875944813363200
1005 48677493211769339904
1006 -203981876315985805312
1007 717453496007950073856
1008 -2129216826862303444992
1009 5351507532755522027520
1010 -11416549403211780325376
1011 20689450838821917687808
1012 -31829924367418334904320
1013 41478716771478945136640
1014 -45600280594437740953600
1015 42031562982699135139840
1016 -32194388667599337553920
1017 20236472876776726462464
1018 -10255588064248838750208
1019 4085035078002682101760
1020 -1230815763761847074816
1021 263586678990740389888
1022 -35740566642812256256
1023 2305843009213693952
1024 -63
1025 41664
1026 -8249472
1027 774664704
1028 -42176189440
1029 1490736586752
1030 -36771502473216
1031 665389092372480
1032 -9158885153832960
1033 98551746684518400
1034 -846606433423196160
1035 5902821140547502080
1036 -33842841205805678592
1037 161211482894892007424
1038 -643257641107697172480
1039 2163559033747179307008
1040 -6162865126431359238144
1041 14915169381615390425088
1042 -30726144732096570064896
1043 53905517073853631692800
1044 -80463844998044933160960
1045 101938691780468885422080
1046 -109146478067976786411520
1047 98140959002843141898240
1048 -73438812859270378291200
1049 45157670024837628690432
1050 -22414982798976007274496
1051 8754673416435073548288
1052 -2589101411376788668416
1053 544755410926735196160
1054 -72634054790231359488
1055 4611686018427387904
1056 1
1057 -2048
1058 698368
1059 -94978048
1060 6885908480
1061 -308488699904
1062 9338794278912
1063 -202785247199232
1064 3295260266987520
1065 -41352285703372800
1066 410475846508216320
1067 -3283806772065730560
1068 21487518225908367360
1069 -116363175623380697088
1070 526404842105769820160
1071 -2003968778223344418816
1072 6456334894356662059008
1073 -17677237785618240503808
1074 41246888166442561175552
1075 -82141740303015057817600
1076 139640958515125598289920
1077 -202406406767568811458560
1078 249477664155375511797760
1079 -260324519118652707962880
1080 228476306673285621350400
1081 -167114098595317483044864
1082 100570928113924096131072
1083 -48915000675954696650752
1084 18740162596631994171392
1085 -5441789501744317726720
1086 1125251388496282648576
1087 -147573952589676412928
1088 9223372036854775808
1089 65
1090 -45760
1091 9646208
1092 -964620800
1093 55948006400
1094 -2107713986560
1095 55449091031040
1096 -1070959586770944
1097 15749405687808000
1098 -181256318091264000
1099 1667558126439628800
1100 -12470434684678963200
1101 76817877657622413312
1102 -393937834141653401600
1103 1696067325319236812800
1104 -6171496590193868144640
1105 19075534915144683356160
1106 -50269644952851871432704
1107 113219921064981692416000
1108 -218188997679883747328000
1109 359745762028296129740800
1110 -506751505315606508339200
1111 608101806378727810007040
1112 -618789997240148557824000
1113 530391426205841620992000
1114 -379385867215472594780160
1115 223556839026824199536640
1116 -106584674768344466849792
1117 40069426604640777011200
1118 -11428334414415370649600
1119 2323136831782796656640
1120 -299759591197780213760
1121 18446744073709551616
1122 -1
1123 2178
1124 -789888
1125 114270464
1126 -8815150080
1127 420384712704
1128 -13554222252032
1129 313683429261312
1130 -5437179440529408
1131 72851097078988800
1132 -772988482690744320
1133 6618923024944988160
1134 -46428387595266293760
1135 269998930938625523712
1136 -1314280510389076623360
1137 5396103428861818044416
1138 -18799328074744398348288
1139 55828307615907607216128
1140 -141786178072146304040960
1141 308581582432978442649600
1142 -576018953874893092945920
1143 921897930824161070940160
1144 -1262980674786588528476160
1145 1476528131876108327976960
1146 -1466056301153582736998400
1147 1227896951007000725028864
1148 -859342662544869285691392
1149 496028678729603095724032
1150 -231909512133320927870976
1151 85580642711025871749120
1152 -23981920217327023947776
1153 4793847616155269726208
1154 -608742554432415203328
1155 36893488147419103232
1156 -67
1157 50116
1158 -11225984
1159 1193161728
1160 -73578306560
1161 2948483411968
1162 -82557535535104
1163 1698326445293568
1164 -26623764568866816
1165 326958512249241600
1166 -3213535091821117440
1167 25708280734568939520
1168 -169674652848155000832
1169 933935696018904449024
1170 -4324628346097390059520
1171 16963703447917504233472
1172 -56674191064633480052736
1173 161926260184667085864960
1174 -396792277209274300497920
1175 835352162545840632627200
1176 -1511783669778082315632640
1177 2350547366963928650219520
1178 -3134063155951904866959360
1179 3571846260992365213777920
1180 -3462504028513007094988800
1181 2835179769229474044837888
1182 -1942242164116562770919424
1183 1098642032227550658297856
1184 -503888450871282632753152
1185 182589619836467114147840
1186 -50286977266436844552192
1187 9887454823508319666176
1188 -1235931852938539958272
1189 73786976294838206464
1190 1
1191 -2312
1192 890120
1193 -136722432
1194 11201473536
1195 -567541325824
1196 19451189075968
1197 -478798500331520
1198 8833832331116544
1199 -126098626216722432
1200 1426905507189227520
1201 -13045993208587223040
1202 97844949064404172800
1203 -609348236634935525376
1204 3182151902426885521408
1205 -14045360121056598163456
1206 52726734970579406815232
1207 -169176689745174567321600
1208 465638698441480475770880
1209 -1102166136851527043645440
1210 2246723278966574358200320
1211 -3945465270380325702205440
1212 5964075408714445828915200
1213 -7744654443779918061895680
1214 8609748823138313164554240
1215 -8152905008033014915006464
1216 6529702201003817375367168
1217 -4380513006962728637562880
1218 2429193576588422244466688
1219 -1093357544453591137255424
1220 389161159890261252243456
1221 -105367802149028958830592
1222 20383652201449054535680
1223 -2508757194024499019776
1224 147573952589676412928
1225 69
1226 -54740
1227 13006224
1228 -1466606592
1229 95981253632
1230 -4083566063616
1231 121459913687040
1232 -2655923445956608
1233 44291429231099904
1234 -579155764682686464
1235 6067346106199572480
1236 -51800267151743385600
1237 365364550976963346432
1238 -2152632169288775499776
1239 10688932150951161102336
1240 -45054423690030700560384
1241 162127661005792293683200
1242 -500279639675016220508160
1243 1328069674092235252039680
1244 -3039684436248894719918080
1245 6005230227711231032033280
1246 -10241477907724580054630400
1247 15062213973380796524789760
1248 -19061155148552201337569280
1249 20682001674789633424097280
1250 -19140989785295503874850816
1251 15001646566124197521653760
1252 -9859668046153007933423616
1253 5362275604048127121686528
1254 -2369304708743649388658688
1255 828609297046959349039104
1256 -220623059121566237327360
1257 42003236255836649029632
1258 -5091301364343836246016
1259 295147905179352825856
1260 -1
1261 2450
1262 -999600
1263 162734880
1264 -14134686720
1265 759503833088
1266 -27618321203200
1267 721718327705600
1268 -14145679223029760
1269 214681484678922240
1270 -2585217036554600448
1271 25180685420986368000
1272 -201445483367890944000
1273 1340077338588862218240
1274 -7487416241004436520960
1275 35423224422958920368128
1276 -142835582350640807936000
1277 493432011756759154688000
1278 -1466197977791512916787200
1279 3758305485035997547724800
1280 -8326092151464363798036480
1281 15955925725802787766272000
1282 -26447031224163605938176000
1283 37869082390541511111475200
1284 -46732059120242715839692800
1285 49516908357612281763201024
1286 -44811681771594825125068800
1287 34383806139211123680870400
1288 -22148529668894438111313920
1289 11817908752549845380628480
1290 -5127770577377560029560832
1291 1762586396242947656908800
1292 -461629770444581529190400
1293 86515229705697797079040
1294 -10330176681277348904960
1295 590295810358705651712
1296 -71
1297 59640
1298 -15005424
1299 1792076352
1300 -124250627072
1301 5602573729792
1302 -176696556093440
1303 4099360101367808
1304 -72582787677159424
1305 1008518734040530944
1306 -11237780179308773376
1307 102161637993716121600
1308 -768255517712745234432
1309 4832786846466499936256
1310 -25663764632960034144256
1311 115900872535948541296640
1312 -447798825707073909555200
1313 1487143663188534529884160
1314 -4260465629675261085614080
1315 10556295406320889815367680
1316 -22657414530639958628106240
1317 42153329359330155587174400
1318 -67956276421708008401141760
1319 94799319929635223560519680
1320 -114146119915275065103482880
1321 118174806500520067401252864
1322 -104625010109313847771791360
1323 78627280324575255295164416
1324 -49659334941837003344314368
1325 26005122213843340149915648
1326 -11084150451802079408160768
1327 3745795851607461551144960
1328 -965262777144999707410432
1329 178121760775739430404096
1330 -20955501267734050635776
1331 1180591620717411303424
1332 1
1333 -2592
1334 1118880
1335 -192745728
1336 17718839424
1337 -1008005087232
1338 38823468662784
1339 -1075111439892480
1340 22344399425765376
1341 -359847060033241088
1342 4602254504635662336
1343 -47656245779603914752
1344 405768759355323187200
1345 -2876588374014352687104
1346 17152989933937436393472
1347 -86750753688878988656640
1348 374637327422537890529280
1349 -1389029663170906973798400
1350 4440485304168581976555520
1351 -12279236744386519718952960
1352 29438682964106143428771840
1353 -61270754787082705022484480
1354 110753689942823917112524800
1355 -173781635233957527913758720
1356 236330698979513162960732160
1357 -277809148188162411970166784
1358 281161294772634959927574528
1359 -243633826357838819224453120
1360 179403090318044948701642752
1361 -111136578636223852069257216
1362 57138015005064240329392128
1363 -23930887299847106473230336
1364 7953221473659504631480320
1365 -2017040783995697211899904
1366 366573698232756209713152
1367 -42501298345826806923264
1368 2361183241434822606848
1369 73
1370 -64824
1371 17243184
1372 -2177567808
1373 159688305920
1374 -7618583904256
1375 254343493419008
1376 -6249582981152768
1377 117271586528690176
1378 -1728212854107013120
1379 20442289188580098048
1380 -197474129552923951104
1381 1579793036423391608832
1382 -10585963594495205310464
1383 59969744500834906931200
1384 -289402379913706518609920
1385 1197073480552149690613760
1386 -4265202989530348477480960
1387 13141436238012425038725120
1388 -35114768895093929253273600
1389 81534780458852245485649920
1390 -164694838933495565632143360
1391 289463656307355842626191360
1392 -442362590397550279388037120
1393 586807517874301391024947200
1394 -673793102876844891341586432
1395 666947599654583767626940416
1396 -565894933040252893744070656
1397 408465515577926900747599872
1398 -248278279486291044288430080
1399 125360180461930560066945024
1400 -51607570451301674497605632
1401 16871705724464008970371072
1402 -4212203328767133854203904
1403 754102897733246470062080
1404 -86183188312371025149952
1405 4722366482869645213696
1406 -1
1407 2738
1408 -1248528
1409 227232096
1410 -22073975040
1411 1327381699072
1412 -54060636471296
1413 1583798426730496
1414 -34843565388070912
1415 594390233090621440
1416 -8058680212849688576
1417 88540824156764110848
1418 -800717018461171089408
1419 6036174446861135904768
1420 -38324917122927847014400
1421 206690242690548802519040
1422 -953442087249950927749120
1423 3783176624275206355025920
1424 -12970891283229278931517440
1425 38562109220411369796403200
1426 -99668220754294001935319040
1427 224340315704787195993784320
1428 -440143367809815048376811520
1429 752708947848669213166141440
1430 -1121055879774613721736806400
1431 1451424183936765194020061184
1432 -1628747500526324742610747392
1433 1577529025667006354478333952
1434 -1311192956398550736189784064
1435 928067609792077653564456960
1436 -553694573977646328906252288
1437 274651248223708226607120384
1438 -111168362376262853626691584
1439 35760452232923715152642048
1440 -8790980355767023918120960
1441 1550707093812319747047424
1442 -174727559866176872906752
1443 9444732965739290427392
1444 -75
1445 70300
1446 -19740240
1447 2632032000
1448 -203836256000
1449 10273347302400
1450 -362464766361600
1451 9417179834613760
1452 -186958717304832000
1453 2916993320288256000
1454 -36559649614279475200
1455 374555777866452172800
1456 -3181227073345733787648
1457 22658312488217477120000
1458 -136619578746690600960000
1459 702782865294804123648000
1460 -3103957655052051546112000
1461 11831556238080761187532800
1462 -39083218804470982901760000
1463 112238987335916668846080000
1464 -280871221967440249356288000
1465 613375470343069957619712000
1466 -1169750391926985939379814400
1467 1947780486094888705720320000
1468 -2828919277423528834498560000
1469 3576641470750375279381708800
1470 -3924442600707233252848435200
1471 3720952984374265602700738560
1472 -3030851428375028373127168000
1473 2104413499070446351417344000
1474 -1232749328417223217879449600
1475 600910066898718127711846400
1476 -239208430476989716223754240
1477 75733107794614564159488000
1478 -18336063609267294306304000
1479 3187597375937010519244800
1480 -354177486215223391027200
1481 18889465931478580854784
1482 1
1483 -2888
1484 1389128
1485 -266712576
1486 27338039040
1487 -1735054211072
1488 74607331076096
1489 -2308727959453696
1490 53677925057298432
1491 -968307667700285440
1492 13892666853426200576
1493 -161660123385323061248
1494 1549828574194075435008
1495 -12398628593552603480064
1496 83641542099362801254400
1497 -479929400183930004439040
1498 2359007817839559175045120
1499 -9991091934379309447249920
1500 36634003759390801306583040
1501 -116728546829353335599923200
1502 324146195426127339627479040
1503 -786082759639667694706360320
1504 1666894308495954963616235520
1505 -3092209731702641091925770240
1506 5016616851964391133177446400
1507 -7109262738783822863017181184
1508 8782030442027075301374164992
1509 -9426414227081472860175204352
1510 8753098925147081941591261184
1511 -6989770466542134399818792960
1512 4762521572118539031740940288
1513 -2740149905058154662366019584
1514 1312988496173699109050384384
1515 -514177313186903147600150528
1516 160257195944996152237096960
1517 -38222834312346908359655424
1518 6549922311740197911396352
1519 -717799705396186072481792
1520 37778931862957161709568
1521 77
1522 -76076
1523 22518496
1524 -3165457152
1525 258512334080
1526 -13743455724544
1527 511679428513792
1528 -14034635753521152
1529 294314567419428864
1530 -4853608655688826880
1531 64344983321131876352
1532 -697876024637098295296
1533 6280884221733884657664
1534 -47455569675322684080128
1535 303902662945416203468800
1536 -1662641665662664132526080
1537 7821973290731169896202240
1538 -31813740106839380082032640
1539 112351226323252585514926080
1540 -345696080994623340045926400
1541 929163612819694928611246080
1542 -2185540989622405347032432640
1543 4503539008918895866612285440
1544 -8132199949500170889571860480
1545 12862152981352311100853452800
1546 -17795166948318021005416071168
1547 21488503484761383855596765184
1548 -22573781438537211323051147264
1549 20537049278669192256309690368
1550 -16083954432154715151054929920
1551 10757792472654301281361330176
1552 -6081209877015027452443885568
1553 2865185422824387934324523008
1554 -1104087734168420859359789056
1555 338850455499259598780497920
1556 -79633266000630827238555648
1557 13454022109695619213819904
1558 -1454488876723850725818368
1559 75557863725914323419136
1560 -1
1561 3042
1562 -1541280
1563 311749568
1564 -33668953344
1565 2252078879232
1566 -102094242525184
1567 3332086816481280
1568 -81747196564340736
1569 1556936802539143168
1570 -23599884164803854336
1571 290350090027586813952
1572 -2945580623468272025600
1573 24960397037020372795392
1574 -178552681450008169414656
1575 1087734726074762411376640
1576 -5684291149164887440097280
1577 25635038515841649239654400
1578 -100261483973069561470648320
1579 341430999475858506629775360
1580 -1015538357415374019719331840
1581 2644409985279057551928852480
1582 -6037976287740765657681100800
1583 12099287749540432825150341120
1584 -21281016750964732912321167360
1585 32833568701488445064724086784
1586 -44372364338663117312206307328
1587 52403421196604240571368734720
1588 -53900661802221504587693555712
1589 48063869023880518912438173696
1590 -36930430436427969333850800128
1591 24255734850366757225088679936
1592 -13475408250203754013938155520
1593 6244548158835679016249196544
1594 -2368432664281837870956675072
1595 715923745310866105920651264
1596 -165816454313001852388507648
1597 27625843924787424500121600
1598 -2946756685310658613346304
1599 151115727451828646838272
1600 -79
1601 82160
1602 -25601056
1603 3788956288
1604 -325850240768
1605 18247613483008
1606 -715867913564160
1607 20698809386483712
1608 -457808960548110336
1609 7967482260767113216
1610 -111544751650739585024
1611 1278576204692271923200
1612 -12172045468670428708864
1613 97376363749363429670912
1614 -661008025845432542298112
1615 3838111117812188955279360
1616 -19190555589060944776396800
1617 83083817138522678561341440
1618 -312874194269391708456222720
1619 1028558079946340353305477120
1620 -2960240327650442968049909760
1621 7474360960180520450890137600
1622 -16579491584400427181974487040
1623 32330775448581036539872542720
1624 -55424186483281776925495787520
1625 83462304351294911134864244736
1626 -110233232162087618480009379840
1627 127380623831745692465788616704
1628 -128338372883112201431696801792
1629 112211692479915752975931277312
1630 -84618653345510239949062930432
1631 54592679577748541902621245440
1632 -29816001923231895962200834048
1633 13593184051839778891858182144
1634 -5075715784062935340693848064
1635 1511480756622363039079858176
1636 -345086930735699323990835200
1637 56706176726298699726061568
1638 -5969071234347231550111744
1639 302231454903657293676544
1640 1
1641 -3200
1642 1705600
1643 -362951680
1644 41246865920
1645 -2903779360768
1646 138589469491200
1647 -4763822643609600
1648 123144815337308160
1649 -2472554723635363840
1650 39534848686338080768
1651 -513439593329065984000
1652 5502733032852815872000
1653 -49304487974361230213120
1654 373305408948735028756480
1655 -2409750777765627495972864
1656 13360513384789265350656000
1657 -64016149693963538792448000
1658 266429118250114918593331200
1659 -967179388014641923542220800
1660 3072654517308054726330286080
1661 -8564890640579943488028672000
1662 20986698208101806559461376000
1663 -45258270918341287189099315200
1664 85942567648126805992066252800
1665 -143681941668051998915715661824
1666 211296973041252939581934796800
1667 -272869885520779477531387494400
1668 308661909465712889519270789120
1669 -304740614790104921775831777280
1670 261353815396259475285713354752
1671 -193493041541387237123214540800
1672 122660767405700837819180646400
1673 -65876552005299470940650864640
1674 29554800767961395654673039360
1675 -10867355313436736787308347392
1676 3188777967557727930548224000
1677 -717799705396186072481792000
1678 116359110137908058065469440
1679 -12089258196146291747061760
1680 604462909807314587353088
1681 81
1682 -88560
1683 29012256
1684 -4514859648
1685 408343972608
1686 -24055172204544
1687 993046852546560
1688 -30226454673702912
1689 704098591222726656
1690 -12912591708037840896
1691 190614449023415746560
1692 -2305455391350403891200
1693 23177511534376060452864
1694 -195985339698085890097152
1695 1407618843742902599811072
1696 -8657612673343443947225088
1697 45911582358639475477708800
1698 -211116116526449756146237440
1699 845732430769621545642885120
1700 -2962916855975624200389918720
1701 9105549362266552420710481920
1702 -24604142241340407426947481600
1703 58552888000604040300897239040
1704 -122847317285263610918071173120
1705 227309321779535388909628293120
1706 -370826187687398908966295568384
1707 532827178244593497643878973440
1708 -673120394873304647528563605504
1709 745662191814537980470238380032
1710 -721692922060125596527594831872
1711 607326284138029190520489639936
1712 -441578762660523016149050327040
1713 275137536734633571600562126848
1714 -145346288062438720773159911424
1715 64185317319985726650039926784
1716 -23246191383495836613696552960
1717 6722642865851155185087283200
1718 -1492305587518670844689645568
1719 238687291510163347681050624
1720 -24480747847196240787800064
1721 1208925819614629174706176
1722 -1
1723 3362
1724 -1882720
1725 420976192
1726 -50276585216
1727 3720467305984
1728 -186699813900288
1729 6749916348702720
1730 -183597724684713984
1731 3880751906080817152
1732 -65360032102413762560
1733 894668491375897477120
1734 -10113643815553623654400
1735 95659511043113351118848
1736 -765276088344906808950784
1737 5224988465251432695595008
1738 -30675738731476153245106176
1739 155839314411242489747865600
1740 -688661351303014430885806080
1741 2658644249553885014827991040
1742 -8998488229259303127110123520
1743 26775989365113048329449635840
1744 -70194982690782621413356339200
1745 162364046919549367790893793280
1746 -331637202218654027828208599040
1747 598300585227122776734972248064
1748 -952949348416050757514525933568
1749 1338524242009966472819145441280
1750 -1654902699212322184576398000128
1751 1796064998419180882716308537344
1752 -1704739659516510668340903018496
1753 1408145609817445618164193820672
1754 -1005818292726746870117281300480
1755 616151625474566614141775118336
1756 -320247376892838837200992862208
1757 139237989953408190087388200960
1758 -49681160734549401157941329920
1759 14163085437098496442656358400
1760 -3100970285175249747444760576
1761 489463841216472987109163008
1762 -49565958604199796162953216
1763 2417851639229258349412352
1764 -83
1765 95284
1766 -32777696
1767 5356812032
1768 -508897143040
1769 31496106816512
1770 -1366446480347136
1771 43726287371108352
1772 -1071294040592154624
1773 20674095520199475200
1774 -321334513228243271680
1775 4094792374102198845440
1776 -43404799165483307761664
1777 387304361784312592334848
1778 -2938171020432716217712640
1779 19107589603846309338415104
1780 -107263059821591781967921152
1781 522794745348934735641968640
1782 -2223055133375650407414497280
1783 8280205355083394230045900800
1784 -27102525820785158674930728960
1785 78156120971566504085846753280
1786 -198942853382169283127609917440
1787 447575411124362346499858759680
1788 -890583726216843444566045491200
1789 1567427358141644462436240064512
1790 -2438725875076695012672930840576
1791 3350168878893237593166854488064
1792 -4055467590239182349623034380288
1793 4313822918898487361960211906560
1794 -4016805603171050527202295676928
1795 3257869982295414252477437968384
1796 -2286774122188127311835124727808
1797 1377649539011571949056710148096
1798 -704680071105663401052025651200
1799 301722171290312216788472954880
1800 -106084964334949957500969943040
1801 29818476461715663730002362368
1802 -6440627861860662842570571776
1803 1003408430280142215006126080
1804 -100340843028014221500612608
1805 4835703278458516698824704
1806 1
1807 -3528
1808 2073288
1809 -486531584
1810 60990209280
1811 -4738261592064
1812 249692027533312
1813 -9482809309396992
1814 271050299426930688
1815 -6023339987265126400
1816 106708223142812712960
1817 -1537337517832384020480
1818 18303228563758021345280
1819 -182469109374079966642176
1820 1539884811913531993620480
1821 -11101330506116865131020288
1822 68890917939168771921936384
1823 -370365434054426053683707904
1824 1734250842000883902169743360
1825 -7104754516305185829656985600
1826 25558898939426091587201925120
1827 -80981041006683365679311093760
1828 226507224633915629585049845760
1829 -560249753683887934046113628160
1830 1226788024467378720827926118400
1831 -2379468037660809665867063230464
1832 4087804064699339682387006062592
1833 -6215975992163356498165007122432
1834 8355240456998797370910106976256
1835 -9907000178897545581962377297920
1836 10332385497313485392261326831616
1837 -9441756816159546672568785174528
1838 7521558257317575375072157237248
1839 -5189699869850821237812024573952
1840 3075546454915982735314413158400
1841 -1548598132164734992191439503360
1842 653125503315173834734887239680
1843 -226333014106998411444596244480
1844 62737923208606577207449485312
1845 -13370719564937798672250306560
1846 2056382819164484226175205376
1847 -203099537695257701350637568
1848 9671406556917033397649408
1849 85
1850 -102340
1851 36924272
1852 -6329875200
1853 630877561600
1854 -40972630000640
1855 1865830535413760
1856 -62691905989902336
1857 1613394639446016000
1858 -32720775494729728000
1859 534750959513868697600
1860 -7169467409766966886400
1861 80011256292999350452224
1862 -752242580532472525619200
1863 6017940644259780204953600
1864 -41310250616080039600455680
1865 245044895699929325811793920
1866 -1263525613457786843009384448
1867 5691556817377418211753984000
1868 -22489714387693765889359872000
1869 78220323699637341849334579200
1870 -240118202984933235444468940800
1871 651957302650000542297709608960
1872 -1568074918492138214592086016000
1873 3344159775151600886221897728000
1874 -6326363433463263794170366525440
1875 10614334004475374377446942965760
1876 -15782120863219950589496868732928
1877 20765948504236777091443248332800
1878 -24127823276693578525884966502400
1879 24681576597798021311724949340160
1880 -22141383614614507597615008317440
1881 17329890636823278061979439202304
1882 -11757049278713214424680759296000
1883 6855772980937628871680851968000
1884 -3398918435619782201171351961600
1885 1412335970965297626970744422400
1886 -482484504675712486619194851328
1887 131916474279073817257469542400
1888 -27744847560155739559506739200
1889 4213106481356982673851023360
1890 -411034778668973919400099840
1891 19342813113834066795298816
1892 -1
1893 3698
1894 -2277968
1895 560380128
1896 -73649959680
1897 6000016715264
1898 -331637287534592
1899 13214470380224512
1900 -396434111406735360
1901 9250129266157158400
1902 -172149774132272168960
1903 2606839436860121415680
1904 -32642163383291955118080
1905 342491621960078667546624
1906 -3044369972978477044858880
1907 23137211794636425540927488
1908 -151511419171328851122847744
1909 860455225454284705307295744
1910 -4261302068916457588188512256
1911 18487868151060022253164953600
1912 -70538327714813623365921669120
1913 237421688405958049377980252160
1914 -706743630603782100473987727360
1915 1864164358983889018641532846080
1916 -4362937861451655150012098150400
1917 9067787587964011438310858686464
1918 -16740530931625867270727739113472
1919 27444644001114105253058893053952
1920 -39919482183438698549903844442112
1921 51438897187371099764848873963520
1922 -58588032050700642444031259836416
1923 58804910011755589296018683854848
1924 -51804325486546590570302173872128
1925 39849481143497377361770902978560
1926 -26589645012342411584675931750400
1927 15260144094039992735553143439360
1928 -7450962374554738237077591162880
1929 3051004956037593665386085089280
1930 -1027706932560031550445839187968
1931 277203668123085433187189391360
1932 -57546077939475963345188683776
1933 8629312500409223049052684288
1934 -831740963894864872197849088
1935 38685626227668133590597632
1936 -87
1937 109736
1938 -41480208
1939 7450635456
1940 -778177480960
1941 52972663431168
1942 -2529105110482944
1943 89120846750351360
1944 -2406262862259486720
1945 51221034027044044800
1946 -879050507778413035520
1947 12383146283487209717760
1948 -145295583059583260688384
1949 1437225824452629860712448
1950 -12106680590216734294671360
1951 87584674205352890682310656
1952 -548067734042587028057489408
1953 2984436064366356253623975936
1954 -14214160955210333388131008512
1955 59465450689813810395689779200
1956 -219296979129264588581177917440
1957 714961579796849334200429445120
1958 -2065444563857564743245685063680
1959 5296403636459916251875151708160
1960 -12070035498054911186246094028800
1961 24461938609391286670792083898368
1962 -44095395867727108918902421192704
1963 70671408865448161095614654840832
1964 -100604912871114174191250937217024
1965 127005617651435778055582714429440
1966 -141857640699199306199787469012992
1967 139751203638125686189652376027136
1968 -120938541609916459202583786946560
1969 91456011565707969148222565253120
1970 -60035063005622452041032715468800
1971 33919206623699767672277638840320
1972 -16314260720074774101125926748160
1973 6584494416750899817391365029888
1974 -2187330339399136918149147918336
1975 582152183806326605933885521920
1976 -119305262360308909364228390912
1977 17669659779487420017505468416
1978 -1682824740903563811190996992
1979 77371252455336267181195264
1980 1
1981 -3872
1982 2497440
1983 -643340544
1984 88551230592
1985 -7556371677184
1986 437582614396928
1987 -18272680601190400
1988 574675804907438080
1989 -14062654990676131840
1990 274591842186360258560
1991 -4364940452416947486720
1992 57408455950266374553600
1993 -633082788079245188923392
1994 5918821621883736766283776
1995 -47350572975069894130270208
1996 326680767582034632487469056
1997 -1956590693539458761422274560
1998 10230174197649170095436464128
1999 -46916190061480689029426970624
2000 189469229094441244157301227520
2001 -676015646664487226540336087040
2002 2136666790197480768874846617600
2003 -5995053486699018505132902973440
2004 14955745134371487653762401566720
2005 -33207858584073833810803046744064
2006 65664408150408440612311906910208
2007 -115635435736568323090863735439360
2008 181262299914335020741133154123776
2009 -252648722929599448147350748397568
2010 312599267353572198555196688695296
2011 -342520191410154201695593621880832
2012 331306732762797962949606925926400
2013 -281726564363330295766938476871680
2014 209501668143758349881121062256640
2015 -135330270105284896817618574376960
2016 75289375621954273581632868843520
2017 -35679526396187141867637938585600
2018 14196695766061831185228569247744
2019 -4651864346921359269485485228032
2020 1221850445552129175212959727616
2021 -247239837221027041777509466112
2022 36171060522869704907208785920
2023 -3404335108034795755972591616
2024 154742504910672534362390528
2025 89
2026 -117480
2027 46475088
2028 -8737316544
2029 955279942144
2030 -68085406785536
2031 3404270339276800
2032 -125666207952732160
2033 3555614472074362880
2034 -79346344008396308480
2035 1428234192151133552640
2036 -21113027188321104691200
2037 260112494960116009795584
2038 -2703391400611120238559232
2039 23944323833984207827238912
2040 -182285820155492678942851072
2041 1201429269206656293032427520
2042 -6897617451445273776468525056
2043 34674509350508673579003936768
2044 -153297830812775188454543720448
2045 598235437318147076895780372480
2046 -2066992873125823787281101619200
2047 6338778144252526280995378298880
2048 -17286510609857953262140957655040
2049 41981525766797886493770897162240
2050 -90877655777538954292398177386496
2051 175424212168543990143526235013120
2052 -301942280338584807277342125719552
2053 463129512699784215673517245464576
2054 -632303063510634674350284211224576
2055 767056175406343703310180846403584
2056 -824791586458434089580839619788800
2057 783552007135512385101797638799360
2058 -654909140292368560682099518996480
2059 479038399293139151803274839982080
2060 -304579746834269561307514787594240
2061 166893011963983321264391664435200
2062 -77943547209125183552667242201088
2063 30580721871522799288606286413824
2064 -9885880877649045144904855977984
2065 2563006153464567259790147846144
2066 -512149334221541503572524400640
2067 74024945786642973625608568832
2068 -6886041468524927779126378496
2069 309485009821345068724781056
2070 -1
2071 4050
2072 -2732400
2073 736290720
2074 -106025863680
2075 9466931561472
2076 -573753427968000
2077 25081221279744000
2078 -826008220812902400
2079 21173883934824857600
2080 -433284530203152875520
2081 7221408836719214592000
2082 -99634510326908583936000
2083 1153307777999477208514560
2084 -11325604423105977243402240
2085 95239220643038309784748032
2086 -691252407893019990373171200
2087 4359449231952771347487129600
2088 -24025409100539717648373514240
2089 116265208762498036187434844160
2090 -496064890719991621066388668416
2091 1872486521300781380331896832000
2092 -6270652536449128343437049856000
2093 18672609775204071067123659571200
2094 -49528766354087394178044316876800
2095 117170910117669606798344841068544
2096 -247419719705486349197108261683200
2097 466483860073656303377916205465600
2098 -785146860591504635295817405562880
2099 1178907748329167879494385239326720
2100 -1577205394374841547255765111144448
2101 1876632542222841608315955314688000
2102 -1980889905679666142111286165504000
2103 1848830578634355065970533754470400
2104 -1519319948728495471245320100249600
2105 1093407068691563200424168254341120
2106 -684448869290493396196662444032000
2107 369465550324153784396421267456000
2108 -170083790184312198290563053649920
2109 65813308089966957846698058055680
2110 -20993612200850219465022671683584
2111 5373252144150161561357805158400
2112 -1060469728965952712052257587200
2113 151454226681320743007189729280
2114 -13926825441960528092615147520
2115 618970019642690137449562112
2116 -91
2117 125580
2118 -51939888
2119 10209897984
2120 -1167331669504
2121 87019269908480
2122 -4551777195212800
2123 175828650512220160
2124 -5207630913700167680
2125 121694111878046023680
2126 -2294803252557439303680
2127 35555844861759533875200
2128 -459381515613933177667584
2129 5010006956610074655588352
2130 -46595532680196162314043392
2131 372764261441569298512347136
2132 -2583934084992696273778769920
2133 15616515915350816471442784256
2134 -82725327551588108875750965248
2135 385828248337771260829413408768
2136 -1590365218758130319028557709312
2137 5811965915727386547944895283200
2138 -18880083217150782967869478010880
2139 54631730160266095396388276797440
2140 -141039058474972674849859530915840
2141 325219476012878167889087859523584
2142 -670263651579516688537742758379520
2143 1234910000485897414033174536650752
2144 -2033423233882793486265152056590336
2145 2990118560168970433339054689878016
2146 -3921466964156026797821711068692480
2147 4578056670904117306212750249164800
2148 -4745331818494844669324369969807360
2149 4352570297561078692623167027937280
2150 -3517678296750130094293915040481280
2151 2491393884217395962155851296276480
2152 -1535790750544970113657716552499200
2153 816874647857432752345509777113088
2154 -370748302240147195869732393713664
2155 141512497057582960838300972089344
2156 -44550230555165006189835491213312
2157 11258653622521864626288134717440
2158 -2194964403718548397730123743232
2159 309794494831166413793505837056
2160 -28163135893742401253955076096
2161 1237940039285380274899124224
2162 1
2163 -4232
2164 2983560
2165 -840170496
2166 126445659648
2167 -11801594900480
2168 747791967784960
2169 -34184775670169600
2170 1177665521837342720
2171 -31589145762225192960
2172 676672753959244922880
2173 -11811015341834093199360
2174 170746200050427651686400
2175 -2072070809227343563849728
2176 21345618336326126554578944
2177 -188430286003430634412834816
2178 1436780930776158587397865472
2179 -9527317401938163895044669440
2180 55258440931241350591259082752
2181 -281715863865674253938936774656
2182 1267721387395534142725215485952
2183 -5053216958817042018389012250624
2184 17894584367903901439326840422400
2185 -56432776209505637002862615592960
2186 158792226674619584970820870471680
2187 -399249027067614956498063902900224
2188 897858671731242684975283980730368
2189 -1807011163232689680453401722224640
2190 3254966861563299463362166478864384
2191 -5245754216094754852024689352507392
2192 7557442514712782413933874490900480
2193 -9719566470534895203959377452072960
2194 11137003247487900754536786663833600
2195 -11339494215624044404619273694085120
2196 10224460543850652856491654156124160
2197 -8128763662191823389011998335303680
2198 5667236637725285320508365036584960
2199 -3441047051414094011711854372454400
2200 1803833085899177702981582607876096
2201 -807309912570261349586162845483008
2202 304018606316016141141624615862272
2203 -94473713254480173941028787585024
2204 23577776974009681964628527022080
2205 -4541383034118417538467437215744
2206 633515815104293355679626821632
2207 -56945241807127492645359714304
2208 2475880078570760549798248448
2209 93
2210 -134044
2211 57907008
2212 -11890238976
2213 1420222988800
2214 -110622459709440
2215 6047361130782720
2216 -244198201852559360
2217 7562961957374853120
2218 -184872403402496409600
2219 3648148760475929149440
2220 -59177875545427720273920
2221 800873915714788481040384
2222 -9154148575064761783287808
2223 89286769352848415423201280
2224 -749624833448430567338016768
2225 5457495946545013448574500864
2226 -34671150719227144261532123136
2227 193242209414070810058269130752
2228 -949259976069119768707286958080
2229 4125807993549198604478988681216
2230 -15918399833361470584722919784448
2231 54669251952958585846523158855680
2232 -167497282579277369402113507983360
2233 458623511824211844791501271859200
2234 -1123717530148108080885215665324032
2235 2465980995042002058488310719840256
2236 -4848932326951276774939977981100032
2237 8543356957009392412989485014319104
2238 -13481626992358480137388433394892800
2239 19036351993581591625689460050493440
2240 -24017189611973907714131505153310720
2241 27019338313470646178397943297474560
2242 -27031558728809167501861714416107520
2243 23966599384451435807277223352729600
2244 -18748921208601042740179847966883840
2245 12870264025995540754674446625669120
2246 -7698968750685620775769218522021888
2247 3978414474038502601832897609465856
2248 -1756132322198105660010626663055360
2249 652587443187197288473084722937856
2250 -200206080131482212508345709887488
2251 49350518351737912326987177787392
2252 -9392560563068001490728380268544
2253 1295194766102329112613208719360
2254 -115128423653540365565618552832
2255 4951760157141521099596496896
2256 -1
2257 4418
2258 -3251648
2259 955984512
2260 -150226137600
2261 14642040878080
2262 -969036887203840
2263 46279497931735040
2264 -1666061925542461440
2265 46715069676974899200
2266 -1046417560764237742080
2267 19107312862785951498240
2268 -289101951141283092234240
2269 3673818640656920525930496
2270 -39653915486455650121154560
2271 367003824709127465259237376
2272 -2936030597673019722073899008
2273 20442309295028190792193671168
2274 -124600742369695639114323329024
2275 668200282693815874055475036160
2276 -3166241339533773680139789402112
2277 13304832945915439227346989613056
2278 -49731384034626842608772679991296
2279 165771280115422808695908933304320
2280 -493786791833174323775047886438400
2281 1316496050716038646081066446618624
2282 -3145293732027458846745715311378432
2283 6738973153316693797430023161905152
2284 -12952831515465853013242122441064448
2285 22332468130113539678003659381145600
2286 -34520696499429742688710741280686080
2287 47792270457698078455338297553059840
2288 -59171382471435716182799796970455040
2289 65378170842565336761415160289034240
2290 -64287578001468987860215082988339200
2291 56061962431094695003566445040762880
2292 -43165079054927370800868060970352640
2293 29181575103405175521060747623792640
2294 -17201770587270419254520019651919872
2295 8764138860647266553251958064414720
2296 -3816283250712227461162877941972992
2297 1399648599628874750887198233460736
2298 -423989937236974106981319946797056
2299 103242419737594242192441792790528
2300 -19418636941240296337136387358720
2301 2647334774011785717871777153024
2302 -232732727385651491681035354112
2303 9903520314283042199192993792
2304 -95
2305 142880
2306 -64410304
2307 13802208000
2308 -1720675264000
2309 139906541465600
2310 -7985434905190400
2311 336757197716029440
2312 -10895085808459776000
2313 278302542756446208000
2314 -5740983882004404633600
2315 97392501270999623270400
2316 -1379077817997354665508864
2317 16501785856378602835148800
2318 -168594600325759715665510400
2319 1483632482866685497856491520
2320 -11329557141891052892722298880
2321 75555769309283525845919465472
2322 -442443694153462088286915788800
2323 2285660541456751516818237030400
2324 -10458290672616745964758567485440
2325 42528065725192349039416899010560
2326 -154132020022212271064068518838272
2327 499039842810122986793931374592000
2328 -1446197095490560492341597044736000
2329 3756709631580185373047348558561280
2330 -8756568459096919751979741342597120
2331 18326878633584664369800024304910336
2332 -34449019987941098439473729896448000
2333 58146563252585559493395752157184000
2334 -88077744992441077003110942611865600
2335 119601730527370064624808100259430400
2336 -145362103256342078543997537238384640
2337 157787900413939841024692034994176000
2338 -152541755387389411527707389329408000
2339 130872846070790432747312738048409600
2340 -99200422135850282356410568566374400
2341 66062118957495971817890713769607168
2342 -38381955648579341110872936913305600
2343 19284410043492638766514542791884800
2344 -8285153944611652210798840606883840
2345 2999503279389231714282742176808960
2346 -897330392825686126289627071381504
2347 215877400038256485875611965849600
2348 -40132468648582921786885983436800
2349 5409797971677111801309172858880
2350 -470417214928444504461667205120
2351 19807040628566084398385987584
2352 1
2353 -4608
2354 3537408
2355 -1084805120
2356 177830553600
2357 -18083391406080
2358 1248849970135040
2359 -62250367742115840
2360 2339576320974520320
2361 -68505241293894451200
2362 1603022646277130158080
2363 -30589280626794760765440
2364 483886953683282338775040
2365 -6431974276651629856948224
2366 72657487199212855791452160
2367 -704193025360646896590258176
2368 5903295563406390717786882048
2369 -43101423578810296577638268928
2370 275712280988262690806162259968
2371 -1553087671000740050629306613760
2372 7737562422447276713776263462912
2373 -34221414291148931156864124583936
2374 134787515485011540687606478012416
2375 -474035320159847350824045970980864
2376 1491866477453420297362910635622400
2377 -4208890241697159630764260536090624
2378 10658712995187829592840412428500992
2379 -24252110071510533301389505847099392
2380 49606588782635181752842171050885120
2381 -91230508105995736556951119174041600
2382 150813823004600861675502245595054080
2383 -223947760442580232461560182776791040
2384 298374843526175845432415997489315840
2385 -356102377355249493849410234765803520
2386 379863378829348669909599152976691200
2387 -361145473205873518058981223699578880
2388 304910771196508236295493537067171840
2389 -227582419375105740233881884756541440
2390 149326008502262362890301447191134208
2391 -85528050157805948774997831891025920
2392 42385103337697504994191963525742592
2393 -17969956488852179172484879447228416
2394 6422996496015437535546804300414976
2395 -1897903205388966494771695935553536
2396 451173437017753268088360319057920
2397 -82912272071177629291643744026624
2398 11052328670739875094299381071872
2399 -950737950171172051122527404032
2400 39614081257132168796771975168
2401 97
2402 -152096
2403 71485120
2404 -15971818240
2405 2076336371200
2406 -176073324277760
2407 10483134845460480
2408 -461257933200261120
2409 15574238450408816640
2410 -415313025344235110400
2411 8947029174558664949760
2412 -158571062524589144801280
2413 2346851725363919343058944
2414 -29365734409681862549045248
2415 313909574724185427248414720
2416 -2892018533587979291037007872
2417 23136148268703834328296062976
2418 -161758616466904119001196003328
2419 993868256129987469899240308736
2420 -5391835883458231618076850257920
2421 25933415517511299392311094411264
2422 -110970894307490211353145148178432
2423 423707050992235352439281474863104
2424 -1447110483129817688442023316553728
2425 4429930050397401087067418315980800
2426 -12174490114974504634575869630742528
2427 30073994449472578937660566199599104
2428 -66831098776605730972579035999109120
2429 133662197553211461945158071998218240
2430 -240607579464577032607297990505267200
2431 389705391001642800354115433801973760
2432 -567497251412530529547928465813012480
2433 742111790308693769408829532217016320
2434 -869992655124438828723512504525783040
2435 912268513046086751346905695282790400
2436 -853163792482537468865275185447567360
2437 709021964528866754947397642700718080
2438 -521226957707707452285654483282690048
2439 337033972653104066891475831295574016
2440 -190340510359104536316510206573936640
2441 93055360620006662199182767658369024
2442 -38939416257093590059252501071265792
2443 13743323384856561197383235672211456
2444 -4011683810816189475419003836956672
2445 942479342684089457963606621552640
2446 -171234342114032370384596660912128
2447 22575074556408194693060429348864
2448 -1921282940970910186643440795648
2449 79228162514264337593543950336
2450 -1
2451 4802
2452 -3841600
2453 1227775360
2454 -209774190080
2455 22236064148480
2456 -1600996618690560
2457 83216637433036800
2458 -3262092187375042560
2459 99653718194712084480
2460 -2433648696965600378880
2461 48483338975912090664960
2462 -801029078732460628377600
2463 11125677727379468543066112
2464 -131388956018576580889542656
2465 1332012174809017751087087616
2466 -11687332630582349299860897792
2467 89373720116217965234230394880
2468 -599229513922070928808554266624
2469 3540824183260714990427787231232
2470 -18521234189363739949929963978752
2471 86088245326171529941486313406464
2472 -356729304099991963393896774369280
2473 1321449422144318055702608920707072
2474 -4386087443713055674246957268729856
2475 13068750342491961804899097168052224
2476 -35007693225136838861992151689986048
2477 84400098970455691176710638246297600
2478 -183268786335846643698000243049103360
2479 358554903212418660447267263170478080
2480 -632028981933754926890098226605588480
2481 1003358542445865833169791050380738560
2482 -1433369346351236904528272929115340800
2483 1840325957972637032667069299199836160
2484 -2119848689078226327356624162028257280
2485 2185682499298047020752792614265159680
2486 -2011238356161583174026043907962306560
2487 1645626348432839250128677170157977600
2488 -1191779923917677267461610413756514304
2489 759595995464014082557949494482173952
2490 -423066124055906577627212376673615872
2491 204080677728865503570850414763966464
2492 -84301829010202617654051806442946560
2493 29384549975102088889538167279976448
2494 -8474541058650132218926367992971264
2495 1967870957439356545218856987131904
2496 -353521012898804615863492702896128
2497 46100887062987561437243386101760
2498 -3882179963198952542083653566464
2499 158456325028528675187087900672
2500 -99
2501 161700
2502 -79168320
2503 18427368960
2504 -2495884751360
2505 220545452574720
2506 -13685128082841600
2507 627691208066334720
2508 -22098422825158901760
2509 614620461733659279360
2510 -13814326568489865707520
2511 255537740476413326131200
2512 -3948909882828840599814144
2513 51617089864440799635177472
2514 -576687486761338589027500032
2515 5556042883206014793211183104
2516 -46510813529868532928017858560
2517 340506056699340049469656793088
2518 -2192327283974129327516348841984
2519 12473484249979661598932424720384
2520 -62975883896238779292171022368768
2521 283147384959833271236117774991360
2522 -1137165659192219279227075023601664
2523 4090009327418453799847241157967872
2524 -13202104937823512435561332853440512
2525 38311990799958428244374063966846976
2526 -100089380899746256661644869579571200
2527 235631296717517113326000312491704320
2528 -500199770224904749341158558096424960
2529 957717385889414353501832516846223360
2530 -1653763354869152654134311887013150720
2531 2574214336304262195887510566574489600
2532 -3608850483011167578465375390447697920
2533 4550644571069712894057651102925455360
2534 -5151965891202539406060154019339304960
2535 5224528791078631510370860413977886720
2536 -4731498676852033102999485458625331200
2537 3812479654573385952543008823598645248
2538 -2720593820488458601814696658808602624
2539 1709532501287132701432409195538284544
2540 -939187608731819817453607521005600768
2541 447100771714824597200953330599198720
2542 -182346981405261796505486848558104576
2543 62780783761020367254495338396909568
2544 -17891561459984353895816342607495168
2545 4106976256992745460822310635175936
2546 -729617100354017426420045835141120
2547 94123057066946033061130212999168
2548 -7843588088912169421760851083264
2549 316912650057057350374175801344
2550 1
2551 -5000
2552 4165000
2553 -1386112000
2554 246628928000
2555 -27227833651200
2556 2042087523840000
2557 -110586893598720000
2558 4517474603507712000
2559 -143850563845029888000
2560 3662889620432918937600
2561 -76111992112891822080000
2562 1312104559685287280640000
2563 -19023497493037149742694400
2564 234623135747458180159897600
2565 -2485387148331694929142087680
2566 22799418396994378886283264000
2567 -182395347175955031090266112000
2568 1280241627320751027747867852800
2569 -7925478751208973645460484915200
2570 43468202689323063147794813419520
2571 -212040013118649088525828358144000
2572 923024074019658505866132324352000
2573 -3595780740528756614156758967910400
2574 12566106098549963273941439584665600
2575 -39472960218138986676021762874933248
2576 111631674825053695350740279623680000
2577 -284578860769948204500000377405440000
2578 654531379770880870350000868032512000
2579 -1358954443662228159129584379363328000
2580 2547463753712583633893763260298035200
2581 -4310885252184171141438414824407040000
2582 6581798018959761296303294062264320000
2583 -9058026923994972189597820080095232000
2584 11221137831217652115471926367879168000
2585 -12489614281703125832873100652943769600
2586 12460295938318846194767764735918080000
2587 -11108623702136905456127648087408640000
2588 8816739233064449172547628060953804800
2589 -6200783636440931286187342812099379200
2590 3842131126630171980492030767750184960
2591 -2082455895192505138478065456775168000
2592 978503372439851812055958467641344000
2593 -394078512785625681900511864396185600
2594 134036108580690866727917044786790400
2595 -37750993877408064336851542202122240
2596 8567473526884295537508113973248000
2597 -1505335087771022414277335056384000
2598 192128294097091018664344079564800
2599 -15845632502852867518708790067200
2600 633825300114114700748351602688







