%!PS-Adobe-2.0 EPSF-2.0
%%Title: fftshift3d.fig
%%Creator: fig2dev Version 3.2 Patchlevel 5-alpha7
%%CreationDate: Thu May 29 16:26:01 2008
%%For: arrivault@caldell (Arrivault Denis)
%%BoundingBox: 0 0 776 317
%Magnification: 1.0000
%%EndComments
/$F2psDict 200 dict def
$F2psDict begin
$F2psDict /mtrx matrix put
/col-1 {0 setgray} bind def
/col0 {0.000 0.000 0.000 srgb} bind def
/col1 {0.000 0.000 1.000 srgb} bind def
/col2 {0.000 1.000 0.000 srgb} bind def
/col3 {0.000 1.000 1.000 srgb} bind def
/col4 {1.000 0.000 0.000 srgb} bind def
/col5 {1.000 0.000 1.000 srgb} bind def
/col6 {1.000 1.000 0.000 srgb} bind def
/col7 {1.000 1.000 1.000 srgb} bind def
/col8 {0.000 0.000 0.560 srgb} bind def
/col9 {0.000 0.000 0.690 srgb} bind def
/col10 {0.000 0.000 0.820 srgb} bind def
/col11 {0.530 0.810 1.000 srgb} bind def
/col12 {0.000 0.560 0.000 srgb} bind def
/col13 {0.000 0.690 0.000 srgb} bind def
/col14 {0.000 0.820 0.000 srgb} bind def
/col15 {0.000 0.560 0.560 srgb} bind def
/col16 {0.000 0.690 0.690 srgb} bind def
/col17 {0.000 0.820 0.820 srgb} bind def
/col18 {0.560 0.000 0.000 srgb} bind def
/col19 {0.690 0.000 0.000 srgb} bind def
/col20 {0.820 0.000 0.000 srgb} bind def
/col21 {0.560 0.000 0.560 srgb} bind def
/col22 {0.690 0.000 0.690 srgb} bind def
/col23 {0.820 0.000 0.820 srgb} bind def
/col24 {0.500 0.190 0.000 srgb} bind def
/col25 {0.630 0.250 0.000 srgb} bind def
/col26 {0.750 0.380 0.000 srgb} bind def
/col27 {1.000 0.500 0.500 srgb} bind def
/col28 {1.000 0.630 0.630 srgb} bind def
/col29 {1.000 0.750 0.750 srgb} bind def
/col30 {1.000 0.880 0.880 srgb} bind def
/col31 {1.000 0.840 0.000 srgb} bind def

end
save
newpath 0 317 moveto 0 0 lineto 776 0 lineto 776 317 lineto closepath clip newpath
-8.1 360.7 translate
1 -1 scale

/cp {closepath} bind def
/ef {eofill} bind def
/gr {grestore} bind def
/gs {gsave} bind def
/sa {save} bind def
/rs {restore} bind def
/l {lineto} bind def
/m {moveto} bind def
/rm {rmoveto} bind def
/n {newpath} bind def
/s {stroke} bind def
/sh {show} bind def
/slc {setlinecap} bind def
/slj {setlinejoin} bind def
/slw {setlinewidth} bind def
/srgb {setrgbcolor} bind def
/rot {rotate} bind def
/sc {scale} bind def
/sd {setdash} bind def
/ff {findfont} bind def
/sf {setfont} bind def
/scf {scalefont} bind def
/sw {stringwidth} bind def
/tr {translate} bind def
/tnt {dup dup currentrgbcolor
  4 -2 roll dup 1 exch sub 3 -1 roll mul add
  4 -2 roll dup 1 exch sub 3 -1 roll mul add
  4 -2 roll dup 1 exch sub 3 -1 roll mul add srgb}
  bind def
/shd {dup dup currentrgbcolor 4 -2 roll mul 4 -2 roll mul
  4 -2 roll mul srgb} bind def
/$F2psBegin {$F2psDict begin /$F2psEnteredState save def} def
/$F2psEnd {$F2psEnteredState restore end} def

$F2psBegin
10 setmiterlimit
0 slj 0 slc
 0.06000 0.06000 sc
%
% Fig objects follow
%
% 
% here starts figure with depth 50
% Polyline
0 slj
0 slc
7.500 slw
n 5250 1350 m 5850 1350 l 5850 1950 l 5250 1950 l
 cp gs col0 s gr 
% Polyline
n 5850 1350 m 6450 1350 l 6450 1950 l 5850 1950 l
 cp gs col0 s gr 
% Polyline
n 6450 1350 m 7050 1350 l 7050 1950 l 6450 1950 l
 cp gs col0 s gr 
% Polyline
n 7050 1350 m 7650 1350 l 7650 1950 l 7050 1950 l
 cp gs col0 s gr 
% Polyline
n 5250 1950 m 5850 1950 l 5850 2550 l 5250 2550 l
 cp gs col0 s gr 
% Polyline
n 5850 1950 m 6450 1950 l 6450 2550 l 5850 2550 l
 cp gs col0 s gr 
% Polyline
n 6450 1950 m 7050 1950 l 7050 2550 l 6450 2550 l
 cp gs col0 s gr 
% Polyline
n 7050 1950 m 7650 1950 l 7650 2550 l 7050 2550 l
 cp gs col0 s gr 
% Polyline
n 5250 2550 m 5850 2550 l 5850 3150 l 5250 3150 l
 cp gs col0 s gr 
% Polyline
n 5850 2550 m 6450 2550 l 6450 3150 l 5850 3150 l
 cp gs col0 s gr 
% Polyline
n 6450 2550 m 7050 2550 l 7050 3150 l 6450 3150 l
 cp gs col0 s gr 
% Polyline
n 7050 2550 m 7650 2550 l 7650 3150 l 7050 3150 l
 cp gs col0 s gr 
% Polyline
n 5250 750 m 5850 750 l 5850 1350 l 5250 1350 l
 cp gs col0 s gr 
% Polyline
n 5850 750 m 6450 750 l 6450 1350 l 5850 1350 l
 cp gs col0 s gr 
% Polyline
n 6450 750 m 7050 750 l 7050 1350 l 6450 1350 l
 cp gs col0 s gr 
% Polyline
n 7050 750 m 7650 750 l 7650 1350 l 7050 1350 l
 cp gs col0 s gr 
/Times-Roman ff 266.67 scf sf
6600 2250 m
gs 1 -1 sc (26) col0 sh gr
/Times-Roman ff 266.67 scf sf
7200 2250 m
gs 1 -1 sc (27) col0 sh gr
/Times-Roman ff 266.67 scf sf
5400 2850 m
gs 1 -1 sc (28) col0 sh gr
/Times-Roman ff 266.67 scf sf
6000 2850 m
gs 1 -1 sc (29) col0 sh gr
/Times-Roman ff 266.67 scf sf
6600 2850 m
gs 1 -1 sc (30) col0 sh gr
/Times-Roman ff 266.67 scf sf
7200 2850 m
gs 1 -1 sc (31) col0 sh gr
/Times-Roman ff 266.67 scf sf
5400 1050 m
gs 1 -1 sc (16) col0 sh gr
/Times-Roman ff 266.67 scf sf
6000 1050 m
gs 1 -1 sc (17) col0 sh gr
/Times-Roman ff 266.67 scf sf
6600 1050 m
gs 1 -1 sc (18) col0 sh gr
/Times-Roman ff 266.67 scf sf
7200 1050 m
gs 1 -1 sc (19) col0 sh gr
/Times-Roman ff 266.67 scf sf
5400 1650 m
gs 1 -1 sc (20) col0 sh gr
/Times-Roman ff 266.67 scf sf
6000 1650 m
gs 1 -1 sc (21) col0 sh gr
/Times-Roman ff 266.67 scf sf
6600 1650 m
gs 1 -1 sc (22) col0 sh gr
/Times-Roman ff 266.67 scf sf
7200 1650 m
gs 1 -1 sc (23) col0 sh gr
/Times-Roman ff 266.67 scf sf
5400 2250 m
gs 1 -1 sc (24) col0 sh gr
/Times-Roman ff 266.67 scf sf
6000 2250 m
gs 1 -1 sc (25) col0 sh gr
% Polyline
n 2550 1350 m 3150 1350 l 3150 1950 l 2550 1950 l
 cp gs col0 s gr 
% Polyline
n 3150 1350 m 3750 1350 l 3750 1950 l 3150 1950 l
 cp gs col0 s gr 
% Polyline
n 3750 1350 m 4350 1350 l 4350 1950 l 3750 1950 l
 cp gs col0 s gr 
% Polyline
n 4350 1350 m 4950 1350 l 4950 1950 l 4350 1950 l
 cp gs col0 s gr 
% Polyline
n 2550 1950 m 3150 1950 l 3150 2550 l 2550 2550 l
 cp gs col0 s gr 
% Polyline
n 3150 1950 m 3750 1950 l 3750 2550 l 3150 2550 l
 cp gs col0 s gr 
% Polyline
n 3750 1950 m 4350 1950 l 4350 2550 l 3750 2550 l
 cp gs col0 s gr 
% Polyline
n 4350 1950 m 4950 1950 l 4950 2550 l 4350 2550 l
 cp gs col0 s gr 
% Polyline
n 2550 2550 m 3150 2550 l 3150 3150 l 2550 3150 l
 cp gs col0 s gr 
% Polyline
n 3150 2550 m 3750 2550 l 3750 3150 l 3150 3150 l
 cp gs col0 s gr 
% Polyline
n 3750 2550 m 4350 2550 l 4350 3150 l 3750 3150 l
 cp gs col0 s gr 
% Polyline
n 4350 2550 m 4950 2550 l 4950 3150 l 4350 3150 l
 cp gs col0 s gr 
% Polyline
n 2550 750 m 3150 750 l 3150 1350 l 2550 1350 l
 cp gs col0 s gr 
% Polyline
n 3150 750 m 3750 750 l 3750 1350 l 3150 1350 l
 cp gs col0 s gr 
% Polyline
n 3750 750 m 4350 750 l 4350 1350 l 3750 1350 l
 cp gs col0 s gr 
% Polyline
n 4350 750 m 4950 750 l 4950 1350 l 4350 1350 l
 cp gs col0 s gr 
/Times-Roman ff 266.67 scf sf
3450 1050 m
gs 1 -1 sc (1) col0 sh gr
/Times-Roman ff 266.67 scf sf
4050 1050 m
gs 1 -1 sc (2) col0 sh gr
/Times-Roman ff 266.67 scf sf
4650 1050 m
gs 1 -1 sc (3) col0 sh gr
/Times-Roman ff 266.67 scf sf
2850 1050 m
gs 1 -1 sc (0) col0 sh gr
/Times-Roman ff 266.67 scf sf
2850 1650 m
gs 1 -1 sc (4) col0 sh gr
/Times-Roman ff 266.67 scf sf
3450 1650 m
gs 1 -1 sc (5) col0 sh gr
/Times-Roman ff 266.67 scf sf
4050 1650 m
gs 1 -1 sc (6) col0 sh gr
/Times-Roman ff 266.67 scf sf
4650 1650 m
gs 1 -1 sc (7) col0 sh gr
/Times-Roman ff 266.67 scf sf
2850 2250 m
gs 1 -1 sc (8) col0 sh gr
/Times-Roman ff 266.67 scf sf
3450 2250 m
gs 1 -1 sc (9) col0 sh gr
/Times-Roman ff 266.67 scf sf
2700 2850 m
gs 1 -1 sc (12) col0 sh gr
/Times-Roman ff 266.67 scf sf
3900 2250 m
gs 1 -1 sc (10) col0 sh gr
/Times-Roman ff 266.67 scf sf
4500 2250 m
gs 1 -1 sc (11) col0 sh gr
/Times-Roman ff 266.67 scf sf
3300 2850 m
gs 1 -1 sc (13) col0 sh gr
/Times-Roman ff 266.67 scf sf
3900 2850 m
gs 1 -1 sc (14) col0 sh gr
/Times-Roman ff 266.67 scf sf
4500 2850 m
gs 1 -1 sc (15) col0 sh gr
% Polyline
n 7950 1350 m 8550 1350 l 8550 1950 l 7950 1950 l
 cp gs col0 s gr 
% Polyline
n 8550 1350 m 9150 1350 l 9150 1950 l 8550 1950 l
 cp gs col0 s gr 
% Polyline
n 9150 1350 m 9750 1350 l 9750 1950 l 9150 1950 l
 cp gs col0 s gr 
% Polyline
n 9750 1350 m 10350 1350 l 10350 1950 l 9750 1950 l
 cp gs col0 s gr 
% Polyline
n 7950 1950 m 8550 1950 l 8550 2550 l 7950 2550 l
 cp gs col0 s gr 
% Polyline
n 8550 1950 m 9150 1950 l 9150 2550 l 8550 2550 l
 cp gs col0 s gr 
% Polyline
n 9150 1950 m 9750 1950 l 9750 2550 l 9150 2550 l
 cp gs col0 s gr 
% Polyline
n 9750 1950 m 10350 1950 l 10350 2550 l 9750 2550 l
 cp gs col0 s gr 
% Polyline
n 7950 2550 m 8550 2550 l 8550 3150 l 7950 3150 l
 cp gs col0 s gr 
% Polyline
n 8550 2550 m 9150 2550 l 9150 3150 l 8550 3150 l
 cp gs col0 s gr 
% Polyline
n 9150 2550 m 9750 2550 l 9750 3150 l 9150 3150 l
 cp gs col0 s gr 
% Polyline
n 9750 2550 m 10350 2550 l 10350 3150 l 9750 3150 l
 cp gs col0 s gr 
% Polyline
n 7950 750 m 8550 750 l 8550 1350 l 7950 1350 l
 cp gs col0 s gr 
% Polyline
n 8550 750 m 9150 750 l 9150 1350 l 8550 1350 l
 cp gs col0 s gr 
% Polyline
n 9150 750 m 9750 750 l 9750 1350 l 9150 1350 l
 cp gs col0 s gr 
% Polyline
n 9750 750 m 10350 750 l 10350 1350 l 9750 1350 l
 cp gs col0 s gr 
/Times-Roman ff 266.67 scf sf
8100 1050 m
gs 1 -1 sc (32) col0 sh gr
/Times-Roman ff 266.67 scf sf
8700 1050 m
gs 1 -1 sc (33) col0 sh gr
/Times-Roman ff 266.67 scf sf
9300 1050 m
gs 1 -1 sc (34) col0 sh gr
/Times-Roman ff 266.67 scf sf
9900 1050 m
gs 1 -1 sc (35) col0 sh gr
/Times-Roman ff 266.67 scf sf
8100 1650 m
gs 1 -1 sc (36) col0 sh gr
/Times-Roman ff 266.67 scf sf
8700 1650 m
gs 1 -1 sc (37) col0 sh gr
/Times-Roman ff 266.67 scf sf
9300 1650 m
gs 1 -1 sc (38) col0 sh gr
/Times-Roman ff 266.67 scf sf
9900 1650 m
gs 1 -1 sc (39) col0 sh gr
/Times-Roman ff 266.67 scf sf
8100 2250 m
gs 1 -1 sc (40) col0 sh gr
/Times-Roman ff 266.67 scf sf
8700 2250 m
gs 1 -1 sc (41) col0 sh gr
/Times-Roman ff 266.67 scf sf
9300 2250 m
gs 1 -1 sc (42) col0 sh gr
/Times-Roman ff 266.67 scf sf
9900 2250 m
gs 1 -1 sc (43) col0 sh gr
/Times-Roman ff 266.67 scf sf
8100 2850 m
gs 1 -1 sc (44) col0 sh gr
/Times-Roman ff 266.67 scf sf
8700 2850 m
gs 1 -1 sc (45) col0 sh gr
/Times-Roman ff 266.67 scf sf
9300 2850 m
gs 1 -1 sc (46) col0 sh gr
/Times-Roman ff 266.67 scf sf
9900 2850 m
gs 1 -1 sc (47) col0 sh gr
% Polyline
n 10650 1350 m 11250 1350 l 11250 1950 l 10650 1950 l
 cp gs col0 s gr 
% Polyline
n 11250 1350 m 11850 1350 l 11850 1950 l 11250 1950 l
 cp gs col0 s gr 
% Polyline
n 11850 1350 m 12450 1350 l 12450 1950 l 11850 1950 l
 cp gs col0 s gr 
% Polyline
n 12450 1350 m 13050 1350 l 13050 1950 l 12450 1950 l
 cp gs col0 s gr 
% Polyline
n 10650 1950 m 11250 1950 l 11250 2550 l 10650 2550 l
 cp gs col0 s gr 
% Polyline
n 11250 1950 m 11850 1950 l 11850 2550 l 11250 2550 l
 cp gs col0 s gr 
% Polyline
n 11850 1950 m 12450 1950 l 12450 2550 l 11850 2550 l
 cp gs col0 s gr 
% Polyline
n 12450 1950 m 13050 1950 l 13050 2550 l 12450 2550 l
 cp gs col0 s gr 
% Polyline
n 10650 2550 m 11250 2550 l 11250 3150 l 10650 3150 l
 cp gs col0 s gr 
% Polyline
n 11250 2550 m 11850 2550 l 11850 3150 l 11250 3150 l
 cp gs col0 s gr 
% Polyline
n 11850 2550 m 12450 2550 l 12450 3150 l 11850 3150 l
 cp gs col0 s gr 
% Polyline
n 12450 2550 m 13050 2550 l 13050 3150 l 12450 3150 l
 cp gs col0 s gr 
% Polyline
n 10650 750 m 11250 750 l 11250 1350 l 10650 1350 l
 cp gs col0 s gr 
% Polyline
n 11250 750 m 11850 750 l 11850 1350 l 11250 1350 l
 cp gs col0 s gr 
% Polyline
n 11850 750 m 12450 750 l 12450 1350 l 11850 1350 l
 cp gs col0 s gr 
% Polyline
n 12450 750 m 13050 750 l 13050 1350 l 12450 1350 l
 cp gs col0 s gr 
/Times-Roman ff 266.67 scf sf
10800 1050 m
gs 1 -1 sc (48) col0 sh gr
/Times-Roman ff 266.67 scf sf
11400 1050 m
gs 1 -1 sc (49) col0 sh gr
/Times-Roman ff 266.67 scf sf
12000 1050 m
gs 1 -1 sc (50) col0 sh gr
/Times-Roman ff 266.67 scf sf
12600 1050 m
gs 1 -1 sc (51) col0 sh gr
/Times-Roman ff 266.67 scf sf
10800 1650 m
gs 1 -1 sc (52) col0 sh gr
/Times-Roman ff 266.67 scf sf
11400 1650 m
gs 1 -1 sc (53) col0 sh gr
/Times-Roman ff 266.67 scf sf
12000 1650 m
gs 1 -1 sc (54) col0 sh gr
/Times-Roman ff 266.67 scf sf
12600 1650 m
gs 1 -1 sc (55) col0 sh gr
/Times-Roman ff 266.67 scf sf
10800 2250 m
gs 1 -1 sc (56) col0 sh gr
/Times-Roman ff 266.67 scf sf
11400 2250 m
gs 1 -1 sc (57) col0 sh gr
/Times-Roman ff 266.67 scf sf
12000 2250 m
gs 1 -1 sc (58) col0 sh gr
/Times-Roman ff 266.67 scf sf
12600 2250 m
gs 1 -1 sc (59) col0 sh gr
/Times-Roman ff 266.67 scf sf
10800 2850 m
gs 1 -1 sc (60) col0 sh gr
/Times-Roman ff 266.67 scf sf
11400 2850 m
gs 1 -1 sc (61) col0 sh gr
/Times-Roman ff 266.67 scf sf
12000 2850 m
gs 1 -1 sc (62) col0 sh gr
/Times-Roman ff 266.67 scf sf
12600 2850 m
gs 1 -1 sc (63) col0 sh gr
% Polyline
n 7950 4800 m 8550 4800 l 8550 5400 l 7950 5400 l
 cp gs col0 s gr 
% Polyline
n 8550 4800 m 9150 4800 l 9150 5400 l 8550 5400 l
 cp gs col0 s gr 
% Polyline
n 9150 4800 m 9750 4800 l 9750 5400 l 9150 5400 l
 cp gs col0 s gr 
% Polyline
n 9750 4800 m 10350 4800 l 10350 5400 l 9750 5400 l
 cp gs col0 s gr 
% Polyline
n 7950 3600 m 8550 3600 l 8550 4200 l 7950 4200 l
 cp gs col0 s gr 
% Polyline
n 8550 3600 m 9150 3600 l 9150 4200 l 8550 4200 l
 cp gs col0 s gr 
% Polyline
n 9150 3600 m 9750 3600 l 9750 4200 l 9150 4200 l
 cp gs col0 s gr 
% Polyline
n 9750 3600 m 10350 3600 l 10350 4200 l 9750 4200 l
 cp gs col0 s gr 
% Polyline
n 7950 5400 m 8550 5400 l 8550 6000 l 7950 6000 l
 cp gs col0 s gr 
% Polyline
n 8550 5400 m 9150 5400 l 9150 6000 l 8550 6000 l
 cp gs col0 s gr 
% Polyline
n 9150 5400 m 9750 5400 l 9750 6000 l 9150 6000 l
 cp gs col0 s gr 
% Polyline
n 9750 5400 m 10350 5400 l 10350 6000 l 9750 6000 l
 cp gs col0 s gr 
% Polyline
n 7950 4200 m 8550 4200 l 8550 4800 l 7950 4800 l
 cp gs col0 s gr 
% Polyline
n 8550 4200 m 9150 4200 l 9150 4800 l 8550 4800 l
 cp gs col0 s gr 
% Polyline
n 9150 4200 m 9750 4200 l 9750 4800 l 9150 4800 l
 cp gs col0 s gr 
% Polyline
n 9750 4200 m 10350 4200 l 10350 4800 l 9750 4800 l
 cp gs col0 s gr 
/Times-Roman ff 266.67 scf sf
9450 5100 m
gs 1 -1 sc (0) col0 sh gr
/Times-Roman ff 266.67 scf sf
10050 5100 m
gs 1 -1 sc (1) col0 sh gr
/Times-Roman ff 266.67 scf sf
8250 5100 m
gs 1 -1 sc (2) col0 sh gr
/Times-Roman ff 266.67 scf sf
8850 5100 m
gs 1 -1 sc (3) col0 sh gr
/Times-Roman ff 266.67 scf sf
9450 5700 m
gs 1 -1 sc (4) col0 sh gr
/Times-Roman ff 266.67 scf sf
10050 5700 m
gs 1 -1 sc (5) col0 sh gr
/Times-Roman ff 266.67 scf sf
8250 5700 m
gs 1 -1 sc (6) col0 sh gr
/Times-Roman ff 266.67 scf sf
8850 5700 m
gs 1 -1 sc (7) col0 sh gr
/Times-Roman ff 266.67 scf sf
9450 3900 m
gs 1 -1 sc (8) col0 sh gr
/Times-Roman ff 266.67 scf sf
10050 3900 m
gs 1 -1 sc (9) col0 sh gr
/Times-Roman ff 266.67 scf sf
8100 3900 m
gs 1 -1 sc (10) col0 sh gr
/Times-Roman ff 266.67 scf sf
8700 3900 m
gs 1 -1 sc (11) col0 sh gr
/Times-Roman ff 266.67 scf sf
9300 4500 m
gs 1 -1 sc (12) col0 sh gr
/Times-Roman ff 266.67 scf sf
9900 4500 m
gs 1 -1 sc (13) col0 sh gr
/Times-Roman ff 266.67 scf sf
8700 4500 m
gs 1 -1 sc (15) col0 sh gr
/Times-Roman ff 266.67 scf sf
8100 4500 m
gs 1 -1 sc (14) col0 sh gr
% Polyline
n 10650 4200 m 11250 4200 l 11250 4800 l 10650 4800 l
 cp gs col0 s gr 
% Polyline
n 11250 4200 m 11850 4200 l 11850 4800 l 11250 4800 l
 cp gs col0 s gr 
% Polyline
n 11850 4200 m 12450 4200 l 12450 4800 l 11850 4800 l
 cp gs col0 s gr 
% Polyline
n 12450 4200 m 13050 4200 l 13050 4800 l 12450 4800 l
 cp gs col0 s gr 
% Polyline
n 10650 4800 m 11250 4800 l 11250 5400 l 10650 5400 l
 cp gs col0 s gr 
% Polyline
n 11250 4800 m 11850 4800 l 11850 5400 l 11250 5400 l
 cp gs col0 s gr 
% Polyline
n 11850 4800 m 12450 4800 l 12450 5400 l 11850 5400 l
 cp gs col0 s gr 
% Polyline
n 12450 4800 m 13050 4800 l 13050 5400 l 12450 5400 l
 cp gs col0 s gr 
% Polyline
n 10650 5400 m 11250 5400 l 11250 6000 l 10650 6000 l
 cp gs col0 s gr 
% Polyline
n 11250 5400 m 11850 5400 l 11850 6000 l 11250 6000 l
 cp gs col0 s gr 
% Polyline
n 11850 5400 m 12450 5400 l 12450 6000 l 11850 6000 l
 cp gs col0 s gr 
% Polyline
n 12450 5400 m 13050 5400 l 13050 6000 l 12450 6000 l
 cp gs col0 s gr 
% Polyline
n 10650 3600 m 11250 3600 l 11250 4200 l 10650 4200 l
 cp gs col0 s gr 
% Polyline
n 11250 3600 m 11850 3600 l 11850 4200 l 11250 4200 l
 cp gs col0 s gr 
% Polyline
n 11850 3600 m 12450 3600 l 12450 4200 l 11850 4200 l
 cp gs col0 s gr 
% Polyline
n 12450 3600 m 13050 3600 l 13050 4200 l 12450 4200 l
 cp gs col0 s gr 
/Times-Roman ff 266.67 scf sf
10800 3900 m
gs 1 -1 sc (26) col0 sh gr
/Times-Roman ff 266.67 scf sf
11400 3900 m
gs 1 -1 sc (27) col0 sh gr
/Times-Roman ff 266.67 scf sf
12000 3900 m
gs 1 -1 sc (24) col0 sh gr
/Times-Roman ff 266.67 scf sf
12600 3900 m
gs 1 -1 sc (25) col0 sh gr
/Times-Roman ff 266.67 scf sf
10800 4500 m
gs 1 -1 sc (30) col0 sh gr
/Times-Roman ff 266.67 scf sf
11400 4500 m
gs 1 -1 sc (31) col0 sh gr
/Times-Roman ff 266.67 scf sf
12000 4500 m
gs 1 -1 sc (28) col0 sh gr
/Times-Roman ff 266.67 scf sf
12600 4500 m
gs 1 -1 sc (29) col0 sh gr
/Times-Roman ff 266.67 scf sf
10800 5100 m
gs 1 -1 sc (18) col0 sh gr
/Times-Roman ff 266.67 scf sf
11400 5100 m
gs 1 -1 sc (19) col0 sh gr
/Times-Roman ff 266.67 scf sf
12000 5100 m
gs 1 -1 sc (16) col0 sh gr
/Times-Roman ff 266.67 scf sf
12600 5100 m
gs 1 -1 sc (17) col0 sh gr
/Times-Roman ff 266.67 scf sf
12000 5700 m
gs 1 -1 sc (20) col0 sh gr
/Times-Roman ff 266.67 scf sf
12600 5700 m
gs 1 -1 sc (21) col0 sh gr
/Times-Roman ff 266.67 scf sf
10800 5700 m
gs 1 -1 sc (22) col0 sh gr
/Times-Roman ff 266.67 scf sf
11400 5700 m
gs 1 -1 sc (23) col0 sh gr
% Polyline
n 5250 4800 m 5850 4800 l 5850 5400 l 5250 5400 l
 cp gs col0 s gr 
% Polyline
n 5850 4800 m 6450 4800 l 6450 5400 l 5850 5400 l
 cp gs col0 s gr 
% Polyline
n 6450 4800 m 7050 4800 l 7050 5400 l 6450 5400 l
 cp gs col0 s gr 
% Polyline
n 7050 4800 m 7650 4800 l 7650 5400 l 7050 5400 l
 cp gs col0 s gr 
% Polyline
n 5250 3600 m 5850 3600 l 5850 4200 l 5250 4200 l
 cp gs col0 s gr 
% Polyline
n 5850 3600 m 6450 3600 l 6450 4200 l 5850 4200 l
 cp gs col0 s gr 
% Polyline
n 6450 3600 m 7050 3600 l 7050 4200 l 6450 4200 l
 cp gs col0 s gr 
% Polyline
n 7050 3600 m 7650 3600 l 7650 4200 l 7050 4200 l
 cp gs col0 s gr 
% Polyline
n 5250 5400 m 5850 5400 l 5850 6000 l 5250 6000 l
 cp gs col0 s gr 
% Polyline
n 5850 5400 m 6450 5400 l 6450 6000 l 5850 6000 l
 cp gs col0 s gr 
% Polyline
n 6450 5400 m 7050 5400 l 7050 6000 l 6450 6000 l
 cp gs col0 s gr 
% Polyline
n 7050 5400 m 7650 5400 l 7650 6000 l 7050 6000 l
 cp gs col0 s gr 
% Polyline
n 5250 4200 m 5850 4200 l 5850 4800 l 5250 4800 l
 cp gs col0 s gr 
% Polyline
n 5850 4200 m 6450 4200 l 6450 4800 l 5850 4800 l
 cp gs col0 s gr 
% Polyline
n 6450 4200 m 7050 4200 l 7050 4800 l 6450 4800 l
 cp gs col0 s gr 
% Polyline
n 7050 4200 m 7650 4200 l 7650 4800 l 7050 4800 l
 cp gs col0 s gr 
/Times-Roman ff 266.67 scf sf
6600 4500 m
gs 1 -1 sc (60) col0 sh gr
/Times-Roman ff 266.67 scf sf
7200 4500 m
gs 1 -1 sc (61) col0 sh gr
/Times-Roman ff 266.67 scf sf
5400 4500 m
gs 1 -1 sc (62) col0 sh gr
/Times-Roman ff 266.67 scf sf
6000 4500 m
gs 1 -1 sc (63) col0 sh gr
/Times-Roman ff 266.67 scf sf
6600 3900 m
gs 1 -1 sc (56) col0 sh gr
/Times-Roman ff 266.67 scf sf
7200 3900 m
gs 1 -1 sc (57) col0 sh gr
/Times-Roman ff 266.67 scf sf
5400 3900 m
gs 1 -1 sc (58) col0 sh gr
/Times-Roman ff 266.67 scf sf
6000 3900 m
gs 1 -1 sc (59) col0 sh gr
/Times-Roman ff 266.67 scf sf
5400 5100 m
gs 1 -1 sc (50) col0 sh gr
/Times-Roman ff 266.67 scf sf
6000 5100 m
gs 1 -1 sc (51) col0 sh gr
/Times-Roman ff 266.67 scf sf
6600 5100 m
gs 1 -1 sc (48) col0 sh gr
/Times-Roman ff 266.67 scf sf
7200 5100 m
gs 1 -1 sc (49) col0 sh gr
/Times-Roman ff 266.67 scf sf
5400 5700 m
gs 1 -1 sc (54) col0 sh gr
/Times-Roman ff 266.67 scf sf
6000 5700 m
gs 1 -1 sc (55) col0 sh gr
/Times-Roman ff 266.67 scf sf
7200 5700 m
gs 1 -1 sc (53) col0 sh gr
/Times-Roman ff 266.67 scf sf
6600 5700 m
gs 1 -1 sc (52) col0 sh gr
% Polyline
n 2550 4800 m 3150 4800 l 3150 5400 l 2550 5400 l
 cp gs col0 s gr 
% Polyline
n 3150 4800 m 3750 4800 l 3750 5400 l 3150 5400 l
 cp gs col0 s gr 
% Polyline
n 3750 4800 m 4350 4800 l 4350 5400 l 3750 5400 l
 cp gs col0 s gr 
% Polyline
n 4350 4800 m 4950 4800 l 4950 5400 l 4350 5400 l
 cp gs col0 s gr 
% Polyline
n 2550 3600 m 3150 3600 l 3150 4200 l 2550 4200 l
 cp gs col0 s gr 
% Polyline
n 3150 3600 m 3750 3600 l 3750 4200 l 3150 4200 l
 cp gs col0 s gr 
% Polyline
n 3750 3600 m 4350 3600 l 4350 4200 l 3750 4200 l
 cp gs col0 s gr 
% Polyline
n 4350 3600 m 4950 3600 l 4950 4200 l 4350 4200 l
 cp gs col0 s gr 
% Polyline
n 2550 5400 m 3150 5400 l 3150 6000 l 2550 6000 l
 cp gs col0 s gr 
% Polyline
n 3150 5400 m 3750 5400 l 3750 6000 l 3150 6000 l
 cp gs col0 s gr 
% Polyline
n 3750 5400 m 4350 5400 l 4350 6000 l 3750 6000 l
 cp gs col0 s gr 
% Polyline
n 4350 5400 m 4950 5400 l 4950 6000 l 4350 6000 l
 cp gs col0 s gr 
% Polyline
n 2550 4200 m 3150 4200 l 3150 4800 l 2550 4800 l
 cp gs col0 s gr 
% Polyline
n 3150 4200 m 3750 4200 l 3750 4800 l 3150 4800 l
 cp gs col0 s gr 
% Polyline
n 3750 4200 m 4350 4200 l 4350 4800 l 3750 4800 l
 cp gs col0 s gr 
% Polyline
n 4350 4200 m 4950 4200 l 4950 4800 l 4350 4800 l
 cp gs col0 s gr 
/Times-Roman ff 266.67 scf sf
2700 3900 m
gs 1 -1 sc (42) col0 sh gr
/Times-Roman ff 266.67 scf sf
3300 3900 m
gs 1 -1 sc (43) col0 sh gr
/Times-Roman ff 266.67 scf sf
3900 3900 m
gs 1 -1 sc (40) col0 sh gr
/Times-Roman ff 266.67 scf sf
4500 3900 m
gs 1 -1 sc (41) col0 sh gr
/Times-Roman ff 266.67 scf sf
2700 4500 m
gs 1 -1 sc (46) col0 sh gr
/Times-Roman ff 266.67 scf sf
3300 4500 m
gs 1 -1 sc (47) col0 sh gr
/Times-Roman ff 266.67 scf sf
3900 4500 m
gs 1 -1 sc (44) col0 sh gr
/Times-Roman ff 266.67 scf sf
4500 4500 m
gs 1 -1 sc (45) col0 sh gr
/Times-Roman ff 266.67 scf sf
2700 5100 m
gs 1 -1 sc (34) col0 sh gr
/Times-Roman ff 266.67 scf sf
3300 5100 m
gs 1 -1 sc (35) col0 sh gr
/Times-Roman ff 266.67 scf sf
3900 5100 m
gs 1 -1 sc (32) col0 sh gr
/Times-Roman ff 266.67 scf sf
4500 5100 m
gs 1 -1 sc (33) col0 sh gr
/Times-Roman ff 266.67 scf sf
4500 5700 m
gs 1 -1 sc (37) col0 sh gr
/Times-Roman ff 266.67 scf sf
3900 5700 m
gs 1 -1 sc (36) col0 sh gr
/Times-Roman ff 266.67 scf sf
2700 5700 m
gs 1 -1 sc (38) col0 sh gr
/Times-Roman ff 266.67 scf sf
3300 5700 m
gs 1 -1 sc (39) col0 sh gr
/Times-Roman ff 333.33 scf sf
150 1950 m
gs 1 -1 sc (Before shifting) col0 sh gr
/Times-Roman ff 333.33 scf sf
150 4800 m
gs 1 -1 sc (After shifting) col0 sh gr
% here ends figure;
$F2psEnd
rs
showpage
%%Trailer
%EOF
