%!PS-Adobe-2.0 EPSF-2.0
%%Title: asymmetric_kernel2d.fig
%%Creator: fig2dev Version 3.2 Patchlevel 5
%%CreationDate: Mon Aug 24 19:12:58 2009
%%For: ben@ben-desktop (Benoit,,,)
%%BoundingBox: 0 0 254 153
%Magnification: 1.0000
%%EndComments
%%BeginProlog
/$F2psDict 200 dict def
$F2psDict begin
$F2psDict /mtrx matrix put
/col-1 {0 setgray} bind def
/col0 {0.000 0.000 0.000 srgb} bind def
/col1 {0.000 0.000 1.000 srgb} bind def
/col2 {0.000 1.000 0.000 srgb} bind def
/col3 {0.000 1.000 1.000 srgb} bind def
/col4 {1.000 0.000 0.000 srgb} bind def
/col5 {1.000 0.000 1.000 srgb} bind def
/col6 {1.000 1.000 0.000 srgb} bind def
/col7 {1.000 1.000 1.000 srgb} bind def
/col8 {0.000 0.000 0.560 srgb} bind def
/col9 {0.000 0.000 0.690 srgb} bind def
/col10 {0.000 0.000 0.820 srgb} bind def
/col11 {0.530 0.810 1.000 srgb} bind def
/col12 {0.000 0.560 0.000 srgb} bind def
/col13 {0.000 0.690 0.000 srgb} bind def
/col14 {0.000 0.820 0.000 srgb} bind def
/col15 {0.000 0.560 0.560 srgb} bind def
/col16 {0.000 0.690 0.690 srgb} bind def
/col17 {0.000 0.820 0.820 srgb} bind def
/col18 {0.560 0.000 0.000 srgb} bind def
/col19 {0.690 0.000 0.000 srgb} bind def
/col20 {0.820 0.000 0.000 srgb} bind def
/col21 {0.560 0.000 0.560 srgb} bind def
/col22 {0.690 0.000 0.690 srgb} bind def
/col23 {0.820 0.000 0.820 srgb} bind def
/col24 {0.500 0.190 0.000 srgb} bind def
/col25 {0.630 0.250 0.000 srgb} bind def
/col26 {0.750 0.380 0.000 srgb} bind def
/col27 {1.000 0.500 0.500 srgb} bind def
/col28 {1.000 0.630 0.630 srgb} bind def
/col29 {1.000 0.750 0.750 srgb} bind def
/col30 {1.000 0.880 0.880 srgb} bind def
/col31 {1.000 0.840 0.000 srgb} bind def

end

/cp {closepath} bind def
/ef {eofill} bind def
/gr {grestore} bind def
/gs {gsave} bind def
/sa {save} bind def
/rs {restore} bind def
/l {lineto} bind def
/m {moveto} bind def
/rm {rmoveto} bind def
/n {newpath} bind def
/s {stroke} bind def
/sh {show} bind def
/slc {setlinecap} bind def
/slj {setlinejoin} bind def
/slw {setlinewidth} bind def
/srgb {setrgbcolor} bind def
/rot {rotate} bind def
/sc {scale} bind def
/sd {setdash} bind def
/ff {findfont} bind def
/sf {setfont} bind def
/scf {scalefont} bind def
/sw {stringwidth} bind def
/tr {translate} bind def
/tnt {dup dup currentrgbcolor
  4 -2 roll dup 1 exch sub 3 -1 roll mul add
  4 -2 roll dup 1 exch sub 3 -1 roll mul add
  4 -2 roll dup 1 exch sub 3 -1 roll mul add srgb}
  bind def
/shd {dup dup currentrgbcolor 4 -2 roll mul 4 -2 roll mul
  4 -2 roll mul srgb} bind def
/$F2psBegin {$F2psDict begin /$F2psEnteredState save def} def
/$F2psEnd {$F2psEnteredState restore end} def

/pageheader {
save
newpath 0 153 moveto 0 0 lineto 254 0 lineto 254 153 lineto closepath clip newpath
-140.3 199.8 translate
1 -1 scale
$F2psBegin
10 setmiterlimit
0 slj 0 slc
 0.06299 0.06299 sc
} bind def
/pagefooter {
$F2psEnd
restore
} bind def
%%EndProlog
pageheader
%
% Fig objects follow
%
% 
% here starts figure with depth 50
% Polyline
0 slj
0 slc
15.000 slw
n 2250 1350 m 2700 1350 l 2700 1800 l 2250 1800 l
 cp gs col0 s gr 
% Polyline
n 2700 1350 m 3150 1350 l 3150 1800 l 2700 1800 l
 cp gs col0 s gr 
% Polyline
n 3150 1350 m 3600 1350 l 3600 1800 l 3150 1800 l
 cp gs col0 s gr 
% Polyline
n 3600 1350 m 4050 1350 l 4050 1800 l 3600 1800 l
 cp gs col0 s gr 
% Polyline
n 4050 1350 m 4500 1350 l 4500 1800 l 4050 1800 l
 cp gs col0 s gr 
% Polyline
n 4500 1350 m 4950 1350 l 4950 1800 l 4500 1800 l
 cp gs col0 s gr 
% Polyline
n 2250 2250 m 2700 2250 l 2700 2700 l 2250 2700 l
 cp gs col0 s gr 
% Polyline
n 2700 2250 m 3150 2250 l 3150 2700 l 2700 2700 l
 cp gs col0 s gr 
% Polyline
n 3150 2250 m 3600 2250 l 3600 2700 l 3150 2700 l
 cp gs col0 s gr 
% Polyline
n 3600 2250 m 4050 2250 l 4050 2700 l 3600 2700 l
 cp gs col0 s gr 
% Polyline
n 4050 2250 m 4500 2250 l 4500 2700 l 4050 2700 l
 cp gs col0 s gr 
% Polyline
n 4500 2250 m 4950 2250 l 4950 2700 l 4500 2700 l
 cp gs col0 s gr 
% Polyline
n 2250 2700 m 2700 2700 l 2700 3150 l 2250 3150 l
 cp gs col0 s gr 
% Polyline
n 2700 2700 m 3150 2700 l 3150 3150 l 2700 3150 l
 cp gs col0 s gr 
% Polyline
n 3150 2700 m 3600 2700 l 3600 3150 l 3150 3150 l
 cp gs col0 s gr 
% Polyline
n 3600 2700 m 4050 2700 l 4050 3150 l 3600 3150 l
 cp gs col0 s gr 
% Polyline
n 4050 2700 m 4500 2700 l 4500 3150 l 4050 3150 l
 cp gs col0 s gr 
% Polyline
n 4500 2700 m 4950 2700 l 4950 3150 l 4500 3150 l
 cp gs col0 s gr 
% Polyline
n 2250 1800 m 2700 1800 l 2700 2250 l 2250 2250 l
 cp gs col0 s gr 
% Polyline
n 2700 1800 m 3150 1800 l 3150 2250 l 2700 2250 l
 cp gs col0 s gr 
% Polyline
n 3150 1800 m 3600 1800 l 3600 2250 l 3150 2250 l
 cp gs col0 s gr 
% Polyline
n 4050 1800 m 4500 1800 l 4500 2250 l 4050 2250 l
 cp gs col0 s gr 
% Polyline
n 4500 1800 m 4950 1800 l 4950 2250 l 4500 2250 l
 cp gs col0 s gr 
% Polyline
n 3600 1800 m 4050 1800 l 4050 2250 l 3600 2250 l
 cp gs col1 1.00 shd ef gr gs col0 s gr 
% Polyline
gs  clippath
3467 1162 m 3615 1162 l 3615 1087 l 3467 1087 l 3467 1087 l 3587 1125 l 3467 1162 l cp
2383 1087 m 2235 1087 l 2235 1162 l 2383 1162 l 2383 1162 l 2263 1125 l 2383 1087 l cp
eoclip
n 2250 1125 m
 3600 1125 l gs col0 s gr gr

% arrowhead
7.500 slw
n 2383 1087 m 2263 1125 l 2383 1162 l  col0 s
% arrowhead
n 3467 1162 m 3587 1125 l 3467 1087 l  col0 s
% Polyline
15.000 slw
gs  clippath
4817 1117 m 4965 1117 l 4965 1042 l 4817 1042 l 4817 1042 l 4937 1080 l 4817 1117 l cp
4183 1042 m 4035 1042 l 4035 1117 l 4183 1117 l 4183 1117 l 4063 1080 l 4183 1042 l cp
eoclip
n 4050 1080 m
 4950 1080 l gs col0 s gr gr

% arrowhead
7.500 slw
n 4183 1042 m 4063 1080 l 4183 1117 l  col0 s
% arrowhead
n 4817 1117 m 4937 1080 l 4817 1042 l  col0 s
% Polyline
15.000 slw
gs  clippath
5212 1483 m 5212 1335 l 5137 1335 l 5137 1483 l 5137 1483 l 5175 1363 l 5212 1483 l cp
5137 1712 m 5137 1860 l 5212 1860 l 5212 1712 l 5212 1712 l 5175 1832 l 5137 1712 l cp
eoclip
n 5175 1845 m
 5175 1350 l gs col0 s gr gr

% arrowhead
7.500 slw
n 5137 1712 m 5175 1832 l 5212 1712 l  col0 s
% arrowhead
n 5212 1483 m 5175 1363 l 5137 1483 l  col0 s
% Polyline
15.000 slw
gs  clippath
5212 2383 m 5212 2235 l 5137 2235 l 5137 2383 l 5137 2383 l 5175 2263 l 5212 2383 l cp
5137 3017 m 5137 3165 l 5212 3165 l 5212 3017 l 5212 3017 l 5175 3137 l 5137 3017 l cp
eoclip
n 5175 3150 m
 5175 2250 l gs col0 s gr gr

% arrowhead
7.500 slw
n 5137 3017 m 5175 3137 l 5212 3017 l  col0 s
% arrowhead
n 5212 2383 m 5175 2263 l 5137 2383 l  col0 s
/Times-Bold ff 222.25 scf sf
2475 945 m
gs 1 -1 sc (ksize_left) col0 sh gr
/Times-Bold ff 222.25 scf sf
4005 945 m
gs 1 -1 sc (ksize_right) col0 sh gr
/Times-Bold ff 222.25 scf sf
5265 1665 m
gs 1 -1 sc (ksize_up) col0 sh gr
/Times-Bold ff 222.25 scf sf
5265 2745 m
gs 1 -1 sc (ksize_bot) col0 sh gr
% here ends figure;
pagefooter
showpage
%%Trailer
%EOF
