<?xml version="1.0" encoding="UTF-8" standalone="no"?>
<!-- Created with Inkscape (http://www.inkscape.org/) -->
<svg
   xmlns:dc="http://purl.org/dc/elements/1.1/"
   xmlns:cc="http://creativecommons.org/ns#"
   xmlns:rdf="http://www.w3.org/1999/02/22-rdf-syntax-ns#"
   xmlns:svg="http://www.w3.org/2000/svg"
   xmlns="http://www.w3.org/2000/svg"
   xmlns:sodipodi="http://sodipodi.sourceforge.net/DTD/sodipodi-0.dtd"
   xmlns:inkscape="http://www.inkscape.org/namespaces/inkscape"
   width="210mm"
   height="297mm"
   id="svg2"
   sodipodi:version="0.32"
   inkscape:version="0.46"
   sodipodi:docname="threads.svg"
   inkscape:output_extension="org.inkscape.output.svg.inkscape">
  <defs
     id="defs4">
    <marker
       inkscape:stockid="DotL"
       orient="auto"
       refY="0.0"
       refX="0.0"
       id="DotL"
       style="overflow:visible">
      <path
         id="path3300"
         d="M -2.5,-1.0 C -2.5,1.7600000 -4.7400000,4.0 -7.5,4.0 C -10.260000,4.0 -12.5,1.7600000 -12.5,-1.0 C -12.5,-3.7600000 -10.260000,-6.0 -7.5,-6.0 C -4.7400000,-6.0 -2.5,-3.7600000 -2.5,-1.0 z "
         style="fill-rule:evenodd;stroke:#000000;stroke-width:1.0pt;marker-start:none;marker-end:none"
         transform="scale(0.8) translate(7.4, 1)" />
    </marker>
    <marker
       inkscape:stockid="Arrow1Lend"
       orient="auto"
       refY="0.0"
       refX="0.0"
       id="Arrow1Lend"
       style="overflow:visible;">
      <path
         id="path3241"
         d="M 0.0,0.0 L 5.0,-5.0 L -12.5,0.0 L 5.0,5.0 L 0.0,0.0 z "
         style="fill-rule:evenodd;stroke:#000000;stroke-width:1.0pt;marker-start:none;"
         transform="scale(0.8) rotate(180) translate(12.5,0)" />
    </marker>
    <inkscape:perspective
       sodipodi:type="inkscape:persp3d"
       inkscape:vp_x="0 : 526.18109 : 1"
       inkscape:vp_y="0 : 1000 : 0"
       inkscape:vp_z="744.09448 : 526.18109 : 1"
       inkscape:persp3d-origin="372.04724 : 350.78739 : 1"
       id="perspective10" />
  </defs>
  <sodipodi:namedview
     id="base"
     pagecolor="#ffffff"
     bordercolor="#666666"
     borderopacity="1.0"
     inkscape:pageopacity="0.0"
     inkscape:pageshadow="2"
     inkscape:zoom="0.7"
     inkscape:cx="322.3732"
     inkscape:cy="892.07052"
     inkscape:document-units="px"
     inkscape:current-layer="layer1"
     showgrid="false"
     showguides="true"
     inkscape:guide-bbox="true"
     inkscape:window-width="1576"
     inkscape:window-height="1116"
     inkscape:window-x="50"
     inkscape:window-y="0"
     showborder="false"
     inkscape:showpageshadow="false" />
  <metadata
     id="metadata7">
    <rdf:RDF>
      <cc:Work
         rdf:about="">
        <dc:format>image/svg+xml</dc:format>
        <dc:type
           rdf:resource="http://purl.org/dc/dcmitype/StillImage" />
      </cc:Work>
    </rdf:RDF>
  </metadata>
  <g
     inkscape:label="Calque 1"
     inkscape:groupmode="layer"
     id="layer1">
    <rect
       style="opacity:1;fill:#ffffff;fill-opacity:1;fill-rule:nonzero;stroke:none;stroke-width:1;stroke-linecap:butt;stroke-linejoin:miter;stroke-miterlimit:4;stroke-dasharray:none;stroke-dashoffset:0;stroke-opacity:1"
       id="rect11862"
       width="1268.5714"
       height="640"
       x="-234.28572"
       y="-17.637819"
       ry="15.679286"
       inkscape:export-filename="/home/antoine/Documents/rnaspace/docs/threads.png"
       inkscape:export-xdpi="90"
       inkscape:export-ydpi="90" />
    <rect
       style="opacity:1;fill:#d4d4d4;fill-opacity:1;fill-rule:nonzero;stroke:#000000;stroke-width:0.3446908;stroke-linecap:butt;stroke-linejoin:miter;stroke-miterlimit:4;stroke-dasharray:none;stroke-dashoffset:0;stroke-opacity:1"
       id="rect2383"
       width="116.30653"
       height="62.464039"
       x="318.75537"
       y="9.8315601"
       ry="8.1379204"
       inkscape:export-filename="/home/antoine/Documents/rnaspace/docs/threads.png"
       inkscape:export-xdpi="90"
       inkscape:export-ydpi="90" />
    <text
       xml:space="preserve"
       style="font-size:10.364151px;font-style:normal;font-variant:normal;font-weight:normal;font-stretch:normal;text-align:start;line-height:100%;writing-mode:lr-tb;text-anchor:start;fill:#000000;fill-opacity:1;stroke:none;stroke-width:1px;stroke-linecap:butt;stroke-linejoin:miter;stroke-opacity:1;font-family:Arial;-inkscape-font-specification:Arial"
       x="349.7196"
       y="41.437496"
       id="text3165"
       sodipodi:linespacing="100%"
       inkscape:export-filename="/home/antoine/Documents/rnaspace/docs/threads.png"
       inkscape:export-xdpi="90"
       inkscape:export-ydpi="90"><tspan
         sodipodi:role="line"
         id="tspan3167"
         x="349.7196"
         y="41.437496">main thread </tspan></text>
    <rect
       style="opacity:1;fill:#d4d4d4;fill-opacity:1;fill-rule:nonzero;stroke:#000000;stroke-width:0.64048243;stroke-linecap:butt;stroke-linejoin:miter;stroke-miterlimit:4;stroke-dasharray:none;stroke-dashoffset:0;stroke-opacity:1"
       id="rect3191"
       width="116.01073"
       height="216.21761"
       x="-34.192043"
       y="226.03496"
       ry="28.169193"
       inkscape:export-filename="/home/antoine/Documents/rnaspace/docs/threads.png"
       inkscape:export-xdpi="90"
       inkscape:export-ydpi="90" />
    <rect
       style="opacity:1;fill:#d4d4d4;fill-opacity:1;fill-rule:nonzero;stroke:#000000;stroke-width:0.64268446;stroke-linecap:butt;stroke-linejoin:miter;stroke-miterlimit:4;stroke-dasharray:none;stroke-dashoffset:0;stroke-opacity:1"
       id="rect3193"
       width="116.00854"
       height="217.71101"
       x="91.441536"
       y="226.03607"
       ry="28.363758"
       inkscape:export-filename="/home/antoine/Documents/rnaspace/docs/threads.png"
       inkscape:export-xdpi="90"
       inkscape:export-ydpi="90" />
    <rect
       style="opacity:1;fill:#d4d4d4;fill-opacity:1;fill-rule:nonzero;stroke:#000000;stroke-width:0.64487886;stroke-linecap:butt;stroke-linejoin:miter;stroke-miterlimit:4;stroke-dasharray:none;stroke-dashoffset:0;stroke-opacity:1"
       id="rect3195"
       width="116.00633"
       height="219.20445"
       x="221.56198"
       y="226.03717"
       ry="28.558323"
       inkscape:export-filename="/home/antoine/Documents/rnaspace/docs/threads.png"
       inkscape:export-xdpi="90"
       inkscape:export-ydpi="90" />
    <text
       xml:space="preserve"
       style="font-size:10.364151px;font-style:normal;font-variant:normal;font-weight:normal;font-stretch:normal;text-align:start;line-height:100%;writing-mode:lr-tb;text-anchor:start;fill:#000000;fill-opacity:1;stroke:none;stroke-width:1px;stroke-linecap:butt;stroke-linejoin:miter;stroke-opacity:1;font-family:Arial;-inkscape-font-specification:Arial"
       x="-12.829487"
       y="259.81387"
       id="text3173"
       sodipodi:linespacing="100%"
       inkscape:export-filename="/home/antoine/Documents/rnaspace/docs/threads.png"
       inkscape:export-xdpi="90"
       inkscape:export-ydpi="90"><tspan
         sodipodi:role="line"
         id="tspan3175"
         x="-12.829487"
         y="259.81387">thread wrapper1</tspan></text>
    <text
       xml:space="preserve"
       style="font-size:10.364151px;font-style:normal;font-variant:normal;font-weight:normal;font-stretch:normal;text-align:start;line-height:100%;writing-mode:lr-tb;text-anchor:start;fill:#000000;fill-opacity:1;stroke:none;stroke-width:1px;stroke-linecap:butt;stroke-linejoin:miter;stroke-opacity:1;font-family:Arial;-inkscape-font-specification:Arial"
       x="107.56832"
       y="259.81387"
       id="text3177"
       sodipodi:linespacing="100%"
       inkscape:export-filename="/home/antoine/Documents/rnaspace/docs/threads.png"
       inkscape:export-xdpi="90"
       inkscape:export-ydpi="90"><tspan
         sodipodi:role="line"
         id="tspan3179"
         x="107.56832"
         y="259.81387">thread wrapper2</tspan></text>
    <text
       xml:space="preserve"
       style="font-size:10.364151px;font-style:normal;font-variant:normal;font-weight:normal;font-stretch:normal;text-align:start;line-height:100%;writing-mode:lr-tb;text-anchor:start;fill:#000000;fill-opacity:1;stroke:none;stroke-width:1px;stroke-linecap:butt;stroke-linejoin:miter;stroke-opacity:1;font-family:Arial;-inkscape-font-specification:Arial"
       x="239.93109"
       y="259.81387"
       id="text3181"
       sodipodi:linespacing="100%"
       inkscape:export-filename="/home/antoine/Documents/rnaspace/docs/threads.png"
       inkscape:export-xdpi="90"
       inkscape:export-ydpi="90"><tspan
         sodipodi:role="line"
         id="tspan3183"
         x="239.93109"
         y="259.81387">thread wrapper3</tspan></text>
    <rect
       style="opacity:1;fill:#d4d4d4;fill-opacity:1;fill-rule:nonzero;stroke:#000000;stroke-width:0.64268446;stroke-linecap:butt;stroke-linejoin:miter;stroke-miterlimit:4;stroke-dasharray:none;stroke-dashoffset:0;stroke-opacity:1"
       id="rect8135"
       width="116.00854"
       height="217.71101"
       x="498.81894"
       y="225.91029"
       ry="28.363758"
       inkscape:export-filename="/home/antoine/Documents/rnaspace/docs/threads.png"
       inkscape:export-xdpi="90"
       inkscape:export-ydpi="90" />
    <rect
       style="opacity:1;fill:#d4d4d4;fill-opacity:1;fill-rule:nonzero;stroke:#000000;stroke-width:0.63827276;stroke-linecap:butt;stroke-linejoin:miter;stroke-miterlimit:4;stroke-dasharray:none;stroke-dashoffset:0;stroke-opacity:1"
       id="rect8137"
       width="116.01294"
       height="214.72418"
       x="624.44922"
       y="225.90808"
       ry="27.974627"
       inkscape:export-filename="/home/antoine/Documents/rnaspace/docs/threads.png"
       inkscape:export-xdpi="90"
       inkscape:export-ydpi="90" />
    <text
       xml:space="preserve"
       style="font-size:10.364151px;font-style:normal;font-variant:normal;font-weight:normal;font-stretch:normal;text-align:start;line-height:100%;writing-mode:lr-tb;text-anchor:start;fill:#000000;fill-opacity:1;stroke:none;stroke-width:1px;stroke-linecap:butt;stroke-linejoin:miter;stroke-opacity:1;font-family:Arial;-inkscape-font-specification:Arial"
       x="520.18036"
       y="259.68811"
       id="text8147"
       sodipodi:linespacing="100%"
       inkscape:export-filename="/home/antoine/Documents/rnaspace/docs/threads.png"
       inkscape:export-xdpi="90"
       inkscape:export-ydpi="90"><tspan
         sodipodi:role="line"
         id="tspan8149"
         x="520.18036"
         y="259.68811">thread wrapper1</tspan></text>
    <text
       xml:space="preserve"
       style="font-size:10.364151px;font-style:normal;font-variant:normal;font-weight:normal;font-stretch:normal;text-align:start;line-height:100%;writing-mode:lr-tb;text-anchor:start;fill:#000000;fill-opacity:1;stroke:none;stroke-width:1px;stroke-linecap:butt;stroke-linejoin:miter;stroke-opacity:1;font-family:Arial;-inkscape-font-specification:Arial"
       x="640.57825"
       y="259.68811"
       id="text8151"
       sodipodi:linespacing="100%"
       inkscape:export-filename="/home/antoine/Documents/rnaspace/docs/threads.png"
       inkscape:export-xdpi="90"
       inkscape:export-ydpi="90"><tspan
         sodipodi:role="line"
         id="tspan8153"
         x="640.57825"
         y="259.68811">thread wrapper2</tspan></text>
    <path
       style="fill:none;fill-rule:evenodd;stroke:#009a00;stroke-width:0.74029648px;stroke-linecap:butt;stroke-linejoin:miter;stroke-opacity:1"
       d="M 110.76836,501.88015 L 172.10721,501.88015"
       id="path10241"
       inkscape:export-filename="/home/antoine/Documents/rnaspace/docs/threads.png"
       inkscape:export-xdpi="90"
       inkscape:export-ydpi="90" />
    <path
       style="fill:none;fill-rule:evenodd;stroke:#0000b2;stroke-width:0.74029648px;stroke-linecap:butt;stroke-linejoin:miter;stroke-opacity:1"
       d="M 110.76836,549.31985 L 172.10721,549.31985"
       id="path10243"
       inkscape:export-filename="/home/antoine/Documents/rnaspace/docs/threads.png"
       inkscape:export-xdpi="90"
       inkscape:export-ydpi="90" />
    <text
       xml:space="preserve"
       style="font-size:10.364151px;font-style:normal;font-variant:normal;font-weight:normal;font-stretch:normal;text-align:start;line-height:100%;writing-mode:lr-tb;text-anchor:start;fill:#000000;fill-opacity:1;stroke:none;stroke-width:1px;stroke-linecap:butt;stroke-linejoin:miter;stroke-opacity:1;font-family:Arial;-inkscape-font-specification:Arial"
       x="196.55798"
       y="504.58002"
       id="text10245"
       sodipodi:linespacing="100%"
       inkscape:export-filename="/home/antoine/Documents/rnaspace/docs/threads.png"
       inkscape:export-xdpi="90"
       inkscape:export-ydpi="90"><tspan
         sodipodi:role="line"
         x="196.55798"
         y="514.94415"
         id="tspan2466">The main thread launch the wrappers threads each time the run button is clicked =&gt; the web server remains accessible.</tspan></text>
    <text
       sodipodi:linespacing="100%"
       id="text10249"
       y="551.95898"
       x="196.55798"
       style="font-size:10.364151px;font-style:normal;font-variant:normal;font-weight:normal;font-stretch:normal;text-align:start;line-height:100%;writing-mode:lr-tb;text-anchor:start;fill:#000000;fill-opacity:1;stroke:none;stroke-width:1px;stroke-linecap:butt;stroke-linejoin:miter;stroke-opacity:1;font-family:Arial;-inkscape-font-specification:Arial"
       xml:space="preserve"
       inkscape:export-filename="/home/antoine/Documents/rnaspace/docs/threads.png"
       inkscape:export-xdpi="90"
       inkscape:export-ydpi="90"><tspan
         y="551.95898"
         x="196.55798"
         sodipodi:role="line"
         id="tspan2470">The wrappers threads execute external programs and wait for them. Then they save the results</tspan></text>
    <path
       style="fill:none;fill-rule:evenodd;stroke:#0000b2;stroke-width:0.74029648px;stroke-linecap:butt;stroke-linejoin:miter;marker-start:url(#DotL);marker-end:url(#Arrow1Lend);stroke-opacity:1"
       d="M 23.065508,282.8456 L -94.341034,315.00153"
       id="path10253"
       sodipodi:nodetypes="cc"
       inkscape:export-filename="/home/antoine/Documents/rnaspace/docs/threads.png"
       inkscape:export-xdpi="90"
       inkscape:export-ydpi="90" />
    <path
       style="fill:none;fill-rule:evenodd;stroke:#0000b2;stroke-width:0.74029648px;stroke-linecap:butt;stroke-linejoin:miter;marker-end:url(#Arrow1Lend);stroke-opacity:1"
       d="M -89.854159,332.94903 L 17.83082,356.87903"
       id="path10774"
       inkscape:export-filename="/home/antoine/Documents/rnaspace/docs/threads.png"
       inkscape:export-xdpi="90"
       inkscape:export-ydpi="90" />
    <path
       style="fill:none;fill-rule:evenodd;stroke:#000000;stroke-width:0.74029648;stroke-linecap:butt;stroke-linejoin:miter;stroke-miterlimit:4;stroke-dasharray:2.22088943, 0.74029648;stroke-dashoffset:0;stroke-opacity:1"
       d="M 23.065508,287.33248 L 23.065508,356.87903"
       id="path11814"
       sodipodi:nodetypes="cc"
       inkscape:export-filename="/home/antoine/Documents/rnaspace/docs/threads.png"
       inkscape:export-xdpi="90"
       inkscape:export-ydpi="90" />
    <text
       xml:space="preserve"
       style="font-size:10.364151px;font-style:normal;font-variant:normal;font-weight:normal;font-stretch:normal;text-align:start;line-height:100%;writing-mode:lr-tb;text-anchor:start;fill:#000000;fill-opacity:1;stroke:none;stroke-width:1px;stroke-linecap:butt;stroke-linejoin:miter;stroke-opacity:1;font-family:Arial;-inkscape-font-specification:Arial"
       x="31.291447"
       y="320.23621"
       id="text11816"
       sodipodi:linespacing="100%"
       inkscape:export-filename="/home/antoine/Documents/rnaspace/docs/threads.png"
       inkscape:export-xdpi="90"
       inkscape:export-ydpi="90"><tspan
         sodipodi:role="line"
         id="tspan11818"
         x="31.291447"
         y="320.23621">wait</tspan></text>
    <text
       xml:space="preserve"
       style="font-size:10.364151px;font-style:normal;font-variant:normal;font-weight:normal;font-stretch:normal;text-align:center;line-height:100%;writing-mode:lr-tb;text-anchor:middle;fill:#000000;fill-opacity:1;stroke:none;stroke-width:1px;stroke-linecap:butt;stroke-linejoin:miter;stroke-opacity:1;font-family:Arial;-inkscape-font-specification:Arial"
       x="26.056755"
       y="377.95306"
       id="text11820"
       sodipodi:linespacing="100%"
       inkscape:export-filename="/home/antoine/Documents/rnaspace/docs/threads.png"
       inkscape:export-xdpi="90"
       inkscape:export-ydpi="90"><tspan
         sodipodi:role="line"
         x="26.056755"
         y="377.95306"
         id="tspan11826">save results</tspan></text>
    <rect
       style="opacity:1;fill:none;fill-opacity:0.5736677;fill-rule:nonzero;stroke:#000000;stroke-width:0.66908777;stroke-linecap:butt;stroke-linejoin:miter;stroke-miterlimit:4;stroke-dasharray:none;stroke-dashoffset:0;stroke-opacity:1"
       id="rect11828"
       width="878.3678"
       height="480.25201"
       x="-48.802734"
       y="-6.5007572"
       ry="23.413042"
       inkscape:export-filename="/home/antoine/Documents/rnaspace/docs/threads.png"
       inkscape:export-xdpi="90"
       inkscape:export-ydpi="90" />
    <text
       xml:space="preserve"
       style="font-size:10.364151px;font-style:normal;font-variant:normal;font-weight:normal;font-stretch:normal;text-align:start;line-height:100%;writing-mode:lr-tb;text-anchor:start;fill:#000000;fill-opacity:1;stroke:none;stroke-width:1px;stroke-linecap:butt;stroke-linejoin:miter;stroke-opacity:1;font-family:Arial;-inkscape-font-specification:Arial"
       x="-29.581993"
       y="11.606793"
       id="text11830"
       sodipodi:linespacing="100%"
       inkscape:export-filename="/home/antoine/Documents/rnaspace/docs/threads.png"
       inkscape:export-xdpi="90"
       inkscape:export-ydpi="90"><tspan
         sodipodi:role="line"
         id="tspan11832"
         x="-29.581993"
         y="11.606793">Python processus</tspan></text>
    <path
       style="fill:none;fill-rule:evenodd;stroke:#000000;stroke-width:0.74029648px;stroke-linecap:butt;stroke-linejoin:miter;stroke-opacity:1"
       d="M -48.88258,22.446849 L 65.334594,22.446849 L 65.334594,-6.3718359"
       id="path11834"
       inkscape:export-filename="/home/antoine/Documents/rnaspace/docs/threads.png"
       inkscape:export-xdpi="90"
       inkscape:export-ydpi="90" />
    <rect
       style="opacity:1;fill:none;fill-opacity:0.5736677;fill-rule:nonzero;stroke:#000000;stroke-width:0.49881291;stroke-linecap:butt;stroke-linejoin:miter;stroke-miterlimit:4;stroke-dasharray:none;stroke-dashoffset:0;stroke-opacity:1"
       id="rect11836"
       width="132.43729"
       height="98.595161"
       x="-227.46765"
       y="293.85629"
       ry="15.700974"
       inkscape:export-filename="/home/antoine/Documents/rnaspace/docs/threads.png"
       inkscape:export-xdpi="90"
       inkscape:export-ydpi="90" />
    <text
       xml:space="preserve"
       style="font-size:10.364151px;font-style:normal;font-variant:normal;font-weight:normal;font-stretch:normal;text-align:start;line-height:100%;writing-mode:lr-tb;text-anchor:start;fill:#000000;fill-opacity:1;stroke:none;stroke-width:1px;stroke-linecap:butt;stroke-linejoin:miter;stroke-opacity:1;font-family:Arial;-inkscape-font-specification:Arial"
       x="-217.1414"
       y="312.21442"
       id="text11838"
       sodipodi:linespacing="100%"
       inkscape:export-filename="/home/antoine/Documents/rnaspace/docs/threads.png"
       inkscape:export-xdpi="90"
       inkscape:export-ydpi="90"><tspan
         sodipodi:role="line"
         id="tspan11840"
         x="-217.1414"
         y="312.21442">YASS processus</tspan></text>
    <path
       style="fill:none;fill-rule:evenodd;stroke:#000000;stroke-width:0.74029648px;stroke-linecap:butt;stroke-linejoin:miter;stroke-opacity:1"
       d="M -227.55842,323.05445 L -129.79312,323.05445 L -129.79312,294.23577"
       id="path11842"
       sodipodi:nodetypes="ccc"
       inkscape:export-filename="/home/antoine/Documents/rnaspace/docs/threads.png"
       inkscape:export-xdpi="90"
       inkscape:export-ydpi="90" />
    <text
       xml:space="preserve"
       style="font-size:10.364151px;font-style:normal;font-variant:normal;font-weight:normal;font-stretch:normal;text-align:start;line-height:100%;writing-mode:lr-tb;text-anchor:start;fill:#000000;fill-opacity:1;stroke:none;stroke-width:1px;stroke-linecap:butt;stroke-linejoin:miter;stroke-opacity:1;font-family:Arial;-inkscape-font-specification:Arial"
       x="-174.73087"
       y="357.20126"
       id="text11844"
       sodipodi:linespacing="100%"
       inkscape:export-filename="/home/antoine/Documents/rnaspace/docs/threads.png"
       inkscape:export-xdpi="90"
       inkscape:export-ydpi="90"><tspan
         sodipodi:role="line"
         id="tspan11846"
         x="-174.73087"
         y="357.20126">yass</tspan></text>
    <path
       style="fill:none;fill-rule:evenodd;stroke:#009a00;stroke-width:1px;stroke-linecap:butt;stroke-linejoin:miter;stroke-opacity:1;marker-end:url(#Arrow1Lend)"
       d="M 12.857143,132.36218 L 691.42857,132.36218 L 691.42857,223.79075"
       id="path2474"
       inkscape:export-filename="/home/antoine/Documents/rnaspace/docs/threads.png"
       inkscape:export-xdpi="90"
       inkscape:export-ydpi="90" />
    <path
       style="fill:none;fill-rule:evenodd;stroke:#009c00;stroke-width:1px;stroke-linecap:butt;stroke-linejoin:miter;stroke-opacity:1"
       d="M 376.42857,71.647896 L 376.42857,131.6479"
       id="path3779"
       inkscape:export-filename="/home/antoine/Documents/rnaspace/docs/threads.png"
       inkscape:export-xdpi="90"
       inkscape:export-ydpi="90" />
    <path
       style="fill:none;fill-rule:evenodd;stroke:#009c00;stroke-width:1px;stroke-linecap:butt;stroke-linejoin:miter;stroke-opacity:1;marker-end:url(#Arrow1Lend)"
       d="M 546.42857,132.36218 L 546.42857,225.21933"
       id="path3781"
       inkscape:export-filename="/home/antoine/Documents/rnaspace/docs/threads.png"
       inkscape:export-xdpi="90"
       inkscape:export-ydpi="90" />
    <path
       id="path4304"
       d="M 278.42857,132.36218 L 278.42857,225.21933"
       style="fill:none;fill-rule:evenodd;stroke:#009c00;stroke-width:1px;stroke-linecap:butt;stroke-linejoin:miter;marker-end:url(#Arrow1Lend);stroke-opacity:1"
       inkscape:export-filename="/home/antoine/Documents/rnaspace/docs/threads.png"
       inkscape:export-xdpi="90"
       inkscape:export-ydpi="90" />
    <path
       style="fill:none;fill-rule:evenodd;stroke:#009c00;stroke-width:1px;stroke-linecap:butt;stroke-linejoin:miter;marker-end:url(#Arrow1Lend);stroke-opacity:1"
       d="M 148.42857,132.36218 L 148.42857,225.21933"
       id="path4306"
       inkscape:export-filename="/home/antoine/Documents/rnaspace/docs/threads.png"
       inkscape:export-xdpi="90"
       inkscape:export-ydpi="90" />
    <path
       id="path4308"
       d="M 13.357144,132.36218 L 13.357144,225.21933"
       style="fill:none;fill-rule:evenodd;stroke:#009c00;stroke-width:1px;stroke-linecap:butt;stroke-linejoin:miter;marker-end:url(#Arrow1Lend);stroke-opacity:1"
       inkscape:export-filename="/home/antoine/Documents/rnaspace/docs/threads.png"
       inkscape:export-xdpi="90"
       inkscape:export-ydpi="90" />
    <text
       xml:space="preserve"
       style="font-size:48px;font-style:normal;font-variant:normal;font-weight:normal;font-stretch:normal;text-align:start;line-height:100%;writing-mode:lr;text-anchor:start;fill:#000000;fill-opacity:1;stroke:none;stroke-width:1px;stroke-linecap:butt;stroke-linejoin:miter;stroke-opacity:1;font-family:Arial;-inkscape-font-specification:Arial"
       x="357.14285"
       y="315.21933"
       id="text4310"
       sodipodi:linespacing="100%"
       inkscape:export-filename="/home/antoine/Documents/rnaspace/docs/threads.png"
       inkscape:export-xdpi="90"
       inkscape:export-ydpi="90"><tspan
         sodipodi:role="line"
         id="tspan4312"
         x="357.14285"
         y="315.21933">...</tspan></text>
    <text
       xml:space="preserve"
       style="font-size:48px;font-style:normal;font-variant:normal;font-weight:normal;font-stretch:normal;text-align:start;line-height:100%;writing-mode:lr-tb;text-anchor:start;fill:#000000;fill-opacity:1;stroke:none;stroke-width:1px;stroke-linecap:butt;stroke-linejoin:miter;stroke-opacity:1;font-family:Arial;-inkscape-font-specification:Arial"
       x="772.7829"
       y="316.19308"
       id="text4314"
       sodipodi:linespacing="100%"
       inkscape:export-filename="/home/antoine/Documents/rnaspace/docs/threads.png"
       inkscape:export-xdpi="90"
       inkscape:export-ydpi="90"><tspan
         sodipodi:role="line"
         id="tspan4316"
         x="772.7829"
         y="316.19308">...</tspan></text>
    <text
       xml:space="preserve"
       style="font-size:14px;font-style:italic;font-variant:normal;font-weight:normal;font-stretch:normal;text-align:start;line-height:100%;writing-mode:lr-tb;text-anchor:start;fill:#000000;fill-opacity:1;stroke:none;stroke-width:1px;stroke-linecap:butt;stroke-linejoin:miter;stroke-opacity:1;font-family:Arial;-inkscape-font-specification:Arial Italic"
       x="176.57143"
       y="126.6479"
       id="text4318"
       sodipodi:linespacing="100%"
       inkscape:export-filename="/home/antoine/Documents/rnaspace/docs/threads.png"
       inkscape:export-xdpi="90"
       inkscape:export-ydpi="90"><tspan
         sodipodi:role="line"
         id="tspan4320"
         x="176.57143"
         y="126.6479">Run 1</tspan></text>
    <text
       xml:space="preserve"
       style="font-size:14px;font-style:italic;font-variant:normal;font-weight:normal;font-stretch:normal;text-align:start;line-height:100%;writing-mode:lr-tb;text-anchor:start;fill:#000000;fill-opacity:1;stroke:none;stroke-width:1px;stroke-linecap:butt;stroke-linejoin:miter;stroke-opacity:1;font-family:Arial;-inkscape-font-specification:Arial Italic"
       x="518.28571"
       y="126.50504"
       id="text4322"
       sodipodi:linespacing="100%"
       inkscape:export-filename="/home/antoine/Documents/rnaspace/docs/threads.png"
       inkscape:export-xdpi="90"
       inkscape:export-ydpi="90"><tspan
         sodipodi:role="line"
         id="tspan4324"
         x="518.28571"
         y="126.50504">Run 2</tspan></text>
  </g>
</svg>
