ResIndex	Residue	Z-score_BCA_5N5A	Z-score_BCA_WTLs	Z-score_BCA_N322A	Z-score_BCA_N424A	Z-score_BCA_N356A	Z-score_BCA_N390A	Z-score_BCA_N325A
314	Pro314.A	-0.718	-0.716	-0.668	-0.718	-0.67	-0.668	-0.668
315	Thr315.A	-0.718	-0.716	-0.668	-0.718	-0.671	-0.668	-0.668
316	His316.A	-0.712	-0.71	-0.663	-0.712	-0.665	-0.663	-0.663
317	Ala317.A	-0.178	-0.175	-0.189	-0.173	-0.194	-0.189	-0.189
318	Asp318.A	0.051	0.061	0.049	0.06	0.039	0.049	0.049
319	Ser319.A	-0.652	-0.651	-0.607	-0.652	-0.608	-0.607	-0.607
320	Leu320.A	-0.55	-0.552	-0.504	-0.557	-0.497	-0.504	-0.504
321	Asn321.A	-0.346	-0.234	-0.196	-0.249	-0.317	-0.196	-0.196
322	Ala322.A	-0.628	-0.627	-0.574	-0.631	-0.571	-0.574	-0.574
323	Leu323.A	-0.577	-0.575	-0.525	-0.579	-0.523	-0.525	-0.525
324	Ala324.A	-0.333	-0.332	-0.287	-0.34	-0.281	-0.287	-0.287
325	Ala325.A	-0.391	-0.388	-0.346	-0.394	-0.343	-0.346	-0.346
326	Ile326.A	-0.533	-0.53	-0.485	-0.535	-0.485	-0.485	-0.485
327	Lys327.A	-0.508	-0.505	-0.465	-0.509	-0.466	-0.465	-0.465
328	Arg328.A	1.413	1.418	1.367	1.399	1.386	1.367	1.367
329	Glu329.A	-0.711	-0.709	-0.661	-0.711	-0.664	-0.661	-0.661
330	Gln330.A	-0.718	-0.716	-0.668	-0.718	-0.67	-0.668	-0.668
331	Gly331.A	-0.633	-0.63	-0.585	-0.632	-0.587	-0.585	-0.585
332	Asn332.A	-0.702	-0.7	-0.653	-0.702	-0.655	-0.653	-0.653
333	Ile333.A	-0.514	-0.511	-0.464	-0.514	-0.465	-0.464	-0.464
334	Glu334.A	-0.39	-0.384	-0.322	-0.39	-0.323	-0.322	-0.322
335	Glu335.A	-0.683	-0.681	-0.635	-0.683	-0.637	-0.635	-0.635
336	Ala336.A	-0.629	-0.627	-0.584	-0.63	-0.586	-0.584	-0.584
337	Val337.A	-0.22	-0.213	-0.148	-0.22	-0.148	-0.148	-0.148
338	Arg338.A	-0.666	-0.664	-0.619	-0.666	-0.621	-0.619	-0.619
339	Leu339.A	-0.431	-0.429	-0.401	-0.432	-0.401	-0.401	-0.401
340	Tyr340.A	0.527	0.453	0.559	0.428	0.673	0.559	0.559
341	Arg341.A	0.116	0.114	0.035	0.115	0.036	0.035	0.035
342	Lys342.A	-0.552	-0.549	-0.496	-0.554	-0.496	-0.496	-0.496
343	Ala343.A	-0.51	-0.512	-0.454	-0.518	-0.446	-0.454	-0.454
344	Leu344.A	-0.08	-0.076	-0.092	-0.082	-0.09	-0.092	-0.092
345	Glu345.A	-0.697	-0.695	-0.648	-0.696	-0.65	-0.648	-0.648
346	Val346.A	-0.687	-0.685	-0.639	-0.687	-0.642	-0.639	-0.639
347	Phe347.A	-0.586	-0.584	-0.544	-0.586	-0.545	-0.544	-0.544
348	Pro348.A	-0.659	-0.658	-0.606	-0.659	-0.608	-0.606	-0.606
349	Glu349.A	-0.587	-0.586	-0.547	-0.587	-0.548	-0.547	-0.547
350	Phe350.A	1.321	1.23	1.071	1.251	1.165	1.071	1.071
351	Ala351.A	-0.391	-0.389	-0.402	-0.393	-0.397	-0.402	-0.402
352	Ala352.A	-0.646	-0.649	-0.619	-0.651	-0.616	-0.619	-0.619
353	Ala353.A	-0.169	-0.189	-0.344	-0.19	-0.308	-0.344	-0.344
354	His354.A	0.186	0.166	0.211	0.153	0.245	0.211	0.211
355	Ser355.A	0.482	0.473	0.204	0.471	0.235	0.204	0.204
356	Ala356.A	-0.627	-0.437	-0.355	-0.452	-0.583	-0.355	-0.355
357	Leu357.A	-0.225	-0.224	-0.167	-0.232	-0.16	-0.167	-0.167
358	Ala358.A	-0.193	-0.188	-0.047	-0.212	-0.027	-0.047	-0.047
359	Ser359.A	1.188	1.298	1.213	1.276	1.104	1.213	1.213
360	Val360.A	1.931	1.973	2.202	1.92	2.208	2.202	2.202
361	Leu361.A	-0.503	-0.501	-0.464	-0.503	-0.465	-0.464	-0.464
362	Gln362.A	4.531	4.685	5.329	4.559	5.279	5.329	5.329
363	Gln363.A	-0.615	-0.613	-0.571	-0.615	-0.573	-0.571	-0.571
364	Gln364.A	0.06	0.069	0.121	0.06	0.121	0.121	0.121
365	Gly365.A	-0.595	-0.592	-0.55	-0.595	-0.552	-0.55	-0.55
366	Lys366.A	-0.717	-0.715	-0.668	-0.717	-0.67	-0.668	-0.668
367	Leu367.A	-0.011	-0.016	-0.124	-0.011	-0.125	-0.124	-0.124
368	Gln368.A	-0.586	-0.586	-0.561	-0.586	-0.562	-0.561	-0.561
369	Glu369.A	0.366	0.363	0.234	0.365	0.236	0.234	0.234
370	Ala370.A	-0.449	-0.443	-0.375	-0.449	-0.376	-0.375	-0.375
371	Leu371.A	0.811	0.8	0.627	0.801	0.637	0.627	0.627
372	Met372.A	-0.652	-0.65	-0.606	-0.652	-0.607	-0.606	-0.606
373	His373.A	0.18	0.169	0.108	0.166	0.121	0.108	0.108
374	Tyr374.A	1.048	1.054	0.741	1.06	0.733	0.741	0.741
375	Lys375.A	-0.458	-0.452	-0.395	-0.458	-0.395	-0.395	-0.395
376	Glu376.A	-0.356	-0.364	-0.365	-0.366	-0.356	-0.365	-0.365
377	Ala377.A	0.073	0.082	0.042	0.065	0.059	0.042	0.042
378	Ile378.A	-0.349	-0.346	-0.344	-0.35	-0.345	-0.344	-0.344
379	Arg379.A	-0.561	-0.556	-0.512	-0.561	-0.514	-0.512	-0.512
380	Ile380.A	1.084	1.016	0.902	1.058	0.944	0.902	0.902
381	Ser381.A	-0.384	-0.381	-0.38	-0.385	-0.378	-0.38	-0.38
382	Pro382.A	0.69	0.623	0.549	0.677	0.569	0.549	0.549
383	Thr383.A	-0.517	-0.516	-0.493	-0.517	-0.493	-0.493	-0.493
384	Phe384.A	0.863	0.854	0.515	0.854	0.548	0.515	0.515
385	Ala385.A	0.064	0.064	-0.045	0.064	-0.04	-0.045	-0.045
386	Asp386.A	0.792	0.77	0.354	0.788	0.381	0.354	0.354
387	Ala387.A	-0.084	-0.064	-0.049	-0.088	-0.038	-0.049	-0.049
388	Tyr388.A	0.15	0.16	0.093	0.145	0.098	0.093	0.093
389	Ser389.A	0.338	0.37	0.193	0.336	0.201	0.193	0.193
390	Ala390.A	-0.459	-0.455	-0.485	-0.458	-0.487	-0.485	-0.485
391	Met391.A	0.161	0.179	0.262	0.164	0.259	0.262	0.262
392	Gly392.A	-0.306	-0.279	-0.304	-0.305	-0.305	-0.304	-0.304
393	Asn393.A	3.175	3.385	4.964	3.192	4.921	4.964	4.964
394	Thr394.A	2.373	2.318	1.169	2.38	1.167	1.169	1.169
395	Leu395.A	-0.146	-0.139	-0.132	-0.147	-0.132	-0.132	-0.132
396	Lys396.A	5.103	4.972	2.803	5.111	2.806	2.803	2.803
397	Glu397.A	-0.641	-0.637	-0.569	-0.641	-0.571	-0.569	-0.569
398	Met398.A	0.459	0.442	0.263	0.456	0.266	0.263	0.263
399	Gln399.A	-0.586	-0.586	-0.563	-0.586	-0.565	-0.563	-0.563
400	Asp400.A	-0.706	-0.704	-0.657	-0.706	-0.659	-0.657	-0.657
401	Val401.A	-0.551	-0.551	-0.513	-0.551	-0.514	-0.513	-0.513
402	Gln402.A	-0.713	-0.712	-0.664	-0.713	-0.666	-0.664	-0.664
403	Gly403.A	-0.584	-0.589	-0.541	-0.584	-0.543	-0.541	-0.541
404	Ala404.A	-0.336	-0.314	-0.31	-0.336	-0.311	-0.31	-0.31
405	Leu405.A	-0.097	-0.126	-0.084	-0.097	-0.085	-0.084	-0.084
406	Gln406.A	-0.638	-0.636	-0.593	-0.638	-0.594	-0.593	-0.593
407	Cys407.A	-0.079	-0.089	-0.077	-0.079	-0.077	-0.077	-0.077
408	Tyr408.A	1.808	2.208	1.033	1.814	1.031	1.033	1.033
409	Thr409.A	-0.517	-0.517	-0.477	-0.516	-0.478	-0.477	-0.477
410	Arg410.A	-0.289	-0.296	-0.263	-0.29	-0.262	-0.263	-0.263
411	Ala411.A	-0.159	-0.096	-0.209	-0.163	-0.206	-0.209	-0.209
412	Ile412.A	0.034	0.014	0.021	0.033	0.022	0.021	0.021
413	Gln413.A	-0.719	-0.717	-0.669	-0.718	-0.671	-0.669	-0.669
414	Ile414.A	1.014	0.941	0.847	1.001	0.868	0.847	0.847
415	Asn415.A	-0.545	-0.543	-0.51	-0.544	-0.512	-0.51	-0.51
416	Pro416.A	0.543	0.441	0.436	0.536	0.45	0.436	0.436
417	Ala417.A	-0.707	-0.705	-0.658	-0.707	-0.66	-0.658	-0.658
418	Phe418.A	2.563	2.514	1.496	2.559	1.534	1.496	1.496
419	Ala419.A	-0.119	-0.116	-0.206	-0.119	-0.204	-0.206	-0.206
420	Asp420.A	1.657	1.725	3.535	1.654	3.539	3.535	3.535
421	Ala421.A	-0.52	-0.457	-0.453	-0.521	-0.453	-0.453	-0.453
422	His422.A	1.215	1.017	1.085	1.208	1.096	1.085	1.085
423	Ser423.A	0.761	0.755	0.248	0.761	0.249	0.248	0.248
424	Ala424.A	-0.335	0.699	3.2	-0.334	3.171	3.2	3.2
425	Leu425.A	1.08	0.636	0.869	1.081	0.87	0.869	0.869
426	Ala426.A	-0.208	-0.298	-0.194	-0.21	-0.193	-0.194	-0.194
427	Ser427.A	3.635	3.567	2.169	3.641	2.169	2.169	2.169
428	Ile428.A	1.533	1.416	1.207	1.535	1.209	1.207	1.207
429	His429.A	-0.024	-0.507	-0.019	-0.023	-0.02	-0.019	-0.019
430	Lys430.A	2.071	1.918	1.592	2.072	1.595	1.592	1.592
431	Asp431.A	-0.719	-0.717	-0.669	-0.719	-0.671	-0.669	-0.669
432	Ser432.A	-0.706	-0.713	-0.657	-0.705	-0.659	-0.657	-0.657
433	Gly433.A	-0.678	-0.704	-0.63	-0.677	-0.632	-0.63	-0.63
434	Asn434.A	-0.558	-0.685	-0.516	-0.557	-0.518	-0.516	-0.516
435	Ile435.A	-0.569	-0.521	-0.528	-0.569	-0.529	-0.528	-0.528
436	Pro436.A	-0.717	-0.644	-0.667	-0.717	-0.669	-0.667	-0.667
437	Glu437.A	-0.638	-0.363	-0.594	-0.638	-0.596	-0.594	-0.594
438	Ala438.A	-0.323	-0.529	-0.29	-0.323	-0.291	-0.29	-0.29
439	Ile439.A	-0.121	-0.14	-0.155	-0.122	-0.154	-0.155	-0.155
440	Ala440.A	-0.516	-0.603	-0.477	-0.517	-0.478	-0.477	-0.477
441	Ser441.A	0.039	-0.058	0.03	0.037	0.032	0.03	0.03
442	Tyr442.A	2.223	2.152	1.299	2.225	1.301	1.299	1.299
443	Arg443.A	-0.488	-0.499	-0.45	-0.488	-0.451	-0.45	-0.45
444	Thr444.A	0.11	-0.003	0.09	0.109	0.093	0.09	0.09
445	Ala445.A	-0.513	-0.521	-0.487	-0.514	-0.487	-0.487	-0.487
446	Leu446.A	0.65	0.63	0.309	0.649	0.314	0.309	0.309
447	Lys447.A	-0.718	-0.716	-0.668	-0.718	-0.67	-0.668	-0.668
448	Leu448.A	-0.096	-0.121	-0.154	-0.097	-0.15	-0.154	-0.154
449	Lys449.A	-0.082	-0.078	0.003	-0.082	0.004	0.003	0.003
450	Pro450.A	-0.502	-0.499	-0.489	-0.502	-0.487	-0.489	-0.489
451	Asp451.A	-0.447	-0.442	-0.363	-0.447	-0.363	-0.363	-0.363
452	Phe452.A	2.701	2.74	3.839	2.698	3.847	3.839	3.839
453	Pro453.A	0.216	0.223	0.213	0.216	0.214	0.213	0.213
454	Asp454.A	-0.713	-0.711	-0.664	-0.713	-0.666	-0.664	-0.664
455	Ala455.A	-0.272	-0.27	-0.252	-0.273	-0.252	-0.252	-0.252
456	Tyr456.A	3.634	3.655	4.022	3.632	4.034	4.022	4.022
457	Cys457.A	-0.254	-0.251	-0.374	-0.254	-0.376	-0.374	-0.374
458	Asn458.A	-0.211	-0.209	-0.339	-0.21	-0.341	-0.339	-0.339
459	Leu459.A	0.294	0.288	-0.031	0.294	-0.031	-0.031	-0.031
460	Ala460.A	-0.404	-0.401	-0.45	-0.404	-0.452	-0.45	-0.45
461	His461.A	0.438	0.442	0.16	0.439	0.159	0.16	0.16
462	Cys462.A	-0.024	-0.08	-0.031	-0.024	-0.032	-0.031	-0.031
463	Leu463.A	0.592	0.59	0.258	0.592	0.26	0.258	0.258
464	Gln464.A	-0.576	-0.573	-0.545	-0.575	-0.547	-0.545	-0.545
465	Ile465.A	-0.357	-0.357	-0.436	-0.357	-0.438	-0.436	-0.436
466	Val466.A	-0.531	-0.515	-0.509	-0.53	-0.51	-0.509	-0.509
467	Cys467.A	-0.653	-0.651	-0.633	-0.653	-0.635	-0.633	-0.633
468	Asp468.A	-0.523	-0.516	-0.538	-0.523	-0.54	-0.538	-0.538
469	Trp469.A	-0.684	-0.682	-0.636	-0.684	-0.638	-0.636	-0.636
470	Thr470.A	-0.71	-0.708	-0.661	-0.71	-0.663	-0.661	-0.661
471	Asp471.A	-0.605	-0.603	-0.561	-0.605	-0.563	-0.561	-0.561
472	Tyr472.A	-0.598	-0.595	-0.554	-0.597	-0.556	-0.554	-0.554
473	Asp473.A	-0.716	-0.714	-0.666	-0.715	-0.668	-0.666	-0.666
474	Glu474.A	-0.707	-0.705	-0.657	-0.706	-0.66	-0.657	-0.657
475	Arg475.A	1.212	1.219	1.237	1.212	1.241	1.237	1.237
476	Met476.A	-0.671	-0.668	-0.623	-0.67	-0.625	-0.623	-0.623
477	Lys477.A	-0.558	-0.555	-0.516	-0.558	-0.518	-0.516	-0.516
478	Lys478.A	0.034	0.041	0.075	0.035	0.075	0.075	0.075
479	Leu479.A	0.357	0.364	0.335	0.357	0.336	0.335	0.335
480	Val480.A	-0.53	-0.527	-0.483	-0.529	-0.485	-0.483	-0.483
481	Ser481.A	-0.496	-0.493	-0.463	-0.495	-0.464	-0.463	-0.463
482	Ile482.A	0.168	0.174	0.183	0.168	0.183	0.183	0.183
483	Val483.A	-0.356	-0.352	-0.324	-0.355	-0.325	-0.324	-0.324
484	Ala484.A	-0.699	-0.697	-0.65	-0.699	-0.652	-0.65	-0.65
485	Asp485.A	-0.574	-0.571	-0.53	-0.574	-0.531	-0.53	-0.53
486	Gln486.A	0.115	0.121	0.122	0.115	0.122	0.122	0.122
487	Leu487.A	-0.713	-0.711	-0.663	-0.712	-0.665	-0.663	-0.663
488	Glu488.A	-0.703	-0.701	-0.654	-0.703	-0.656	-0.654	-0.654
489	Lys489.A	-0.716	-0.714	-0.667	-0.716	-0.669	-0.667	-0.667
490	Asn490.A	-0.708	-0.706	-0.658	-0.707	-0.66	-0.658	-0.658
