"id","nom","genre","age","nourriture","date_arrivee","soigneur"
3,"Abigail","girafe",10,"Feuille accacia",11/11/2012,"Nathalie"
1,"Tyrone","singe",2,"banane",07/01/2012,"Fabrice"
40,"Lareina","singe",3,"banane",25/12/2016,"Sandrine"
37,"Sheila","zebre",5,"blé",03/09/2016,"Nathalie"
1,"Tyrone","grenouille",2,"insecte",07/01/2012,"Fabrice"
32,"Abdul","aigle",1,"blé",20/03/2016,"Nathalie"
10,"Eden","aigle",7,"blé",13/03/2014,"Nathalie"
