"# Clé";Valeur;;;;
identifier:DOI;10.5072/AMMA-CATCH.niger;;;;
creatorName;AMMA-CATCH;;;;
title;"AMMA-CATCH observatory: Niamey square degree mesoscale site (16 000 km2) in cultivated Sahelian Zone, Niger";;;;
title:AlternativeTitle;"African Monsoon Multidisciplinary Analyses - Coupling Tropical Atmosphere and Hydrological Cycle: Niger site";;;;
title:Subtitle;"Niamey Square Degree mesoscale site";;;;
title:TranslatedTitle;;;;;
description:Abstract;"The Niger mesoscale observation site is geographically central among the three such sites of the AMMA-CATCH regional observatory. Located 13-14°N and 2-3°E in SW Niger, it samples the cultivated Sahelian environment, on both sides of the Niger River albeit predominantly to its north-east, and includes the city of Niamey. The climate is semiarid, with ~300-700 mm/year of rainfall concentrated in a short monsoon season (July-September essentially). Landuse is a patchwork of millet fields, fallow bush plots, tiger bush, and bare land. Meteorological, hydrological, and ecological observations have been carried out for several decades at this site, starting with the EPSAT-Niger, HAPEX-Sahel, SEBEX programs in the 80-90's. Most instruments were made perennial since the launch of the AMMA international experiment in 2005.";;;;
description:Other;"Cappelaere B., Descroix L., Lebel T., Boulain N., Ramier D., Laurent J.P., Favreau G., Boubkraoui S., Boucher M., Bouzou Moussa I., Chaffard V., Hiernaux P., Issoufou H.B.A., Le Breton E., Mamadou I., Nazoumou Y., Oi M., Ottle C., Quantin G., 2009. The AMMA-CATCH experiment in the cultivated Sahelian area of south-west Niger - Investigating water cycle response to a fluctuating climate and changing environment. Journal of Hydrology, 375(1-2): 34-51, doi: 10.1016/j.jhydrol.2009.06.021.";;;;
publisher;"IRD, CNRS-INSU, OSUG, OMP, OREME";;;;
publicationYear;1990;;;;
subject:main;"Sahelian climate";;;;
subject:var;Precipitation;;;;
subject:var;"Surface water";;;;
subject:var;Meteo;;;;
subject:var;Flux;;;;
subject:var;Radiation;;;;
subject:var;Vegetation;;;;
subject:var;"Ground water";;;;
subject:var;Soils;;;;
subject:var;"Water quality / Water chemistry";;;;
contributorName:ContactPerson;contact@amma-catch.org;;;;
contributorName:DataManager;"Véronique Chaffard";affiliation;IRD/IGE;nameIdentifier:ORCID;0000-0003-2823-7117
contributorName:Distributor;"Institut des Géosciences de l'Environnement (France) - IGE";;;;
contributorName:Distributor;"OSUG Data Center (France)";;;;
contributorName:HostingInstitution;"Université Grenoble Alpes (France) - UGA";;;;
contributorName:Funder;"Institut de Recherche pour le Développement (France) - IRD";;;;
contributorName:Funder;"Centre National de la Recherche Scientifique (France) - CNRS, Institut de Sciences de l'Univers (France) - INSU";;;;
contributorName:Funder;"Observatoire des Sciences de l'Univers de Grenoble (France) - OSUG";;;;
contributorName:Funder;"Observatoire de Recherche Méditerranéen de l'Environnement (France) - OREME";;;;
contributorName:Funder;"Observatoire Midi-Pyrénées (France) - OMP";;;;
contributorName:ProjectLeader;"Sylvie Galle";affiliation;IRD/IGE;nameIdentifier:ORCID;0000-0002-3100-8510
contributorName:Sponsor;"LabEx OSUG@2020";;;;
contributorName:WorkPackageLeader;"Bernard Cappelaere";affiliation;IRD/HSM;nameIdentifier:ORCID;0000-0001-8533-1164
contributorName:WorkPackageLeader;"Ibrahim Bouzou Moussa";affiliation;"UAM/Dept Géographie";nameIdentifier:ORCID;0000-0002-3140-8987
contributorName:ProjectMember;"Jérôme Demarty";affiliation;IRD/HSM;nameIdentifier:ORCID;0000-0001-5173-9030
contributorName:RelatedPerson;"Thierry Lebel";affiliation;IRD/IGE;nameIdentifier:ORCID;0000-0002-1297-6751
contributorName:ResearchGroup;"Institut des Géosciences de l'Environnement (France) - IGE";;;;
contributorName:ResearchGroup;"Hydrosciences Montpellier (France) - HSM";;;;
contributorName:ResearchGroup;"Géosciences Environment Toulouse (France) - GET";;;;
contributorName:ResearchGroup;"Direction des Ressources en Eau (Niger) - DRE";;;;
contributorName:ResearchGroup;"Institut de Recherche pour le Développement (Niger) - IRD Niger";;;;
contributorName:ResearchGroup;"Université Abdou Moumouni (Niger) - UAM";;;;
contributorName:ResearchGroup;"Université de Maradi (Niger) - UM";;;;
contributorName:ResearchGroup;"Université de Zinder (Niger) - UZ";;;;
date:Collected;1990-01-01/;;;;
language;en;;;;
resourceType:Dataset;"multi-scale eco-hydrological observations network";;;;
relatedIdentifier:Cites:URL;http://www.amma-catch.org;;;;
relatedIdentifier:IsPartOf:DOI;10.5072/AMMA-CATCH.all;;;;
relatedIdentifier:HasPart:DOI;;;;;
format;CSV;;;;
format;NETCDF;;;;
format;"O&M 1.0";;;;
rights;"License: CC BY 4.0";rightsURI;https://creativecommons.org/licenses/by/4.0;;
rights;"Data access and use are ruled by the AMMA-CATCH data policy.";rightsURI;http://www.amma-catch.org/spip.php?rubrique63&lang=en;;
rights;"For any publication using AMMA-CATCH data, depending on the contribution of the data to the scientific results obtained, data users should either propose co-authorship to the data providers (doi work package leaders) or at least acknowledge their contribution.
The following sentence should appear in the acknowledgments of the publication:
""The AMMA-CATCH regional observing system was set up thanks to an incentive funding of the French Ministry of Research that allowed pooling together various pre-existing small scale observing setups. The continuity and long term perenity of the measurements are made possible by an undisrupted IRD funding since 1990 and by a continuous CNRS-INSU funding since 2005.""";;;;
geoLocationPlace;Niger;;;;
geoLocationPlace;"Niger Niamey meso site";;;;
geoLocationPlace;"Niger Central super site";;;;
geoLocationPlace;"Niger Wankama local intensive site";;;;
geoLocationPlace;"Niger Tondikiboro local intensive site";;;;
geoLocationPlace;"Niger Mele Haoussa local intensive site";;;;
geoLocationBox;"13 1.6  14 3";;;;
