# Clé;Valeur;;;;
identifier:DOI;10.5072/AMMA-CATCH.CE.SW_Gha;;;;
contributorName:DataCollector;Nogmana Soumaguel;affiliation;IRD-Mali/GET;nameIdentifier:ORCID;
contributorName:WorkPackageLeader;;affiliation;;nameIdentifier:ORCID;
contributorName:ProjectMember;Mamadou Diawara;affiliation;USTTB/LET;nameIdentifier:ORCID;
contributorName:Other;Pierre Hiernaux;affiliation;CNRS/GET;nameIdentifier:ORCID;0000-0002-1764-9178
contributorName:Other;Eric Mougin;affiliation;CNRS/GET;nameIdentifier:ORCID;0000-0002-7569-5906
relatedIdentifier:IsSupplementedBy:DOI;;;;;
