<?xml version="1.0" encoding="UTF-8" standalone="no"?>
<!-- Created with Inkscape (http://www.inkscape.org/) -->

<svg
   xmlns:dc="http://purl.org/dc/elements/1.1/"
   xmlns:cc="http://creativecommons.org/ns#"
   xmlns:rdf="http://www.w3.org/1999/02/22-rdf-syntax-ns#"
   xmlns:svg="http://www.w3.org/2000/svg"
   xmlns="http://www.w3.org/2000/svg"
   xmlns:xlink="http://www.w3.org/1999/xlink"
   xmlns:sodipodi="http://sodipodi.sourceforge.net/DTD/sodipodi-0.dtd"
   xmlns:inkscape="http://www.inkscape.org/namespaces/inkscape"
   width="210mm"
   height="297mm"
   viewBox="0 0 210 297"
   version="1.1"
   id="svg8"
   inkscape:version="0.92.3 (2405546, 2018-03-11)"
   sodipodi:docname="stim_chan_connection.svg"
   inkscape:export-filename="/home/bornat/Taf/Technique/Git_shared/SmartStim/smartstimdemo/TWIST/doc_user/stim_chan_connection.png"
   inkscape:export-xdpi="300"
   inkscape:export-ydpi="300">
  <defs
     id="defs2" />
  <sodipodi:namedview
     id="base"
     pagecolor="#ffffff"
     bordercolor="#666666"
     borderopacity="1.0"
     inkscape:pageopacity="0.0"
     inkscape:pageshadow="2"
     inkscape:zoom="1.4142136"
     inkscape:cx="339.24477"
     inkscape:cy="673.4558"
     inkscape:document-units="mm"
     inkscape:current-layer="layer1"
     showgrid="true"
     inkscape:window-width="1920"
     inkscape:window-height="1175"
     inkscape:window-x="3480"
     inkscape:window-y="360"
     inkscape:window-maximized="1">
    <inkscape:grid
       type="xygrid"
       id="grid4749" />
  </sodipodi:namedview>
  <metadata
     id="metadata5">
    <rdf:RDF>
      <cc:Work
         rdf:about="">
        <dc:format>image/svg+xml</dc:format>
        <dc:type
           rdf:resource="http://purl.org/dc/dcmitype/StillImage" />
        <dc:title></dc:title>
      </cc:Work>
    </rdf:RDF>
  </metadata>
  <g
     inkscape:label="Layer 1"
     inkscape:groupmode="layer"
     id="layer1">
    <rect
       style="opacity:1;vector-effect:none;fill:none;fill-opacity:1;fill-rule:evenodd;stroke:#000000;stroke-width:0.1;stroke-linecap:butt;stroke-linejoin:miter;stroke-miterlimit:4;stroke-dasharray:none;stroke-dashoffset:0;stroke-opacity:1"
       id="rect5110"
       width="15.875"
       height="5.2916665"
       x="37.041668"
       y="119.72916" />
    <rect
       style="opacity:1;vector-effect:none;fill:#0072ff;fill-opacity:1;fill-rule:evenodd;stroke:#000000;stroke-width:0.1;stroke-linecap:butt;stroke-linejoin:miter;stroke-miterlimit:4;stroke-dasharray:none;stroke-dashoffset:0;stroke-opacity:1"
       id="rect5115"
       width="1.5875"
       height="1.5875"
       x="37.570831"
       y="120.25833" />
    <rect
       style="opacity:1;vector-effect:none;fill:#00a100;fill-opacity:1;fill-rule:evenodd;stroke:#000000;stroke-width:0.1;stroke-linecap:butt;stroke-linejoin:miter;stroke-miterlimit:4;stroke-dasharray:none;stroke-dashoffset:0;stroke-opacity:1"
       id="rect5115-4"
       width="1.5875"
       height="1.5875"
       x="40.216667"
       y="120.25833" />
    <rect
       style="opacity:1;vector-effect:none;fill:#0072ff;fill-opacity:1;fill-rule:evenodd;stroke:#000000;stroke-width:0.1;stroke-linecap:butt;stroke-linejoin:miter;stroke-miterlimit:4;stroke-dasharray:none;stroke-dashoffset:0;stroke-opacity:1"
       id="rect5115-5"
       width="1.5875"
       height="1.5875"
       x="42.862499"
       y="120.25833" />
    <rect
       style="opacity:1;vector-effect:none;fill:#00a100;fill-opacity:1;fill-rule:evenodd;stroke:#000000;stroke-width:0.1;stroke-linecap:butt;stroke-linejoin:miter;stroke-miterlimit:4;stroke-dasharray:none;stroke-dashoffset:0;stroke-opacity:1"
       id="rect5115-1"
       width="1.5875"
       height="1.5875"
       x="45.508331"
       y="120.25833" />
    <rect
       style="opacity:1;vector-effect:none;fill:#0072ff;fill-opacity:1;fill-rule:evenodd;stroke:#000000;stroke-width:0.1;stroke-linecap:butt;stroke-linejoin:miter;stroke-miterlimit:4;stroke-dasharray:none;stroke-dashoffset:0;stroke-opacity:1"
       id="rect5115-7"
       width="1.5875"
       height="1.5875"
       x="48.154167"
       y="120.25833" />
    <rect
       style="opacity:1;vector-effect:none;fill:#ff006b;fill-opacity:1;fill-rule:evenodd;stroke:#000000;stroke-width:0.1;stroke-linecap:butt;stroke-linejoin:miter;stroke-miterlimit:4;stroke-dasharray:none;stroke-dashoffset:0;stroke-opacity:1"
       id="rect5115-57"
       width="1.5875"
       height="1.5875"
       x="50.799999"
       y="120.25833" />
    <rect
       style="opacity:1;vector-effect:none;fill:#00a100;fill-opacity:1;fill-rule:evenodd;stroke:#000000;stroke-width:0.1;stroke-linecap:butt;stroke-linejoin:miter;stroke-miterlimit:4;stroke-dasharray:none;stroke-dashoffset:0;stroke-opacity:1"
       id="rect5115-16"
       width="1.5875"
       height="1.5875"
       x="37.570831"
       y="122.90417" />
    <rect
       style="opacity:1;vector-effect:none;fill:#0072ff;fill-opacity:1;fill-rule:evenodd;stroke:#000000;stroke-width:0.1;stroke-linecap:butt;stroke-linejoin:miter;stroke-miterlimit:4;stroke-dasharray:none;stroke-dashoffset:0;stroke-opacity:1"
       id="rect5115-9"
       width="1.5875"
       height="1.5875"
       x="40.216667"
       y="122.90417" />
    <rect
       style="opacity:1;vector-effect:none;fill:#00a100;fill-opacity:1;fill-rule:evenodd;stroke:#000000;stroke-width:0.1;stroke-linecap:butt;stroke-linejoin:miter;stroke-miterlimit:4;stroke-dasharray:none;stroke-dashoffset:0;stroke-opacity:1"
       id="rect5115-8"
       width="1.5875"
       height="1.5875"
       x="42.862499"
       y="122.90417" />
    <rect
       style="opacity:1;vector-effect:none;fill:#0072ff;fill-opacity:1;fill-rule:evenodd;stroke:#000000;stroke-width:0.1;stroke-linecap:butt;stroke-linejoin:miter;stroke-miterlimit:4;stroke-dasharray:none;stroke-dashoffset:0;stroke-opacity:1"
       id="rect5115-13"
       width="1.5875"
       height="1.5875"
       x="45.508331"
       y="122.90417" />
    <rect
       style="opacity:1;vector-effect:none;fill:#0072ff;fill-opacity:1;fill-rule:evenodd;stroke:#000000;stroke-width:0.1;stroke-linecap:butt;stroke-linejoin:miter;stroke-miterlimit:4;stroke-dasharray:none;stroke-dashoffset:0;stroke-opacity:1"
       id="rect5115-3"
       width="1.5875"
       height="1.5875"
       x="48.154167"
       y="122.90417" />
    <rect
       style="opacity:1;vector-effect:none;fill:#ff006b;fill-opacity:1;fill-rule:evenodd;stroke:#000000;stroke-width:0.1;stroke-linecap:butt;stroke-linejoin:miter;stroke-miterlimit:4;stroke-dasharray:none;stroke-dashoffset:0;stroke-opacity:1"
       id="rect5115-37"
       width="1.5875"
       height="1.5875"
       x="50.799999"
       y="122.90417" />
    <rect
       style="opacity:1;vector-effect:none;fill:none;fill-opacity:1;fill-rule:evenodd;stroke:#000000;stroke-width:0.1;stroke-linecap:butt;stroke-linejoin:miter;stroke-miterlimit:4;stroke-dasharray:none;stroke-dashoffset:0;stroke-opacity:1"
       id="rect5110-9"
       width="15.875"
       height="5.2916665"
       x="59.53125"
       y="119.72916" />
    <rect
       style="opacity:1;vector-effect:none;fill:#0072ff;fill-opacity:1;fill-rule:evenodd;stroke:#000000;stroke-width:0.1;stroke-linecap:butt;stroke-linejoin:miter;stroke-miterlimit:4;stroke-dasharray:none;stroke-dashoffset:0;stroke-opacity:1"
       id="rect5115-86"
       width="1.5875"
       height="1.5875"
       x="60.060413"
       y="120.25833" />
    <rect
       style="opacity:1;vector-effect:none;fill:#00a100;fill-opacity:1;fill-rule:evenodd;stroke:#000000;stroke-width:0.1;stroke-linecap:butt;stroke-linejoin:miter;stroke-miterlimit:4;stroke-dasharray:none;stroke-dashoffset:0;stroke-opacity:1"
       id="rect5115-4-7"
       width="1.5875"
       height="1.5875"
       x="62.706249"
       y="120.25833" />
    <rect
       style="opacity:1;vector-effect:none;fill:#0072ff;fill-opacity:1;fill-rule:evenodd;stroke:#000000;stroke-width:0.1;stroke-linecap:butt;stroke-linejoin:miter;stroke-miterlimit:4;stroke-dasharray:none;stroke-dashoffset:0;stroke-opacity:1"
       id="rect5115-5-0"
       width="1.5875"
       height="1.5875"
       x="65.352081"
       y="120.25833" />
    <rect
       style="opacity:1;vector-effect:none;fill:#00a100;fill-opacity:1;fill-rule:evenodd;stroke:#000000;stroke-width:0.1;stroke-linecap:butt;stroke-linejoin:miter;stroke-miterlimit:4;stroke-dasharray:none;stroke-dashoffset:0;stroke-opacity:1"
       id="rect5115-1-4"
       width="1.5875"
       height="1.5875"
       x="67.997917"
       y="120.25833" />
    <rect
       style="opacity:1;vector-effect:none;fill:#0072ff;fill-opacity:1;fill-rule:evenodd;stroke:#000000;stroke-width:0.1;stroke-linecap:butt;stroke-linejoin:miter;stroke-miterlimit:4;stroke-dasharray:none;stroke-dashoffset:0;stroke-opacity:1"
       id="rect5115-7-8"
       width="1.5875"
       height="1.5875"
       x="70.643753"
       y="120.25833" />
    <rect
       style="opacity:1;vector-effect:none;fill:#ff006b;fill-opacity:1;fill-rule:evenodd;stroke:#000000;stroke-width:0.1;stroke-linecap:butt;stroke-linejoin:miter;stroke-miterlimit:4;stroke-dasharray:none;stroke-dashoffset:0;stroke-opacity:1"
       id="rect5115-57-4"
       width="1.5875"
       height="1.5875"
       x="73.289581"
       y="120.25833" />
    <rect
       style="opacity:1;vector-effect:none;fill:#00a100;fill-opacity:1;fill-rule:evenodd;stroke:#000000;stroke-width:0.1;stroke-linecap:butt;stroke-linejoin:miter;stroke-miterlimit:4;stroke-dasharray:none;stroke-dashoffset:0;stroke-opacity:1"
       id="rect5115-16-8"
       width="1.5875"
       height="1.5875"
       x="60.060413"
       y="122.90417" />
    <rect
       style="opacity:1;vector-effect:none;fill:#0072ff;fill-opacity:1;fill-rule:evenodd;stroke:#000000;stroke-width:0.1;stroke-linecap:butt;stroke-linejoin:miter;stroke-miterlimit:4;stroke-dasharray:none;stroke-dashoffset:0;stroke-opacity:1"
       id="rect5115-9-1"
       width="1.5875"
       height="1.5875"
       x="62.706249"
       y="122.90417" />
    <rect
       style="opacity:1;vector-effect:none;fill:#00a100;fill-opacity:1;fill-rule:evenodd;stroke:#000000;stroke-width:0.1;stroke-linecap:butt;stroke-linejoin:miter;stroke-miterlimit:4;stroke-dasharray:none;stroke-dashoffset:0;stroke-opacity:1"
       id="rect5115-8-6"
       width="1.5875"
       height="1.5875"
       x="65.352081"
       y="122.90417" />
    <rect
       style="opacity:1;vector-effect:none;fill:#0072ff;fill-opacity:1;fill-rule:evenodd;stroke:#000000;stroke-width:0.1;stroke-linecap:butt;stroke-linejoin:miter;stroke-miterlimit:4;stroke-dasharray:none;stroke-dashoffset:0;stroke-opacity:1"
       id="rect5115-13-8"
       width="1.5875"
       height="1.5875"
       x="67.997917"
       y="122.90417" />
    <rect
       style="opacity:1;vector-effect:none;fill:#0072ff;fill-opacity:1;fill-rule:evenodd;stroke:#000000;stroke-width:0.1;stroke-linecap:butt;stroke-linejoin:miter;stroke-miterlimit:4;stroke-dasharray:none;stroke-dashoffset:0;stroke-opacity:1"
       id="rect5115-3-5"
       width="1.5875"
       height="1.5875"
       x="70.643753"
       y="122.90417" />
    <rect
       style="opacity:1;vector-effect:none;fill:#ff006b;fill-opacity:1;fill-rule:evenodd;stroke:#000000;stroke-width:0.1;stroke-linecap:butt;stroke-linejoin:miter;stroke-miterlimit:4;stroke-dasharray:none;stroke-dashoffset:0;stroke-opacity:1"
       id="rect5115-37-2"
       width="1.5875"
       height="1.5875"
       x="73.289581"
       y="122.90417" />
    <path
       style="fill:none;stroke:#000000;stroke-width:0.26458332px;stroke-linecap:butt;stroke-linejoin:miter;stroke-opacity:1"
       d="m 82.020833,126.60833 3.96875,-7.9375"
       id="path5245"
       inkscape:connector-curvature="0"
       sodipodi:nodetypes="cc" />
    <path
       style="fill:none;stroke:#000000;stroke-width:0.26458332px;stroke-linecap:butt;stroke-linejoin:miter;stroke-opacity:1"
       d="m 87.3125,118.67083 -3.96875,7.9375"
       id="path5247"
       inkscape:connector-curvature="0"
       sodipodi:nodetypes="cc" />
    <g
       id="g5260"
       clip-path="none">
      <g
         inkscape:label="Clip"
         id="g5258">
        <rect
           y="119.72916"
           x="96.572914"
           height="5.2916665"
           width="5.2916665"
           id="rect5249"
           style="opacity:1;vector-effect:none;fill:none;fill-opacity:1;fill-rule:evenodd;stroke:#000000;stroke-width:0.1;stroke-linecap:butt;stroke-linejoin:miter;stroke-miterlimit:4;stroke-dasharray:none;stroke-dashoffset:0;stroke-opacity:1" />
        <path
           d="m 97.103973,122.46441 a 2.1166666,2.1166666 0 0 1 2.025347,-2.20419 2.1166666,2.1166666 0 0 1 2.20421,2.02533 2.1166666,2.1166666 0 0 1 -2.025313,2.20422 2.1166666,2.1166666 0 0 1 -2.204241,-2.02528"
           sodipodi:open="true"
           sodipodi:end="3.0993032"
           sodipodi:start="3.0993382"
           sodipodi:ry="2.1166666"
           sodipodi:rx="2.1166666"
           sodipodi:cy="122.375"
           sodipodi:cx="99.21875"
           sodipodi:type="arc"
           id="path5251"
           style="opacity:1;vector-effect:none;fill:none;fill-opacity:1;fill-rule:evenodd;stroke:#000000;stroke-width:0.1;stroke-linecap:butt;stroke-linejoin:miter;stroke-miterlimit:4;stroke-dasharray:none;stroke-dashoffset:0;stroke-opacity:1" />
        <path
           d="m 98.954403,122.38618 a 0.26458332,0.26458332 0 0 1 0.253074,-0.27552 0.26458332,0.26458332 0 0 1 0.275612,0.25297 0.26458332,0.26458332 0 0 1 -0.252874,0.2757 0.26458332,0.26458332 0 0 1 -0.275796,-0.25277"
           sodipodi:open="true"
           sodipodi:end="3.0978846"
           sodipodi:start="3.0993382"
           sodipodi:ry="0.26458332"
           sodipodi:rx="0.26458332"
           sodipodi:cy="122.375"
           sodipodi:cx="99.21875"
           sodipodi:type="arc"
           id="path5253"
           style="opacity:1;vector-effect:none;fill:none;fill-opacity:1;fill-rule:evenodd;stroke:#000000;stroke-width:0.1;stroke-linecap:butt;stroke-linejoin:miter;stroke-miterlimit:4;stroke-dasharray:none;stroke-dashoffset:0;stroke-opacity:1" />
        <g
           transform="translate(10.583332,1.2774378e-6)"
           id="g5284-9">
          <rect
             style="opacity:1;vector-effect:none;fill:none;fill-opacity:1;fill-rule:evenodd;stroke:#000000;stroke-width:0.1;stroke-linecap:butt;stroke-linejoin:miter;stroke-miterlimit:4;stroke-dasharray:none;stroke-dashoffset:0;stroke-opacity:1"
             id="rect5249-6"
             width="5.2916665"
             height="5.2916665"
             x="96.572914"
             y="119.72916" />
          <path
             style="opacity:1;vector-effect:none;fill:none;fill-opacity:1;fill-rule:evenodd;stroke:#000000;stroke-width:0.1;stroke-linecap:butt;stroke-linejoin:miter;stroke-miterlimit:4;stroke-dasharray:none;stroke-dashoffset:0;stroke-opacity:1"
             id="path5251-0"
             sodipodi:type="arc"
             sodipodi:cx="99.21875"
             sodipodi:cy="122.375"
             sodipodi:rx="2.1166666"
             sodipodi:ry="2.1166666"
             sodipodi:start="3.0993382"
             sodipodi:end="3.0993032"
             sodipodi:open="true"
             d="m 97.103973,122.46441 a 2.1166666,2.1166666 0 0 1 2.025347,-2.20419 2.1166666,2.1166666 0 0 1 2.20421,2.02533 2.1166666,2.1166666 0 0 1 -2.025313,2.20422 2.1166666,2.1166666 0 0 1 -2.204241,-2.02528" />
          <path
             style="opacity:1;vector-effect:none;fill:none;fill-opacity:1;fill-rule:evenodd;stroke:#000000;stroke-width:0.1;stroke-linecap:butt;stroke-linejoin:miter;stroke-miterlimit:4;stroke-dasharray:none;stroke-dashoffset:0;stroke-opacity:1"
             id="path5253-6"
             sodipodi:type="arc"
             sodipodi:cx="99.21875"
             sodipodi:cy="122.375"
             sodipodi:rx="0.26458332"
             sodipodi:ry="0.26458332"
             sodipodi:start="3.0993382"
             sodipodi:end="3.0978846"
             sodipodi:open="true"
             d="m 98.954403,122.38618 a 0.26458332,0.26458332 0 0 1 0.253074,-0.27552 0.26458332,0.26458332 0 0 1 0.275612,0.25297 0.26458332,0.26458332 0 0 1 -0.252874,0.2757 0.26458332,0.26458332 0 0 1 -0.275796,-0.25277" />
        </g>
        <g
           transform="translate(21.166672,1.2715658e-5)"
           id="g5284-4">
          <rect
             style="opacity:1;vector-effect:none;fill:none;fill-opacity:1;fill-rule:evenodd;stroke:#000000;stroke-width:0.1;stroke-linecap:butt;stroke-linejoin:miter;stroke-miterlimit:4;stroke-dasharray:none;stroke-dashoffset:0;stroke-opacity:1"
             id="rect5249-9"
             width="5.2916665"
             height="5.2916665"
             x="96.572914"
             y="119.72916" />
          <path
             style="opacity:1;vector-effect:none;fill:none;fill-opacity:1;fill-rule:evenodd;stroke:#000000;stroke-width:0.1;stroke-linecap:butt;stroke-linejoin:miter;stroke-miterlimit:4;stroke-dasharray:none;stroke-dashoffset:0;stroke-opacity:1"
             id="path5251-9"
             sodipodi:type="arc"
             sodipodi:cx="99.21875"
             sodipodi:cy="122.375"
             sodipodi:rx="2.1166666"
             sodipodi:ry="2.1166666"
             sodipodi:start="3.0993382"
             sodipodi:end="3.0993032"
             sodipodi:open="true"
             d="m 97.103973,122.46441 a 2.1166666,2.1166666 0 0 1 2.025347,-2.20419 2.1166666,2.1166666 0 0 1 2.20421,2.02533 2.1166666,2.1166666 0 0 1 -2.025313,2.20422 2.1166666,2.1166666 0 0 1 -2.204241,-2.02528" />
          <path
             style="opacity:1;vector-effect:none;fill:none;fill-opacity:1;fill-rule:evenodd;stroke:#000000;stroke-width:0.1;stroke-linecap:butt;stroke-linejoin:miter;stroke-miterlimit:4;stroke-dasharray:none;stroke-dashoffset:0;stroke-opacity:1"
             id="path5253-0"
             sodipodi:type="arc"
             sodipodi:cx="99.21875"
             sodipodi:cy="122.375"
             sodipodi:rx="0.26458332"
             sodipodi:ry="0.26458332"
             sodipodi:start="3.0993382"
             sodipodi:end="3.0978846"
             sodipodi:open="true"
             d="m 98.954403,122.38618 a 0.26458332,0.26458332 0 0 1 0.253074,-0.27552 0.26458332,0.26458332 0 0 1 0.275612,0.25297 0.26458332,0.26458332 0 0 1 -0.252874,0.2757 0.26458332,0.26458332 0 0 1 -0.275796,-0.25277" />
        </g>
        <g
           transform="translate(31.750006,1.2715658e-5)"
           id="g5284-9-8">
          <rect
             style="opacity:1;vector-effect:none;fill:none;fill-opacity:1;fill-rule:evenodd;stroke:#000000;stroke-width:0.1;stroke-linecap:butt;stroke-linejoin:miter;stroke-miterlimit:4;stroke-dasharray:none;stroke-dashoffset:0;stroke-opacity:1"
             id="rect5249-6-9"
             width="5.2916665"
             height="5.2916665"
             x="96.572914"
             y="119.72916" />
          <path
             style="opacity:1;vector-effect:none;fill:none;fill-opacity:1;fill-rule:evenodd;stroke:#000000;stroke-width:0.1;stroke-linecap:butt;stroke-linejoin:miter;stroke-miterlimit:4;stroke-dasharray:none;stroke-dashoffset:0;stroke-opacity:1"
             id="path5251-0-3"
             sodipodi:type="arc"
             sodipodi:cx="99.21875"
             sodipodi:cy="122.375"
             sodipodi:rx="2.1166666"
             sodipodi:ry="2.1166666"
             sodipodi:start="3.0993382"
             sodipodi:end="3.0993032"
             sodipodi:open="true"
             d="m 97.103973,122.46441 a 2.1166666,2.1166666 0 0 1 2.025347,-2.20419 2.1166666,2.1166666 0 0 1 2.20421,2.02533 2.1166666,2.1166666 0 0 1 -2.025313,2.20422 2.1166666,2.1166666 0 0 1 -2.204241,-2.02528" />
          <path
             style="opacity:1;vector-effect:none;fill:none;fill-opacity:1;fill-rule:evenodd;stroke:#000000;stroke-width:0.1;stroke-linecap:butt;stroke-linejoin:miter;stroke-miterlimit:4;stroke-dasharray:none;stroke-dashoffset:0;stroke-opacity:1"
             id="path5253-6-1"
             sodipodi:type="arc"
             sodipodi:cx="99.21875"
             sodipodi:cy="122.375"
             sodipodi:rx="0.26458332"
             sodipodi:ry="0.26458332"
             sodipodi:start="3.0993382"
             sodipodi:end="3.0978846"
             sodipodi:open="true"
             d="m 98.954403,122.38618 a 0.26458332,0.26458332 0 0 1 0.253074,-0.27552 0.26458332,0.26458332 0 0 1 0.275612,0.25297 0.26458332,0.26458332 0 0 1 -0.252874,0.2757 0.26458332,0.26458332 0 0 1 -0.275796,-0.25277" />
        </g>
        <g
           transform="translate(42.333338,1.2715658e-5)"
           id="g5284-48"
           style="stroke-width:0.1;stroke-miterlimit:4;stroke-dasharray:none">
          <rect
             style="opacity:1;vector-effect:none;fill:none;fill-opacity:1;fill-rule:evenodd;stroke:#000000;stroke-width:0.1;stroke-linecap:butt;stroke-linejoin:miter;stroke-miterlimit:4;stroke-dasharray:none;stroke-dashoffset:0;stroke-opacity:1"
             id="rect5249-96"
             width="5.2916665"
             height="5.2916665"
             x="96.572914"
             y="119.72916" />
          <path
             style="opacity:1;vector-effect:none;fill:none;fill-opacity:1;fill-rule:evenodd;stroke:#000000;stroke-width:0.1;stroke-linecap:butt;stroke-linejoin:miter;stroke-miterlimit:4;stroke-dasharray:none;stroke-dashoffset:0;stroke-opacity:1"
             id="path5251-7"
             sodipodi:type="arc"
             sodipodi:cx="99.21875"
             sodipodi:cy="122.375"
             sodipodi:rx="2.1166666"
             sodipodi:ry="2.1166666"
             sodipodi:start="3.0993382"
             sodipodi:end="3.0993032"
             sodipodi:open="true"
             d="m 97.103973,122.46441 a 2.1166666,2.1166666 0 0 1 2.025347,-2.20419 2.1166666,2.1166666 0 0 1 2.20421,2.02533 2.1166666,2.1166666 0 0 1 -2.025313,2.20422 2.1166666,2.1166666 0 0 1 -2.204241,-2.02528" />
          <path
             style="opacity:1;vector-effect:none;fill:none;fill-opacity:1;fill-rule:evenodd;stroke:#000000;stroke-width:0.1;stroke-linecap:butt;stroke-linejoin:miter;stroke-miterlimit:4;stroke-dasharray:none;stroke-dashoffset:0;stroke-opacity:1"
             id="path5253-7"
             sodipodi:type="arc"
             sodipodi:cx="99.21875"
             sodipodi:cy="122.375"
             sodipodi:rx="0.26458332"
             sodipodi:ry="0.26458332"
             sodipodi:start="3.0993382"
             sodipodi:end="3.0978846"
             sodipodi:open="true"
             d="m 98.954403,122.38618 a 0.26458332,0.26458332 0 0 1 0.253074,-0.27552 0.26458332,0.26458332 0 0 1 0.275612,0.25297 0.26458332,0.26458332 0 0 1 -0.252874,0.2757 0.26458332,0.26458332 0 0 1 -0.275796,-0.25277" />
        </g>
        <g
           transform="translate(52.916672,1.2715658e-5)"
           id="g5284-9-3">
          <rect
             style="opacity:1;vector-effect:none;fill:none;fill-opacity:1;fill-rule:evenodd;stroke:#000000;stroke-width:0.1;stroke-linecap:butt;stroke-linejoin:miter;stroke-miterlimit:4;stroke-dasharray:none;stroke-dashoffset:0;stroke-opacity:1"
             id="rect5249-6-7"
             width="5.2916665"
             height="5.2916665"
             x="96.572914"
             y="119.72916" />
          <path
             style="opacity:1;vector-effect:none;fill:none;fill-opacity:1;fill-rule:evenodd;stroke:#000000;stroke-width:0.1;stroke-linecap:butt;stroke-linejoin:miter;stroke-miterlimit:4;stroke-dasharray:none;stroke-dashoffset:0;stroke-opacity:1"
             id="path5251-0-1"
             sodipodi:type="arc"
             sodipodi:cx="99.21875"
             sodipodi:cy="122.375"
             sodipodi:rx="2.1166666"
             sodipodi:ry="2.1166666"
             sodipodi:start="3.0993382"
             sodipodi:end="3.0993032"
             sodipodi:open="true"
             d="m 97.103973,122.46441 a 2.1166666,2.1166666 0 0 1 2.025347,-2.20419 2.1166666,2.1166666 0 0 1 2.20421,2.02533 2.1166666,2.1166666 0 0 1 -2.025313,2.20422 2.1166666,2.1166666 0 0 1 -2.204241,-2.02528" />
          <path
             style="opacity:1;vector-effect:none;fill:none;fill-opacity:1;fill-rule:evenodd;stroke:#000000;stroke-width:0.1;stroke-linecap:butt;stroke-linejoin:miter;stroke-miterlimit:4;stroke-dasharray:none;stroke-dashoffset:0;stroke-opacity:1"
             id="path5253-6-2"
             sodipodi:type="arc"
             sodipodi:cx="99.21875"
             sodipodi:cy="122.375"
             sodipodi:rx="0.26458332"
             sodipodi:ry="0.26458332"
             sodipodi:start="3.0993382"
             sodipodi:end="3.0978846"
             sodipodi:open="true"
             d="m 98.954403,122.38618 a 0.26458332,0.26458332 0 0 1 0.253074,-0.27552 0.26458332,0.26458332 0 0 1 0.275612,0.25297 0.26458332,0.26458332 0 0 1 -0.252874,0.2757 0.26458332,0.26458332 0 0 1 -0.275796,-0.25277" />
        </g>
        <g
           transform="translate(63.50001,2.2715658e-5)"
           id="g5284-4-2">
          <rect
             style="opacity:1;vector-effect:none;fill:none;fill-opacity:1;fill-rule:evenodd;stroke:#000000;stroke-width:0.1;stroke-linecap:butt;stroke-linejoin:miter;stroke-miterlimit:4;stroke-dasharray:none;stroke-dashoffset:0;stroke-opacity:1"
             id="rect5249-9-1"
             width="5.2916665"
             height="5.2916665"
             x="96.572914"
             y="119.72916" />
          <path
             style="opacity:1;vector-effect:none;fill:none;fill-opacity:1;fill-rule:evenodd;stroke:#000000;stroke-width:0.1;stroke-linecap:butt;stroke-linejoin:miter;stroke-miterlimit:4;stroke-dasharray:none;stroke-dashoffset:0;stroke-opacity:1"
             id="path5251-9-5"
             sodipodi:type="arc"
             sodipodi:cx="99.21875"
             sodipodi:cy="122.375"
             sodipodi:rx="2.1166666"
             sodipodi:ry="2.1166666"
             sodipodi:start="3.0993382"
             sodipodi:end="3.0993032"
             sodipodi:open="true"
             d="m 97.103973,122.46441 a 2.1166666,2.1166666 0 0 1 2.025347,-2.20419 2.1166666,2.1166666 0 0 1 2.20421,2.02533 2.1166666,2.1166666 0 0 1 -2.025313,2.20422 2.1166666,2.1166666 0 0 1 -2.204241,-2.02528" />
          <path
             style="opacity:1;vector-effect:none;fill:none;fill-opacity:1;fill-rule:evenodd;stroke:#000000;stroke-width:0.1;stroke-linecap:butt;stroke-linejoin:miter;stroke-miterlimit:4;stroke-dasharray:none;stroke-dashoffset:0;stroke-opacity:1"
             id="path5253-0-0"
             sodipodi:type="arc"
             sodipodi:cx="99.21875"
             sodipodi:cy="122.375"
             sodipodi:rx="0.26458332"
             sodipodi:ry="0.26458332"
             sodipodi:start="3.0993382"
             sodipodi:end="3.0978846"
             sodipodi:open="true"
             d="m 98.954403,122.38618 a 0.26458332,0.26458332 0 0 1 0.253074,-0.27552 0.26458332,0.26458332 0 0 1 0.275612,0.25297 0.26458332,0.26458332 0 0 1 -0.252874,0.2757 0.26458332,0.26458332 0 0 1 -0.275796,-0.25277" />
        </g>
        <g
           transform="translate(74.083344,2.2715658e-5)"
           id="g5284-9-8-9">
          <rect
             style="opacity:1;vector-effect:none;fill:none;fill-opacity:1;fill-rule:evenodd;stroke:#000000;stroke-width:0.1;stroke-linecap:butt;stroke-linejoin:miter;stroke-miterlimit:4;stroke-dasharray:none;stroke-dashoffset:0;stroke-opacity:1"
             id="rect5249-6-9-0"
             width="5.2916665"
             height="5.2916665"
             x="96.572914"
             y="119.72916" />
          <path
             style="opacity:1;vector-effect:none;fill:none;fill-opacity:1;fill-rule:evenodd;stroke:#000000;stroke-width:0.1;stroke-linecap:butt;stroke-linejoin:miter;stroke-miterlimit:4;stroke-dasharray:none;stroke-dashoffset:0;stroke-opacity:1"
             id="path5251-0-3-4"
             sodipodi:type="arc"
             sodipodi:cx="99.21875"
             sodipodi:cy="122.375"
             sodipodi:rx="2.1166666"
             sodipodi:ry="2.1166666"
             sodipodi:start="3.0993382"
             sodipodi:end="3.0993032"
             sodipodi:open="true"
             d="m 97.103973,122.46441 a 2.1166666,2.1166666 0 0 1 2.025347,-2.20419 2.1166666,2.1166666 0 0 1 2.20421,2.02533 2.1166666,2.1166666 0 0 1 -2.025313,2.20422 2.1166666,2.1166666 0 0 1 -2.204241,-2.02528" />
          <path
             style="opacity:1;vector-effect:none;fill:none;fill-opacity:1;fill-rule:evenodd;stroke:#000000;stroke-width:0.1;stroke-linecap:butt;stroke-linejoin:miter;stroke-miterlimit:4;stroke-dasharray:none;stroke-dashoffset:0;stroke-opacity:1"
             id="path5253-6-1-0"
             sodipodi:type="arc"
             sodipodi:cx="99.21875"
             sodipodi:cy="122.375"
             sodipodi:rx="0.26458332"
             sodipodi:ry="0.26458332"
             sodipodi:start="3.0993382"
             sodipodi:end="3.0978846"
             sodipodi:open="true"
             d="m 98.954403,122.38618 a 0.26458332,0.26458332 0 0 1 0.253074,-0.27552 0.26458332,0.26458332 0 0 1 0.275612,0.25297 0.26458332,0.26458332 0 0 1 -0.252874,0.2757 0.26458332,0.26458332 0 0 1 -0.275796,-0.25277" />
        </g>
        <path
           style="fill:none;stroke:#000000;stroke-width:0.26458332px;stroke-linecap:butt;stroke-linejoin:miter;stroke-opacity:1"
           d="M 82.814582,125.02083 H 33.072916 l 10e-7,0.52917 49.477083,0"
           id="path5406"
           inkscape:connector-curvature="0" />
        <path
           style="fill:none;stroke:#000000;stroke-width:0.265;stroke-linecap:butt;stroke-linejoin:miter;stroke-opacity:1;stroke-miterlimit:4;stroke-dasharray:none"
           d="m 83.87292,125.55 97.36666,0 v -0.52917 l -97.10208,0"
           id="path5406-1"
           inkscape:connector-curvature="0"
           sodipodi:nodetypes="cccc" />
      </g>
    </g>
    <use
       height="100%"
       width="100%"
       id="use5264"
       xlink:href="#g5258"
       y="0"
       x="0" />
    <text
       xml:space="preserve"
       style="font-style:normal;font-weight:normal;font-size:4.93888855px;line-height:1.25;font-family:sans-serif;letter-spacing:0px;word-spacing:0px;fill:#000000;fill-opacity:1;stroke:none;stroke-width:0.26458332"
       x="97.648819"
       y="117.01718"
       id="text5499"><tspan
         sodipodi:role="line"
         id="tspan5497"
         x="97.648819"
         y="117.01718"
         style="stroke-width:0.26458332">0</tspan></text>
    <text
       xml:space="preserve"
       style="font-style:normal;font-weight:normal;font-size:4.93888855px;line-height:1.25;font-family:sans-serif;letter-spacing:0px;word-spacing:0px;fill:#000000;fill-opacity:1;stroke:none;stroke-width:0.26458332"
       x="108.18754"
       y="117.01959"
       id="text5503"><tspan
         sodipodi:role="line"
         id="tspan5501"
         x="108.18754"
         y="117.01959"
         style="stroke-width:0.26458332">1</tspan></text>
    <text
       xml:space="preserve"
       style="font-style:normal;font-weight:normal;font-size:4.93888855px;line-height:1.25;font-family:sans-serif;letter-spacing:0px;word-spacing:0px;fill:#000000;fill-opacity:1;stroke:none;stroke-width:0.26458332"
       x="118.88059"
       y="117.05215"
       id="text5507"><tspan
         sodipodi:role="line"
         id="tspan5505"
         x="118.88059"
         y="117.05215"
         style="stroke-width:0.26458332">2</tspan></text>
    <text
       xml:space="preserve"
       style="font-style:normal;font-weight:normal;font-size:4.93888855px;line-height:1.25;font-family:sans-serif;letter-spacing:0px;word-spacing:0px;fill:#000000;fill-opacity:1;stroke:none;stroke-width:0.26458332"
       x="129.40726"
       y="117.01718"
       id="text5511"><tspan
         sodipodi:role="line"
         id="tspan5509"
         x="129.40726"
         y="117.01718"
         style="stroke-width:0.26458332">3</tspan></text>
    <text
       xml:space="preserve"
       style="font-style:normal;font-weight:normal;font-size:4.93888855px;line-height:1.25;font-family:sans-serif;letter-spacing:0px;word-spacing:0px;fill:#000000;fill-opacity:1;stroke:none;stroke-width:0.26458332"
       x="139.97925"
       y="117.01959"
       id="text5515"><tspan
         sodipodi:role="line"
         id="tspan5513"
         x="139.97925"
         y="117.01959"
         style="stroke-width:0.26458332">4</tspan></text>
    <text
       xml:space="preserve"
       style="font-style:normal;font-weight:normal;font-size:4.93888855px;line-height:1.25;font-family:sans-serif;letter-spacing:0px;word-spacing:0px;fill:#000000;fill-opacity:1;stroke:none;stroke-width:0.26458332"
       x="150.5896"
       y="116.98463"
       id="text5519"><tspan
         sodipodi:role="line"
         id="tspan5517"
         x="150.5896"
         y="116.98463"
         style="stroke-width:0.26458332">5</tspan></text>
    <text
       xml:space="preserve"
       style="font-style:normal;font-weight:normal;font-size:4.93888855px;line-height:1.25;font-family:sans-serif;letter-spacing:0px;word-spacing:0px;fill:#000000;fill-opacity:1;stroke:none;stroke-width:0.26458332"
       x="161.13072"
       y="117.01718"
       id="text5523"><tspan
         sodipodi:role="line"
         id="tspan5521"
         x="161.13072"
         y="117.01718"
         style="stroke-width:0.26458332">6</tspan></text>
    <text
       xml:space="preserve"
       style="font-style:normal;font-weight:normal;font-size:4.93888855px;line-height:1.25;font-family:sans-serif;letter-spacing:0px;word-spacing:0px;fill:#000000;fill-opacity:1;stroke:none;stroke-width:0.26458332"
       x="171.7394"
       y="117.01959"
       id="text5527"><tspan
         sodipodi:role="line"
         id="tspan5525"
         x="171.7394"
         y="117.01959"
         style="stroke-width:0.26458332">7</tspan></text>
    <text
       xml:space="preserve"
       style="font-style:normal;font-weight:normal;font-size:4.93888855px;line-height:1.25;font-family:sans-serif;letter-spacing:0px;word-spacing:0px;fill:#00a100;fill-opacity:1;stroke:none;stroke-width:0.26458332;"
       x="36.792782"
       y="131.43697"
       id="text5499-1"><tspan
         sodipodi:role="line"
         id="tspan5497-7"
         x="36.792782"
         y="131.43697"
         style="stroke-width:0.26458332;fill:#00a100;fill-opacity:1;">0</tspan></text>
    <text
       xml:space="preserve"
       style="font-style:normal;font-weight:normal;font-size:4.93888855px;line-height:1.25;font-family:sans-serif;letter-spacing:0px;word-spacing:0px;fill:#00a100;fill-opacity:1;stroke:none;stroke-width:0.26458332;"
       x="39.395874"
       y="117.08104"
       id="text5503-5"><tspan
         sodipodi:role="line"
         id="tspan5501-6"
         x="39.395874"
         y="117.08104"
         style="stroke-width:0.26458332;fill:#00a100;fill-opacity:1;">1</tspan></text>
    <text
       xml:space="preserve"
       style="font-style:normal;font-weight:normal;font-size:4.93888855px;line-height:1.25;font-family:sans-serif;letter-spacing:0px;word-spacing:0px;fill:#00a100;fill-opacity:1;stroke:none;stroke-width:0.26458332;"
       x="42.151436"
       y="131.47194"
       id="text5507-5"><tspan
         sodipodi:role="line"
         id="tspan5505-4"
         x="42.151436"
         y="131.47194"
         style="stroke-width:0.26458332;fill:#00a100;fill-opacity:1;">2</tspan></text>
    <text
       xml:space="preserve"
       style="font-style:normal;font-weight:normal;font-size:4.93888855px;line-height:1.25;font-family:sans-serif;letter-spacing:0px;word-spacing:0px;fill:#00a100;fill-opacity:1;stroke:none;stroke-width:0.26458332;"
       x="44.740597"
       y="117.07864"
       id="text5511-2"><tspan
         sodipodi:role="line"
         id="tspan5509-2"
         x="44.740597"
         y="117.07864"
         style="stroke-width:0.26458332;fill:#00a100;fill-opacity:1;">3</tspan></text>
    <text
       xml:space="preserve"
       style="font-style:normal;font-weight:normal;font-size:4.93888855px;line-height:1.25;font-family:sans-serif;letter-spacing:0px;word-spacing:0px;fill:#00a100;fill-opacity:1;stroke:none;stroke-width:0.26458332;"
       x="59.301117"
       y="131.43938"
       id="text5515-1"><tspan
         sodipodi:role="line"
         id="tspan5513-7"
         x="59.301117"
         y="131.43938"
         style="stroke-width:0.26458332;fill:#00a100;fill-opacity:1;">4</tspan></text>
    <text
       xml:space="preserve"
       style="font-style:normal;font-weight:normal;font-size:4.93888855px;line-height:1.25;font-family:sans-serif;letter-spacing:0px;word-spacing:0px;fill:#00a100;fill-opacity:1;stroke:none;stroke-width:0.26458332;"
       x="61.954185"
       y="117.04607"
       id="text5519-2"><tspan
         sodipodi:role="line"
         id="tspan5517-4"
         x="61.954185"
         y="117.04607"
         style="stroke-width:0.26458332;fill:#00a100;fill-opacity:1;">5</tspan></text>
    <text
       xml:space="preserve"
       style="font-style:normal;font-weight:normal;font-size:4.93888855px;line-height:1.25;font-family:sans-serif;letter-spacing:0px;word-spacing:0px;fill:#00a100;fill-opacity:1;stroke:none;stroke-width:0.26458332;"
       x="64.557816"
       y="131.43697"
       id="text5523-1"><tspan
         sodipodi:role="line"
         id="tspan5521-6"
         x="64.557816"
         y="131.43697"
         style="stroke-width:0.26458332;fill:#00a100;fill-opacity:1;">6</tspan></text>
    <text
       xml:space="preserve"
       style="font-style:normal;font-weight:normal;font-size:4.93888855px;line-height:1.25;font-family:sans-serif;letter-spacing:0px;word-spacing:0px;fill:#00a100;fill-opacity:1;stroke:none;stroke-width:0.26458332;"
       x="67.228973"
       y="117.08105"
       id="text5527-5"><tspan
         sodipodi:role="line"
         id="tspan5525-7"
         x="67.228973"
         y="117.08105"
         style="stroke-width:0.26458332;fill:#00a100;fill-opacity:1;">7</tspan></text>
    <g
       id="g5708">
      <path
         sodipodi:nodetypes="cc"
         inkscape:connector-curvature="0"
         id="path5677"
         d="m 74.083333,118.93542 -10e-7,-9.78959"
         style="fill:none;stroke:#ff006b;stroke-width:0.26458332px;stroke-linecap:butt;stroke-linejoin:miter;stroke-opacity:1" />
      <path
         inkscape:connector-curvature="0"
         id="path5679"
         d="M 78.052082,109.14583 H 51.593749 l 10e-7,9.78959"
         style="fill:none;stroke:#ff006b;stroke-width:0.26458332px;stroke-linecap:butt;stroke-linejoin:miter;stroke-opacity:1" />
    </g>
    <g
       transform="matrix(1,0,0,-1,9.9999998e-7,244.75)"
       id="g5708-7">
      <path
         sodipodi:nodetypes="cc"
         inkscape:connector-curvature="0"
         id="path5677-3"
         d="m 74.083332,118.40625 0,-9.26042"
         style="fill:none;stroke:#ff006b;stroke-width:0.26458332px;stroke-linecap:butt;stroke-linejoin:miter;stroke-opacity:1" />
      <path
         inkscape:connector-curvature="0"
         id="path5679-6"
         d="M 78.052082,109.14583 H 51.593749 l 0,9.26042"
         style="fill:none;stroke:#ff006b;stroke-width:0.26458332px;stroke-linecap:butt;stroke-linejoin:miter;stroke-opacity:1"
         sodipodi:nodetypes="ccc" />
    </g>
    <g
       id="g5749">
      <path
         inkscape:connector-curvature="0"
         id="path5731"
         d="m 71.437499,118.93542 v -8.99584 l -35.718749,0"
         style="fill:none;stroke:#0072ff;stroke-width:0.26458332px;stroke-linecap:butt;stroke-linejoin:miter;stroke-opacity:1" />
      <path
         inkscape:connector-curvature="0"
         id="path5733"
         d="m 66.145832,118.93542 v -8.99584"
         style="fill:none;stroke:#0072ff;stroke-width:0.26458332px;stroke-linecap:butt;stroke-linejoin:miter;stroke-opacity:1" />
      <path
         inkscape:connector-curvature="0"
         id="path5735"
         d="m 60.854166,118.93542 v -8.99584"
         style="fill:none;stroke:#0072ff;stroke-width:0.26458332px;stroke-linecap:butt;stroke-linejoin:miter;stroke-opacity:1" />
      <path
         inkscape:connector-curvature="0"
         id="path5737"
         d="m 48.947916,118.93542 v -8.99584"
         style="fill:none;stroke:#0072ff;stroke-width:0.26458332px;stroke-linecap:butt;stroke-linejoin:miter;stroke-opacity:1" />
      <path
         inkscape:connector-curvature="0"
         id="path5739"
         d="m 43.656249,118.93542 v -8.99584"
         style="fill:none;stroke:#0072ff;stroke-width:0.26458332px;stroke-linecap:butt;stroke-linejoin:miter;stroke-opacity:1" />
      <path
         inkscape:connector-curvature="0"
         id="path5741"
         d="m 38.364583,118.93542 v -8.99584"
         style="fill:none;stroke:#0072ff;stroke-width:0.26458332px;stroke-linecap:butt;stroke-linejoin:miter;stroke-opacity:1" />
    </g>
    <path
       style="fill:none;stroke:#0072ff;stroke-width:0.26458332px;stroke-linecap:butt;stroke-linejoin:miter;stroke-opacity:1"
       d="m 71.4375,126.34375 -10e-7,8.46667 H 35.71875"
       id="path5731-7"
       inkscape:connector-curvature="0"
       sodipodi:nodetypes="ccc" />
    <path
       style="fill:none;stroke:#0072ff;stroke-width:0.26458332px;stroke-linecap:butt;stroke-linejoin:miter;stroke-opacity:1"
       d="m 68.791667,126.34375 -2e-6,8.46667"
       id="path5733-9"
       inkscape:connector-curvature="0"
       sodipodi:nodetypes="cc" />
    <path
       style="fill:none;stroke:#0072ff;stroke-width:0.26458332px;stroke-linecap:butt;stroke-linejoin:miter;stroke-opacity:1"
       d="m 63.5,126.34375 -10e-7,8.46667"
       id="path5735-7"
       inkscape:connector-curvature="0"
       sodipodi:nodetypes="cc" />
    <path
       style="fill:none;stroke:#0072ff;stroke-width:0.26458332px;stroke-linecap:butt;stroke-linejoin:miter;stroke-opacity:1"
       d="m 48.947917,126.34375 0,8.46667"
       id="path5737-2"
       inkscape:connector-curvature="0"
       sodipodi:nodetypes="cc" />
    <path
       style="fill:none;stroke:#0072ff;stroke-width:0.26458332px;stroke-linecap:butt;stroke-linejoin:miter;stroke-opacity:1"
       d="m 46.302083,126.34375 -1e-6,8.46667"
       id="path5739-2"
       inkscape:connector-curvature="0"
       sodipodi:nodetypes="cc" />
    <path
       style="fill:none;stroke:#0072ff;stroke-width:0.26458332px;stroke-linecap:butt;stroke-linejoin:miter;stroke-opacity:1"
       d="m 41.010417,126.34375 -10e-7,8.46667"
       id="path5741-1"
       inkscape:connector-curvature="0"
       sodipodi:nodetypes="cc" />
    <text
       xml:space="preserve"
       style="font-style:normal;font-weight:normal;font-size:4.93888855px;line-height:1.25;font-family:sans-serif;letter-spacing:0px;word-spacing:0px;fill:#0072ff;fill-opacity:1;stroke:none;stroke-width:0.26458332;"
       x="24.771614"
       y="111.52708"
       id="text5792"><tspan
         sodipodi:role="line"
         id="tspan5790"
         x="24.771614"
         y="111.52708"
         style="stroke-width:0.26458332;fill:#0072ff;fill-opacity:1;">gnd</tspan></text>
    <text
       xml:space="preserve"
       style="font-style:normal;font-weight:normal;font-size:4.93888855px;line-height:1.25;font-family:sans-serif;letter-spacing:0px;word-spacing:0px;fill:#0072ff;fill-opacity:1;stroke:none;stroke-width:0.26458332;"
       x="24.771614"
       y="136.00105"
       id="text5796"><tspan
         sodipodi:role="line"
         id="tspan5794"
         x="24.771614"
         y="136.00105"
         style="stroke-width:0.26458332;fill:#0072ff;fill-opacity:1;">gnd</tspan></text>
    <text
       xml:space="preserve"
       style="font-style:normal;font-weight:normal;font-size:4.93888855px;line-height:1.25;font-family:sans-serif;letter-spacing:0px;word-spacing:0px;fill:#ff006b;fill-opacity:1;stroke:none;stroke-width:0.26458332;"
       x="79.507294"
       y="110.60104"
       id="text5800"><tspan
         sodipodi:role="line"
         id="tspan5798"
         x="79.507294"
         y="110.60104"
         style="stroke-width:0.26458332;fill:#ff006b;fill-opacity:1;">+16.7V</tspan></text>
    <text
       xml:space="preserve"
       style="font-style:normal;font-weight:normal;font-size:4.93888855px;line-height:1.25;font-family:sans-serif;letter-spacing:0px;word-spacing:0px;fill:#ff006b;fill-opacity:1;stroke:none;stroke-width:0.26458332;"
       x="80.825218"
       y="136.92708"
       id="text5804"><tspan
         sodipodi:role="line"
         id="tspan5802"
         x="80.825218"
         y="136.92708"
         style="stroke-width:0.26458332;fill:#ff006b;fill-opacity:1;">-16.7V</tspan></text>
  </g>
</svg>
