%!PS-Adobe-3.0 EPSF-3.0
%%Creator: MATLAB, The MathWorks, Inc. Version 8.0.0.783 (R2012b). Operating System: Linux 3.2.0-31-generic #50-Ubuntu SMP Fri Sep 7 16:16:45 UTC 2012 x86_64.
%%Title: ./heat2d_ex10-3.eps
%%CreationDate: 03/25/2014  17:42:27
%%DocumentNeededFonts: Helvetica
%%DocumentProcessColors: Cyan Magenta Yellow Black
%%LanguageLevel: 2
%%Pages: 1
%%BoundingBox:    89   219   546   591
%%EndComments

%%BeginProlog
% MathWorks dictionary
/MathWorks 160 dict begin
% definition operators
/bdef {bind def} bind def
/ldef {load def} bind def
/xdef {exch def} bdef
/xstore {exch store} bdef
% operator abbreviations
/c  /clip ldef
/cc /concat ldef
/cp /closepath ldef
/gr /grestore ldef
/gs /gsave ldef
/mt /moveto ldef
/np /newpath ldef
/cm /currentmatrix ldef
/sm /setmatrix ldef
/rm /rmoveto ldef
/rl /rlineto ldef
/s {show newpath} bdef
/sc {setcmykcolor} bdef
/sr /setrgbcolor ldef
/sg /setgray ldef
/w /setlinewidth ldef
/j /setlinejoin ldef
/cap /setlinecap ldef
/rc {rectclip} bdef
/rf {rectfill} bdef
% page state control
/pgsv () def
/bpage {/pgsv save def} bdef
/epage {pgsv restore} bdef
/bplot /gsave ldef
/eplot {stroke grestore} bdef
% orientation switch
/portraitMode 0 def /landscapeMode 1 def /rotateMode 2 def
% coordinate system mappings
/dpi2point 0 def
% font control
/FontSize 0 def
/FMS {/FontSize xstore findfont [FontSize 0 0 FontSize neg 0 0]
  makefont setfont} bdef
/reencode {exch dup where {pop load} {pop StandardEncoding} ifelse
  exch dup 3 1 roll findfont dup length dict begin
  { 1 index /FID ne {def}{pop pop} ifelse } forall
  /Encoding exch def currentdict end definefont pop} bdef
/isroman {findfont /CharStrings get /Agrave known} bdef
/FMSR {3 1 roll 1 index dup isroman {reencode} {pop pop} ifelse
  exch FMS} bdef
/csm {1 dpi2point div -1 dpi2point div scale neg translate
 dup landscapeMode eq {pop -90 rotate}
  {rotateMode eq {90 rotate} if} ifelse} bdef
% line types: solid, dotted, dashed, dotdash
/SO { [] 0 setdash } bdef
/DO { [.5 dpi2point mul 4 dpi2point mul] 0 setdash } bdef
/DA { [6 dpi2point mul] 0 setdash } bdef
/DD { [.5 dpi2point mul 4 dpi2point mul 6 dpi2point mul 4
  dpi2point mul] 0 setdash } bdef
% macros for lines and objects
/L {lineto stroke} bdef
/MP {3 1 roll moveto 1 sub {rlineto} repeat} bdef
/AP {{rlineto} repeat} bdef
/PDlw -1 def
/W {/PDlw currentlinewidth def setlinewidth} def
/PP {closepath eofill} bdef
/DP {closepath stroke} bdef
/MR {4 -2 roll moveto dup  0 exch rlineto exch 0 rlineto
  neg 0 exch rlineto closepath} bdef
/FR {MR stroke} bdef
/PR {MR fill} bdef
/L1i {{currentfile picstr readhexstring pop} image} bdef
/tMatrix matrix def
/MakeOval {newpath tMatrix currentmatrix pop translate scale
0 0 1 0 360 arc tMatrix setmatrix} bdef
/FO {MakeOval stroke} bdef
/PO {MakeOval fill} bdef
/PD {currentlinewidth 2 div 0 360 arc fill
   PDlw -1 eq not {PDlw w /PDlw -1 def} if} def
/FA {newpath tMatrix currentmatrix pop translate scale
  0 0 1 5 -2 roll arc tMatrix setmatrix stroke} bdef
/PA {newpath tMatrix currentmatrix pop	translate 0 0 moveto scale
  0 0 1 5 -2 roll arc closepath tMatrix setmatrix fill} bdef
/FAn {newpath tMatrix currentmatrix pop translate scale
  0 0 1 5 -2 roll arcn tMatrix setmatrix stroke} bdef
/PAn {newpath tMatrix currentmatrix pop translate 0 0 moveto scale
  0 0 1 5 -2 roll arcn closepath tMatrix setmatrix fill} bdef
/vradius 0 def /hradius 0 def /lry 0 def
/lrx 0 def /uly 0 def /ulx 0 def /rad 0 def
/MRR {/vradius xdef /hradius xdef /lry xdef /lrx xdef /uly xdef
  /ulx xdef newpath tMatrix currentmatrix pop ulx hradius add uly
  vradius add translate hradius vradius scale 0 0 1 180 270 arc 
  tMatrix setmatrix lrx hradius sub uly vradius add translate
  hradius vradius scale 0 0 1 270 360 arc tMatrix setmatrix
  lrx hradius sub lry vradius sub translate hradius vradius scale
  0 0 1 0 90 arc tMatrix setmatrix ulx hradius add lry vradius sub
  translate hradius vradius scale 0 0 1 90 180 arc tMatrix setmatrix
  closepath} bdef
/FRR {MRR stroke } bdef
/PRR {MRR fill } bdef
/MlrRR {/lry xdef /lrx xdef /uly xdef /ulx xdef /rad lry uly sub 2 div def
  newpath tMatrix currentmatrix pop ulx rad add uly rad add translate
  rad rad scale 0 0 1 90 270 arc tMatrix setmatrix lrx rad sub lry rad
  sub translate rad rad scale 0 0 1 270 90 arc tMatrix setmatrix
  closepath} bdef
/FlrRR {MlrRR stroke } bdef
/PlrRR {MlrRR fill } bdef
/MtbRR {/lry xdef /lrx xdef /uly xdef /ulx xdef /rad lrx ulx sub 2 div def
  newpath tMatrix currentmatrix pop ulx rad add uly rad add translate
  rad rad scale 0 0 1 180 360 arc tMatrix setmatrix lrx rad sub lry rad
  sub translate rad rad scale 0 0 1 0 180 arc tMatrix setmatrix
  closepath} bdef
/FtbRR {MtbRR stroke } bdef
/PtbRR {MtbRR fill } bdef
/stri 6 array def /dtri 6 array def
/smat 6 array def /dmat 6 array def
/tmat1 6 array def /tmat2 6 array def /dif 3 array def
/asub {/ind2 exch def /ind1 exch def dup dup
  ind1 get exch ind2 get sub exch } bdef
/tri_to_matrix {
  2 0 asub 3 1 asub 4 0 asub 5 1 asub
  dup 0 get exch 1 get 7 -1 roll astore } bdef
/compute_transform {
  dmat dtri tri_to_matrix tmat1 invertmatrix 
  smat stri tri_to_matrix tmat2 concatmatrix } bdef
/ds {stri astore pop} bdef
/dt {dtri astore pop} bdef
/db {2 copy /cols xdef /rows xdef mul dup 3 mul string
  currentfile 
  3 index 0 eq {/ASCIIHexDecode filter}
  {/ASCII85Decode filter 3 index 2 eq {/RunLengthDecode filter} if }
  ifelse exch readstring pop
  dup 0 3 index getinterval /rbmap xdef
  dup 2 index dup getinterval /gbmap xdef
  1 index dup 2 mul exch getinterval /bbmap xdef pop pop}bdef
/it {gs np dtri aload pop moveto lineto lineto cp c
  cols rows 8 compute_transform 
  rbmap gbmap bbmap true 3 colorimage gr}bdef
/il {newpath moveto lineto stroke}bdef
currentdict end def
%%EndProlog

%%BeginSetup
MathWorks begin

0 cap

end
%%EndSetup

%%Page: 1 1
%%BeginPageSetup
%%PageBoundingBox:    89   219   546   591
MathWorks begin
bpage
%%EndPageSetup

%%BeginObject: obj1
bplot

/dpi2point 12 def
portraitMode 0216 7344 csm

  856   247  5489  4462 rc
93 dict begin %Colortable dictionary
/c0 { 0.000000 0.000000 0.000000 sr} bdef
/c1 { 1.000000 1.000000 1.000000 sr} bdef
/c2 { 0.900000 0.000000 0.000000 sr} bdef
/c3 { 0.000000 0.820000 0.000000 sr} bdef
/c4 { 0.000000 0.000000 0.800000 sr} bdef
/c5 { 0.910000 0.820000 0.320000 sr} bdef
/c6 { 1.000000 0.260000 0.820000 sr} bdef
/c7 { 0.000000 0.820000 0.820000 sr} bdef
c0
1 j
1 sg
   0    0 6913 5186 rf
6 w
gs 898 389 5358 4226 rc
0 sg
217 288 -257 -51 40 -237 3537 3408 4 MP stroke
-207 -260 355 24 -148 236 3254 3606 4 MP stroke
-7 -243 207 260 -200 -17 3454 3623 4 MP stroke
194 -227 7 243 -201 -16 3655 3639 4 MP stroke
201 16 -83 215 -118 -231 3655 3639 4 MP stroke
203 -35 -164 229 -39 -194 3045 3402 4 MP stroke
-217 -145 314 -88 -97 233 3103 2975 4 MP stroke
232 -7 -4 223 -228 -216 2816 3661 4 MP stroke
219 -27 -26 224 -193 -197 3035 3634 4 MP stroke
-7 -240 209 204 -202 36 3247 3366 4 MP stroke
202 -36 39 194 -241 -158 3247 3366 4 MP stroke
-75 -215 254 -8 -179 223 2767 3222 4 MP stroke
118 231 -341 -145 223 -86 3655 3639 4 MP stroke
30 218 -188 0 158 -218 4023 4510 4 MP stroke
369 -42 -40 237 -329 -195 3906 3366 4 MP stroke
-65 -218 223 0 -158 218 4181 4292 4 MP stroke
-102 -223 188 0 -86 223 4267 4069 4 MP stroke
41 -215 222 215 -263 0 4560 3880 4 MP stroke
-220 -227 247 -1 -27 228 4047 3842 4 MP stroke
84 227 -355 -24 271 -203 3190 4069 4 MP stroke
228 -8 -45 231 -183 -223 3993 4292 4 MP stroke
223 0 -193 218 -30 -218 4023 4510 4 MP stroke
161 222 -247 1 86 -223 4181 4292 4 MP stroke
231 0 -194 227 -37 -227 3692 3866 4 MP stroke
115 220 -231 0 116 -220 3576 4086 4 MP stroke
-41 328 -196 -101 237 -227 3810 4069 4 MP stroke
-100 -218 223 0 -123 218 4369 4292 4 MP stroke
137 -207 100 218 -237 -11 4606 4303 4 MP stroke
102 223 -252 -26 150 -197 4369 4292 4 MP stroke
65 218 -188 0 123 -218 4246 4510 4 MP stroke
237 11 -150 197 -87 -208 4606 4303 4 MP stroke
223 0 -137 207 -86 -207 4692 4510 4 MP stroke
193 0 -140 206 -53 -206 4799 4303 4 MP stroke
200 0 -74 224 -126 -224 4437 3661 4 MP stroke
248 7 -128 216 -120 -223 4685 3668 4 MP stroke
144 -190 116 215 -260 -25 4945 3693 4 MP stroke
-144 190 -63 -227 207 37 5008 3921 4 MP stroke
115 214 -207 -38 92 -176 4916 4097 4 MP stroke
-92 176 -179 -223 271 47 4916 4097 4 MP stroke
344 -6 -116 180 -228 -174 5377 3123 4 MP stroke
118 227 -234 -47 116 -180 5033 3129 4 MP stroke
-116 181 -118 -227 234 46 4799 3083 4 MP stroke
-316 -5 144 -190 172 195 4917 3308 4 MP stroke
125 232 -243 4 118 -236 4445 3222 4 MP stroke
190 -181 -8 236 -182 -55 4237 3661 4 MP stroke
250 38 -190 181 -60 -219 4297 3880 4 MP stroke
252 26 -30 189 -222 -215 4519 4095 4 MP stroke
140 -219 60 219 -200 0 4437 3661 4 MP stroke
241 3 -125 212 -116 -215 4801 3883 4 MP stroke
128 -216 126 224 -254 -8 4565 3445 4 MP stroke
74 -224 153 254 -227 -30 4311 3437 4 MP stroke
-118 236 -118 -333 236 97 4563 2986 4 MP stroke
-118 157 -125 -153 243 -4 4320 2990 4 MP stroke
-118 236 -119 -278 237 42 4445 3222 4 MP stroke
30 -189 220 227 -250 -38 4297 3880 4 MP stroke
-204 135 8 -236 196 101 3851 3741 4 MP stroke
29 -199 177 53 -206 146 4084 3407 4 MP stroke
-196 -102 159 -125 37 227 3655 3639 4 MP stroke
234 -17 -116 220 -118 -203 3810 4069 4 MP stroke
-193 0 107 -207 86 207 4606 4303 4 MP stroke
111 -207 117 207 -228 0 5027 4303 4 MP stroke
223 0 -159 159 -64 -159 5362 4510 4 MP stroke
186 217 -241 -3 55 -214 4746 4097 4 MP stroke
179 223 -207 -37 28 -186 5187 4144 4 MP stroke
271 48 -160 159 -111 -207 5298 4351 4 MP stroke
111 207 -270 -47 159 -160 5298 4351 4 MP stroke
-218 -64 159 -160 59 224 5558 3808 4 MP stroke
-142 187 -59 -223 201 36 5357 3772 4 MP stroke
-142 187 -59 -224 201 37 5416 3995 4 MP stroke
-201 -36 142 -187 59 223 5357 3772 4 MP stroke
-201 -37 229 -149 -28 186 5215 3958 4 MP stroke
263 0 -140 219 -123 -219 4560 3880 4 MP stroke
206 -146 -28 187 -178 -41 4084 3407 4 MP stroke
182 55 -29 199 -153 -254 4237 3661 4 MP stroke
29 -199 178 41 -207 158 4113 3208 4 MP stroke
134 -215 198 229 -332 -14 4445 3222 4 MP stroke
332 14 -207 218 -125 -232 4445 3222 4 MP stroke
254 8 -134 215 -120 -223 4565 3445 4 MP stroke
-117 181 -176 -268 293 87 4565 3445 4 MP stroke
118 -157 125 232 -243 -75 4438 2833 4 MP stroke
-63 -233 280 88 -217 145 4050 2975 4 MP stroke
27 -188 196 102 -223 86 3878 3553 4 MP stroke
204 -135 -27 188 -177 -53 4055 3606 4 MP stroke
28 -187 341 145 -369 42 3906 3366 4 MP stroke
-280 -88 207 -158 73 246 3833 3120 4 MP stroke
-73 -246 329 195 -256 51 3833 3120 4 MP stroke
-107 207 -117 -207 224 0 4692 4510 4 MP stroke
227 30 -29 199 -198 -229 4311 3437 4 MP stroke
-87 -161 260 25 -173 136 4858 3532 4 MP stroke
144 -190 87 161 -231 29 5089 3503 4 MP stroke
59 -224 176 268 -235 -44 4917 3308 4 MP stroke
-41 215 -186 -217 227 2 4519 4095 4 MP stroke
-258 -25 160 -159 98 184 5678 3688 4 MP stroke
-57 -226 258 25 -201 201 5879 3487 4 MP stroke
-179 -103 120 -120 59 223 5499 3585 4 MP stroke
-102 -191 246 1 -144 190 5377 3123 4 MP stroke
-59 -223 201 37 -142 186 5357 3772 4 MP stroke
-133 -136 240 -5 -107 141 5366 3449 4 MP stroke
144 -190 63 228 -207 -38 5152 3731 4 MP stroke
142 -187 98 182 -240 5 5499 3585 4 MP stroke
-63 -228 207 38 -144 190 5089 3503 4 MP stroke
-201 -37 160 -159 41 196 5416 3995 4 MP stroke
-144 190 -63 -228 207 38 4801 3883 4 MP stroke
-271 -47 160 -159 111 206 4916 4097 4 MP stroke
-261 37 168 -168 93 131 5659 4212 4 MP stroke
-160 159 -42 -180 202 21 5457 4191 4 MP stroke
-202 -21 148 -149 54 170 5457 4191 4 MP stroke
213 10 -159 160 -54 -170 5511 4361 4 MP stroke
223 0 -149 149 -74 -149 5585 4510 4 MP stroke
74 149 -241 18 167 -167 5585 4510 4 MP stroke
-149 148 0 -223 149 75 6106 4212 4 MP stroke
-268 90 156 -201 112 111 5808 4064 4 MP stroke
-186 -37 149 -149 37 186 5920 4175 4 MP stroke
-216 203 0 -223 216 20 6039 2928 4 MP stroke
216 -203 0 200 -216 3 6255 2725 4 MP stroke
0 171 -237 -171 237 0 5781 2502 4 MP stroke
-245 27 0 -171 245 144 5536 2358 4 MP stroke
0 170 -237 0 237 -170 5781 2672 4 MP stroke
-280 70 -33 -188 313 118 5289 2617 4 MP stroke
-216 226 0 -223 216 -3 6039 2728 4 MP stroke
42 236 -258 -56 216 -180 5823 2908 4 MP stroke
-216 -20 216 -180 0 200 6039 2928 4 MP stroke
-216 180 0 -200 216 20 5823 2908 4 MP stroke
-216 -20 216 -156 0 176 5823 2908 4 MP stroke
207 -218 63 233 -270 -15 4320 2990 4 MP stroke
-145 217 -125 -232 270 15 4050 2975 4 MP stroke
159 -159 112 207 -271 -48 5298 4351 4 MP stroke
149 -149 64 159 -213 -10 5511 4361 4 MP stroke
270 47 -229 149 -41 -196 5457 4191 4 MP stroke
-254 66 42 -236 212 170 5569 2161 4 MP stroke
-228 125 88 -250 140 125 5149 2261 4 MP stroke
-234 125 0 -207 234 82 4915 2179 4 MP stroke
-255 28 0 -231 255 203 5034 2414 4 MP stroke
-234 -82 115 -153 119 235 4915 2179 4 MP stroke
-224 -166 234 -125 -10 291 4925 1888 4 MP stroke
228 -174 -55 310 -173 -136 5377 1880 4 MP stroke
177 -250 146 207 -323 43 4801 1515 4 MP stroke
-234 74 -119 -235 353 161 4681 2253 4 MP stroke
147 236 -238 16 91 -252 4533 2017 4 MP stroke
147 210 -242 -4 95 -206 4438 2223 4 MP stroke
206 29 -91 252 -115 -281 4739 2046 4 MP stroke
234 -74 -58 207 -176 -133 4915 2179 4 MP stroke
186 -158 115 281 -301 -123 4925 1888 4 MP stroke
-243 -30 169 -219 74 249 4438 2223 4 MP stroke
-115 -153 234 -160 -119 313 5034 2589 4 MP stroke
-237 -197 237 0 0 197 6018 2305 4 MP stroke
-179 63 -42 -236 221 173 5602 2735 4 MP stroke
-216 -43 216 -156 0 199 6039 3128 4 MP stroke
-221 -44 183 -136 38 180 5602 3040 4 MP stroke
-221 -173 221 -132 0 305 5602 2735 4 MP stroke
-263 -97 161 -94 102 191 5377 3123 4 MP stroke
218 64 -120 120 -98 -184 5776 3872 4 MP stroke
-21 -226 258 56 -237 170 6018 2502 4 MP stroke
216 -226 21 226 -237 0 6255 2502 4 MP stroke
280 161 -247 28 -33 -189 5569 2547 4 MP stroke
179 -63 33 188 -212 -125 5781 2672 4 MP stroke
212 -45 33 189 -245 -144 5781 2502 4 MP stroke
0 -197 237 171 -237 26 6018 2305 4 MP stroke
237 -26 -42 236 -195 -210 6018 2305 4 MP stroke
-51 256 -192 -331 243 75 4195 2758 4 MP stroke
-237 27 0 -224 237 197 6018 2305 4 MP stroke
0 -223 216 203 -216 20 6255 2055 4 MP stroke
228 -125 0 207 -228 -82 5377 2136 4 MP stroke
33 -197 159 222 -192 -25 5569 2161 4 MP stroke
225 -173 0 256 -225 -83 5602 1963 4 MP stroke
-216 -203 237 -27 -21 230 6039 2075 4 MP stroke
-216 -180 216 -20 0 200 6039 1875 4 MP stroke
0 -200 216 156 -216 44 6039 1875 4 MP stroke
119 278 -236 -97 117 -181 4682 3264 4 MP stroke
-137 -341 234 152 -97 189 4778 2561 4 MP stroke
97 -189 169 278 -266 -89 4778 2561 4 MP stroke
228 -82 0 207 -228 -125 5377 2867 4 MP stroke
-97 -308 266 89 -169 219 4681 2253 4 MP stroke
238 -16 -92 223 -146 -207 4624 1765 4 MP stroke
-95 232 -147 -236 242 4 4291 2013 4 MP stroke
239 -63 -177 250 -62 -187 4863 1702 4 MP stroke
301 123 -239 63 -62 -186 4925 1888 4 MP stroke
62 186 -168 94 106 -280 4925 1888 4 MP stroke
279 -144 -106 280 -173 -136 5204 1744 4 MP stroke
224 166 -279 144 55 -310 5149 2054 4 MP stroke
173 136 -234 95 61 -231 5377 1880 4 MP stroke
-116 -180 323 -43 -207 223 4685 1335 4 MP stroke
-243 22 192 -279 51 257 4195 2245 4 MP stroke
-169 -278 243 -83 -74 361 4512 2472 4 MP stroke
216 180 -216 43 0 -223 6255 2055 4 MP stroke
-11 201 -168 -111 179 -90 6076 1029 4 MP stroke
-353 -161 256 -147 97 308 4681 2253 4 MP stroke
-192 279 -74 -249 266 -30 4246 2502 4 MP stroke
-266 30 74 -361 192 331 4246 2502 4 MP stroke
-216 -156 216 -43 0 199 6039 1676 4 MP stroke
0 -223 160 160 -160 63 6255 1386 4 MP stroke
0 -177 193 224 -193 -47 5823 1742 4 MP stroke
216 -44 0 177 -216 -133 6039 1875 4 MP stroke
-176 213 -51 -193 227 -20 5441 1184 4 MP stroke
11 -212 159 159 -170 53 6106 1237 4 MP stroke
160 -63 -11 212 -149 -149 6255 1386 4 MP stroke
149 -75 30 208 -179 -133 6255 1162 4 MP stroke
58 235 -234 -22 176 -213 5441 1184 4 MP stroke
221 -61 -169 254 -52 -193 5720 1357 4 MP stroke
52 193 -268 -126 216 -67 5720 1357 4 MP stroke
-225 -173 225 -83 0 256 5377 2867 4 MP stroke
0 -305 225 173 -225 132 5602 2735 4 MP stroke
0 -170 212 125 -212 45 5781 2502 4 MP stroke
-313 -118 225 -132 88 250 5289 2617 4 MP stroke
-280 -161 280 -70 0 231 5289 2386 4 MP stroke
-159 -222 247 -28 -88 250 5377 2136 4 MP stroke
-140 -125 255 -28 -115 153 5149 2261 4 MP stroke
119 -313 137 341 -256 -28 5034 2589 4 MP stroke
140 -125 115 153 -255 -28 5289 2617 4 MP stroke
0 -175 256 28 -256 147 5034 2414 4 MP stroke
118 333 -234 -152 116 -181 4799 3083 4 MP stroke
-243 83 118 -236 125 153 4438 2833 4 MP stroke
-117 181 -118 -225 235 44 4682 3264 4 MP stroke
120 223 -237 -42 117 -181 4565 3445 4 MP stroke
118 225 -234 -46 116 -179 4917 3308 4 MP stroke
120 223 -293 -87 173 -136 4685 3668 4 MP stroke
-246 -1 113 -135 133 136 5233 3313 4 MP stroke
-59 224 -172 -195 231 -29 4858 3532 4 MP stroke
-205 -41 142 -186 63 227 5152 3731 4 MP stroke
0 -256 228 174 -228 82 5377 2867 4 MP stroke
0 -207 234 47 -234 160 5149 2742 4 MP stroke
-88 -250 228 125 -140 125 5289 2617 4 MP stroke
255 28 0 175 -255 -203 5289 2617 4 MP stroke
-160 -160 216 -67 -56 227 6095 1449 4 MP stroke
0 -224 149 149 -149 75 6255 1162 4 MP stroke
-159 -159 216 -67 -57 226 5936 1290 4 MP stroke
-216 66 0 -199 216 133 5823 1742 4 MP stroke
221 132 -221 44 0 -176 5823 2095 4 MP stroke
0 176 -216 -156 216 -20 5823 2095 4 MP stroke
-33 198 -221 -132 254 -66 5569 2161 4 MP stroke
-225 173 33 -198 192 25 5377 2136 4 MP stroke
-33 197 -212 -170 245 -27 5536 2358 4 MP stroke
195 210 -216 20 21 -230 6018 2305 4 MP stroke
216 156 -216 67 0 -223 6255 1832 4 MP stroke
0 -223 224 223 -224 0 6255 493 4 MP stroke
-167 -167 241 -19 -74 186 5585 493 4 MP stroke
112 223 -223 0 111 -223 5920 716 4 MP stroke
-56 167 -112 -223 168 56 5752 660 4 MP stroke
-223 0 56 -167 167 167 5585 493 4 MP stroke
-93 131 -145 -235 238 104 5659 791 4 MP stroke
-23 179 -167 -112 190 -67 5897 895 4 MP stroke
268 -22 -89 156 -179 -134 6076 1029 4 MP stroke
128 239 -268 22 140 -261 5936 1290 4 MP stroke
179 133 -179 90 0 -223 6255 1162 4 MP stroke
167 112 -111 223 -56 -335 6087 828 4 MP stroke
93 -131 148 112 -241 19 5752 660 4 MP stroke
-168 -56 23 -179 145 235 5752 660 4 MP stroke
-128 270 -148 -112 276 -158 5383 949 4 MP stroke
-42 180 -238 -104 280 -76 5617 971 4 MP stroke
159 159 -223 0 64 -159 5298 652 4 MP stroke
11 -201 179 134 -190 67 6087 828 4 MP stroke
0 -223 168 111 -168 112 6255 716 4 MP stroke
168 -112 56 335 -224 -223 6255 716 4 MP stroke
-223 0 74 -186 149 186 5362 493 4 MP stroke
265 122 -258 214 -7 -336 4923 1242 4 MP stroke
-289 -89 235 -94 54 183 4923 1242 4 MP stroke
62 187 -230 -93 168 -94 4863 1702 4 MP stroke
-229 147 -58 -234 287 87 5212 1331 4 MP stroke
173 136 -234 95 61 -231 5204 1744 4 MP stroke
173 136 -234 95 61 -231 5438 1649 4 MP stroke
-61 231 -173 -136 234 -95 5204 1744 4 MP stroke
-253 185 28 -268 225 83 5377 1880 4 MP stroke
237 -92 7 336 -244 -244 5160 1150 4 MP stroke
-288 -88 234 -95 54 183 4977 1425 4 MP stroke
-122 273 -54 -183 176 -90 4801 1515 4 MP stroke
-176 90 -54 -183 230 93 4801 1515 4 MP stroke
234 22 -276 158 42 -180 5617 971 4 MP stroke
-191 -80 140 -113 51 193 5617 971 4 MP stroke
216 -66 -56 226 -160 -160 6039 1676 4 MP stroke
160 160 -216 67 56 -227 6039 1676 4 MP stroke
170 -53 -140 261 -30 -208 6106 1237 4 MP stroke
116 180 -238 93 122 -273 4801 1515 4 MP stroke
89 -156 191 80 -280 76 5897 895 4 MP stroke
128 -270 85 297 -213 -27 5511 679 4 MP stroke
-64 159 -149 -186 213 27 5298 652 4 MP stroke
-112 207 -159 -159 271 -48 5027 700 4 MP stroke
-271 48 148 -276 123 228 5027 700 4 MP stroke
-111 -207 196 0 -85 207 4916 493 4 MP stroke
176 108 -221 61 45 -169 5675 1526 4 MP stroke
193 47 -45 169 -148 -216 5823 1742 4 MP stroke
204 -10 -45 169 -159 -159 5879 1516 4 MP stroke
-139 -207 225 0 -86 207 4692 493 4 MP stroke
-139 -212 229 -3 -90 215 4519 908 4 MP stroke
258 -214 -88 214 -170 0 4916 906 4 MP stroke
87 -208 106 208 -193 0 4606 700 4 MP stroke
85 -206 140 206 -225 0 4831 700 4 MP stroke
111 -206 85 206 -196 0 5027 700 4 MP stroke
234 22 -111 206 -123 -228 5150 928 4 MP stroke
112 -207 111 207 -223 0 5139 493 4 MP stroke
85 -207 139 207 -224 0 4916 493 4 MP stroke
56 -207 167 207 -223 0 4469 493 4 MP stroke
176 133 -186 158 10 -291 4915 2179 4 MP stroke
-27 -215 248 -7 -221 222 4658 1120 4 MP stroke
95 -232 178 218 -273 14 4386 1781 4 MP stroke
-223 0 86 -207 137 207 4469 493 4 MP stroke
-194 224 -41 -216 235 -8 4243 1566 4 MP stroke
-182 55 -6 -224 188 169 4055 1397 4 MP stroke
192 -219 -35 314 -157 -95 4429 1123 4 MP stroke
-234 -204 189 -36 45 240 3821 1397 4 MP stroke
96 -232 145 217 -241 15 4291 2013 4 MP stroke
-193 -224 221 -44 -28 268 5630 1695 4 MP stroke
56 -226 148 216 -204 10 5879 1516 4 MP stroke
-192 -46 253 -185 -61 231 5438 1649 4 MP stroke
45 -169 192 46 -237 123 5675 1526 4 MP stroke
237 -123 -61 231 -176 -108 5675 1526 4 MP stroke
57 -226 159 159 -216 67 5936 1290 4 MP stroke
268 126 -140 113 -128 -239 5936 1290 4 MP stroke
289 89 -237 92 -52 -181 5212 1331 4 MP stroke
288 88 -235 94 -53 -182 5265 1513 4 MP stroke
53 182 -287 -87 234 -95 5265 1513 4 MP stroke
229 -147 52 181 -281 -34 5441 1184 4 MP stroke
169 -254 58 234 -227 20 5668 1164 4 MP stroke
-58 -235 281 34 -223 201 5383 949 4 MP stroke
-10 -222 244 244 -234 -22 5150 928 4 MP stroke
223 -201 10 222 -233 -21 5383 949 4 MP stroke
233 21 -148 276 -85 -297 5383 949 4 MP stroke
-228 174 0 -256 228 82 5149 2054 4 MP stroke
-56 207 -137 -207 193 0 4413 700 4 MP stroke
-65 218 -167 -207 232 -11 4181 711 4 MP stroke
-223 0 65 -218 158 218 4023 493 4 MP stroke
-227 70 70 -164 157 94 4115 934 4 MP stroke
-106 -208 177 44 -71 164 4413 700 4 MP stroke
200 0 -192 219 -8 -219 4437 1342 4 MP stroke
6 224 -200 0 194 -224 4243 1566 4 MP stroke
41 216 -248 7 207 -223 4478 1558 4 MP stroke
-85 206 -85 -206 170 0 4746 906 4 MP stroke
-87 208 -140 -206 227 -2 4519 908 4 MP stroke
-227 2 88 -214 139 212 4519 908 4 MP stroke
8 219 -229 3 221 -222 4437 1342 4 MP stroke
27 215 -265 -122 238 -93 4685 1335 4 MP stroke
143 215 -235 8 92 -223 4386 1781 4 MP stroke
-130 229 -143 -215 273 -14 4113 1795 4 MP stroke
-148 -236 243 30 -95 206 4533 2017 4 MP stroke
-63 233 -178 -218 241 -15 4050 2028 4 MP stroke
-206 -29 58 -207 148 236 4533 2017 4 MP stroke
-188 214 -5 -223 193 9 3617 925 4 MP stroke
152 220 -193 -8 41 -212 3576 1137 4 MP stroke
-41 212 -199 -236 240 24 3576 1137 4 MP stroke
234 0 -226 236 -8 -236 4055 1397 4 MP stroke
237 227 -305 0 68 -227 4047 1161 4 MP stroke
5 236 -231 0 226 -236 3821 1397 4 MP stroke
8 236 -190 -181 182 -55 4055 1397 4 MP stroke
161 153 -232 11 71 -164 4342 864 4 MP stroke
-66 223 -161 -153 227 -70 4115 934 4 MP stroke
-70 164 -87 -259 157 95 4272 1028 4 MP stroke
193 218 -223 0 30 -218 3993 711 4 MP stroke
243 -22 -96 232 -147 -210 4438 2223 4 MP stroke
-188 35 130 -229 58 194 4055 1601 4 MP stroke
-188 -169 188 -35 0 204 4055 1397 4 MP stroke
-189 36 -58 -194 247 158 3866 1637 4 MP stroke
-247 -158 280 -88 -33 246 3866 1637 4 MP stroke
-188 0 66 -223 122 223 3993 711 4 MP stroke
-158 -218 188 0 -30 218 4023 493 4 MP stroke
-188 0 183 -223 5 223 3805 711 4 MP stroke
240 -203 0 227 -240 -24 3816 1161 4 MP stroke
-229 -8 188 -214 41 222 3576 703 4 MP stroke
231 0 6 227 -237 -227 4047 1161 4 MP stroke
-193 -218 188 0 5 218 3800 493 4 MP stroke
223 210 -224 0 1 -210 3576 703 4 MP stroke
76 206 -228 8 152 -214 3424 917 4 MP stroke
229 8 -224 210 -5 -218 3805 711 4 MP stroke
305 0 -183 223 -122 -223 4115 934 4 MP stroke
224 -210 -1 210 -223 0 3800 493 4 MP stroke
256 51 -289 195 33 -246 3833 1883 4 MP stroke
-280 88 63 -233 217 145 3833 1883 4 MP stroke
-106 208 -96 -221 202 13 2634 908 4 MP stroke
-9 212 -223 -219 232 7 2584 1335 4 MP stroke
-40 219 -250 -38 290 -181 2816 1342 4 MP stroke
-193 -9 -6 -227 199 236 3617 925 4 MP stroke
-87 244 -152 -220 239 -24 3337 1161 4 MP stroke
-239 24 0 -227 239 203 3337 1161 4 MP stroke
234 204 -234 0 0 -204 4055 1601 4 MP stroke
-177 -44 90 -215 87 259 4342 864 4 MP stroke
-68 227 -157 -94 225 -133 4047 1161 4 MP stroke
-225 133 35 -314 190 181 4047 1161 4 MP stroke
228 -8 -5 218 -223 -210 3576 703 4 MP stroke
-41 -222 193 8 -152 214 3576 703 4 MP stroke
-223 0 193 -218 30 218 3130 493 4 MP stroke
122 -223 66 223 -188 0 3160 711 4 MP stroke
5 -218 188 0 -193 218 3353 493 4 MP stroke
-30 -218 188 0 -158 218 3130 493 4 MP stroke
-245 -33 284 -198 -39 231 3576 1364 4 MP stroke
-223 0 158 -218 65 218 2907 493 4 MP stroke
-137 207 -56 -207 193 0 2547 700 4 MP stroke
56 207 -223 0 167 -207 2740 700 4 MP stroke
87 208 -193 0 106 -208 2634 908 4 MP stroke
-140 206 -87 -208 227 2 2407 906 4 MP stroke
-41 215 -222 -215 263 0 2593 1123 4 MP stroke
232 11 -167 207 -65 -218 2972 711 4 MP stroke
96 221 -232 -11 136 -210 2836 921 4 MP stroke
-122 223 -71 -214 193 -9 3038 934 4 MP stroke
-188 0 117 -214 71 214 3160 711 4 MP stroke
-282 -55 256 -169 26 224 2816 1342 4 MP stroke
-263 0 40 -219 223 219 2593 1123 4 MP stroke
-232 -7 228 -216 4 223 2584 1335 4 MP stroke
-40 -237 251 195 -211 42 3537 1595 4 MP stroke
289 -195 40 237 -329 -42 3866 1637 4 MP stroke
39 -231 205 198 -244 33 3576 1364 4 MP stroke
-5 -236 245 33 -240 203 3816 1161 4 MP stroke
-205 -198 211 -42 -6 240 3332 1397 4 MP stroke
-239 -203 244 -33 -5 236 3337 1161 4 MP stroke
5 -236 226 236 -231 0 3337 1161 4 MP stroke
84 207 -223 0 139 -207 2322 700 4 MP stroke
-136 210 -66 -223 202 13 2836 921 4 MP stroke
222 215 -202 -13 -20 -202 2856 1123 4 MP stroke
20 202 -202 -13 182 -189 2856 1123 4 MP stroke
137 -207 86 207 -223 0 2684 493 4 MP stroke
-139 207 -86 -207 225 0 2322 700 4 MP stroke
-112 207 -84 -207 196 0 2126 700 4 MP stroke
-196 0 85 -206 111 206 2126 700 4 MP stroke
-280 -88 217 -145 63 233 3040 1795 4 MP stroke
6 -246 280 88 -286 158 3326 1637 4 MP stroke
257 -51 -6 246 -251 -195 3577 1832 4 MP stroke
29 -199 198 229 -227 -30 3069 1596 4 MP stroke
286 -158 -29 199 -257 -41 3326 1637 4 MP stroke
29 -199 227 30 -256 169 3098 1397 4 MP stroke
6 -240 228 240 -234 0 3332 1397 4 MP stroke
250 38 -182 189 -68 -227 3106 1161 4 MP stroke
234 0 -8 236 -226 -236 3332 1397 4 MP stroke
231 0 -125 236 -106 -236 3337 1161 4 MP stroke
-284 198 -45 -240 329 42 3537 1595 4 MP stroke
125 -236 68 227 -193 9 3231 925 4 MP stroke
87 -244 106 236 -193 8 3424 917 4 MP stroke
193 -8 -117 214 -76 -206 3424 917 4 MP stroke
-28 223 -232 -215 260 -8 2324 1343 4 MP stroke
-260 8 -4 -223 264 215 2324 1343 4 MP stroke
234 203 -234 31 0 -234 2238 2257 4 MP stroke
-86 344 -179 -223 265 -121 2502 1902 4 MP stroke
234 177 -264 121 30 -298 2472 2200 4 MP stroke
-224 63 118 -236 106 173 2609 2076 4 MP stroke
-30 298 -107 -174 137 -124 2472 2200 4 MP stroke
-137 124 -106 -173 243 49 2472 2200 4 MP stroke
179 223 -254 -8 75 -215 2767 1781 4 MP stroke
257 41 -29 199 -228 -240 3326 1637 4 MP stroke
236 108 -322 236 86 -344 2502 1902 4 MP stroke
282 55 -290 181 8 -236 3098 1397 4 MP stroke
241 3 -55 214 -186 -217 2593 1123 4 MP stroke
-227 -2 41 -215 186 217 2407 906 4 MP stroke
-112 -207 271 48 -159 159 2014 493 4 MP stroke
213 10 -149 149 -64 -159 1855 652 4 MP stroke
224 -63 -158 295 -66 -232 2833 2013 4 MP stroke
107 174 -265 121 158 -295 2609 2076 4 MP stroke
243 -4 -118 236 -125 -232 2958 2245 4 MP stroke
125 232 -270 -15 145 -217 2958 2245 4 MP stroke
254 8 -228 216 -26 -224 2842 1566 4 MP stroke
191 32 -149 148 -42 -180 1536 971 4 MP stroke
163 47 -159 160 -4 -207 1540 1178 4 MP stroke
29 -228 245 151 -274 77 2295 1566 4 MP stroke
-306 -57 201 -173 105 230 1646 1408 4 MP stroke
-106 176 -106 -230 212 54 1434 1354 4 MP stroke
-99 190 -105 -230 204 40 1547 1598 4 MP stroke
-88 184 -113 -244 201 60 1346 1538 4 MP stroke
4 213 -204 -40 200 -173 1551 1811 4 MP stroke
-240 -231 228 46 12 185 1764 1823 4 MP stroke
-200 173 -13 -185 213 12 1551 1811 4 MP stroke
-213 -12 -12 -185 225 197 1551 1811 4 MP stroke
142 154 -234 22 92 -176 2145 1082 4 MP stroke
9 -212 232 215 -241 -3 2593 1123 4 MP stroke
170 0 -85 206 -85 -206 2407 906 4 MP stroke
216 -180 0 223 -216 -43 1114 1875 4 MP stroke
192 -44 33 193 -225 -149 1776 2264 4 MP stroke
247 0 -159 238 -88 -238 1864 2502 4 MP stroke
228 -210 0 256 -228 -46 2004 2054 4 MP stroke
-216 180 0 -200 216 20 898 2055 4 MP stroke
-216 -20 216 -203 0 223 898 2055 4 MP stroke
237 1 -237 196 0 -197 1135 2502 4 MP stroke
-192 44 159 -238 33 194 1584 2308 4 MP stroke
-221 156 -33 -193 254 37 1330 2271 4 MP stroke
-254 -37 212 -194 42 231 1330 2271 4 MP stroke
-237 -27 237 -196 0 223 898 2278 4 MP stroke
-212 194 -33 -194 245 0 1372 2502 4 MP stroke
-195 231 -42 -231 237 0 1135 2502 4 MP stroke
-42 230 -212 -193 254 -37 1330 2732 4 MP stroke
228 -85 0 192 -228 -107 2004 2846 4 MP stroke
234 -229 0 207 -234 22 2238 2824 4 MP stroke
304 150 -185 172 -119 -322 2238 2824 4 MP stroke
-266 -29 169 -324 97 353 2375 2502 4 MP stroke
-234 229 -97 -195 331 -34 2004 3053 4 MP stroke
-137 164 -58 -295 195 131 2335 3019 4 MP stroke
-234 -31 137 -164 97 195 2238 2824 4 MP stroke
-137 165 -58 -295 195 130 2198 3184 4 MP stroke
-84 260 -194 -131 278 -129 1920 3313 4 MP stroke
74 -323 87 208 -161 115 2426 3560 4 MP stroke
-195 -131 162 -115 33 246 2393 3314 4 MP stroke
-197 -151 161 -115 36 266 2229 3409 4 MP stroke
-195 -130 164 -95 31 225 2198 3184 4 MP stroke
-165 94 -36 -266 201 172 2064 3503 4 MP stroke
58 295 -237 -72 179 -223 2588 3445 4 MP stroke
149 -149 -19 242 -130 -93 1196 1088 4 MP stroke
160 -159 21 202 -181 -43 1377 1131 4 MP stroke
-159 159 -129 -248 288 89 1058 1449 4 MP stroke
159 -160 32 192 -191 -32 1536 971 4 MP stroke
149 -149 -37 260 -112 -111 1345 939 4 MP stroke
-21 -202 170 53 -149 149 1196 1088 4 MP stroke
-237 0 42 -230 195 230 1135 2502 4 MP stroke
-195 34 195 -231 0 197 1135 2305 4 MP stroke
0 -176 195 -34 -195 210 1330 2095 4 MP stroke
-21 -230 237 27 -216 203 1114 2075 4 MP stroke
-237 -197 237 -27 0 224 898 2501 4 MP stroke
-234 4 119 -245 115 241 2004 2261 4 MP stroke
-198 -229 273 14 -75 215 2842 1566 4 MP stroke
0 234 -234 -177 234 -57 2238 2257 4 MP stroke
0 207 -234 -203 234 -4 2004 2261 4 MP stroke
-228 210 0 -207 228 -3 1776 2264 4 MP stroke
-228 3 140 -241 88 238 1776 2264 4 MP stroke
-97 302 -169 -331 266 29 2375 2502 4 MP stroke
-119 245 -137 -245 256 0 2119 2502 4 MP stroke
-256 0 137 -322 119 322 2119 2502 4 MP stroke
-97 -353 234 31 -137 322 2375 2502 4 MP stroke
70 172 -255 0 185 -172 1934 2674 4 MP stroke
-273 -14 207 -218 66 232 2767 1781 4 MP stroke
216 156 -216 43 0 -199 1114 3327 4 MP stroke
216 -67 -56 227 -160 -160 1274 3487 4 MP stroke
217 -64 -57 226 -160 -162 1434 3649 4 MP stroke
160 159 -217 64 57 -223 1377 3872 4 MP stroke
161 159 -220 64 59 -223 1595 3808 4 MP stroke
56 -226 160 160 -216 66 1330 3261 4 MP stroke
0 -304 221 108 -221 196 1551 2888 4 MP stroke
-216 -133 216 -66 0 199 1114 3128 4 MP stroke
-195 -210 216 -20 -21 230 1135 2698 4 MP stroke
-216 -180 216 -43 0 223 898 2948 4 MP stroke
237 72 -303 160 66 -232 2767 3222 4 MP stroke
-243 75 -118 -210 361 135 2472 2855 4 MP stroke
-10 232 -209 -204 219 -28 3035 3634 4 MP stroke
-203 35 10 -232 193 197 2842 3437 4 MP stroke
-219 27 179 -246 40 219 2816 3661 4 MP stroke
239 -14 -66 232 -173 -218 3006 3208 4 MP stroke
194 131 -331 34 137 -165 2198 3184 4 MP stroke
303 -160 58 295 -361 -135 2833 2990 4 MP stroke
243 -75 -169 324 -74 -249 2715 2780 4 MP stroke
125 -232 118 210 -243 22 2958 2758 4 MP stroke
243 -22 -192 278 -51 -256 2958 2758 4 MP stroke
237 197 -237 -1 0 -196 1135 2698 4 MP stroke
0 223 -216 -203 216 -20 898 2948 4 MP stroke
195 34 0 196 -195 -230 1330 2732 4 MP stroke
-63 -233 270 15 -207 218 3040 1795 4 MP stroke
169 331 -243 -49 74 -282 2641 2531 4 MP stroke
-234 57 97 -302 137 245 2238 2257 4 MP stroke
74 249 -266 29 192 -278 2715 2780 4 MP stroke
192 253 -243 4 51 -257 2907 2502 4 MP stroke
-70 -172 228 107 -158 65 1934 2674 4 MP stroke
234 -22 70 172 -304 -150 2238 2824 4 MP stroke
-70 -172 158 -65 -88 237 1864 2502 4 MP stroke
-115 -241 255 0 -140 241 2004 2261 4 MP stroke
-247 0 88 -237 159 237 1617 2502 4 MP stroke
-221 -20 221 -156 0 176 1330 2095 4 MP stroke
0 -304 221 196 -221 108 1551 1811 4 MP stroke
-216 -20 195 -210 21 230 1114 2075 4 MP stroke
-192 -44 225 -149 -33 193 1584 2695 4 MP stroke
-245 0 33 -193 212 193 1372 2502 4 MP stroke
-254 37 33 -193 221 156 1330 2732 4 MP stroke
216 -44 0 200 -216 -156 1330 3084 4 MP stroke
221 -69 0 177 -221 -108 1551 3192 4 MP stroke
195 210 -195 -34 0 -176 1330 2908 4 MP stroke
221 -196 0 176 -221 20 1551 2888 4 MP stroke
221 -20 0 176 -221 -156 1551 2888 4 MP stroke
-237 27 21 -230 216 203 898 2725 4 MP stroke
-216 20 0 -200 216 180 898 2948 4 MP stroke
-33 193 -159 -237 192 44 1584 2695 4 MP stroke
-216 20 0 -176 216 156 1114 2928 4 MP stroke
-228 85 0 -207 228 122 1776 2931 4 MP stroke
0 304 -225 -235 225 -69 1551 3192 4 MP stroke
218 -65 -56 226 -162 -161 1492 3422 4 MP stroke
0 223 -216 -156 216 -67 898 3394 4 MP stroke
224 -223 0 223 -224 0 1122 493 4 MP stroke
168 56 -149 148 -19 -204 1066 995 4 MP stroke
149 75 -224 223 75 -298 1047 791 4 MP stroke
-149 149 -37 -186 186 37 1047 791 4 MP stroke
0 223 -149 -75 149 -148 898 939 4 MP stroke
19 204 -186 -37 167 -167 1066 995 4 MP stroke
205 18 -149 149 -56 -167 1401 660 4 MP stroke
74 149 -223 0 149 -149 1196 642 4 MP stroke
56 167 -223 0 167 -167 1401 660 4 MP stroke
-261 37 149 -148 112 111 1233 828 4 MP stroke
-74 -149 149 -149 -75 298 1122 493 4 MP stroke
-167 167 37 -260 130 93 1066 995 4 MP stroke
0 223 -168 -56 168 -167 898 1162 4 MP stroke
-149 -75 149 -149 0 224 898 1162 4 MP stroke
216 67 -160 160 -56 -227 1114 1676 4 MP stroke
-216 133 0 -177 216 44 1114 1875 4 MP stroke
19 -242 149 75 -168 167 1066 995 4 MP stroke
28 -229 147 203 -175 26 2266 1794 4 MP stroke
264 -121 -28 229 -236 -108 2502 1902 4 MP stroke
-201 68 -7 -211 208 143 1944 1150 4 MP stroke
-197 170 -58 -271 255 101 1540 1178 4 MP stroke
8 315 -208 -143 200 -172 1952 1465 4 MP stroke
69 178 -343 -101 274 -77 2021 1643 4 MP stroke
207 38 -92 176 -115 -214 2352 1120 4 MP stroke
99 -190 113 244 -212 -54 1646 1408 4 MP stroke
-160 159 -57 -223 217 64 1217 1290 4 MP stroke
-217 144 -4 -213 221 69 1330 1742 4 MP stroke
-201 -60 217 -144 -16 204 1346 1538 4 MP stroke
-217 -64 88 -184 129 248 1217 1290 4 MP stroke
-232 138 16 -204 216 66 1114 1676 4 MP stroke
-216 -66 216 -133 0 199 1114 1676 4 MP stroke
-147 -203 234 -31 -87 234 2091 1820 4 MP stroke
0 304 -225 -197 225 -107 1551 2115 4 MP stroke
-225 107 0 -256 225 149 1551 2115 4 MP stroke
261 -37 -168 168 -93 -131 1494 791 4 MP stroke
160 -159 42 180 -202 -21 1696 812 4 MP stroke
148 -149 93 131 -241 18 1642 642 4 MP stroke
160 63 -149 149 -11 -212 1058 1449 4 MP stroke
-293 8 322 -236 -29 228 2295 1566 4 MP stroke
-264 -215 293 -8 -29 223 2324 1343 4 MP stroke
29 -223 143 273 -172 -50 2324 1343 4 MP stroke
-207 -38 200 -173 7 211 2145 1082 4 MP stroke
257 -180 13 185 -270 -5 2021 1643 4 MP stroke
175 -26 70 177 -245 -151 2266 1794 4 MP stroke
-69 -178 270 5 -201 173 1952 1465 4 MP stroke
-143 -273 343 101 -200 172 2152 1293 4 MP stroke
28 -223 172 50 -200 173 2352 1120 4 MP stroke
201 -68 -59 222 -142 -154 2145 1082 4 MP stroke
207 142 -266 80 59 -222 1944 1150 4 MP stroke
-257 180 -70 -177 327 -3 1764 1823 4 MP stroke
-327 3 87 -234 240 231 1764 1823 4 MP stroke
37 186 -205 -18 168 -168 1233 828 4 MP stroke
181 43 -149 149 -32 -192 1377 1131 4 MP stroke
57 223 -163 -47 106 -176 1434 1354 4 MP stroke
64 159 -223 0 159 -159 1855 652 4 MP stroke
54 170 -213 -10 159 -160 1696 812 4 MP stroke
-148 149 -54 -170 202 21 1494 791 4 MP stroke
58 271 -207 -142 149 -129 1795 1279 4 MP stroke
306 57 -149 129 -157 -186 1952 1465 4 MP stroke
157 186 -149 129 -8 -315 1952 1465 4 MP stroke
-111 -206 234 -22 -123 228 2126 700 4 MP stroke
-41 -196 201 37 -160 159 1696 812 4 MP stroke
112 207 -224 0 112 -207 2126 700 4 MP stroke
-159 160 -148 -276 307 116 1696 812 4 MP stroke
85 206 -225 0 140 -206 2407 906 4 MP stroke
74 149 -223 0 149 -149 1642 642 4 MP stroke
-167 167 -74 -149 241 -18 1401 660 4 MP stroke
-170 0 55 -214 115 214 2237 906 4 MP stroke
-271 -48 123 -228 148 276 1855 652 4 MP stroke
197 -170 4 207 -201 -37 1737 1008 4 MP stroke
106 230 -255 -101 149 -129 1646 1408 4 MP stroke
266 -80 41 196 -307 -116 2003 928 4 MP stroke
-216 156 0 -199 216 43 898 1832 4 MP stroke
-216 156 0 -176 216 20 1114 2075 4 MP stroke
216 -156 0 200 -216 -44 1330 1919 4 MP stroke
221 20 0 176 -221 -196 1551 2115 4 MP stroke
221 -108 0 177 -221 -69 1551 1811 4 MP stroke
-288 -89 232 -138 56 227 1058 1449 4 MP stroke
-170 -53 159 -159 11 212 1047 1237 4 MP stroke
-160 -63 160 -160 0 223 898 1386 4 MP stroke
-216 -67 216 -156 0 223 898 1609 4 MP stroke
-224 223 0 -223 224 0 6031 4510 4 MP stroke
-149 -75 298 -74 -149 149 6106 4212 4 MP stroke
30 238 -179 -90 149 -148 6106 4212 4 MP stroke
-74 -149 223 0 -149 149 5957 4361 4 MP stroke
191 32 -159 160 -32 -192 5808 4064 4 MP stroke
261 -37 -149 148 -112 -111 5920 4175 4 MP stroke
205 18 -168 168 -37 -186 5957 4361 4 MP stroke
56 167 -205 -18 149 -149 5808 4510 4 MP stroke
74 149 -298 74 224 -223 6031 4510 4 MP stroke
186 37 -156 201 -30 -238 6106 4212 4 MP stroke
268 -90 32 192 -300 -102 6076 3974 4 MP stroke
0 -223 179 90 -179 133 6255 3841 4 MP stroke
30 -208 140 261 -170 -53 6106 3766 4 MP stroke
0 -224 149 75 -149 149 6255 3617 4 MP stroke
-11 -212 170 53 -159 159 6095 3554 4 MP stroke
0 -223 160 63 -160 160 6255 3394 4 MP stroke
-140 -261 300 102 -160 159 5936 3713 4 MP stroke
-56 -227 216 67 -160 160 6039 3327 4 MP stroke
201 -201 -1 288 -200 -87 5879 3487 4 MP stroke
159 -159 57 226 -216 -67 6095 3554 4 MP stroke
183 41 -183 136 0 -177 5823 3261 4 MP stroke
223 0 -167 167 -56 -167 5808 4510 4 MP stroke
-30 208 -149 -75 179 -133 6076 3974 4 MP stroke
-93 -131 241 -18 -148 149 5659 4212 4 MP stroke
-183 -41 144 -139 39 180 5640 3220 4 MP stroke
-225 83 -38 -180 263 97 5377 3123 4 MP stroke
-161 94 -39 -180 200 86 5479 3314 4 MP stroke
107 -141 63 228 -170 -87 5259 3590 4 MP stroke
205 41 -107 141 -98 -182 5357 3772 4 MP stroke
107 -141 26 277 -133 -136 5366 3449 4 MP stroke
-20 -271 133 136 -113 135 5479 3314 4 MP stroke
-26 -277 170 87 -144 190 5233 3313 4 MP stroke
-344 6 144 -190 200 184 5033 3129 4 MP stroke
-200 -184 316 5 -116 179 5033 3129 4 MP stroke
-144 139 -56 -226 200 87 5679 3400 4 MP stroke
20 271 -200 -86 180 -185 5499 3585 4 MP stroke
-180 185 1 -288 179 103 5499 3585 4 MP stroke
42 180 -191 -32 149 -148 5659 4212 4 MP stroke
11 212 -160 -63 149 -149 6106 3766 4 MP stroke
-55 214 -115 -214 170 0 4746 4097 4 MP stroke
87 208 -227 -2 140 -206 4606 4303 4 MP stroke
53 206 -170 0 117 -206 4799 4303 4 MP stroke
223 0 -111 207 -112 -207 5139 4510 4 MP stroke
228 0 -117 206 -111 -206 5027 4303 4 MP stroke
160 -160 56 226 -216 -66 6039 3327 4 MP stroke
160 -160 56 227 -216 -67 6255 3394 4 MP stroke
0 -199 216 66 -216 133 6039 3128 4 MP stroke
0 -223 216 43 -216 180 6255 2948 4 MP stroke
-216 -44 216 -133 0 177 5823 3084 4 MP stroke
0 -200 216 44 -216 156 6039 2928 4 MP stroke
0 -176 221 44 -221 132 5823 2908 4 MP stroke
125 -212 123 219 -248 -7 4685 3668 4 MP stroke
-216 156 0 -223 216 67 6039 3327 4 MP stroke
0 223 -224 -223 224 0 898 4510 4 MP stroke
-201 45 89 -268 112 223 1233 4287 4 MP stroke
111 -223 56 335 -167 -112 1233 4287 4 MP stroke
223 0 -111 223 -112 -223 1345 4510 4 MP stroke
190 -67 -11 201 -179 -134 1256 4108 4 MP stroke
201 -45 -23 179 -178 -134 1434 4242 4 MP stroke
178 134 -280 76 102 -210 1434 4242 4 MP stroke
223 0 -89 268 -134 -268 1568 4510 4 MP stroke
0 223 -168 -111 168 -112 898 4287 4 MP stroke
-55 -214 170 0 -115 214 2352 3883 4 MP stroke
309 96 -278 129 -31 -225 2229 3409 4 MP stroke
197 151 -164 95 -33 -246 2426 3560 4 MP stroke
195 131 -137 164 -58 -295 2588 3445 4 MP stroke
84 -260 144 190 -228 70 2004 3053 4 MP stroke
-54 170 -159 -160 213 -10 1642 4361 4 MP stroke
-262 51 54 -170 208 119 1434 4242 4 MP stroke
-74 149 -149 -149 223 0 1568 4510 4 MP stroke
-64 159 -159 -159 223 0 1791 4510 4 MP stroke
168 111 -179 90 11 -201 1066 4175 4 MP stroke
224 223 -168 112 -56 -335 1122 4510 4 MP stroke
167 112 -190 67 23 -179 1233 4287 4 MP stroke
-228 0 116 -207 112 207 2126 4303 4 MP stroke
280 -76 -121 236 -159 -160 1536 4032 4 MP stroke
-120 246 -87 -208 207 -38 2145 3921 4 MP stroke
-201 -172 264 -56 -63 228 2064 3503 4 MP stroke
-207 37 179 -223 28 186 1938 3958 4 MP stroke
112 -207 159 159 -271 48 2126 4303 4 MP stroke
224 0 -112 207 -112 -207 2238 4510 4 MP stroke
271 -47 -179 223 -92 -176 2237 4097 4 MP stroke
186 -217 55 214 -241 3 2593 3880 4 MP stroke
111 -207 159 160 -270 47 1966 4144 4 MP stroke
115 -214 92 176 -207 38 2352 3883 4 MP stroke
59 -224 159 160 -218 64 1595 3808 4 MP stroke
201 -36 -59 223 -142 -187 1796 3772 4 MP stroke
207 -37 -63 227 -144 -190 2145 3921 4 MP stroke
63 -228 142 187 -205 41 1859 3544 4 MP stroke
63 -228 142 187 -205 41 2064 3503 4 MP stroke
205 -41 -61 231 -144 -190 2064 3503 4 MP stroke
164 162 -225 69 61 -231 1715 3354 4 MP stroke
-61 231 -144 -190 205 -41 1654 3585 4 MP stroke
-223 68 61 -231 162 163 1492 3422 4 MP stroke
-142 -186 201 -37 -59 223 1796 3772 4 MP stroke
-142 -187 205 -41 -63 228 1859 3544 4 MP stroke
-201 36 59 -223 142 187 1595 3808 4 MP stroke
144 190 -309 -96 165 -94 2064 3503 4 MP stroke
218 -64 -57 223 -161 -159 1595 3808 4 MP stroke
-160 -159 271 -48 -111 207 1966 4144 4 MP stroke
111 -206 160 159 -271 47 2237 4097 4 MP stroke
-28 -186 229 149 -201 37 1938 3958 4 MP stroke
-102 210 -160 -159 262 -51 1434 4242 4 MP stroke
-208 -119 74 -149 134 268 1434 4242 4 MP stroke
-228 -122 228 -70 0 192 1776 2931 4 MP stroke
-225 149 0 -192 225 43 1551 2888 4 MP stroke
-225 -43 0 -192 225 235 1551 2888 4 MP stroke
0 -177 216 133 -216 44 1330 3084 4 MP stroke
0 223 -160 -160 160 -63 898 3617 4 MP stroke
-30 -208 179 133 -149 75 1047 3766 4 MP stroke
-159 -159 170 -53 -11 212 1058 3554 4 MP stroke
11 -212 149 149 -160 63 1058 3554 4 MP stroke
140 -261 30 208 -170 53 1217 3713 4 MP stroke
64 -159 149 149 -213 10 1855 4351 4 MP stroke
121 -236 179 134 -300 102 1377 3872 4 MP stroke
300 -102 -140 261 -160 -159 1377 3872 4 MP stroke
201 -37 -59 224 -142 -187 1737 3995 4 MP stroke
160 159 -201 37 41 -196 1696 4191 4 MP stroke
142 186 -205 41 63 -227 1938 3958 4 MP stroke
162 161 -221 69 59 -230 1492 3422 4 MP stroke
160 162 -218 65 58 -227 1434 3649 4 MP stroke
-205 41 61 -231 144 190 1715 3354 4 MP stroke
149 -75 0 224 -149 -149 1047 3766 4 MP stroke
57 -226 159 159 -216 67 1274 3487 4 MP stroke
56 -227 160 160 -216 67 1114 3327 4 MP stroke
-179 -133 179 -90 0 223 898 3841 4 MP stroke
270 -47 -41 196 -229 -149 1966 4144 4 MP stroke
144 190 -264 56 120 -246 2145 3921 4 MP stroke
232 -215 -74 323 -158 -108 2584 3668 4 MP stroke
158 108 -162 115 4 -223 2584 3668 4 MP stroke
223 -68 -59 230 -164 -162 1715 3354 4 MP stroke
-58 227 -162 -163 220 -64 1434 3649 4 MP stroke
205 -41 -61 231 -144 -190 1920 3313 4 MP stroke
-111 206 -117 -206 228 0 2126 4303 4 MP stroke
-137 -207 223 0 -86 207 2547 4303 4 MP stroke
-150 -197 237 -11 -87 208 2634 4095 4 MP stroke
-193 0 86 -207 107 207 2354 4303 4 MP stroke
-170 0 53 -206 117 206 2237 4097 4 MP stroke
-116 207 -107 -207 223 0 2238 4510 4 MP stroke
-74 282 -192 -253 266 -29 2641 2531 4 MP stroke
-237 11 100 -218 137 207 2547 4303 4 MP stroke
-125 232 -145 -217 270 -15 2833 2990 4 MP stroke
241 -3 -232 215 -9 -212 2593 3880 4 MP stroke
227 -2 -186 217 -41 -215 2634 4095 4 MP stroke
-53 206 -140 -206 193 0 2354 4303 4 MP stroke
-304 0 218 -223 86 223 2886 4069 4 MP stroke
-222 215 -30 -189 252 -26 2634 4095 4 MP stroke
-102 223 -86 -223 188 0 2784 4292 4 MP stroke
-179 246 -71 -208 250 -38 2856 3880 4 MP stroke
41 215 -263 0 222 -215 2634 4095 4 MP stroke
-252 26 102 -223 150 197 2634 4095 4 MP stroke
65 -218 123 218 -188 0 2972 4292 4 MP stroke
164 -229 75 215 -239 14 3006 3208 4 MP stroke
73 -246 241 158 -314 88 3320 3120 4 MP stroke
97 -233 173 218 -270 15 3103 2975 4 MP stroke
188 0 -218 223 30 -223 3160 4292 4 MP stroke
223 0 -30 218 -193 -218 3353 4510 4 MP stroke
5 218 -228 -8 223 -210 3353 4510 4 MP stroke
-195 -131 137 -164 58 295 2335 3019 4 MP stroke
-84 -227 304 0 -220 227 3106 3842 4 MP stroke
-227 2 87 -208 140 206 2407 4097 4 MP stroke
-100 218 -123 -218 223 0 2684 4510 4 MP stroke
-223 219 -40 -219 263 0 2593 3880 4 MP stroke
223 0 -65 218 -158 -218 3130 4510 4 MP stroke
228 216 -254 8 26 -224 2816 3661 4 MP stroke
9 212 -232 7 223 -219 2593 3880 4 MP stroke
71 208 -219 28 148 -236 3106 3842 4 MP stroke
30 189 -250 38 220 -227 2886 4069 4 MP stroke
158 218 -188 0 30 -218 3130 4510 4 MP stroke
193 9 -271 203 78 -212 3383 4078 4 MP stroke
7 240 -207 -257 200 17 3254 3606 4 MP stroke
-193 -8 0 -214 193 222 3383 4078 4 MP stroke
-30 223 -158 -223 188 0 3160 4292 4 MP stroke
-188 0 -5 -218 193 218 3160 4292 4 MP stroke
207 257 -290 -42 83 -215 3454 3623 4 MP stroke
223 0 -223 210 0 -210 3576 4510 4 MP stroke
290 42 -73 246 -217 -288 3537 3408 4 MP stroke
224 0 -189 210 -35 -210 3800 4510 4 MP stroke
-159 125 41 -328 118 203 3692 3866 4 MP stroke
189 214 -234 17 45 -231 3765 4300 4 MP stroke
0 214 -189 -214 189 0 3576 4300 4 MP stroke
-193 -222 228 8 -35 214 3383 4078 4 MP stroke
-115 -220 193 8 -78 212 3461 3866 4 MP stroke
-193 -9 35 -214 158 223 3190 4069 4 MP stroke
0 210 -189 0 189 -210 3576 4510 4 MP stroke
35 210 -228 8 193 -218 3800 4510 4 MP stroke
210 1 -237 227 27 -228 4020 4070 4 MP stroke
183 223 -210 -1 27 -222 3993 4292 4 MP stroke
-27 222 -161 -222 188 0 3993 4292 4 MP stroke
36 w
/c8 { 0.500000 0.000000 0.000000 sr} bdef
c8
224 0 898 4510 2 MP stroke
/c9 { 0.000000 0.687500 1.000000 sr} bdef
c9
0 -223 6255 4510 2 MP stroke
/c10 { 1.000000 0.625000 0.000000 sr} bdef
c10
-224 0 6255 493 2 MP stroke
/c11 { 1.000000 0.062500 0.000000 sr} bdef
c11
0 223 898 493 2 MP stroke
/c12 { 0.812500 1.000000 0.187500 sr} bdef
c12
51 257 4195 2245 2 MP stroke
/c13 { 0.000000 0.000000 0.562500 sr} bdef
c13
257 -51 3320 1883 2 MP stroke
/c14 { 0.000000 0.125000 1.000000 sr} bdef
c14
-51 -256 2958 2758 2 MP stroke
/c15 { 0.250000 1.000000 0.750000 sr} bdef
c15
-256 51 3833 3120 2 MP stroke
gr

36 w
c15
0 sg
%%IncludeResource: font Helvetica
/Helvetica /ISOLatin1Encoding 120 FMSR

 881 4657 mt 
( ) s
6239  431 mt 
( ) s
gs 898 389 5358 4226 rc
c8
224 0 898 4510 2 MP stroke
223 0 1122 4510 2 MP stroke
223 0 1345 4510 2 MP stroke
223 0 1568 4510 2 MP stroke
223 0 1791 4510 2 MP stroke
224 0 2014 4510 2 MP stroke
223 0 2238 4510 2 MP stroke
223 0 2461 4510 2 MP stroke
223 0 2684 4510 2 MP stroke
223 0 2907 4510 2 MP stroke
223 0 3130 4510 2 MP stroke
223 0 3353 4510 2 MP stroke
224 0 3576 4510 2 MP stroke
223 0 3800 4510 2 MP stroke
223 0 4023 4510 2 MP stroke
223 0 4246 4510 2 MP stroke
223 0 4469 4510 2 MP stroke
224 0 4692 4510 2 MP stroke
223 0 4916 4510 2 MP stroke
223 0 5139 4510 2 MP stroke
223 0 5362 4510 2 MP stroke
223 0 5585 4510 2 MP stroke
223 0 5808 4510 2 MP stroke
224 0 6031 4510 2 MP stroke
c9
0 -223 6255 4510 2 MP stroke
0 -223 6255 4287 2 MP stroke
0 -223 6255 4064 2 MP stroke
0 -224 6255 3841 2 MP stroke
0 -223 6255 3617 2 MP stroke
0 -223 6255 3394 2 MP stroke
0 -223 6255 3171 2 MP stroke
0 -223 6255 2948 2 MP stroke
0 -223 6255 2725 2 MP stroke
0 -224 6255 2502 2 MP stroke
0 -223 6255 2278 2 MP stroke
0 -223 6255 2055 2 MP stroke
0 -223 6255 1832 2 MP stroke
0 -223 6255 1609 2 MP stroke
0 -224 6255 1386 2 MP stroke
0 -223 6255 1162 2 MP stroke
0 -223 6255 939 2 MP stroke
0 -223 6255 716 2 MP stroke
c10
-224 0 6255 493 2 MP stroke
-223 0 6031 493 2 MP stroke
-223 0 5808 493 2 MP stroke
-223 0 5585 493 2 MP stroke
-223 0 5362 493 2 MP stroke
-223 0 5139 493 2 MP stroke
-224 0 4916 493 2 MP stroke
-223 0 4692 493 2 MP stroke
-223 0 4469 493 2 MP stroke
-223 0 4246 493 2 MP stroke
-223 0 4023 493 2 MP stroke
-223 0 3800 493 2 MP stroke
-224 0 3577 493 2 MP stroke
-223 0 3353 493 2 MP stroke
-223 0 3130 493 2 MP stroke
-223 0 2907 493 2 MP stroke
-223 0 2684 493 2 MP stroke
-223 0 2461 493 2 MP stroke
-224 0 2238 493 2 MP stroke
-223 0 2014 493 2 MP stroke
-223 0 1791 493 2 MP stroke
-223 0 1568 493 2 MP stroke
-223 0 1345 493 2 MP stroke
-224 0 1122 493 2 MP stroke
c11
0 223 898 493 2 MP stroke
0 223 898 716 2 MP stroke
0 223 898 939 2 MP stroke
0 224 898 1162 2 MP stroke
0 223 898 1386 2 MP stroke
0 223 898 1609 2 MP stroke
0 223 898 1832 2 MP stroke
0 223 898 2055 2 MP stroke
0 223 898 2278 2 MP stroke
0 224 898 2501 2 MP stroke
0 223 898 2725 2 MP stroke
0 223 898 2948 2 MP stroke
0 223 898 3171 2 MP stroke
0 223 898 3394 2 MP stroke
0 224 898 3617 2 MP stroke
0 223 898 3841 2 MP stroke
0 223 898 4064 2 MP stroke
0 223 898 4287 2 MP stroke
c12
51 257 4195 2245 2 MP stroke
145 217 4050 2028 2 MP stroke
217 145 3833 1883 2 MP stroke
256 51 3577 1832 2 MP stroke
c13
257 -51 3320 1883 2 MP stroke
217 -145 3103 2028 2 MP stroke
145 -217 2958 2245 2 MP stroke
51 -257 2907 2502 2 MP stroke
c14
-51 -256 2958 2758 2 MP stroke
-145 -217 3103 2975 2 MP stroke
-217 -145 3320 3120 2 MP stroke
-257 -51 3577 3171 2 MP stroke
c15
-256 51 3833 3120 2 MP stroke
-217 145 4050 2975 2 MP stroke
-145 217 4195 2758 2 MP stroke
-51 256 4246 2502 2 MP stroke
6 w
gr

6 w
c15
1 sg
0 1722 737 0 0 -1722 5458 2171 4 MP
PP
-737 0 0 1722 737 0 0 -1722 5458 2171 5 MP stroke
4 w
DO
SO
6 w
0 sg
5458 2171 mt 6195 2171 L
5458  449 mt 6195  449 L
5458 2171 mt 5458  449 L
6195 2171 mt 6195  449 L
5458 2171 mt 6195 2171 L
5458 2171 mt 5458  449 L
5458 2171 mt 6195 2171 L
5458  449 mt 6195  449 L
5458 2171 mt 5458  449 L
6195 2171 mt 6195  449 L
%%IncludeResource: font Symbol
/Symbol /ISOLatin1Encoding 120 FMSR

5905  562 mt 
(G) s
%%IncludeResource: font Helvetica
/Helvetica /ISOLatin1Encoding 96 FMSR

5977  622 mt 
(1) s
gs 5458 449 738 1723 rc
36 w
c8
343 0 5526 573 2 MP stroke
gr

36 w
c8
0 sg
%%IncludeResource: font Symbol
/Symbol /ISOLatin1Encoding 120 FMSR

5905  772 mt 
(G) s
%%IncludeResource: font Helvetica
/Helvetica /ISOLatin1Encoding 96 FMSR

5977  832 mt 
(2) s
gs 5458 449 738 1723 rc
c9
343 0 5526 784 2 MP stroke
gr

c9
0 sg
%%IncludeResource: font Symbol
/Symbol /ISOLatin1Encoding 120 FMSR

5905  983 mt 
(G) s
%%IncludeResource: font Helvetica
/Helvetica /ISOLatin1Encoding 96 FMSR

5977 1043 mt 
(3) s
gs 5458 449 738 1723 rc
c10
343 0 5526 994 2 MP stroke
gr

c10
0 sg
%%IncludeResource: font Symbol
/Symbol /ISOLatin1Encoding 120 FMSR

5905 1193 mt 
(G) s
%%IncludeResource: font Helvetica
/Helvetica /ISOLatin1Encoding 96 FMSR

5977 1253 mt 
(4) s
gs 5458 449 738 1723 rc
c11
343 0 5526 1204 2 MP stroke
gr

c11
0 sg
%%IncludeResource: font Symbol
/Symbol /ISOLatin1Encoding 120 FMSR

5905 1404 mt 
(G) s
%%IncludeResource: font Helvetica
/Helvetica /ISOLatin1Encoding 96 FMSR

5977 1464 mt 
(100) s
gs 5458 449 738 1723 rc
c12
343 0 5526 1415 2 MP stroke
gr

c12
0 sg
%%IncludeResource: font Symbol
/Symbol /ISOLatin1Encoding 120 FMSR

5905 1614 mt 
(G) s
%%IncludeResource: font Helvetica
/Helvetica /ISOLatin1Encoding 96 FMSR

5977 1674 mt 
(101) s
gs 5458 449 738 1723 rc
c13
343 0 5526 1625 2 MP stroke
gr

c13
0 sg
%%IncludeResource: font Symbol
/Symbol /ISOLatin1Encoding 120 FMSR

5905 1825 mt 
(G) s
%%IncludeResource: font Helvetica
/Helvetica /ISOLatin1Encoding 96 FMSR

5977 1885 mt 
(102) s
gs 5458 449 738 1723 rc
c14
343 0 5526 1835 2 MP stroke
gr

c14
0 sg
%%IncludeResource: font Symbol
/Symbol /ISOLatin1Encoding 120 FMSR

5905 2035 mt 
(G) s
%%IncludeResource: font Helvetica
/Helvetica /ISOLatin1Encoding 96 FMSR

5977 2095 mt 
(103) s
gs 5458 449 738 1723 rc
c15
343 0 5526 2046 2 MP stroke
6 w
gr

6 w
c15

end %%Color Dict

eplot
%%EndObject

epage
end

showpage

%%Trailer
%%EOF
