{
  "version": "0.0.1",
  "url" : "https://...",
  "header":{
    "title": "Home",
    "filename": "header.md"
  },
  "order":[
    "GetSurvey",
    "GetSurveys",
    "GetAnsweredSurveys",
    "GetInvitedSurveys",
    "GetSurveysFeed",
    "PostSurvey",
    "PutSurvey",
    "DeleteSurvey",
    "GetLang",
    "GetUser"
  ],
  "template" : {
    "forceLanguage": "en"
  }
}