%!PS-Adobe-2.0 EPSF-2.0
%%Title: transfo.ps
%%Creator: fig2dev Version 3.2 Patchlevel 1
%%CreationDate: Thu Sep 18 11:36:14 2003
%%For: pair@ossau (P.Mathieu Pair)
%%Orientation: Portrait
%%BoundingBox: 0 0 434 339
%%Pages: 0
%%BeginSetup
%%EndSetup
%%Magnification: 1.0000
%%EndComments
/$F2psDict 200 dict def
$F2psDict begin
$F2psDict /mtrx matrix put
/col-1 {0 setgray} bind def
/col0 {0.000 0.000 0.000 srgb} bind def
/col1 {0.000 0.000 1.000 srgb} bind def
/col2 {0.000 1.000 0.000 srgb} bind def
/col3 {0.000 1.000 1.000 srgb} bind def
/col4 {1.000 0.000 0.000 srgb} bind def
/col5 {1.000 0.000 1.000 srgb} bind def
/col6 {1.000 1.000 0.000 srgb} bind def
/col7 {1.000 1.000 1.000 srgb} bind def
/col8 {0.000 0.000 0.560 srgb} bind def
/col9 {0.000 0.000 0.690 srgb} bind def
/col10 {0.000 0.000 0.820 srgb} bind def
/col11 {0.530 0.810 1.000 srgb} bind def
/col12 {0.000 0.560 0.000 srgb} bind def
/col13 {0.000 0.690 0.000 srgb} bind def
/col14 {0.000 0.820 0.000 srgb} bind def
/col15 {0.000 0.560 0.560 srgb} bind def
/col16 {0.000 0.690 0.690 srgb} bind def
/col17 {0.000 0.820 0.820 srgb} bind def
/col18 {0.560 0.000 0.000 srgb} bind def
/col19 {0.690 0.000 0.000 srgb} bind def
/col20 {0.820 0.000 0.000 srgb} bind def
/col21 {0.560 0.000 0.560 srgb} bind def
/col22 {0.690 0.000 0.690 srgb} bind def
/col23 {0.820 0.000 0.820 srgb} bind def
/col24 {0.500 0.190 0.000 srgb} bind def
/col25 {0.630 0.250 0.000 srgb} bind def
/col26 {0.750 0.380 0.000 srgb} bind def
/col27 {1.000 0.500 0.500 srgb} bind def
/col28 {1.000 0.630 0.630 srgb} bind def
/col29 {1.000 0.750 0.750 srgb} bind def
/col30 {1.000 0.880 0.880 srgb} bind def
/col31 {1.000 0.840 0.000 srgb} bind def

end
save
-39.0 437.0 translate
1 -1 scale

/cp {closepath} bind def
/ef {eofill} bind def
/gr {grestore} bind def
/gs {gsave} bind def
/sa {save} bind def
/rs {restore} bind def
/l {lineto} bind def
/m {moveto} bind def
/rm {rmoveto} bind def
/n {newpath} bind def
/s {stroke} bind def
/sh {show} bind def
/slc {setlinecap} bind def
/slj {setlinejoin} bind def
/slw {setlinewidth} bind def
/srgb {setrgbcolor} bind def
/rot {rotate} bind def
/sc {scale} bind def
/sd {setdash} bind def
/ff {findfont} bind def
/sf {setfont} bind def
/scf {scalefont} bind def
/sw {stringwidth} bind def
/tr {translate} bind def
/tnt {dup dup currentrgbcolor
  4 -2 roll dup 1 exch sub 3 -1 roll mul add
  4 -2 roll dup 1 exch sub 3 -1 roll mul add
  4 -2 roll dup 1 exch sub 3 -1 roll mul add srgb}
  bind def
/shd {dup dup currentrgbcolor 4 -2 roll mul 4 -2 roll mul
  4 -2 roll mul srgb} bind def
/$F2psBegin {$F2psDict begin /$F2psEnteredState save def} def
/$F2psEnd {$F2psEnteredState restore end} def
%%EndProlog

$F2psBegin
10 setmiterlimit
n -1000 8275 m -1000 -1000 l 8873 -1000 l 8873 8275 l cp clip
 0.06000 0.06000 sc
% Polyline
7.500 slw
n 675 2550 m 3750 2550 l 3750 5700 l 675 5700 l cp gs col0 s gr 
% Polyline
n 5025 1650 m 5475 1650 l 5475 6825 l 5025 6825 l cp gs col0 s gr 
% Polyline
n 6675 2850 m 7125 2850 l 7125 5250 l 6675 5250 l cp gs col0 s gr 
% Polyline
gs  clippath
4605 4095 m 4725 4125 l 4605 4155 l 4740 4155 l 4740 4095 l cp
clip
n 3975 4125 m 4725 4125 l gs col0 s gr gr

% arrowhead
n 4605 4095 m 4725 4125 l 4605 4155 l  col0 s
% Polyline
gs  clippath
6342 3014 m 6450 3075 l 6326 3072 l 6457 3108 l 6472 3050 l cp
clip
n 5625 2850 m 6450 3075 l gs col0 s gr gr

% arrowhead
n 6342 3014 m 6450 3075 l 6326 3072 l  col0 s
% Polyline
gs  clippath
6341 3242 m 6450 3300 l 6326 3300 l 6457 3333 l 6472 3275 l cp
clip
n 5550 3075 m 6450 3300 l gs col0 s gr gr

% arrowhead
n 6341 3242 m 6450 3300 l 6326 3300 l  col0 s
% Polyline
gs  clippath
6402 3688 m 6525 3675 l 6422 3744 l 6549 3698 l 6529 3642 l cp
clip
n 5700 3975 m 6525 3675 l gs col0 s gr gr

% arrowhead
n 6402 3688 m 6525 3675 l 6422 3744 l  col0 s
% Polyline
gs  clippath
6427 4125 m 6525 4050 l 6473 4162 l 6558 4057 l 6511 4020 l cp
clip
n 5625 5175 m 6525 4050 l gs col0 s gr gr

% arrowhead
n 6427 4125 m 6525 4050 l 6473 4162 l  col0 s
/Times-Roman ff 270.00 scf sf
1575 6300 m
gs 1 -1 sc (M_BOOL) col0 sh gr
/Times-Roman ff 270.00 scf sf
5100 7275 m
gs 1 -1 sc (V) col0 sh gr
/Times-Roman ff 270.00 scf sf
6150 5700 m
gs 1 -1 sc (Position_Index) col0 sh gr
/Times-Roman ff 210.00 scf sf
825 2850 m
gs 1 -1 sc (0 1 0 0 ....) col0 sh gr
/Times-Roman ff 210.00 scf sf
825 3150 m
gs 1 -1 sc (0) col0 sh gr
/Times-Roman ff 210.00 scf sf
825 4425 m
gs 1 -1 sc (.) col0 sh gr
/Times-Roman ff 210.00 scf sf
825 4680 m
gs 1 -1 sc (.) col0 sh gr
/Times-Roman ff 210.00 scf sf
825 4935 m
gs 1 -1 sc (.) col0 sh gr
/Times-Roman ff 210.00 scf sf
825 3750 m
gs 1 -1 sc (1) col0 sh gr
/Times-Roman ff 210.00 scf sf
825 4125 m
gs 1 -1 sc (1) col0 sh gr
/Times-Roman ff 210.00 scf sf
5175 2025 m
gs 1 -1 sc (0) col0 sh gr
/Times-Roman ff 210.00 scf sf
5175 2280 m
gs 1 -1 sc (0) col0 sh gr
/Times-Roman ff 210.00 scf sf
5175 2535 m
gs 1 -1 sc (0) col0 sh gr
/Times-Roman ff 210.00 scf sf
5175 2790 m
gs 1 -1 sc (1) col0 sh gr
/Times-Roman ff 210.00 scf sf
5175 3045 m
gs 1 -1 sc (1) col0 sh gr
/Times-Roman ff 210.00 scf sf
5175 3300 m
gs 1 -1 sc (.) col0 sh gr
/Times-Roman ff 210.00 scf sf
5175 3555 m
gs 1 -1 sc (.) col0 sh gr
/Times-Roman ff 210.00 scf sf
5175 3810 m
gs 1 -1 sc (.) col0 sh gr
/Times-Roman ff 210.00 scf sf
5175 4065 m
gs 1 -1 sc (1) col0 sh gr
/Times-Roman ff 210.00 scf sf
5175 4320 m
gs 1 -1 sc (.) col0 sh gr
/Times-Roman ff 210.00 scf sf
5175 4575 m
gs 1 -1 sc (.) col0 sh gr
/Times-Roman ff 210.00 scf sf
5175 4830 m
gs 1 -1 sc (.) col0 sh gr
/Times-Roman ff 210.00 scf sf
5175 5340 m
gs 1 -1 sc (1) col0 sh gr
/Times-Roman ff 210.00 scf sf
5175 5595 m
gs 1 -1 sc (.) col0 sh gr
/Times-Roman ff 210.00 scf sf
5175 5850 m
gs 1 -1 sc (.) col0 sh gr
/Times-Roman ff 210.00 scf sf
6825 3225 m
gs 1 -1 sc (4) col0 sh gr
/Times-Roman ff 210.00 scf sf
6825 3480 m
gs 1 -1 sc (5) col0 sh gr
/Times-Roman ff 210.00 scf sf
6825 3735 m
gs 1 -1 sc (14) col0 sh gr
/Times-Roman ff 210.00 scf sf
6825 3990 m
gs 1 -1 sc (27) col0 sh gr
/Times-Roman ff 210.00 scf sf
6825 4245 m
gs 1 -1 sc (.) col0 sh gr
/Times-Roman ff 210.00 scf sf
6825 4500 m
gs 1 -1 sc (.) col0 sh gr
/Times-Roman ff 210.00 scf sf
6825 4755 m
gs 1 -1 sc (.) col0 sh gr
/Times-Roman ff 210.00 scf sf
825 3450 m
gs 1 -1 sc (0) col0 sh gr
$F2psEnd
rs
