%!PS-Adobe-2.0 EPSF-2.0
%%Title: elig-replace.eps
%%Creator: fig2dev Version 3.2 Patchlevel 0-beta3
%%CreationDate: Fri Oct 30 15:19:20 1998
%%For: fgarcia@beciberi (Frederic Garcia,,52 83,)
%%Orientation: Portrait
%%BoundingBox: 0 0 386 216
%%Pages: 0
%%BeginSetup
%%EndSetup
%%Magnification: 1.0000
%%EndComments
/$F2psDict 200 dict def
$F2psDict begin
$F2psDict /mtrx matrix put
/col-1 {0 setgray} bind def
/col0 {0.000 0.000 0.000 srgb} bind def
/col1 {0.000 0.000 1.000 srgb} bind def
/col2 {0.000 1.000 0.000 srgb} bind def
/col3 {0.000 1.000 1.000 srgb} bind def
/col4 {1.000 0.000 0.000 srgb} bind def
/col5 {1.000 0.000 1.000 srgb} bind def
/col6 {1.000 1.000 0.000 srgb} bind def
/col7 {1.000 1.000 1.000 srgb} bind def
/col8 {0.000 0.000 0.560 srgb} bind def
/col9 {0.000 0.000 0.690 srgb} bind def
/col10 {0.000 0.000 0.820 srgb} bind def
/col11 {0.530 0.810 1.000 srgb} bind def
/col12 {0.000 0.560 0.000 srgb} bind def
/col13 {0.000 0.690 0.000 srgb} bind def
/col14 {0.000 0.820 0.000 srgb} bind def
/col15 {0.000 0.560 0.560 srgb} bind def
/col16 {0.000 0.690 0.690 srgb} bind def
/col17 {0.000 0.820 0.820 srgb} bind def
/col18 {0.560 0.000 0.000 srgb} bind def
/col19 {0.690 0.000 0.000 srgb} bind def
/col20 {0.820 0.000 0.000 srgb} bind def
/col21 {0.560 0.000 0.560 srgb} bind def
/col22 {0.690 0.000 0.690 srgb} bind def
/col23 {0.820 0.000 0.820 srgb} bind def
/col24 {0.500 0.190 0.000 srgb} bind def
/col25 {0.630 0.250 0.000 srgb} bind def
/col26 {0.750 0.380 0.000 srgb} bind def
/col27 {1.000 0.500 0.500 srgb} bind def
/col28 {1.000 0.630 0.630 srgb} bind def
/col29 {1.000 0.750 0.750 srgb} bind def
/col30 {1.000 0.880 0.880 srgb} bind def
/col31 {1.000 0.840 0.000 srgb} bind def

end
save
-168.0 306.0 translate
1 -1 scale

/cp {closepath} bind def
/ef {eofill} bind def
/gr {grestore} bind def
/gs {gsave} bind def
/sa {save} bind def
/rs {restore} bind def
/l {lineto} bind def
/m {moveto} bind def
/rm {rmoveto} bind def
/n {newpath} bind def
/s {stroke} bind def
/sh {show} bind def
/slc {setlinecap} bind def
/slj {setlinejoin} bind def
/slw {setlinewidth} bind def
/srgb {setrgbcolor} bind def
/rot {rotate} bind def
/sc {scale} bind def
/sd {setdash} bind def
/ff {findfont} bind def
/sf {setfont} bind def
/scf {scalefont} bind def
/sw {stringwidth} bind def
/tr {translate} bind def
/tnt {dup dup currentrgbcolor
  4 -2 roll dup 1 exch sub 3 -1 roll mul add
  4 -2 roll dup 1 exch sub 3 -1 roll mul add
  4 -2 roll dup 1 exch sub 3 -1 roll mul add srgb}
  bind def
/shd {dup dup currentrgbcolor 4 -2 roll mul 4 -2 roll mul
  4 -2 roll mul srgb} bind def
/reencdict 12 dict def /ReEncode { reencdict begin
/newcodesandnames exch def /newfontname exch def /basefontname exch def
/basefontdict basefontname findfont def /newfont basefontdict maxlength dict def
basefontdict { exch dup /FID ne { dup /Encoding eq
{ exch dup length array copy newfont 3 1 roll put }
{ exch newfont 3 1 roll put } ifelse } { pop pop } ifelse } forall
newfont /FontName newfontname put newcodesandnames aload pop
128 1 255 { newfont /Encoding get exch /.notdef put } for
newcodesandnames length 2 idiv { newfont /Encoding get 3 1 roll put } repeat
newfontname newfont definefont pop end } def
/isovec [
8#200 /grave 8#201 /acute 8#202 /circumflex 8#203 /tilde
8#204 /macron 8#205 /breve 8#206 /dotaccent 8#207 /dieresis
8#210 /ring 8#211 /cedilla 8#212 /hungarumlaut 8#213 /ogonek 8#214 /caron
8#220 /dotlessi 8#230 /oe 8#231 /OE
8#240 /space 8#241 /exclamdown 8#242 /cent 8#243 /sterling
8#244 /currency 8#245 /yen 8#246 /brokenbar 8#247 /section 8#250 /dieresis
8#251 /copyright 8#252 /ordfeminine 8#253 /guillemotleft 8#254 /logicalnot
8#255 /endash 8#256 /registered 8#257 /macron 8#260 /degree 8#261 /plusminus
8#262 /twosuperior 8#263 /threesuperior 8#264 /acute 8#265 /mu 8#266 /paragraph
8#267 /periodcentered 8#270 /cedilla 8#271 /onesuperior 8#272 /ordmasculine
8#273 /guillemotright 8#274 /onequarter 8#275 /onehalf
8#276 /threequarters 8#277 /questiondown 8#300 /Agrave 8#301 /Aacute
8#302 /Acircumflex 8#303 /Atilde 8#304 /Adieresis 8#305 /Aring
8#306 /AE 8#307 /Ccedilla 8#310 /Egrave 8#311 /Eacute
8#312 /Ecircumflex 8#313 /Edieresis 8#314 /Igrave 8#315 /Iacute
8#316 /Icircumflex 8#317 /Idieresis 8#320 /Eth 8#321 /Ntilde 8#322 /Ograve
8#323 /Oacute 8#324 /Ocircumflex 8#325 /Otilde 8#326 /Odieresis 8#327 /multiply
8#330 /Oslash 8#331 /Ugrave 8#332 /Uacute 8#333 /Ucircumflex
8#334 /Udieresis 8#335 /Yacute 8#336 /Thorn 8#337 /germandbls 8#340 /agrave
8#341 /aacute 8#342 /acircumflex 8#343 /atilde 8#344 /adieresis 8#345 /aring
8#346 /ae 8#347 /ccedilla 8#350 /egrave 8#351 /eacute
8#352 /ecircumflex 8#353 /edieresis 8#354 /igrave 8#355 /iacute
8#356 /icircumflex 8#357 /idieresis 8#360 /eth 8#361 /ntilde 8#362 /ograve
8#363 /oacute 8#364 /ocircumflex 8#365 /otilde 8#366 /odieresis 8#367 /divide
8#370 /oslash 8#371 /ugrave 8#372 /uacute 8#373 /ucircumflex
8#374 /udieresis 8#375 /yacute 8#376 /thorn 8#377 /ydieresis] def
/Times-Roman /Times-Roman-iso isovec ReEncode
/$F2psBegin {$F2psDict begin /$F2psEnteredState save def} def
/$F2psEnd {$F2psEnteredState restore end} def
%%EndProlog

$F2psBegin
10 setmiterlimit
n -1000 6085 m -1000 -1000 l 10218 -1000 l 10218 6085 l cp clip
 0.06000 0.06000 sc
% Polyline
7.500 slw
n 3000 2730 m 3345 2730 l gs col0 s gr 
% Polyline
n 3600 4890 m 3600 4350 l gs col0 s gr 
% Polyline
n 4770 4890 m 4770 4350 l gs col0 s gr 
% Polyline
n 5190 4890 m 5190 4350 l gs col0 s gr 
% Polyline
n 6330 4875 m 6330 4335 l gs col0 s gr 
% Polyline
gs  clippath
9003 4860 m 9123 4890 l 9003 4920 l 9165 4920 l 9165 4860 l cp
clip
n 3090 4890 m 9150 4890 l gs col0 s gr gr

% arrowhead
n 9003 4860 m 9123 4890 l 9003 4920 l 9003 4890 l 9003 4860 l  cp gs 0.00 setgray ef gr  col0 s
% Polyline
15.000 slw
n 3315 3957 m 3592 3950 l gs col0 s gr 
% Polyline
7.500 slw
gs  clippath
3135 1850 m 3165 1730 l 3195 1850 l 3195 1688 l 3135 1688 l cp
clip
n 3165 3953 m 3165 1703 l gs col0 s gr gr

% arrowhead
n 3135 1850 m 3165 1730 l 3195 1850 l 3165 1850 l 3135 1850 l  cp gs 0.00 setgray ef gr  col0 s
% Polyline
15.000 slw
n 3592 3939 m 3599 2775 l gs col0 s gr 
% Polyline
n 4781 3714 m 4785 2745 l gs col0 s gr 
% Polyline
n 5158 3377 m 5167 2745 l gs col0 s gr 
% Polyline
n 6322 3720 m 6320 2738 l gs col0 s gr 
% Polyline
7.500 slw
 [60] 0 sd
gs  clippath
8921 3928 m 9041 3958 l 8921 3988 l 9083 3988 l 9083 3928 l cp
clip
n 3150 3960 m 9068 3958 l gs col0 s gr gr
 [] 0 sd
% arrowhead
n 8921 3928 m 9041 3958 l 8921 3988 l 8921 3958 l 8921 3928 l  cp gs 0.00 setgray ef gr  col0 s
% Polyline
15.000 slw
n 3596 2760 m 3597 2763 l 3599 2770 l 3601 2781 l 3606 2797 l 3611 2816 l
 3617 2838 l 3623 2861 l 3629 2883 l 3635 2904 l 3640 2923 l
 3646 2940 l 3651 2955 l 3656 2969 l 3661 2983 l 3667 2996 l
 3673 3010 l 3679 3023 l 3685 3036 l 3692 3049 l 3698 3062 l
 3704 3075 l 3711 3087 l 3718 3100 l 3724 3113 l 3731 3125 l
 3738 3137 l 3746 3149 l 3755 3163 l 3765 3176 l 3774 3189 l
 3784 3201 l 3794 3214 l 3805 3226 l 3815 3239 l 3825 3251 l
 3836 3263 l 3847 3275 l 3859 3287 l 3871 3299 l 3882 3309 l
 3893 3319 l 3905 3328 l 3917 3337 l 3929 3347 l 3941 3356 l
 3953 3365 l 3966 3374 l 3978 3383 l 3991 3392 l 4004 3401 l
 4018 3410 l 4032 3420 l 4046 3429 l 4059 3437 l 4073 3445 l
 4086 3454 l 4101 3462 l 4115 3470 l 4130 3479 l 4145 3487 l
 4160 3496 l 4175 3504 l 4190 3512 l 4205 3521 l 4220 3529 l
 4235 3537 l 4250 3544 l 4266 3552 l 4281 3559 l 4297 3566 l
 4312 3573 l 4328 3579 l 4345 3586 l 4361 3592 l 4377 3598 l
 4394 3604 l 4411 3610 l 4427 3616 l 4444 3622 l 4460 3628 l
 4477 3634 l 4493 3639 l 4509 3644 l 4525 3649 l 4541 3654 l
 4559 3659 l 4578 3664 l 4599 3668 l 4621 3673 l 4645 3678 l
 4671 3683 l 4697 3688 l 4722 3693 l 4744 3697 l 4762 3700 l
 4775 3702 l 4782 3703 l 4786 3704 l gs col0 s gr 
% Polyline
n 4804 2775 m 4805 2778 l 4807 2785 l 4809 2796 l 4814 2812 l 4819 2831 l
 4825 2853 l 4831 2876 l 4837 2898 l 4843 2919 l 4848 2938 l
 4854 2955 l 4859 2970 l 4864 2984 l 4869 2998 l 4875 3011 l
 4881 3025 l 4887 3038 l 4893 3051 l 4900 3064 l 4906 3077 l
 4912 3090 l 4919 3102 l 4926 3115 l 4932 3128 l 4939 3140 l
 4946 3152 l 4954 3164 l 4963 3178 l 4973 3191 l 4983 3204 l
 4994 3218 l 5005 3231 l 5017 3244 l 5028 3257 l 5039 3270 l
 5050 3282 l 5060 3294 l 5070 3304 l 5079 3314 l 5089 3324 l
 5100 3334 l 5112 3343 l 5124 3352 l 5137 3361 l 5148 3369 l
 5158 3376 l 5164 3380 l 5167 3382 l gs col0 s gr 
% Polyline
n 5182 2773 m 5183 2776 l 5185 2783 l 5187 2794 l 5192 2810 l 5197 2829 l
 5203 2851 l 5209 2874 l 5215 2896 l 5221 2917 l 5226 2936 l
 5232 2953 l 5237 2968 l 5242 2982 l 5247 2996 l 5253 3009 l
 5259 3023 l 5265 3036 l 5271 3049 l 5278 3062 l 5284 3075 l
 5290 3088 l 5297 3100 l 5304 3113 l 5310 3126 l 5317 3138 l
 5324 3150 l 5332 3162 l 5341 3176 l 5351 3189 l 5360 3202 l
 5370 3214 l 5380 3227 l 5391 3239 l 5401 3252 l 5411 3264 l
 5422 3276 l 5433 3288 l 5445 3300 l 5457 3312 l 5468 3322 l
 5479 3332 l 5491 3341 l 5503 3350 l 5515 3360 l 5527 3369 l
 5539 3378 l 5552 3387 l 5564 3396 l 5577 3405 l 5590 3414 l
 5604 3423 l 5618 3433 l 5632 3442 l 5645 3450 l 5659 3458 l
 5672 3467 l 5687 3475 l 5701 3483 l 5716 3492 l 5731 3500 l
 5746 3509 l 5761 3517 l 5776 3525 l 5791 3534 l 5806 3542 l
 5821 3550 l 5836 3557 l 5852 3565 l 5867 3572 l 5883 3579 l
 5898 3586 l 5915 3592 l 5931 3598 l 5948 3605 l 5964 3611 l
 5981 3617 l 5999 3623 l 6016 3629 l 6032 3635 l 6049 3640 l
 6066 3646 l 6082 3651 l 6097 3657 l 6112 3662 l 6127 3667 l
 6143 3672 l 6160 3678 l 6178 3683 l 6196 3689 l 6216 3695 l
 6237 3701 l 6258 3707 l 6279 3712 l 6296 3718 l 6311 3722 l
 6321 3725 l 6327 3726 l 6330 3727 l gs col0 s gr 
% Polyline
n 6330 2751 m 6331 2754 l 6333 2761 l 6335 2772 l 6340 2788 l 6345 2807 l
 6351 2829 l 6357 2852 l 6363 2874 l 6369 2895 l 6374 2914 l
 6380 2931 l 6385 2946 l 6390 2960 l 6395 2974 l 6401 2987 l
 6407 3001 l 6413 3014 l 6419 3027 l 6426 3040 l 6432 3053 l
 6438 3066 l 6445 3078 l 6452 3091 l 6458 3104 l 6465 3116 l
 6472 3128 l 6480 3140 l 6489 3154 l 6499 3167 l 6508 3180 l
 6518 3192 l 6528 3205 l 6539 3217 l 6549 3230 l 6559 3242 l
 6570 3254 l 6581 3266 l 6593 3278 l 6605 3290 l 6616 3300 l
 6627 3310 l 6639 3319 l 6651 3328 l 6663 3338 l 6675 3347 l
 6687 3356 l 6700 3365 l 6712 3374 l 6725 3383 l 6738 3392 l
 6752 3401 l 6766 3411 l 6780 3420 l 6793 3428 l 6806 3436 l
 6820 3444 l 6834 3453 l 6849 3461 l 6863 3469 l 6878 3477 l
 6893 3486 l 6908 3494 l 6923 3502 l 6938 3510 l 6953 3518 l
 6968 3526 l 6984 3534 l 6999 3542 l 7015 3550 l 7031 3558 l
 7048 3565 l 7064 3573 l 7081 3581 l 7099 3588 l 7116 3596 l
 7134 3604 l 7152 3612 l 7170 3619 l 7188 3627 l 7205 3634 l
 7223 3642 l 7240 3649 l 7257 3655 l 7274 3661 l 7290 3667 l
 7308 3673 l 7327 3678 l 7344 3683 l 7361 3688 l 7378 3692 l
 7395 3695 l 7411 3699 l 7427 3702 l 7444 3705 l 7461 3709 l
 7479 3713 l 7498 3717 l 7517 3722 l 7537 3727 l 7553 3731 l
 7570 3735 l 7587 3740 l 7605 3744 l 7624 3749 l 7642 3754 l
 7661 3759 l 7681 3763 l 7700 3769 l 7719 3774 l 7739 3778 l
 7758 3783 l 7777 3788 l 7795 3793 l 7814 3797 l 7832 3802 l
 7850 3806 l 7867 3810 l 7886 3814 l 7905 3819 l 7924 3823 l
 7942 3827 l 7960 3830 l 7978 3834 l 7996 3838 l 8013 3841 l
 8031 3845 l 8048 3849 l 8066 3852 l 8084 3856 l 8103 3859 l
 8121 3863 l 8140 3866 l 8160 3870 l 8178 3873 l 8196 3876 l
 8214 3879 l 8233 3882 l 8252 3885 l 8271 3889 l 8291 3892 l
 8311 3895 l 8331 3898 l 8351 3901 l 8371 3904 l 8390 3907 l
 8409 3910 l 8428 3913 l 8446 3915 l 8464 3918 l 8481 3920 l
 8497 3922 l 8517 3924 l 8538 3926 l 8559 3928 l 8581 3929 l
 8605 3931 l 8629 3932 l 8654 3933 l 8677 3934 l 8698 3935 l
 8715 3936 l 8727 3937 l 8734 3937 l 8737 3937 l gs col0 s gr 
/Times-Roman-iso ff 180.00 scf sf
2805 2775 m
gs 1 -1 sc (1) col0 sh gr
/Times-Roman-iso ff 180.00 scf sf
7065 4620 m
gs 1 -1 sc (dates des visites de l'\351tat s) col0 sh gr
/Times-Roman-iso ff 180.00 scf sf
8955 5085 m
gs 1 -1 sc (n) col0 sh gr
/Times-Roman-iso ff 180.00 scf sf
8902 4155 m
gs 1 -1 sc (n) col0 sh gr
/Times-Roman-iso ff 180.00 scf sf
3270 1689 m
gs 1 -1 sc (z\(s\)) col0 sh gr
$F2psEnd
rs
