%!PS-Adobe-2.0 EPSF-2.0
%%Title: elig-cumul.eps
%%Creator: fig2dev Version 3.2 Patchlevel 0-beta3
%%CreationDate: Fri Oct 30 15:12:33 1998
%%For: fgarcia@beciberi (Frederic Garcia,,52 83,)
%%Orientation: Portrait
%%BoundingBox: 0 0 386 216
%%Pages: 0
%%BeginSetup
%%EndSetup
%%Magnification: 1.0000
%%EndComments
/$F2psDict 200 dict def
$F2psDict begin
$F2psDict /mtrx matrix put
/col-1 {0 setgray} bind def
/col0 {0.000 0.000 0.000 srgb} bind def
/col1 {0.000 0.000 1.000 srgb} bind def
/col2 {0.000 1.000 0.000 srgb} bind def
/col3 {0.000 1.000 1.000 srgb} bind def
/col4 {1.000 0.000 0.000 srgb} bind def
/col5 {1.000 0.000 1.000 srgb} bind def
/col6 {1.000 1.000 0.000 srgb} bind def
/col7 {1.000 1.000 1.000 srgb} bind def
/col8 {0.000 0.000 0.560 srgb} bind def
/col9 {0.000 0.000 0.690 srgb} bind def
/col10 {0.000 0.000 0.820 srgb} bind def
/col11 {0.530 0.810 1.000 srgb} bind def
/col12 {0.000 0.560 0.000 srgb} bind def
/col13 {0.000 0.690 0.000 srgb} bind def
/col14 {0.000 0.820 0.000 srgb} bind def
/col15 {0.000 0.560 0.560 srgb} bind def
/col16 {0.000 0.690 0.690 srgb} bind def
/col17 {0.000 0.820 0.820 srgb} bind def
/col18 {0.560 0.000 0.000 srgb} bind def
/col19 {0.690 0.000 0.000 srgb} bind def
/col20 {0.820 0.000 0.000 srgb} bind def
/col21 {0.560 0.000 0.560 srgb} bind def
/col22 {0.690 0.000 0.690 srgb} bind def
/col23 {0.820 0.000 0.820 srgb} bind def
/col24 {0.500 0.190 0.000 srgb} bind def
/col25 {0.630 0.250 0.000 srgb} bind def
/col26 {0.750 0.380 0.000 srgb} bind def
/col27 {1.000 0.500 0.500 srgb} bind def
/col28 {1.000 0.630 0.630 srgb} bind def
/col29 {1.000 0.750 0.750 srgb} bind def
/col30 {1.000 0.880 0.880 srgb} bind def
/col31 {1.000 0.840 0.000 srgb} bind def

end
save
-168.0 306.0 translate
1 -1 scale

/cp {closepath} bind def
/ef {eofill} bind def
/gr {grestore} bind def
/gs {gsave} bind def
/sa {save} bind def
/rs {restore} bind def
/l {lineto} bind def
/m {moveto} bind def
/rm {rmoveto} bind def
/n {newpath} bind def
/s {stroke} bind def
/sh {show} bind def
/slc {setlinecap} bind def
/slj {setlinejoin} bind def
/slw {setlinewidth} bind def
/srgb {setrgbcolor} bind def
/rot {rotate} bind def
/sc {scale} bind def
/sd {setdash} bind def
/ff {findfont} bind def
/sf {setfont} bind def
/scf {scalefont} bind def
/sw {stringwidth} bind def
/tr {translate} bind def
/tnt {dup dup currentrgbcolor
  4 -2 roll dup 1 exch sub 3 -1 roll mul add
  4 -2 roll dup 1 exch sub 3 -1 roll mul add
  4 -2 roll dup 1 exch sub 3 -1 roll mul add srgb}
  bind def
/shd {dup dup currentrgbcolor 4 -2 roll mul 4 -2 roll mul
  4 -2 roll mul srgb} bind def
/reencdict 12 dict def /ReEncode { reencdict begin
/newcodesandnames exch def /newfontname exch def /basefontname exch def
/basefontdict basefontname findfont def /newfont basefontdict maxlength dict def
basefontdict { exch dup /FID ne { dup /Encoding eq
{ exch dup length array copy newfont 3 1 roll put }
{ exch newfont 3 1 roll put } ifelse } { pop pop } ifelse } forall
newfont /FontName newfontname put newcodesandnames aload pop
128 1 255 { newfont /Encoding get exch /.notdef put } for
newcodesandnames length 2 idiv { newfont /Encoding get 3 1 roll put } repeat
newfontname newfont definefont pop end } def
/isovec [
8#200 /grave 8#201 /acute 8#202 /circumflex 8#203 /tilde
8#204 /macron 8#205 /breve 8#206 /dotaccent 8#207 /dieresis
8#210 /ring 8#211 /cedilla 8#212 /hungarumlaut 8#213 /ogonek 8#214 /caron
8#220 /dotlessi 8#230 /oe 8#231 /OE
8#240 /space 8#241 /exclamdown 8#242 /cent 8#243 /sterling
8#244 /currency 8#245 /yen 8#246 /brokenbar 8#247 /section 8#250 /dieresis
8#251 /copyright 8#252 /ordfeminine 8#253 /guillemotleft 8#254 /logicalnot
8#255 /endash 8#256 /registered 8#257 /macron 8#260 /degree 8#261 /plusminus
8#262 /twosuperior 8#263 /threesuperior 8#264 /acute 8#265 /mu 8#266 /paragraph
8#267 /periodcentered 8#270 /cedilla 8#271 /onesuperior 8#272 /ordmasculine
8#273 /guillemotright 8#274 /onequarter 8#275 /onehalf
8#276 /threequarters 8#277 /questiondown 8#300 /Agrave 8#301 /Aacute
8#302 /Acircumflex 8#303 /Atilde 8#304 /Adieresis 8#305 /Aring
8#306 /AE 8#307 /Ccedilla 8#310 /Egrave 8#311 /Eacute
8#312 /Ecircumflex 8#313 /Edieresis 8#314 /Igrave 8#315 /Iacute
8#316 /Icircumflex 8#317 /Idieresis 8#320 /Eth 8#321 /Ntilde 8#322 /Ograve
8#323 /Oacute 8#324 /Ocircumflex 8#325 /Otilde 8#326 /Odieresis 8#327 /multiply
8#330 /Oslash 8#331 /Ugrave 8#332 /Uacute 8#333 /Ucircumflex
8#334 /Udieresis 8#335 /Yacute 8#336 /Thorn 8#337 /germandbls 8#340 /agrave
8#341 /aacute 8#342 /acircumflex 8#343 /atilde 8#344 /adieresis 8#345 /aring
8#346 /ae 8#347 /ccedilla 8#350 /egrave 8#351 /eacute
8#352 /ecircumflex 8#353 /edieresis 8#354 /igrave 8#355 /iacute
8#356 /icircumflex 8#357 /idieresis 8#360 /eth 8#361 /ntilde 8#362 /ograve
8#363 /oacute 8#364 /ocircumflex 8#365 /otilde 8#366 /odieresis 8#367 /divide
8#370 /oslash 8#371 /ugrave 8#372 /uacute 8#373 /ucircumflex
8#374 /udieresis 8#375 /yacute 8#376 /thorn 8#377 /ydieresis] def
/Times-Roman /Times-Roman-iso isovec ReEncode
/$F2psBegin {$F2psDict begin /$F2psEnteredState save def} def
/$F2psEnd {$F2psEnteredState restore end} def
%%EndProlog

$F2psBegin
10 setmiterlimit
n -1000 6085 m -1000 -1000 l 10218 -1000 l 10218 6085 l cp clip
 0.06000 0.06000 sc
% Polyline
15.000 slw
n 3592 3939 m 3599 2775 l gs col0 s gr 
% Polyline
n 4781 3714 m 4788 2550 l gs col0 s gr 
% Polyline
n 5150 3242 m 5157 2078 l gs col0 s gr 
% Polyline
n 6296 3422 m 6303 2258 l gs col0 s gr 
% Polyline
n 3596 2760 m 3597 2763 l 3599 2770 l 3601 2781 l 3606 2797 l 3611 2816 l
 3617 2838 l 3623 2861 l 3629 2883 l 3635 2904 l 3640 2923 l
 3646 2940 l 3651 2955 l 3656 2969 l 3661 2983 l 3667 2996 l
 3673 3010 l 3679 3023 l 3685 3036 l 3692 3049 l 3698 3062 l
 3704 3075 l 3711 3087 l 3718 3100 l 3724 3113 l 3731 3125 l
 3738 3137 l 3746 3149 l 3755 3163 l 3765 3176 l 3774 3189 l
 3784 3201 l 3794 3214 l 3805 3226 l 3815 3239 l 3825 3251 l
 3836 3263 l 3847 3275 l 3859 3287 l 3871 3299 l 3882 3309 l
 3893 3319 l 3905 3328 l 3917 3337 l 3929 3347 l 3941 3356 l
 3953 3365 l 3966 3374 l 3978 3383 l 3991 3392 l 4004 3401 l
 4018 3410 l 4032 3420 l 4046 3429 l 4059 3437 l 4073 3445 l
 4086 3454 l 4101 3462 l 4115 3470 l 4130 3479 l 4145 3487 l
 4160 3496 l 4175 3504 l 4190 3512 l 4205 3521 l 4220 3529 l
 4235 3537 l 4250 3544 l 4266 3552 l 4281 3559 l 4297 3566 l
 4312 3573 l 4328 3579 l 4345 3586 l 4361 3592 l 4377 3598 l
 4394 3604 l 4411 3610 l 4427 3616 l 4444 3622 l 4460 3628 l
 4477 3634 l 4493 3639 l 4509 3644 l 4525 3649 l 4541 3654 l
 4559 3659 l 4578 3664 l 4599 3668 l 4621 3673 l 4645 3678 l
 4671 3683 l 4697 3688 l 4722 3693 l 4744 3697 l 4762 3700 l
 4775 3702 l 4782 3703 l 4786 3704 l gs col0 s gr 
% Polyline
n 4807 2576 m 4808 2579 l 4809 2584 l 4812 2594 l 4815 2608 l 4820 2626 l
 4826 2648 l 4832 2671 l 4838 2695 l 4845 2719 l 4851 2742 l
 4857 2763 l 4863 2782 l 4869 2800 l 4874 2816 l 4880 2831 l
 4887 2848 l 4894 2864 l 4901 2881 l 4909 2897 l 4916 2913 l
 4924 2929 l 4932 2945 l 4940 2961 l 4948 2976 l 4956 2992 l
 4964 3007 l 4973 3022 l 4982 3037 l 4991 3052 l 5001 3066 l
 5011 3081 l 5024 3097 l 5037 3114 l 5053 3132 l 5069 3151 l
 5086 3170 l 5102 3188 l 5117 3204 l 5128 3218 l 5137 3227 l
 5142 3232 l 5144 3235 l gs col0 s gr 
% Polyline
n 5158 2082 m 5159 2085 l 5160 2090 l 5163 2100 l 5166 2114 l 5171 2134 l
 5178 2157 l 5185 2183 l 5192 2212 l 5200 2241 l 5208 2270 l
 5216 2298 l 5223 2325 l 5231 2349 l 5238 2372 l 5244 2392 l
 5251 2412 l 5258 2430 l 5265 2448 l 5272 2466 l 5280 2483 l
 5288 2500 l 5296 2518 l 5304 2535 l 5312 2552 l 5320 2569 l
 5328 2586 l 5337 2602 l 5345 2619 l 5354 2636 l 5362 2652 l
 5371 2668 l 5380 2685 l 5390 2701 l 5399 2716 l 5409 2732 l
 5419 2747 l 5430 2762 l 5440 2777 l 5451 2791 l 5462 2806 l
 5473 2820 l 5484 2834 l 5496 2848 l 5507 2861 l 5518 2875 l
 5530 2889 l 5542 2903 l 5554 2916 l 5566 2930 l 5578 2943 l
 5591 2957 l 5604 2970 l 5618 2983 l 5632 2996 l 5647 3009 l
 5662 3021 l 5677 3033 l 5692 3046 l 5708 3058 l 5724 3069 l
 5739 3081 l 5755 3093 l 5772 3105 l 5788 3116 l 5804 3128 l
 5821 3140 l 5838 3152 l 5855 3164 l 5873 3176 l 5891 3188 l
 5910 3200 l 5927 3211 l 5946 3222 l 5966 3234 l 5988 3247 l
 6011 3260 l 6037 3275 l 6064 3290 l 6093 3306 l 6123 3322 l
 6153 3339 l 6183 3355 l 6210 3370 l 6235 3383 l 6257 3395 l
 6274 3404 l 6287 3411 l 6295 3415 l 6300 3418 l 6302 3419 l gs col0 s gr 
% Polyline
n 6318 2266 m 6319 2269 l 6320 2275 l 6323 2285 l 6327 2300 l 6332 2321 l
 6339 2346 l 6346 2374 l 6354 2404 l 6363 2435 l 6371 2466 l
 6379 2496 l 6387 2524 l 6395 2550 l 6402 2574 l 6410 2596 l
 6417 2617 l 6424 2636 l 6432 2655 l 6439 2674 l 6447 2692 l
 6456 2711 l 6464 2729 l 6473 2747 l 6481 2765 l 6490 2783 l
 6499 2801 l 6507 2819 l 6516 2837 l 6525 2855 l 6535 2872 l
 6544 2889 l 6554 2907 l 6563 2924 l 6574 2941 l 6584 2957 l
 6595 2973 l 6606 2989 l 6617 3005 l 6629 3020 l 6640 3035 l
 6652 3050 l 6664 3065 l 6676 3080 l 6688 3095 l 6700 3109 l
 6712 3124 l 6725 3139 l 6738 3153 l 6751 3167 l 6764 3182 l
 6777 3196 l 6791 3210 l 6806 3224 l 6821 3238 l 6837 3251 l
 6852 3264 l 6868 3277 l 6885 3290 l 6901 3303 l 6918 3316 l
 6935 3328 l 6952 3341 l 6969 3353 l 6986 3365 l 7004 3378 l
 7022 3390 l 7040 3403 l 7058 3416 l 7077 3428 l 7096 3441 l
 7116 3454 l 7134 3466 l 7153 3477 l 7173 3489 l 7193 3501 l
 7213 3513 l 7233 3525 l 7254 3537 l 7275 3549 l 7296 3561 l
 7317 3573 l 7339 3586 l 7360 3598 l 7382 3610 l 7403 3621 l
 7425 3633 l 7446 3644 l 7468 3655 l 7489 3666 l 7511 3677 l
 7533 3687 l 7553 3696 l 7573 3705 l 7594 3713 l 7614 3722 l
 7635 3730 l 7656 3738 l 7677 3746 l 7699 3754 l 7720 3762 l
 7741 3770 l 7763 3778 l 7784 3786 l 7806 3793 l 7827 3801 l
 7848 3808 l 7870 3815 l 7891 3822 l 7912 3829 l 7932 3836 l
 7953 3843 l 7974 3849 l 7994 3855 l 8016 3861 l 8039 3867 l
 8063 3873 l 8088 3879 l 8115 3885 l 8144 3891 l 8174 3897 l
 8206 3903 l 8238 3909 l 8270 3915 l 8302 3920 l 8331 3926 l
 8357 3931 l 8380 3935 l 8398 3938 l 8412 3940 l 8421 3942 l
 8426 3943 l 8428 3943 l gs col0 s gr 
% Polyline
n 3315 3957 m 3592 3950 l gs col0 s gr 
% Polyline
7.500 slw
 [60] 0 sd
gs  clippath
8921 3928 m 9041 3958 l 8921 3988 l 9083 3988 l 9083 3928 l cp
clip
n 3150 3960 m 9068 3958 l gs col0 s gr gr
 [] 0 sd
% arrowhead
n 8921 3928 m 9041 3958 l 8921 3988 l 8921 3958 l 8921 3928 l  cp gs 0.00 setgray ef gr  col0 s
% Polyline
15.000 slw
n 8407 3944 m 8767 3937 l gs col0 s gr 
% Polyline
7.500 slw
gs  clippath
3135 1850 m 3165 1730 l 3195 1850 l 3195 1688 l 3135 1688 l cp
clip
n 3165 3953 m 3165 1703 l gs col0 s gr gr

% arrowhead
n 3135 1850 m 3165 1730 l 3195 1850 l 3165 1850 l 3135 1850 l  cp gs 0.00 setgray ef gr  col0 s
/Times-Roman-iso ff 180.00 scf sf
8902 4155 m
gs 1 -1 sc (n) col0 sh gr
/Times-Roman-iso ff 180.00 scf sf
3270 1689 m
gs 1 -1 sc (z\(s\)) col0 sh gr
% Polyline
n 3000 2730 m 3345 2730 l gs col0 s gr 
% Polyline
n 3600 4890 m 3600 4350 l gs col0 s gr 
% Polyline
n 4770 4890 m 4770 4350 l gs col0 s gr 
% Polyline
n 5190 4890 m 5190 4350 l gs col0 s gr 
% Polyline
n 6330 4875 m 6330 4335 l gs col0 s gr 
% Polyline
gs  clippath
9003 4860 m 9123 4890 l 9003 4920 l 9165 4920 l 9165 4860 l cp
clip
n 3090 4890 m 9150 4890 l gs col0 s gr gr

% arrowhead
n 9003 4860 m 9123 4890 l 9003 4920 l 9003 4890 l 9003 4860 l  cp gs 0.00 setgray ef gr  col0 s
/Times-Roman-iso ff 180.00 scf sf
2805 2775 m
gs 1 -1 sc (1) col0 sh gr
/Times-Roman-iso ff 180.00 scf sf
7065 4620 m
gs 1 -1 sc (dates des visites de l'\351tat s) col0 sh gr
/Times-Roman-iso ff 180.00 scf sf
8955 5085 m
gs 1 -1 sc (n) col0 sh gr
$F2psEnd
rs
