<?xml version="1.0" encoding="UTF-8" standalone="no"?>
<!-- Created with Inkscape (http://www.inkscape.org/) -->

<svg
   xmlns:dc="http://purl.org/dc/elements/1.1/"
   xmlns:cc="http://creativecommons.org/ns#"
   xmlns:rdf="http://www.w3.org/1999/02/22-rdf-syntax-ns#"
   xmlns:svg="http://www.w3.org/2000/svg"
   xmlns="http://www.w3.org/2000/svg"
   xmlns:xlink="http://www.w3.org/1999/xlink"
   xmlns:sodipodi="http://sodipodi.sourceforge.net/DTD/sodipodi-0.dtd"
   xmlns:inkscape="http://www.inkscape.org/namespaces/inkscape"
   width="48"
   height="48"
   id="svg2"
   version="1.1"
   inkscape:version="0.92.1 r15371"
   inkscape:export-filename="/home/valot/data/presentation/masschroq.png"
   inkscape:export-xdpi="90"
   inkscape:export-ydpi="90"
   sodipodi:docname="masschroq.svg">
  <defs
     id="defs4">
    <inkscape:perspective
       sodipodi:type="inkscape:persp3d"
       inkscape:vp_x="0 : 189.91304 : 1"
       inkscape:vp_y="0 : 1000 : 0"
       inkscape:vp_z="499.14661 : 189.91304 : 1"
       inkscape:persp3d-origin="249.5733 : 126.60869 : 1"
       id="perspective50" />
    <linearGradient
       id="linearGradient4034">
      <stop
         style="stop-color:#8d8d8d;stop-opacity:1;"
         offset="0"
         id="stop4036" />
      <stop
         style="stop-color:#d2d2d2;stop-opacity:0;"
         offset="1"
         id="stop4038" />
    </linearGradient>
    <radialGradient
       inkscape:collect="always"
       xlink:href="#linearGradient4034"
       id="radialGradient4046"
       gradientUnits="userSpaceOnUse"
       gradientTransform="matrix(0.92324481,-0.0056018,0.00470472,0.77539747,19.084596,47.201358)"
       cx="261.12445"
       cy="203.64244"
       fx="261.12445"
       fy="203.64244"
       r="263.14474" />
    <inkscape:perspective
       id="perspective3722"
       inkscape:persp3d-origin="0.5 : 0.33333333 : 1"
       inkscape:vp_z="1 : 0.5 : 1"
       inkscape:vp_y="0 : 1000 : 0"
       inkscape:vp_x="0 : 0.5 : 1"
       sodipodi:type="inkscape:persp3d" />
  </defs>
  <sodipodi:namedview
     id="base"
     pagecolor="#ffffff"
     bordercolor="#666666"
     borderopacity="1.0"
     inkscape:pageopacity="0.0"
     inkscape:pageshadow="2"
     inkscape:zoom="7.919596"
     inkscape:cx="31.037216"
     inkscape:cy="15.427092"
     inkscape:document-units="px"
     inkscape:current-layer="layer1"
     showgrid="false"
     fit-margin-top="0"
     fit-margin-left="0"
     fit-margin-right="0"
     fit-margin-bottom="0"
     inkscape:window-width="1278"
     inkscape:window-height="940"
     inkscape:window-x="0"
     inkscape:window-y="33"
     inkscape:window-maximized="0"
     showguides="true"
     inkscape:guide-bbox="true" />
  <metadata
     id="metadata7">
    <rdf:RDF>
      <cc:Work
         rdf:about="">
        <dc:format>image/svg+xml</dc:format>
        <dc:type
           rdf:resource="http://purl.org/dc/dcmitype/StillImage" />
        <dc:title></dc:title>
      </cc:Work>
    </rdf:RDF>
  </metadata>
  <g
     inkscape:label="Calque 1"
     inkscape:groupmode="layer"
     id="layer1"
     transform="translate(-25.50167,-487.22477)">
    <path
       style="fill:#ffff00;fill-opacity:1;stroke:#030000;stroke-width:0.12626907;stroke-linejoin:round;stroke-miterlimit:4;stroke-opacity:1;stroke-dasharray:none"
       d=""
       id="path3974"
       inkscape:connector-curvature="0"
       transform="translate(21.093404,156.31215)" />
    <path
       style="fill:#ffff00;fill-opacity:1;stroke:#030000;stroke-width:0.35714287;stroke-linejoin:round;stroke-miterlimit:4;stroke-opacity:1;stroke-dasharray:none"
       d=""
       id="path3978"
       inkscape:connector-curvature="0"
       transform="translate(21.093404,156.31215)" />
    <g
       id="g3701-8"
       transform="matrix(1.1324638,0,0,0.99223884,19.946875,12.10099)">
      <g
         id="g3769"
         transform="translate(-24.362179,-7.2887117)">
        <path
           style="fill:#757575;fill-opacity:1;stroke:none"
           d="m 42.720969,528.77466 c 1.552374,-2.74059 2.377728,-3.54476 5.407891,-8.69719 l 10.156022,-20.73463 c -3.044738,6.81651 -8.688933,23.0405 -9.01964,26.96978 -0.113911,1.35342 0.1899,2.97972 0.487337,3.39923 l 0.385054,0.54309 -5.088143,0.4925 c -2.795362,0.27057 -5.097743,0.4243 -5.163905,0.48597 -0.198407,0.18492 -0.01428,-0.0226 0.04049,-0.0189 l 0.179069,-0.266 2.615825,-2.17385 z"
           id="path4012-6"
           inkscape:connector-curvature="0"
           sodipodi:nodetypes="cccsscssccc" />
        <path
           style="fill:#757575;fill-opacity:1;stroke:none"
           d="m 55.627647,530.69778 c -2.385665,-0.23166 -4.658956,-0.29727 -4.432311,-0.49928 0.05068,-0.0452 -0.147787,0.007 -0.06006,-0.0806 0.667061,-0.66247 1.488731,-0.75487 4.432655,-4.48761 2.092655,-2.65338 9.001429,-15.44457 9.540654,-16.87731 2.414264,-4.29631 4.117055,-8.38093 1.365995,-1.24602 -1.467519,4.50988 -3.048078,8.44743 -4.024892,12.76082 -1.362027,6.01441 -2.036345,7.46272 -1.413143,9.48859 l 0.476352,1.5485 -0.955023,-0.17247 c -0.322011,-0.0581 -2.544562,-0.20295 -4.930229,-0.43461 l 0,0 z"
           id="path4014-7"
           inkscape:connector-curvature="0"
           sodipodi:nodetypes="cscsccsscscc" />
        <path
           style="fill:none;stroke:#757575;stroke-width:0.37471068;stroke-linecap:butt;stroke-linejoin:round;stroke-miterlimit:4;stroke-opacity:1;stroke-dasharray:none"
           d="m 34.915582,531.81795 c 0,0 -1.122256,0.19538 4.362423,-0.54306 5.484682,-0.73844 19.062977,-32.13311 19.062977,-32.13311 0,0 -11.921116,27.10784 -8.30082,30.78752 3.620295,3.67969 18.536371,-27.92251 18.536371,-27.92251 0,0 -10.949587,28.677 -6.80161,29.14303 4.147977,0.46603 3.55329,0.71817 4.283902,0.44603"
           id="path2985-8"
           inkscape:connector-curvature="0"
           sodipodi:nodetypes="czczczz" />
      </g>
    </g>
    <g
       id="g3701"
       transform="matrix(1.1865377,0,0,1.0396172,-10.189633,-20.189123)">
      <path
         sodipodi:nodetypes="csscssscssccc"
         inkscape:connector-curvature="0"
         id="path4012"
         d="m 40.39513,530.7993 c 1.552374,-2.74059 2.417149,-7.63903 3.239736,-16.84075 0.220606,-2.4678 0.69272,-11.43346 0.714485,-13.56849 l 0.01984,-1.94729 0.118341,1.26001 c 1.349999,14.37409 2.402716,21.94205 3.736435,26.86115 0.352166,1.29889 1.032674,2.95081 1.370928,3.32789 l 0.273555,0.30496 -4.81896,0.55066 c -2.79144,0.31897 -5.097743,0.4243 -5.163905,0.48597 -0.198407,0.18492 -0.01428,-0.0226 0.04049,-0.0189 l 0.573279,-0.71592 z"
         style="fill:#f8e32e;fill-opacity:1;stroke:none" />
      <path
         sodipodi:nodetypes="cscsscssscsccc"
         inkscape:connector-curvature="0"
         id="path4014"
         d="m 55.627647,530.69778 c -2.385665,-0.23166 -4.380207,-0.45634 -4.432311,-0.49928 -0.05211,-0.043 -0.231412,-0.12074 -0.143683,-0.20787 0.667061,-0.66247 1.443906,-4.37155 1.993336,-9.35447 0.515815,-4.67803 1.432597,-14.58972 1.656454,-20.70163 0.05302,-1.44756 0.144216,-2.53002 0.20266,-2.40548 0.05845,0.12455 0.209419,1.33468 0.335494,2.68919 0.503531,5.40972 1.68843,14.64297 2.440152,19.01472 1.003233,5.83444 2.000516,9.48881 3.071286,11.25419 l 0.399491,0.65864 -0.59265,-0.0134 c -0.32596,-0.007 -2.544562,-0.20295 -4.930229,-0.43461 l 0,0 z"
         style="fill:#f8e32e;fill-opacity:1;stroke:none" />
      <path
         sodipodi:nodetypes="czczczz"
         inkscape:connector-curvature="0"
         id="path2985"
         d="m 35.696078,531.62706 c 0,0 -1.902752,0.38627 3.581927,-0.35217 5.484682,-0.73844 4.871417,-40.59161 4.871417,-40.59161 0,0 2.270444,35.56634 5.89074,39.24602 3.620295,3.67969 4.660179,-39.26051 4.660179,-39.26051 0,0 2.982354,40.14226 7.130332,40.54466 4.147977,0.4024 3.386041,0.40003 4.116653,0.12789"
         style="fill:none;stroke:#000000;stroke-width:0.37471068;stroke-linecap:butt;stroke-linejoin:round;stroke-miterlimit:4;stroke-opacity:1;stroke-dasharray:none" />
      <path
         sodipodi:nodetypes="csc"
         inkscape:connector-curvature="0"
         id="path4048"
         d="m 44.11621,496.06582 c 0,0 0.742901,23.21551 3.930852,31.58867 0.681273,1.78936 2.137402,2.55139 2.137402,2.55139"
         style="fill:none;stroke:#000000;stroke-width:0.24980712px;stroke-linecap:butt;stroke-linejoin:miter;stroke-opacity:1" />
      <path
         sodipodi:nodetypes="csc"
         inkscape:connector-curvature="0"
         id="path4048-6"
         d="m 54.729513,496.10632 c 0,0 1.234257,23.78248 4.422208,32.15564 0.681273,1.78937 2.333946,2.89563 2.333946,2.89563"
         style="fill:none;stroke:#000000;stroke-width:0.24980712px;stroke-linecap:butt;stroke-linejoin:miter;stroke-opacity:1" />
      <path
         inkscape:connector-curvature="0"
         id="path4068"
         d="m 59.741305,529.02507 c -0.944172,-1.68431 -2.013008,-6.20584 -2.848189,-12.04876 -0.531086,-3.71548 -1.452254,-12.41993 -1.413157,-13.35342 0.0189,-0.45164 -0.01956,-0.72557 0.430644,3.06685 1.3564,11.42631 2.665516,18.63078 4.034318,22.20211 0.137882,0.35975 0.225713,0.67468 0.195182,0.69985 -0.03053,0.0252 -0.209991,-0.22982 -0.398798,-0.56663 l 0,0 z"
         style="fill:none;stroke:none" />
      <path
         inkscape:connector-curvature="0"
         id="path4070"
         d="m 59.741305,529.02507 c -0.944172,-1.68431 -2.013008,-6.20584 -2.848189,-12.04876 -0.531086,-3.71548 -1.452254,-12.41993 -1.413157,-13.35342 0.0189,-0.45164 -0.01956,-0.72557 0.430644,3.06685 1.3564,11.42631 2.665516,18.63078 4.034318,22.20211 0.137882,0.35975 0.225713,0.67468 0.195182,0.69985 -0.03053,0.0252 -0.209991,-0.22982 -0.398798,-0.56663 l 0,0 z"
         style="fill:none;stroke:none" />
      <path
         inkscape:connector-curvature="0"
         id="path4072"
         d="m 48.539053,528.22573 c -0.952471,-1.7493 -2.065891,-6.91969 -2.797522,-12.99085 -0.419481,-3.4809 -1.102386,-11.41248 -1.075362,-12.48974 0.0065,-0.25834 0.159119,0.95178 0.3392,2.68915 1.25874,12.14416 2.352041,18.97596 3.583493,22.39252 0.165066,0.45796 0.282449,0.84721 0.260854,0.86501 -0.0216,0.0178 -0.161392,-0.19194 -0.310663,-0.46609 z"
         style="fill:none;stroke:none" />
      <path
         inkscape:connector-curvature="0"
         id="path4074"
         d="m 48.933868,528.92992 c -0.382653,-0.52392 -0.646575,-1.0531 -0.915142,-1.83492 -1.383198,-4.02659 -2.516113,-11.68763 -3.24598,-21.95008 -0.138427,-1.94638 -0.305749,-4.83969 -0.287462,-4.97076 0.0086,-0.0615 0.111385,0.88145 0.228463,2.09539 1.117943,11.59164 2.105918,18.6808 3.256595,23.36751 0.287905,1.17264 0.539205,1.96901 0.900963,2.85513 0.145494,0.35639 0.257745,0.6536 0.249455,0.66047 -0.0083,0.007 -0.0924,-0.0933 -0.186892,-0.22274 z"
         style="fill:none;stroke:none" />
      <path
         sodipodi:nodetypes="ssscssss"
         inkscape:connector-curvature="0"
         id="path4076"
         d="m 60.35831,530.1425 c -0.681133,-0.45624 -1.088408,-1.58455 -1.382383,-2.44002 -1.151797,-3.35177 -2.419727,-10.84383 -3.467511,-18.70471 -0.476398,-3.57411 -1.062422,-15.25846 -0.728879,-15.66968 0.450613,0.0904 0.77192,7.37822 0.916013,8.75921 0.523758,5.01974 1.496057,12.80575 2.073903,16.30057 0.935312,5.65679 2.46143,10.10585 3.191594,12.24061 0.100615,0.29416 -0.36965,-0.32985 -0.602737,-0.48598 z"
         style="fill:#000000;fill-opacity:1;stroke:none" />
      <path
         sodipodi:nodetypes="ssscssscs"
         inkscape:connector-curvature="0"
         id="path4078"
         d="m 48.884733,528.97042 c -0.382654,-0.52392 -0.84312,-1.0936 -1.111686,-1.87542 -1.383198,-4.02659 -2.41784,-11.40415 -3.147706,-21.66659 -0.138428,-1.94639 -0.453155,-9.01101 -0.385733,-9.30408 0.05772,-0.91194 0.701011,4.72879 0.818088,5.94272 1.117944,11.59165 2.204189,18.84281 3.354866,23.52952 0.287905,1.17263 0.440935,1.888 0.802693,2.77413 0.145493,0.35638 0.454289,1.38257 0.445998,1.38944 -0.0083,0.007 -0.682025,-0.66034 -0.77652,-0.78972 z"
         style="fill:#000000;fill-opacity:1;stroke:none" />
    </g>
  </g>
</svg>
