%!PS-Adobe-3.0
%%Pages: (atend)
%%BoundingBox: 2 23 774 600
%%HiResBoundingBox: 2.880703 23.400704 773.190733 599.579320
%.......................................
%%Creator: GPL Ghostscript 871 (pswrite)
%%CreationDate: 2011/09/07 15:37:45
%%DocumentData: Clean7Bit
%%LanguageLevel: 2
%%EndComments
%%BeginProlog
% This copyright applies to everything between here and the %%EndProlog:
% Copyright (C) 2010 Artifex Software, Inc.  All rights reserved.
%%BeginResource: procset GS_pswrite_2_0_1001 1.001 0
/GS_pswrite_2_0_1001 80 dict dup begin
/PageSize 2 array def/setpagesize{ PageSize aload pop 3 index eq exch
4 index eq and{ pop pop pop}{ PageSize dup  1
5 -1 roll put 0 4 -1 roll put dup null eq {false} {dup where} ifelse{ exch get exec}
{ pop/setpagedevice where
{ pop 1 dict dup /PageSize PageSize put setpagedevice}
{ /setpage where{ pop PageSize aload pop pageparams 3 {exch pop} repeat
setpage}if}ifelse}ifelse}ifelse} bind def
/!{bind def}bind def/#{load def}!/N/counttomark #
/rG{3{3 -1 roll 255 div}repeat setrgbcolor}!/G{255 div setgray}!/K{0 G}!
/r6{dup 3 -1 roll rG}!/r5{dup 3 1 roll rG}!/r3{dup rG}!
/w/setlinewidth #/J/setlinecap #
/j/setlinejoin #/M/setmiterlimit #/d/setdash #/i/setflat #
/m/moveto #/l/lineto #/c/rcurveto #
/p{N 2 idiv{N -2 roll rlineto}repeat}!
/P{N 0 gt{N -2 roll moveto p}if}!
/h{p closepath}!/H{P closepath}!
/lx{0 rlineto}!/ly{0 exch rlineto}!/v{0 0 6 2 roll c}!/y{2 copy c}!
/re{4 -2 roll m exch dup lx exch ly neg lx h}!
/^{3 index neg 3 index neg}!
/f{P fill}!/f*{P eofill}!/s{H stroke}!/S{P stroke}!
/q/gsave #/Q/grestore #/rf{re fill}!
/Y{P clip newpath}!/Y*{P eoclip newpath}!/rY{re Y}!
/|={pop exch 4 1 roll 1 array astore cvx 3 array astore cvx exch 1 index def exec}!
/|{exch string readstring |=}!
/+{dup type/nametype eq{2 index 7 add -3 bitshift 2 index mul}if}!
/@/currentfile #/${+ @ |}!
/B{{2 copy string{readstring pop}aload pop 4 array astore cvx
3 1 roll}repeat pop pop true}!
/Ix{[1 0 0 1 11 -2 roll exch neg exch neg]exch}!
/,{true exch Ix imagemask}!/If{false exch Ix imagemask}!/I{exch Ix image}!
/Ic{exch Ix false 3 colorimage}!
/F{/Columns counttomark 3 add -2 roll/Rows exch/K -1/BlackIs1 true>>
/CCITTFaxDecode filter}!/FX{<</EndOfBlock false F}!
/X{/ASCII85Decode filter}!/@X{@ X}!/&2{2 index 2 index}!
/@F{@ &2<<F}!/@C{@X &2 FX}!
/$X{+ @X |}!/&4{4 index 4 index}!/$F{+ @ &4<<F |}!/$C{+ @X &4 FX |}!
/IC{3 1 roll 10 dict begin 1{/ImageType/Interpolate/Decode/DataSource
/ImageMatrix/BitsPerComponent/Height/Width}{exch def}forall
currentdict end image}!
/~{@ read {pop} if}!
end def
%%EndResource
/pagesave null def
%%EndProlog
%%Page: 1 1
%%PageBoundingBox: 0 0 792 612
%%BeginPageSetup
GS_pswrite_2_0_1001 begin
792 612 null setpagesize
/pagesave save store 197 dict begin
0.18 0.18 scale
%%EndPageSetup
gsave mark
Q q
0 0 4400 0 0 3400 ^ Y
0.2 i
K
3353.39 469.91 m
4.5 -2.04 7.89 -4.73 10.18 -8.08 c
2.29 -3.35 3.43 -6.94 3.43 -10.79 c
0 -5.97 -2.43 -11.13 -7.29 -15.5 c
-4.86 -4.36 -10.77 -6.55 -17.71 -6.55 c
-6.94 0 -12.85 2.18 -17.71 6.55 c
-4.86 4.37 -7.29 9.53 -7.29 15.5 c
0 3.8 1.17 7.38 3.52 10.72 c
2.34 3.34 5.83 6.06 10.48 8.14 c
-4.15 2.12 -7.18 4.32 -9.07 6.61 c
-2.62 3.24 -3.93 6.83 -3.93 10.75 c
0 5.53 2.35 10.36 7.04 14.51 c
4.7 4.14 10.35 6.22 16.96 6.22 c
6.66 0 12.32 -2.07 16.99 -6.22 c
4.67 -4.14 7.02 -8.98 7.02 -14.51 c
0 -3.93 -1.28 -7.49 -3.84 -10.7 c
-1.8 -2.32 -4.73 -4.55 -8.78 -6.67 c
h
3360 487.43 m
0 4.26 -1.74 7.92 -5.22 10.98 c
-3.48 3.06 -7.75 4.59 -12.81 4.59 c
-5.02 0 -9.27 -1.54 -12.75 -4.62 c
-3.48 -3.08 -5.22 -6.71 -5.22 -10.89 c
0 -3.87 1.72 -7.25 5.16 -10.15 c
3.44 -2.9 7.71 -4.35 12.81 -4.35 c
5.14 0 9.44 1.45 12.88 4.35 c
3.44 2.9 5.16 6.26 5.16 10.09 c
h
3362 451.18 m
0 4.53 -1.92 8.46 -5.74 11.8 c
-3.82 3.34 -8.58 5.02 -14.27 5.02 c
-5.69 0 -10.44 -1.68 -14.26 -5.02 c
-3.82 -3.34 -5.73 -7.25 -5.73 -11.74 c
0 -4.65 1.92 -8.68 5.76 -12.11 c
3.84 -3.43 8.59 -5.14 14.23 -5.14 c
5.64 0 10.39 1.71 14.23 5.14 c
3.84 3.42 5.77 7.44 5.77 12.04 c
h
f
3447 474.71 0 -12.49 P
0 -10.86 -2.8 -19.45 -8.37 -25.77 c
-4.37 -4.96 -9.88 -7.45 -16.53 -7.45 c
-3.2 0 -6.21 0.59 -9.05 1.77 c
-2.83 1.18 -5.24 2.83 -7.23 4.95 c
-1.25 1.32 -2.63 3.45 -4.12 6.37 c
-1.49 2.92 -2.56 5.61 -3.21 8.05 c
-1 3.45 -1.49 7.47 -1.49 12.08 c
0 12.49 p
0 10.89 2.79 19.5 8.36 25.83 c
4.37 4.97 9.88 7.45 16.54 7.45 c
3.24 0 6.27 -0.59 9.07 -1.77 c
2.81 -1.18 5.21 -2.84 7.2 -4.96 c
1.3 -1.36 2.68 -3.5 4.15 -6.43 c
1.47 -2.92 2.55 -5.59 3.24 -7.99 c
0.95 -3.45 1.44 -7.49 1.44 -12.14 c
h
3442 462.96 0 11.14 P
0 4.78 -0.75 9.22 -2.23 13.34 c
-1.48 4.11 -3.15 7.39 -5.01 9.84 c
-1.11 1.4 -2.54 2.61 -4.31 3.61 c
-2.52 1.4 -5.35 2.11 -8.49 2.11 c
-6.23 0 -11.12 -2.89 -14.66 -8.67 c
-3.54 -5.78 -5.3 -12.52 -5.3 -20.23 c
0 -11.14 p
0 -4.78 0.74 -9.23 2.22 -13.37 c
1.48 -4.13 3.17 -7.43 5.07 -9.87 c
1.06 -1.36 2.48 -2.55 4.25 -3.55 c
2.52 -1.45 5.37 -2.17 8.55 -2.17 c
6.19 0 11.05 2.9 14.59 8.7 c
3.54 5.8 5.32 12.55 5.32 20.26 c
h
f
2554.39 462.82 m
3.38 4.49 6.86 7.81 10.43 9.96 c
3.58 2.14 7.55 3.22 11.93 3.22 c
5.81 0 10.96 -2.23 15.47 -6.68 c
4.51 -4.45 6.77 -9.93 6.77 -16.47 c
0 -5.98 -2.05 -11.45 -6.13 -16.41 c
-4.08 -4.96 -9.71 -7.44 -16.88 -7.44 c
-4.68 0 -9.05 1.34 -13.11 4.02 c
-4.06 2.68 -7.25 6.81 -9.57 12.38 c
-2.87 6.93 -4.32 14.6 -4.32 23.01 c
0 6.32 1.37 12.21 4.11 17.66 c
2.09 4.21 4.86 7.9 8.34 11.09 c
3.47 3.18 7.52 5.79 12.15 7.81 c
4.63 2.02 9.63 3.04 15.02 3.04 c
3.65 0 6.69 -0.68 9.12 -2.04 c
1.04 -0.6 1.57 -1.4 1.57 -2.39 c
0 -0.72 -0.25 -1.31 -0.73 -1.77 c
-0.48 -0.46 -1.1 -0.69 -1.84 -0.69 c
-0.57 0 -1.25 0.21 -2.04 0.63 c
-1.8 0.84 -4.04 1.26 -6.71 1.26 c
-8.56 0 -16.36 -3.36 -23.4 -10.07 c
-7.05 -6.7 -10.57 -14.68 -10.57 -23.93 c
0 -1.32 0.13 -3.38 0.39 -6.19 c
h
2556.01 454.23 m
1.65 -7.26 4.25 -12.45 7.79 -15.56 c
3.54 -3.11 7.72 -4.67 12.54 -4.67 c
4.86 0 9.02 1.75 12.48 5.24 c
3.45 3.49 5.19 8.03 5.19 13.62 c
0 5.23 -1.75 9.55 -5.22 12.99 c
-3.48 3.43 -7.41 5.16 -11.79 5.16 c
-4.21 0 -8.28 -1.66 -12.18 -4.98 c
-2.61 -2.2 -5.54 -6.12 -8.8 -11.79 c
h
f
2676 474.71 0 -12.49 P
0 -10.86 -2.8 -19.45 -8.37 -25.77 c
-4.37 -4.96 -9.88 -7.45 -16.53 -7.45 c
-3.2 0 -6.21 0.59 -9.05 1.77 c
-2.83 1.18 -5.24 2.83 -7.23 4.95 c
-1.25 1.32 -2.63 3.45 -4.12 6.37 c
-1.49 2.92 -2.56 5.61 -3.21 8.05 c
-1 3.45 -1.49 7.47 -1.49 12.08 c
0 12.49 p
0 10.89 2.79 19.5 8.36 25.83 c
4.37 4.97 9.88 7.45 16.54 7.45 c
3.24 0 6.27 -0.59 9.07 -1.77 c
2.81 -1.18 5.21 -2.84 7.2 -4.96 c
1.3 -1.36 2.68 -3.5 4.15 -6.43 c
1.47 -2.92 2.55 -5.59 3.24 -7.99 c
0.95 -3.45 1.44 -7.49 1.44 -12.14 c
h
2671 462.96 0 11.14 P
0 4.78 -0.75 9.22 -2.23 13.34 c
-1.48 4.11 -3.15 7.39 -5.01 9.84 c
-1.11 1.4 -2.54 2.61 -4.31 3.61 c
-2.52 1.4 -5.35 2.11 -8.49 2.11 c
-6.23 0 -11.12 -2.89 -14.66 -8.67 c
-3.54 -5.78 -5.3 -12.52 -5.3 -20.23 c
0 -11.14 p
0 -4.78 0.74 -9.23 2.22 -13.37 c
1.48 -4.13 3.17 -7.43 5.07 -9.87 c
1.06 -1.36 2.48 -2.55 4.25 -3.55 c
2.52 -1.45 5.37 -2.17 8.55 -2.17 c
6.19 0 11.05 2.9 14.59 8.7 c
3.54 5.8 5.32 12.55 5.32 20.26 c
h
f
1823 436 0 16 -36.03 0 0 5.79 30.57 48.21 11.46 0 0 -49 4.51 0 P
1.33 0 2.28 -0.23 2.84 -0.68 c
0.56 -0.46 0.84 -1.06 0.84 -1.82 c
0 -0.71 -0.28 -1.31 -0.84 -1.79 c
-0.56 -0.48 -1.5 -0.71 -2.84 -0.71 c
-4.51 0 0 -16 ^ p
1.33 0 2.28 -0.23 2.84 -0.68 c
0.56 -0.46 0.84 -1.06 0.84 -1.82 c
0 -0.71 -0.29 -1.31 -0.85 -1.79 c
-0.57 -0.48 -1.52 -0.71 -2.87 -0.71 c
-20.37 0 p
-1.35 0 -2.3 0.24 -2.87 0.71 c
-0.57 0.48 -0.85 1.07 -0.85 1.79 c
0 0.75 0.27 1.36 0.83 1.82 c
0.55 0.45 1.48 0.68 2.8 0.68 c
h
1792.72 457 30.28 0 0 44 -2.85 0 H
f
1919 474.71 0 -12.49 P
0 -10.86 -2.8 -19.45 -8.37 -25.77 c
-4.37 -4.96 -9.88 -7.45 -16.53 -7.45 c
-3.2 0 -6.21 0.59 -9.05 1.77 c
-2.83 1.18 -5.24 2.83 -7.23 4.95 c
-1.25 1.32 -2.63 3.45 -4.12 6.37 c
-1.49 2.92 -2.56 5.61 -3.21 8.05 c
-1 3.45 -1.49 7.47 -1.49 12.08 c
0 12.49 p
0 10.89 2.79 19.5 8.36 25.83 c
4.37 4.97 9.88 7.45 16.54 7.45 c
3.24 0 6.27 -0.59 9.07 -1.77 c
2.81 -1.18 5.21 -2.84 7.2 -4.96 c
1.3 -1.36 2.68 -3.5 4.15 -6.43 c
1.47 -2.92 2.55 -5.59 3.24 -7.99 c
0.95 -3.45 1.44 -7.49 1.44 -12.14 c
h
1914 462.96 0 11.14 P
0 4.78 -0.75 9.22 -2.23 13.34 c
-1.48 4.11 -3.15 7.39 -5.01 9.84 c
-1.11 1.4 -2.54 2.61 -4.31 3.61 c
-2.52 1.4 -5.35 2.11 -8.49 2.11 c
-6.23 0 -11.12 -2.89 -14.66 -8.67 c
-3.54 -5.78 -5.3 -12.52 -5.3 -20.23 c
0 -11.14 p
0 -4.78 0.74 -9.23 2.22 -13.37 c
1.48 -4.13 3.17 -7.43 5.07 -9.87 c
1.06 -1.36 2.48 -2.55 4.25 -3.55 c
2.52 -1.45 5.37 -2.17 8.55 -2.17 c
6.19 0 11.05 2.9 14.59 8.7 c
3.54 5.8 5.32 12.55 5.32 20.26 c
h
f
1018.52 436.36 0 -0.36 41.48 0 0 1.99 P
0 1.21 0.29 2.07 0.85 2.59 c
0.57 0.52 1.29 0.79 2.19 0.79 c
0.85 0 1.55 -0.26 2.12 -0.78 c
0.57 -0.52 0.85 -1.38 0.85 -2.58 c
0 -7.01 -53 0 0 7.44 p
11.15 9.2 22 18.55 32.54 28.07 c
4.92 4.44 8.3 7.7 10.13 9.78 c
1.83 2.08 3.08 3.91 3.75 5.49 c
0.68 1.58 1.02 3.17 1.02 4.77 c
0 4.32 -1.89 8.14 -5.69 11.46 c
-3.79 3.32 -8.36 5 -13.72 5 c
-4.79 0 -9.04 -1.27 -12.74 -3.8 c
-3.7 -2.53 -6.1 -5.66 -7.19 -9.4 c
-0.26 -0.96 -0.59 -1.59 -0.98 -1.87 c
-0.52 -0.4 -1.14 -0.6 -1.83 -0.6 c
-0.74 0 -1.36 0.23 -1.86 0.69 c
-0.5 0.46 -0.75 1.01 -0.75 1.65 c
0 1.92 1.14 4.51 3.43 7.79 c
2.29 3.27 5.45 5.85 9.48 7.73 c
4.03 1.88 8.16 2.82 12.38 2.82 c
6.84 0 12.72 -2.19 17.64 -6.54 c
4.92 -4.36 7.4 -9.29 7.4 -14.8 c
0 -2.32 -0.42 -4.45 -1.24 -6.38 c
-0.82 -1.94 -2.23 -4.06 -4.2 -6.36 c
-1.98 -2.3 -5.53 -5.77 -10.65 -10.4 c
-12.85 -11.67 -23.32 -20.72 -31.39 -27.16 c
h
f
1147 474.71 0 -12.49 P
0 -10.86 -2.8 -19.45 -8.37 -25.77 c
-4.37 -4.96 -9.88 -7.45 -16.53 -7.45 c
-3.2 0 -6.21 0.59 -9.05 1.77 c
-2.83 1.18 -5.24 2.83 -7.23 4.95 c
-1.25 1.32 -2.63 3.45 -4.12 6.37 c
-1.49 2.92 -2.56 5.61 -3.21 8.05 c
-1 3.45 -1.49 7.47 -1.49 12.08 c
0 12.49 p
0 10.89 2.79 19.5 8.36 25.83 c
4.37 4.97 9.88 7.45 16.54 7.45 c
3.24 0 6.27 -0.59 9.07 -1.77 c
2.81 -1.18 5.21 -2.84 7.2 -4.96 c
1.3 -1.36 2.68 -3.5 4.15 -6.43 c
1.47 -2.92 2.55 -5.59 3.24 -7.99 c
0.95 -3.45 1.44 -7.49 1.44 -12.14 c
h
1142 462.96 0 11.14 P
0 4.78 -0.75 9.22 -2.23 13.34 c
-1.48 4.11 -3.15 7.39 -5.01 9.84 c
-1.11 1.4 -2.54 2.61 -4.31 3.61 c
-2.52 1.4 -5.35 2.11 -8.49 2.11 c
-6.23 0 -11.12 -2.89 -14.66 -8.67 c
-3.54 -5.78 -5.3 -12.52 -5.3 -20.23 c
0 -11.14 p
0 -4.78 0.74 -9.23 2.22 -13.37 c
1.48 -4.13 3.17 -7.43 5.07 -9.87 c
1.06 -1.36 2.48 -2.55 4.25 -3.55 c
2.52 -1.45 5.37 -2.17 8.55 -2.17 c
6.19 0 11.05 2.9 14.59 8.7 c
3.54 5.8 5.32 12.55 5.32 20.26 c
h
f
336 474.71 0 -12.49 P
0 -10.86 -2.8 -19.45 -8.37 -25.77 c
-4.37 -4.96 -9.88 -7.45 -16.53 -7.45 c
-3.2 0 -6.21 0.59 -9.05 1.77 c
-2.83 1.18 -5.24 2.83 -7.23 4.95 c
-1.25 1.32 -2.63 3.45 -4.12 6.37 c
-1.49 2.92 -2.56 5.61 -3.21 8.05 c
-1 3.45 -1.49 7.47 -1.49 12.08 c
0 12.49 p
0 10.89 2.79 19.5 8.36 25.83 c
4.37 4.97 9.88 7.45 16.54 7.45 c
3.24 0 6.27 -0.59 9.07 -1.77 c
2.81 -1.18 5.21 -2.84 7.2 -4.96 c
1.3 -1.36 2.68 -3.5 4.15 -6.43 c
1.47 -2.92 2.55 -5.59 3.24 -7.99 c
0.95 -3.45 1.44 -7.49 1.44 -12.14 c
h
331 462.96 0 11.14 P
0 4.78 -0.75 9.22 -2.23 13.34 c
-1.48 4.11 -3.15 7.39 -5.01 9.84 c
-1.11 1.4 -2.54 2.61 -4.31 3.61 c
-2.52 1.4 -5.35 2.11 -8.49 2.11 c
-6.23 0 -11.12 -2.89 -14.66 -8.67 c
-3.54 -5.78 -5.3 -12.52 -5.3 -20.23 c
0 -11.14 p
0 -4.78 0.74 -9.23 2.22 -13.37 c
1.48 -4.13 3.17 -7.43 5.07 -9.87 c
1.06 -1.36 2.48 -2.55 4.25 -3.55 c
2.52 -1.45 5.37 -2.17 8.55 -2.17 c
6.19 0 11.05 2.9 14.59 8.7 c
3.54 5.8 5.32 12.55 5.32 20.26 c
h
f
Q q
288.023 534.027 27.125 49.8047 re
Y
13.013 w
1 J
1 j
K
q[0 -0.957138 1.04286 0 0 0]concat
-505.89 289.19 -156.15 0 S
Q
Q q
678.562 558.918 27.1211 24.9141 re
Y
13.013 w
1 J
1 j
K
q[0 -0.957138 1.04286 0 0 0]concat
-557.95 663.67 -78.06 0 S
Q
Q q
1070.59 534.027 27.1523 49.8047 re
Y
13.013 w
1 J
1 j
K
q[0 -0.957138 1.04286 0 0 0]concat
-505.89 1039.6 -156.15 0 S
Q
Q q
1461.13 558.918 27.1523 24.9141 re
Y
13.013 w
1 J
1 j
K
q[0 -0.957138 1.04286 0 0 0]concat
-557.95 1414.08 -78.06 0 S
Q
Q q
1853.17 534.027 27.1484 49.8047 re
Y
13.013 w
1 J
1 j
K
q[0 -0.957138 1.04286 0 0 0]concat
-505.89 1790.03 -156.15 0 S
Q
Q q
2231.64 558.918 25.6328 24.9141 re
Y
13.013 w
1 J
1 j
K
q[0 -0.957138 1.04286 0 0 0]concat
-557.95 2152.95 -78.06 0 S
Q
Q q
2622.18 534.027 27.1484 49.8047 re
Y
13.013 w
1 J
1 j
K
q[0 -0.957138 1.04286 0 0 0]concat
-505.89 2527.42 -156.15 0 S
Q
Q q
3014.23 558.918 27.125 24.9141 re
Y
13.013 w
1 J
1 j
K
q[0 -0.957138 1.04286 0 0 0]concat
-557.95 2903.36 -78.06 0 S
Q
Q q
3404.75 534.027 27.1484 49.8047 re
Y
13.013 w
1 J
1 j
K
q[0 -0.957138 1.04286 0 0 0]concat
-505.89 3277.84 -156.15 0 S
Q
Q q
301.582 571.379 3116.76 24.9102 re
Y
13.013 w
1 J
1 j
K
q[0 -0.957138 1.04286 0 0 0]concat
-609.98 -2700.9 0 8967.37 S
Q
Q q
0 0 4400 0 0 3400 ^ Y
0.2 i
K
164 621.71 0 -12.49 P
0 -10.86 -2.8 -19.45 -8.37 -25.77 c
-4.37 -4.96 -9.88 -7.45 -16.53 -7.45 c
-3.2 0 -6.21 0.59 -9.05 1.77 c
-2.83 1.18 -5.24 2.83 -7.23 4.95 c
-1.25 1.32 -2.63 3.45 -4.12 6.37 c
-1.49 2.92 -2.56 5.61 -3.21 8.05 c
-1 3.45 -1.49 7.47 -1.49 12.08 c
0 12.49 p
0 10.89 2.79 19.5 8.36 25.83 c
4.37 4.97 9.88 7.45 16.54 7.45 c
3.24 0 6.27 -0.59 9.07 -1.77 c
2.81 -1.18 5.21 -2.84 7.2 -4.96 c
1.3 -1.36 2.68 -3.5 4.15 -6.43 c
1.47 -2.92 2.55 -5.59 3.24 -7.99 c
0.95 -3.45 1.44 -7.49 1.44 -12.14 c
h
159 609.96 0 11.14 P
0 4.78 -0.75 9.22 -2.23 13.34 c
-1.48 4.11 -3.15 7.39 -5.01 9.84 c
-1.11 1.4 -2.54 2.61 -4.31 3.61 c
-2.52 1.4 -5.35 2.11 -8.49 2.11 c
-6.23 0 -11.12 -2.89 -14.66 -8.67 c
-3.54 -5.78 -5.3 -12.52 -5.3 -20.23 c
0 -11.14 p
0 -4.78 0.74 -9.23 2.22 -13.37 c
1.48 -4.13 3.17 -7.43 5.07 -9.87 c
1.06 -1.36 2.48 -2.55 4.25 -3.55 c
2.52 -1.45 5.37 -2.17 8.55 -2.17 c
6.19 0 11.05 2.9 14.59 8.7 c
3.54 5.8 5.32 12.55 5.32 20.26 c
h
f
22.78 1060.96 25.22 7.27 0 -71.23 18.66 0 P
1.3 0 2.22 -0.23 2.79 -0.68 c
0.56 -0.46 0.85 -1.06 0.85 -1.82 c
0 -0.71 -0.29 -1.31 -0.85 -1.79 c
-0.57 -0.48 -1.5 -0.71 -2.8 -0.71 c
-43.1 0 p
-1.3 0 -2.24 0.24 -2.81 0.71 c
-0.56 0.48 -0.85 1.07 -0.85 1.79 c
0 0.75 0.29 1.36 0.88 1.82 c
0.58 0.45 1.54 0.68 2.89 0.68 c
19.35 0 0 64.26 -18.41 -5.15 p
-0.9 -0.24 -1.55 -0.36 -1.95 -0.36 c
-0.67 0 -1.29 0.25 -1.85 0.75 c
-0.56 0.5 -0.84 1.09 -0.84 1.77 c
0 0.6 0.22 1.16 0.66 1.68 c
0.35 0.32 1.07 0.66 2.17 1.02 c
h
f
150 1035.71 0 -12.49 P
0 -10.86 -2.8 -19.45 -8.37 -25.77 c
-4.37 -4.96 -9.88 -7.45 -16.53 -7.45 c
-3.2 0 -6.21 0.59 -9.05 1.77 c
-2.83 1.18 -5.24 2.83 -7.23 4.95 c
-1.25 1.32 -2.63 3.45 -4.12 6.37 c
-1.49 2.92 -2.56 5.61 -3.21 8.05 c
-1 3.45 -1.49 7.47 -1.49 12.08 c
0 12.49 p
0 10.89 2.79 19.5 8.36 25.83 c
4.37 4.97 9.88 7.45 16.54 7.45 c
3.24 0 6.27 -0.59 9.07 -1.77 c
2.81 -1.18 5.21 -2.84 7.2 -4.96 c
1.3 -1.36 2.68 -3.5 4.15 -6.43 c
1.47 -2.92 2.55 -5.59 3.24 -7.99 c
0.95 -3.45 1.44 -7.49 1.44 -12.14 c
h
145 1023.96 0 11.14 P
0 4.78 -0.75 9.22 -2.23 13.34 c
-1.48 4.11 -3.15 7.39 -5.01 9.84 c
-1.11 1.4 -2.54 2.61 -4.31 3.61 c
-2.52 1.4 -5.35 2.11 -8.49 2.11 c
-6.23 0 -11.12 -2.89 -14.66 -8.67 c
-3.54 -5.78 -5.3 -12.52 -5.3 -20.23 c
0 -11.14 p
0 -4.78 0.74 -9.23 2.22 -13.37 c
1.48 -4.13 3.17 -7.43 5.07 -9.87 c
1.06 -1.36 2.48 -2.55 4.25 -3.55 c
2.52 -1.45 5.37 -2.17 8.55 -2.17 c
6.19 0 11.05 2.9 14.59 8.7 c
3.54 5.8 5.32 12.55 5.32 20.26 c
h
f
21.52 1401.36 0 -0.36 41.48 0 0 1.99 P
0 1.21 0.29 2.07 0.85 2.59 c
0.57 0.52 1.29 0.79 2.19 0.79 c
0.85 0 1.55 -0.26 2.12 -0.78 c
0.57 -0.52 0.85 -1.38 0.85 -2.58 c
0 -7.01 -53 0 0 7.44 p
11.15 9.2 22 18.55 32.54 28.07 c
4.92 4.44 8.3 7.7 10.13 9.78 c
1.83 2.08 3.08 3.91 3.75 5.49 c
0.68 1.58 1.02 3.17 1.02 4.77 c
0 4.32 -1.89 8.14 -5.69 11.46 c
-3.79 3.32 -8.36 5 -13.72 5 c
-4.79 0 -9.04 -1.27 -12.74 -3.8 c
-3.7 -2.53 -6.1 -5.66 -7.19 -9.4 c
-0.26 -0.96 -0.59 -1.59 -0.98 -1.87 c
-0.52 -0.4 -1.14 -0.6 -1.83 -0.6 c
-0.74 0 -1.36 0.23 -1.86 0.69 c
-0.5 0.46 -0.75 1.01 -0.75 1.65 c
0 1.92 1.14 4.51 3.43 7.79 c
2.29 3.27 5.45 5.85 9.48 7.73 c
4.03 1.88 8.16 2.82 12.38 2.82 c
6.84 0 12.72 -2.19 17.64 -6.54 c
4.92 -4.36 7.4 -9.29 7.4 -14.8 c
0 -2.32 -0.42 -4.45 -1.24 -6.38 c
-0.82 -1.94 -2.23 -4.06 -4.2 -6.36 c
-1.98 -2.3 -5.53 -5.77 -10.65 -10.4 c
-12.85 -11.67 -23.32 -20.72 -31.39 -27.16 c
h
f
150 1439.71 0 -12.49 P
0 -10.86 -2.8 -19.45 -8.37 -25.77 c
-4.37 -4.96 -9.88 -7.45 -16.53 -7.45 c
-3.2 0 -6.21 0.59 -9.05 1.77 c
-2.83 1.18 -5.24 2.83 -7.23 4.95 c
-1.25 1.32 -2.63 3.45 -4.12 6.37 c
-1.49 2.92 -2.56 5.61 -3.21 8.05 c
-1 3.45 -1.49 7.47 -1.49 12.08 c
0 12.49 p
0 10.89 2.79 19.5 8.36 25.83 c
4.37 4.97 9.88 7.45 16.54 7.45 c
3.24 0 6.27 -0.59 9.07 -1.77 c
2.81 -1.18 5.21 -2.84 7.2 -4.96 c
1.3 -1.36 2.68 -3.5 4.15 -6.43 c
1.47 -2.92 2.55 -5.59 3.24 -7.99 c
0.95 -3.45 1.44 -7.49 1.44 -12.14 c
h
145 1427.96 0 11.14 P
0 4.78 -0.75 9.22 -2.23 13.34 c
-1.48 4.11 -3.15 7.39 -5.01 9.84 c
-1.11 1.4 -2.54 2.61 -4.31 3.61 c
-2.52 1.4 -5.35 2.11 -8.49 2.11 c
-6.23 0 -11.12 -2.89 -14.66 -8.67 c
-3.54 -5.78 -5.3 -12.52 -5.3 -20.23 c
0 -11.14 p
0 -4.78 0.74 -9.23 2.22 -13.37 c
1.48 -4.13 3.17 -7.43 5.07 -9.87 c
1.06 -1.36 2.48 -2.55 4.25 -3.55 c
2.52 -1.45 5.37 -2.17 8.55 -2.17 c
6.19 0 11.05 2.9 14.59 8.7 c
3.54 5.8 5.32 12.55 5.32 20.26 c
h
f
56.39 1838.83 m
5.07 -2.08 8.95 -4.93 11.61 -8.56 c
2.66 -3.62 4 -7.4 4 -11.32 c
0 -6.05 -2.68 -11.39 -8.02 -16.01 c
-5.34 -4.62 -12.02 -6.94 -20.04 -6.94 c
-4.71 0 -9.59 0.93 -14.64 2.8 c
-5.06 1.86 -8.59 3.77 -10.59 5.72 c
-0.66 0.65 -0.98 1.34 -0.98 2.07 c
0 0.65 0.25 1.22 0.76 1.7 c
0.5 0.49 1.11 0.73 1.82 0.73 c
0.7 0 1.5 -0.31 2.38 -0.93 c
6.82 -4.73 14.04 -7.1 21.66 -7.1 c
6.43 0 11.8 1.84 16.14 5.52 c
4.34 3.68 6.52 7.77 6.52 12.27 c
0 3.02 -1.08 5.97 -3.23 8.86 c
-2.15 2.89 -5.25 5.18 -9.29 6.84 c
-4.04 1.67 -8.12 2.51 -12.25 2.51 c
-1.33 0 -2.29 0.23 -2.86 0.69 c
-0.58 0.46 -0.87 1.07 -0.87 1.83 c
0 0.72 0.27 1.32 0.8 1.8 c
0.54 0.48 1.34 0.72 2.41 0.72 c
4.62 -0.05 p
4.83 0 8.82 1.38 11.96 4.14 c
3.14 2.76 4.71 5.95 4.71 9.59 c
0 3.75 -1.66 7.07 -4.97 9.95 c
-3.32 2.88 -7.65 4.32 -12.99 4.32 c
-3.75 0 -7.2 -0.6 -10.34 -1.8 c
-3.14 -1.2 -5.67 -2.84 -7.56 -4.93 c
-0.69 -0.8 -1.21 -1.29 -1.58 -1.47 c
-0.37 -0.18 -0.79 -0.27 -1.26 -0.27 c
-0.73 0 -1.36 0.23 -1.87 0.69 c
-0.52 0.46 -0.77 1.01 -0.77 1.65 c
0 1.6 1.89 3.61 5.68 6.05 c
5.27 3.39 11.25 5.09 17.96 5.09 c
6.92 0 12.61 -1.91 17.05 -5.74 c
4.44 -3.82 6.66 -8.38 6.66 -13.67 c
0 -3.36 -1.07 -6.55 -3.21 -9.55 c
-2.14 -3 -5.27 -5.41 -9.41 -7.21 c
h
f
150 1841.71 0 -12.49 P
0 -10.86 -2.8 -19.45 -8.37 -25.77 c
-4.37 -4.96 -9.88 -7.45 -16.53 -7.45 c
-3.2 0 -6.21 0.59 -9.05 1.77 c
-2.83 1.18 -5.24 2.83 -7.23 4.95 c
-1.25 1.32 -2.63 3.45 -4.12 6.37 c
-1.49 2.92 -2.56 5.61 -3.21 8.05 c
-1 3.45 -1.49 7.47 -1.49 12.08 c
0 12.49 p
0 10.89 2.79 19.5 8.36 25.83 c
4.37 4.97 9.88 7.45 16.54 7.45 c
3.24 0 6.27 -0.59 9.07 -1.77 c
2.81 -1.18 5.21 -2.84 7.2 -4.96 c
1.3 -1.36 2.68 -3.5 4.15 -6.43 c
1.47 -2.92 2.55 -5.59 3.24 -7.99 c
0.95 -3.45 1.44 -7.49 1.44 -12.14 c
h
145 1829.96 0 11.14 P
0 4.78 -0.75 9.22 -2.23 13.34 c
-1.48 4.11 -3.15 7.39 -5.01 9.84 c
-1.11 1.4 -2.54 2.61 -4.31 3.61 c
-2.52 1.4 -5.35 2.11 -8.49 2.11 c
-6.23 0 -11.12 -2.89 -14.66 -8.67 c
-3.54 -5.78 -5.3 -12.52 -5.3 -20.23 c
0 -11.14 p
0 -4.78 0.74 -9.23 2.22 -13.37 c
1.48 -4.13 3.17 -7.43 5.07 -9.87 c
1.06 -1.36 2.48 -2.55 4.25 -3.55 c
2.52 -1.45 5.37 -2.17 8.55 -2.17 c
6.19 0 11.05 2.9 14.59 8.7 c
3.54 5.8 5.32 12.55 5.32 20.26 c
h
f
55 2218 0 16 -36.03 0 0 5.79 30.57 48.21 11.46 0 0 -49 4.51 0 P
1.33 0 2.28 -0.23 2.84 -0.68 c
0.56 -0.46 0.84 -1.06 0.84 -1.82 c
0 -0.71 -0.28 -1.31 -0.84 -1.79 c
-0.56 -0.48 -1.5 -0.71 -2.84 -0.71 c
-4.51 0 0 -16 ^ p
1.33 0 2.28 -0.23 2.84 -0.68 c
0.56 -0.46 0.84 -1.06 0.84 -1.82 c
0 -0.71 -0.29 -1.31 -0.85 -1.79 c
-0.57 -0.48 -1.52 -0.71 -2.87 -0.71 c
-20.37 0 p
-1.35 0 -2.3 0.24 -2.87 0.71 c
-0.57 0.48 -0.85 1.07 -0.85 1.79 c
0 0.75 0.27 1.36 0.83 1.82 c
0.55 0.45 1.48 0.68 2.8 0.68 c
h
24.72 2239 30.28 0 0 44 -2.85 0 H
f
150 2256.71 0 -12.49 P
0 -10.86 -2.8 -19.45 -8.37 -25.77 c
-4.37 -4.96 -9.88 -7.45 -16.53 -7.45 c
-3.2 0 -6.21 0.59 -9.05 1.77 c
-2.83 1.18 -5.24 2.83 -7.23 4.95 c
-1.25 1.32 -2.63 3.45 -4.12 6.37 c
-1.49 2.92 -2.56 5.61 -3.21 8.05 c
-1 3.45 -1.49 7.47 -1.49 12.08 c
0 12.49 p
0 10.89 2.79 19.5 8.36 25.83 c
4.37 4.97 9.88 7.45 16.54 7.45 c
3.24 0 6.27 -0.59 9.07 -1.77 c
2.81 -1.18 5.21 -2.84 7.2 -4.96 c
1.3 -1.36 2.68 -3.5 4.15 -6.43 c
1.47 -2.92 2.55 -5.59 3.24 -7.99 c
0.95 -3.45 1.44 -7.49 1.44 -12.14 c
h
145 2244.96 0 11.14 P
0 4.78 -0.75 9.22 -2.23 13.34 c
-1.48 4.11 -3.15 7.39 -5.01 9.84 c
-1.11 1.4 -2.54 2.61 -4.31 3.61 c
-2.52 1.4 -5.35 2.11 -8.49 2.11 c
-6.23 0 -11.12 -2.89 -14.66 -8.67 c
-3.54 -5.78 -5.3 -12.52 -5.3 -20.23 c
0 -11.14 p
0 -4.78 0.74 -9.23 2.22 -13.37 c
1.48 -4.13 3.17 -7.43 5.07 -9.87 c
1.06 -1.36 2.48 -2.55 4.25 -3.55 c
2.52 -1.45 5.37 -2.17 8.55 -2.17 c
6.19 0 11.05 2.9 14.59 8.7 c
3.54 5.8 5.32 12.55 5.32 20.26 c
h
f
62.78 2699 -32.78 0 0 -24.52 P
3.23 1.17 6.32 2.05 9.29 2.64 c
2.96 0.59 5.78 0.88 8.44 0.88 c
6.89 0 12.66 -2.22 17.3 -6.65 c
4.64 -4.43 6.97 -10.27 6.97 -17.5 c
0 -7.99 -2.62 -14.46 -7.85 -19.42 c
-5.23 -4.95 -11.77 -7.43 -19.61 -7.43 c
-5.19 0 -10.18 1.07 -14.97 3.22 c
-3.4 1.5 -6.5 3.36 -9.29 5.59 c
-1.66 1.34 -2.48 2.45 -2.48 3.34 c
0 0.73 0.26 1.35 0.78 1.86 c
0.52 0.5 1.13 0.76 1.82 0.76 c
0.73 0 1.51 -0.37 2.33 -1.11 c
6.52 -5.77 13.63 -8.66 21.31 -8.66 c
6.35 0 11.6 2.01 15.74 6.03 c
4.15 4.02 6.22 9.37 6.22 16.05 c
0 5.68 -1.77 10.25 -5.31 13.71 c
-3.54 3.46 -8.04 5.2 -13.5 5.2 c
-5.59 0 -11.17 -1.34 -16.75 -4 c
-1.37 -0.62 -2.32 -0.93 -2.88 -0.93 c
-0.77 0 -1.39 0.24 -1.86 0.71 c
-0.47 0.48 -0.7 1.15 -0.7 2.02 c
0 33.19 37.82 0 p
1.29 0 2.21 -0.23 2.77 -0.71 c
0.56 -0.47 0.84 -1.08 0.84 -1.82 c
0 -0.7 -0.29 -1.29 -0.86 -1.76 c
-0.57 -0.47 -1.5 -0.71 -2.81 -0.71 c
h
f
150 2672.71 0 -12.49 P
0 -10.86 -2.8 -19.45 -8.37 -25.77 c
-4.37 -4.96 -9.88 -7.45 -16.53 -7.45 c
-3.2 0 -6.21 0.59 -9.05 1.77 c
-2.83 1.18 -5.24 2.83 -7.23 4.95 c
-1.25 1.32 -2.63 3.45 -4.12 6.37 c
-1.49 2.92 -2.56 5.61 -3.21 8.05 c
-1 3.45 -1.49 7.47 -1.49 12.08 c
0 12.49 p
0 10.89 2.79 19.5 8.36 25.83 c
4.37 4.97 9.88 7.45 16.54 7.45 c
3.24 0 6.27 -0.59 9.07 -1.77 c
2.81 -1.18 5.21 -2.84 7.2 -4.96 c
1.3 -1.36 2.68 -3.5 4.15 -6.43 c
1.47 -2.92 2.55 -5.59 3.24 -7.99 c
0.95 -3.45 1.44 -7.49 1.44 -12.14 c
h
145 2660.96 0 11.14 P
0 4.78 -0.75 9.22 -2.23 13.34 c
-1.48 4.11 -3.15 7.39 -5.01 9.84 c
-1.11 1.4 -2.54 2.61 -4.31 3.61 c
-2.52 1.4 -5.35 2.11 -8.49 2.11 c
-6.23 0 -11.12 -2.89 -14.66 -8.67 c
-3.54 -5.78 -5.3 -12.52 -5.3 -20.23 c
0 -11.14 p
0 -4.78 0.74 -9.23 2.22 -13.37 c
1.48 -4.13 3.17 -7.43 5.07 -9.87 c
1.06 -1.36 2.48 -2.55 4.25 -3.55 c
2.52 -1.45 5.37 -2.17 8.55 -2.17 c
6.19 0 11.05 2.9 14.59 8.7 c
3.54 5.8 5.32 12.55 5.32 20.26 c
h
f
28.39 3062.82 m
3.38 4.49 6.86 7.81 10.43 9.96 c
3.58 2.14 7.55 3.22 11.93 3.22 c
5.81 0 10.96 -2.23 15.47 -6.68 c
4.51 -4.45 6.77 -9.93 6.77 -16.47 c
0 -5.98 -2.05 -11.45 -6.13 -16.41 c
-4.08 -4.96 -9.71 -7.44 -16.88 -7.44 c
-4.68 0 -9.05 1.34 -13.11 4.02 c
-4.06 2.68 -7.25 6.81 -9.57 12.38 c
-2.87 6.93 -4.32 14.6 -4.32 23.01 c
0 6.32 1.37 12.21 4.11 17.66 c
2.09 4.21 4.86 7.9 8.34 11.09 c
3.47 3.18 7.52 5.79 12.15 7.81 c
4.63 2.02 9.63 3.04 15.02 3.04 c
3.65 0 6.69 -0.68 9.12 -2.04 c
1.04 -0.6 1.57 -1.4 1.57 -2.39 c
0 -0.72 -0.25 -1.31 -0.73 -1.77 c
-0.48 -0.46 -1.1 -0.69 -1.84 -0.69 c
-0.57 0 -1.25 0.21 -2.04 0.63 c
-1.8 0.84 -4.04 1.26 -6.71 1.26 c
-8.56 0 -16.36 -3.36 -23.4 -10.07 c
-7.05 -6.7 -10.57 -14.68 -10.57 -23.93 c
0 -1.32 0.13 -3.38 0.39 -6.19 c
h
30.01 3054.23 m
1.65 -7.26 4.25 -12.45 7.79 -15.56 c
3.54 -3.11 7.72 -4.67 12.54 -4.67 c
4.86 0 9.02 1.75 12.48 5.24 c
3.45 3.49 5.19 8.03 5.19 13.62 c
0 5.23 -1.75 9.55 -5.22 12.99 c
-3.48 3.43 -7.41 5.16 -11.79 5.16 c
-4.21 0 -8.28 -1.66 -12.18 -4.98 c
-2.61 -2.2 -5.54 -6.12 -8.8 -11.79 c
h
f
150 3074.71 0 -12.49 P
0 -10.86 -2.8 -19.45 -8.37 -25.77 c
-4.37 -4.96 -9.88 -7.45 -16.53 -7.45 c
-3.2 0 -6.21 0.59 -9.05 1.77 c
-2.83 1.18 -5.24 2.83 -7.23 4.95 c
-1.25 1.32 -2.63 3.45 -4.12 6.37 c
-1.49 2.92 -2.56 5.61 -3.21 8.05 c
-1 3.45 -1.49 7.47 -1.49 12.08 c
0 12.49 p
0 10.89 2.79 19.5 8.36 25.83 c
4.37 4.97 9.88 7.45 16.54 7.45 c
3.24 0 6.27 -0.59 9.07 -1.77 c
2.81 -1.18 5.21 -2.84 7.2 -4.96 c
1.3 -1.36 2.68 -3.5 4.15 -6.43 c
1.47 -2.92 2.55 -5.59 3.24 -7.99 c
0.95 -3.45 1.44 -7.49 1.44 -12.14 c
h
145 3062.96 0 11.14 P
0 4.78 -0.75 9.22 -2.23 13.34 c
-1.48 4.11 -3.15 7.39 -5.01 9.84 c
-1.11 1.4 -2.54 2.61 -4.31 3.61 c
-2.52 1.4 -5.35 2.11 -8.49 2.11 c
-6.23 0 -11.12 -2.89 -14.66 -8.67 c
-3.54 -5.78 -5.3 -12.52 -5.3 -20.23 c
0 -11.14 p
0 -4.78 0.74 -9.23 2.22 -13.37 c
1.48 -4.13 3.17 -7.43 5.07 -9.87 c
1.06 -1.36 2.48 -2.55 4.25 -3.55 c
2.52 -1.45 5.37 -2.17 8.55 -2.17 c
6.19 0 11.05 2.9 14.59 8.7 c
3.54 5.8 5.32 12.55 5.32 20.26 c
h
f
Q q
247.312 571.379 54.2695 24.9102 re
Y
13.013 w
1 J
1 j
K
q[0 -0.957138 1.04286 0 0 0]concat
-609.98 341.23 0 -156.15 S
Q
Q q
274.434 781.727 27.1484 24.9141 re
Y
13.013 w
1 J
1 j
K
q[0 -0.957138 1.04286 0 0 0]concat
-829.75 315.22 0 -78.08 S
Q
Q q
247.312 992.102 54.2695 24.8945 re
Y
13.013 w
1 J
1 j
K
q[0 -0.957138 1.04286 0 0 0]concat
-1049.54 341.23 0 -156.15 S
Q
Q q
274.434 1191.38 27.1484 24.8945 re
Y
13.013 w
1 J
1 j
K
q[0 -0.957138 1.04286 0 0 0]concat
-1257.75 315.22 0 -78.08 S
Q
Q q
247.312 1401.73 54.2695 24.9141 re
Y
13.013 w
1 J
1 j
K
q[0 -0.957138 1.04286 0 0 0]concat
-1477.53 341.23 0 -156.15 S
Q
Q q
274.434 1612.09 27.1484 24.9102 re
Y
13.013 w
1 J
1 j
K
q[0 -0.957138 1.04286 0 0 0]concat
-1697.29 315.22 0 -78.08 S
Q
Q q
247.312 1809.98 54.2695 24.9102 re
Y
13.013 w
1 J
1 j
K
q[0 -0.957138 1.04286 0 0 0]concat
-1904.05 341.23 0 -156.15 S
Q
Q q
274.434 2020.33 27.1484 24.918 re
Y
13.013 w
1 J
1 j
K
q[0 -0.957138 1.04286 0 0 0]concat
-2123.82 315.22 0 -78.08 S
Q
Q q
247.312 2232.07 54.2695 23.5273 re
Y
13.013 w
1 J
1 j
K
q[0 -0.957138 1.04286 0 0 0]concat
-2343.6 341.23 0 -156.15 S
Q
Q q
274.434 2442.43 27.1484 24.9102 re
Y
13.013 w
1 J
1 j
K
q[0 -0.957138 1.04286 0 0 0]concat
-2564.82 315.22 0 -78.08 S
Q
Q q
247.312 2652.78 54.2695 24.9102 re
Y
13.013 w
1 J
1 j
K
q[0 -0.957138 1.04286 0 0 0]concat
-2784.59 341.23 0 -156.15 S
Q
Q q
274.434 2850.7 27.1484 24.8867 re
Y
13.013 w
1 J
1 j
K
q[0 -0.957138 1.04286 0 0 0]concat
-2991.36 315.22 0 -78.08 S
Q
Q q
247.312 3061.04 54.2695 24.918 re
Y
13.013 w
1 J
1 j
K
q[0 -0.957138 1.04286 0 0 0]concat
-3211.14 341.23 0 -156.15 S
Q
Q q
288.023 583.832 27.125 2489.67 re
Y
13.013 w
1 J
1 j
K
q[0 -0.957138 1.04286 0 0 0]concat
1991.16 289.19 -7803.44 0 S
Q
Q q
342.293 918.75 39.2188 247.723 re
Y
13.013 w
1 J
1 j
K
q[0 -0.957138 1.04286 0 0 0]concat
-1477.53 289.19 776.45 115.68 S
Q
Q q
381.512 868.922 40.7109 49.8281 re
Y
13.013 w
1 J
1 j
K
q[0 -0.957138 1.04286 0 0 0]concat
-1010.5 328.22 154.73 115.68 S
Q
Q q
422.223 868.922 40.7109 172.984 re
Y
13.013 w
1 J
1 j
K
q[0 -0.957138 1.04286 0 0 0]concat
-727.11 365.83 -543.63 117.11 S
Q
Q q
462.934 708.398 27.1289 333.508 re
Y
13.013 w
1 J
1 j
K
q[0 -0.957138 1.04286 0 0 0]concat
-1438.48 417.87 1048.28 78.08 S
Q
Q q
490.062 708.398 40.7109 85.7852 re
Y
13.013 w
1 J
1 j
K
q[0 -0.957138 1.04286 0 0 0]concat
-649.02 430.88 -271.84 117.11 S
Q
Q q
530.773 794.184 40.7109 210.371 re
Y
13.013 w
1 J
1 j
K
q[0 -0.957138 1.04286 0 0 0]concat
-609.98 469.92 -660.77 117.11 S
Q
Q q
571.484 1004.55 40.7109 199.285 re
Y
13.013 w
1 J
1 j
K
q[0 -0.957138 1.04286 0 0 0]concat
-842.76 508.96 -621.75 115.68 S
Q
Q q
612.195 708.398 39.2148 495.441 re
Y
13.013 w
1 J
1 j
K
q[0 -0.957138 1.04286 0 0 0]concat
-1775.36 548 1554.32 115.68 S
Q
Q q
651.41 708.398 40.7109 581.23 re
Y
13.013 w
1 J
1 j
K
q[0 -0.957138 1.04286 0 0 0]concat
-131.39 587.03 -1824.72 115.68 S
Q
Q q
692.121 1004.55 40.7109 285.074 re
Y
13.013 w
1 J
1 j
K
q[0 -0.957138 1.04286 0 0 0]concat
-1645.24 624.64 893.55 117.11 S
Q
Q q
732.832 1004.55 40.7109 247.723 re
Y
13.013 w
1 J
1 j
K
q[0 -0.957138 1.04286 0 0 0]concat
-790.73 663.67 -776.42 117.11 S
Q
Q q
773.543 621.199 40.7109 631.078 re
Y
13.013 w
1 J
1 j
K
q[0 -0.957138 1.04286 0 0 0]concat
-1969.12 702.71 1980.87 117.12 S
Q
Q q
814.254 621.199 27.1523 247.723 re
Y
13.013 w
1 J
1 j
K
q[0 -0.957138 1.04286 0 0 0]concat
-390.21 754.76 -776.44 78.08 S
Q
Q q
841.406 794.184 40.7109 74.7383 re
Y
13.013 w
1 J
1 j
K
q[0 -0.957138 1.04286 0 0 0]concat
-985.92 767.79 234.24 115.66 S
Q
Q q
882.117 794.184 39.1953 372.289 re
Y
13.013 w
1 J
1 j
K
q[0 -0.957138 1.04286 0 0 0]concat
-442.27 806.82 -1163.93 115.66 S
Q
Q q
921.312 1129.1 40.7109 37.3711 re
Y
13.013 w
1 J
1 j
K
q[0 -0.957138 1.04286 0 0 0]concat
-1257.75 845.86 117.13 115.66 S
Q
Q q
962.023 1041.91 40.7109 87.1953 re
Y
13.013 w
1 J
1 j
K
q[0 -0.957138 1.04286 0 0 0]concat
-1270.74 883.45 271.81 117.11 S
Q
Q q
1002.73 1041.91 40.7109 161.934 re
Y
13.013 w
1 J
1 j
K
q[0 -0.957138 1.04286 0 0 0]concat
-920.85 922.48 -504.61 117.11 S
Q
Q q
1043.45 868.922 40.7109 334.918 re
Y
13.013 w
1 J
1 j
K
q[0 -0.957138 1.04286 0 0 0]concat
-1606.19 961.52 1048.25 117.12 S
Q
Q q
1084.16 708.398 40.7148 160.523 re
Y
13.013 w
1 J
1 j
K
q[0 -0.957138 1.04286 0 0 0]concat
-1075.55 1000.56 504.62 117.12 S
Q
Q q
1124.87 708.398 40.7109 333.508 re
Y
13.013 w
1 J
1 j
K
q[0 -0.957138 1.04286 0 0 0]concat
-390.21 1039.6 -1048.28 115.68 S
Q
Q q
1165.58 708.398 25.6523 333.508 re
Y
13.013 w
1 J
1 j
K
q[0 -0.957138 1.04286 0 0 0]concat
-1438.48 1091.67 1048.28 76.62 S
Q
Q q
1191.23 708.398 40.7109 420.703 re
Y
13.013 w
1 J
1 j
K
q[0 -0.957138 1.04286 0 0 0]concat
-299.13 1104.67 -1320.08 115.68 S
Q
Q q
1231.95 831.555 40.7109 297.547 re
Y
13.013 w
1 J
1 j
K
q[0 -0.957138 1.04286 0 0 0]concat
-1490.54 1142.27 932.59 117.11 S
Q
Q q
1272.66 819.102 40.7109 24.9102 re
Y
13.013 w
1 J
1 j
K
q[0 -0.957138 1.04286 0 0 0]concat
-868.79 1181.31 0 117.11 S
Q
Q q
1313.37 744.379 40.7109 87.1758 re
Y
13.013 w
1 J
1 j
K
q[0 -0.957138 1.04286 0 0 0]concat
-959.89 1220.35 271.83 117.11 S
Q
Q q
1354.08 744.379 40.7109 507.898 re
Y
13.013 w
1 J
1 j
K
q[0 -0.957138 1.04286 0 0 0]concat
-247.07 1259.39 -1591.91 117.12 S
Q
Q q
1394.79 1252.28 40.7148 780.512 re
Y
13.013 w
1 J
1 j
K
q[0 -0.957138 1.04286 0 0 0]concat
-492.87 1298.42 -2446.44 115.66 S
Q
Q q
1435.5 2032.79 39.1914 459.461 re
Y
13.013 w
1 J
1 j
K
q[0 -0.957138 1.04286 0 0 0]concat
-1645.24 1337.46 -1437.21 115.66 S
Q
Q q
1474.7 671.027 40.7109 1821.22 re
Y
13.013 w
1 J
1 j
K
q[0 -0.957138 1.04286 0 0 0]concat
-4505.19 1376.5 5706.89 115.66 S
Q
Q q
1515.41 671.027 27.1484 532.812 re
Y
13.013 w
1 J
1 j
K
q[0 -0.957138 1.04286 0 0 0]concat
-144.41 1427.12 -1668.54 78.08 S
Q
Q q
1542.55 1203.84 40.7109 172.98 re
Y
13.013 w
1 J
1 j
K
q[0 -0.957138 1.04286 0 0 0]concat
-1075.55 1440.12 -543.66 117.11 S
Q
Q q
1583.27 744.379 40.7109 632.441 re
Y
13.013 w
1 J
1 j
K
q[0 -0.957138 1.04286 0 0 0]concat
-2097.79 1479.15 1979.42 117.12 S
Q
Q q
1623.98 744.379 40.7188 384.723 re
Y
13.013 w
1 J
1 j
K
q[0 -0.957138 1.04286 0 0 0]concat
-377.19 1518.19 -1202.97 117.12 S
Q
Q q
1664.7 1004.55 40.7109 124.547 re
Y
13.013 w
1 J
1 j
K
q[0 -0.957138 1.04286 0 0 0]concat
-1308.36 1557.23 387.5 115.68 S
Q
Q q
1705.41 1004.55 39.2109 37.3516 re
Y
13.013 w
1 J
1 j
K
q[0 -0.957138 1.04286 0 0 0]concat
-1010.5 1596.28 -117.1 115.67 S
Q
Q q
1744.62 831.555 40.7109 210.352 re
Y
13.013 w
1 J
1 j
K
q[0 -0.957138 1.04286 0 0 0]concat
-1308.36 1635.31 659.34 115.67 S
Q
Q q
1785.33 831.555 40.7148 582.641 re
Y
13.013 w
1 J
1 j
K
q[0 -0.957138 1.04286 0 0 0]concat
-260.09 1672.91 -1824.69 117.12 S
Q
Q q
1826.04 1327 40.7109 87.1992 re
Y
13.013 w
1 J
1 j
K
q[0 -0.957138 1.04286 0 0 0]concat
-1567.15 1711.95 271.8 117.12 S
Q
Q q
1866.75 1252.28 27.125 74.7188 re
Y
13.013 w
1 J
1 j
K
q[0 -0.957138 1.04286 0 0 0]concat
-1464.51 1764 232.79 78.08 S
Q
Q q
1893.88 1252.28 40.7148 247.699 re
Y
13.013 w
1 J
1 j
K
q[0 -0.957138 1.04286 0 0 0]concat
-1049.54 1777 -776.42 117.12 S
Q
Q q
1934.59 1499.98 40.7109 74.7383 re
Y
13.013 w
1 J
1 j
K
q[0 -0.957138 1.04286 0 0 0]concat
-1490.54 1816.04 -232.78 115.68 S
Q
Q q
1975.3 1537.35 39.2109 37.3633 re
Y
13.013 w
1 J
1 j
K
q[0 -0.957138 1.04286 0 0 0]concat
-1684.28 1855.08 117.13 115.67 S
Q
Q q
2014.52 1327 40.7109 210.355 re
Y
13.013 w
1 J
1 j
K
q[0 -0.957138 1.04286 0 0 0]concat
-1825.97 1894.12 659.32 115.68 S
Q
Q q
2055.23 1252.28 40.7188 74.7188 re
Y
13.013 w
1 J
1 j
K
q[0 -0.957138 1.04286 0 0 0]concat
-1464.51 1931.72 232.79 117.12 S
Q
Q q
2095.95 1252.28 40.7109 322.438 re
Y
13.013 w
1 J
1 j
K
q[0 -0.957138 1.04286 0 0 0]concat
-972.91 1970.76 -1009.23 117.12 S
Q
Q q
2136.66 1574.71 40.7109 49.8281 re
Y
13.013 w
1 J
1 j
K
q[0 -0.957138 1.04286 0 0 0]concat
-1593.18 2009.8 -156.17 117.11 S
Q
Q q
2177.37 1252.28 27.1445 372.266 re
Y
13.013 w
1 J
1 j
K
q[0 -0.957138 1.04286 0 0 0]concat
-2084.78 2061.84 1163.93 78.08 S
Q
Q q
2204.51 1252.28 40.7148 322.438 re
Y
13.013 w
1 J
1 j
K
q[0 -0.957138 1.04286 0 0 0]concat
-972.91 2074.87 -1009.23 115.66 S
Q
Q q
2245.23 1414.2 39.1914 160.52 re
Y
13.013 w
1 J
1 j
K
q[0 -0.957138 1.04286 0 0 0]concat
-1812.95 2113.91 504.6 115.66 S
Q
Q q
2284.42 1414.2 40.7109 85.7812 re
Y
13.013 w
1 J
1 j
K
q[0 -0.957138 1.04286 0 0 0]concat
-1386.42 2152.95 -271.83 115.66 S
Q
Q q
2325.13 1499.98 40.7148 199.285 re
Y
13.013 w
1 J
1 j
K
q[0 -0.957138 1.04286 0 0 0]concat
-1360.4 2190.53 -621.74 117.12 S
Q
Q q
2365.84 1699.26 40.7109 48.4375 re
Y
13.013 w
1 J
1 j
K
q[0 -0.957138 1.04286 0 0 0]concat
-1723.32 2229.56 -154.7 117.12 S
Q
Q q
2406.55 1747.7 40.7109 37.3672 re
Y
13.013 w
1 J
1 j
K
q[0 -0.957138 1.04286 0 0 0]concat
-1788.37 2268.61 -115.68 117.11 S
Q
Q q
2447.27 1785.07 40.7109 124.566 re
Y
13.013 w
1 J
1 j
K
q[0 -0.957138 1.04286 0 0 0]concat
-1736.34 2307.64 -387.48 115.68 S
Q
Q q
2487.98 1909.63 39.2188 85.7891 re
Y
13.013 w
1 J
1 j
K
q[0 -0.957138 1.04286 0 0 0]concat
-1904.05 2346.68 -271.83 115.68 S
Q
Q q
2527.2 1699.26 27.1211 296.16 re
Y
13.013 w
1 J
1 j
K
q[0 -0.957138 1.04286 0 0 0]concat
-2395.66 2398.75 931.15 76.62 S
Q
Q q
2554.32 1699.26 40.7109 333.527 re
Y
13.013 w
1 J
1 j
K
q[0 -0.957138 1.04286 0 0 0]concat
-1425.47 2411.76 -1048.28 115.66 S
Q
Q q
2595.03 2032.79 40.7188 174.371 re
Y
13.013 w
1 J
1 j
K
q[0 -0.957138 1.04286 0 0 0]concat
-1943.1 2449.33 -543.66 117.14 S
Q
Q q
2635.75 2157.36 40.7305 49.8047 re
Y
13.013 w
1 J
1 j
K
q[0 -0.957138 1.04286 0 0 0]concat
-2356.61 2488.37 154.7 117.14 S
Q
Q q
2676.48 2157.36 40.7109 85.7891 re
Y
13.013 w
1 J
1 j
K
q[0 -0.957138 1.04286 0 0 0]concat
-2162.87 2527.42 -271.83 117.13 S
Q
Q q
2717.19 2082.62 40.7109 160.527 re
Y
13.013 w
1 J
1 j
K
q[0 -0.957138 1.04286 0 0 0]concat
-2512.76 2566.47 504.59 115.66 S
Q
Q q
2757.9 2082.62 39.1953 247.723 re
Y
13.013 w
1 J
1 j
K
q[0 -0.957138 1.04286 0 0 0]concat
-1917.07 2605.51 -776.44 115.66 S
Q
Q q
2797.09 2157.36 40.7109 172.984 re
Y
13.013 w
1 J
1 j
K
q[0 -0.957138 1.04286 0 0 0]concat
-2615.42 2644.55 542.21 115.66 S
Q
Q q
2837.8 2157.36 40.7109 507.879 re
Y
13.013 w
1 J
1 j
K
q[0 -0.957138 1.04286 0 0 0]concat
-1723.32 2682.13 -1591.91 117.11 S
Q
Q q
2878.52 2665.23 27.1523 74.7383 re
Y
13.013 w
1 J
1 j
K
q[0 -0.957138 1.04286 0 0 0]concat
-2706.52 2734.17 -232.79 78.08 S
Q
Q q
342.293 831.555 66.3477 49.8242 re
Y
39.0389 w
1 J
1 j
K
q[0 -0.957138 1.04286 0 0 0]concat
-894.82 302.2 0 115.68 S
Q
Q q
381.512 831.555 67.8398 49.8242 re
Y
39.0389 w
1 J
1 j
K
q[0 -0.957138 1.04286 0 0 0]concat
-894.82 341.23 0 115.68 S
Q
Q q
422.223 831.555 67.8398 49.8242 re
Y
39.0389 w
1 J
1 j
K
q[0 -0.957138 1.04286 0 0 0]concat
-894.82 378.83 0 117.12 S
Q
Q q
462.934 683.484 54.2773 185.438 re
Y
39.0389 w
1 J
1 j
K
q[0 -0.957138 1.04286 0 0 0]concat
-1062.53 430.88 504.59 78.08 S
Q
Q q
490.062 671.027 67.8594 48.4375 re
Y
39.0389 w
1 J
1 j
K
q[0 -0.957138 1.04286 0 0 0]concat
-727.11 443.91 0 117.11 S
Q
Q q
530.773 671.027 67.8594 48.4375 re
Y
39.0389 w
1 J
1 j
K
q[0 -0.957138 1.04286 0 0 0]concat
-727.11 482.94 0 117.12 S
Q
Q q
571.484 671.027 67.8594 48.4375 re
Y
39.0389 w
1 J
1 j
K
q[0 -0.957138 1.04286 0 0 0]concat
-727.11 521.98 0 115.66 S
Q
Q q
612.195 671.027 66.3672 48.4375 re
Y
39.0389 w
1 J
1 j
K
q[0 -0.957138 1.04286 0 0 0]concat
-727.11 561.02 0 115.66 S
Q
Q q
651.41 671.027 67.8633 48.4375 re
Y
39.0389 w
1 J
1 j
K
q[0 -0.957138 1.04286 0 0 0]concat
-727.11 600.07 0 115.66 S
Q
Q q
692.121 671.027 67.8633 48.4375 re
Y
39.0389 w
1 J
1 j
K
q[0 -0.957138 1.04286 0 0 0]concat
-727.11 637.64 0 117.12 S
Q
Q q
732.832 671.027 67.8633 48.4375 re
Y
39.0389 w
1 J
1 j
K
q[0 -0.957138 1.04286 0 0 0]concat
-727.11 676.68 0 117.12 S
Q
Q q
773.543 596.289 67.8633 112.109 re
Y
39.0389 w
1 J
1 j
K
q[0 -0.957138 1.04286 0 0 0]concat
-816.73 715.72 271.8 117.12 S
Q
Q q
814.254 596.289 54.2812 112.109 re
Y
39.0389 w
1 J
1 j
K
q[0 -0.957138 1.04286 0 0 0]concat
-544.93 767.79 -271.8 78.08 S
Q
Q q
841.406 671.027 67.8398 48.4375 re
Y
39.0389 w
1 J
1 j
K
q[0 -0.957138 1.04286 0 0 0]concat
-727.11 780.79 0 115.68 S
Q
Q q
882.117 671.027 66.3438 48.4375 re
Y
39.0389 w
1 J
1 j
K
q[0 -0.957138 1.04286 0 0 0]concat
-727.11 819.83 0 115.67 S
Q
Q q
921.312 671.027 67.8594 48.4375 re
Y
39.0389 w
1 J
1 j
K
q[0 -0.957138 1.04286 0 0 0]concat
-727.11 858.87 0 115.67 S
Q
Q q
962.023 671.027 67.8594 48.4375 re
Y
39.0389 w
1 J
1 j
K
q[0 -0.957138 1.04286 0 0 0]concat
-727.11 896.47 0 117.12 S
Q
Q q
1002.73 671.027 67.8594 48.4375 re
Y
39.0389 w
1 J
1 j
K
q[0 -0.957138 1.04286 0 0 0]concat
-727.11 935.51 0 117.12 S
Q
Q q
1043.45 671.027 67.8594 48.4375 re
Y
39.0389 w
1 J
1 j
K
q[0 -0.957138 1.04286 0 0 0]concat
-727.11 974.55 0 117.12 S
Q
Q q
1084.16 671.027 67.8594 48.4375 re
Y
39.0389 w
1 J
1 j
K
q[0 -0.957138 1.04286 0 0 0]concat
-727.11 1013.59 0 117.11 S
Q
Q q
1124.87 671.027 66.3633 48.4375 re
Y
39.0389 w
1 J
1 j
K
q[0 -0.957138 1.04286 0 0 0]concat
-727.11 1052.63 0 115.66 S
Q
Q q
1165.58 671.027 52.7773 48.4375 re
Y
39.0389 w
1 J
1 j
K
q[0 -0.957138 1.04286 0 0 0]concat
-727.11 1104.67 0 76.64 S
Q
Q q
1191.23 671.027 67.8359 48.4375 re
Y
39.0389 w
1 J
1 j
K
q[0 -0.957138 1.04286 0 0 0]concat
-727.11 1117.68 0 115.68 S
Q
Q q
1231.95 671.027 67.8398 48.4375 re
Y
39.0389 w
1 J
1 j
K
q[0 -0.957138 1.04286 0 0 0]concat
-727.11 1155.28 0 117.12 S
Q
Q q
1272.66 671.027 67.8398 48.4375 re
Y
39.0389 w
1 J
1 j
K
q[0 -0.957138 1.04286 0 0 0]concat
-727.11 1194.31 0 117.12 S
Q
Q q
1313.37 671.027 67.8398 48.4375 re
Y
39.0389 w
1 J
1 j
K
q[0 -0.957138 1.04286 0 0 0]concat
-727.11 1233.36 0 117.11 S
Q
Q q
1354.08 671.027 67.8398 48.4375 re
Y
39.0389 w
1 J
1 j
K
q[0 -0.957138 1.04286 0 0 0]concat
-727.11 1272.4 0 117.11 S
Q
Q q
1394.79 671.027 66.3438 48.4375 re
Y
39.0389 w
1 J
1 j
K
q[0 -0.957138 1.04286 0 0 0]concat
-727.11 1311.43 0 115.68 S
Q
Q q
1435.5 671.027 66.3398 48.4375 re
Y
39.0389 w
1 J
1 j
K
q[0 -0.957138 1.04286 0 0 0]concat
-727.11 1350.47 0 115.68 S
Q
Q q
1474.7 646.117 67.8594 62.2812 re
Y
52.0519 w
1 J
1 j
K
q[0 -0.957138 1.04286 0 0 0]concat
-764.7 1389.51 115.68 115.68 S
Q
Q q
1515.41 646.117 54.3008 98.2617 re
Y
39.0389 w
1 J
1 j
K
q[0 -0.957138 1.04286 0 0 0]concat
-609.98 1440.12 -232.79 78.08 S
Q
Q q
1542.55 708.398 67.8633 48.4336 re
Y
39.0389 w
1 J
1 j
K
q[0 -0.957138 1.04286 0 0 0]concat
-764.7 1453.12 0 117.12 S
Q
Q q
1583.27 708.398 67.8633 48.4336 re
Y
39.0389 w
1 J
1 j
K
q[0 -0.957138 1.04286 0 0 0]concat
-764.7 1492.16 0 117.11 S
Q
Q q
1623.98 719.465 67.8633 112.09 re
Y
39.0389 w
1 J
1 j
K
q[0 -0.957138 1.04286 0 0 0]concat
-675.05 1531.2 -271.83 115.68 S
Q
Q q
1664.7 794.184 66.3398 49.8281 re
Y
39.0389 w
1 J
1 j
K
q[0 -0.957138 1.04286 0 0 0]concat
-855.78 1570.24 0 115.68 S
Q
Q q
1705.41 794.184 66.3398 49.8281 re
Y
39.0389 w
1 J
1 j
K
q[0 -0.957138 1.04286 0 0 0]concat
-855.78 1609.28 0 115.68 S
Q
Q q
1744.62 794.184 67.8398 49.8281 re
Y
39.0389 w
1 J
1 j
K
q[0 -0.957138 1.04286 0 0 0]concat
-855.78 1646.88 0 117.11 S
Q
Q q
1785.33 806.641 67.8398 445.637 re
Y
39.0389 w
1 J
1 j
K
q[0 -0.957138 1.04286 0 0 0]concat
-416.24 1685.92 -1320.1 117.11 S
Q
Q q
1826.04 1216.28 67.8359 48.4336 re
Y
39.0389 w
1 J
1 j
K
q[0 -0.957138 1.04286 0 0 0]concat
-1295.35 1724.96 0 117.11 S
Q
Q q
1866.75 1216.28 54.2734 48.4336 re
Y
39.0389 w
1 J
1 j
K
q[0 -0.957138 1.04286 0 0 0]concat
-1295.35 1777 0 78.08 S
Q
Q q
1893.88 1216.28 67.8594 48.4336 re
Y
39.0389 w
1 J
1 j
K
q[0 -0.957138 1.04286 0 0 0]concat
-1295.35 1790.03 0 115.66 S
Q
Q q
1934.59 1216.28 66.3633 48.4336 re
Y
39.0389 w
1 J
1 j
K
q[0 -0.957138 1.04286 0 0 0]concat
-1295.35 1829.07 0 115.66 S
Q
Q q
1975.3 1216.28 66.3633 48.4336 re
Y
39.0389 w
1 J
1 j
K
q[0 -0.957138 1.04286 0 0 0]concat
-1295.35 1868.11 0 115.66 S
Q
Q q
2014.52 1216.28 67.8633 48.4336 re
Y
39.0389 w
1 J
1 j
K
q[0 -0.957138 1.04286 0 0 0]concat
-1295.35 1905.69 0 117.11 S
Q
Q q
2055.23 1216.28 67.8633 48.4336 re
Y
39.0389 w
1 J
1 j
K
q[0 -0.957138 1.04286 0 0 0]concat
-1295.35 1944.73 0 117.11 S
Q
Q q
2095.95 1216.28 67.8555 48.4336 re
Y
39.0389 w
1 J
1 j
K
q[0 -0.957138 1.04286 0 0 0]concat
-1295.35 1983.76 0 117.12 S
Q
Q q
2136.66 1216.28 67.8555 48.4336 re
Y
39.0389 w
1 J
1 j
K
q[0 -0.957138 1.04286 0 0 0]concat
-1295.35 2022.8 0 117.12 S
Q
Q q
2177.37 1216.28 54.2734 48.4336 re
Y
39.0389 w
1 J
1 j
K
q[0 -0.957138 1.04286 0 0 0]concat
-1295.35 2074.87 0 78.08 S
Q
Q q
2204.51 1227.37 66.3438 186.828 re
Y
39.0389 w
1 J
1 j
K
q[0 -0.957138 1.04286 0 0 0]concat
-1127.61 2087.88 -504.62 115.66 S
Q
Q q
2245.23 1376.82 66.3398 49.8281 re
Y
39.0389 w
1 J
1 j
K
q[0 -0.957138 1.04286 0 0 0]concat
-1464.51 2126.91 0 115.68 S
Q
Q q
2284.42 1389.28 67.8594 110.699 re
Y
39.0389 w
1 J
1 j
K
q[0 -0.957138 1.04286 0 0 0]concat
-1373.41 2164.5 -271.83 117.14 S
Q
Q q
2325.13 1475.09 67.8594 224.172 re
Y
39.0389 w
1 J
1 j
K
q[0 -0.957138 1.04286 0 0 0]concat
-1347.38 2203.54 -621.74 117.14 S
Q
Q q
2365.84 1661.92 67.8555 49.7969 re
Y
39.0389 w
1 J
1 j
K
q[0 -0.957138 1.04286 0 0 0]concat
-1762.34 2242.59 0 117.12 S
Q
Q q
2406.55 1661.92 67.8633 49.7969 re
Y
39.0389 w
1 J
1 j
K
q[0 -0.957138 1.04286 0 0 0]concat
-1762.34 2281.63 0 117.11 S
Q
Q q
2447.27 1661.92 67.8633 49.7969 re
Y
39.0389 w
1 J
1 j
K
q[0 -0.957138 1.04286 0 0 0]concat
-1762.34 2320.67 0 115.66 S
Q
Q q
2487.98 1661.92 66.3398 49.7969 re
Y
39.0389 w
1 J
1 j
K
q[0 -0.957138 1.04286 0 0 0]concat
-1762.34 2359.71 0 115.66 S
Q
Q q
2527.2 1661.92 54.2695 49.7969 re
Y
39.0389 w
1 J
1 j
K
q[0 -0.957138 1.04286 0 0 0]concat
-1762.34 2411.76 0 76.61 S
Q
Q q
2554.32 1674.37 67.8633 358.418 re
Y
39.0389 w
1 J
1 j
K
q[0 -0.957138 1.04286 0 0 0]concat
-1412.45 2423.33 -1048.28 117.11 S
Q
Q q
2595.03 2007.88 67.8633 74.7383 re
Y
52.0519 w
1 J
1 j
K
q[0 -0.957138 1.04286 0 0 0]concat
-2060.2 2462.36 -154.73 117.11 S
Q
Q q
2635.75 2045.25 67.8555 49.8242 re
Y
39.0389 w
1 J
1 j
K
q[0 -0.957138 1.04286 0 0 0]concat
-2162.87 2501.4 0 117.11 S
Q
Q q
2676.48 2045.25 67.8398 49.8242 re
Y
39.0389 w
1 J
1 j
K
q[0 -0.957138 1.04286 0 0 0]concat
-2162.87 2540.44 0 117.11 S
Q
Q q
2717.19 2045.25 67.8398 49.8242 re
Y
39.0389 w
1 J
1 j
K
q[0 -0.957138 1.04286 0 0 0]concat
-2162.87 2579.48 0 115.66 S
Q
Q q
2757.9 2057.71 66.3398 99.6484 re
Y
52.0519 w
1 J
1 j
K
q[0 -0.957138 1.04286 0 0 0]concat
-2084.78 2618.51 -234.24 115.66 S
Q
Q q
2797.09 2119.99 67.8555 49.8008 re
Y
39.0389 w
1 J
1 j
K
q[0 -0.957138 1.04286 0 0 0]concat
-2240.95 2657.55 0 115.66 S
Q
Q q
2837.8 2132.45 67.8633 148.066 re
Y
39.0389 w
1 J
1 j
K
q[0 -0.957138 1.04286 0 0 0]concat
-2110.81 2695.14 -388.96 117.11 S
Q
Q q
2878.52 2243.14 54.2734 49.8203 re
Y
39.0389 w
1 J
1 j
K
q[0 -0.957138 1.04286 0 0 0]concat
-2369.63 2747.2 0 78.08 S
Q
Q q
342.293 1166.47 66.3477 49.8047 re
Y
39.0389 w
1 J
1 j
K
q[0 -0.957138 1.04286 0 0 0]concat
-1244.73 302.2 0 115.68 S
Q
Q q
381.512 1166.47 67.8398 49.8047 re
Y
39.0389 w
1 J
1 j
K
q[0 -0.957138 1.04286 0 0 0]concat
-1244.73 341.23 0 115.68 S
Q
Q q
422.223 1166.47 67.8398 49.8047 re
Y
39.0389 w
1 J
1 j
K
q[0 -0.957138 1.04286 0 0 0]concat
-1244.73 378.83 0 117.12 S
Q
Q q
462.934 1166.47 54.2773 49.8047 re
Y
39.0389 w
1 J
1 j
K
q[0 -0.957138 1.04286 0 0 0]concat
-1244.73 430.88 0 78.08 S
Q
Q q
490.062 1166.47 67.8594 49.8047 re
Y
39.0389 w
1 J
1 j
K
q[0 -0.957138 1.04286 0 0 0]concat
-1244.73 443.91 0 117.11 S
Q
Q q
530.773 1166.47 67.8594 49.8047 re
Y
39.0389 w
1 J
1 j
K
q[0 -0.957138 1.04286 0 0 0]concat
-1244.73 482.94 0 117.12 S
Q
Q q
571.484 1166.47 67.8594 49.8047 re
Y
39.0389 w
1 J
1 j
K
q[0 -0.957138 1.04286 0 0 0]concat
-1244.73 521.98 0 115.66 S
Q
Q q
612.195 1166.47 66.3672 49.8047 re
Y
39.0389 w
1 J
1 j
K
q[0 -0.957138 1.04286 0 0 0]concat
-1244.73 561.02 0 115.66 S
Q
Q q
651.41 1178.93 67.8633 110.699 re
Y
39.0389 w
1 J
1 j
K
q[0 -0.957138 1.04286 0 0 0]concat
-1153.63 600.07 -271.83 115.66 S
Q
Q q
692.121 1227.37 67.8633 62.2617 re
Y
52.0519 w
1 J
1 j
K
q[0 -0.957138 1.04286 0 0 0]concat
-1373.41 637.64 115.66 117.12 S
Q
Q q
732.832 1216.28 67.8633 48.4336 re
Y
39.0389 w
1 J
1 j
K
q[0 -0.957138 1.04286 0 0 0]concat
-1295.35 676.68 0 117.12 S
Q
Q q
773.543 1178.93 67.8633 73.3477 re
Y
52.0519 w
1 J
1 j
K
q[0 -0.957138 1.04286 0 0 0]concat
-1347.38 715.72 154.7 117.12 S
Q
Q q
814.254 1166.47 54.2812 49.8047 re
Y
39.0389 w
1 J
1 j
K
q[0 -0.957138 1.04286 0 0 0]concat
-1244.73 767.79 0 78.08 S
Q
Q q
841.406 1166.47 67.8398 49.8047 re
Y
39.0389 w
1 J
1 j
K
q[0 -0.957138 1.04286 0 0 0]concat
-1244.73 780.79 0 115.68 S
Q
Q q
882.117 1166.47 66.3438 49.8047 re
Y
39.0389 w
1 J
1 j
K
q[0 -0.957138 1.04286 0 0 0]concat
-1244.73 819.83 0 115.67 S
Q
Q q
921.312 1166.47 67.8594 49.8047 re
Y
39.0389 w
1 J
1 j
K
q[0 -0.957138 1.04286 0 0 0]concat
-1244.73 858.87 0 115.67 S
Q
Q q
962.023 1166.47 67.8594 49.8047 re
Y
39.0389 w
1 J
1 j
K
q[0 -0.957138 1.04286 0 0 0]concat
-1244.73 896.47 0 117.12 S
Q
Q q
1002.73 1166.47 67.8594 49.8047 re
Y
39.0389 w
1 J
1 j
K
q[0 -0.957138 1.04286 0 0 0]concat
-1244.73 935.51 0 117.12 S
Q
Q q
1043.45 1166.47 67.8594 49.8047 re
Y
39.0389 w
1 J
1 j
K
q[0 -0.957138 1.04286 0 0 0]concat
-1244.73 974.55 0 117.12 S
Q
Q q
1084.16 1166.47 67.8594 49.8047 re
Y
39.0389 w
1 J
1 j
K
q[0 -0.957138 1.04286 0 0 0]concat
-1244.73 1013.59 0 117.11 S
Q
Q q
1124.87 1166.47 66.3633 49.8047 re
Y
39.0389 w
1 J
1 j
K
q[0 -0.957138 1.04286 0 0 0]concat
-1244.73 1052.63 0 115.66 S
Q
Q q
1165.58 1166.47 52.7773 49.8047 re
Y
39.0389 w
1 J
1 j
K
q[0 -0.957138 1.04286 0 0 0]concat
-1244.73 1104.67 0 76.64 S
Q
Q q
1191.23 1166.47 67.8359 49.8047 re
Y
39.0389 w
1 J
1 j
K
q[0 -0.957138 1.04286 0 0 0]concat
-1244.73 1117.68 0 115.68 S
Q
Q q
1231.95 1166.47 67.8398 49.8047 re
Y
39.0389 w
1 J
1 j
K
q[0 -0.957138 1.04286 0 0 0]concat
-1244.73 1155.28 0 117.12 S
Q
Q q
1272.66 1166.47 67.8398 49.8047 re
Y
39.0389 w
1 J
1 j
K
q[0 -0.957138 1.04286 0 0 0]concat
-1244.73 1194.31 0 117.12 S
Q
Q q
1313.37 1166.47 67.8398 49.8047 re
Y
39.0389 w
1 J
1 j
K
q[0 -0.957138 1.04286 0 0 0]concat
-1244.73 1233.36 0 117.11 S
Q
Q q
1354.08 1178.93 67.8398 73.3477 re
Y
52.0519 w
1 J
1 j
K
q[0 -0.957138 1.04286 0 0 0]concat
-1192.68 1272.4 -154.7 117.11 S
Q
Q q
1394.79 1227.37 66.3438 805.422 re
Y
39.0389 w
1 J
1 j
K
q[0 -0.957138 1.04286 0 0 0]concat
-479.86 1311.43 -2446.44 115.68 S
Q
Q q
1435.5 2007.88 66.3398 484.371 re
Y
39.0389 w
1 J
1 j
K
q[0 -0.957138 1.04286 0 0 0]concat
-1632.22 1350.47 -1437.21 115.68 S
Q
Q q
1474.7 1389.28 67.8594 1102.97 re
Y
39.0389 w
1 J
1 j
K
q[0 -0.957138 1.04286 0 0 0]concat
-3715.75 1389.51 3377.6 115.68 S
Q
Q q
1515.41 1376.82 54.3008 49.8281 re
Y
39.0389 w
1 J
1 j
K
q[0 -0.957138 1.04286 0 0 0]concat
-1464.51 1440.12 0 78.08 S
Q
Q q
1542.55 1376.82 67.8633 49.8281 re
Y
39.0389 w
1 J
1 j
K
q[0 -0.957138 1.04286 0 0 0]concat
-1464.51 1453.12 0 117.12 S
Q
Q q
1583.27 1376.82 67.8633 49.8281 re
Y
39.0389 w
1 J
1 j
K
q[0 -0.957138 1.04286 0 0 0]concat
-1464.51 1492.16 0 117.11 S
Q
Q q
1623.98 1376.82 67.8633 49.8281 re
Y
39.0389 w
1 J
1 j
K
q[0 -0.957138 1.04286 0 0 0]concat
-1464.51 1531.2 0 115.68 S
Q
Q q
1664.7 1376.82 66.3398 49.8281 re
Y
39.0389 w
1 J
1 j
K
q[0 -0.957138 1.04286 0 0 0]concat
-1464.51 1570.24 0 115.68 S
Q
Q q
1705.41 1376.82 66.3398 49.8281 re
Y
39.0389 w
1 J
1 j
K
q[0 -0.957138 1.04286 0 0 0]concat
-1464.51 1609.28 0 115.68 S
Q
Q q
1744.62 1376.82 67.8398 49.8281 re
Y
39.0389 w
1 J
1 j
K
q[0 -0.957138 1.04286 0 0 0]concat
-1464.51 1646.88 0 117.11 S
Q
Q q
1785.33 1376.82 67.8398 49.8281 re
Y
39.0389 w
1 J
1 j
K
q[0 -0.957138 1.04286 0 0 0]concat
-1464.51 1685.92 0 117.11 S
Q
Q q
1826.04 1376.82 67.8359 49.8281 re
Y
39.0389 w
1 J
1 j
K
q[0 -0.957138 1.04286 0 0 0]concat
-1464.51 1724.96 0 117.11 S
Q
Q q
1866.75 1376.82 54.2734 49.8281 re
Y
39.0389 w
1 J
1 j
K
q[0 -0.957138 1.04286 0 0 0]concat
-1464.51 1777 0 78.08 S
Q
Q q
1893.88 1389.28 67.8594 110.699 re
Y
39.0389 w
1 J
1 j
K
q[0 -0.957138 1.04286 0 0 0]concat
-1373.41 1790.03 -271.83 115.66 S
Q
Q q
1934.59 1475.09 66.3633 99.625 re
Y
52.0519 w
1 J
1 j
K
q[0 -0.957138 1.04286 0 0 0]concat
-1477.53 1829.07 -232.78 115.66 S
Q
Q q
1975.3 1537.35 66.3633 49.8203 re
Y
39.0389 w
1 J
1 j
K
q[0 -0.957138 1.04286 0 0 0]concat
-1632.22 1868.11 0 115.66 S
Q
Q q
2014.52 1537.35 67.8633 49.8203 re
Y
39.0389 w
1 J
1 j
K
q[0 -0.957138 1.04286 0 0 0]concat
-1632.22 1905.69 0 117.11 S
Q
Q q
2055.23 1537.35 67.8633 49.8203 re
Y
39.0389 w
1 J
1 j
K
q[0 -0.957138 1.04286 0 0 0]concat
-1632.22 1944.73 0 117.11 S
Q
Q q
2095.95 1537.35 67.8555 49.8203 re
Y
39.0389 w
1 J
1 j
K
q[0 -0.957138 1.04286 0 0 0]concat
-1632.22 1983.76 0 117.12 S
Q
Q q
2136.66 1549.8 67.8555 74.7383 re
Y
52.0519 w
1 J
1 j
K
q[0 -0.957138 1.04286 0 0 0]concat
-1580.16 2022.8 -156.17 117.12 S
Q
Q q
2177.37 1587.17 54.2734 49.8281 re
Y
39.0389 w
1 J
1 j
K
q[0 -0.957138 1.04286 0 0 0]concat
-1684.28 2074.87 0 78.08 S
Q
Q q
2204.51 1587.17 66.3438 49.8281 re
Y
39.0389 w
1 J
1 j
K
q[0 -0.957138 1.04286 0 0 0]concat
-1684.28 2087.88 0 115.66 S
Q
Q q
2245.23 1587.17 66.3398 49.8281 re
Y
39.0389 w
1 J
1 j
K
q[0 -0.957138 1.04286 0 0 0]concat
-1684.28 2126.91 0 115.68 S
Q
Q q
2284.42 1587.17 67.8594 49.8281 re
Y
39.0389 w
1 J
1 j
K
q[0 -0.957138 1.04286 0 0 0]concat
-1684.28 2164.5 0 117.14 S
Q
Q q
2325.13 1599.63 67.8594 99.6289 re
Y
52.0519 w
1 J
1 j
K
q[0 -0.957138 1.04286 0 0 0]concat
-1606.19 2203.54 -232.79 117.14 S
Q
Q q
2365.84 1674.37 67.8555 73.3281 re
Y
52.0519 w
1 J
1 j
K
q[0 -0.957138 1.04286 0 0 0]concat
-1710.31 2242.59 -154.7 117.12 S
Q
Q q
2406.55 1724.18 67.8633 60.8906 re
Y
52.0519 w
1 J
1 j
K
q[0 -0.957138 1.04286 0 0 0]concat
-1775.36 2281.63 -115.68 117.11 S
Q
Q q
2447.27 1760.16 67.8633 149.477 re
Y
39.0389 w
1 J
1 j
K
q[0 -0.957138 1.04286 0 0 0]concat
-1723.32 2320.67 -387.48 115.66 S
Q
Q q
2487.98 1884.72 66.3398 110.699 re
Y
39.0389 w
1 J
1 j
K
q[0 -0.957138 1.04286 0 0 0]concat
-1891.04 2359.71 -271.83 115.66 S
Q
Q q
2527.2 1959.44 54.2695 48.4414 re
Y
39.0389 w
1 J
1 j
K
q[0 -0.957138 1.04286 0 0 0]concat
-2073.21 2411.76 0 76.61 S
Q
Q q
2554.32 1971.89 67.8633 60.8945 re
Y
52.0519 w
1 J
1 j
K
q[0 -0.957138 1.04286 0 0 0]concat
-2034.17 2423.33 -115.68 117.11 S
Q
Q q
2595.03 2007.88 67.8633 199.281 re
Y
39.0389 w
1 J
1 j
K
q[0 -0.957138 1.04286 0 0 0]concat
-1930.08 2462.36 -543.66 117.11 S
Q
Q q
2635.75 2169.79 67.8555 49.8281 re
Y
39.0389 w
1 J
1 j
K
q[0 -0.957138 1.04286 0 0 0]concat
-2292.99 2501.4 0 117.11 S
Q
Q q
2676.48 2182.25 67.8398 60.8945 re
Y
52.0519 w
1 J
1 j
K
q[0 -0.957138 1.04286 0 0 0]concat
-2253.97 2540.44 -115.66 117.11 S
Q
Q q
2717.19 2207.16 67.8398 48.4414 re
Y
39.0389 w
1 J
1 j
K
q[0 -0.957138 1.04286 0 0 0]concat
-2332.03 2579.48 0 115.66 S
Q
Q q
2757.9 2219.62 66.3398 110.723 re
Y
39.0389 w
1 J
1 j
K
q[0 -0.957138 1.04286 0 0 0]concat
-2240.95 2618.51 -271.81 115.66 S
Q
Q q
2797.09 2292.96 67.8555 49.8281 re
Y
39.0389 w
1 J
1 j
K
q[0 -0.957138 1.04286 0 0 0]concat
-2421.68 2657.55 0 115.66 S
Q
Q q
2837.8 2305.43 67.8633 359.805 re
Y
39.0389 w
1 J
1 j
K
q[0 -0.957138 1.04286 0 0 0]concat
-2073.21 2695.14 -1048.28 117.11 S
Q
Q q
2878.52 2640.32 54.2734 99.6523 re
Y
39.0389 w
1 J
1 j
K
q[0 -0.957138 1.04286 0 0 0]concat
-2693.51 2747.2 -232.79 78.08 S
Q
Q q
0 0 4400 0 0 3400 ^ Y
0.2 i
K
1631 281 3 0 1 -37.17 -4 0 P
-1.74 9.37 -6.01 16.91 -12.8 22.61 c
-6.8 5.71 -14.15 8.56 -22.05 8.56 c
-6.11 0 -10.95 -1.54 -14.51 -4.56 c
-3.56 -3.03 -5.34 -6.51 -5.34 -10.46 c
0 -2.5 0.64 -4.72 1.91 -6.66 c
1.76 -2.61 4.57 -5.2 8.45 -7.75 c
2.84 -1.83 9.42 -5.08 19.71 -9.75 c
14.42 -6.5 24.14 -12.64 29.17 -18.41 c
4.97 -5.78 7.46 -12.39 7.46 -19.83 c
0 -9.45 -4.03 -17.57 -12.05 -24.37 c
-8.02 -6.8 -18.21 -10.2 -30.56 -10.2 c
-3.87 0 -7.54 0.36 -10.99 1.09 c
-3.45 0.73 -7.78 2.1 -12.99 4.11 c
-2.91 1.12 -5.3 1.68 -7.17 1.68 c
-1.58 0 -3.24 -0.56 -5 -1.68 c
-1.76 -1.12 -3.18 -2.82 -4.27 -5.12 c
-3.36 0 0 42.95 3.36 0 p
2.66 -12.04 7.79 -21.22 15.37 -27.55 c
7.59 -6.33 15.77 -9.49 24.53 -9.49 c
6.77 0 12.17 1.69 16.19 5.06 c
4.02 3.38 6.03 7.3 6.03 11.79 c
0 2.66 -0.78 5.23 -2.31 7.72 c
-1.54 2.49 -3.87 4.86 -7 7.1 c
-3.13 2.24 -8.67 5.16 -16.61 8.76 c
-11.14 5.04 -19.14 9.32 -24.01 12.87 c
-4.87 3.54 -8.62 7.5 -11.24 11.87 c
-2.62 4.37 -3.93 9.19 -3.93 14.45 c
0 8.96 3.55 16.6 10.67 22.91 c
7.12 6.31 16.09 9.48 26.91 9.48 c
3.95 0 7.77 -0.44 11.48 -1.33 c
2.81 -0.67 6.23 -1.9 10.27 -3.71 c
4.04 -1.8 6.86 -2.7 8.48 -2.7 c
1.55 0 2.78 0.44 3.68 1.33 c
0.89 0.89 1.73 3.02 2.52 6.41 c
h
f
1704 177.51 m
-10.41 -8.39 -19.75 -12.59 -28.03 -12.59 c
-4.87 0 -8.91 1.46 -12.14 4.38 c
-3.23 2.92 -4.84 6.57 -4.84 10.97 c
0 5.95 2.8 11.3 8.4 16.06 c
5.6 4.75 17.8 11.08 36.61 18.98 c
0 7.84 p
0 5.89 -0.35 9.61 -1.04 11.13 c
-0.7 1.53 -2.01 2.86 -3.94 4 c
-1.93 1.14 -4.1 1.71 -6.52 1.71 c
-3.92 0 -7.15 -0.81 -9.68 -2.43 c
-1.57 -1 -2.36 -2.18 -2.36 -3.52 c
0 -1.17 0.78 -2.62 2.34 -4.36 c
2.12 -2.4 3.18 -4.72 3.18 -6.95 c
0 -2.73 -1.09 -5.07 -3.27 -6.99 c
-2.17 -1.93 -5.01 -2.89 -8.52 -2.89 c
-3.75 0 -6.89 1.05 -9.42 3.15 c
-2.53 2.1 -3.79 4.55 -3.79 7.37 c
0 3.98 1.71 7.77 5.14 11.39 c
3.43 3.61 8.21 6.39 14.36 8.32 c
6.14 1.93 12.52 2.91 19.14 2.91 c
8.01 0 14.34 -1.57 19.01 -4.7 c
4.66 -3.13 7.69 -6.52 9.07 -10.18 c
0.84 -2.32 1.28 -7.67 1.28 -16.03 c
0 -30.16 p
0 -3.54 0.15 -5.77 0.46 -6.69 c
0.31 -0.91 0.78 -1.59 1.4 -2.04 c
0.63 -0.44 1.34 -0.66 2.15 -0.66 c
1.62 0 3.27 1.02 4.95 3.07 c
2.8 -2 p
-3.04 -4.1 -6.17 -7.07 -9.4 -8.93 c
-3.24 -1.85 -6.92 -2.78 -11.04 -2.78 c
-4.84 0 -8.62 1.04 -11.35 3.13 c
-2.73 2.09 -4.39 5.24 -5 9.46 c
h
1704 183.56 0 26.05 P
-7.37 -3.94 -12.85 -8.16 -16.44 -12.65 c
-2.37 -3 -3.56 -6.02 -3.56 -9.07 c
0 -2.55 1 -4.8 3.01 -6.74 c
1.52 -1.5 3.66 -2.25 6.39 -2.25 c
3.04 0 6.57 1.55 10.59 4.66 c
h
f
1750.89 244 34.11 0 0 -10.41 P
4.68 4.66 9.02 7.92 13.01 9.78 c
3.99 1.86 8.36 2.79 13.11 2.79 c
5.48 0 10.07 -1.18 13.79 -3.51 c
3.71 -2.33 6.57 -5.88 8.59 -10.65 c
4.87 4.99 9.54 8.6 14.02 10.82 c
4.47 2.22 9.14 3.34 14.02 3.34 c
5.9 0 10.61 -1.25 14.11 -3.71 c
3.5 -2.47 5.94 -5.61 7.3 -9.41 c
1.37 -3.8 2.07 -9.86 2.07 -18.18 c
0 -31.87 p
0 -5.99 0.57 -9.71 1.72 -11.15 c
1.14 -1.44 3.54 -2.38 7.19 -2.83 c
0 -3 -43.8 0 ^ p
3.68 0.28 6.4 1.5 8.14 3.66 c
1.16 1.5 1.75 4.94 1.75 10.32 c
0 33.45 p
0 6.93 -0.32 11.34 -0.94 13.23 c
-0.62 1.88 -1.6 3.29 -2.94 4.2 c
-1.34 0.92 -2.91 1.39 -4.71 1.39 c
-2.68 0 -5.38 -0.89 -8.11 -2.63 c
-2.74 -1.75 -5.5 -4.37 -8.3 -7.86 c
0 -41.77 p
0 -5.61 0.52 -9.12 1.55 -10.57 c
1.39 -2.05 4.07 -3.19 8.02 -3.41 c
0 -3 -43.89 0 ^ p
2.45 0.11 4.38 0.65 5.79 1.62 c
1.41 0.97 2.35 2.14 2.82 3.5 c
0.47 1.36 0.71 4.31 0.71 8.86 c
0 33.45 p
0 7.04 -0.32 11.45 -0.94 13.23 c
-0.62 1.77 -1.67 3.16 -3.13 4.16 c
-1.47 1 -3.04 1.51 -4.73 1.51 c
-2.5 0 -4.77 -0.59 -6.83 -1.76 c
-2.93 -1.72 -6.05 -4.66 -9.36 -8.82 c
0 -41.77 p
0 -5.49 0.62 -9.11 1.85 -10.86 c
1.23 -1.75 3.82 -2.79 7.75 -3.12 c
0 -3 -43.71 0 ^ p
3.55 0.34 6.07 1.39 7.58 3.18 c
1.02 1.22 1.53 4.84 1.53 10.86 c
0 44.1 p
0 5.9 -0.59 9.57 -1.76 11.02 c
-1.17 1.45 -3.62 2.39 -7.35 2.85 c
h
f
1937 173.91 0 -28.7 P
0 -3.96 0.35 -6.65 1.05 -8.08 c
0.7 -1.43 1.78 -2.47 3.24 -3.13 c
1.46 -0.66 4.32 -0.99 8.58 -0.99 c
0 -3 -48.34 0 ^ p
3.86 0.11 6.73 1.08 8.59 2.91 c
1.25 1.28 1.87 4.57 1.87 9.89 c
0 82.05 p
0 5.49 -0.72 8.99 -2.15 10.52 c
-1.43 1.52 -4.2 2.4 -8.32 2.63 c
0 3 35.46 0 0 -10.41 p
2.96 3.95 5.97 6.79 9.05 8.55 c
4.4 2.58 9.2 3.87 14.39 3.87 c
6.21 0 11.86 -1.67 16.96 -5 c
5.1 -3.62 8.97 -8.59 11.63 -14.94 c
2.65 -6.34 3.98 -13.18 3.98 -20.49 c
0 -7.87 -1.37 -15.06 -4.12 -21.57 c
-2.74 -6.51 -6.72 -11.47 -11.94 -14.88 c
-5.21 -3.41 -11.02 -5.11 -17.41 -5.11 c
-4.64 0 -8.99 0.91 -13.03 2.73 c
-3.02 1.4 -6.18 3.79 -9.5 7.17 c
h
1937 223.8 0 -41.62 P
5.12 -6.79 10.59 -10.18 16.41 -10.18 c
3.21 0 5.86 1.59 7.94 4.75 c
3.09 4.67 4.64 13.57 4.64 26.7 c
0 13.46 -1.7 22.66 -5.09 27.61 c
-2.26 3.28 -5.3 4.93 -9.1 4.93 c
-6.01 0 -10.94 -4.07 -14.81 -12.19 c
h
f
2005.9 279 35.1 0 0 -96.84 P
0 -5.5 0.73 -9.01 2.18 -10.54 c
1.45 -1.53 4.29 -2.4 8.52 -2.62 c
0 -3 -45.8 0 ^ p
3.73 0.11 6.49 1.11 8.3 3 c
1.2 1.28 1.8 4.67 1.8 10.17 c
0 80.73 p
0 5.45 -0.69 8.93 -2.07 10.46 c
-1.38 1.53 -4.06 2.4 -8.03 2.63 c
h
f
2131.08 208 -47.08 0 P
0.55 -10.2 3.58 -18.25 9.09 -24.17 c
4.22 -4.55 9.3 -6.82 15.23 -6.82 c
3.67 0 7 0.88 10 2.64 c
3 1.76 6.21 4.92 9.64 9.5 c
3.12 -1.81 p
-4.61 -8.49 -9.7 -14.5 -15.28 -18.03 c
-5.57 -3.53 -12.03 -5.3 -19.36 -5.3 c
-12.6 0 -22.14 4.41 -28.63 13.23 c
-5.21 7.11 -7.82 15.94 -7.82 26.47 c
0 12.91 3.83 23.18 11.5 30.82 c
7.66 7.64 16.65 11.47 26.95 11.47 c
8.6 0 16.07 -3.2 22.4 -9.59 c
6.33 -6.39 9.74 -15.86 10.23 -28.41 c
h
2084.11 214 24.67 0 P
0 8.78 -0.53 14.8 -1.59 18.07 c
-1.06 3.27 -2.71 5.75 -4.95 7.44 c
-1.27 0.98 -2.96 1.48 -5.08 1.48 c
-3.14 0 -5.71 -1.39 -7.71 -4.18 c
-3.57 -4.85 -5.35 -11.5 -5.35 -19.96 c
h
f
145.58 3257.62 3.68 0 -4.62 -39.62 -109.19 0 0 3 4.14 0 P
3.61 0 6.52 0.59 8.73 1.75 c
1.59 0.78 2.82 2.11 3.68 4 c
0.68 1.34 1.02 4.84 1.02 10.52 c
0 74.45 p
0 5.79 -0.34 9.4 -1.02 10.85 c
-0.68 1.45 -2.04 2.71 -4.09 3.8 c
-2.05 1.09 -4.82 1.64 -8.31 1.64 c
-4.14 0 0 3 65.57 0 ^ -5.16 0 p
-3.44 0 -6.21 -0.59 -8.31 -1.77 c
-1.52 -0.78 -2.71 -2.12 -3.58 -4.02 c
-0.64 -1.34 -0.96 -4.85 -0.96 -10.54 c
0 -72.28 p
0 -5.8 0.36 -9.5 1.08 -11.09 c
0.72 -1.59 2.13 -2.77 4.22 -3.55 c
1.5 -0.5 5.12 -0.75 10.86 -0.75 c
10.15 0 p
6.46 0 11.85 1.06 16.16 3.2 c
4.31 2.13 8.04 5.49 11.18 10.09 c
3.14 4.59 6.12 11.37 8.93 20.34 c
h
f
234.08 3260 -47.08 0 P
0.55 -10.2 3.58 -18.25 9.09 -24.17 c
4.22 -4.55 9.3 -6.82 15.23 -6.82 c
3.67 0 7 0.88 10 2.64 c
3 1.76 6.21 4.92 9.64 9.5 c
3.12 -1.81 p
-4.61 -8.49 -9.7 -14.5 -15.28 -18.03 c
-5.57 -3.53 -12.03 -5.3 -19.36 -5.3 c
-12.6 0 -22.14 4.41 -28.63 13.23 c
-5.21 7.11 -7.82 15.94 -7.82 26.47 c
0 12.91 3.83 23.18 11.5 30.82 c
7.66 7.64 16.65 11.47 26.95 11.47 c
8.6 0 16.07 -3.2 22.4 -9.59 c
6.33 -6.39 9.74 -15.86 10.23 -28.41 c
h
187.11 3266 24.67 0 P
0 8.78 -0.53 14.8 -1.59 18.07 c
-1.06 3.27 -2.71 5.75 -4.95 7.44 c
-1.27 0.98 -2.96 1.48 -5.08 1.48 c
-3.14 0 -5.71 -1.39 -7.71 -4.18 c
-3.57 -4.85 -5.35 -11.5 -5.35 -19.96 c
h
f
286.79 3215.67 -4.26 0 -28.57 60.54 P
-3.45 7.29 -6.14 11.91 -8.07 13.86 c
-1.39 1.45 -3.45 2.42 -6.17 2.93 c
0 3 45.07 0 ^ p
-2.84 0 -4.78 -0.48 -5.8 -1.43 c
-1.45 -1.23 -2.18 -2.68 -2.18 -4.35 c
0 -2.06 1.33 -5.94 3.99 -11.63 c
13.96 -29.37 11.16 25.36 p
3.2 7.25 4.8 12.39 4.8 15.4 c
0 1.73 -0.68 3.14 -2.04 4.23 c
-1.36 1.09 -3.76 1.69 -7.21 1.8 c
0 3 27.75 0 ^ p
-2.66 -0.34 -4.84 -1.27 -6.53 -2.77 c
-1.7 -1.5 -4.23 -5.93 -7.62 -13.28 c
h
f
409.08 3260 -47.08 0 P
0.55 -10.2 3.58 -18.25 9.09 -24.17 c
4.22 -4.55 9.3 -6.82 15.23 -6.82 c
3.67 0 7 0.88 10 2.64 c
3 1.76 6.21 4.92 9.64 9.5 c
3.12 -1.81 p
-4.61 -8.49 -9.7 -14.5 -15.28 -18.03 c
-5.57 -3.53 -12.03 -5.3 -19.36 -5.3 c
-12.6 0 -22.14 4.41 -28.63 13.23 c
-5.21 7.11 -7.82 15.94 -7.82 26.47 c
0 12.91 3.83 23.18 11.5 30.82 c
7.66 7.64 16.65 11.47 26.95 11.47 c
8.6 0 16.07 -3.2 22.4 -9.59 c
6.33 -6.39 9.74 -15.86 10.23 -28.41 c
h
362.11 3266 24.67 0 P
0 8.78 -0.53 14.8 -1.59 18.07 c
-1.06 3.27 -2.71 5.75 -4.95 7.44 c
-1.27 0.98 -2.96 1.48 -5.08 1.48 c
-3.14 0 -5.71 -1.39 -7.71 -4.18 c
-3.57 -4.85 -5.35 -11.5 -5.35 -19.96 c
h
f
416.9 3331 35.1 0 0 -96.84 P
0 -5.5 0.73 -9.01 2.18 -10.54 c
1.45 -1.53 4.29 -2.4 8.52 -2.62 c
0 -3 -45.8 0 ^ p
3.73 0.11 6.49 1.11 8.3 3 c
1.2 1.28 1.8 4.67 1.8 10.17 c
0 80.73 p
0 5.45 -0.69 8.93 -2.07 10.46 c
-1.38 1.53 -4.06 2.4 -8.03 2.63 c
h
f
Q q
2878.52 2330.34 364.906 124.543 re
Y
13.013 w
1 J
1 j
K
q[0 -0.957138 1.04286 0 0 0]concat
-2306 2411.76 -387.51 1046.82 S
Q
Q q
3148.42 2367.71 95.0039 87.1719 re
Y
13.013 w
1 J
1 j
K
q[0 -0.957138 1.04286 0 0 0]concat
-2654.47 3199.77 271.83 -271.84 S
Q
Q q
3107.71 2454.88 135.715 12.457 re
Y
13.013 w
1 J
1 j
K
q[0 -0.957138 1.04286 0 0 0]concat
-2551.8 3238.81 -39.04 -387.5 S
Q
Q q
2905.67 2800.87 351.32 235.266 re
Y
13.013 w
1 J
1 j
K
q[0 -0.957138 1.04286 0 0 0]concat
-2680.49 2449.33 -737.4 1009.24 S
Q
Q q
3189.13 2925.41 67.8594 110.723 re
Y
13.013 w
1 J
1 j
K
q[0 -0.957138 1.04286 0 0 0]concat
-3289.21 3186.74 349.9 -193.74 S
Q
Q q
3121.29 3011.22 135.699 24.9102 re
Y
13.013 w
1 J
1 j
K
q[0 -0.957138 1.04286 0 0 0]concat
-3198.13 3251.81 76.64 -387.49 S
Q
Q q
2878.52 1897.18 364.906 322.438 re
Y
13.013 w
1 J
1 j
K
q[0 -0.957138 1.04286 0 0 0]concat
-2654.47 2411.76 1009.23 1046.82 S
Q
Q q
3121.29 1897.18 122.133 37.3477 re
Y
13.013 w
1 J
1 j
K
q[0 -0.957138 1.04286 0 0 0]concat
-1943.1 3225.78 -117.1 -348.46 S
Q
Q q
3189.13 1897.18 54.293 110.699 re
Y
13.013 w
1 J
1 j
K
q[0 -0.957138 1.04286 0 0 0]concat
-1865.01 3162.16 -349.92 -156.15 S
Q
Q q
0 0 4400 0 0 3400 ^ Y
0.2 i
K
3440.66 2514.94 3.29 0.05 P
18.14 0 33.01 -5.3 44.6 -15.91 c
12.28 -11.24 18.45 -25.3 18.45 -42.2 c
0 -14.43 -4.61 -27.12 -13.77 -38.08 c
-12.13 -14.54 -29.26 -21.81 -51.39 -21.81 c
-22.19 0 -39.35 6.93 -51.48 20.8 c
-9.58 10.96 -14.37 23.96 -14.37 39.01 c
0 16.89 6.23 30.96 18.69 42.23 c
11.76 10.64 26.07 15.95 42.94 15.95 c
h
3441.77 2510 m
-11.23 0 -19.77 -5.37 -25.62 -16.06 c
-4.77 -8.78 -7.15 -21.39 -7.15 -37.83 c
0 -19.53 3.68 -33.97 11.04 -43.31 c
5.13 -6.53 12.31 -9.79 21.54 -9.79 c
6.21 0 11.41 1.41 15.57 4.22 c
5.31 3.6 9.44 9.36 12.4 17.27 c
2.96 7.91 4.45 18.22 4.45 30.94 c
0 15.14 -1.52 26.47 -4.54 33.98 c
-3.02 7.52 -6.86 12.82 -11.54 15.92 c
-4.68 3.09 -10.06 4.66 -16.16 4.66 c
h
f
3520.8 2478 34.2 0 0 -17.82 P
5.68 7.98 10.67 13.28 14.95 15.89 c
4.28 2.62 8.41 3.93 12.38 3.93 c
3.43 0 6.16 -0.97 8.21 -2.91 c
2.05 -1.94 3.08 -4.68 3.08 -8.21 c
0 -3.77 -1 -6.68 -2.98 -8.76 c
-1.99 -2.08 -4.39 -3.12 -7.2 -3.12 c
-3.24 0 -6.05 1 -8.44 3.02 c
-2.39 2.01 -3.79 3.14 -4.22 3.38 c
-0.61 0.36 -1.32 0.53 -2.11 0.53 c
-1.77 0 -3.45 -0.62 -5.04 -1.84 c
-2.51 -1.89 -4.4 -4.58 -5.69 -8.07 c
-1.96 -5.38 -2.93 -11.32 -2.93 -17.81 c
0 -17.89 0.09 -4.66 p
0 -3.16 0.22 -5.19 0.66 -6.07 c
0.75 -1.5 1.87 -2.59 3.34 -3.29 c
1.48 -0.7 3.98 -1.12 7.5 -1.29 c
0 -3 -45.8 0 ^ p
3.6 0.28 6.03 1.21 7.3 2.8 c
1.27 1.59 1.9 5.78 1.9 12.57 c
0 43.18 p
0 4.45 -0.23 7.29 -0.71 8.52 c
-0.59 1.56 -1.45 2.7 -2.57 3.42 c
-1.12 0.72 -3.09 1.23 -5.93 1.51 c
h
f
3622.95 2516 m
3.93 0 7.25 -1.28 9.96 -3.83 c
2.72 -2.55 4.09 -5.62 4.09 -9.21 c
0 -3.59 -1.38 -6.65 -4.13 -9.17 c
-2.75 -2.52 -6.06 -3.79 -9.92 -3.79 c
-3.87 0 -7.16 1.26 -9.87 3.79 c
-2.72 2.52 -4.08 5.58 -4.08 9.17 c
0 3.59 1.36 6.66 4.08 9.21 c
2.72 2.55 6.01 3.83 9.88 3.83 c
h
3599.81 2478 35.19 0 0 -61.82 P
0 -5.5 0.72 -9.02 2.16 -10.55 c
1.44 -1.53 4.25 -2.41 8.45 -2.63 c
0 -3 -45.8 0 ^ p
3.76 0.11 6.55 1.11 8.37 3.01 c
1.21 1.28 1.82 4.68 1.82 10.19 c
0 45.6 p
0 5.51 -0.7 9.03 -2.09 10.57 c
-1.4 1.53 -4.09 2.41 -8.1 2.64 c
h
f
3708.68 2477 28.56 0 0 -9 -16.23 0 P
2.84 -2.77 4.81 -5.28 5.91 -7.54 c
1.39 -3.04 2.09 -6.23 2.09 -9.55 c
0 -5.64 -1.68 -10.53 -5.01 -14.68 c
-3.34 -4.14 -7.87 -7.39 -13.61 -9.73 c
-5.73 -2.34 -10.82 -3.51 -15.27 -3.51 c
-0.36 0 -3.96 0.29 -10.81 0.89 c
-2.7 0 -4.97 -0.82 -6.8 -2.45 c
-1.83 -1.64 -2.75 -3.59 -2.75 -5.87 c
0 -2 0.83 -3.64 2.49 -4.91 c
1.66 -1.28 4.37 -1.91 8.12 -1.91 c
15.69 0.26 p
12.7 0 21.43 -1.29 26.21 -3.86 c
6.83 -3.57 10.25 -9.08 10.25 -16.51 c
0 -4.75 -1.57 -9.06 -4.71 -12.94 c
-3.14 -3.88 -7.29 -6.75 -12.42 -8.59 c
-7.8 -2.73 -16.77 -4.11 -26.93 -4.11 c
-7.61 0 -14.57 0.68 -20.85 2.04 c
-6.29 1.36 -10.79 3.25 -13.51 5.66 c
-2.72 2.41 -4.08 4.96 -4.08 7.62 c
0 2.55 1.04 4.84 3.13 6.87 c
2.09 2.03 5.96 3.73 11.64 5.12 c
-7.86 3.55 -11.78 8.49 -11.78 14.82 c
0 3.83 1.6 7.55 4.8 11.16 c
3.2 3.61 8.27 6.75 15.23 9.41 c
-8.1 2.72 -13.96 6.3 -17.58 10.74 c
-3.62 4.44 -5.44 9.58 -5.44 15.41 c
0 7.61 3.38 14.2 10.16 19.78 c
6.77 5.58 15.47 8.37 26.11 8.37 c
5.62 0 11.43 -1 17.41 -3 c
h
3692.64 2475 m
-3.54 0 -6.53 -1.64 -8.97 -4.91 c
-2.44 -3.27 -3.66 -10.04 -3.66 -20.31 c
0 -8.32 1.21 -14.03 3.62 -17.13 c
2.41 -3.1 5.27 -4.65 8.56 -4.65 c
3.66 0 6.71 1.54 9.16 4.61 c
2.44 3.07 3.66 9.05 3.66 17.93 c
0 10 -1.37 16.81 -4.12 20.44 c
-1.95 2.68 -4.7 4.03 -8.24 4.03 c
h
3687.48 2389 m
-6.19 0 -10.29 -0.48 -12.29 -1.45 c
-3.46 -1.76 -5.19 -4.14 -5.19 -7.15 c
0 -2.89 1.79 -5.52 5.37 -7.87 c
3.58 -2.36 10.32 -3.54 20.21 -3.54 c
8.44 0 15.07 1.05 19.89 3.15 c
4.82 2.1 7.25 5.05 7.25 8.85 c
0 1.42 -0.47 2.61 -1.38 3.57 c
-1.64 1.7 -4.11 2.87 -7.42 3.49 c
-3.31 0.63 -12.12 0.93 -26.45 0.93 c
h
f
3767.95 2516 m
3.93 0 7.25 -1.28 9.96 -3.83 c
2.72 -2.55 4.09 -5.62 4.09 -9.21 c
0 -3.59 -1.38 -6.65 -4.13 -9.17 c
-2.75 -2.52 -6.06 -3.79 -9.92 -3.79 c
-3.87 0 -7.16 1.26 -9.87 3.79 c
-2.72 2.52 -4.08 5.58 -4.08 9.17 c
0 3.59 1.36 6.66 4.08 9.21 c
2.72 2.55 6.01 3.83 9.88 3.83 c
h
3744.81 2478 35.19 0 0 -61.82 P
0 -5.5 0.72 -9.02 2.16 -10.55 c
1.44 -1.53 4.25 -2.41 8.45 -2.63 c
0 -3 -45.8 0 ^ p
3.76 0.11 6.55 1.11 8.37 3.01 c
1.21 1.28 1.82 4.68 1.82 10.19 c
0 45.6 p
0 5.51 -0.7 9.03 -2.09 10.57 c
-1.4 1.53 -4.09 2.41 -8.1 2.64 c
h
f
3799.35 2478 34.66 0 0 -10.25 P
4.28 4.33 8.38 7.48 12.3 9.45 c
3.93 1.97 8.14 2.95 12.66 2.95 c
5.41 0 9.89 -1.41 13.46 -4.21 c
3.57 -2.8 5.95 -6.29 7.13 -10.45 c
0.95 -3.16 1.44 -9.23 1.44 -18.22 c
0 -30.29 p
0 -5.99 0.64 -9.72 1.9 -11.19 c
1.27 -1.47 3.92 -2.4 7.95 -2.79 c
0 -3 -42.89 0 ^ p
3.09 0.39 5.3 1.61 6.64 3.66 c
0.93 1.39 1.4 4.83 1.4 10.32 c
0 34.62 p
0 6.38 -0.27 10.4 -0.8 12.07 c
-0.53 1.66 -1.44 2.95 -2.71 3.87 c
-1.28 0.92 -2.69 1.39 -4.23 1.39 c
-5.11 0 -9.86 -3.43 -14.25 -10.25 c
0 -41.69 p
0 -5.82 0.58 -9.52 1.75 -11.07 c
1.16 -1.55 3.33 -2.53 6.49 -2.91 c
0 -3 -42.89 0 ^ p
3.76 0.34 6.43 1.39 8.03 3.18 c
1.08 1.22 1.63 4.84 1.63 10.86 c
0 44.1 p
0 5.9 -0.62 9.57 -1.86 11.02 c
-1.24 1.45 -3.84 2.39 -7.79 2.85 c
h
f
3950 2411.51 m
-10.41 -8.39 -19.75 -12.59 -28.03 -12.59 c
-4.87 0 -8.91 1.46 -12.14 4.38 c
-3.23 2.92 -4.84 6.57 -4.84 10.97 c
0 5.95 2.8 11.3 8.4 16.06 c
5.6 4.75 17.8 11.08 36.61 18.98 c
0 7.84 p
0 5.89 -0.35 9.61 -1.04 11.13 c
-0.7 1.53 -2.01 2.86 -3.94 4 c
-1.93 1.14 -4.1 1.71 -6.52 1.71 c
-3.92 0 -7.15 -0.81 -9.68 -2.43 c
-1.57 -1 -2.36 -2.18 -2.36 -3.52 c
0 -1.17 0.78 -2.62 2.34 -4.36 c
2.12 -2.4 3.18 -4.72 3.18 -6.95 c
0 -2.73 -1.09 -5.07 -3.27 -6.99 c
-2.17 -1.93 -5.01 -2.89 -8.52 -2.89 c
-3.75 0 -6.89 1.05 -9.42 3.15 c
-2.53 2.1 -3.79 4.55 -3.79 7.37 c
0 3.98 1.71 7.77 5.14 11.39 c
3.43 3.61 8.21 6.39 14.36 8.32 c
6.14 1.93 12.52 2.91 19.14 2.91 c
8.01 0 14.34 -1.57 19.01 -4.7 c
4.66 -3.13 7.69 -6.52 9.07 -10.18 c
0.84 -2.32 1.28 -7.67 1.28 -16.03 c
0 -30.16 p
0 -3.54 0.15 -5.77 0.46 -6.69 c
0.31 -0.91 0.78 -1.59 1.4 -2.04 c
0.63 -0.44 1.34 -0.66 2.15 -0.66 c
1.62 0 3.27 1.02 4.95 3.07 c
2.8 -2 p
-3.04 -4.1 -6.17 -7.07 -9.4 -8.93 c
-3.24 -1.85 -6.92 -2.78 -11.04 -2.78 c
-4.84 0 -8.62 1.04 -11.35 3.13 c
-2.73 2.09 -4.39 5.24 -5 9.46 c
h
3950 2417.56 0 26.05 P
-7.37 -3.94 -12.85 -8.16 -16.44 -12.65 c
-2.37 -3 -3.56 -6.02 -3.56 -9.07 c
0 -2.55 1 -4.8 3.01 -6.74 c
1.52 -1.5 3.66 -2.25 6.39 -2.25 c
3.04 0 6.57 1.55 10.59 4.66 c
h
f
3993.9 2513 35.1 0 0 -96.84 P
0 -5.5 0.73 -9.01 2.18 -10.54 c
1.45 -1.53 4.29 -2.4 8.52 -2.62 c
0 -3 -45.8 0 ^ p
3.73 0.11 6.49 1.11 8.3 3 c
1.2 1.28 1.8 4.67 1.8 10.17 c
0 80.73 p
0 5.45 -0.69 8.93 -2.07 10.46 c
-1.38 1.53 -4.06 2.4 -8.03 2.63 c
h
f
3489 3113 4 0 0 -38.67 ^ P
-2.66 10.22 -7.59 18.05 -14.8 23.5 c
-7.21 5.45 -15.39 8.17 -24.53 8.17 c
-7.63 0 -14.64 -2.04 -21.01 -6.1 c
-6.37 -4.06 -11.03 -9.38 -13.98 -15.94 c
-3.79 -8.4 -5.68 -17.75 -5.68 -28.04 c
0 -10.12 1.39 -19.35 4.17 -27.66 c
2.78 -8.32 7.13 -14.61 13.06 -18.86 c
5.92 -4.25 13.6 -6.38 23.03 -6.38 c
7.74 0 14.82 1.57 21.26 4.71 c
6.44 3.14 13.22 8.56 20.37 16.25 c
0 -9.88 p
-6.93 -6.7 -14.13 -11.56 -21.62 -14.57 c
-7.49 -3.01 -16.23 -4.52 -26.24 -4.52 c
-13.16 0 -24.85 2.41 -35.06 7.24 c
-10.22 4.82 -18.1 11.76 -23.65 20.8 c
-5.55 9.04 -8.32 18.66 -8.32 28.88 c
0 10.76 3.07 20.97 9.2 30.62 c
6.13 9.65 14.41 17.14 24.83 22.47 c
10.42 5.32 21.48 7.99 33.2 7.99 c
8.64 0 17.76 -1.72 27.36 -5.16 c
5.56 -2 9.09 -3 10.6 -3 c
1.93 0 3.61 0.65 5.03 1.96 c
1.42 1.3 2.34 3.37 2.79 6.2 c
h
f
3507.9 3111 35.1 0 0 -96.84 P
0 -5.5 0.73 -9.01 2.18 -10.54 c
1.45 -1.53 4.29 -2.4 8.52 -2.62 c
0 -3 -45.8 0 ^ p
3.73 0.11 6.49 1.11 8.3 3 c
1.2 1.28 1.8 4.67 1.8 10.17 c
0 80.73 p
0 5.45 -0.69 8.93 -2.07 10.46 c
-1.38 1.53 -4.06 2.4 -8.03 2.63 c
h
f
3601.77 3078 m
7.42 0 14.32 -1.75 20.71 -5.23 c
6.39 -3.48 11.23 -8.41 14.55 -14.81 c
3.31 -6.4 4.97 -13.4 4.97 -21.01 c
0 -10.98 -3.07 -20.16 -9.21 -27.55 c
-7.42 -8.93 -17.67 -13.4 -30.74 -13.4 c
-12.83 0 -22.71 4.08 -29.64 12.24 c
-6.93 8.16 -10.4 17.62 -10.4 28.38 c
0 11.09 3.54 20.75 10.63 29 c
7.08 8.24 16.8 12.38 29.14 12.38 c
h
3602.18 3072 m
-3.05 0 -5.66 -1.07 -7.84 -3.18 c
-2.18 -2.11 -3.62 -6.28 -4.3 -12.5 c
-0.69 -6.22 -1.03 -14.87 -1.03 -25.95 c
0 -5.87 0.42 -11.35 1.25 -16.45 c
0.66 -3.89 2.06 -6.85 4.21 -8.88 c
2.15 -2.03 4.6 -3.04 7.35 -3.04 c
2.69 0 4.93 0.68 6.72 2.05 c
2.33 1.86 3.88 4.47 4.66 7.81 c
1.2 5.21 1.8 15.73 1.8 31.58 c
0 9.32 -0.57 15.72 -1.71 19.2 c
-1.14 3.48 -2.81 6.02 -5.02 7.61 c
-1.55 1.15 -3.59 1.73 -6.1 1.73 c
h
f
3706.16 3077.83 3.07 0 1.35 -26.39 ^ P
-3.67 7.91 -7.47 13.32 -11.41 16.21 c
-3.94 2.89 -7.86 4.34 -11.77 4.34 c
-2.47 0 -4.57 -0.77 -6.32 -2.29 c
-1.75 -1.52 -2.62 -3.28 -2.62 -5.27 c
0 -1.5 0.6 -2.93 1.8 -4.32 c
1.93 -2.27 7.31 -6.15 16.15 -11.65 c
8.84 -5.5 14.66 -10.18 17.45 -14.02 c
2.8 -3.84 4.2 -8.14 4.2 -12.9 c
0 -4.31 -1.18 -8.54 -3.52 -12.69 c
-2.34 -4.15 -5.65 -7.33 -9.92 -9.54 c
-4.27 -2.21 -8.99 -3.32 -14.16 -3.32 c
-4.03 0 -9.41 1.15 -16.15 3.45 c
-1.8 0.6 -3.04 0.9 -3.7 0.9 c
-1.98 0 -3.64 -1.37 -4.96 -4.11 c
-2.98 0 -1.44 27.64 3.07 0 p
2.71 -7.3 6.42 -12.77 11.14 -16.41 c
4.72 -3.64 9.18 -5.47 13.39 -5.47 c
2.89 0 5.25 0.81 7.08 2.45 c
1.83 1.63 2.75 3.61 2.75 5.93 c
0 2.66 -0.9 4.95 -2.71 6.89 c
-1.8 1.93 -5.83 4.87 -12.09 8.79 c
-9.2 5.86 -15.15 10.34 -17.86 13.44 c
-3.97 4.54 -5.95 9.54 -5.95 15.02 c
0 5.97 2.24 11.38 6.72 16.21 c
4.48 4.84 10.96 7.27 19.44 7.27 c
4.57 0 8.99 -1.02 13.26 -3.06 c
1.62 -0.83 2.95 -1.24 3.97 -1.24 c
1.08 0 1.95 0.21 2.61 0.62 c
0.66 0.41 1.71 1.58 3.16 3.52 c
h
f
3747.95 3114 m
3.93 0 7.25 -1.28 9.96 -3.83 c
2.72 -2.55 4.09 -5.62 4.09 -9.21 c
0 -3.59 -1.38 -6.65 -4.13 -9.17 c
-2.75 -2.52 -6.06 -3.79 -9.92 -3.79 c
-3.87 0 -7.16 1.26 -9.87 3.79 c
-2.72 2.52 -4.08 5.58 -4.08 9.17 c
0 3.59 1.36 6.66 4.08 9.21 c
2.72 2.55 6.01 3.83 9.88 3.83 c
h
3724.81 3076 35.19 0 0 -61.82 P
0 -5.5 0.72 -9.02 2.16 -10.55 c
1.44 -1.53 4.25 -2.41 8.45 -2.63 c
0 -3 -45.8 0 ^ p
3.76 0.11 6.55 1.11 8.37 3.01 c
1.21 1.28 1.82 4.68 1.82 10.19 c
0 45.6 p
0 5.51 -0.7 9.03 -2.09 10.57 c
-1.4 1.53 -4.09 2.41 -8.1 2.64 c
h
f
3779.35 3076 34.66 0 0 -10.25 P
4.28 4.33 8.38 7.48 12.3 9.45 c
3.93 1.97 8.14 2.95 12.66 2.95 c
5.41 0 9.89 -1.41 13.46 -4.21 c
3.57 -2.8 5.95 -6.29 7.13 -10.45 c
0.95 -3.16 1.44 -9.23 1.44 -18.22 c
0 -30.29 p
0 -5.99 0.64 -9.72 1.9 -11.19 c
1.27 -1.47 3.92 -2.4 7.95 -2.79 c
0 -3 -42.89 0 ^ p
3.09 0.39 5.3 1.61 6.64 3.66 c
0.93 1.39 1.4 4.83 1.4 10.32 c
0 34.62 p
0 6.38 -0.27 10.4 -0.8 12.07 c
-0.53 1.66 -1.44 2.95 -2.71 3.87 c
-1.28 0.92 -2.69 1.39 -4.23 1.39 c
-5.11 0 -9.86 -3.43 -14.25 -10.25 c
0 -41.69 p
0 -5.82 0.58 -9.52 1.75 -11.07 c
1.16 -1.55 3.33 -2.53 6.49 -2.91 c
0 -3 -42.89 0 ^ p
3.76 0.34 6.43 1.39 8.03 3.18 c
1.08 1.22 1.63 4.84 1.63 10.86 c
0 44.1 p
0 5.9 -0.62 9.57 -1.86 11.02 c
-1.24 1.45 -3.84 2.39 -7.79 2.85 c
h
f
3937.68 3075 28.56 0 0 -9 -16.23 0 P
2.84 -2.77 4.81 -5.28 5.91 -7.54 c
1.39 -3.04 2.09 -6.23 2.09 -9.55 c
0 -5.64 -1.68 -10.53 -5.01 -14.68 c
-3.34 -4.14 -7.87 -7.39 -13.61 -9.73 c
-5.73 -2.34 -10.82 -3.51 -15.27 -3.51 c
-0.36 0 -3.96 0.29 -10.81 0.89 c
-2.7 0 -4.97 -0.82 -6.8 -2.45 c
-1.83 -1.64 -2.75 -3.59 -2.75 -5.87 c
0 -2 0.83 -3.64 2.49 -4.91 c
1.66 -1.28 4.37 -1.91 8.12 -1.91 c
15.69 0.26 p
12.7 0 21.43 -1.29 26.21 -3.86 c
6.83 -3.57 10.25 -9.08 10.25 -16.51 c
0 -4.75 -1.57 -9.06 -4.71 -12.94 c
-3.14 -3.88 -7.29 -6.75 -12.42 -8.59 c
-7.8 -2.73 -16.77 -4.11 -26.93 -4.11 c
-7.61 0 -14.57 0.68 -20.85 2.04 c
-6.29 1.36 -10.79 3.25 -13.51 5.66 c
-2.72 2.41 -4.08 4.96 -4.08 7.62 c
0 2.55 1.04 4.84 3.13 6.87 c
2.09 2.03 5.96 3.73 11.64 5.12 c
-7.86 3.55 -11.78 8.49 -11.78 14.82 c
0 3.83 1.6 7.55 4.8 11.16 c
3.2 3.61 8.27 6.75 15.23 9.41 c
-8.1 2.72 -13.96 6.3 -17.58 10.74 c
-3.62 4.44 -5.44 9.58 -5.44 15.41 c
0 7.61 3.38 14.2 10.16 19.78 c
6.77 5.58 15.47 8.37 26.11 8.37 c
5.62 0 11.43 -1 17.41 -3 c
h
3921.64 3073 m
-3.54 0 -6.53 -1.64 -8.97 -4.91 c
-2.44 -3.27 -3.66 -10.04 -3.66 -20.31 c
0 -8.32 1.21 -14.03 3.62 -17.13 c
2.41 -3.1 5.27 -4.65 8.56 -4.65 c
3.66 0 6.71 1.54 9.16 4.61 c
2.44 3.07 3.66 9.05 3.66 17.93 c
0 10 -1.37 16.81 -4.12 20.44 c
-1.95 2.68 -4.7 4.03 -8.24 4.03 c
h
3916.48 2987 m
-6.19 0 -10.29 -0.48 -12.29 -1.45 c
-3.46 -1.76 -5.19 -4.14 -5.19 -7.15 c
0 -2.89 1.79 -5.52 5.37 -7.87 c
3.58 -2.36 10.32 -3.54 20.21 -3.54 c
8.44 0 15.07 1.05 19.89 3.15 c
4.82 2.1 7.25 5.05 7.25 8.85 c
0 1.42 -0.47 2.61 -1.38 3.57 c
-1.64 1.7 -4.11 2.87 -7.42 3.49 c
-3.31 0.63 -12.12 0.93 -26.45 0.93 c
h
f
3440.66 1976.94 3.29 0.05 P
18.14 0 33.01 -5.3 44.6 -15.91 c
12.28 -11.24 18.45 -25.3 18.45 -42.2 c
0 -14.43 -4.61 -27.12 -13.77 -38.08 c
-12.13 -14.54 -29.26 -21.81 -51.39 -21.81 c
-22.19 0 -39.35 6.93 -51.48 20.8 c
-9.58 10.96 -14.37 23.96 -14.37 39.01 c
0 16.89 6.23 30.96 18.69 42.23 c
11.76 10.64 26.07 15.95 42.94 15.95 c
h
3441.77 1972 m
-11.23 0 -19.77 -5.37 -25.62 -16.06 c
-4.77 -8.78 -7.15 -21.39 -7.15 -37.83 c
0 -19.53 3.68 -33.97 11.04 -43.31 c
5.13 -6.53 12.31 -9.79 21.54 -9.79 c
6.21 0 11.41 1.41 15.57 4.22 c
5.31 3.6 9.44 9.36 12.4 17.27 c
2.96 7.91 4.45 18.22 4.45 30.94 c
0 15.14 -1.52 26.47 -4.54 33.98 c
-3.02 7.52 -6.86 12.82 -11.54 15.92 c
-4.68 3.09 -10.06 4.66 -16.16 4.66 c
h
f
3553 1869.91 0 -28.7 P
0 -3.96 0.35 -6.65 1.05 -8.08 c
0.7 -1.43 1.78 -2.47 3.24 -3.13 c
1.46 -0.66 4.32 -0.99 8.58 -0.99 c
0 -3 -48.34 0 ^ p
3.86 0.11 6.73 1.08 8.59 2.91 c
1.25 1.28 1.87 4.57 1.87 9.89 c
0 82.05 p
0 5.49 -0.72 8.99 -2.15 10.52 c
-1.43 1.52 -4.2 2.4 -8.32 2.63 c
0 3 35.46 0 0 -10.41 p
2.96 3.95 5.97 6.79 9.05 8.55 c
4.4 2.58 9.2 3.87 14.39 3.87 c
6.21 0 11.86 -1.67 16.96 -5 c
5.1 -3.62 8.97 -8.59 11.63 -14.94 c
2.65 -6.34 3.98 -13.18 3.98 -20.49 c
0 -7.87 -1.37 -15.06 -4.12 -21.57 c
-2.74 -6.51 -6.72 -11.47 -11.94 -14.88 c
-5.21 -3.41 -11.02 -5.11 -17.41 -5.11 c
-4.64 0 -8.99 0.91 -13.03 2.73 c
-3.02 1.4 -6.18 3.79 -9.5 7.17 c
h
3553 1919.8 0 -41.62 P
5.12 -6.79 10.59 -10.18 16.41 -10.18 c
3.21 0 5.86 1.59 7.94 4.75 c
3.09 4.67 4.64 13.57 4.64 26.7 c
0 13.46 -1.7 22.66 -5.09 27.61 c
-2.26 3.28 -5.3 4.93 -9.1 4.93 c
-6.01 0 -10.94 -4.07 -14.81 -12.19 c
h
f
3695.08 1904 -47.08 0 P
0.55 -10.2 3.58 -18.25 9.09 -24.17 c
4.22 -4.55 9.3 -6.82 15.23 -6.82 c
3.67 0 7 0.88 10 2.64 c
3 1.76 6.21 4.92 9.64 9.5 c
3.12 -1.81 p
-4.61 -8.49 -9.7 -14.5 -15.28 -18.03 c
-5.57 -3.53 -12.03 -5.3 -19.36 -5.3 c
-12.6 0 -22.14 4.41 -28.63 13.23 c
-5.21 7.11 -7.82 15.94 -7.82 26.47 c
0 12.91 3.83 23.18 11.5 30.82 c
7.66 7.64 16.65 11.47 26.95 11.47 c
8.6 0 16.07 -3.2 22.4 -9.59 c
6.33 -6.39 9.74 -15.86 10.23 -28.41 c
h
3648.11 1910 24.67 0 P
0 8.78 -0.53 14.8 -1.59 18.07 c
-1.06 3.27 -2.71 5.75 -4.95 7.44 c
-1.27 0.98 -2.96 1.48 -5.08 1.48 c
-3.14 0 -5.71 -1.39 -7.71 -4.18 c
-3.57 -4.85 -5.35 -11.5 -5.35 -19.96 c
h
f
3706.35 1940 34.66 0 0 -10.25 P
4.28 4.33 8.38 7.48 12.3 9.45 c
3.93 1.97 8.14 2.95 12.66 2.95 c
5.41 0 9.89 -1.41 13.46 -4.21 c
3.57 -2.8 5.95 -6.29 7.13 -10.45 c
0.95 -3.16 1.44 -9.23 1.44 -18.22 c
0 -30.29 p
0 -5.99 0.64 -9.72 1.9 -11.19 c
1.27 -1.47 3.92 -2.4 7.95 -2.79 c
0 -3 -42.89 0 ^ p
3.09 0.39 5.3 1.61 6.64 3.66 c
0.93 1.39 1.4 4.83 1.4 10.32 c
0 34.62 p
0 6.38 -0.27 10.4 -0.8 12.07 c
-0.53 1.66 -1.44 2.95 -2.71 3.87 c
-1.28 0.92 -2.69 1.39 -4.23 1.39 c
-5.11 0 -9.86 -3.43 -14.25 -10.25 c
0 -41.69 p
0 -5.82 0.58 -9.52 1.75 -11.07 c
1.16 -1.55 3.33 -2.53 6.49 -2.91 c
0 -3 -42.89 0 ^ p
3.76 0.34 6.43 1.39 8.03 3.18 c
1.08 1.22 1.63 4.84 1.63 10.86 c
0 44.1 p
0 5.9 -0.62 9.57 -1.86 11.02 c
-1.24 1.45 -3.84 2.39 -7.79 2.85 c
h
f
3830.95 1978 m
3.93 0 7.25 -1.28 9.96 -3.83 c
2.72 -2.55 4.09 -5.62 4.09 -9.21 c
0 -3.59 -1.38 -6.65 -4.13 -9.17 c
-2.75 -2.52 -6.06 -3.79 -9.92 -3.79 c
-3.87 0 -7.16 1.26 -9.87 3.79 c
-2.72 2.52 -4.08 5.58 -4.08 9.17 c
0 3.59 1.36 6.66 4.08 9.21 c
2.72 2.55 6.01 3.83 9.88 3.83 c
h
3807.81 1940 35.19 0 0 -61.82 P
0 -5.5 0.72 -9.02 2.16 -10.55 c
1.44 -1.53 4.25 -2.41 8.45 -2.63 c
0 -3 -45.8 0 ^ p
3.76 0.11 6.55 1.11 8.37 3.01 c
1.21 1.28 1.82 4.68 1.82 10.19 c
0 45.6 p
0 5.51 -0.7 9.03 -2.09 10.57 c
-1.4 1.53 -4.09 2.41 -8.1 2.64 c
h
f
3861.35 1940 34.66 0 0 -10.25 P
4.28 4.33 8.38 7.48 12.3 9.45 c
3.93 1.97 8.14 2.95 12.66 2.95 c
5.41 0 9.89 -1.41 13.46 -4.21 c
3.57 -2.8 5.95 -6.29 7.13 -10.45 c
0.95 -3.16 1.44 -9.23 1.44 -18.22 c
0 -30.29 p
0 -5.99 0.64 -9.72 1.9 -11.19 c
1.27 -1.47 3.92 -2.4 7.95 -2.79 c
0 -3 -42.89 0 ^ p
3.09 0.39 5.3 1.61 6.64 3.66 c
0.93 1.39 1.4 4.83 1.4 10.32 c
0 34.62 p
0 6.38 -0.27 10.4 -0.8 12.07 c
-0.53 1.66 -1.44 2.95 -2.71 3.87 c
-1.28 0.92 -2.69 1.39 -4.23 1.39 c
-5.11 0 -9.86 -3.43 -14.25 -10.25 c
0 -41.69 p
0 -5.82 0.58 -9.52 1.75 -11.07 c
1.16 -1.55 3.33 -2.53 6.49 -2.91 c
0 -3 -42.89 0 ^ p
3.76 0.34 6.43 1.39 8.03 3.18 c
1.08 1.22 1.63 4.84 1.63 10.86 c
0 44.1 p
0 5.9 -0.62 9.57 -1.86 11.02 c
-1.24 1.45 -3.84 2.39 -7.79 2.85 c
h
f
4019.68 1939 28.56 0 0 -9 -16.23 0 P
2.84 -2.77 4.81 -5.28 5.91 -7.54 c
1.39 -3.04 2.09 -6.23 2.09 -9.55 c
0 -5.64 -1.68 -10.53 -5.01 -14.68 c
-3.34 -4.14 -7.87 -7.39 -13.61 -9.73 c
-5.73 -2.34 -10.82 -3.51 -15.27 -3.51 c
-0.36 0 -3.96 0.29 -10.81 0.89 c
-2.7 0 -4.97 -0.82 -6.8 -2.45 c
-1.83 -1.64 -2.75 -3.59 -2.75 -5.87 c
0 -2 0.83 -3.64 2.49 -4.91 c
1.66 -1.28 4.37 -1.91 8.12 -1.91 c
15.69 0.26 p
12.7 0 21.43 -1.29 26.21 -3.86 c
6.83 -3.57 10.25 -9.08 10.25 -16.51 c
0 -4.75 -1.57 -9.06 -4.71 -12.94 c
-3.14 -3.88 -7.29 -6.75 -12.42 -8.59 c
-7.8 -2.73 -16.77 -4.11 -26.93 -4.11 c
-7.61 0 -14.57 0.68 -20.85 2.04 c
-6.29 1.36 -10.79 3.25 -13.51 5.66 c
-2.72 2.41 -4.08 4.96 -4.08 7.62 c
0 2.55 1.04 4.84 3.13 6.87 c
2.09 2.03 5.96 3.73 11.64 5.12 c
-7.86 3.55 -11.78 8.49 -11.78 14.82 c
0 3.83 1.6 7.55 4.8 11.16 c
3.2 3.61 8.27 6.75 15.23 9.41 c
-8.1 2.72 -13.96 6.3 -17.58 10.74 c
-3.62 4.44 -5.44 9.58 -5.44 15.41 c
0 7.61 3.38 14.2 10.16 19.78 c
6.77 5.58 15.47 8.37 26.11 8.37 c
5.62 0 11.43 -1 17.41 -3 c
h
4003.64 1937 m
-3.54 0 -6.53 -1.64 -8.97 -4.91 c
-2.44 -3.27 -3.66 -10.04 -3.66 -20.31 c
0 -8.32 1.21 -14.03 3.62 -17.13 c
2.41 -3.1 5.27 -4.65 8.56 -4.65 c
3.66 0 6.71 1.54 9.16 4.61 c
2.44 3.07 3.66 9.05 3.66 17.93 c
0 10 -1.37 16.81 -4.12 20.44 c
-1.95 2.68 -4.7 4.03 -8.24 4.03 c
h
3998.48 1851 m
-6.19 0 -10.29 -0.48 -12.29 -1.45 c
-3.46 -1.76 -5.19 -4.14 -5.19 -7.15 c
0 -2.89 1.79 -5.52 5.37 -7.87 c
3.58 -2.36 10.32 -3.54 20.21 -3.54 c
8.44 0 15.07 1.05 19.89 3.15 c
4.82 2.1 7.25 5.05 7.25 8.85 c
0 1.42 -0.47 2.61 -1.38 3.57 c
-1.64 1.7 -4.11 2.87 -7.42 3.49 c
-3.31 0.63 -12.12 0.93 -26.45 0.93 c
h
f
Q q
2649.33 1029.45 417.668 62.2852 re
Y
52.0519 w
1 J
1 j
K
q[0 -0.957138 1.04286 0 0 0]concat
-1101.58 2216.56 0 1048.25 S
Q
Q q
0 0 4400 0 0 3400 ^ Y
0.2 i
K
3453 1197 3 0 1 -37.17 -4 0 P
-1.74 9.37 -6.01 16.91 -12.8 22.61 c
-6.8 5.71 -14.15 8.56 -22.05 8.56 c
-6.11 0 -10.95 -1.54 -14.51 -4.56 c
-3.56 -3.03 -5.34 -6.51 -5.34 -10.46 c
0 -2.5 0.64 -4.72 1.91 -6.66 c
1.76 -2.61 4.57 -5.2 8.45 -7.75 c
2.84 -1.83 9.42 -5.08 19.71 -9.75 c
14.42 -6.5 24.14 -12.64 29.17 -18.41 c
4.97 -5.78 7.46 -12.39 7.46 -19.83 c
0 -9.45 -4.03 -17.57 -12.05 -24.37 c
-8.02 -6.8 -18.21 -10.2 -30.56 -10.2 c
-3.87 0 -7.54 0.36 -10.99 1.09 c
-3.45 0.73 -7.78 2.1 -12.99 4.11 c
-2.91 1.12 -5.3 1.68 -7.17 1.68 c
-1.58 0 -3.24 -0.56 -5 -1.68 c
-1.76 -1.12 -3.18 -2.82 -4.27 -5.12 c
-3.36 0 0 42.95 3.36 0 p
2.66 -12.04 7.79 -21.22 15.37 -27.55 c
7.59 -6.33 15.77 -9.49 24.53 -9.49 c
6.77 0 12.17 1.69 16.19 5.06 c
4.02 3.38 6.03 7.3 6.03 11.79 c
0 2.66 -0.78 5.23 -2.31 7.72 c
-1.54 2.49 -3.87 4.86 -7 7.1 c
-3.13 2.24 -8.67 5.16 -16.61 8.76 c
-11.14 5.04 -19.14 9.32 -24.01 12.87 c
-4.87 3.54 -8.62 7.5 -11.24 11.87 c
-2.62 4.37 -3.93 9.19 -3.93 14.45 c
0 8.96 3.55 16.6 10.67 22.91 c
7.12 6.31 16.09 9.48 26.91 9.48 c
3.95 0 7.77 -0.44 11.48 -1.33 c
2.81 -0.67 6.23 -1.9 10.27 -3.71 c
4.04 -1.8 6.86 -2.7 8.48 -2.7 c
1.55 0 2.78 0.44 3.68 1.33 c
0.89 0.89 1.73 3.02 2.52 6.41 c
h
f
3509.99 1188.29 3.01 0 0 -28.29 20.04 0 0 -8 ^ 0 -48.31 P
0 -4.52 0.22 -7.44 0.68 -8.75 c
0.45 -1.31 1.25 -2.37 2.39 -3.18 c
1.14 -0.81 2.2 -1.21 3.16 -1.21 c
3.91 0 7.61 2.76 11.1 8.29 c
2.71 -1.84 p
-4.84 -10.71 -12.71 -16.07 -23.6 -16.07 c
-5.32 0 -9.82 1.38 -13.5 4.14 c
-3.68 2.76 -6.03 5.84 -7.04 9.25 c
-0.6 1.9 -0.9 7.04 -0.9 15.41 c
0 42.28 -11.55 0 0 2.88 p
7.64 4.88 14.14 10.01 19.5 15.39 c
5.36 5.38 10.05 11.38 14.05 18.02 c
h
f
3541.8 1160 34.2 0 0 -17.82 P
5.68 7.98 10.67 13.28 14.95 15.89 c
4.28 2.62 8.41 3.93 12.38 3.93 c
3.43 0 6.16 -0.97 8.21 -2.91 c
2.05 -1.94 3.08 -4.68 3.08 -8.21 c
0 -3.77 -1 -6.68 -2.98 -8.76 c
-1.99 -2.08 -4.39 -3.12 -7.2 -3.12 c
-3.24 0 -6.05 1 -8.44 3.02 c
-2.39 2.01 -3.79 3.14 -4.22 3.38 c
-0.61 0.36 -1.32 0.53 -2.11 0.53 c
-1.77 0 -3.45 -0.62 -5.04 -1.84 c
-2.51 -1.89 -4.4 -4.58 -5.69 -8.07 c
-1.96 -5.38 -2.93 -11.32 -2.93 -17.81 c
0 -17.89 0.09 -4.66 p
0 -3.16 0.22 -5.19 0.66 -6.07 c
0.75 -1.5 1.87 -2.59 3.34 -3.29 c
1.48 -0.7 3.98 -1.12 7.5 -1.29 c
0 -3 -45.8 0 ^ p
3.6 0.28 6.03 1.21 7.3 2.8 c
1.27 1.59 1.9 5.78 1.9 12.57 c
0 43.18 p
0 4.45 -0.23 7.29 -0.71 8.52 c
-0.59 1.56 -1.45 2.7 -2.57 3.42 c
-1.12 0.72 -3.09 1.23 -5.93 1.51 c
h
f
3670.6 1160 34.4 0 0 -61.07 P
0 -5.95 0.61 -9.66 1.84 -11.14 c
1.23 -1.47 3.71 -2.41 7.46 -2.79 c
0 -3 -34.31 0 0 10.4 p
-4.06 -4.44 -8.12 -7.67 -12.18 -9.7 c
-4.06 -2.02 -8.61 -3.04 -13.64 -3.04 c
-4.79 0 -9.05 1.35 -12.77 4.05 c
-3.73 2.7 -6.23 5.86 -7.5 9.48 c
-1.27 3.62 -1.91 9.94 -1.91 18.95 c
0 30.98 p
0 5.9 -0.6 9.57 -1.79 11.02 c
-1.2 1.45 -3.69 2.39 -7.49 2.85 c
0 3 34.29 0 0 -53.32 p
0 -5.56 0.29 -9.15 0.88 -10.77 c
0.59 -1.61 1.52 -2.84 2.79 -3.67 c
1.27 -0.84 2.73 -1.25 4.4 -1.25 c
2.23 0 4.23 0.53 6.03 1.59 c
2.47 1.45 5.44 4.37 8.9 8.77 c
0 41.77 p
0 5.9 -0.61 9.58 -1.82 11.03 c
-1.21 1.45 -3.74 2.39 -7.59 2.86 c
h
f
3796.41 1102.06 2.86 -1.97 P
-4 -6.78 -8.98 -11.82 -14.94 -15.12 c
-5.96 -3.31 -12.3 -4.96 -19.02 -4.96 c
-11.32 0 -20.36 3.89 -27.14 11.66 c
-6.78 7.77 -10.17 17.12 -10.17 28.04 c
0 10.53 3.05 19.8 9.16 27.8 c
7.37 9.65 17.52 14.49 30.45 14.49 c
8.68 0 15.59 -2.02 20.7 -6.05 c
5.12 -4.03 7.69 -8.53 7.69 -13.5 c
0 -3.14 -1.03 -5.66 -3.07 -7.53 c
-2.04 -1.88 -4.73 -2.82 -8.04 -2.82 c
-3.5 0 -6.38 1.07 -8.66 3.2 c
-2.28 2.13 -3.69 5.94 -4.22 11.41 c
-0.37 3.45 -1.26 5.86 -2.68 7.23 c
-1.41 1.37 -3.07 2.05 -4.98 2.05 c
-2.95 0 -5.47 -1.41 -7.55 -4.22 c
-3.2 -4.24 -4.79 -10.75 -4.79 -19.51 c
0 -7.27 1.29 -14.23 3.86 -20.87 c
2.57 -6.64 6.09 -11.59 10.55 -14.84 c
3.36 -2.37 7.34 -3.55 11.93 -3.55 c
3 0 5.84 0.63 8.54 1.89 c
2.69 1.26 5.87 3.65 9.54 7.16 c
h
f
3839.99 1188.29 3.01 0 0 -28.29 20.04 0 0 -8 ^ 0 -48.31 P
0 -4.52 0.22 -7.44 0.68 -8.75 c
0.45 -1.31 1.25 -2.37 2.39 -3.18 c
1.14 -0.81 2.2 -1.21 3.16 -1.21 c
3.91 0 7.61 2.76 11.1 8.29 c
2.71 -1.84 p
-4.84 -10.71 -12.71 -16.07 -23.6 -16.07 c
-5.32 0 -9.82 1.38 -13.5 4.14 c
-3.68 2.76 -6.03 5.84 -7.04 9.25 c
-0.6 1.9 -0.9 7.04 -0.9 15.41 c
0 42.28 -11.55 0 0 2.88 p
7.64 4.88 14.14 10.01 19.5 15.39 c
5.36 5.38 10.05 11.38 14.05 18.02 c
h
f
3918.6 1160 34.4 0 0 -61.07 P
0 -5.95 0.61 -9.66 1.84 -11.14 c
1.23 -1.47 3.71 -2.41 7.46 -2.79 c
0 -3 -34.31 0 0 10.4 p
-4.06 -4.44 -8.12 -7.67 -12.18 -9.7 c
-4.06 -2.02 -8.61 -3.04 -13.64 -3.04 c
-4.79 0 -9.05 1.35 -12.77 4.05 c
-3.73 2.7 -6.23 5.86 -7.5 9.48 c
-1.27 3.62 -1.91 9.94 -1.91 18.95 c
0 30.98 p
0 5.9 -0.6 9.57 -1.79 11.02 c
-1.2 1.45 -3.69 2.39 -7.49 2.85 c
0 3 34.29 0 0 -53.32 p
0 -5.56 0.29 -9.15 0.88 -10.77 c
0.59 -1.61 1.52 -2.84 2.79 -3.67 c
1.27 -0.84 2.73 -1.25 4.4 -1.25 c
2.23 0 4.23 0.53 6.03 1.59 c
2.47 1.45 5.44 4.37 8.9 8.77 c
0 41.77 p
0 5.9 -0.61 9.58 -1.82 11.03 c
-1.21 1.45 -3.74 2.39 -7.59 2.86 c
h
f
3975.8 1160 34.2 0 0 -17.82 P
5.68 7.98 10.67 13.28 14.95 15.89 c
4.28 2.62 8.41 3.93 12.38 3.93 c
3.43 0 6.16 -0.97 8.21 -2.91 c
2.05 -1.94 3.08 -4.68 3.08 -8.21 c
0 -3.77 -1 -6.68 -2.98 -8.76 c
-1.99 -2.08 -4.39 -3.12 -7.2 -3.12 c
-3.24 0 -6.05 1 -8.44 3.02 c
-2.39 2.01 -3.79 3.14 -4.22 3.38 c
-0.61 0.36 -1.32 0.53 -2.11 0.53 c
-1.77 0 -3.45 -0.62 -5.04 -1.84 c
-2.51 -1.89 -4.4 -4.58 -5.69 -8.07 c
-1.96 -5.38 -2.93 -11.32 -2.93 -17.81 c
0 -17.89 0.09 -4.66 p
0 -3.16 0.22 -5.19 0.66 -6.07 c
0.75 -1.5 1.87 -2.59 3.34 -3.29 c
1.48 -0.7 3.98 -1.12 7.5 -1.29 c
0 -3 -45.8 0 ^ p
3.6 0.28 6.03 1.21 7.3 2.8 c
1.27 1.59 1.9 5.78 1.9 12.57 c
0 43.18 p
0 4.45 -0.23 7.29 -0.71 8.52 c
-0.59 1.56 -1.45 2.7 -2.57 3.42 c
-1.12 0.72 -3.09 1.23 -5.93 1.51 c
h
f
4077.95 1198 m
3.93 0 7.25 -1.28 9.96 -3.83 c
2.72 -2.55 4.09 -5.62 4.09 -9.21 c
0 -3.59 -1.38 -6.65 -4.13 -9.17 c
-2.75 -2.52 -6.06 -3.79 -9.92 -3.79 c
-3.87 0 -7.16 1.26 -9.87 3.79 c
-2.72 2.52 -4.08 5.58 -4.08 9.17 c
0 3.59 1.36 6.66 4.08 9.21 c
2.72 2.55 6.01 3.83 9.88 3.83 c
h
4054.81 1160 35.19 0 0 -61.82 P
0 -5.5 0.72 -9.02 2.16 -10.55 c
1.44 -1.53 4.25 -2.41 8.45 -2.63 c
0 -3 -45.8 0 ^ p
3.76 0.11 6.55 1.11 8.37 3.01 c
1.21 1.28 1.82 4.68 1.82 10.19 c
0 45.6 p
0 5.51 -0.7 9.03 -2.09 10.57 c
-1.4 1.53 -4.09 2.41 -8.1 2.64 c
h
f
4109.35 1160 34.66 0 0 -10.25 P
4.28 4.33 8.38 7.48 12.3 9.45 c
3.93 1.97 8.14 2.95 12.66 2.95 c
5.41 0 9.89 -1.41 13.46 -4.21 c
3.57 -2.8 5.95 -6.29 7.13 -10.45 c
0.95 -3.16 1.44 -9.23 1.44 -18.22 c
0 -30.29 p
0 -5.99 0.64 -9.72 1.9 -11.19 c
1.27 -1.47 3.92 -2.4 7.95 -2.79 c
0 -3 -42.89 0 ^ p
3.09 0.39 5.3 1.61 6.64 3.66 c
0.93 1.39 1.4 4.83 1.4 10.32 c
0 34.62 p
0 6.38 -0.27 10.4 -0.8 12.07 c
-0.53 1.66 -1.44 2.95 -2.71 3.87 c
-1.28 0.92 -2.69 1.39 -4.23 1.39 c
-5.11 0 -9.86 -3.43 -14.25 -10.25 c
0 -41.69 p
0 -5.82 0.58 -9.52 1.75 -11.07 c
1.16 -1.55 3.33 -2.53 6.49 -2.91 c
0 -3 -42.89 0 ^ p
3.76 0.34 6.43 1.39 8.03 3.18 c
1.08 1.22 1.63 4.84 1.63 10.86 c
0 44.1 p
0 5.9 -0.62 9.57 -1.86 11.02 c
-1.24 1.45 -3.84 2.39 -7.79 2.85 c
h
f
4266.68 1159 28.56 0 0 -9 -16.23 0 P
2.84 -2.77 4.81 -5.28 5.91 -7.54 c
1.39 -3.04 2.09 -6.23 2.09 -9.55 c
0 -5.64 -1.68 -10.53 -5.01 -14.68 c
-3.34 -4.14 -7.87 -7.39 -13.61 -9.73 c
-5.73 -2.34 -10.82 -3.51 -15.27 -3.51 c
-0.36 0 -3.96 0.29 -10.81 0.89 c
-2.7 0 -4.97 -0.82 -6.8 -2.45 c
-1.83 -1.64 -2.75 -3.59 -2.75 -5.87 c
0 -2 0.83 -3.64 2.49 -4.91 c
1.66 -1.28 4.37 -1.91 8.12 -1.91 c
15.69 0.26 p
12.7 0 21.43 -1.29 26.21 -3.86 c
6.83 -3.57 10.25 -9.08 10.25 -16.51 c
0 -4.75 -1.57 -9.06 -4.71 -12.94 c
-3.14 -3.88 -7.29 -6.75 -12.42 -8.59 c
-7.8 -2.73 -16.77 -4.11 -26.93 -4.11 c
-7.61 0 -14.57 0.68 -20.85 2.04 c
-6.29 1.36 -10.79 3.25 -13.51 5.66 c
-2.72 2.41 -4.08 4.96 -4.08 7.62 c
0 2.55 1.04 4.84 3.13 6.87 c
2.09 2.03 5.96 3.73 11.64 5.12 c
-7.86 3.55 -11.78 8.49 -11.78 14.82 c
0 3.83 1.6 7.55 4.8 11.16 c
3.2 3.61 8.27 6.75 15.23 9.41 c
-8.1 2.72 -13.96 6.3 -17.58 10.74 c
-3.62 4.44 -5.44 9.58 -5.44 15.41 c
0 7.61 3.38 14.2 10.16 19.78 c
6.77 5.58 15.47 8.37 26.11 8.37 c
5.62 0 11.43 -1 17.41 -3 c
h
4250.64 1157 m
-3.54 0 -6.53 -1.64 -8.97 -4.91 c
-2.44 -3.27 -3.66 -10.04 -3.66 -20.31 c
0 -8.32 1.21 -14.03 3.62 -17.13 c
2.41 -3.1 5.27 -4.65 8.56 -4.65 c
3.66 0 6.71 1.54 9.16 4.61 c
2.44 3.07 3.66 9.05 3.66 17.93 c
0 10 -1.37 16.81 -4.12 20.44 c
-1.95 2.68 -4.7 4.03 -8.24 4.03 c
h
4245.48 1071 m
-6.19 0 -10.29 -0.48 -12.29 -1.45 c
-3.46 -1.76 -5.19 -4.14 -5.19 -7.15 c
0 -2.89 1.79 -5.52 5.37 -7.87 c
3.58 -2.36 10.32 -3.54 20.21 -3.54 c
8.44 0 15.07 1.05 19.89 3.15 c
4.82 2.1 7.25 5.05 7.25 8.85 c
0 1.42 -0.47 2.61 -1.38 3.57 c
-1.64 1.7 -4.11 2.87 -7.42 3.49 c
-3.31 0.63 -12.12 0.93 -26.45 0.93 c
h
f
3447.08 940 -47.08 0 P
0.55 -10.2 3.58 -18.25 9.09 -24.17 c
4.22 -4.55 9.3 -6.82 15.23 -6.82 c
3.67 0 7 0.88 10 2.64 c
3 1.76 6.21 4.92 9.64 9.5 c
3.12 -1.81 p
-4.61 -8.49 -9.7 -14.5 -15.28 -18.03 c
-5.57 -3.53 -12.03 -5.3 -19.36 -5.3 c
-12.6 0 -22.14 4.41 -28.63 13.23 c
-5.21 7.11 -7.82 15.94 -7.82 26.47 c
0 12.91 3.83 23.18 11.5 30.82 c
7.66 7.64 16.65 11.47 26.95 11.47 c
8.6 0 16.07 -3.2 22.4 -9.59 c
6.33 -6.39 9.74 -15.86 10.23 -28.41 c
h
3400.11 946 24.67 0 P
0 8.78 -0.53 14.8 -1.59 18.07 c
-1.06 3.27 -2.71 5.75 -4.95 7.44 c
-1.27 0.98 -2.96 1.48 -5.08 1.48 c
-3.14 0 -5.71 -1.39 -7.71 -4.18 c
-3.57 -4.85 -5.35 -11.5 -5.35 -19.96 c
h
f
3454.9 1011 35.1 0 0 -96.84 P
0 -5.5 0.73 -9.01 2.18 -10.54 c
1.45 -1.53 4.29 -2.4 8.52 -2.62 c
0 -3 -45.8 0 ^ p
3.73 0.11 6.49 1.11 8.3 3 c
1.2 1.28 1.8 4.67 1.8 10.17 c
0 80.73 p
0 5.45 -0.69 8.93 -2.07 10.46 c
-1.38 1.53 -4.06 2.4 -8.03 2.63 c
h
f
3580.08 940 -47.08 0 P
0.55 -10.2 3.58 -18.25 9.09 -24.17 c
4.22 -4.55 9.3 -6.82 15.23 -6.82 c
3.67 0 7 0.88 10 2.64 c
3 1.76 6.21 4.92 9.64 9.5 c
3.12 -1.81 p
-4.61 -8.49 -9.7 -14.5 -15.28 -18.03 c
-5.57 -3.53 -12.03 -5.3 -19.36 -5.3 c
-12.6 0 -22.14 4.41 -28.63 13.23 c
-5.21 7.11 -7.82 15.94 -7.82 26.47 c
0 12.91 3.83 23.18 11.5 30.82 c
7.66 7.64 16.65 11.47 26.95 11.47 c
8.6 0 16.07 -3.2 22.4 -9.59 c
6.33 -6.39 9.74 -15.86 10.23 -28.41 c
h
3533.11 946 24.67 0 P
0 8.78 -0.53 14.8 -1.59 18.07 c
-1.06 3.27 -2.71 5.75 -4.95 7.44 c
-1.27 0.98 -2.96 1.48 -5.08 1.48 c
-3.14 0 -5.71 -1.39 -7.71 -4.18 c
-3.57 -4.85 -5.35 -11.5 -5.35 -19.96 c
h
f
3590.89 976 34.11 0 0 -10.41 P
4.68 4.66 9.02 7.92 13.01 9.78 c
3.99 1.86 8.36 2.79 13.11 2.79 c
5.48 0 10.07 -1.18 13.79 -3.51 c
3.71 -2.33 6.57 -5.88 8.59 -10.65 c
4.87 4.99 9.54 8.6 14.02 10.82 c
4.47 2.22 9.14 3.34 14.02 3.34 c
5.9 0 10.61 -1.25 14.11 -3.71 c
3.5 -2.47 5.94 -5.61 7.3 -9.41 c
1.37 -3.8 2.07 -9.86 2.07 -18.18 c
0 -31.87 p
0 -5.99 0.57 -9.71 1.72 -11.15 c
1.14 -1.44 3.54 -2.38 7.19 -2.83 c
0 -3 -43.8 0 ^ p
3.68 0.28 6.4 1.5 8.14 3.66 c
1.16 1.5 1.75 4.94 1.75 10.32 c
0 33.45 p
0 6.93 -0.32 11.34 -0.94 13.23 c
-0.62 1.88 -1.6 3.29 -2.94 4.2 c
-1.34 0.92 -2.91 1.39 -4.71 1.39 c
-2.68 0 -5.38 -0.89 -8.11 -2.63 c
-2.74 -1.75 -5.5 -4.37 -8.3 -7.86 c
0 -41.77 p
0 -5.61 0.52 -9.12 1.55 -10.57 c
1.39 -2.05 4.07 -3.19 8.02 -3.41 c
0 -3 -43.89 0 ^ p
2.45 0.11 4.38 0.65 5.79 1.62 c
1.41 0.97 2.35 2.14 2.82 3.5 c
0.47 1.36 0.71 4.31 0.71 8.86 c
0 33.45 p
0 7.04 -0.32 11.45 -0.94 13.23 c
-0.62 1.77 -1.67 3.16 -3.13 4.16 c
-1.47 1 -3.04 1.51 -4.73 1.51 c
-2.5 0 -4.77 -0.59 -6.83 -1.76 c
-2.93 -1.72 -6.05 -4.66 -9.36 -8.82 c
0 -41.77 p
0 -5.49 0.62 -9.11 1.85 -10.86 c
1.23 -1.75 3.82 -2.79 7.75 -3.12 c
0 -3 -43.71 0 ^ p
3.55 0.34 6.07 1.39 7.58 3.18 c
1.02 1.22 1.53 4.84 1.53 10.86 c
0 44.1 p
0 5.9 -0.59 9.57 -1.76 11.02 c
-1.17 1.45 -3.62 2.39 -7.35 2.85 c
h
f
3816.08 940 -47.08 0 P
0.55 -10.2 3.58 -18.25 9.09 -24.17 c
4.22 -4.55 9.3 -6.82 15.23 -6.82 c
3.67 0 7 0.88 10 2.64 c
3 1.76 6.21 4.92 9.64 9.5 c
3.12 -1.81 p
-4.61 -8.49 -9.7 -14.5 -15.28 -18.03 c
-5.57 -3.53 -12.03 -5.3 -19.36 -5.3 c
-12.6 0 -22.14 4.41 -28.63 13.23 c
-5.21 7.11 -7.82 15.94 -7.82 26.47 c
0 12.91 3.83 23.18 11.5 30.82 c
7.66 7.64 16.65 11.47 26.95 11.47 c
8.6 0 16.07 -3.2 22.4 -9.59 c
6.33 -6.39 9.74 -15.86 10.23 -28.41 c
h
3769.11 946 24.67 0 P
0 8.78 -0.53 14.8 -1.59 18.07 c
-1.06 3.27 -2.71 5.75 -4.95 7.44 c
-1.27 0.98 -2.96 1.48 -5.08 1.48 c
-3.14 0 -5.71 -1.39 -7.71 -4.18 c
-3.57 -4.85 -5.35 -11.5 -5.35 -19.96 c
h
f
3826.35 976 34.66 0 0 -10.25 P
4.28 4.33 8.38 7.48 12.3 9.45 c
3.93 1.97 8.14 2.95 12.66 2.95 c
5.41 0 9.89 -1.41 13.46 -4.21 c
3.57 -2.8 5.95 -6.29 7.13 -10.45 c
0.95 -3.16 1.44 -9.23 1.44 -18.22 c
0 -30.29 p
0 -5.99 0.64 -9.72 1.9 -11.19 c
1.27 -1.47 3.92 -2.4 7.95 -2.79 c
0 -3 -42.89 0 ^ p
3.09 0.39 5.3 1.61 6.64 3.66 c
0.93 1.39 1.4 4.83 1.4 10.32 c
0 34.62 p
0 6.38 -0.27 10.4 -0.8 12.07 c
-0.53 1.66 -1.44 2.95 -2.71 3.87 c
-1.28 0.92 -2.69 1.39 -4.23 1.39 c
-5.11 0 -9.86 -3.43 -14.25 -10.25 c
0 -41.69 p
0 -5.82 0.58 -9.52 1.75 -11.07 c
1.16 -1.55 3.33 -2.53 6.49 -2.91 c
0 -3 -42.89 0 ^ p
3.76 0.34 6.43 1.39 8.03 3.18 c
1.08 1.22 1.63 4.84 1.63 10.86 c
0 44.1 p
0 5.9 -0.62 9.57 -1.86 11.02 c
-1.24 1.45 -3.84 2.39 -7.79 2.85 c
h
f
3958.99 1004.29 3.01 0 0 -28.29 20.04 0 0 -8 ^ 0 -48.31 P
0 -4.52 0.22 -7.44 0.68 -8.75 c
0.45 -1.31 1.25 -2.37 2.39 -3.18 c
1.14 -0.81 2.2 -1.21 3.16 -1.21 c
3.91 0 7.61 2.76 11.1 8.29 c
2.71 -1.84 p
-4.84 -10.71 -12.71 -16.07 -23.6 -16.07 c
-5.32 0 -9.82 1.38 -13.5 4.14 c
-3.68 2.76 -6.03 5.84 -7.04 9.25 c
-0.6 1.9 -0.9 7.04 -0.9 15.41 c
0 42.28 -11.55 0 0 2.88 p
7.64 4.88 14.14 10.01 19.5 15.39 c
5.36 5.38 10.05 11.38 14.05 18.02 c
h
f
cleartomark end end pagesave restore
 showpage
%%PageTrailer
%%Trailer
%%Pages: 1
%%EOF
