<?xml version="1.0" encoding="UTF-8" standalone="no"?>
<!-- Created with Inkscape (http://www.inkscape.org/) -->

<svg
   xmlns:dc="http://purl.org/dc/elements/1.1/"
   xmlns:cc="http://creativecommons.org/ns#"
   xmlns:rdf="http://www.w3.org/1999/02/22-rdf-syntax-ns#"
   xmlns:svg="http://www.w3.org/2000/svg"
   xmlns="http://www.w3.org/2000/svg"
   xmlns:xlink="http://www.w3.org/1999/xlink"
   xmlns:sodipodi="http://sodipodi.sourceforge.net/DTD/sodipodi-0.dtd"
   xmlns:inkscape="http://www.inkscape.org/namespaces/inkscape"
   width="264.06671"
   height="279.0957"
   id="svg3014"
   version="1.1"
   inkscape:version="0.48.0 r9654"
   sodipodi:docname="sds.pdf">
  <defs
     id="defs3016" />
  <sodipodi:namedview
     id="base"
     pagecolor="#ffffff"
     bordercolor="#666666"
     borderopacity="1.0"
     inkscape:pageopacity="0.0"
     inkscape:pageshadow="2"
     inkscape:zoom="2.8"
     inkscape:cx="122.53479"
     inkscape:cy="172.36303"
     inkscape:document-units="px"
     inkscape:current-layer="layer1"
     showgrid="false"
     inkscape:window-width="1680"
     inkscape:window-height="972"
     inkscape:window-x="1280"
     inkscape:window-y="24"
     inkscape:window-maximized="1"
     fit-margin-top="0"
     fit-margin-left="0"
     fit-margin-right="0"
     fit-margin-bottom="0" />
  <metadata
     id="metadata3019">
    <rdf:RDF>
      <cc:Work
         rdf:about="">
        <dc:format>image/svg+xml</dc:format>
        <dc:type
           rdf:resource="http://purl.org/dc/dcmitype/StillImage" />
        <dc:title></dc:title>
      </cc:Work>
    </rdf:RDF>
  </metadata>
  <g
     inkscape:label="Calque 1"
     inkscape:groupmode="layer"
     id="layer1"
     transform="translate(-144.99997,-206.26647)">
    <image
       y="219.36218"
       x="144.99997"
       id="image3065"
       xlink:href="file:///home/langella/office/bilan11/pappso/2011_03_16_proteomevert%20Toulouse/masschroq/images/sds-page.jpg"
       height="266"
       width="230" />
    <rect
       style="opacity:0.52027031;fill:none;stroke:#ff0000;stroke-width:1.70000005;stroke-miterlimit:4;stroke-opacity:1;stroke-dasharray:none"
       id="rect3068"
       width="185.36299"
       height="9.0913725"
       x="188.39345"
       y="252.82645"
       ry="4.5456862" />
    <text
       xml:space="preserve"
       style="font-size:24.81693077px;font-style:normal;font-variant:normal;font-weight:bold;font-stretch:normal;line-height:125%;letter-spacing:0px;word-spacing:0px;fill:#ff0000;fill-opacity:1;stroke:none;font-family:Arial Black;-inkscape-font-specification:'Arial Black, Bold'"
       x="392.60696"
       y="258.25275"
       id="text3838"
       sodipodi:linespacing="125%"
       transform="scale(0.96671915,1.0344266)"><tspan
         sodipodi:role="line"
         id="tspan3840"
         x="392.60696"
         y="258.25275"
         style="font-style:normal;font-variant:normal;font-weight:bold;font-stretch:normal;fill:#ff0000;fill-opacity:1;font-family:Arial;-inkscape-font-specification:Arial Bold">G1</tspan></text>
    <rect
       style="opacity:0.52027031;fill:none;stroke:#ff0000;stroke-width:1.6520505;stroke-miterlimit:4;stroke-opacity:1;stroke-dasharray:none"
       id="rect3068-8"
       width="185.36299"
       height="8.5857496"
       x="187.13077"
       y="315.4559"
       ry="4.2928748" />
    <path
       sodipodi:type="arc"
       style="opacity:0.52027031;fill:none;stroke:#faff00;stroke-width:1.70000005;stroke-linejoin:round;stroke-miterlimit:4;stroke-opacity:1;stroke-dasharray:none;stroke-dashoffset:0"
       id="path3860"
       sodipodi:cx="207.58635"
       sodipodi:cy="257.8772"
       sodipodi:rx="15.657364"
       sodipodi:ry="4.0406103"
       d="m 223.24371,257.8772 c 0,2.23156 -7.01004,4.04061 -15.65736,4.04061 -8.64732,0 -15.65736,-1.80905 -15.65736,-4.04061 0,-2.23157 7.01004,-4.04061 15.65736,-4.04061 8.64732,0 15.65736,1.80904 15.65736,4.04061 z" />
    <text
       xml:space="preserve"
       style="font-size:14.13802814px;font-style:normal;font-variant:normal;font-weight:bold;font-stretch:normal;line-height:125%;letter-spacing:0px;word-spacing:0px;fill:#faff00;fill-opacity:1;stroke:none;font-family:Arial;-inkscape-font-specification:Arial Bold"
       x="188.25471"
       y="248.73308"
       id="text3862"
       sodipodi:linespacing="125%"><tspan
         sodipodi:role="line"
         id="tspan3864"
         x="188.25471"
         y="248.73308">Ech1</tspan></text>
    <path
       transform="translate(40.406101,-1.0101446)"
       sodipodi:type="arc"
       style="opacity:0.52027031;fill:none;stroke:#faff00;stroke-width:1.70000005;stroke-linejoin:round;stroke-miterlimit:4;stroke-opacity:1;stroke-dasharray:none;stroke-dashoffset:0"
       id="path3860-9"
       sodipodi:cx="207.58635"
       sodipodi:cy="257.8772"
       sodipodi:rx="15.657364"
       sodipodi:ry="4.0406103"
       d="m 223.24371,257.8772 c 0,2.23156 -7.01004,4.04061 -15.65736,4.04061 -8.64732,0 -15.65736,-1.80905 -15.65736,-4.04061 0,-2.23157 7.01004,-4.04061 15.65736,-4.04061 8.64732,0 15.65736,1.80904 15.65736,4.04061 z" />
    <path
       transform="translate(75.256363,-1.0101444)"
       sodipodi:type="arc"
       style="opacity:0.52027031;fill:none;stroke:#faff00;stroke-width:1.70000005;stroke-linejoin:round;stroke-miterlimit:4;stroke-opacity:1;stroke-dasharray:none;stroke-dashoffset:0"
       id="path3860-2"
       sodipodi:cx="207.58635"
       sodipodi:cy="257.8772"
       sodipodi:rx="15.657364"
       sodipodi:ry="4.0406103"
       d="m 223.24371,257.8772 c 0,2.23156 -7.01004,4.04061 -15.65736,4.04061 -8.64732,0 -15.65736,-1.80905 -15.65736,-4.04061 0,-2.23157 7.01004,-4.04061 15.65736,-4.04061 8.64732,0 15.65736,1.80904 15.65736,4.04061 z" />
    <path
       transform="translate(110.6117,-0.50506856)"
       sodipodi:type="arc"
       style="opacity:0.52027031;fill:none;stroke:#faff00;stroke-width:1.70000005;stroke-linejoin:round;stroke-miterlimit:4;stroke-opacity:1;stroke-dasharray:none;stroke-dashoffset:0"
       id="path3860-3"
       sodipodi:cx="207.58635"
       sodipodi:cy="257.8772"
       sodipodi:rx="15.657364"
       sodipodi:ry="4.0406103"
       d="m 223.24371,257.8772 c 0,2.23156 -7.01004,4.04061 -15.65736,4.04061 -8.64732,0 -15.65736,-1.80905 -15.65736,-4.04061 0,-2.23157 7.01004,-4.04061 15.65736,-4.04061 8.64732,0 15.65736,1.80904 15.65736,4.04061 z" />
    <path
       transform="translate(146.97719,-1.0101442)"
       sodipodi:type="arc"
       style="opacity:0.52027031;fill:none;stroke:#faff00;stroke-width:1.70000005;stroke-linejoin:round;stroke-miterlimit:4;stroke-opacity:1;stroke-dasharray:none;stroke-dashoffset:0"
       id="path3860-8"
       sodipodi:cx="207.58635"
       sodipodi:cy="257.8772"
       sodipodi:rx="15.657364"
       sodipodi:ry="4.0406103"
       d="m 223.24371,257.8772 c 0,2.23156 -7.01004,4.04061 -15.65736,4.04061 -8.64732,0 -15.65736,-1.80905 -15.65736,-4.04061 0,-2.23157 7.01004,-4.04061 15.65736,-4.04061 8.64732,0 15.65736,1.80904 15.65736,4.04061 z" />
    <text
       xml:space="preserve"
       style="font-size:14.13802814px;font-style:normal;font-variant:normal;font-weight:bold;font-stretch:normal;line-height:125%;letter-spacing:0px;word-spacing:0px;fill:#faff00;fill-opacity:1;stroke:none;font-family:Arial;-inkscape-font-specification:Arial Bold"
       x="227.20323"
       y="248.73308"
       id="text3862-4"
       sodipodi:linespacing="125%"><tspan
         sodipodi:role="line"
         id="tspan3864-1"
         x="227.20323"
         y="248.73308">Ech2</tspan></text>
    <text
       xml:space="preserve"
       style="font-size:14.13802814px;font-style:normal;font-variant:normal;font-weight:bold;font-stretch:normal;line-height:125%;letter-spacing:0px;word-spacing:0px;fill:#faff00;fill-opacity:1;stroke:none;font-family:Arial;-inkscape-font-specification:Arial Bold"
       x="264.89389"
       y="248.73308"
       id="text3862-1"
       sodipodi:linespacing="125%"><tspan
         sodipodi:role="line"
         id="tspan3864-3"
         x="264.89389"
         y="248.73308">Ech3</tspan></text>
    <text
       xml:space="preserve"
       style="font-size:14.13802814px;font-style:normal;font-variant:normal;font-weight:bold;font-stretch:normal;line-height:125%;letter-spacing:0px;word-spacing:0px;fill:#faff00;fill-opacity:1;stroke:none;font-family:Arial;-inkscape-font-specification:Arial Bold"
       x="300.49478"
       y="248.73308"
       id="text3862-6"
       sodipodi:linespacing="125%"><tspan
         sodipodi:role="line"
         id="tspan3864-38"
         x="300.49478"
         y="248.73308">Ech4</tspan></text>
    <text
       xml:space="preserve"
       style="font-size:14.13802814px;font-style:normal;font-variant:normal;font-weight:bold;font-stretch:normal;line-height:125%;letter-spacing:0px;word-spacing:0px;fill:#faff00;fill-opacity:1;stroke:none;font-family:Arial;-inkscape-font-specification:Arial Bold"
       x="338.28894"
       y="248.69165"
       id="text3862-66"
       sodipodi:linespacing="125%"><tspan
         sodipodi:role="line"
         id="tspan3864-35"
         x="338.28894"
         y="248.69165">Ech5</tspan></text>
    <text
       xml:space="preserve"
       style="font-size:24.81693077px;font-style:normal;font-variant:normal;font-weight:bold;font-stretch:normal;line-height:125%;letter-spacing:0px;word-spacing:0px;fill:#ff0000;fill-opacity:1;stroke:none;font-family:Arial Black;-inkscape-font-specification:'Arial Black, Bold'"
       x="391.21341"
       y="317.74564"
       id="text3838-9"
       sodipodi:linespacing="125%"
       transform="scale(0.96671915,1.0344266)"><tspan
         sodipodi:role="line"
         id="tspan3840-0"
         x="391.21341"
         y="317.74564"
         style="font-style:normal;font-variant:normal;font-weight:bold;font-stretch:normal;fill:#ff0000;fill-opacity:1;font-family:Arial;-inkscape-font-specification:Arial Bold">G2</tspan></text>
    <path
       transform="translate(-1.3860041e-6,61.619313)"
       sodipodi:type="arc"
       style="opacity:0.52027031;fill:none;stroke:#faff00;stroke-width:1.70000005;stroke-linejoin:round;stroke-miterlimit:4;stroke-opacity:1;stroke-dasharray:none;stroke-dashoffset:0"
       id="path3860-5"
       sodipodi:cx="207.58635"
       sodipodi:cy="257.8772"
       sodipodi:rx="15.657364"
       sodipodi:ry="4.0406103"
       d="m 223.24371,257.8772 c 0,2.23156 -7.01004,4.04061 -15.65736,4.04061 -8.64732,0 -15.65736,-1.80905 -15.65736,-4.04061 0,-2.23157 7.01004,-4.04061 15.65736,-4.04061 8.64732,0 15.65736,1.80904 15.65736,4.04061 z" />
    <path
       transform="translate(39.395948,62.12439)"
       sodipodi:type="arc"
       style="opacity:0.52027031;fill:none;stroke:#faff00;stroke-width:1.70000005;stroke-linejoin:round;stroke-miterlimit:4;stroke-opacity:1;stroke-dasharray:none;stroke-dashoffset:0"
       id="path3860-4"
       sodipodi:cx="207.58635"
       sodipodi:cy="257.8772"
       sodipodi:rx="15.657364"
       sodipodi:ry="4.0406103"
       d="m 223.24371,257.8772 c 0,2.23156 -7.01004,4.04061 -15.65736,4.04061 -8.64732,0 -15.65736,-1.80905 -15.65736,-4.04061 0,-2.23157 7.01004,-4.04061 15.65736,-4.04061 8.64732,0 15.65736,1.80904 15.65736,4.04061 z" />
    <path
       transform="translate(75.76144,61.619313)"
       sodipodi:type="arc"
       style="opacity:0.52027031;fill:none;stroke:#faff00;stroke-width:1.70000005;stroke-linejoin:round;stroke-miterlimit:4;stroke-opacity:1;stroke-dasharray:none;stroke-dashoffset:0"
       id="path3860-89"
       sodipodi:cx="207.58635"
       sodipodi:cy="257.8772"
       sodipodi:rx="15.657364"
       sodipodi:ry="4.0406103"
       d="m 223.24371,257.8772 c 0,2.23156 -7.01004,4.04061 -15.65736,4.04061 -8.64732,0 -15.65736,-1.80905 -15.65736,-4.04061 0,-2.23157 7.01004,-4.04061 15.65736,-4.04061 8.64732,0 15.65736,1.80904 15.65736,4.04061 z" />
    <path
       transform="translate(113.13708,61.619313)"
       sodipodi:type="arc"
       style="opacity:0.52027031;fill:none;stroke:#faff00;stroke-width:1.70000005;stroke-linejoin:round;stroke-miterlimit:4;stroke-opacity:1;stroke-dasharray:none;stroke-dashoffset:0"
       id="path3860-897"
       sodipodi:cx="207.58635"
       sodipodi:cy="257.8772"
       sodipodi:rx="15.657364"
       sodipodi:ry="4.0406103"
       d="m 223.24371,257.8772 c 0,2.23156 -7.01004,4.04061 -15.65736,4.04061 -8.64732,0 -15.65736,-1.80905 -15.65736,-4.04061 0,-2.23157 7.01004,-4.04061 15.65736,-4.04061 8.64732,0 15.65736,1.80904 15.65736,4.04061 z" />
    <path
       transform="translate(146.47212,61.114237)"
       sodipodi:type="arc"
       style="opacity:0.52027031;fill:none;stroke:#faff00;stroke-width:1.70000005;stroke-linejoin:round;stroke-miterlimit:4;stroke-opacity:1;stroke-dasharray:none;stroke-dashoffset:0"
       id="path3860-6"
       sodipodi:cx="207.58635"
       sodipodi:cy="257.8772"
       sodipodi:rx="15.657364"
       sodipodi:ry="4.0406103"
       d="m 223.24371,257.8772 c 0,2.23156 -7.01004,4.04061 -15.65736,4.04061 -8.64732,0 -15.65736,-1.80905 -15.65736,-4.04061 0,-2.23157 7.01004,-4.04061 15.65736,-4.04061 8.64732,0 15.65736,1.80904 15.65736,4.04061 z" />
    <rect
       style="opacity:0.52027031;fill:none;stroke:#ff0000;stroke-width:1.6520505;stroke-miterlimit:4;stroke-opacity:1;stroke-dasharray:none"
       id="rect3068-8-9"
       width="185.36299"
       height="8.5857496"
       x="187.63582"
       y="387.68207"
       ry="4.2928748" />
    <text
       xml:space="preserve"
       style="font-size:24.81693077px;font-style:normal;font-variant:normal;font-weight:bold;font-stretch:normal;line-height:125%;letter-spacing:0px;word-spacing:0px;fill:#ff0000;fill-opacity:1;stroke:none;font-family:Arial Black;-inkscape-font-specification:'Arial Black, Bold'"
       x="391.12253"
       y="386.59125"
       id="text3838-9-7"
       sodipodi:linespacing="125%"
       transform="scale(0.96671915,1.0344266)"><tspan
         sodipodi:role="line"
         id="tspan3840-0-5"
         x="391.12253"
         y="386.59125"
         style="font-style:normal;font-variant:normal;font-weight:bold;font-stretch:normal;fill:#ff0000;fill-opacity:1;font-family:Arial;-inkscape-font-specification:Arial Bold">G3</tspan></text>
    <text
       xml:space="preserve"
       style="font-size:40px;font-style:normal;font-variant:normal;font-weight:bold;font-stretch:normal;line-height:125%;letter-spacing:0px;word-spacing:0px;fill:#ff0000;fill-opacity:1;stroke:none;font-family:Arial Black;-inkscape-font-specification:'Arial Black, Bold'"
       x="387.49026"
       y="416.97623"
       id="text4085"
       sodipodi:linespacing="125%"><tspan
         sodipodi:role="line"
         id="tspan4087"
         x="387.49026"
         y="416.97623">.</tspan></text>
    <text
       xml:space="preserve"
       style="font-size:40px;font-style:normal;font-variant:normal;font-weight:bold;font-stretch:normal;line-height:125%;letter-spacing:0px;word-spacing:0px;fill:#ff0000;fill-opacity:1;stroke:none;font-family:Arial Black;-inkscape-font-specification:'Arial Black, Bold'"
       x="387.49026"
       y="435.63593"
       id="text4085-4"
       sodipodi:linespacing="125%"><tspan
         sodipodi:role="line"
         id="tspan4087-9"
         x="387.49026"
         y="435.63593">.</tspan></text>
    <text
       xml:space="preserve"
       style="font-size:40px;font-style:normal;font-variant:normal;font-weight:bold;font-stretch:normal;line-height:125%;letter-spacing:0px;word-spacing:0px;fill:#ff0000;fill-opacity:1;stroke:none;font-family:Arial Black;-inkscape-font-specification:'Arial Black, Bold'"
       x="387.49026"
       y="454.29562"
       id="text4085-9"
       sodipodi:linespacing="125%"><tspan
         sodipodi:role="line"
         id="tspan4087-0"
         x="387.49026"
         y="454.29562">.</tspan></text>
    <rect
       style="opacity:0.52027031;fill:none;stroke:#00f4ff;stroke-width:1.47961581;stroke-linejoin:round;stroke-miterlimit:4;stroke-opacity:1;stroke-dasharray:none;stroke-dashoffset:0"
       id="rect4175"
       width="36.291813"
       height="258.79181"
       x="187.03264"
       y="219.55975"
       ry="7.4986849" />
    <rect
       style="opacity:0.52027031;fill:none;stroke:#00f4ff;stroke-width:1.45073283;stroke-linejoin:round;stroke-miterlimit:4;stroke-opacity:1;stroke-dasharray:none;stroke-dashoffset:0"
       id="rect4175-7"
       width="34.888763"
       height="258.79181"
       x="227.92549"
       y="219.54532"
       ry="7.4986849" />
    <rect
       style="opacity:0.52027031;fill:none;stroke:#00f4ff;stroke-width:1.43551338;stroke-linejoin:round;stroke-miterlimit:4;stroke-opacity:1;stroke-dasharray:none;stroke-dashoffset:0"
       id="rect4175-7-6"
       width="34.160576"
       height="258.79181"
       x="265.41275"
       y="219.5377"
       ry="7.4986849" />
    <rect
       style="opacity:0.52027031;fill:none;stroke:#00f4ff;stroke-width:1.43551338;stroke-linejoin:round;stroke-miterlimit:4;stroke-opacity:1;stroke-dasharray:none;stroke-dashoffset:0"
       id="rect4175-7-6-1"
       width="34.160576"
       height="258.79181"
       x="301.84827"
       y="219.5377"
       ry="7.4986849" />
    <rect
       style="opacity:0.52027031;fill:none;stroke:#00f4ff;stroke-width:1.43551338;stroke-linejoin:round;stroke-miterlimit:4;stroke-opacity:1;stroke-dasharray:none;stroke-dashoffset:0"
       id="rect4175-7-6-3"
       width="34.160576"
       height="258.79181"
       x="338.27682"
       y="219.5377"
       ry="7.4986849" />
    <text
       xml:space="preserve"
       style="font-size:14.13802814px;font-style:normal;font-variant:normal;font-weight:bold;font-stretch:normal;line-height:125%;letter-spacing:0px;word-spacing:0px;fill:#00f4ff;fill-opacity:1;stroke:none;font-family:Arial;-inkscape-font-specification:Arial Bold"
       x="188.01106"
       y="216.43163"
       id="text3862-44"
       sodipodi:linespacing="125%"><tspan
         sodipodi:role="line"
         id="tspan3864-381"
         x="188.01106"
         y="216.43163">Ind1</tspan></text>
    <text
       xml:space="preserve"
       style="font-size:14.13802814px;font-style:normal;font-variant:normal;font-weight:bold;font-stretch:normal;line-height:125%;letter-spacing:0px;word-spacing:0px;fill:#00f4ff;fill-opacity:1;stroke:none;font-family:Arial;-inkscape-font-specification:Arial Bold"
       x="264.55029"
       y="216.42818"
       id="text3862-44-5"
       sodipodi:linespacing="125%"><tspan
         sodipodi:role="line"
         id="tspan3864-381-7"
         x="264.55029"
         y="216.42818">Ind3</tspan></text>
    <text
       xml:space="preserve"
       style="font-size:14.13802814px;font-style:normal;font-variant:normal;font-weight:bold;font-stretch:normal;line-height:125%;letter-spacing:0px;word-spacing:0px;fill:#00f4ff;fill-opacity:1;stroke:none;font-family:Arial;-inkscape-font-specification:Arial Bold"
       x="303.10126"
       y="216.43163"
       id="text3862-44-3"
       sodipodi:linespacing="125%"><tspan
         sodipodi:role="line"
         id="tspan3864-381-75"
         x="303.10126"
         y="216.43163">Ind4</tspan></text>
    <text
       xml:space="preserve"
       style="font-size:14.13802814px;font-style:normal;font-variant:normal;font-weight:bold;font-stretch:normal;line-height:125%;letter-spacing:0px;word-spacing:0px;fill:#00f4ff;fill-opacity:1;stroke:none;font-family:Arial;-inkscape-font-specification:Arial Bold"
       x="341.84546"
       y="216.40747"
       id="text3862-44-4"
       sodipodi:linespacing="125%"><tspan
         sodipodi:role="line"
         id="tspan3864-381-5"
         x="341.84546"
         y="216.40747">Ind5</tspan></text>
    <text
       xml:space="preserve"
       style="font-size:14.13802814px;font-style:normal;font-variant:normal;font-weight:bold;font-stretch:normal;line-height:125%;letter-spacing:0px;word-spacing:0px;fill:#00f4ff;fill-opacity:1;stroke:none;font-family:Arial;-inkscape-font-specification:Arial Bold"
       x="225.90964"
       y="216.43163"
       id="text3862-44-2"
       sodipodi:linespacing="125%"><tspan
         sodipodi:role="line"
         id="tspan3864-381-9"
         x="225.90964"
         y="216.43163">Ind2</tspan></text>
  </g>
</svg>
