<?xml version="1.0" encoding="UTF-8" standalone="no"?>
<!-- Created with Inkscape (http://www.inkscape.org/) -->

<svg
   xmlns:dc="http://purl.org/dc/elements/1.1/"
   xmlns:cc="http://creativecommons.org/ns#"
   xmlns:rdf="http://www.w3.org/1999/02/22-rdf-syntax-ns#"
   xmlns:svg="http://www.w3.org/2000/svg"
   xmlns="http://www.w3.org/2000/svg"
   xmlns:sodipodi="http://sodipodi.sourceforge.net/DTD/sodipodi-0.dtd"
   xmlns:inkscape="http://www.inkscape.org/namespaces/inkscape"
   width="210mm"
   height="297mm"
   id="svg4480"
   version="1.1"
   inkscape:version="0.48.0 r9654"
   sodipodi:docname="decalages.svg">
  <defs
     id="defs4482">
    <marker
       inkscape:stockid="Arrow2Lend"
       orient="auto"
       refY="0.0"
       refX="0.0"
       id="Arrow2Lend"
       style="overflow:visible;">
      <path
         id="path5117"
         style="font-size:12.0;fill-rule:evenodd;stroke-width:0.62500000;stroke-linejoin:round;"
         d="M 8.7185878,4.0337352 L -2.2072895,0.016013256 L 8.7185884,-4.0017078 C 6.9730900,-1.6296469 6.9831476,1.6157441 8.7185878,4.0337352 z "
         transform="scale(1.1) rotate(180) translate(1,0)" />
    </marker>
    <marker
       inkscape:stockid="Arrow2Mend"
       orient="auto"
       refY="0.0"
       refX="0.0"
       id="Arrow2Mend"
       style="overflow:visible;">
      <path
         id="path5123"
         style="font-size:12px;fill:#ff0400;fill-rule:evenodd;stroke:#ff0400;stroke-width:0.625;stroke-linejoin:round"
         d="M 8.7185878,4.0337352 -2.2072895,0.01601326 8.7185884,-4.0017078 c -1.7454984,2.3720609 -1.7354408,5.6174519 -6e-7,8.035443 z"
         transform="scale(-0.6,-0.6)"
         inkscape:connector-curvature="0" />
    </marker>
    <marker
       inkscape:stockid="Arrow1Lend"
       orient="auto"
       refY="0.0"
       refX="0.0"
       id="Arrow1Lend"
       style="overflow:visible;">
      <path
         id="path5099"
         d="M 0.0,0.0 L 5.0,-5.0 L -12.5,0.0 L 5.0,5.0 L 0.0,0.0 z "
         style="fill-rule:evenodd;stroke:#000000;stroke-width:1.0pt;marker-start:none;"
         transform="scale(0.8) rotate(180) translate(12.5,0)" />
    </marker>
    <marker
       inkscape:stockid="Arrow2Lend"
       orient="auto"
       refY="0"
       refX="0"
       id="Arrow2Lend-1"
       style="overflow:visible">
      <path
         inkscape:connector-curvature="0"
         id="path5117-7"
         style="font-size:12px;fill-rule:evenodd;stroke-width:0.625;stroke-linejoin:round"
         d="M 8.7185878,4.0337352 -2.2072895,0.01601326 8.7185884,-4.0017078 c -1.7454984,2.3720609 -1.7354408,5.6174519 -6e-7,8.035443 z"
         transform="matrix(-1.1,0,0,-1.1,-1.1,0)" />
    </marker>
    <marker
       inkscape:stockid="Arrow2Mend"
       orient="auto"
       refY="0"
       refX="0"
       id="Arrow2Mend-2"
       style="overflow:visible">
      <path
         id="path5123-5"
         style="font-size:12px;fill:#ff0400;fill-rule:evenodd;stroke:#ff0400;stroke-width:0.625;stroke-linejoin:round"
         d="M 8.7185878,4.0337352 -2.2072895,0.01601326 8.7185884,-4.0017078 c -1.7454984,2.3720609 -1.7354408,5.6174519 -6e-7,8.035443 z"
         transform="scale(-0.6,-0.6)"
         inkscape:connector-curvature="0" />
    </marker>
  </defs>
  <sodipodi:namedview
     id="base"
     pagecolor="#ffffff"
     bordercolor="#666666"
     borderopacity="1.0"
     inkscape:pageopacity="0.0"
     inkscape:pageshadow="2"
     inkscape:zoom="1.4"
     inkscape:cx="370.99503"
     inkscape:cy="491.76123"
     inkscape:document-units="px"
     inkscape:current-layer="layer1"
     showgrid="false"
     inkscape:window-width="1680"
     inkscape:window-height="972"
     inkscape:window-x="1280"
     inkscape:window-y="24"
     inkscape:window-maximized="1" />
  <metadata
     id="metadata4485">
    <rdf:RDF>
      <cc:Work
         rdf:about="">
        <dc:format>image/svg+xml</dc:format>
        <dc:type
           rdf:resource="http://purl.org/dc/dcmitype/StillImage" />
        <dc:title></dc:title>
      </cc:Work>
    </rdf:RDF>
  </metadata>
  <g
     inkscape:label="Calque 1"
     inkscape:groupmode="layer"
     id="layer1">
    <g
       id="g6263">
      <path
         inkscape:connector-curvature="0"
         id="path5763"
         d="M 50.507627,352.32647 681.85297,351.31632"
         style="fill:none;stroke:#000000;stroke-width:1px;stroke-linecap:butt;stroke-linejoin:miter;stroke-opacity:1;marker-mid:none;marker-end:url(#Arrow2Lend)" />
      <g
         id="g6249">
        <path
           style="fill:#f1dadb;stroke:none;stroke-width:1px;stroke-linecap:butt;stroke-linejoin:miter;stroke-opacity:1;fill-opacity:1"
           d="m 167.68532,314.95082 c 35.09732,-52.1647 36.87057,-276.781793 36.87057,-276.781793 0,0 44.3927,272.384133 79.80205,278.297023 -46.413,0.86214 -94.19123,-1.37339 -116.67262,-1.51523 z"
           id="path6157"
           inkscape:connector-curvature="0"
           sodipodi:nodetypes="cccc" />
        <path
           style="fill:none;stroke:#0000ff;stroke-width:2.10000000000000009;stroke-linecap:butt;stroke-linejoin:miter;stroke-opacity:1;stroke-miterlimit:4;stroke-dasharray:none"
           d="m 65.773758,322.89445 c 0,0 76.491952,1.70287 96.796222,-5.22408 20.30428,-6.92695 33.84,-93.94846 42.54026,-282.337199 48.09621,270.220519 63.14688,274.175859 88.05148,280.143579 24.90459,5.96772 97.31618,5.05076 97.31618,5.05076 0,0 50.51322,5.42079 63.00071,-100.17842 6.24375,6.29432 24.22217,76.24738 51.75133,91.08878 11.36672,17.87186 145.42127,10.93663 145.42127,10.93663"
           id="path4563"
           inkscape:connector-curvature="0"
           sodipodi:nodetypes="czczcccc" />
        <path
           sodipodi:type="arc"
           style="opacity:1;fill:none;fill-opacity:1;stroke:#ff0400;stroke-width:3.60000000000000009;stroke-linejoin:round;stroke-miterlimit:4;stroke-opacity:1;stroke-dasharray:none;stroke-dashoffset:0"
           id="path5073"
           sodipodi:cx="200.51527"
           sodipodi:cy="101.80864"
           sodipodi:rx="8.586297"
           sodipodi:ry="14.142136"
           d="m 209.10157,101.80864 a 8.586297,14.142136 0 1 1 -17.17259,0 8.586297,14.142136 0 1 1 17.17259,0 z" />
        <text
           xml:space="preserve"
           style="font-size:40px;font-style:normal;font-variant:normal;font-weight:bold;font-stretch:normal;line-height:125%;letter-spacing:0px;word-spacing:0px;fill:#ff0400;fill-opacity:1;stroke:none;font-family:Arial Black;-inkscape-font-specification:'Arial Black, Bold'"
           x="122.22846"
           y="16.955822"
           id="text5077"
           sodipodi:linespacing="125%"><tspan
             sodipodi:role="line"
             x="122.22846"
             y="66.955826"
             id="tspan5081"
             style="font-style:normal;font-variant:normal;font-weight:bold;font-stretch:normal;font-family:Arial;-inkscape-font-specification:Arial Bold">peptide1</tspan></text>
        <path
           style="fill:none;stroke:#ff0400;stroke-width:4.19999981;stroke-linecap:butt;stroke-linejoin:miter;stroke-miterlimit:4;stroke-opacity:1;stroke-dasharray:none;marker-end:url(#Arrow2Mend)"
           d="m 191.92898,93.727417 c 0,0 -17.50924,-14.007287 -22.22335,-26.263966 -5.05076,-13.131983 -3.03046,-15.152288 2.02031,-32.324882"
           id="path5091"
           inkscape:connector-curvature="0"
           sodipodi:nodetypes="csc" />
        <path
           style="fill:none;stroke:#000000;stroke-width:1px;stroke-linecap:butt;stroke-linejoin:miter;stroke-opacity:1"
           d="m 163.64471,268.48381 0,80.30713"
           id="path6137"
           inkscape:connector-curvature="0"
           sodipodi:nodetypes="cc" />
        <path
           style="fill:none;stroke:#000000;stroke-width:1px;stroke-linecap:butt;stroke-linejoin:miter;stroke-opacity:1"
           d="m 281.83256,269.99904 0,79.29697"
           id="path6137-8"
           inkscape:connector-curvature="0"
           sodipodi:nodetypes="cc" />
        <text
           xml:space="preserve"
           style="font-size:40px;font-style:normal;font-variant:normal;font-weight:bold;font-stretch:normal;line-height:125%;letter-spacing:0px;word-spacing:0px;fill:#0000ff;fill-opacity:1;stroke:none;font-family:Arial Black;-inkscape-font-specification:'Arial Black, Bold'"
           x="405.98807"
           y="102.1368"
           id="text5077-8"
           sodipodi:linespacing="125%"><tspan
             sodipodi:role="line"
             x="405.98807"
             y="102.1368"
             id="tspan5081-8"
             style="font-style:normal;font-variant:normal;font-weight:bold;font-stretch:normal;fill:#0000ff;fill-opacity:1;font-family:Arial;-inkscape-font-specification:Arial Bold">Ech1</tspan></text>
        <text
           xml:space="preserve"
           style="font-size:40px;font-style:normal;font-variant:normal;font-weight:bold;font-stretch:normal;line-height:125%;letter-spacing:0px;word-spacing:0px;fill:#ff0400;fill-opacity:1;stroke:none;font-family:Arial Black;-inkscape-font-specification:'Arial Black, Bold'"
           x="119.91988"
           y="342.34744"
           id="text5077-0"
           sodipodi:linespacing="125%"><tspan
             sodipodi:role="line"
             x="119.91988"
             y="342.34744"
             id="tspan5081-6"
             style="font-style:normal;font-variant:normal;font-weight:bold;font-stretch:normal;font-family:Arial;-inkscape-font-specification:Arial Bold">peptide1</tspan></text>
      </g>
    </g>
    <g
       id="g6286"
       transform="translate(134.28572,10)">
      <path
         sodipodi:nodetypes="cccc"
         inkscape:connector-curvature="0"
         id="path6157-0"
         d="m 165.37674,640.34245 c 35.09732,-52.1647 36.87057,-276.7818 36.87057,-276.7818 0,0 44.3927,272.38414 79.80205,278.29703 -46.413,0.86214 -94.19123,-1.37339 -116.67262,-1.51523 z"
         style="fill:#f1dadb;fill-opacity:1;stroke:none" />
      <path
         sodipodi:nodetypes="czczcccc"
         inkscape:connector-curvature="0"
         id="path4563-0"
         d="m -73.677672,646.85751 c 0,0 213.634812,3.13144 233.939072,-3.79551 20.30428,-6.92695 33.84,-93.94846 42.54026,-282.3372 48.09621,270.22052 63.14688,274.17586 88.05148,280.14358 24.90459,5.96772 97.31618,5.05076 97.31618,5.05076 0,0 50.51322,5.42079 63.00071,-100.17842 6.24375,6.29432 24.22217,76.24738 51.75133,91.08878 11.36672,17.87186 145.42127,10.93663 145.42127,10.93663"
         style="fill:none;stroke:#0000ff;stroke-width:2.0999999;stroke-linecap:butt;stroke-linejoin:miter;stroke-miterlimit:4;stroke-opacity:1;stroke-dasharray:none" />
    </g>
    <path
       style="fill:none;stroke:#000000;stroke-width:1px;stroke-linecap:butt;stroke-linejoin:miter;stroke-opacity:1;marker-mid:none;marker-end:url(#Arrow2Lend)"
       d="M 48.199045,677.7181 679.54439,676.70795"
       id="path5763-7"
       inkscape:connector-curvature="0" />
    <path
       style="fill:none;stroke:#000000;stroke-width:1px;stroke-linecap:butt;stroke-linejoin:miter;stroke-opacity:1"
       d="m 161.33613,593.87544 0,80.30713"
       id="path6137-6"
       inkscape:connector-curvature="0"
       sodipodi:nodetypes="cc" />
    <path
       style="fill:none;stroke:#000000;stroke-width:1px;stroke-linecap:butt;stroke-linejoin:miter;stroke-opacity:1"
       d="m 279.52398,595.39067 0,79.29697"
       id="path6137-8-1"
       inkscape:connector-curvature="0"
       sodipodi:nodetypes="cc" />
    <text
       xml:space="preserve"
       style="font-size:40px;font-style:normal;font-variant:normal;font-weight:bold;font-stretch:normal;line-height:125%;letter-spacing:0px;word-spacing:0px;fill:#0000ff;fill-opacity:1;stroke:none;font-family:Arial Black;-inkscape-font-specification:'Arial Black, Bold'"
       x="403.6795"
       y="427.52844"
       id="text5077-8-8"
       sodipodi:linespacing="125%"><tspan
         sodipodi:role="line"
         x="403.6795"
         y="427.52844"
         id="tspan5081-8-7"
         style="font-style:normal;font-variant:normal;font-weight:bold;font-stretch:normal;fill:#0000ff;fill-opacity:1;font-family:Arial;-inkscape-font-specification:Arial Bold">Ech2</tspan></text>
  </g>
</svg>
