#/*-----------------------------------------------------------------*/
#/*! 
#  \file scscpxx.sym
#  \brief Exported C++ symbols for the gnu ld linkers
#  \author  M. Gastineau 
#           Astronomie et Systemes Dynamiques, IMCCE, CNRS, Observatoire de Paris. 
#
#   Copyright, 2008, 2009, 2010, 2011, 2012, 2013,  M. Gastineau, CNRS
#   email of the author : gastineau@imcce.fr
#  
#
#/*-----------------------------------------------------------------*/
#
#
# initial version generated with the following command :
# objdump -T -C .libs/libscscpxx.so.0  | grep text | sed -e 's/^[^:]*:/SCSCP:/g' | sort | sed 's/([^$]*$/*;/g' | uniq
#

LIBSCSCPXX_1.0.0 {
global: 
extern "C++" {
SCSCP::beginOMA*;
SCSCP::beginOMATP*;
SCSCP::beginOMATTR*;
SCSCP::beginOME*;
SCSCP::beginOMOBJ*;
SCSCP::Client::?Client*;
SCSCP::Client::Client*;
SCSCP::Client::close*;
SCSCP::ClientComputation::?ClientComputation*;
SCSCP::ClientComputation::ClientComputation*;
SCSCP::ClientComputation::discard*;
SCSCP::ClientComputation::finish*;
SCSCP::ClientComputation::interrupt*;
SCSCP::ClientComputation::recv*;
SCSCP::ClientComputation::send*;
SCSCP::Client::connect*;
SCSCP::Client::eof*;
SCSCP::endOMA*;
SCSCP::endOMATP*;
SCSCP::endOMATTR*;
SCSCP::endOME*;
SCSCP::endOMOBJ*;
*SCSCP::Exception; #export typeinfo
SCSCP::Exception::?Exception*;
SCSCP::Exception::Exception*;
SCSCP::Exception::what*;
SCSCP::IncomingClient::eof*;
SCSCP::IncomingClient::?IncomingClient*;
SCSCP::Iunfstream::beginOM*;
SCSCP::Iunfstream::get_attr*;
SCSCP::Iunfstream::get_content*;
SCSCP::Iunfstream::get_type*;
SCSCP::Iunfstream::get_typename*;
SCSCP::Iunfstream_iterator_attr::get_name*;
SCSCP::Iunfstream_iterator_attr::get_value*;
SCSCP::Iunfstream_iterator_attr::Iunfstream_iterator_attr*;
SCSCP::Iunfstream_iterator_attr::operator*;
SCSCP::Iunfstream::?Iunfstream*;
SCSCP::Iunfstream::Iunfstream*;
SCSCP::Iunfstream::operator*;
SCSCP::Ofmtstreambuffer::?Ofmtstreambuffer*;
SCSCP::Ofmtstreambuffer::Ofmtstreambuffer*;
SCSCP::Ofmtstreambuffer::overflow*;
SCSCP::Ofmtstreambuffer::sync*;
SCSCP::Ofmtstreambuffer::underflow*;
SCSCP::Ofmtstream::?Ofmtstream*;
SCSCP::OMBasenode::beginOM*;
SCSCP::operator*;
SCSCP::Ounfstream::operator*;
SCSCP::Ounfstream::?Ounfstream*;
SCSCP::Ounfstream::Ounfstream*;
SCSCP::ProcedureCall::get_callid*;
SCSCP::ProcedureCall::get_debuglevel*;
SCSCP::ProcedureCall::get_encodingtype*;
SCSCP::ProcedureCall::get_maxmemory*;
SCSCP::ProcedureCall::get_memory*;
SCSCP::ProcedureCall::get_message*;
SCSCP::ProcedureCall::get_minmemory*;
SCSCP::ProcedureCall::get_returntype*;
SCSCP::ProcedureCall::get_runtimelimit*;
SCSCP::ProcedureCall::get_runtime*;
SCSCP::ProcedureCall::?ProcedureCall*;
SCSCP::ProcedureCall::ProcedureCall*;
SCSCP::ProcedureCall::sendinfomessage*;
SCSCP::ProcedureCall::set_debuglevel*;
SCSCP::ProcedureCall::set_encodingtype*;
SCSCP::ProcedureCall::set_maxmemory*;
SCSCP::ProcedureCall::set_memory*;
SCSCP::ProcedureCall::set_message*;
SCSCP::ProcedureCall::set_minmemory*;
SCSCP::ProcedureCall::set_runtimelimit*;
SCSCP::ProcedureCall::set_runtime*;
SCSCP::Server::acceptclient*;
SCSCP::Server::close*;
SCSCP::Server::getport*;
SCSCP::ServerComputation::finish*;
SCSCP::ServerComputation::recv*;
SCSCP::ServerComputation::sendcompleted*;
SCSCP::ServerComputation::sendterminated*;
SCSCP::ServerComputation::?ServerComputation*;
SCSCP::ServerComputation::ServerComputation*;
SCSCP::Server::listen*;
SCSCP::Server::?Server*;
SCSCP::Server::Server*;
};
local: *;
};

