<!DOCTYPE ui:UiBinder SYSTEM "http://dl.google.com/gwt/DTD/xhtml.ent">


<!--  Insyght Copyright - INRA IDDN.FR.001.060011.000.R.C.2013.000.42000 
	Auteurs: Thomas Lacroix (thomas.lacroix@jouy.inra.fr) This file is part of 
	Insyght Insyght is a web application whose purpose is to explore the landscape 
	of conserved and idiosyncratic genomic regions across multiple genomes and 
	their rearrangements throughout evolution. Its unique display is based on 
	the association of symbolic and proportional views. The basic idea is that 
	the user can browse and interact with a variety of symbols that constitute 
	the chain of annotation events: homologs, conserved syntenies, genomic regions 
	insertions / deletions, etc... The symbols are tightly integrated with a 
	display representing the same annotation events drawn proportionally according 
	to their genomic positions and joined up by trapezoids if they are homologous. 
	The symbols highlight a region of interest and provide legibility while the 
	proportional display simultaneously allows grasping genomic locations and 
	complex rearrangements scattered across the genomes and occurring at different 
	scales. This software is governed by the CeCILL-B license under French law 
	and abiding by the rules of distribution of free software. You can use, modify 
	and/ or redistribute the software under the terms of the CeCILL-B license 
	as circulated by CEA, CNRS and INRIA at the following URL "http://www.cecill.info". 
	As a counterpart to the access to the source code and rights to copy, modify 
	and redistribute granted by the license, users are provided only with a limited 
	warranty and the software's author, the holder of the economic rights, and 
	the successive licensors have only limited liability. In this respect, the 
	user's attention is drawn to the risks associated with loading, using, modifying 
	and/or developing or reproducing the software by the user in light of its 
	specific status of free software, that may mean that it is complicated to 
	manipulate, and that also therefore means that it is reserved for developers 
	and experienced professionals having in-depth computer knowledge. Users are 
	therefore encouraged to load and test the software's suitability as regards 
	their requirements in conditions enabling the security of their systems and/or 
	data to be ensured and, more generally, to use and operate it in the same 
	conditions as regards security. The fact that you are presently reading this 
	means that you have had knowledge of the CeCILL-B license and that you accept 
	its terms. -->


<ui:UiBinder xmlns:ui="urn:ui:com.google.gwt.uibinder"
	xmlns:g="urn:import:com.google.gwt.user.client.ui">
	<ui:style gss="true">
		.titleMenuContextuel {
		  font-weight: bold;
		  border-bottom: 2px solid #c1cdcd;
		  padding-bottom: 4px;
		  text-align: center;
		  color: #2f4f4f;
		}

	</ui:style>

	<g:VerticalPanel width="100%" spacing='0'
		horizontalAlignment="center">
		<g:Label width="80%" text="Contextual Menu" styleName="{style.titleMenuContextuel}" />

		<g:MenuBar vertical='true' autoOpen='true'> <!-- ui:field='mainMenu' -->

			<g:MenuItem>
				Transfert / find<br/>in other view
				<g:MenuBar vertical='true' autoOpen='true'>
					<g:MenuItem>
						Reference gene in ...
						<g:MenuBar vertical='true' autoOpen='true'>
							<g:MenuItem ui:field='transfertGeneToHomologBrowsingTable'>Orthologs browsing table</g:MenuItem>
							<g:MenuItem ui:field='transfertGeneToAnnotationsComparator'>Annotations comparator</g:MenuItem>
							<g:MenuItem ui:field='transfertGeneToGenomicOrganizationView'>Genomic organization<br/>view</g:MenuItem>
						</g:MenuBar>
					</g:MenuItem>
					<g:MenuItem>
						Reference gene set in ...
						<g:MenuBar vertical='true' autoOpen='true'>
							<g:MenuItem ui:field='transfertGeneSetToHomologBrowsingTable'>Orthologs browsing table</g:MenuItem>
							<g:MenuItem ui:field='transfertGeneSetToAnnotationsComparator'>Annotations comparator</g:MenuItem>
						</g:MenuBar>
					</g:MenuItem>
					<g:MenuItem>
						Reference displayed<br/>region in ...
						<g:MenuBar vertical='true' autoOpen='true'>
							<g:MenuItem ui:field='transfertDisplayedRegionToHomologBrowsingTable'>Orthologs browsing table</g:MenuItem>
							<g:MenuItem ui:field='transfertDisplayedRegionToAnnotationsComparator'>Annotations comparator</g:MenuItem>
						</g:MenuBar>
					</g:MenuItem>
				</g:MenuBar>
			</g:MenuItem>



			<g:MenuItem>
				Selected symbol
				<g:MenuBar vertical='true' autoOpen='true'>
					<g:MenuItem ui:field='selectedSymbolExpandCollapseGenes'>Expand / collapse interlocked symbols</g:MenuItem>
					<g:MenuItem ui:field='selectedSymbolListOffShoots'>List off shoots</g:MenuItem>
					<g:MenuItem ui:field='selectedSymbolListGenes'>List reference genes</g:MenuItem>
					<g:MenuItem ui:field='statSummaryRefCDS'>Stat summary ref CDS</g:MenuItem>
				</g:MenuBar>
			</g:MenuItem>



			<g:MenuItem>
				Quick navigation
				<g:MenuBar vertical='true' autoOpen='true'>
					<g:MenuItem ui:field='quickNavigationFindGene'>Find gene</g:MenuItem>
					<g:MenuItem ui:field='quickNavigationSynchronizeAllDisplaysOnReferenceGene'>Synchronize all displays<br/>on this
						reference gene</g:MenuItem>
					<g:MenuItem ui:field='quickNavigationCenterDisplayAtClickPosition'>Center this display<br/>at click
						position</g:MenuItem>
					<g:MenuItem>
						Navigate symbols
						<g:MenuBar vertical='true' autoOpen='true'>
							<g:MenuItem ui:field='navSymbolsNext'>
								Find next
								<g:MenuBar vertical='true' autoOpen='true'>
									<g:MenuItem ui:field='navSymbolsNextGeneHomology'>Gene homology</g:MenuItem>
									<g:MenuItem ui:field='navSymbolsNextSyntenyRegion'>Synteny region</g:MenuItem>
									<g:MenuItem ui:field='navSymbolsNextSyntenyRegion5Genes'>Synteny region > 3 genes</g:MenuItem>
									<g:MenuItem ui:field='navSymbolsNextSyntenyRegion20Genes'>Synteny region > 20 genes</g:MenuItem>
									<g:MenuItem ui:field='navSymbolsNextReferenceGeneGenomicRegionInsertion'>Reference gene /<br/>genomic region<br/>without homolog</g:MenuItem>
								</g:MenuBar>
							</g:MenuItem>
							<g:MenuItem ui:field='navSymbolsPrevious'>
								Find previous
								<g:MenuBar vertical='true' autoOpen='true'>
									<g:MenuItem ui:field='navSymbolsPreviousGeneHomology'>Gene homology</g:MenuItem>
									<g:MenuItem ui:field='navSymbolsPreviousSyntenyRegion'>Synteny region</g:MenuItem>
									<g:MenuItem ui:field='navSymbolsPreviousSyntenyRegion5Genes'>Synteny region > 3 genes</g:MenuItem>
									<g:MenuItem ui:field='navSymbolsPreviousSyntenyRegion20Genes'>Synteny region > 20 genes</g:MenuItem>
									<g:MenuItem
										ui:field='navSymbolsPreviousReferenceGeneGenomicRegionInsertion'>Reference gene /<br/>genomic region<br/>without homolog</g:MenuItem>
								</g:MenuBar>
							</g:MenuItem>
						</g:MenuBar>
					</g:MenuItem>
					<g:MenuItem>
						Zoom
						<g:MenuBar vertical='true' autoOpen='true'>
							<g:MenuItem>
								Reference<br/>genome
								<g:MenuBar vertical='true' autoOpen='true'>
									<g:MenuItem ui:field='referenceGenomeZoomIn'>zoom in [elements]</g:MenuItem>
									<g:MenuItem>
										zoom out...
										<g:MenuBar vertical='true' autoOpen='true'>
											<g:MenuItem ui:field='referenceGenomeZoomOut2X'>2X</g:MenuItem>
											<g:MenuItem ui:field='referenceGenomeZoomOut5X'>5X</g:MenuItem>
											<g:MenuItem ui:field='referenceGenomeZoomOutMax'>MAX</g:MenuItem>
										</g:MenuBar>
									</g:MenuItem>

								</g:MenuBar>
							</g:MenuItem>
							<g:MenuItem>
								Compared<br/>genome
								<g:MenuBar vertical='true' autoOpen='true'>
									<g:MenuItem ui:field='comparedGenomeZoomIn'>zoom in [elements]</g:MenuItem>
									<g:MenuItem>
										zoom out
										<g:MenuBar vertical='true' autoOpen='true'>
											<g:MenuItem ui:field='comparedGenomeZoomOut2X'>2X</g:MenuItem>
											<g:MenuItem ui:field='comparedGenomeZoomOut5X'>5X</g:MenuItem>
											<g:MenuItem ui:field='comparedGenomeZoomOutMax'>MAX</g:MenuItem>
										</g:MenuBar>
									</g:MenuItem>

								</g:MenuBar>
							</g:MenuItem>
						</g:MenuBar>
					</g:MenuItem>
					<g:MenuItem ui:field='quickNavigationSetComparedOrganismAsReference'>Set this compared organism<br/>as reference (mirror view)</g:MenuItem>

				</g:MenuBar>
			</g:MenuItem>


			<g:MenuItem>
				Export
				<g:MenuBar vertical='true' autoOpen='true'>
					<g:MenuItem ui:field='exportGeneSequence'>Gene(s) sequence(s)</g:MenuItem>
					<g:MenuItem ui:field='exportTable'>Table</g:MenuItem>
					<g:MenuItem ui:field='exportGraphics'>Graphics</g:MenuItem>
					
				</g:MenuBar>
			</g:MenuItem>



		</g:MenuBar>
	</g:VerticalPanel>

</ui:UiBinder>
		 