<?xml version="1.0" encoding="UTF-8" standalone="no"?>
<svg
   xmlns:dc="http://purl.org/dc/elements/1.1/"
   xmlns:cc="http://creativecommons.org/ns#"
   xmlns:rdf="http://www.w3.org/1999/02/22-rdf-syntax-ns#"
   xmlns:svg="http://www.w3.org/2000/svg"
   xmlns="http://www.w3.org/2000/svg"
   xmlns:sodipodi="http://sodipodi.sourceforge.net/DTD/sodipodi-0.dtd"
   xmlns:inkscape="http://www.inkscape.org/namespaces/inkscape"
   viewBox="0 0 47.9 48"
   version="1.1"
   id="svg75"
   sodipodi:docname="logo.svg"
   inkscape:version="0.92.0 r15299"
   inkscape:export-filename="C:\Users\blechner01\Documents\Projets\dev\insasedtsync\icons\res\ic_launcher.png"
   inkscape:export-xdpi="96"
   inkscape:export-ydpi="96">
  <metadata
     id="metadata79">
    <rdf:RDF>
      <cc:Work
         rdf:about="">
        <dc:format>image/svg+xml</dc:format>
        <dc:type
           rdf:resource="http://purl.org/dc/dcmitype/StillImage" />
        <dc:title>Fichier</dc:title>
      </cc:Work>
    </rdf:RDF>
  </metadata>
  <sodipodi:namedview
     pagecolor="#ffffff"
     bordercolor="#666666"
     borderopacity="1"
     objecttolerance="10"
     gridtolerance="10"
     guidetolerance="10"
     inkscape:pageopacity="0"
     inkscape:pageshadow="2"
     inkscape:window-width="1920"
     inkscape:window-height="1137"
     id="namedview77"
     showgrid="false"
     inkscape:zoom="6.9532167"
     inkscape:cx="-33.471358"
     inkscape:cy="63.552466"
     inkscape:window-x="1912"
     inkscape:window-y="-8"
     inkscape:window-maximized="1"
     inkscape:current-layer="svg75" />
  <defs
     id="defs4">
    <style
       id="style2">.cls-1{fill:#c1c1c1;}.cls-2{fill:#fff;}.cls-3{fill:#e32518;}.cls-4{fill:#e2e2e2;}.cls-5{fill:#95c11f;}.cls-6{fill:#666;}</style>
  </defs>
  <title
     id="title6">Fichier</title>
  <g
     id="g4759"
     transform="scale(1.0020743,1)"
     inkscape:export-filename="C:\Users\blechner01\Documents\Projets\dev\insasedtsync\icons\res\ic_launcher.png"
     inkscape:export-xdpi="1024"
     inkscape:export-ydpi="1024">
    <g
       id="g3883">
      <g
         id="g3761">
        <g
           id="g3759">
          <g
             id="g3757">
            <path
               style="fill:#c1c1c1"
               inkscape:connector-curvature="0"
               d="M 42.2,48 H 5.7 A 5.65,5.65 0 0 1 0,42.29 V 13.71 H 47.9 V 42.29 A 5.73,5.73 0 0 1 42.2,48 Z"
               class="cls-1"
               id="path3755" />
          </g>
        </g>
      </g>
      <g
         id="g3777">
        <g
           id="g3775">
          <g
             id="g3773">
            <path
               style="fill:#ffffff"
               inkscape:connector-curvature="0"
               d="M 42.2,45.54 H 5.7 A 5.64,5.64 0 0 1 0,39.85 V 11.43 h 47.9 v 28.42 a 5.71,5.71 0 0 1 -5.7,5.69 z"
               class="cls-2"
               id="path3771" />
          </g>
        </g>
      </g>
      <g
         id="g3785">
        <g
           id="g3783">
          <g
             id="g3781">
            <path
               style="fill:#e32518"
               inkscape:connector-curvature="0"
               d="M 47.9,14.86 H 0 V 5.71 A 5.73,5.73 0 0 1 5.7,0 h 36.5 a 5.65,5.65 0 0 1 5.7,5.71 z"
               class="cls-3"
               id="path3779" />
          </g>
        </g>
      </g>
    </g>
    <g
       id="Grille">
      <g
         id="g4531">
        <g
           id="g4529">
          <g
             id="g4527">
            <path
               style="fill:#e2e2e2"
               inkscape:connector-curvature="0"
               d="m 5.07,20.57 h 5.78 a 0.64,0.64 0 0 1 0.64,0.64 v 5.57 a 0.65,0.65 0 0 1 -0.65,0.65 H 5.07 A 0.64,0.64 0 0 1 4.43,26.79 v -5.57 a 0.65,0.65 0 0 1 0.64,-0.65 z"
               class="cls-4"
               id="rect4525" />
          </g>
        </g>
      </g>
      <g
         id="g4539">
        <g
           id="g4537">
          <g
             id="g4535">
            <rect
               style="fill:#e2e2e2"
               ry="0.64999998"
               rx="0.64999998"
               height="6.8600001"
               width="7.0700002"
               y="20.57"
               x="15.03"
               class="cls-4"
               id="rect4533" />
          </g>
        </g>
      </g>
      <g
         id="g4547">
        <g
           id="g4545">
          <g
             id="g4543">
            <rect
               style="fill:#e2e2e2"
               ry="0.66000003"
               rx="0.66000003"
               height="6.8600001"
               width="7.0700002"
               y="20.57"
               x="25.530001"
               class="cls-4"
               id="rect4541" />
          </g>
        </g>
      </g>
      <g
         id="g4555">
        <g
           id="g4553">
          <g
             id="g4551">
            <rect
               style="fill:#e2e2e2"
               ry="0.63999999"
               rx="0.63999999"
               height="6.8600001"
               width="7.0700002"
               y="20.57"
               x="36.139999"
               class="cls-4"
               id="rect4549" />
          </g>
        </g>
      </g>
      <g
         id="g4563">
        <g
           id="g4561">
          <g
             id="g4559">
            <path
               style="fill:#e2e2e2"
               inkscape:connector-curvature="0"
               d="m 5.07,32 h 5.78 a 0.64,0.64 0 0 1 0.64,0.64 v 5.57 a 0.65,0.65 0 0 1 -0.65,0.65 H 5.07 A 0.64,0.64 0 0 1 4.43,38.22 V 32.65 A 0.65,0.65 0 0 1 5.07,32 Z"
               class="cls-4"
               id="rect4557" />
          </g>
        </g>
      </g>
      <g
         id="g4571">
        <g
           id="g4569">
          <g
             id="g4567">
            <rect
               style="fill:#e2e2e2"
               ry="0.64999998"
               rx="0.64999998"
               height="6.8600001"
               width="7.0700002"
               y="32"
               x="15.03"
               class="cls-4"
               id="rect4565" />
          </g>
        </g>
      </g>
      <g
         id="g4579">
        <g
           id="g4577">
          <g
             id="g4575">
            <rect
               style="fill:#e2e2e2"
               ry="0.63"
               rx="0.63"
               height="6.8600001"
               width="7.0700002"
               y="32"
               x="25.530001"
               class="cls-4"
               id="rect4573" />
          </g>
        </g>
      </g>
      <g
         id="g4587">
        <g
           id="g4585">
          <g
             id="g4583">
            <rect
               style="fill:#e32518"
               ry="0.63999999"
               rx="0.63999999"
               height="6.8600001"
               width="7.0700002"
               y="32"
               x="36.139999"
               class="cls-3"
               id="rect4581" />
          </g>
        </g>
      </g>
    </g>
    <g
       id="INSA">
      <path
         style="fill:#ffffff"
         inkscape:connector-curvature="0"
         id="path62"
         d="m 20.49,13.5 h -1.77 c -0.48,0 -1,0 -1.44,0 a 0.44,0.44 0 0 1 -0.5,-0.37 Q 15.88,9.95 15,6.76 A 2.31,2.31 0 0 0 14.74,6.13 v 7.35 h -3.1 V 1.13 h 3.64 l 2.07,7.39 h 0.09 V 1.15 h 3.05 z"
         class="cls-2" />
      <path
         style="fill:#ffffff"
         inkscape:connector-curvature="0"
         id="path64"
         d="m 33,13.48 h -3.49 l 3,-12.34 h 4.17 l 3.07,12.37 h -1.68 c -0.45,0 -0.9,0 -1.34,0 -0.44,0 -0.54,-0.14 -0.58,-0.52 -0.06,-0.55 -0.16,-1.1 -0.25,-1.66 h -2.58 z m 1.69,-9.65 h -0.08 l -0.86,5 h 1.79 z"
         class="cls-2" />
      <path
         style="fill:#ffffff"
         inkscape:connector-curvature="0"
         id="path66"
         d="m 29.59,4.67 h -3.1 C 26.42,4.34 26.38,4.02 26.3,3.67 A 0.77,0.77 0 0 0 25.54,3.03 0.9,0.9 0 0 0 24.61,3.57 1.16,1.16 0 0 0 25,5.15 a 14.86,14.86 0 0 0 2,1 5.08,5.08 0 0 1 2.15,1.47 4.07,4.07 0 0 1 0.49,3.71 3,3 0 0 1 -2.56,2.18 8.18,8.18 0 0 1 -4,-0.14 2.8,2.8 0 0 1 -1.9,-2.59 c 0,-0.3 0,-0.61 0,-0.95 h 3.13 c 0,0.28 0,0.57 0.11,0.85 a 1,1 0 0 0 1.08,0.84 1,1 0 0 0 1,-1 C 26.57,9.74 26.15,9.18 25.24,8.8 24.57,8.52 23.89,8.24 23.24,7.92 a 3.28,3.28 0 0 1 -1.88,-3.37 5.53,5.53 0 0 1 0.23,-1.43 2.93,2.93 0 0 1 2,-2 6.53,6.53 0 0 1 4.05,0 2.46,2.46 0 0 1 1.66,1.66 17.9,17.9 0 0 1 0.29,1.89 z"
         class="cls-2" />
      <path
         style="fill:#ffffff"
         inkscape:connector-curvature="0"
         id="path68"
         d="M 10.69,13.49 H 7.45 V 1.14 h 3.24 z"
         class="cls-2" />
      <path
         style="fill:#666666"
         inkscape:connector-curvature="0"
         id="path70"
         d="m 37.5,1.09 h 2.21 v 9.08 0 z"
         class="cls-6" />
    </g>
    <path
       style="fill:#95c11f;fill-opacity:1;stroke:none;stroke-width:0.11395274;stroke-opacity:1"
       d="m 40.70279,29.994974 c -0.667429,-0.667536 -1.74964,-0.667536 -2.417288,0 l -4.003953,4.003844 C 33.61253,27.186723 28.566814,21.304141 21.518731,19.902181 16.330925,18.870338 10.980501,20.472513 7.2067205,24.18817 c -0.672667,0.662407 -0.681099,1.744617 -0.01886,2.41728 0.66241,0.672662 1.744622,0.681095 2.417163,0.01869 2.9660705,-2.920381 7.1702525,-4.179671 11.2465595,-3.369011 5.568312,1.107619 9.546048,5.774782 10.035818,11.164861 l -4.425343,-4.425355 c -0.66743,-0.667422 -1.74975,-0.667535 -2.417289,1.14e-4 -0.667538,0.667535 -0.667538,1.749745 0,2.417279 l 7.120343,7.120337 c 0.333762,0.333767 0.771223,0.500595 1.208574,0.500595 0.437352,0 0.874938,-0.166828 1.208699,-0.500595 l 7.120109,-7.119994 c 0.667773,-0.667536 0.667773,-1.749859 2.34e-4,-2.417395 z"
       id="XMLID_6_"
       inkscape:connector-curvature="0" />
  </g>
</svg>
