"ID"	"time"	"age"	"drug"	"censor"	"ent.date"	"end.date"	"OS.time"	"OS"	"RFS.time"	"RFS"
"1"	1	5	46	0	1	1990-05-15	1990-10-14	4.984	1	4.984	1
"2"	2	6	35	1	0	1989-09-19	1990-03-20	5.967	0	5.967	0
"3"	3	8	30	1	1	1991-04-21	1991-12-20	7.967	1	7.967	1
"4"	4	3	30	1	1	1991-01-03	1991-04-04	2.984	1	2.984	1
"5"	5	22	36	0	1	1989-09-18	1991-07-19	21.934	1	21.934	1
"6"	6	1	32	1	0	1991-03-18	1991-04-17	0.984	0	0.984	0
"7"	7	7	36	1	1	1989-11-11	1990-06-11	6.951	1	6.951	1
"8"	8	9	31	1	1	1989-11-25	1990-08-25	8.951	1	8.951	1
"9"	9	3	48	0	1	1991-02-11	1991-05-13	2.984	1	2.984	1
"10"	10	12	47	0	1	1989-08-11	1990-08-11	11.967	1	11.967	1
"11"	11	2	28	1	0	1990-04-11	1990-06-10	1.967	0	1.967	0
"12"	12	12	34	0	1	1991-05-11	1992-05-10	11.967	1	11.967	1
"13"	13	1	44	1	1	1989-01-17	1989-02-16	0.984	1	0.984	1
"14"	14	15	32	1	1	1991-02-16	1992-05-17	14.951	1	14.951	1
"15"	15	34	36	0	1	1991-04-09	1994-02-06	33.902	1	33.902	1
"16"	16	1	36	0	1	1991-03-09	1991-04-08	0.984	1	0.984	1
"17"	17	4	54	0	1	1990-08-03	1990-12-02	3.967	1	3.967	1
"18"	18	19	35	0	0	1990-06-10	1992-01-08	18.918	0	18.918	0
"19"	19	3	44	1	0	1991-06-12	1991-09-11	2.984	0	2.984	0
"20"	20	2	38	0	1	1991-01-07	1991-03-08	1.967	1	1.967	1
"21"	21	2	40	0	0	1989-08-29	1989-10-28	1.967	0	1.967	0
"22"	22	6	34	1	1	1989-05-29	1989-11-27	5.967	1	5.967	1
"23"	23	60	25	0	0	1990-11-16	1995-11-14	59.803	0	40	0
"24"	24	11	32	0	1	1990-05-09	1991-04-08	10.951	1	10.951	1
"25"	25	2	42	1	0	1991-09-10	1991-11-09	1.967	0	1.967	0
"26"	26	5	47	0	1	1991-12-26	1992-05-26	4.984	1	4.984	1
"27"	27	4	30	0	0	1991-05-29	1991-09-27	3.967	0	3.967	0
"28"	28	1	47	1	1	1990-05-01	1990-05-31	0.984	1	0.984	1
"29"	29	13	41	0	1	1991-03-24	1992-04-22	12.951	1	12.951	1
"30"	30	3	40	1	1	1989-07-18	1989-10-17	2.984	1	2.984	1
"31"	31	2	43	0	1	1990-09-16	1990-11-15	1.967	1	1.967	1
"32"	32	1	41	0	1	1989-06-22	1989-07-22	0.984	1	0.984	1
"33"	33	30	30	0	1	1990-04-27	1992-10-25	29.902	1	29.902	1
"34"	34	7	37	0	1	1990-05-16	1990-12-14	6.951	1	6.951	1
"35"	35	4	42	1	1	1989-02-19	1989-06-20	3.967	1	3.967	1
"36"	36	8	31	1	1	1990-02-17	1990-10-18	7.967	1	7.967	1
"37"	37	5	39	1	1	1991-08-06	1992-01-05	4.984	1	4.984	1
"38"	38	10	32	0	1	1989-08-10	1990-06-10	9.967	1	9.967	1
"39"	39	2	51	0	1	1990-12-27	1991-02-25	1.967	1	1.967	1
"40"	40	9	36	0	1	1989-04-26	1990-01-24	8.951	1	8.951	1
"41"	41	36	43	0	1	1990-12-04	1993-12-03	35.902	1	35.902	1
"42"	42	3	39	0	1	1991-04-28	1991-07-28	2.984	1	2.984	1
"43"	43	9	33	0	1	1991-07-09	1992-04-07	8.951	1	8.951	1
"44"	44	3	45	1	1	1989-12-31	1990-04-01	2.984	1	2.984	1
"45"	45	35	33	0	1	1989-12-20	1992-11-18	34.885	1	34.885	1
"46"	46	8	28	0	1	1991-06-22	1992-02-20	7.967	1	7.967	1
"47"	47	11	31	0	1	1990-04-11	1991-03-11	10.951	1	10.951	1
"48"	48	56	20	1	0	1990-05-22	1995-01-19	55.836	0	40	0
"49"	49	2	44	0	0	1991-11-11	1992-01-10	1.967	0	1.967	0
"50"	50	3	39	1	1	1991-01-18	1991-04-19	2.984	1	2.984	1
"51"	51	15	33	0	1	1989-11-11	1991-02-10	14.951	1	14.951	1
"52"	52	1	31	0	1	1990-10-01	1990-10-31	0.984	1	0.984	1
"53"	53	10	33	0	1	1990-03-20	1991-01-18	9.967	1	9.967	1
"54"	54	1	50	1	1	1990-07-30	1990-08-29	0.984	1	0.984	1
"55"	55	7	36	1	1	1989-07-17	1990-02-14	6.951	1	6.951	1
"56"	56	3	30	1	1	1990-11-10	1991-02-09	2.984	1	2.984	1
"57"	57	3	42	1	1	1989-03-05	1989-06-04	2.984	1	2.984	1
"58"	58	2	32	1	1	1991-03-02	1991-05-01	1.967	1	1.967	1
"59"	59	32	34	0	1	1989-09-11	1992-05-11	31.902	1	31.902	1
"60"	60	3	38	1	1	1989-09-12	1989-12-12	2.984	1	2.984	1
"61"	61	10	33	0	0	1990-04-08	1991-02-06	9.967	0	9.967	0
"62"	62	11	39	1	1	1989-04-20	1990-03-20	10.951	1	10.951	1
"63"	63	3	39	1	1	1991-01-31	1991-05-02	2.984	1	2.984	1
"64"	64	7	33	1	1	1989-09-15	1990-04-15	6.951	1	6.951	1
"65"	65	5	34	1	1	1991-12-07	1992-05-07	4.984	1	4.984	1
"66"	66	31	34	0	1	1990-03-04	1992-10-01	30.885	1	30.885	1
"67"	67	5	46	1	1	1989-04-20	1989-09-19	4.984	1	4.984	1
"68"	68	58	22	0	1	1989-06-16	1994-04-15	57.836	1	40	0
"69"	69	1	44	1	1	1990-10-01	1990-10-31	0.984	1	0.984	1
"70"	70	3	37	0	0	1991-02-01	1991-05-03	2.984	0	2.984	0
"71"	71	43	25	0	1	1989-05-13	1992-12-10	42.852	1	40	0
"72"	72	1	38	0	1	1990-08-09	1990-09-08	0.984	1	0.984	1
"73"	73	6	32	0	1	1991-12-18	1992-06-17	5.967	1	5.967	1
"74"	74	53	34	0	1	1990-08-23	1995-01-21	52.852	1	40	0
"75"	75	14	29	0	1	1991-01-19	1992-03-19	13.934	1	13.934	1
"76"	76	4	36	1	1	1991-08-26	1991-12-25	3.967	1	3.967	1
"77"	77	54	21	0	1	1991-05-16	1995-11-13	53.836	1	40	0
"78"	78	1	26	1	1	1989-03-20	1989-04-19	0.984	1	0.984	1
"79"	79	1	32	1	1	1991-10-05	1991-11-04	0.984	1	0.984	1
"80"	80	8	42	0	1	1991-05-21	1992-01-19	7.967	1	7.967	1
"81"	81	5	40	1	1	1991-06-10	1991-11-09	4.984	1	4.984	1
"82"	82	1	37	1	1	1989-08-31	1989-09-30	0.984	1	0.984	1
"83"	83	1	47	0	1	1991-12-28	1992-01-27	0.984	1	0.984	1
"84"	84	2	32	1	1	1990-09-29	1990-11-28	1.967	1	1.967	1
"85"	85	7	41	1	0	1991-11-20	1992-06-19	6.951	0	6.951	0
"86"	86	1	46	1	0	1989-07-02	1989-08-01	0.984	0	0.984	0
"87"	87	10	26	1	1	1991-10-11	1992-08-10	9.967	1	9.967	1
"88"	88	24	30	0	0	1990-10-11	1992-10-10	23.934	0	23.934	0
"89"	89	7	32	1	1	1990-12-05	1991-07-05	6.951	1	6.951	1
"90"	90	12	31	1	0	1989-09-08	1990-09-08	11.967	0	11.967	0
"91"	91	4	35	0	1	1990-04-10	1990-08-09	3.967	1	3.967	1
"92"	92	57	36	0	1	1990-12-11	1995-09-09	56.82	1	40	0
"93"	93	1	41	1	1	1990-12-15	1991-01-14	0.984	1	0.984	1
"94"	94	12	36	1	0	1989-01-13	1990-01-13	11.967	0	11.967	0
"95"	95	7	35	1	1	1991-08-22	1992-03-21	6.951	1	6.951	1
"96"	96	1	34	1	1	1991-08-02	1991-09-01	0.984	1	0.984	1
"97"	97	5	28	0	1	1991-05-22	1991-10-21	4.984	1	4.984	1
"98"	98	60	29	0	0	1990-04-02	1995-04-01	59.836	0	40	0
"99"	99	2	35	1	0	1991-05-01	1991-06-30	1.967	0	1.967	0
"100"	100	1	34	1	1	1989-05-11	1989-06-10	0.984	1	0.984	1
