"Year";"Month";"Day";"Title";"Space";"Education";"SF";"Science";"SETI";"Everythings"
2011;12;30;"Illuminations à Frangy";;;;;;1
2011;12;25;"Noël en images...";;;;;;1
2011;12;8;"Je suis une pafinie !";;;1;;;
2011;12;7;"Main courante à l'IGS";;;;;;1
2011;11;30;"Je m'indigne un peu, beaucoup...";;;;;;1
2011;11;26;"Serres et Hessel";;1;;;;
2011;11;24;"Messages sur des cartons";;;;;1;
2011;11;13;"Pourquoi aller occuper la Défense ?";;;;;;1
2011;11;11;"atelier 99%";;;;;;1
2011;11;9;"Compatibilité entre civilisations";;;;;1;
2011;11;5;"Courage et chocolat";;1;;;;
2011;10;22;"Kidexpo";;1;;;;
2011;10;20;"Arecibo et gmail";;;;;1;
2011;10;8;"L'ipad, gadget ou outil ?";;;;;;1
2011;9;30;"Gestion du stress";;1;;;;
2011;9;28;"Méditations";;;;;;1
2011;9;23;"Plus vite que la lumière";;;;1;;
2011;9;11;"La fête dans la boue !";;;;;;1
2011;8;29;"L'ISS à Frangy";1;;;;;
2011;8;28;"Foire de la Balme";;;;;;1
2011;8;25;"Autour des étangs à la Chapelle Voland";;;;;;1
2011;8;18;"Paris plages";;;;;;1
2011;8;15;"De la vie vers Uranus";;;;;1;
2011;8;14;"Etoiles sous la pluie";;;;;1;
2011;8;11;"Twitter ça sert à quoi ?";;;;;;1
2011;8;9;"Comment aller à la fête de la rose ?";;;;;;1
2011;7;30;"Vive la Bresse Libre !";;1;;;;
2011;7;25;"Auf Wierdersehen Thomas !";;;;;;1
2011;7;23;"Dogon 2.0";;;;;;1
2011;7;6;"Xénophobie";;;;;;1
2011;7;6;"Analyse linéaire";;1;;;;
2011;7;4;"Ô temps...";;;;;;1
2011;7;2;"L'art du tchikenague";;;;;;1
2011;6;30;"Plan peinard";;;;;;1
2011;6;20;"Au revoir Bob";;;;;;1
2011;6;15;"Le chat du rabbin";;;1;;;
2011;6;12;"Artisanat";;;;;;1
2011;6;11;"A la recherche des balises";;1;;;;
2011;6;9;"Une histoire de mouche";;1;;;;
2011;5;25;"Message privé";;;;;;1
2011;5;23;"Deux tiers";;1;;;;
2011;5;19;"L'orthographe, ça sert à quoi ?";;1;;;;
2011;5;9;"Festicité";;;;;;1
2011;5;5;"Positivons !";;;;;;1
2011;5;4;"En surfant...";;;;;1;
2011;5;2;"1er mai";;;;;;1
2011;4;29;"Citoyen ulissien ?";;;;;;1
2011;4;28;"N'enterrez pas SETI !";;;;;1;
2011;4;26;"On demande pas la Lune...";;;;;;1
2011;4;22;"Bob";;1;;;;
2011;4;21;"Parc expérimental";;1;;;;
2011;4;19;"La momie !";;;;;;1
2011;4;12;"Zoo humain";;;;;;1
2011;4;9;"Révolte à Ouaga";;;;;;1
2011;4;7;"koumi kiya";;;;1;;
2011;4;2;"Du césium à Orsay";;;;1;;
2011;3;20;"Err 99";;;;1;;
2011;3;13;"Trop d'info ?";;;;1;;
2011;3;12;"Anthropocènique";;;;1;;
2011;3;8;"L'ISS en photo";1;;;;;
2011;3;7;"Journée de la femme";;;;;;1
2011;3;4;"Héritage patrimonial";;;;;;1
2011;3;1;"Le banquet";;;;;;1
2011;2;22;"Ariane 200";1;;;;;
2011;2;6;"Le dentifrice ça sert à rien";;;;1;;
2011;2;6;"Les maths ça sert à rien...";;1;;;;
2011;1;30;"Héros et victimes";;;;;;1
2011;1;26;"Tout ira bien";;;;;;1
2011;1;20;"La réponse est 111";;1;;;;
2011;1;19;"La dictée des CM2";;1;;;;
2011;1;11;"Les soignants autrement";;;;;;1
2011;1;6;"Le cri d'éti";;;1;;;
