"Year";"Month";"Day";"Title";"Space";"Education";"SF";"Science";"SETI";"Everythings"
2009;12;25;"Le jura c'est beau !";;;;;;1
2009;12;23;"Enfin !";;;;;;1
2009;12;20;"The hand";;;;;;1
2009;12;19;"Copenhague";;;;;;1
2009;12;18;"Plan campus sous la neige";;1;;;;
2009;12;13;"Galilée à l'UNESCO";;;;;;1
2009;12;12;"Ca pendouille";;;;;;1
2009;12;11;"Ils sont de retour";;;;;;1
2009;12;3;"Les germes poussent";;;;;;1
2009;11;29;"Activités du dimanche";;;;;;1
2009;11;28;"Scrooge";;;1;;;
2009;11;22;"Nouveau projecteur !";;;;;;1
2009;11;15;"Plan anti-grippe";;;;;;1
2009;11;12;"Disneyland";;;;;;1
2009;11;1;"Planètes au fil de l'Yvette";;1;;;;
2009;10;25;"Orion et son chien";;;;1;;
2009;10;24;"Bravo St Jean!";;;;1;;
2009;10;24;"Le jour et la nuit aux Ulis";;;;;;1
2009;10;17;"Le phare 40";;;;;;1
2009;9;27;"Sur le chemin de la fête des plantes";;;;;;1
2009;9;20;"Jeunes majeurs";;;;;;1
2009;9;8;"Ciel de septembre";;;;;;1
2009;9;2;"Déjà la rentrée ?";;1;;;;
2009;8;30;"Viaduc des Fauvettes";;;;;;1
2009;8;19;"Autopsie d'un sans papier";;1;;;;
2009;8;6;"Lune et Jupiter";;;;1;;
2009;7;26;"De Paris à Frangy";;;;1;;
2009;7;19;"Les jolies photos de ma fille";;;;;;1
2009;7;15;"Pour les victimes...";;;;;;1
2009;7;14;"Plein feu";;;;;;1
2009;7;9;"Où est la nuit ?";;;;;;1
2009;6;27;"Il était une fois la vie";;;;1;;
2009;6;24;"Lettre aux instituteurs";;1;;;;
2009;6;16;"Escalier des Ulis";;;;;;1
2009;6;11;"John, 7 ans, terroriste";;;;;;1
2009;6;9;"Eve ou Lucy ?";;1;;;;
2009;6;8;"Grand corps malade";;1;;;;
2009;6;7;"Aux mamans ulissiennes";;1;;;;
2009;6;6;"Les Ulis";;;;;;1
2009;6;5;"Enfin le calme";;;;;;1
2009;6;3;"Appel au calme et au respect";;1;;;;
2009;6;2;"La vie et le reste";;;;;;1
2009;6;1;"Le feu";;;;;;1
2009;5;31;"Acysd";;;;;;1
2009;5;27;"La chanson du dimanche";;;;;;1
2009;5;20;"L'école avant...";;1;;;;
2009;5;11;"Atlantis";1;;;;;
2009;5;6;"De la maternelle à l'université";;1;;;;
2009;4;24;"Du haut de la tour Eiffel";;;;;;1
2009;4;22;"Annie David";;;;;;1
2009;4;18;"Insécurité ?";;;;;;1
2009;4;14;"Sauvons le palais de la découverte";;1;;1;;
2009;4;10;"Fous ta cagoule";;;;;;1
2009;4;7;"Une rose cachée";;;;;;1
2009;4;7;"Eric, ramène-les !";;;;;;1
2009;4;5;"Marathon";;;;;;1
2009;4;3;"La valls des étiquettes";;;;;;1
2009;3;31;"Visible";;;;;;1
2009;3;27;"Vol pour Bamako";;;;;;1
2009;3;23;"Fêtes comme chez vous";;;;;1;
2009;3;22;"Mody";;;;;;1
2009;3;18;"Printemps des couettes";;1;;;;
2009;3;15;"Carnaval";;;;;;1
2009;3;9;"Giboulées à Orsay";;;;;;1
2009;3;8;"Toumaï";;1;;1;;
2009;3;2;"Indispensable ?";;1;;;;
2009;2;25;"La BAC is back...";;;;;;1
2009;2;20;"Deux visions...";;;;1;;
2009;2;15;"Plateau de saclay";;;;;;1
2009;2;14;"Parc nord";;;;;;1
2009;2;13;"Promenade aux Ulis";;;;;;1
2009;2;12;"Pas de chauffage";;;;1;;
2009;2;11;"Orsay dans la rue...";;;;1;;
2009;2;8;"Le mois du manga";;;1;;;
2009;2;5;"Réponse";;1;;;;
2009;2;4;"Oups Clochette...";;;;;;1
2009;1;31;"Nouvel an chinois";;;;;;1
2009;1;30;"Les chercheurs s'expriment !";;;;1;;
2009;1;26;"A Gaza ce soir";;;;;;1
2009;1;21;"En attendant le 29 : AG";;;;1;;
2009;1;21;"En attendant le 29 : Café débat";;;;1;;
2009;1;21;"En attendant le 29...";;1;;;;
2009;1;17;"France 2025";;;1;1;;
2009;1;15;"Petite vidéo...";;;;;1;
2009;1;10;" La terre sans nous...";;;1;;;
2009;1;6;"Photos de Gaza";;;;;;1
2009;1;6;"Chouette, il a neigé";;;;;;1
2009;1;2;"Musée de l'homme";;1;;1;;
2009;1;1;"Meilleurs voeux...";;;;1;;
