current set encoding is : lash-lsdf
seed is : 3284
cycles of length 1
(1/22), name = r1, size = 1658
(2/22), name = r2, size = 924
(3/22), name = r3, size = 1652
(4/22), name = r4, size = 924
(5/22), name = r5, size = 1683
(6/22), name = r6, size = 948
(7/22), name = r7, size = 948
(8/22), name = r8, size = 924
(9/22), name = r9, size = 1724
(10/22), name = r10, size = 924
(11/22), name = r11, size = 1712
(12/22), name = r12, size = 1730
(13/22), name = r13, size = 924
(14/22), name = r14, size = 1898
(15/22), name = r15, size = 924
(16/22), name = r16, size = 1778
(17/22), name = r17, size = 948
(18/22), name = r18, size = 948
(19/22), name = r19, size = 924
(20/22), name = r20, size = 1970
(21/22), name = r21, size = 924
(22/22), name = r22, size = 1946
**********************
Random choose
Name = r9  No new state computed
Name = r11  No new state computed
Name = r18  No new state computed
Name = r5  No new state computed
Name = r15  No new state computed
Name = r3  No new state computed
Name = r2  No new state computed
Name = r19  No new state computed
Name = r21  No new state computed
Name = r1  OK !
Now we have a representation of size = 59
Minimization in Progress
Name = r2  I.N.C.R.E.A.S.E
Name = r4 No new state computed
Name = r17 No new state computed
Name = r22 No new state computed
Name = r8 No new state computed
Name = r19 No new state computed
Name = r7 No new state computed
Name = r13 No new state computed
Name = r9 No new state computed
Name = r18 No new state computed
Name = r16 No new state computed
Name = r20 No new state computed
Name = r21 No new state computed
Name = r3 No new state computed
Name = r15 No new state computed
Name = r5 No new state computed
Name = r6 No new state computed
Name = r12  I.N.C.R.E.A.S.E
Name = r14 No new state computed
Name = r10 No new state computed
Name = r11 No new state computed
increase = 1
**********************
Random choose
Name = r12  OK !
Now we have a representation of size = 80
Minimization in Progress
Name = r2  I.N.C.R.E.A.S.E
Name = r15 No new state computed
Name = r1 No new state computed
Name = r5 No new state computed
Name = r10 No new state computed
Name = r3 No new state computed
Name = r6  I.N.C.R.E.A.S.E
Name = r13  I.N.C.R.E.A.S.E
Name = r22 No new state computed
Name = r18 No new state computed
Name = r11 No new state computed
Name = r19 No new state computed
Name = r16 No new state computed
Name = r8 No new state computed
Name = r4 No new state computed
Name = r14 No new state computed
Name = r21 No new state computed
Name = r20 No new state computed
Name = r7 No new state computed
Name = r17  I.N.C.R.E.A.S.E
Name = r9 No new state computed
increase = 1
**********************
Random choose
Name = r17  OK !
Now we have a representation of size = 86
Minimization in Progress
Name = r22 No new state computed
Name = r14 No new state computed
Name = r8 No new state computed
Name = r20 No new state computed
Name = r19  I.N.C.R.E.A.S.E
Name = r6  I.N.C.R.E.A.S.E
Name = r12 No new state computed
Name = r2  I.N.C.R.E.A.S.E
Name = r21 No new state computed
Name = r15 No new state computed
Name = r18 No new state computed
Name = r4 No new state computed
Name = r9 No new state computed
Name = r10 No new state computed
Name = r7 No new state computed
Name = r1 No new state computed
Name = r13  I.N.C.R.E.A.S.E
Name = r5 No new state computed
Name = r16 No new state computed
Name = r3 No new state computed
Name = r11 No new state computed
increase = 1
**********************
Random choose
Name = r13  OK !
Now we have a representation of size = 87
Minimization in Progress
Name = r2  I.N.C.R.E.A.S.E
Name = r9 No new state computed
Name = r14 No new state computed
Name = r11 No new state computed
Name = r3 No new state computed
Name = r21 No new state computed
Name = r15  I.N.C.R.E.A.S.E
Name = r8 No new state computed
Name = r19  I.N.C.R.E.A.S.E
Name = r1  OK !
Now we have a representation of size = 87
Name = r8 No new state computed
Name = r5 No new state computed
Name = r10 No new state computed
Name = r2  I.N.C.R.E.A.S.E
Name = r12 No new state computed
Name = r14 No new state computed
Name = r16 No new state computed
Name = r11 No new state computed
Name = r6  I.N.C.R.E.A.S.E
Name = r19  I.N.C.R.E.A.S.E
Name = r15  I.N.C.R.E.A.S.E
Name = r21 No new state computed
Name = r7 No new state computed
Name = r3 No new state computed
Name = r20 No new state computed
Name = r13 No new state computed
Name = r22 No new state computed
Name = r18 No new state computed
Name = r17 No new state computed
Name = r9 No new state computed
Name = r4 No new state computed
increase = 1
**********************
Random choose
Name = r15  OK !
Now we have a representation of size = 88
Minimization in Progress
Name = r20 No new state computed
Name = r22 No new state computed
Name = r16 No new state computed
Name = r10 No new state computed
Name = r19  I.N.C.R.E.A.S.E
Name = r21 No new state computed
Name = r8 No new state computed
Name = r7 No new state computed
Name = r14 No new state computed
Name = r13 No new state computed
Name = r18 No new state computed
Name = r17 No new state computed
Name = r1 No new state computed
Name = r11 No new state computed
Name = r3 No new state computed
Name = r6  I.N.C.R.E.A.S.E
Name = r5 No new state computed
Name = r9 No new state computed
Name = r4 No new state computed
Name = r2  I.N.C.R.E.A.S.E
Name = r12 No new state computed
increase = 1
**********************
Random choose
Name = r2  OK !
Now we have a representation of size = 89
Minimization in Progress
Name = r20 No new state computed
Name = r9 No new state computed
Name = r21 No new state computed
Name = r10 No new state computed
Name = r5 No new state computed
Name = r18 No new state computed
Name = r14 No new state computed
Name = r22 No new state computed
Name = r12  I.N.C.R.E.A.S.E
Name = r13 No new state computed
Name = r1 No new state computed
Name = r7 No new state computed
Name = r16 No new state computed
Name = r17 No new state computed
Name = r4 No new state computed
Name = r19  I.N.C.R.E.A.S.E
Name = r11 No new state computed
Name = r8 No new state computed
Name = r6  I.N.C.R.E.A.S.E
Name = r15 No new state computed
Name = r3  I.N.C.R.E.A.S.E
increase = 1
**********************
Random choose
Name = r3  OK !
Now we have a representation of size = 100
Minimization in Progress
Name = r18 No new state computed
Name = r13 No new state computed
Name = r15 No new state computed
Name = r5  I.N.C.R.E.A.S.E
Name = r9 No new state computed
Name = r10 No new state computed
Name = r6  I.N.C.R.E.A.S.E
Name = r11 No new state computed
Name = r4 No new state computed
Name = r19  I.N.C.R.E.A.S.E
Name = r8 No new state computed
Name = r7 No new state computed
Name = r17 No new state computed
Name = r2 No new state computed
Name = r16 No new state computed
Name = r22 No new state computed
Name = r1 No new state computed
Name = r21 No new state computed
Name = r14 No new state computed
Name = r20 No new state computed
Name = r12  I.N.C.R.E.A.S.E
increase = 1
**********************
Random choose
Name = r12  OK !
Now we have a representation of size = 120
Minimization in Progress
Name = r1 No new state computed
Name = r16 No new state computed
Name = r14 No new state computed
Name = r11 No new state computed
Name = r8 No new state computed
Name = r22 No new state computed
Name = r9 No new state computed
Name = r15 No new state computed
Name = r5  I.N.C.R.E.A.S.E
Name = r13 No new state computed
Name = r20 No new state computed
Name = r10 No new state computed
Name = r2 No new state computed
Name = r6  I.N.C.R.E.A.S.E
Name = r4 No new state computed
Name = r18 No new state computed
Name = r21 No new state computed
Name = r17  I.N.C.R.E.A.S.E
Name = r7 No new state computed
Name = r19  I.N.C.R.E.A.S.E
Name = r3 No new state computed
increase = 1
**********************
Random choose
Name = r19  OK !
Now we have a representation of size = 121
Minimization in Progress
Name = r17  I.N.C.R.E.A.S.E
Name = r9 No new state computed
Name = r2 No new state computed
Name = r14 No new state computed
Name = r16 No new state computed
Name = r3 No new state computed
Name = r12 No new state computed
Name = r4 No new state computed
Name = r21 No new state computed
Name = r15 No new state computed
Name = r18 No new state computed
Name = r10 No new state computed
Name = r6  I.N.C.R.E.A.S.E
Name = r7 No new state computed
Name = r13 No new state computed
Name = r8 No new state computed
Name = r20  I.N.C.R.E.A.S.E
Name = r11 No new state computed
Name = r5  I.N.C.R.E.A.S.E
Name = r22 No new state computed
Name = r1 No new state computed
increase = 1
**********************
Random choose
Name = r5  OK !
Now we have a representation of size = 140
Minimization in Progress
Name = r15 No new state computed
Name = r2 No new state computed
Name = r1  I.N.C.R.E.A.S.E
Name = r3 No new state computed
Name = r21 No new state computed
Name = r20  I.N.C.R.E.A.S.E
Name = r22 No new state computed
Name = r14 No new state computed
Name = r8 No new state computed
Name = r18 No new state computed
Name = r9 No new state computed
Name = r10 No new state computed
Name = r12 No new state computed
Name = r4 No new state computed
Name = r7 No new state computed
Name = r11 No new state computed
Name = r16 No new state computed
Name = r19 No new state computed
Name = r17  I.N.C.R.E.A.S.E
Name = r13  I.N.C.R.E.A.S.E
Name = r6  I.N.C.R.E.A.S.E
increase = 1
**********************
Random choose
Name = r6  OK !
Now we have a representation of size = 142
Minimization in Progress
Name = r10 No new state computed
Name = r17  I.N.C.R.E.A.S.E
Name = r7 No new state computed
Name = r16  I.N.C.R.E.A.S.E
Name = r4 No new state computed
Name = r13  I.N.C.R.E.A.S.E
Name = r12 No new state computed
Name = r18 No new state computed
Name = r9 No new state computed
Name = r2 No new state computed
Name = r19 No new state computed
Name = r8 No new state computed
Name = r15 No new state computed
Name = r11 No new state computed
Name = r5 No new state computed
Name = r14 No new state computed
Name = r1  I.N.C.R.E.A.S.E
Name = r3 No new state computed
Name = r20  I.N.C.R.E.A.S.E
Name = r21 No new state computed
Name = r22 No new state computed
increase = 1
**********************
Random choose
Name = r20  OK !
Now we have a representation of size = 161
Minimization in Progress
Name = r18 No new state computed
Name = r11 No new state computed
Name = r16  I.N.C.R.E.A.S.E
Name = r14 No new state computed
Name = r19 No new state computed
Name = r2  OK !
Now we have a representation of size = 161
Name = r20 No new state computed
Name = r10 No new state computed
Name = r6 No new state computed
Name = r8 No new state computed
Name = r16  I.N.C.R.E.A.S.E
Name = r22 No new state computed
Name = r12 No new state computed
Name = r11 No new state computed
Name = r4 No new state computed
Name = r18 No new state computed
Name = r7 No new state computed
Name = r3  I.N.C.R.E.A.S.E
Name = r21 No new state computed
Name = r19 No new state computed
Name = r15 No new state computed
Name = r14 No new state computed
Name = r5 No new state computed
Name = r9 No new state computed
Name = r17  I.N.C.R.E.A.S.E
Name = r1  I.N.C.R.E.A.S.E
Name = r13  I.N.C.R.E.A.S.E
increase = 1
**********************
Random choose
Name = r13  OK !
Now we have a representation of size = 165
Minimization in Progress
Name = r2 No new state computed
Name = r20 No new state computed
Name = r1  I.N.C.R.E.A.S.E
Name = r8 No new state computed
Name = r14 No new state computed
Name = r9 No new state computed
Name = r3  I.N.C.R.E.A.S.E
Name = r18 No new state computed
Name = r7 No new state computed
Name = r4 No new state computed
Name = r6 No new state computed
Name = r10 No new state computed
Name = r5 No new state computed
Name = r17  I.N.C.R.E.A.S.E
Name = r22 No new state computed
Name = r12 No new state computed
Name = r11 No new state computed
Name = r15 No new state computed
Name = r16  I.N.C.R.E.A.S.E
Name = r19 No new state computed
Name = r21 No new state computed
increase = 1
**********************
Random choose
Name = r16  OK !
Now we have a representation of size = 167
Minimization in Progress
Name = r4 No new state computed
Name = r11 No new state computed
Name = r17  I.N.C.R.E.A.S.E
Name = r1  I.N.C.R.E.A.S.E
Name = r8 No new state computed
Name = r13 No new state computed
Name = r10 No new state computed
Name = r14 No new state computed
Name = r12 No new state computed
Name = r5 No new state computed
Name = r18 No new state computed
Name = r9 No new state computed
Name = r21 No new state computed
Name = r15 No new state computed
Name = r22 No new state computed
Name = r6 No new state computed
Name = r19 No new state computed
Name = r2 No new state computed
Name = r7 No new state computed
Name = r3  I.N.C.R.E.A.S.E
Name = r20 No new state computed
increase = 1
**********************
Random choose
Name = r3  OK !
Now we have a representation of size = 176
Minimization in Progress
Name = r7 No new state computed
Name = r10 No new state computed
Name = r13 No new state computed
Name = r4 No new state computed
Name = r2 No new state computed
Name = r6 No new state computed
Name = r19 No new state computed
Name = r1  I.N.C.R.E.A.S.E
Name = r9 No new state computed
Name = r14 No new state computed
Name = r22 No new state computed
Name = r17  I.N.C.R.E.A.S.E
Name = r15 No new state computed
Name = r20 No new state computed
Name = r5  I.N.C.R.E.A.S.E
Name = r18 No new state computed
Name = r21  I.N.C.R.E.A.S.E
Name = r11 No new state computed
Name = r8 No new state computed
Name = r12 No new state computed
Name = r16 No new state computed
increase = 1
**********************
Random choose
Name = r21  OK !
Now we have a representation of size = 184
Minimization in Progress
Name = r10 No new state computed
Name = r11 No new state computed
Name = r4 No new state computed
Name = r3 No new state computed
Name = r8 No new state computed
Name = r14 No new state computed
Name = r6 No new state computed
Name = r12 No new state computed
Name = r22 No new state computed
Name = r2 No new state computed
Name = r18 No new state computed
Name = r20 No new state computed
Name = r17  I.N.C.R.E.A.S.E
Name = r19 No new state computed
Name = r13 No new state computed
Name = r1  I.N.C.R.E.A.S.E
Name = r16 No new state computed
Name = r5  I.N.C.R.E.A.S.E
Name = r7 No new state computed
Name = r15 No new state computed
Name = r9 No new state computed
increase = 1
**********************
Random choose
Name = r5  OK !
Now we have a representation of size = 192
Minimization in Progress
Name = r21 No new state computed
Name = r4 No new state computed
Name = r14 No new state computed
Name = r12 No new state computed
Name = r19 No new state computed
Name = r9 No new state computed
Name = r22 No new state computed
Name = r6 No new state computed
Name = r10 No new state computed
Name = r18 No new state computed
Name = r16 No new state computed
Name = r3 No new state computed
Name = r2 No new state computed
Name = r8 No new state computed
Name = r17  I.N.C.R.E.A.S.E
Name = r1  I.N.C.R.E.A.S.E
Name = r11 No new state computed
Name = r13 No new state computed
Name = r20 No new state computed
Name = r7 No new state computed
Name = r15 No new state computed
increase = 1
**********************
Random choose
Name = r1  OK !
Now we have a representation of size = 203
Minimization in Progress
Name = r22 No new state computed
Name = r5 No new state computed
Name = r4 No new state computed
Name = r6  I.N.C.R.E.A.S.E
Name = r7 No new state computed
Name = r17  I.N.C.R.E.A.S.E
Name = r10 No new state computed
Name = r3 No new state computed
Name = r9 No new state computed
Name = r14 No new state computed
Name = r12 No new state computed
Name = r13 No new state computed
Name = r8 No new state computed
Name = r16 No new state computed
Name = r20 No new state computed
Name = r11 No new state computed
Name = r21 No new state computed
Name = r19 No new state computed
Name = r15 No new state computed
Name = r18 No new state computed
Name = r2  OK !
Now we have a representation of size = 203
Name = r10 No new state computed
Name = r7 No new state computed
Name = r15 No new state computed
Name = r4 No new state computed
Name = r6  I.N.C.R.E.A.S.E
Name = r1 No new state computed
Name = r13 No new state computed
Name = r3 No new state computed
Name = r20 No new state computed
Name = r8 No new state computed
Name = r22  I.N.C.R.E.A.S.E
Name = r12  I.N.C.R.E.A.S.E
Name = r21 No new state computed
Name = r18 No new state computed
Name = r11 No new state computed
Name = r19 No new state computed
Name = r16 No new state computed
Name = r17  I.N.C.R.E.A.S.E
Name = r14 No new state computed
Name = r5 No new state computed
Name = r9 No new state computed
increase = 1
**********************
Random choose
Name = r17  OK !
Now we have a representation of size = 210
Minimization in Progress
Name = r14 No new state computed
Name = r5  OK !
Now we have a representation of size = 206
Name = r9 No new state computed
Name = r6  I.N.C.R.E.A.S.E
Name = r13 No new state computed
Name = r10 No new state computed
Name = r22  I.N.C.R.E.A.S.E
Name = r14 No new state computed
Name = r11 No new state computed
Name = r2 No new state computed
Name = r4 No new state computed
Name = r12  I.N.C.R.E.A.S.E
Name = r18 No new state computed
Name = r17 No new state computed
Name = r19  I.N.C.R.E.A.S.E
Name = r8 No new state computed
Name = r3 No new state computed
Name = r7 No new state computed
Name = r16 No new state computed
Name = r21 No new state computed
Name = r15 No new state computed
Name = r1 No new state computed
Name = r20 No new state computed
increase = 1
**********************
Random choose
Name = r19  OK !
Now we have a representation of size = 210
Minimization in Progress
Name = r3  OK !
Now we have a representation of size = 207
Name = r6  I.N.C.R.E.A.S.E
Name = r18 No new state computed
Name = r21 No new state computed
Name = r12  I.N.C.R.E.A.S.E
Name = r13 No new state computed
Name = r10 No new state computed
Name = r22  I.N.C.R.E.A.S.E
Name = r19 No new state computed
Name = r11 No new state computed
Name = r8 No new state computed
Name = r20 No new state computed
Name = r5  I.N.C.R.E.A.S.E
Name = r2 No new state computed
Name = r17 No new state computed
Name = r9 No new state computed
Name = r16 No new state computed
Name = r14 No new state computed
Name = r15 No new state computed
Name = r4 No new state computed
Name = r7 No new state computed
Name = r1 No new state computed
increase = 1
**********************
Random choose
Name = r5  OK !
Now we have a representation of size = 211
Minimization in Progress
Name = r4 No new state computed
Name = r14 No new state computed
Name = r7 No new state computed
Name = r12  I.N.C.R.E.A.S.E
Name = r2 No new state computed
Name = r21 No new state computed
Name = r22  I.N.C.R.E.A.S.E
Name = r3 No new state computed
Name = r18 No new state computed
Name = r6  I.N.C.R.E.A.S.E
Name = r13 No new state computed
Name = r8 No new state computed
Name = r19 No new state computed
Name = r1  OK !
Now we have a representation of size = 205
Name = r11 No new state computed
Name = r7 No new state computed
Name = r6  I.N.C.R.E.A.S.E
Name = r16 No new state computed
Name = r3 No new state computed
Name = r15 No new state computed
Name = r8 No new state computed
Name = r9 No new state computed
Name = r22  I.N.C.R.E.A.S.E
Name = r5 No new state computed
Name = r10 No new state computed
Name = r14 No new state computed
Name = r4 No new state computed
Name = r21 No new state computed
Name = r12  I.N.C.R.E.A.S.E
Name = r2 No new state computed
Name = r17 No new state computed
Name = r18 No new state computed
Name = r20 No new state computed
Name = r19 No new state computed
Name = r13 No new state computed
increase = 1
**********************
Random choose
Name = r12  OK !
Now we have a representation of size = 214
Minimization in Progress
Name = r20 No new state computed
Name = r2 No new state computed
Name = r15 No new state computed
Name = r3 No new state computed
Name = r17  I.N.C.R.E.A.S.E
Name = r18 No new state computed
Name = r10 No new state computed
Name = r11 No new state computed
Name = r22 No new state computed
Name = r9 No new state computed
Name = r4 No new state computed
Name = r16 No new state computed
Name = r1 No new state computed
Name = r21 No new state computed
Name = r19 No new state computed
Name = r6  I.N.C.R.E.A.S.E
Name = r14 No new state computed
Name = r5 No new state computed
Name = r7 No new state computed
Name = r13 No new state computed
Name = r8 No new state computed
increase = 1
**********************
Random choose
Name = r6  OK !
Now we have a representation of size = 215
Minimization in Progress
Name = r18 No new state computed
Name = r9 No new state computed
Name = r5 No new state computed
Name = r10 No new state computed
Name = r11 No new state computed
Name = r12 No new state computed
Name = r22 No new state computed
Name = r8  I.N.C.R.E.A.S.E
Name = r14 No new state computed
Name = r21 No new state computed
Name = r15 No new state computed
Name = r7 No new state computed
Name = r17  I.N.C.R.E.A.S.E
Name = r19 No new state computed
Name = r13 No new state computed
Name = r16 No new state computed
Name = r2 No new state computed
Name = r20  I.N.C.R.E.A.S.E
Name = r4 No new state computed
Name = r3 No new state computed
Name = r1 No new state computed
increase = 1
**********************
Random choose
Name = r20  OK !
Now we have a representation of size = 221
Minimization in Progress
Name = r19 No new state computed
Name = r22 No new state computed
Name = r15 No new state computed
Name = r5 No new state computed
Name = r16 No new state computed
Name = r7 No new state computed
Name = r3 No new state computed
Name = r13 No new state computed
Name = r17  I.N.C.R.E.A.S.E
Name = r1 No new state computed
Name = r9 No new state computed
Name = r10 No new state computed
Name = r21  OK !
Now we have a representation of size = 216
Name = r6 No new state computed
Name = r11 No new state computed
Name = r19 No new state computed
Name = r12 No new state computed
Name = r2 No new state computed
Name = r9 No new state computed
Name = r7 No new state computed
Name = r8  I.N.C.R.E.A.S.E
Name = r17  I.N.C.R.E.A.S.E
Name = r1 No new state computed
Name = r13 No new state computed
Name = r14 No new state computed
Name = r10 No new state computed
Name = r3 No new state computed
Name = r18 No new state computed
Name = r16 No new state computed
Name = r20 No new state computed
Name = r22 No new state computed
Name = r5 No new state computed
Name = r15 No new state computed
Name = r4 No new state computed
increase = 1
**********************
Random choose
Name = r17  OK !
Now we have a representation of size = 219
Minimization in Progress
Name = r13 No new state computed
Name = r5 No new state computed
Name = r18 No new state computed
Name = r15 No new state computed
Name = r3 No new state computed
Name = r7 No new state computed
Name = r12 No new state computed
Name = r21 No new state computed
Name = r20 No new state computed
Name = r1 No new state computed
Name = r2 No new state computed
Name = r9 No new state computed
Name = r19 No new state computed
Name = r16 No new state computed
Name = r8  I.N.C.R.E.A.S.E
Name = r4 No new state computed
Name = r11 No new state computed
Name = r14 No new state computed
Name = r6 No new state computed
Name = r10 No new state computed
Name = r22 No new state computed
increase = 1
**********************
Random choose
Name = r8  OK !
Now we have a representation of size = 221
Minimization in Progress
Name = r22 No new state computed
Name = r1 No new state computed
Name = r18 No new state computed
Name = r9  I.N.C.R.E.A.S.E
Name = r19 No new state computed
Name = r4 No new state computed
Name = r3 No new state computed
Name = r12 No new state computed
Name = r7 No new state computed
Name = r17 No new state computed
Name = r5 No new state computed
Name = r21 No new state computed
Name = r6 No new state computed
Name = r2 No new state computed
Name = r13 No new state computed
Name = r20 No new state computed
Name = r11 No new state computed
Name = r15 No new state computed
Name = r10 No new state computed
Name = r14  I.N.C.R.E.A.S.E
Name = r16 No new state computed
increase = 1
**********************
Random choose
Name = r14  OK !
Now we have a representation of size = 229
Minimization in Progress
Name = r6 No new state computed
Name = r1 No new state computed
Name = r12 No new state computed
Name = r4 No new state computed
Name = r10 No new state computed
Name = r22 No new state computed
Name = r17 No new state computed
Name = r3 No new state computed
Name = r20 No new state computed
Name = r16  I.N.C.R.E.A.S.E
Name = r7 No new state computed
Name = r13 No new state computed
Name = r2 No new state computed
Name = r15 No new state computed
Name = r18 No new state computed
Name = r19 No new state computed
Name = r9  I.N.C.R.E.A.S.E
Name = r5 No new state computed
Name = r21 No new state computed
Name = r11 No new state computed
Name = r8 No new state computed
increase = 1
**********************
Random choose
Name = r9  OK !
Now we have a representation of size = 255
Minimization in Progress
Name = r13 No new state computed
Name = r12 No new state computed
Name = r18 No new state computed
Name = r22 No new state computed
Name = r11 No new state computed
Name = r15 No new state computed
Name = r3 No new state computed
Name = r1 No new state computed
Name = r20 No new state computed
Name = r14 No new state computed
Name = r4 No new state computed
Name = r10  I.N.C.R.E.A.S.E
Name = r7 No new state computed
Name = r17 No new state computed
Name = r8 No new state computed
Name = r16  I.N.C.R.E.A.S.E
Name = r21 No new state computed
Name = r6 No new state computed
Name = r2 No new state computed
Name = r5 No new state computed
Name = r19 No new state computed
increase = 1
**********************
Random choose
Name = r16  OK !
Now we have a representation of size = 263
Minimization in Progress
Name = r13 No new state computed
Name = r10  I.N.C.R.E.A.S.E
Name = r5 No new state computed
Name = r3 No new state computed
Name = r14 No new state computed
Name = r7 No new state computed
Name = r8 No new state computed
Name = r20 No new state computed
Name = r19 No new state computed
Name = r4 No new state computed
Name = r12  OK !
Now we have a representation of size = 263
Name = r20 No new state computed
Name = r5 No new state computed
Name = r15 No new state computed
Name = r11 No new state computed
Name = r3 No new state computed
Name = r16 No new state computed
Name = r10  I.N.C.R.E.A.S.E
Name = r1 No new state computed
Name = r13  OK !
Now we have a representation of size = 261
Name = r19 No new state computed
Name = r20 No new state computed
Name = r22 No new state computed
Name = r7 No new state computed
Name = r8 No new state computed
Name = r3 No new state computed
Name = r17  I.N.C.R.E.A.S.E
Name = r2 No new state computed
Name = r9 No new state computed
Name = r10  I.N.C.R.E.A.S.E
Name = r4 No new state computed
Name = r16 No new state computed
Name = r12 No new state computed
Name = r5 No new state computed
Name = r11 No new state computed
Name = r1 No new state computed
Name = r15 No new state computed
Name = r18 No new state computed
Name = r21 No new state computed
Name = r6 No new state computed
Name = r14 No new state computed
increase = 1
**********************
Random choose
Name = r10  OK !
Now we have a representation of size = 263
Minimization in Progress
Name = r2 No new state computed
Name = r6 No new state computed
Name = r22 No new state computed
Name = r15 No new state computed
Name = r18 No new state computed
Name = r11 No new state computed
Name = r12 No new state computed
Name = r7 No new state computed
Name = r9 No new state computed
Name = r19 No new state computed
Name = r4 No new state computed
Name = r14 No new state computed
Name = r16 No new state computed
Name = r20 No new state computed
Name = r1 No new state computed
Name = r13 No new state computed
Name = r21 No new state computed
Name = r17  I.N.C.R.E.A.S.E
Name = r8 No new state computed
Name = r3 No new state computed
Name = r5 No new state computed
increase = 1
**********************
Random choose
Name = r17  OK !
Now we have a representation of size = 264
Minimization in Progress
Name = r12 No new state computed
Name = r7 No new state computed
Name = r1 No new state computed
Name = r19  OK !
Now we have a representation of size = 263
Name = r10 No new state computed
Name = r20  I.N.C.R.E.A.S.E
Name = r22 No new state computed
Name = r4 No new state computed
Name = r5 No new state computed
Name = r18 No new state computed
Name = r17 No new state computed
Name = r8 No new state computed
Name = r21 No new state computed
Name = r2 No new state computed
Name = r15 No new state computed
Name = r16 No new state computed
Name = r14 No new state computed
Name = r7 No new state computed
Name = r1 No new state computed
Name = r13 No new state computed
Name = r9  I.N.C.R.E.A.S.E
Name = r3 No new state computed
Name = r11 No new state computed
Name = r12 No new state computed
Name = r6 No new state computed
increase = 1
**********************
Random choose
Name = r9  OK !
Now we have a representation of size = 265
Minimization in Progress
Name = r13 No new state computed
Name = r3 No new state computed
Name = r2 No new state computed
Name = r16 No new state computed
Name = r4 No new state computed
Name = r10  OK !
Now we have a representation of size = 265
Name = r9 No new state computed
Name = r11 No new state computed
Name = r13 No new state computed
Name = r8 No new state computed
Name = r17 No new state computed
Name = r22 No new state computed
Name = r6 No new state computed
Name = r3 No new state computed
Name = r12 No new state computed
Name = r18 No new state computed
Name = r15 No new state computed
Name = r5 No new state computed
Name = r14 No new state computed
Name = r16 No new state computed
Name = r20  I.N.C.R.E.A.S.E
Name = r4 No new state computed
Name = r2 No new state computed
Name = r21 No new state computed
Name = r7 No new state computed
Name = r1 No new state computed
Name = r19 No new state computed
increase = 1
**********************
Random choose
Name = r20  OK !
Now we have a representation of size = 275
Minimization in Progress
Name = r9 No new state computed
Name = r1 No new state computed
Name = r15 No new state computed
Name = r5 No new state computed
Name = r11 No new state computed
Name = r19 No new state computed
Name = r18 No new state computed
Name = r7 No new state computed
Name = r2 No new state computed
Name = r17 No new state computed
Name = r10 No new state computed
Name = r14 No new state computed
Name = r16 No new state computed
Name = r13 No new state computed
Name = r21 No new state computed
Name = r22 No new state computed
Name = r3 No new state computed
Name = r4 No new state computed
Name = r6 No new state computed
Name = r12 No new state computed
Name = r8 No new state computed
increase = 0
nb accelerations 44
Fix point FOUND
seed is : 3284
