let
  G0 := int * (0, 0, 1, 1, 0, 0, 0) + int * (0, 0, 0, 0, 1, 0, 0) + int * (0, 0, 0, 0, 0, 1, 0);
  G1 := int * (0, 0, 1, 1, 0, 1, 0) + int * (0, 0, 0, 0, 1, 0, 0);
  G2 := int * (0, 0, 1, 1, 1, 0, 0) + int * (0, 0, 0, 0, 0, 1, 0);
  G3 := int * (0, 0, 1, 1, 1, 1, 0);
  nat7 := (nat, nat, nat, nat, nat, nat, nat);
  R := 
    let
      I_F7_6 := 2 * G0;
      I_F6_5 := I_F7_6 || I_F7_6 + (0, 0, 0, 0, 0, 1, 0);
      I_F5_4 := I_F6_5 || I_F6_5 + (0, 0, 0, 0, 1, 0, 0);
      PCF19_0 := (0, 0, 1, 0, 0, 0, 0) + G1;
      I_F18_6 := 2 * PCF19_0;
      I_F17_5 := I_F18_6 + (0, 0, 0, 0, 0, 1, 0);
      I_F16_4 := I_F17_5 || I_F17_5 + (0, 0, 0, 0, 1, 0, 0);
      I_F15_3 := I_F16_4 + (0, 0, 0, 1, 0, 0, 0);
      I_F23_6 := 2 * G1;
      I_F21_4 := I_F23_6 || I_F23_6 + (0, 0, 0, 0, 1, 0, 0);
      I_F14_2 := I_F15_3 || I_F21_4 + (0, 0, 1, 0, 0, 0, 0);
      I_F13_1 := I_F14_2 + (0, 1, 0, 0, 0, 0, 0);
      I_F11_6 := 2 * I_F13_1;
      I_F10_5 := I_F11_6 + (0, 0, 0, 0, 0, 1, 0);
      PCF34_0 := (0, 0, 1, 0, 0, 0, 0) + G2;
      I_F33_6 := 2 * PCF34_0;
      I_F32_5 := I_F33_6 || I_F33_6 + (0, 0, 0, 0, 0, 1, 0);
      I_F31_4 := I_F32_5 + (0, 0, 0, 0, 1, 0, 0);
      I_F30_3 := I_F31_4 + (0, 0, 0, 1, 0, 0, 0);
      I_F38_6 := 2 * G2;
      I_F37_5 := I_F38_6 || I_F38_6 + (0, 0, 0, 0, 0, 1, 0);
      I_F29_2 := I_F30_3 || I_F37_5 + (0, 0, 1, 0, 0, 0, 0);
      I_F27_0 := I_F29_2 + (1, 0, 0, 0, 0, 0, 0);
      I_F26_6 := 2 * I_F27_0;
      I_F41_0 := I_F13_1 || I_F29_2 + (1, 0, 0, 0, 0, 0, 0);
      I_F40_6 := 2 * I_F41_0;
      I_F25_5 := I_F26_6 || I_F40_6 + (0, 0, 0, 0, 0, 1, 0);
      I_F9_4 := I_F10_5 || I_F25_5 + (0, 0, 0, 0, 1, 0, 0);
      I_F4_3 := I_F5_4 || I_F9_4 + (0, 0, 0, 1, 0, 0, 0);
      I_F51_5 := I_F23_6 + (0, 0, 0, 0, 0, 1, 0);
      I_F50_4 := I_F51_5 || I_F51_5 + (0, 0, 0, 0, 1, 0, 0);
      I_F49_3 := I_F50_4 + (0, 0, 0, 1, 0, 0, 0);
      I_F48_2 := I_F21_4 || I_F49_3 + (0, 0, 1, 0, 0, 0, 0);
      I_F47_1 := I_F48_2 + (0, 1, 0, 0, 0, 0, 0);
      I_F55_4 := I_F37_5 + (0, 0, 0, 0, 1, 0, 0);
      I_F54_3 := I_F55_4 + (0, 0, 0, 1, 0, 0, 0);
      I_F53_2 := I_F37_5 || I_F54_3 + (0, 0, 1, 0, 0, 0, 0);
      I_F46_0 := I_F47_1 || I_F53_2 + (1, 0, 0, 0, 0, 0, 0);
      I_F45_6 := 2 * I_F46_0;
      I_F57_0 := I_F53_2 + (1, 0, 0, 0, 0, 0, 0);
      I_F56_6 := 2 * I_F57_0;
      I_F44_5 := I_F45_6 || I_F56_6 + (0, 0, 0, 0, 0, 1, 0);
      I_F59_6 := 2 * I_F47_1;
      I_F43_4 := I_F44_5 || I_F59_6 + (0, 0, 0, 0, 1, 0, 0);
      I_F42_3 := I_F43_4 || I_F5_4 + (0, 0, 0, 1, 0, 0, 0);
      I_F3_2 := I_F4_3 || I_F42_3 + (0, 0, 1, 0, 0, 0, 0);
      PCF73_0 := (0, 0, 1, 0, 0, 0, 0) + G3;
      I_F72_6 := 2 * PCF73_0;
      I_F71_5 := I_F72_6 + (0, 0, 0, 0, 0, 1, 0);
      I_F70_4 := I_F71_5 + (0, 0, 0, 0, 1, 0, 0);
      I_F69_3 := I_F70_4 + (0, 0, 0, 1, 0, 0, 0);
      I_F77_6 := 2 * G3;
      I_F68_2 := I_F69_3 || I_F77_6 + (0, 0, 1, 0, 0, 0, 0);
      I_F66_0 := I_F68_2 + (1, 0, 0, 0, 0, 0, 0);
      I_F65_6 := 2 * I_F66_0;
      I_F64_5 := I_F65_6 + (0, 0, 0, 0, 0, 1, 0);
      I_F62_3 := I_F64_5 || I_F16_4 + (0, 0, 0, 1, 0, 0, 0);
      PCF90_0 := (0, 0, 1, 0, 0, 1, 0) + G3;
      I_F89_6 := 2 * PCF90_0;
      I_F87_4 := I_F89_6 + (0, 0, 0, 0, 1, 0, 0);
      I_F86_3 := I_F87_4 + (0, 0, 0, 1, 0, 0, 0);
      I_F93_5 := I_F77_6 + (0, 0, 0, 0, 0, 1, 0);
      I_F85_2 := I_F86_3 || I_F93_5 + (0, 0, 1, 0, 0, 0, 0);
      I_F83_0 := I_F85_2 + (1, 0, 0, 0, 0, 0, 0);
      I_F82_6 := 2 * I_F83_0;
      I_F80_4 := I_F82_6 + (0, 0, 0, 0, 1, 0, 0);
      I_F79_3 := I_F21_4 || I_F80_4 + (0, 0, 0, 1, 0, 0, 0);
      I_F61_2 := I_F62_3 || I_F79_3 + (0, 0, 1, 0, 0, 0, 0);
      I_F2_1 := I_F3_2 || I_F61_2 + (0, 1, 0, 0, 0, 0, 0);
      I_F101_1 := I_F68_2 + (0, 1, 0, 0, 0, 0, 0);
      I_F99_6 := 2 * I_F101_1;
      I_F97_4 := I_F99_6 + (0, 0, 0, 0, 1, 0, 0);
      I_F96_3 := I_F97_4 || I_F31_4 + (0, 0, 0, 1, 0, 0, 0);
      PCF113_0 := (0, 0, 1, 0, 1, 0, 0) + G3;
      I_F112_6 := 2 * PCF113_0;
      I_F111_5 := I_F112_6 + (0, 0, 0, 0, 0, 1, 0);
      I_F109_3 := I_F111_5 + (0, 0, 0, 1, 0, 0, 0);
      I_F115_4 := I_F77_6 + (0, 0, 0, 0, 1, 0, 0);
      I_F108_2 := I_F109_3 || I_F115_4 + (0, 0, 1, 0, 0, 0, 0);
      I_F107_1 := I_F108_2 + (0, 1, 0, 0, 0, 0, 0);
      I_F105_6 := 2 * I_F107_1;
      I_F104_5 := I_F105_6 + (0, 0, 0, 0, 0, 1, 0);
      I_F102_3 := I_F37_5 || I_F104_5 + (0, 0, 0, 1, 0, 0, 0);
      I_F95_2 := I_F96_3 || I_F102_3 + (0, 0, 1, 0, 0, 0, 0);
      I_F118_4 := I_F71_5 || I_F72_6 + (0, 0, 0, 0, 1, 0, 0);
      I_F121_4 := I_F111_5 || I_F89_6 + (0, 0, 0, 0, 1, 0, 0);
      I_F120_3 := I_F121_4 + (0, 0, 0, 1, 0, 0, 0);
      I_F116_2 := I_F118_4 || I_F120_3 + (0, 0, 1, 0, 0, 0, 0);
      I_F94_1 := I_F95_2 || I_F116_2 + (0, 1, 0, 0, 0, 0, 0);
    in
      I_F2_1 || I_F94_1 + (1, 0, 0, 0, 0, 0, 0);
in
  { (p1, p2, t, s, a1, a2, state) | (p1, p2, t, s, a1, a2, state) in nat7 && R };
// Automata size             : #SA=70 #EA=14 #S=133 #D=13 #Refs=27 #to0=48/266
// Formula size              : 1251 nodes
// Time to synthesis formula : 10 ms
