let
  G0 := int * (0, 0, 1, 0, 0, 0) + int * (0, 0, 0, 1, 0, 0);
  G1 := int * (0, 0, 0, 1, 0, 0);
  nat6 := (nat, nat, nat, nat, nat, nat);
  R := 
    let
      PCF7_0 := 
        let
          CF0 := (0, 0, 0, 1, 0, 0) + G0;
          CF1 := (0, 0, 0, 0, 0, 0);
        in
          CF0 ^ CF1;
      I_F6_5 := 2 * PCF7_0;
      PCF9_0 := 
        let
          CF0 := (0, 0, 1, 0, 0, 0) + G0;
        in
          CF0 ^ G1;
      I_F8_5 := 2 * PCF9_0;
      I_F5_4 := I_F6_5 || I_F8_5 + (0, 0, 0, 0, 1, 0);
      I_F11_5 := 2 * G0;
      I_F10_4 := I_F11_5 || I_F8_5 + (0, 0, 0, 0, 1, 0);
      I_F4_3 := I_F5_4 || I_F10_4 + (0, 0, 0, 1, 0, 0);
      I_F14_4 := I_F11_5 || I_F11_5 + (0, 0, 0, 0, 1, 0);
      I_F13_3 := I_F14_4 || I_F14_4 + (0, 0, 0, 1, 0, 0);
      I_F3_2 := I_F4_3 || I_F13_3 + (0, 0, 1, 0, 0, 0);
      I_F18_5 := 2 * G1;
      I_F16_3 := I_F18_5 || I_F18_5 + (0, 0, 0, 1, 0, 0);
      I_F2_1 := I_F3_2 || I_F16_3 + (0, 1, 0, 0, 0, 0);
    in
      I_F2_1 || I_F16_3 + (1, 0, 0, 0, 0, 0);
in
  { (modified, exclusive, shared, invalid, owned, state) | (modified, exclusive, shared, invalid, owned, state) in nat6 && R };
// Automata size             : #SA=13 #EA=9 #S=33 #D=7 #Refs=17 #to0=4/66
// Formula size              : 270 nodes
// Time to synthesis formula : 10 ms
