current set encoding is : lash-msdf
seed is : 2691
cycles of length 1
(1/4), name = r1, size = 148
(2/4), name = r2, size = 80
(3/4), name = r3, size = 176
(4/4), name = r4, size = 187
**********************
Random choose
Name = r2  No new state computed
Name = r1  OK !
Now we have a representation of size = 14
Minimization in Progress
Name = r2 No new state computed
Name = r3  I.N.C.R.E.A.S.E
Name = r4  I.N.C.R.E.A.S.E
increase = 1
**********************
Random choose
Name = r4  OK !
Now we have a representation of size = 23
Minimization in Progress
Name = r3 No new state computed
Name = r2  I.N.C.R.E.A.S.E
Name = r1 No new state computed
increase = 1
**********************
Random choose
Name = r2  OK !
Now we have a representation of size = 24
Minimization in Progress
Name = r1 No new state computed
Name = r3 No new state computed
Name = r4 No new state computed
increase = 0
nb accelerations 3
Fix point FOUND
seed is : 2691
