current set encoding is : lira
seed is : 21768
(1/16)->
(2/16)->
(3/16)->
(4/16)->
(5/16)->
(6/16)->
(7/16)->
(8/16)->
(9/16)->
(10/16)->
(11/16)->
(12/16)->
(13/16)->
(14/16)->
(15/16)->
(16/16)->
Simplification of the linear system 
1 functions have the same action, it remains only 1
2 functions have the same action, it remains only 1
1 functions have the same action, it remains only 1
1 functions have the same action, it remains only 1
1 functions have the same action, it remains only 1
1 functions have the same action, it remains only 1
1 functions have the same action, it remains only 1
1 functions have the same action, it remains only 1
Number of actions before simplification : 9
Number of actions after simplification  : 8
(1/32)->
(2/32)->
(3/32)->
(4/32)->
(5/32)->
(6/32)->
(7/32)->
(8/32)->
(9/32)->
(10/32)->
(11/32)->
(12/32)->
(13/32)->
(14/32)->
(15/32)->
(16/32)->
(17/32)->
(18/32)->
(19/32)->
(20/32)->
(21/32)->
(22/32)->
(23/32)->
(24/32)->
(25/32)->
(26/32)->
(27/32)->
(28/32)->
(29/32)->
(30/32)->
(31/32)->
(32/32)->
Simplification of the linear system 
1 functions have the same action, it remains only 1
2 functions have the same action, it remains only 1
2 functions have the same action, it remains only 1
1 functions have the same action, it remains only 1
3 functions have the same action, it remains only 1
1 functions have the same action, it remains only 1
3 functions have the same action, it remains only 1
2 functions have the same action, it remains only 1
1 functions have the same action, it remains only 1
1 functions have the same action, it remains only 1
1 functions have the same action, it remains only 1
1 functions have the same action, it remains only 1
1 functions have the same action, it remains only 1
Number of actions before simplification : 20
Number of actions after simplification  : 13
cycles of length 3
(1/13), name = ++t4, size = 16
(2/13), name = (+t4.(+t4.t2+t2)+(+t4.t2+t2)), size = 16
(3/13), name = (+t3.+t4++t3.t4), size = 28
(4/13), name = +t3.(+t4.t2+t2), size = 28
(5/13), name = (+t4.+t2.t3+t2.+t3++t2.t3), size = 26
(6/13), name = +t3.+t3.t4, size = 19
(7/13), name = (+t1.(+t4.t2+t2)+t4.+t1.t2++t1.t2), size = 50
(8/13), name = (+t4.+t1++t4.t1), size = 46
(9/13), name = +t3.+t4.t1, size = 46
(10/13), name = +t1.+t2.t3, size = 20
(11/13), name = +t1.+t1.t2, size = 20
(12/13), name = ++t3, size = 10
(13/13), name = ++t1, size = 35
**********************
Random choose
Name = (+t3.+t4++t3.t4)  No new state computed
Name = +t3.(+t4.t2+t2)  No new state computed
Name = +t3.+t3.t4  No new state computed
Name = +t1.+t1.t2  OK !
Now we have a representation of size = 7
Minimization in Progress
Name = +t3.+t3.t4 No new state computed
Name = (+t4.+t2.t3+t2.+t3++t2.t3)  OK !
Now we have a representation of size = 7
Name = (+t3.+t4++t3.t4) No new state computed
Name = (+t1.(+t4.t2+t2)+t4.+t1.t2++t1.t2)  OK !
Now we have a representation of size = 7
Name = ++t4 No new state computed
Name = (+t4.(+t4.t2+t2)+(+t4.t2+t2))  OK !
Now we have a representation of size = 7
Name = (+t4.+t1++t4.t1) No new state computed
Name = +t1.+t2.t3  I.N.C.R.E.A.S.E
Name = +t3.(+t4.t2+t2) No new state computed
Name = ++t1  I.N.C.R.E.A.S.E
Name = ++t4 No new state computed
Name = (+t4.+t2.t3+t2.+t3++t2.t3) No new state computed
Name = ++t3  I.N.C.R.E.A.S.E
Name = (+t3.+t4++t3.t4) No new state computed
Name = +t3.+t4.t1 No new state computed
Name = +t3.+t3.t4 No new state computed
Name = (+t1.(+t4.t2+t2)+t4.+t1.t2++t1.t2) No new state computed
Name = +t1.+t1.t2 No new state computed
increase = 1
**********************
Random choose
Name = ++t3  OK !
Now we have a representation of size = 9
Minimization in Progress
Name = +t3.(+t4.t2+t2)  I.N.C.R.E.A.S.E
Name = (+t4.+t2.t3+t2.+t3++t2.t3)  I.N.C.R.E.A.S.E
Name = (+t1.(+t4.t2+t2)+t4.+t1.t2++t1.t2)  I.N.C.R.E.A.S.E
Name = +t1.+t1.t2 No new state computed
Name = +t3.+t3.t4  I.N.C.R.E.A.S.E
Name = (+t4.+t1++t4.t1)  I.N.C.R.E.A.S.E
Name = ++t4  I.N.C.R.E.A.S.E
Name = ++t1  I.N.C.R.E.A.S.E
Name = +t3.+t4.t1  I.N.C.R.E.A.S.E
Name = (+t4.(+t4.t2+t2)+(+t4.t2+t2))  I.N.C.R.E.A.S.E
Name = (+t3.+t4++t3.t4)  I.N.C.R.E.A.S.E
Name = +t1.+t2.t3 No new state computed
increase = 1
**********************
Random choose
Name = (+t3.+t4++t3.t4)  OK !
Now we have a representation of size = 22
Minimization in Progress
Name = ++t3 No new state computed
Name = (+t4.+t2.t3+t2.+t3++t2.t3)  I.N.C.R.E.A.S.E
Name = (+t1.(+t4.t2+t2)+t4.+t1.t2++t1.t2)  I.N.C.R.E.A.S.E
Name = (+t4.(+t4.t2+t2)+(+t4.t2+t2))  OK !
Now we have a representation of size = 22
Name = ++t3  I.N.C.R.E.A.S.E
Name = (+t4.+t1++t4.t1)  I.N.C.R.E.A.S.E
Name = (+t3.+t4++t3.t4) No new state computed
Name = +t3.+t3.t4 No new state computed
Name = (+t4.+t2.t3+t2.+t3++t2.t3)  I.N.C.R.E.A.S.E
Name = +t1.+t1.t2  I.N.C.R.E.A.S.E
Name = (+t1.(+t4.t2+t2)+t4.+t1.t2++t1.t2)  I.N.C.R.E.A.S.E
Name = +t3.(+t4.t2+t2) No new state computed
Name = ++t1  I.N.C.R.E.A.S.E
Name = +t1.+t2.t3  I.N.C.R.E.A.S.E
Name = ++t4 No new state computed
Name = +t3.+t4.t1  I.N.C.R.E.A.S.E
increase = 1
**********************
Random choose
Name = +t3.+t4.t1  OK !
Now we have a representation of size = 24
Minimization in Progress
Name = (+t4.(+t4.t2+t2)+(+t4.t2+t2))  OK !
Now we have a representation of size = 24
Name = (+t4.+t1++t4.t1) No new state computed
Name = (+t4.+t2.t3+t2.+t3++t2.t3)  OK !
Now we have a representation of size = 24
Name = +t3.+t3.t4 No new state computed
Name = ++t4 No new state computed
Name = +t1.+t1.t2  I.N.C.R.E.A.S.E
Name = +t3.+t4.t1 No new state computed
Name = ++t3  I.N.C.R.E.A.S.E
Name = (+t4.+t1++t4.t1) No new state computed
Name = +t1.+t2.t3  I.N.C.R.E.A.S.E
Name = (+t4.(+t4.t2+t2)+(+t4.t2+t2)) No new state computed
Name = (+t3.+t4++t3.t4) No new state computed
Name = ++t1  I.N.C.R.E.A.S.E
Name = (+t1.(+t4.t2+t2)+t4.+t1.t2++t1.t2)  I.N.C.R.E.A.S.E
Name = +t3.(+t4.t2+t2) No new state computed
increase = 1
**********************
Random choose
Name = (+t1.(+t4.t2+t2)+t4.+t1.t2++t1.t2)  OK !
Now we have a representation of size = 28
Minimization in Progress
Name = (+t4.+t2.t3+t2.+t3++t2.t3) No new state computed
Name = +t3.+t4.t1 No new state computed
Name = +t3.+t3.t4 No new state computed
Name = ++t3  I.N.C.R.E.A.S.E
Name = +t1.+t2.t3  I.N.C.R.E.A.S.E
Name = (+t4.(+t4.t2+t2)+(+t4.t2+t2)) No new state computed
Name = +t1.+t1.t2  I.N.C.R.E.A.S.E
Name = ++t1  I.N.C.R.E.A.S.E
Name = +t3.(+t4.t2+t2) No new state computed
Name = (+t4.+t1++t4.t1) No new state computed
Name = ++t4 No new state computed
Name = (+t3.+t4++t3.t4) No new state computed
increase = 1
**********************
Random choose
Name = ++t1  OK !
Now we have a representation of size = 70
Minimization in Progress
Name = +t3.+t4.t1 No new state computed
Name = +t1.+t2.t3  I.N.C.R.E.A.S.E
Name = ++t3  I.N.C.R.E.A.S.E
Name = (+t3.+t4++t3.t4) No new state computed
Name = ++t4 No new state computed
Name = +t3.(+t4.t2+t2) No new state computed
Name = (+t4.+t2.t3+t2.+t3++t2.t3)  I.N.C.R.E.A.S.E
Name = +t1.+t1.t2  I.N.C.R.E.A.S.E
Name = +t3.+t3.t4 No new state computed
Name = (+t1.(+t4.t2+t2)+t4.+t1.t2++t1.t2)  I.N.C.R.E.A.S.E
Name = (+t4.+t1++t4.t1) No new state computed
Name = (+t4.(+t4.t2+t2)+(+t4.t2+t2))  I.N.C.R.E.A.S.E
increase = 1
**********************
Random choose
Name = (+t4.(+t4.t2+t2)+(+t4.t2+t2))  OK !
Now we have a representation of size = 86
Minimization in Progress
Name = (+t4.+t1++t4.t1) No new state computed
Name = +t3.+t3.t4 No new state computed
Name = (+t4.+t2.t3+t2.+t3++t2.t3)  I.N.C.R.E.A.S.E
Name = ++t1 No new state computed
Name = ++t3  I.N.C.R.E.A.S.E
Name = +t1.+t1.t2 No new state computed
Name = ++t4 No new state computed
Name = +t3.+t4.t1 No new state computed
Name = (+t3.+t4++t3.t4) No new state computed
Name = +t1.+t2.t3  I.N.C.R.E.A.S.E
Name = +t3.(+t4.t2+t2) No new state computed
Name = (+t1.(+t4.t2+t2)+t4.+t1.t2++t1.t2) No new state computed
increase = 1
**********************
Random choose
Name = +t1.+t2.t3  OK !
Now we have a representation of size = 88
Minimization in Progress
Name = +t1.+t1.t2 No new state computed
Name = (+t4.+t1++t4.t1) No new state computed
Name = (+t1.(+t4.t2+t2)+t4.+t1.t2++t1.t2) No new state computed
Name = ++t1 No new state computed
Name = ++t4 No new state computed
Name = (+t4.+t2.t3+t2.+t3++t2.t3) No new state computed
Name = (+t3.+t4++t3.t4) No new state computed
Name = +t3.(+t4.t2+t2) No new state computed
Name = +t3.+t3.t4 No new state computed
Name = ++t3  I.N.C.R.E.A.S.E
Name = +t3.+t4.t1 No new state computed
Name = (+t4.(+t4.t2+t2)+(+t4.t2+t2)) No new state computed
increase = 1
**********************
Random choose
Name = ++t3  OK !
Now we have a representation of size = 144
Minimization in Progress
Name = +t3.+t4.t1  I.N.C.R.E.A.S.E
Name = ++t1 No new state computed
Name = ++t4  I.N.C.R.E.A.S.E
Name = (+t3.+t4++t3.t4)  I.N.C.R.E.A.S.E
Name = (+t4.+t2.t3+t2.+t3++t2.t3) No new state computed
Name = +t3.(+t4.t2+t2) No new state computed
Name = +t1.+t1.t2 No new state computed
Name = +t1.+t2.t3 No new state computed
Name = (+t1.(+t4.t2+t2)+t4.+t1.t2++t1.t2)  I.N.C.R.E.A.S.E
Name = +t3.+t3.t4  I.N.C.R.E.A.S.E
Name = (+t4.+t1++t4.t1)  I.N.C.R.E.A.S.E
Name = (+t4.(+t4.t2+t2)+(+t4.t2+t2)) No new state computed
increase = 1
**********************
Random choose
Name = (+t4.+t1++t4.t1)  OK !
Now we have a representation of size = 155
Minimization in Progress
Name = +t3.+t4.t1 No new state computed
Name = (+t4.+t2.t3+t2.+t3++t2.t3)  OK !
Now we have a representation of size = 155
Name = (+t3.+t4++t3.t4)  I.N.C.R.E.A.S.E
Name = +t3.(+t4.t2+t2) No new state computed
Name = ++t4  I.N.C.R.E.A.S.E
Name = +t1.+t2.t3  I.N.C.R.E.A.S.E
Name = ++t1  I.N.C.R.E.A.S.E
Name = (+t1.(+t4.t2+t2)+t4.+t1.t2++t1.t2)  OK !
Now we have a representation of size = 155
Name = +t1.+t2.t3  OK !
Now we have a representation of size = 154
Name = (+t3.+t4++t3.t4)  I.N.C.R.E.A.S.E
Name = +t3.+t4.t1 No new state computed
Name = ++t1  I.N.C.R.E.A.S.E
Name = (+t4.+t1++t4.t1) No new state computed
Name = ++t4  I.N.C.R.E.A.S.E
Name = (+t4.+t2.t3+t2.+t3++t2.t3) No new state computed
Name = ++t3  I.N.C.R.E.A.S.E
Name = (+t4.(+t4.t2+t2)+(+t4.t2+t2)) No new state computed
Name = +t3.(+t4.t2+t2) No new state computed
Name = +t3.+t3.t4  I.N.C.R.E.A.S.E
Name = +t1.+t1.t2  I.N.C.R.E.A.S.E
Name = (+t1.(+t4.t2+t2)+t4.+t1.t2++t1.t2) No new state computed
increase = 1
**********************
Random choose
Name = +t1.+t1.t2  OK !
Now we have a representation of size = 157
Minimization in Progress
Name = ++t4  I.N.C.R.E.A.S.E
Name = (+t3.+t4++t3.t4)  I.N.C.R.E.A.S.E
Name = (+t4.(+t4.t2+t2)+(+t4.t2+t2)) No new state computed
Name = (+t4.+t2.t3+t2.+t3++t2.t3) No new state computed
Name = +t3.+t3.t4  I.N.C.R.E.A.S.E
Name = ++t1  I.N.C.R.E.A.S.E
Name = (+t1.(+t4.t2+t2)+t4.+t1.t2++t1.t2) No new state computed
Name = (+t4.+t1++t4.t1) No new state computed
Name = +t3.(+t4.t2+t2) No new state computed
Name = ++t3  I.N.C.R.E.A.S.E
Name = +t3.+t4.t1 No new state computed
Name = +t1.+t2.t3 No new state computed
increase = 1
**********************
Random choose
Name = ++t3  OK !
Now we have a representation of size = 159
Minimization in Progress
Name = (+t1.(+t4.t2+t2)+t4.+t1.t2++t1.t2)  I.N.C.R.E.A.S.E
Name = +t3.+t3.t4  I.N.C.R.E.A.S.E
Name = (+t3.+t4++t3.t4)  I.N.C.R.E.A.S.E
Name = +t1.+t1.t2 No new state computed
Name = ++t4  I.N.C.R.E.A.S.E
Name = (+t4.(+t4.t2+t2)+(+t4.t2+t2)) No new state computed
Name = +t1.+t2.t3 No new state computed
Name = ++t1  I.N.C.R.E.A.S.E
Name = (+t4.+t1++t4.t1)  I.N.C.R.E.A.S.E
Name = +t3.(+t4.t2+t2) No new state computed
Name = +t3.+t4.t1  I.N.C.R.E.A.S.E
Name = (+t4.+t2.t3+t2.+t3++t2.t3) No new state computed
increase = 1
**********************
Random choose
Name = +t3.+t4.t1  OK !
Now we have a representation of size = 174
Minimization in Progress
Name = ++t4  I.N.C.R.E.A.S.E
Name = +t3.+t3.t4  I.N.C.R.E.A.S.E
Name = (+t4.+t2.t3+t2.+t3++t2.t3)  I.N.C.R.E.A.S.E
Name = (+t4.+t1++t4.t1) No new state computed
Name = +t3.(+t4.t2+t2) No new state computed
Name = ++t1  I.N.C.R.E.A.S.E
Name = (+t3.+t4++t3.t4)  I.N.C.R.E.A.S.E
Name = +t1.+t1.t2  I.N.C.R.E.A.S.E
Name = +t1.+t2.t3  I.N.C.R.E.A.S.E
Name = (+t4.(+t4.t2+t2)+(+t4.t2+t2))  OK !
Now we have a representation of size = 174
Name = ++t3  I.N.C.R.E.A.S.E
Name = (+t4.+t2.t3+t2.+t3++t2.t3)  I.N.C.R.E.A.S.E
Name = +t1.+t2.t3  I.N.C.R.E.A.S.E
Name = +t3.(+t4.t2+t2) No new state computed
Name = (+t4.+t1++t4.t1) No new state computed
Name = +t1.+t1.t2  I.N.C.R.E.A.S.E
Name = +t3.+t4.t1 No new state computed
Name = ++t4  I.N.C.R.E.A.S.E
Name = +t3.+t3.t4  I.N.C.R.E.A.S.E
Name = (+t1.(+t4.t2+t2)+t4.+t1.t2++t1.t2)  I.N.C.R.E.A.S.E
Name = ++t1  I.N.C.R.E.A.S.E
Name = (+t3.+t4++t3.t4)  I.N.C.R.E.A.S.E
increase = 1
**********************
Random choose
Name = (+t3.+t4++t3.t4)  OK !
Now we have a representation of size = 179
Minimization in Progress
Name = +t1.+t2.t3  I.N.C.R.E.A.S.E
Name = +t3.+t4.t1 No new state computed
Name = +t3.(+t4.t2+t2) No new state computed
Name = (+t4.(+t4.t2+t2)+(+t4.t2+t2)) No new state computed
Name = ++t4 No new state computed
Name = ++t1  I.N.C.R.E.A.S.E
Name = ++t3  I.N.C.R.E.A.S.E
Name = (+t4.+t1++t4.t1) No new state computed
Name = +t1.+t1.t2  I.N.C.R.E.A.S.E
Name = +t3.+t3.t4 No new state computed
Name = (+t1.(+t4.t2+t2)+t4.+t1.t2++t1.t2)  I.N.C.R.E.A.S.E
Name = (+t4.+t2.t3+t2.+t3++t2.t3)  I.N.C.R.E.A.S.E
increase = 1
**********************
Random choose
Name = (+t4.+t2.t3+t2.+t3++t2.t3)  OK !
Now we have a representation of size = 180
Minimization in Progress
Name = +t3.(+t4.t2+t2) No new state computed
Name = (+t4.(+t4.t2+t2)+(+t4.t2+t2)) No new state computed
Name = ++t3  I.N.C.R.E.A.S.E
Name = (+t1.(+t4.t2+t2)+t4.+t1.t2++t1.t2)  OK !
Now we have a representation of size = 179
Name = +t3.+t4.t1 No new state computed
Name = (+t4.(+t4.t2+t2)+(+t4.t2+t2)) No new state computed
Name = (+t3.+t4++t3.t4) No new state computed
Name = +t3.+t3.t4 No new state computed
Name = (+t4.+t2.t3+t2.+t3++t2.t3) No new state computed
Name = +t1.+t1.t2  I.N.C.R.E.A.S.E
Name = ++t3  I.N.C.R.E.A.S.E
Name = +t1.+t2.t3  OK !
Now we have a representation of size = 178
Name = +t1.+t1.t2  I.N.C.R.E.A.S.E
Name = (+t4.+t1++t4.t1) No new state computed
Name = +t3.+t3.t4 No new state computed
Name = (+t1.(+t4.t2+t2)+t4.+t1.t2++t1.t2) No new state computed
Name = +t3.+t4.t1 No new state computed
Name = (+t4.(+t4.t2+t2)+(+t4.t2+t2)) No new state computed
Name = (+t4.+t2.t3+t2.+t3++t2.t3) No new state computed
Name = (+t3.+t4++t3.t4) No new state computed
Name = +t3.(+t4.t2+t2) No new state computed
Name = ++t4 No new state computed
Name = ++t3  I.N.C.R.E.A.S.E
Name = ++t1  I.N.C.R.E.A.S.E
increase = 1
**********************
Random choose
Name = ++t1  OK !
Now we have a representation of size = 238
Minimization in Progress
Name = (+t1.(+t4.t2+t2)+t4.+t1.t2++t1.t2)  I.N.C.R.E.A.S.E
Name = +t3.(+t4.t2+t2) No new state computed
Name = (+t4.(+t4.t2+t2)+(+t4.t2+t2))  I.N.C.R.E.A.S.E
Name = ++t4 No new state computed
Name = ++t3  I.N.C.R.E.A.S.E
Name = (+t4.+t1++t4.t1) No new state computed
Name = +t3.+t3.t4 No new state computed
Name = +t3.+t4.t1 No new state computed
Name = (+t4.+t2.t3+t2.+t3++t2.t3)  I.N.C.R.E.A.S.E
Name = +t1.+t2.t3  I.N.C.R.E.A.S.E
Name = (+t3.+t4++t3.t4) No new state computed
Name = +t1.+t1.t2  I.N.C.R.E.A.S.E
increase = 1
**********************
Random choose
Name = +t1.+t1.t2  OK !
Now we have a representation of size = 258
Minimization in Progress
Name = +t3.+t3.t4 No new state computed
Name = (+t4.(+t4.t2+t2)+(+t4.t2+t2)) No new state computed
Name = +t3.(+t4.t2+t2) No new state computed
Name = +t3.+t4.t1 No new state computed
Name = (+t3.+t4++t3.t4) No new state computed
Name = (+t4.+t1++t4.t1) No new state computed
Name = (+t1.(+t4.t2+t2)+t4.+t1.t2++t1.t2) No new state computed
Name = ++t4 No new state computed
Name = (+t4.+t2.t3+t2.+t3++t2.t3)  OK !
Now we have a representation of size = 254
Name = ++t3  I.N.C.R.E.A.S.E
Name = +t1.+t2.t3 No new state computed
Name = +t3.+t4.t1 No new state computed
Name = (+t3.+t4++t3.t4) No new state computed
Name = +t3.+t3.t4 No new state computed
Name = +t1.+t1.t2 No new state computed
Name = (+t4.(+t4.t2+t2)+(+t4.t2+t2)) No new state computed
Name = ++t1 No new state computed
Name = ++t4 No new state computed
Name = +t3.(+t4.t2+t2) No new state computed
Name = (+t1.(+t4.t2+t2)+t4.+t1.t2++t1.t2) No new state computed
Name = (+t4.+t1++t4.t1) No new state computed
increase = 1
**********************
Random choose
Name = ++t3  OK !
Now we have a representation of size = 321
Minimization in Progress
Name = +t3.+t3.t4  I.N.C.R.E.A.S.E
Name = (+t4.+t2.t3+t2.+t3++t2.t3) No new state computed
Name = +t1.+t1.t2 No new state computed
Name = +t3.(+t4.t2+t2) No new state computed
Name = +t3.+t4.t1  I.N.C.R.E.A.S.E
Name = +t1.+t2.t3 No new state computed
Name = (+t3.+t4++t3.t4)  I.N.C.R.E.A.S.E
Name = (+t4.+t1++t4.t1)  I.N.C.R.E.A.S.E
Name = (+t4.(+t4.t2+t2)+(+t4.t2+t2)) No new state computed
Name = ++t4  I.N.C.R.E.A.S.E
Name = ++t1 No new state computed
Name = (+t1.(+t4.t2+t2)+t4.+t1.t2++t1.t2)  I.N.C.R.E.A.S.E
increase = 1
**********************
Random choose
Name = (+t1.(+t4.t2+t2)+t4.+t1.t2++t1.t2)  OK !
Now we have a representation of size = 323
Minimization in Progress
Name = +t3.+t3.t4  I.N.C.R.E.A.S.E
Name = (+t3.+t4++t3.t4)  I.N.C.R.E.A.S.E
Name = +t3.+t4.t1  I.N.C.R.E.A.S.E
Name = (+t4.+t1++t4.t1)  I.N.C.R.E.A.S.E
Name = (+t4.+t2.t3+t2.+t3++t2.t3) No new state computed
Name = ++t1 No new state computed
Name = ++t3  I.N.C.R.E.A.S.E
Name = +t1.+t1.t2 No new state computed
Name = +t3.(+t4.t2+t2) No new state computed
Name = (+t4.(+t4.t2+t2)+(+t4.t2+t2)) No new state computed
Name = +t1.+t2.t3 No new state computed
Name = ++t4  I.N.C.R.E.A.S.E
increase = 1
**********************
Random choose
Name = ++t4  OK !
Now we have a representation of size = 338
Minimization in Progress
Name = ++t1  I.N.C.R.E.A.S.E
Name = ++t3  I.N.C.R.E.A.S.E
Name = (+t3.+t4++t3.t4) No new state computed
Name = +t1.+t2.t3  OK !
Now we have a representation of size = 338
Name = +t3.(+t4.t2+t2) No new state computed
Name = (+t4.+t1++t4.t1)  OK !
Now we have a representation of size = 333
Name = +t1.+t2.t3  I.N.C.R.E.A.S.E
Name = +t3.+t4.t1 No new state computed
Name = (+t4.(+t4.t2+t2)+(+t4.t2+t2)) No new state computed
Name = ++t3  I.N.C.R.E.A.S.E
Name = +t1.+t1.t2  I.N.C.R.E.A.S.E
Name = +t3.(+t4.t2+t2) No new state computed
Name = (+t4.+t2.t3+t2.+t3++t2.t3) No new state computed
Name = (+t3.+t4++t3.t4) No new state computed
Name = ++t1  I.N.C.R.E.A.S.E
Name = ++t4 No new state computed
Name = (+t1.(+t4.t2+t2)+t4.+t1.t2++t1.t2)  OK !
Now we have a representation of size = 333
Name = +t3.+t3.t4 No new state computed
Name = +t1.+t2.t3  OK !
Now we have a representation of size = 332
Name = (+t4.(+t4.t2+t2)+(+t4.t2+t2)) No new state computed
Name = (+t4.+t1++t4.t1) No new state computed
Name = +t1.+t1.t2  I.N.C.R.E.A.S.E
Name = +t3.+t4.t1 No new state computed
Name = (+t3.+t4++t3.t4) No new state computed
Name = (+t4.+t2.t3+t2.+t3++t2.t3) No new state computed
Name = (+t1.(+t4.t2+t2)+t4.+t1.t2++t1.t2) No new state computed
Name = +t3.+t3.t4 No new state computed
Name = ++t3  I.N.C.R.E.A.S.E
Name = +t3.(+t4.t2+t2) No new state computed
Name = ++t1  I.N.C.R.E.A.S.E
Name = ++t4 No new state computed
increase = 1
**********************
Random choose
Name = ++t1  OK !
Now we have a representation of size = 358
Minimization in Progress
Name = (+t1.(+t4.t2+t2)+t4.+t1.t2++t1.t2)  I.N.C.R.E.A.S.E
Name = +t3.+t4.t1 No new state computed
Name = (+t3.+t4++t3.t4) No new state computed
Name = (+t4.+t1++t4.t1) No new state computed
Name = ++t4 No new state computed
Name = ++t3  I.N.C.R.E.A.S.E
Name = +t3.(+t4.t2+t2) No new state computed
Name = (+t4.+t2.t3+t2.+t3++t2.t3)  I.N.C.R.E.A.S.E
Name = +t1.+t1.t2  I.N.C.R.E.A.S.E
Name = +t1.+t2.t3  I.N.C.R.E.A.S.E
Name = +t3.+t3.t4 No new state computed
Name = (+t4.(+t4.t2+t2)+(+t4.t2+t2))  I.N.C.R.E.A.S.E
increase = 1
**********************
Random choose
Name = (+t4.(+t4.t2+t2)+(+t4.t2+t2))  OK !
Now we have a representation of size = 376
Minimization in Progress
Name = (+t4.+t1++t4.t1) No new state computed
Name = (+t1.(+t4.t2+t2)+t4.+t1.t2++t1.t2) No new state computed
Name = +t3.+t4.t1 No new state computed
Name = +t1.+t2.t3  OK !
Now we have a representation of size = 367
Name = +t3.(+t4.t2+t2) No new state computed
Name = ++t3  I.N.C.R.E.A.S.E
Name = (+t4.+t1++t4.t1) No new state computed
Name = +t1.+t1.t2 No new state computed
Name = ++t1 No new state computed
Name = +t3.+t4.t1 No new state computed
Name = (+t3.+t4++t3.t4) No new state computed
Name = (+t4.(+t4.t2+t2)+(+t4.t2+t2)) No new state computed
Name = ++t4 No new state computed
Name = (+t1.(+t4.t2+t2)+t4.+t1.t2++t1.t2) No new state computed
Name = +t3.+t3.t4 No new state computed
Name = (+t4.+t2.t3+t2.+t3++t2.t3) No new state computed
increase = 1
**********************
Random choose
Name = ++t3  OK !
Now we have a representation of size = 424
Minimization in Progress
Name = +t3.+t4.t1  I.N.C.R.E.A.S.E
Name = +t1.+t2.t3 No new state computed
Name = +t3.+t3.t4  I.N.C.R.E.A.S.E
Name = (+t3.+t4++t3.t4)  I.N.C.R.E.A.S.E
Name = (+t4.+t2.t3+t2.+t3++t2.t3) No new state computed
Name = +t1.+t1.t2 No new state computed
Name = ++t4  I.N.C.R.E.A.S.E
Name = +t3.(+t4.t2+t2) No new state computed
Name = ++t1 No new state computed
Name = (+t4.+t1++t4.t1)  I.N.C.R.E.A.S.E
Name = (+t4.(+t4.t2+t2)+(+t4.t2+t2)) No new state computed
Name = (+t1.(+t4.t2+t2)+t4.+t1.t2++t1.t2)  I.N.C.R.E.A.S.E
increase = 1
**********************
Random choose
Name = (+t1.(+t4.t2+t2)+t4.+t1.t2++t1.t2)  OK !
Now we have a representation of size = 430
Minimization in Progress
Name = ++t1 No new state computed
Name = (+t4.+t1++t4.t1)  I.N.C.R.E.A.S.E
Name = (+t3.+t4++t3.t4)  I.N.C.R.E.A.S.E
Name = (+t4.(+t4.t2+t2)+(+t4.t2+t2)) No new state computed
Name = +t1.+t2.t3 No new state computed
Name = ++t4  I.N.C.R.E.A.S.E
Name = ++t3  I.N.C.R.E.A.S.E
Name = +t1.+t1.t2 No new state computed
Name = +t3.+t4.t1  I.N.C.R.E.A.S.E
Name = (+t4.+t2.t3+t2.+t3++t2.t3) No new state computed
Name = +t3.(+t4.t2+t2) No new state computed
Name = +t3.+t3.t4  I.N.C.R.E.A.S.E
increase = 1
**********************
Random choose
Name = +t3.+t3.t4  OK !
Now we have a representation of size = 450
Minimization in Progress
Name = (+t3.+t4++t3.t4) No new state computed
Name = +t3.(+t4.t2+t2) No new state computed
Name = ++t1  I.N.C.R.E.A.S.E
Name = +t1.+t1.t2  I.N.C.R.E.A.S.E
Name = (+t4.+t2.t3+t2.+t3++t2.t3) No new state computed
Name = +t1.+t2.t3  OK !
Now we have a representation of size = 449
Name = ++t3  I.N.C.R.E.A.S.E
Name = (+t3.+t4++t3.t4) No new state computed
Name = +t3.+t3.t4 No new state computed
Name = (+t4.+t2.t3+t2.+t3++t2.t3) No new state computed
Name = +t3.+t4.t1  OK !
Now we have a representation of size = 443
Name = (+t3.+t4++t3.t4) No new state computed
Name = ++t3  I.N.C.R.E.A.S.E
Name = +t3.+t3.t4 No new state computed
Name = ++t1  I.N.C.R.E.A.S.E
Name = (+t1.(+t4.t2+t2)+t4.+t1.t2++t1.t2)  OK !
Now we have a representation of size = 442
Name = (+t3.+t4++t3.t4) No new state computed
Name = +t3.+t3.t4 No new state computed
Name = +t1.+t1.t2  I.N.C.R.E.A.S.E
Name = ++t1  I.N.C.R.E.A.S.E
Name = (+t4.(+t4.t2+t2)+(+t4.t2+t2)) No new state computed
Name = +t1.+t2.t3  OK !
Now we have a representation of size = 441
Name = +t1.+t1.t2  I.N.C.R.E.A.S.E
Name = +t3.+t3.t4 No new state computed
Name = (+t4.+t1++t4.t1) No new state computed
Name = +t3.+t4.t1 No new state computed
Name = ++t4 No new state computed
Name = (+t4.(+t4.t2+t2)+(+t4.t2+t2)) No new state computed
Name = (+t4.+t2.t3+t2.+t3++t2.t3) No new state computed
Name = ++t3  I.N.C.R.E.A.S.E
Name = (+t1.(+t4.t2+t2)+t4.+t1.t2++t1.t2) No new state computed
Name = (+t3.+t4++t3.t4) No new state computed
Name = ++t1  I.N.C.R.E.A.S.E
Name = +t3.(+t4.t2+t2) No new state computed
increase = 1
**********************
Random choose
Name = ++t1  OK !
Now we have a representation of size = 480
Minimization in Progress
Name = +t3.(+t4.t2+t2) No new state computed
Name = +t1.+t2.t3  I.N.C.R.E.A.S.E
Name = +t3.+t4.t1 No new state computed
Name = (+t3.+t4++t3.t4) No new state computed
Name = ++t4 No new state computed
Name = +t1.+t1.t2  I.N.C.R.E.A.S.E
Name = (+t4.+t2.t3+t2.+t3++t2.t3)  I.N.C.R.E.A.S.E
Name = ++t3  I.N.C.R.E.A.S.E
Name = (+t1.(+t4.t2+t2)+t4.+t1.t2++t1.t2)  I.N.C.R.E.A.S.E
Name = +t3.+t3.t4 No new state computed
Name = (+t4.+t1++t4.t1) No new state computed
Name = (+t4.(+t4.t2+t2)+(+t4.t2+t2))  I.N.C.R.E.A.S.E
increase = 1
**********************
Random choose
Name = (+t4.(+t4.t2+t2)+(+t4.t2+t2))  OK !
Now we have a representation of size = 500
Minimization in Progress
Name = +t1.+t2.t3  OK !
Now we have a representation of size = 493
Name = +t3.+t3.t4 No new state computed
Name = ++t4 No new state computed
Name = +t3.(+t4.t2+t2) No new state computed
Name = (+t4.(+t4.t2+t2)+(+t4.t2+t2)) No new state computed
Name = +t3.+t4.t1 No new state computed
Name = +t1.+t1.t2 No new state computed
Name = (+t1.(+t4.t2+t2)+t4.+t1.t2++t1.t2) No new state computed
Name = ++t1 No new state computed
Name = (+t4.+t2.t3+t2.+t3++t2.t3) No new state computed
Name = ++t3  I.N.C.R.E.A.S.E
Name = (+t4.+t1++t4.t1) No new state computed
Name = (+t3.+t4++t3.t4) No new state computed
increase = 1
**********************
Random choose
Name = ++t3  OK !
Now we have a representation of size = 528
Minimization in Progress
Name = +t1.+t2.t3 No new state computed
Name = (+t4.+t1++t4.t1)  I.N.C.R.E.A.S.E
Name = +t3.+t3.t4  I.N.C.R.E.A.S.E
Name = (+t1.(+t4.t2+t2)+t4.+t1.t2++t1.t2)  I.N.C.R.E.A.S.E
Name = +t1.+t1.t2 No new state computed
Name = (+t4.+t2.t3+t2.+t3++t2.t3) No new state computed
Name = ++t4  I.N.C.R.E.A.S.E
Name = +t3.+t4.t1  I.N.C.R.E.A.S.E
Name = (+t4.(+t4.t2+t2)+(+t4.t2+t2)) No new state computed
Name = ++t1 No new state computed
Name = +t3.(+t4.t2+t2) No new state computed
Name = (+t3.+t4++t3.t4)  I.N.C.R.E.A.S.E
increase = 1
**********************
Random choose
Name = (+t3.+t4++t3.t4)  OK !
Now we have a representation of size = 547
Minimization in Progress
Name = ++t4 No new state computed
Name = +t3.+t3.t4 No new state computed
Name = +t3.(+t4.t2+t2) No new state computed
Name = ++t3 No new state computed
Name = +t1.+t1.t2  I.N.C.R.E.A.S.E
Name = (+t4.+t1++t4.t1)  OK !
Now we have a representation of size = 544
Name = +t1.+t2.t3  I.N.C.R.E.A.S.E
Name = (+t4.(+t4.t2+t2)+(+t4.t2+t2))  I.N.C.R.E.A.S.E
Name = +t3.+t4.t1 No new state computed
Name = +t1.+t1.t2  I.N.C.R.E.A.S.E
Name = (+t3.+t4++t3.t4) No new state computed
Name = ++t4 No new state computed
Name = ++t3 No new state computed
Name = ++t1  I.N.C.R.E.A.S.E
Name = +t3.(+t4.t2+t2) No new state computed
Name = (+t1.(+t4.t2+t2)+t4.+t1.t2++t1.t2)  I.N.C.R.E.A.S.E
Name = (+t4.+t2.t3+t2.+t3++t2.t3)  I.N.C.R.E.A.S.E
Name = +t3.+t3.t4 No new state computed
increase = 1
**********************
Random choose
Name = (+t4.+t2.t3+t2.+t3++t2.t3)  OK !
Now we have a representation of size = 546
Minimization in Progress
Name = (+t3.+t4++t3.t4) No new state computed
Name = (+t4.(+t4.t2+t2)+(+t4.t2+t2))  OK !
Now we have a representation of size = 545
Name = +t3.(+t4.t2+t2) No new state computed
Name = +t3.+t4.t1 No new state computed
Name = +t1.+t1.t2  I.N.C.R.E.A.S.E
Name = (+t3.+t4++t3.t4) No new state computed
Name = ++t3  I.N.C.R.E.A.S.E
Name = (+t1.(+t4.t2+t2)+t4.+t1.t2++t1.t2)  OK !
Now we have a representation of size = 545
Name = ++t4 No new state computed
Name = +t1.+t2.t3  OK !
Now we have a representation of size = 544
Name = (+t3.+t4++t3.t4) No new state computed
Name = +t1.+t1.t2  I.N.C.R.E.A.S.E
Name = (+t1.(+t4.t2+t2)+t4.+t1.t2++t1.t2) No new state computed
Name = ++t3  I.N.C.R.E.A.S.E
Name = (+t4.+t2.t3+t2.+t3++t2.t3) No new state computed
Name = ++t4 No new state computed
Name = (+t4.(+t4.t2+t2)+(+t4.t2+t2)) No new state computed
Name = +t3.+t3.t4 No new state computed
Name = +t3.(+t4.t2+t2) No new state computed
Name = ++t1  I.N.C.R.E.A.S.E
Name = +t3.+t4.t1 No new state computed
Name = (+t4.+t1++t4.t1) No new state computed
increase = 1
**********************
Random choose
Name = ++t1  OK !
Now we have a representation of size = 565
Minimization in Progress
Name = +t3.(+t4.t2+t2) No new state computed
Name = (+t4.+t1++t4.t1) No new state computed
Name = +t1.+t1.t2  I.N.C.R.E.A.S.E
Name = (+t4.+t2.t3+t2.+t3++t2.t3)  I.N.C.R.E.A.S.E
Name = (+t4.(+t4.t2+t2)+(+t4.t2+t2))  I.N.C.R.E.A.S.E
Name = +t3.+t4.t1 No new state computed
Name = (+t1.(+t4.t2+t2)+t4.+t1.t2++t1.t2)  I.N.C.R.E.A.S.E
Name = (+t3.+t4++t3.t4) No new state computed
Name = ++t4 No new state computed
Name = +t3.+t3.t4 No new state computed
Name = +t1.+t2.t3  I.N.C.R.E.A.S.E
Name = ++t3  I.N.C.R.E.A.S.E
increase = 1
**********************
Random choose
Name = ++t3  OK !
Now we have a representation of size = 590
Minimization in Progress
Name = (+t4.+t1++t4.t1)  I.N.C.R.E.A.S.E
Name = (+t1.(+t4.t2+t2)+t4.+t1.t2++t1.t2)  I.N.C.R.E.A.S.E
Name = +t1.+t1.t2  I.N.C.R.E.A.S.E
Name = ++t4  I.N.C.R.E.A.S.E
Name = (+t4.+t2.t3+t2.+t3++t2.t3)  I.N.C.R.E.A.S.E
Name = ++t1 No new state computed
Name = +t3.+t3.t4  I.N.C.R.E.A.S.E
Name = +t3.(+t4.t2+t2) No new state computed
Name = (+t3.+t4++t3.t4)  I.N.C.R.E.A.S.E
Name = (+t4.(+t4.t2+t2)+(+t4.t2+t2))  I.N.C.R.E.A.S.E
Name = +t3.+t4.t1  I.N.C.R.E.A.S.E
Name = +t1.+t2.t3  I.N.C.R.E.A.S.E
increase = 1
**********************
Random choose
Name = +t1.+t2.t3  OK !
Now we have a representation of size = 610
Minimization in Progress
Name = (+t1.(+t4.t2+t2)+t4.+t1.t2++t1.t2)  OK !
Now we have a representation of size = 603
Name = +t3.(+t4.t2+t2) No new state computed
Name = (+t4.+t2.t3+t2.+t3++t2.t3) No new state computed
Name = ++t3  I.N.C.R.E.A.S.E
Name = +t1.+t2.t3 No new state computed
Name = ++t1 No new state computed
Name = ++t4  I.N.C.R.E.A.S.E
Name = +t3.+t4.t1  I.N.C.R.E.A.S.E
Name = (+t3.+t4++t3.t4)  I.N.C.R.E.A.S.E
Name = +t3.+t3.t4  I.N.C.R.E.A.S.E
Name = (+t4.+t1++t4.t1)  I.N.C.R.E.A.S.E
Name = (+t4.(+t4.t2+t2)+(+t4.t2+t2)) No new state computed
Name = +t1.+t1.t2 No new state computed
increase = 1
**********************
Random choose
Name = (+t4.+t1++t4.t1)  OK !
Now we have a representation of size = 616
Minimization in Progress
Name = +t1.+t2.t3 No new state computed
Name = (+t4.(+t4.t2+t2)+(+t4.t2+t2)) No new state computed
Name = +t3.+t3.t4  OK !
Now we have a representation of size = 612
Name = +t3.+t4.t1 No new state computed
Name = +t1.+t2.t3 No new state computed
Name = +t1.+t1.t2 No new state computed
Name = +t3.(+t4.t2+t2) No new state computed
Name = (+t4.+t2.t3+t2.+t3++t2.t3) No new state computed
Name = (+t4.+t1++t4.t1) No new state computed
Name = (+t3.+t4++t3.t4) No new state computed
Name = ++t4 No new state computed
Name = (+t4.(+t4.t2+t2)+(+t4.t2+t2)) No new state computed
Name = (+t1.(+t4.t2+t2)+t4.+t1.t2++t1.t2) No new state computed
Name = ++t3  I.N.C.R.E.A.S.E
Name = ++t1  I.N.C.R.E.A.S.E
increase = 1
**********************
Random choose
Name = ++t1  OK !
Now we have a representation of size = 627
Minimization in Progress
Name = +t1.+t2.t3  I.N.C.R.E.A.S.E
Name = ++t3  I.N.C.R.E.A.S.E
Name = ++t4 No new state computed
Name = (+t3.+t4++t3.t4) No new state computed
Name = (+t4.(+t4.t2+t2)+(+t4.t2+t2))  I.N.C.R.E.A.S.E
Name = +t3.+t4.t1 No new state computed
Name = (+t4.+t2.t3+t2.+t3++t2.t3)  I.N.C.R.E.A.S.E
Name = (+t1.(+t4.t2+t2)+t4.+t1.t2++t1.t2)  I.N.C.R.E.A.S.E
Name = +t1.+t1.t2  I.N.C.R.E.A.S.E
Name = +t3.+t3.t4 No new state computed
Name = +t3.(+t4.t2+t2) No new state computed
Name = (+t4.+t1++t4.t1) No new state computed
increase = 1
**********************
Random choose
Name = +t1.+t1.t2  OK !
Now we have a representation of size = 636
Minimization in Progress
Name = (+t1.(+t4.t2+t2)+t4.+t1.t2++t1.t2) No new state computed
Name = (+t3.+t4++t3.t4) No new state computed
Name = ++t1 No new state computed
Name = +t3.+t4.t1 No new state computed
Name = ++t4 No new state computed
Name = +t3.(+t4.t2+t2) No new state computed
Name = ++t3  I.N.C.R.E.A.S.E
Name = +t3.+t3.t4 No new state computed
Name = (+t4.(+t4.t2+t2)+(+t4.t2+t2)) No new state computed
Name = (+t4.+t2.t3+t2.+t3++t2.t3)  OK !
Now we have a representation of size = 633
Name = (+t3.+t4++t3.t4) No new state computed
Name = +t1.+t2.t3 No new state computed
Name = ++t4 No new state computed
Name = +t3.+t3.t4 No new state computed
Name = (+t4.+t1++t4.t1) No new state computed
Name = ++t3  I.N.C.R.E.A.S.E
Name = +t3.+t4.t1 No new state computed
Name = ++t1 No new state computed
Name = +t1.+t1.t2 No new state computed
Name = (+t1.(+t4.t2+t2)+t4.+t1.t2++t1.t2) No new state computed
Name = (+t4.(+t4.t2+t2)+(+t4.t2+t2)) No new state computed
Name = +t3.(+t4.t2+t2) No new state computed
increase = 1
**********************
Random choose
Name = ++t3  OK !
Now we have a representation of size = 667
Minimization in Progress
Name = ++t4  I.N.C.R.E.A.S.E
Name = +t3.+t4.t1  I.N.C.R.E.A.S.E
Name = (+t1.(+t4.t2+t2)+t4.+t1.t2++t1.t2)  I.N.C.R.E.A.S.E
Name = +t1.+t2.t3 No new state computed
Name = (+t3.+t4++t3.t4)  I.N.C.R.E.A.S.E
Name = +t3.+t3.t4  I.N.C.R.E.A.S.E
Name = (+t4.+t1++t4.t1)  I.N.C.R.E.A.S.E
Name = +t1.+t1.t2 No new state computed
Name = (+t4.+t2.t3+t2.+t3++t2.t3) No new state computed
Name = +t3.(+t4.t2+t2) No new state computed
Name = (+t4.(+t4.t2+t2)+(+t4.t2+t2)) No new state computed
Name = ++t1 No new state computed
increase = 1
**********************
Random choose
Name = (+t4.+t1++t4.t1)  OK !
Now we have a representation of size = 693
Minimization in Progress
Name = +t1.+t1.t2  I.N.C.R.E.A.S.E
Name = ++t1  I.N.C.R.E.A.S.E
Name = (+t3.+t4++t3.t4)  OK !
Now we have a representation of size = 682
Name = (+t4.+t2.t3+t2.+t3++t2.t3)  I.N.C.R.E.A.S.E
Name = +t3.+t3.t4 No new state computed
Name = +t1.+t1.t2  I.N.C.R.E.A.S.E
Name = (+t4.+t1++t4.t1) No new state computed
Name = +t1.+t2.t3  I.N.C.R.E.A.S.E
Name = +t3.(+t4.t2+t2) No new state computed
Name = +t3.+t4.t1 No new state computed
Name = (+t4.(+t4.t2+t2)+(+t4.t2+t2))  I.N.C.R.E.A.S.E
Name = ++t3 No new state computed
Name = ++t4 