current set encoding is : mona
seed is : 2691
cycles of length 1
(1/12), name = r1, size = 57
(2/12), name = r2, size = 341
(3/12), name = r3, size = 110
(4/12), name = r4, size = 72
(5/12), name = r5, size = 68
(6/12), name = r6, size = 123
(7/12), name = r7, size = 53
(8/12), name = r8, size = 311
(9/12), name = r9, size = 110
(10/12), name = r10, size = 122
(11/12), name = r11, size = 128
(12/12), name = r12, size = 116
**********************
Random choose
Name = r5  No new state computed
Name = r1  OK !
Now we have a representation of size = 19
Minimization in Progress
Name = r5 No new state computed
Name = r9 No new state computed
Name = r11 No new state computed
Name = r6 No new state computed
Name = r7  OK !
Now we have a representation of size = 19
Name = r10 No new state computed
Name = r1 No new state computed
Name = r3 No new state computed
Name = r4 No new state computed
Name = r2  I.N.C.R.E.A.S.E
Name = r6 No new state computed
Name = r12 No new state computed
Name = r5 No new state computed
Name = r8  I.N.C.R.E.A.S.E
Name = r9 No new state computed
Name = r11 No new state computed
increase = 1
**********************
Random choose
Name = r8  OK !
Now we have a representation of size = 36
Minimization in Progress
Name = r1 No new state computed
Name = r6 No new state computed
Name = r7 No new state computed
Name = r4 No new state computed
Name = r9 No new state computed
Name = r5 No new state computed
Name = r12 No new state computed
Name = r10  I.N.C.R.E.A.S.E
Name = r2  OK !
Now we have a representation of size = 36
Name = r6 No new state computed
Name = r8 No new state computed
Name = r11  OK !
Now we have a representation of size = 36
Name = r3 No new state computed
Name = r1 No new state computed
Name = r6 No new state computed
Name = r5 No new state computed
Name = r7 No new state computed
Name = r10  OK !
Now we have a representation of size = 27
Name = r4 No new state computed
Name = r12 No new state computed
Name = r9 No new state computed
Name = r3 No new state computed
Name = r8 No new state computed
Name = r7 No new state computed
Name = r6 No new state computed
Name = r1 No new state computed
Name = r5 No new state computed
Name = r2 No new state computed
Name = r11 No new state computed
increase = 0
nb accelerations 6
Fix point FOUND
seed is : 2691
