current set encoding is : prestaf
seed is : 2691
cycles of length 1
(1/17), name = r2, size = 326
(2/17), name = r3, size = 314
(3/17), name = r4, size = 74
(4/17), name = r5, size = 204
(5/17), name = r6, size = 458
(6/17), name = r7, size = 1435
(7/17), name = r8, size = 5623
(8/17), name = r9, size = 1713
(9/17), name = r10, size = 6791
(10/17), name = r11, size = 124
(11/17), name = r12, size = 744
(12/17), name = r13, size = 1246
(13/17), name = r14, size = 4897
(14/17), name = r15, size = 1309
(15/17), name = r16, size = 5326
(16/17), name = r17, size = 621
(17/17), name = r18, size = 121
**********************
Random choose
Name = r8  No new state computed
Name = r3  No new state computed
Name = r18  No new state computed
Name = r14  No new state computed
Name = r7  No new state computed
Name = r10  No new state computed
Name = r12  No new state computed
Name = r13  No new state computed
Name = r2  OK !
Now we have a representation of size = 127
Minimization in Progress
Name = r7 No new state computed
Name = r8 No new state computed
Name = r4 No new state computed
Name = r13 No new state computed
Name = r5  I.N.C.R.E.A.S.E
Name = r6 No new state computed
Name = r14 No new state computed
Name = r16 No new state computed
Name = r17 No new state computed
Name = r18 No new state computed
Name = r11 No new state computed
Name = r9 No new state computed
Name = r3 No new state computed
Name = r15 No new state computed
Name = r12 No new state computed
Name = r10 No new state computed
increase = 1
**********************
Random choose
Name = r5  OK !
Now we have a representation of size = 255
Minimization in Progress
Name = r17 No new state computed
Name = r9  I.N.C.R.E.A.S.E
Name = r16 No new state computed
Name = r11  I.N.C.R.E.A.S.E
Name = r8 No new state computed
Name = r4 No new state computed
Name = r2 No new state computed
Name = r7  I.N.C.R.E.A.S.E
Name = r6 No new state computed
Name = r13 No new state computed
Name = r14 No new state computed
Name = r3 No new state computed
Name = r18 No new state computed
Name = r12 No new state computed
Name = r10  I.N.C.R.E.A.S.E
Name = r15 No new state computed
increase = 1
**********************
Random choose
Name = r10  OK !
Now we have a representation of size = 279
Minimization in Progress
Name = r8 No new state computed
Name = r9  I.N.C.R.E.A.S.E
Name = r4 No new state computed
Name = r11  I.N.C.R.E.A.S.E
Name = r13 No new state computed
Name = r17 No new state computed
Name = r6 No new state computed
Name = r7  I.N.C.R.E.A.S.E
Name = r18 No new state computed
Name = r12 No new state computed
Name = r3 No new state computed
Name = r2 No new state computed
Name = r5 No new state computed
Name = r14 No new state computed
Name = r16 No new state computed
Name = r15 No new state computed
increase = 1
**********************
Random choose
Name = r7  OK !
Now we have a representation of size = 404
Minimization in Progress
Name = r10  I.N.C.R.E.A.S.E
Name = r5 No new state computed
Name = r17 No new state computed
Name = r3 No new state computed
Name = r6 No new state computed
Name = r9  I.N.C.R.E.A.S.E
Name = r12 No new state computed
Name = r15 No new state computed
Name = r18 No new state computed
Name = r11  I.N.C.R.E.A.S.E
Name = r14 No new state computed
Name = r16 No new state computed
Name = r13 No new state computed
Name = r8 No new state computed
Name = r4 No new state computed
Name = r2 No new state computed
increase = 1
**********************
Random choose
Name = r11  OK !
Now we have a representation of size = 513
Minimization in Progress
Name = r4 No new state computed
Name = r3 No new state computed
Name = r14 No new state computed
Name = r16 No new state computed
Name = r9  I.N.C.R.E.A.S.E
Name = r5 No new state computed
Name = r8 No new state computed
Name = r17 No new state computed
Name = r10  I.N.C.R.E.A.S.E
Name = r18 No new state computed
Name = r13  I.N.C.R.E.A.S.E
Name = r15 No new state computed
Name = r2 No new state computed
Name = r12  OK !
Now we have a representation of size = 513
Name = r3 No new state computed
Name = r10  I.N.C.R.E.A.S.E
Name = r5 No new state computed
Name = r16 No new state computed
Name = r14 No new state computed
Name = r9  I.N.C.R.E.A.S.E
Name = r15 No new state computed
Name = r6 No new state computed
Name = r7 No new state computed
Name = r8 No new state computed
Name = r17 No new state computed
Name = r13  I.N.C.R.E.A.S.E
Name = r4 No new state computed
Name = r2 No new state computed
Name = r18 No new state computed
Name = r11 No new state computed
increase = 1
**********************
Random choose
Name = r13  OK !
Now we have a representation of size = 632
Minimization in Progress
Name = r6 No new state computed
Name = r18  I.N.C.R.E.A.S.E
Name = r10  I.N.C.R.E.A.S.E
Name = r4 No new state computed
Name = r12 No new state computed
Name = r5 No new state computed
Name = r7 No new state computed
Name = r17 No new state computed
Name = r15 No new state computed
Name = r8 No new state computed
Name = r16 No new state computed
Name = r9  I.N.C.R.E.A.S.E
Name = r2 No new state computed
Name = r3 No new state computed
Name = r14 No new state computed
Name = r11 No new state computed
increase = 1
**********************
Random choose
Name = r9  OK !
Now we have a representation of size = 2199
Minimization in Progress
Name = r3 No new state computed
Name = r5 No new state computed
Name = r14 No new state computed
Name = r12 No new state computed
Name = r15 No new state computed
Name = r4 No new state computed
Name = r13 No new state computed
Name = r7  OK !
Now we have a representation of size = 1242
Name = r5 No new state computed
Name = r10  I.N.C.R.E.A.S.E
Name = r9 No new state computed
Name = r12 No new state computed
Name = r15 No new state computed
Name = r3 No new state computed
Name = r17 No new state computed
Name = r16 No new state computed
Name = r13 No new state computed
Name = r8  I.N.C.R.E.A.S.E
Name = r2 No new state computed
Name = r11  I.N.C.R.E.A.S.E
Name = r14 No new state computed
Name = r4 No new state computed
Name = r18  I.N.C.R.E.A.S.E
Name = r6 No new state computed
increase = 1
**********************
Random choose
Name = r18  OK !
Now we have a representation of size = 1347
Minimization in Progress
Name = r11  I.N.C.R.E.A.S.E
Name = r14 No new state computed
Name = r12 No new state computed
Name = r17 No new state computed
Name = r6 No new state computed
Name = r10  I.N.C.R.E.A.S.E
Name = r16 No new state computed
Name = r13 No new state computed
Name = r9 No new state computed
Name = r7 No new state computed
Name = r3 No new state computed
Name = r15 No new state computed
Name = r2 No new state computed
Name = r8  I.N.C.R.E.A.S.E
Name = r5 No new state computed
Name = r4 No new state computed
increase = 1
**********************
Random choose
Name = r8  OK !
Now we have a representation of size = 5557
Minimization in Progress
Name = r2 No new state computed
Name = r16 No new state computed
Name = r17 No new state computed
Name = r10  I.N.C.R.E.A.S.E
Name = r3 No new state computed
Name = r6 No new state computed
Name = r7 No new state computed
Name = r15 No new state computed
Name = r5 No new state computed
Name = r11  I.N.C.R.E.A.S.E
Name = r18 No new state computed
Name = r9 No new state computed
Name = r13 No new state computed
Name = r14 No new state computed
Name = r12 No new state computed
Name = r4 No new state computed
increase = 1
**********************
Random choose
Name = r11  OK !
Now we have a representation of size = 6396
Minimization in Progress
Name = r2 No new state computed
Name = r6 No new state computed
Name = r12  I.N.C.R.E.A.S.E
Name = r16  I.N.C.R.E.A.S.E
Name = r17 No new state computed
Name = r9 No new state computed
Name = r10  I.N.C.R.E.A.S.E
Name = r13  I.N.C.R.E.A.S.E
Name = r14  I.N.C.R.E.A.S.E
Name = r18 No new state computed
Name = r7 No new state computed
Name = r4 No new state computed
Name = r15  I.N.C.R.E.A.S.E
Name = r3 No new state computed
Name = r5 No new state computed
Name = r8 No new state computed
increase = 1
**********************
Random choose
Name = r15  OK !
Now we have a representation of size = 7292
Minimization in Progress
Name = r8 No new state computed
Name = r18 No new state computed
Name = r6 No new state computed
Name = r9 No new state computed
Name = r5 No new state computed
Name = r12  I.N.C.R.E.A.S.E
Name = r17 No new state computed
Name = r11 No new state computed
Name = r7 No new state computed
Name = r13  I.N.C.R.E.A.S.E
Name = r4 No new state computed
Name = r2 No new state computed
Name = r14  I.N.C.R.E.A.S.E
Name = r10  I.N.C.R.E.A.S.E
Name = r16  I.N.C.R.E.A.S.E
Name = r3 No new state computed
increase = 1
**********************
Random choose
Name = r16  OK !
Now we have a representation of size = 7693
Minimization in Progress
Name = r6 No new state computed
Name = r14  I.N.C.R.E.A.S.E
Name = r3 No new state computed
Name = r17 No new state computed
Name = r8 No new state computed
Name = r12  I.N.C.R.E.A.S.E
Name = r18 No new state computed
Name = r15 No new state computed
Name = r2 No new state computed
Name = r4 No new state computed
Name = r11 No new state computed
Name = r5 No new state computed
Name = r7 No new state computed
Name = r10  I.N.C.R.E.A.S.E
Name = r9 No new state computed
Name = r13  I.N.C.R.E.A.S.E
increase = 1
**********************
Random choose
Name = r13  OK !
Now we have a representation of size = 8438
Minimization in Progress
Name = r7 No new state computed
Name = r12  I.N.C.R.E.A.S.E
Name = r16 No new state computed
Name = r10  I.N.C.R.E.A.S.E
Name = r9 No new state computed
Name = r6 No new state computed
Name = r5 No new state computed
Name = r4 No new state computed
Name = r18  I.N.C.R.E.A.S.E
Name = r17 No new state computed
Name = r3 No new state computed
Name = r11 No new state computed
Name = r14  I.N.C.R.E.A.S.E
Name = r8 No new state computed
Name = r2 No new state computed
Name = r15 No new state computed
increase = 1
**********************
Random choose
Name = r14  OK !
Now we have a representation of size = 11230
Minimization in Progress
Name = r6 No new state computed
Name = r9 No new state computed
Name = r17 No new state computed
Name = r13 No new state computed
Name = r7 No new state computed
Name = r16 No new state computed
Name = r11 No new state computed
Name = r15 No new state computed
Name = r2 No new state computed
Name = r10  I.N.C.R.E.A.S.E
Name = r12  OK !
Now we have a representation of size = 10801
Name = r15 No new state computed
Name = r4 No new state computed
Name = r8 No new state computed
Name = r14 No new state computed
Name = r17 No new state computed
Name = r3 No new state computed
Name = r9 No new state computed
Name = r18  I.N.C.R.E.A.S.E
Name = r13 No new state computed
Name = r2 No new state computed
Name = r5 No new state computed
Name = r11 No new state computed
Name = r6 No new state computed
Name = r10  I.N.C.R.E.A.S.E
Name = r7 No new state computed
Name = r16 No new state computed
increase = 1
**********************
Random choose
Name = r10  OK !
Now we have a representation of size = 14761
Minimization in Progress
Name = r2 No new state computed
Name = r13 No new state computed
Name = r3 No new state computed
Name = r14 No new state computed
Name = r17 No new state computed
Name = r8 No new state computed
Name = r4 No new state computed
Name = r18  I.N.C.R.E.A.S.E
Name = r16 No new state computed
Name = r12 No new state computed
Name = r7 No new state computed
Name = r11  I.N.C.R.E.A.S.E
Name = r9 No new state computed
Name = r15 No new state computed
Name = r6 No new state computed
Name = r5 No new state computed
increase = 1
**********************
Random choose
Name = r11  OK !
Now we have a representation of size = 15570
Minimization in Progress
Name = r14 No new state computed
Name = r4 No new state computed
Name = r13  I.N.C.R.E.A.S.E
Name = r5 No new state computed
Name = r6 No new state computed
Name = r8 No new state computed
Name = r15 No new state computed
Name = r3 No new state computed
Name = r7 No new state computed
Name = r2 No new state computed
Name = r12  I.N.C.R.E.A.S.E
Name = r17 No new state computed
Name = r10 No new state computed
Name = r18  I.N.C.R.E.A.S.E
Name = r9 No new state computed
Name = r16  I.N.C.R.E.A.S.E
increase = 1
**********************
Random choose
Name = r16  OK !
Now we have a representation of size = 16047
Minimization in Progress
Name = r6 No new state computed
Name = r9 No new state computed
Name = r7 No new state computed
Name = r17 No new state computed
Name = r2 No new state computed
Name = r18  I.N.C.R.E.A.S.E
Name = r5 No new state computed
Name = r13  I.N.C.R.E.A.S.E
Name = r15 No new state computed
Name = r3 No new state computed
Name = r11 No new state computed
Name = r12  OK !
Now we have a representation of size = 16037
Name = r15 No new state computed
Name = r6 No new state computed
Name = r8 No new state computed
Name = r9 No new state computed
Name = r7 No new state computed
Name = r5 No new state computed
Name = r10 No new state computed
Name = r14 No new state computed
Name = r17 No new state computed
Name = r4 No new state computed
Name = r13  I.N.C.R.E.A.S.E
Name = r11 No new state computed
Name = r3 No new state computed
Name = r2 No new state computed
Name = r16 No new state computed
Name = r18  I.N.C.R.E.A.S.E
increase = 1
**********************
Random choose
Name = r18  OK !
Now we have a representation of size = 16679
Minimization in Progress
Name = r11 No new state computed
Name = r12 No new state computed
Name = r5 No new state computed
Name = r13  I.N.C.R.E.A.S.E
Name = r4 No new state computed
Name = r8 No new state computed
Name = r14 No new state computed
Name = r17 No new state computed
Name = r10 No new state computed
Name = r6 No new state computed
Name = r9 No new state computed
Name = r16 No new state computed
Name = r15 No new state computed
Name = r2 No new state computed
Name = r3 No new state computed
Name = r7 No new state computed
increase = 1
**********************
Random choose
Name = r13  OK !
Now we have a representation of size = 17404
Minimization in Progress
Name = r7 No new state computed
Name = r3 No new state computed
Name = r5 No new state computed
Name = r12 No new state computed
Name = r6 No new state computed
Name = r16 No new state computed
Name = r8 No new state computed
Name = r4 No new state computed
Name = r18  OK !
Now we have a representation of size = 17373
Name = r11 No new state computed
Name = r13 No new state computed
Name = r15 No new state computed
Name = r17 No new state computed
Name = r2 No new state computed
Name = r10 No new state computed
Name = r5 No new state computed
Name = r9 No new state computed
Name = r12 No new state computed
Name = r3 No new state computed
Name = r16 No new state computed
Name = r4 No new state computed
Name = r8 No new state computed
Name = r7 No new state computed
Name = r14 No new state computed
Name = r6 No new state computed
increase = 0
nb accelerations 24
Fix point FOUND
seed is : 2691
