current set encoding is : prestaf-no-among
seed is : 3284
(1/64)->
(2/64)->
(3/64)->
(4/64)->
(5/64)->
(6/64)->
(7/64)->
(8/64)->
(9/64)->
(10/64)->
(11/64)->
(12/64)->
(13/64)->
(14/64)->
(15/64)->
(16/64)->
(17/64)->
(18/64)->
(19/64)->
(20/64)->
(21/64)->
(22/64)->
(23/64)->
(24/64)->
(25/64)->
(26/64)->
(27/64)->
(28/64)->
(29/64)->
(30/64)->
(31/64)->
(32/64)->
(33/64)->
(34/64)->
(35/64)->
(36/64)->
(37/64)->
(38/64)->
(39/64)->
(40/64)->
(41/64)->
(42/64)->
(43/64)->
(44/64)->
(45/64)->
(46/64)->
(47/64)->
(48/64)->
(49/64)->
(50/64)->
(51/64)->
(52/64)->
(53/64)->
(54/64)->
(55/64)->
(56/64)->
(57/64)->
(58/64)->
(59/64)->
(60/64)->
(61/64)->
(62/64)->
(63/64)->
(64/64)->
Simplification of the linear system 
1 functions have the same action, it remains only 1
1 functions have the same action, it remains only 1
1 functions have the same action, it remains only 1
2 functions have the same action, it remains only 1
1 functions have the same action, it remains only 1
2 functions have the same action, it remains only 1
1 functions have the same action, it remains only 1
2 functions have the same action, it remains only 1
1 functions have the same action, it remains only 1
2 functions have the same action, it remains only 1
1 functions have the same action, it remains only 1
1 functions have the same action, it remains only 1
2 functions have the same action, it remains only 1
2 functions have the same action, it remains only 1
2 functions have the same action, it remains only 1
1 functions have the same action, it remains only 1
2 functions have the same action, it remains only 1
1 functions have the same action, it remains only 1
1 functions have the same action, it remains only 1
1 functions have the same action, it remains only 1
1 functions have the same action, it remains only 1
2 functions have the same action, it remains only 1
1 functions have the same action, it remains only 1
1 functions have the same action, it remains only 1
Number of actions before simplification : 33
Number of actions after simplification  : 24
cycles of length 2
(1/24), name = +useC.stop, size = 1416
(2/24), name = +stop.useC, size = 1068
(3/24), name = +releaseC2.stop, size = 1465
(4/24), name = (+return.stop+stop), size = 303
(5/24), name = +releaseC1.stop, size = 1485
(6/24), name = (+useC.req+req.useC), size = 918
(7/24), name = +req, size = 194
(8/24), name = (+releaseC2.useC+useC.releaseC2), size = 773
(9/24), name = +useC, size = 876
(10/24), name = (+useD.releaseC2+releaseC2.useD), size = 3268
(11/24), name = +releaseC2, size = 846
(12/24), name = +useD, size = 696
(13/24), name = (+releaseD.useC+useC.releaseD), size = 3268
(14/24), name = (+releaseC1.req+req.releaseC1), size = 876
(15/24), name = (+releaseD.useD+useD.releaseD), size = 777
(16/24), name = +releaseD, size = 822
(17/24), name = (+releaseC1.useC+useC.releaseC1), size = 729
(18/24), name = +releaseC1, size = 918
(19/24), name = +useC.return, size = 1360
(20/24), name = +releaseC2.return, size = 1416
(21/24), name = +return.releaseC2, size = 1039
(22/24), name = (+stop.return+return), size = 288
(23/24), name = +releaseC1.return, size = 1439
(24/24), name = +return.releaseC1, size = 1057
**********************
Random choose
Name = (+useD.releaseC2+releaseC2.useD)  No new state computed
Name = +useD  No new state computed
Name = +releaseC2.return  No new state computed
Name = +releaseC1.stop  No new state computed
Name = (+releaseC1.useC+useC.releaseC1)  No new state computed
Name = (+return.stop+stop)  OK !
Now we have a representation of size = 50
Minimization in Progress
Name = +stop.useC No new state computed
Name = (+releaseC2.useC+useC.releaseC2) No new state computed
Name = +releaseD No new state computed
Name = +useC.stop No new state computed
Name = +releaseC1.return No new state computed
Name = +return.releaseC1 No new state computed
Name = +return.releaseC2 No new state computed
Name = +releaseC2.return No new state computed
Name = +req  OK !
Now we have a representation of size = 50
Name = +releaseC2 No new state computed
Name = (+useD.releaseC2+releaseC2.useD) No new state computed
Name = +useC.return  I.N.C.R.E.A.S.E
Name = (+releaseC1.req+req.releaseC1) No new state computed
Name = +stop.useC  I.N.C.R.E.A.S.E
Name = (+releaseD.useC+useC.releaseD) No new state computed
Name = +return.releaseC1 No new state computed
Name = (+return.stop+stop) No new state computed
Name = +releaseC1.stop No new state computed
Name = +releaseC1 No new state computed
Name = +releaseC1.return No new state computed
Name = +useD No new state computed
Name = +useC.stop  I.N.C.R.E.A.S.E
Name = (+releaseC1.useC+useC.releaseC1) No new state computed
Name = +return.releaseC2 No new state computed
Name = +useC  I.N.C.R.E.A.S.E
Name = +releaseC2.return No new state computed
Name = (+releaseD.useD+useD.releaseD) No new state computed
Name = (+stop.return+return)  I.N.C.R.E.A.S.E
Name = (+releaseC2.useC+useC.releaseC2)  OK !
Now we have a representation of size = 50
Name = (+releaseC1.req+req.releaseC1) No new state computed
Name = (+return.stop+stop) No new state computed
Name = +return.releaseC1 No new state computed
Name = +releaseC1 No new state computed
Name = (+releaseC1.useC+useC.releaseC1) No new state computed
Name = +req No new state computed
Name = +useC.return  I.N.C.R.E.A.S.E
Name = +stop.useC  I.N.C.R.E.A.S.E
Name = +releaseC1.stop No new state computed
Name = +releaseC1.return No new state computed
Name = +releaseC2.return No new state computed
Name = +useC  I.N.C.R.E.A.S.E
Name = (+releaseD.useD+useD.releaseD) No new state computed
Name = +releaseC2 No new state computed
Name = (+stop.return+return)  I.N.C.R.E.A.S.E
Name = +useD  I.N.C.R.E.A.S.E
Name = +useC.stop  I.N.C.R.E.A.S.E
Name = (+useD.releaseC2+releaseC2.useD) No new state computed
Name = +return.releaseC2 No new state computed
Name = +releaseD No new state computed
Name = +releaseC2.stop No new state computed
Name = (+releaseD.useC+useC.releaseD) No new state computed
Name = (+useC.req+req.useC)  I.N.C.R.E.A.S.E
increase = 1
**********************
Random choose
Name = (+useC.req+req.useC)  OK !
Now we have a representation of size = 57
Minimization in Progress
Name = +useC.return No new state computed
Name = +releaseC2.stop No new state computed
Name = +useD  I.N.C.R.E.A.S.E
Name = +releaseC1.return  I.N.C.R.E.A.S.E
Name = (+return.stop+stop)  I.N.C.R.E.A.S.E
Name = +return.releaseC1 No new state computed
Name = +releaseD No new state computed
Name = +req No new state computed
Name = (+releaseC1.req+req.releaseC1) No new state computed
Name = +stop.useC No new state computed
Name = +releaseC2 No new state computed
Name = (+useD.releaseC2+releaseC2.useD)  I.N.C.R.E.A.S.E
Name = +useC.stop  I.N.C.R.E.A.S.E
Name = (+releaseD.useD+useD.releaseD) No new state computed
Name = (+releaseC1.useC+useC.releaseC1) No new state computed
Name = (+releaseD.useC+useC.releaseD) No new state computed
Name = +releaseC2.return  I.N.C.R.E.A.S.E
Name = +releaseC1.stop No new state computed
Name = (+stop.return+return)  I.N.C.R.E.A.S.E
Name = (+releaseC2.useC+useC.releaseC2) No new state computed
Name = +useC No new state computed
Name = +return.releaseC2 No new state computed
Name = +releaseC1 No new state computed
increase = 1
**********************
Random choose
Name = (+stop.return+return)  OK !
Now we have a representation of size = 61
Minimization in Progress
Name = (+releaseC1.req+req.releaseC1) No new state computed
Name = +stop.useC No new state computed
Name = (+releaseC2.useC+useC.releaseC2) No new state computed
Name = +releaseC1.stop No new state computed
Name = (+useD.releaseC2+releaseC2.useD)  I.N.C.R.E.A.S.E
Name = +return.releaseC1 No new state computed
Name = +useD  I.N.C.R.E.A.S.E
Name = +releaseC1.return No new state computed
Name = +releaseD No new state computed
Name = +releaseC2 No new state computed
Name = (+useC.req+req.useC) No new state computed
Name = +useC.return No new state computed
Name = (+releaseD.useD+useD.releaseD) No new state computed
Name = +return.releaseC2 No new state computed
Name = +req No new state computed
Name = +releaseC2.stop No new state computed
Name = +releaseC2.return No new state computed
Name = (+releaseD.useC+useC.releaseD) No new state computed
Name = +useC.stop  I.N.C.R.E.A.S.E
Name = +releaseC1 No new state computed
Name = (+releaseC1.useC+useC.releaseC1) No new state computed
Name = +useC No new state computed
Name = (+return.stop+stop)  I.N.C.R.E.A.S.E
increase = 1
**********************
Random choose
Name = (+return.stop+stop)  OK !
Now we have a representation of size = 69
Minimization in Progress
Name = (+stop.return+return) No new state computed
Name = (+releaseC1.useC+useC.releaseC1) No new state computed
Name = +releaseC1.return No new state computed
Name = +releaseC2 No new state computed
Name = +releaseC1 No new state computed
Name = +return.releaseC2 No new state computed
Name = +useC No new state computed
Name = (+releaseC2.useC+useC.releaseC2) No new state computed
Name = +releaseD No new state computed
Name = (+releaseD.useD+useD.releaseD) No new state computed
Name = +releaseC2.return No new state computed
Name = +useC.return No new state computed
Name = +useC.stop No new state computed
Name = (+useD.releaseC2+releaseC2.useD)  I.N.C.R.E.A.S.E
Name = +return.releaseC1 No new state computed
Name = +req No new state computed
Name = (+useC.req+req.useC) No new state computed
Name = (+releaseD.useC+useC.releaseD) No new state computed
Name = +stop.useC No new state computed
Name = +releaseC2.stop No new state computed
Name = (+releaseC1.req+req.releaseC1) No new state computed
Name = +releaseC1.stop No new state computed
Name = +useD  I.N.C.R.E.A.S.E
increase = 1
**********************
Random choose
Name = +useD  OK !
Now we have a representation of size = 75
Minimization in Progress
Name = +releaseC2 No new state computed
Name = +return.releaseC1 No new state computed
Name = (+useC.req+req.useC) No new state computed
Name = (+stop.return+return) No new state computed
Name = (+releaseC1.useC+useC.releaseC1) No new state computed
Name = +releaseC2.stop No new state computed
Name = +releaseD No new state computed
Name = +useC.return No new state computed
Name = +useC.stop No new state computed
Name = +useC No new state computed
Name = (+useD.releaseC2+releaseC2.useD) No new state computed
Name = +req No new state computed
Name = +return.releaseC2 No new state computed
Name = +releaseC2.return No new state computed
Name = (+releaseD.useD+useD.releaseD) No new state computed
Name = (+releaseC1.req+req.releaseC1) No new state computed
Name = (+releaseC2.useC+useC.releaseC2) No new state computed
Name = (+return.stop+stop) No new state computed
Name = +releaseC1.stop No new state computed
Name = +releaseC1.return No new state computed
Name = +stop.useC No new state computed
Name = +releaseC1 No new state computed
Name = (+releaseD.useC+useC.releaseD) No new state computed
increase = 0
nb accelerations 7
Fix point FOUND
seed is : 3284
