current set encoding is : prestaf
seed is : 21768
cycles of length 1
(1/13), name = t1, size = 224
(2/13), name = t2, size = 972
(3/13), name = t3, size = 906
(4/13), name = t4, size = 876
(5/13), name = t5, size = 942
(6/13), name = t6, size = 224
(7/13), name = t7, size = 236
(8/13), name = t8, size = 224
(9/13), name = t9, size = 428
(10/13), name = t10, size = 446
(11/13), name = t11, size = 230
(12/13), name = t12, size = 458
(13/13), name = t13, size = 410
**********************
Random choose
Name = t3  No new state computed
Name = t4  No new state computed
Name = t6  OK !
Now we have a representation of size = 52
Minimization in Progress
Name = t8  OK !
Now we have a representation of size = 52
Name = t6 No new state computed
Name = t5 No new state computed
Name = t2 No new state computed
Name = t12 No new state computed
Name = t1 No new state computed
Name = t10 No new state computed
Name = t4 No new state computed
Name = t11 No new state computed
Name = t7 No new state computed
Name = t13 No new state computed
Name = t3  I.N.C.R.E.A.S.E
Name = t9  I.N.C.R.E.A.S.E
increase = 1
**********************
Random choose
Name = t9  OK !
Now we have a representation of size = 55
Minimization in Progress
Name = t2  I.N.C.R.E.A.S.E
Name = t7 No new state computed
Name = t4 No new state computed
Name = t3  I.N.C.R.E.A.S.E
Name = t13 No new state computed
Name = t6 No new state computed
Name = t12 No new state computed
Name = t11 No new state computed
Name = t8 No new state computed
Name = t5 No new state computed
Name = t10  I.N.C.R.E.A.S.E
Name = t1 No new state computed
increase = 1
**********************
Random choose
Name = t10  OK !
Now we have a representation of size = 56
Minimization in Progress
Name = t2  I.N.C.R.E.A.S.E
Name = t8 No new state computed
Name = t11  I.N.C.R.E.A.S.E
Name = t4 No new state computed
Name = t13 No new state computed
Name = t3  I.N.C.R.E.A.S.E
Name = t6 No new state computed
Name = t7 No new state computed
Name = t5 No new state computed
Name = t1 No new state computed
Name = t12 No new state computed
Name = t9  OK !
Now we have a representation of size = 55
Name = t4 No new state computed
Name = t7 No new state computed
Name = t6 No new state computed
Name = t10  I.N.C.R.E.A.S.E
Name = t13 No new state computed
Name = t5 No new state computed
Name = t2  I.N.C.R.E.A.S.E
Name = t11  I.N.C.R.E.A.S.E
Name = t8 No new state computed
Name = t12 No new state computed
Name = t1 No new state computed
Name = t3  I.N.C.R.E.A.S.E
increase = 1
**********************
Random choose
Name = t3  OK !
Now we have a representation of size = 61
Minimization in Progress
Name = t6 No new state computed
Name = t5 No new state computed
Name = t1  OK !
Now we have a representation of size = 61
Name = t13 No new state computed
Name = t11  I.N.C.R.E.A.S.E
Name = t7 No new state computed
Name = t8 No new state computed
Name = t12 No new state computed
Name = t3 No new state computed
Name = t4 No new state computed
Name = t10  I.N.C.R.E.A.S.E
Name = t2  I.N.C.R.E.A.S.E
Name = t5 No new state computed
Name = t9 No new state computed
Name = t6 No new state computed
increase = 1
**********************
Random choose
Name = t2  OK !
Now we have a representation of size = 67
Minimization in Progress
Name = t7 No new state computed
Name = t6 No new state computed
Name = t8 No new state computed
Name = t3 No new state computed
Name = t12 No new state computed
Name = t9 No new state computed
Name = t11  I.N.C.R.E.A.S.E
Name = t10  I.N.C.R.E.A.S.E
Name = t1  OK !
Now we have a representation of size = 66
Name = t7 No new state computed
Name = t8 No new state computed
Name = t9 No new state computed
Name = t11  I.N.C.R.E.A.S.E
Name = t3 No new state computed
Name = t13 No new state computed
Name = t4 No new state computed
Name = t6 No new state computed
Name = t2 No new state computed
Name = t5 No new state computed
Name = t10  I.N.C.R.E.A.S.E
Name = t12 No new state computed
increase = 1
**********************
Random choose
Name = t10  OK !
Now we have a representation of size = 103
Minimization in Progress
Name = t2 No new state computed
Name = t7 No new state computed
Name = t5 No new state computed
Name = t13 No new state computed
Name = t12 No new state computed
Name = t11  I.N.C.R.E.A.S.E
Name = t9  OK !
Now we have a representation of size = 103
Name = t1 No new state computed
Name = t4 No new state computed
Name = t6 No new state computed
Name = t10  I.N.C.R.E.A.S.E
Name = t7 No new state computed
Name = t3  I.N.C.R.E.A.S.E
Name = t13 No new state computed
Name = t11  I.N.C.R.E.A.S.E
Name = t8 No new state computed
Name = t5 No new state computed
Name = t12 No new state computed
Name = t2  I.N.C.R.E.A.S.E
increase = 1
**********************
Random choose
Name = t2  OK !
Now we have a representation of size = 109
Minimization in Progress
Name = t5 No new state computed
Name = t9 No new state computed
Name = t6 No new state computed
Name = t13 No new state computed
Name = t1  OK !
Now we have a representation of size = 103
Name = t8 No new state computed
Name = t12 No new state computed
Name = t9 No new state computed
Name = t13 No new state computed
Name = t2 No new state computed
Name = t5 No new state computed
Name = t3  I.N.C.R.E.A.S.E
Name = t11  I.N.C.R.E.A.S.E
Name = t10  I.N.C.R.E.A.S.E
Name = t6 No new state computed
Name = t7 No new state computed
Name = t4 No new state computed
increase = 1
**********************
Random choose
Name = t10  OK !
Now we have a representation of size = 106
Minimization in Progress
Name = t11  I.N.C.R.E.A.S.E
Name = t8 No new state computed
Name = t5 No new state computed
Name = t3  I.N.C.R.E.A.S.E
Name = t9  OK !
Now we have a representation of size = 106
Name = t1 No new state computed
Name = t2  I.N.C.R.E.A.S.E
Name = t6 No new state computed
Name = t13 No new state computed
Name = t7 No new state computed
Name = t11  I.N.C.R.E.A.S.E
Name = t5 No new state computed
Name = t10  I.N.C.R.E.A.S.E
Name = t4 No new state computed
Name = t12 No new state computed
Name = t8 No new state computed
Name = t3  I.N.C.R.E.A.S.E
increase = 1
**********************
Random choose
Name = t3  OK !
Now we have a representation of size = 111
Minimization in Progress
Name = t4 No new state computed
Name = t9 No new state computed
Name = t10  I.N.C.R.E.A.S.E
Name = t1  OK !
Now we have a representation of size = 96
Name = t7 No new state computed
Name = t13 No new state computed
Name = t3 No new state computed
Name = t2  I.N.C.R.E.A.S.E
Name = t4 No new state computed
Name = t5 No new state computed
Name = t10  I.N.C.R.E.A.S.E
Name = t9 No new state computed
Name = t6 No new state computed
Name = t8 No new state computed
Name = t11  I.N.C.R.E.A.S.E
Name = t12 No new state computed
increase = 1
**********************
Random choose
Name = t11  OK !
Now we have a representation of size = 102
Minimization in Progress
Name = t3 No new state computed
Name = t6 No new state computed
Name = t13  I.N.C.R.E.A.S.E
Name = t12 No new state computed
Name = t10  I.N.C.R.E.A.S.E
Name = t1 No new state computed
Name = t2  I.N.C.R.E.A.S.E
Name = t9 No new state computed
Name = t8 No new state computed
Name = t7 No new state computed
Name = t5 No new state computed
Name = t4 No new state computed
increase = 1
**********************
Random choose
Name = t2  OK !
Now we have a representation of size = 108
Minimization in Progress
Name = t13  I.N.C.R.E.A.S.E
Name = t1  OK !
Now we have a representation of size = 97
Name = t7 No new state computed
Name = t5 No new state computed
Name = t8 No new state computed
Name = t11 No new state computed
Name = t4 No new state computed
Name = t3 No new state computed
Name = t10  I.N.C.R.E.A.S.E
Name = t6 No new state computed
Name = t12 No new state computed
Name = t9 No new state computed
Name = t13  I.N.C.R.E.A.S.E
Name = t2 No new state computed
increase = 1
**********************
Random choose
Name = t13  OK !
Now we have a representation of size = 99
Minimization in Progress
Name = t5 No new state computed
Name = t11 No new state computed
Name = t7 No new state computed
Name = t6 No new state computed
Name = t2 No new state computed
Name = t10  I.N.C.R.E.A.S.E
Name = t1 No new state computed
Name = t4 No new state computed
Name = t9 No new state computed
Name = t3 No new state computed
Name = t8 No new state computed
Name = t12 No new state computed
increase = 1
**********************
Random choose
Name = t10  OK !
Now we have a representation of size = 167
Minimization in Progress
Name = t3  I.N.C.R.E.A.S.E
Name = t1 No new state computed
Name = t4 No new state computed
Name = t5 No new state computed
Name = t2 No new state computed
Name = t13 No new state computed
Name = t7 No new state computed
Name = t6 No new state computed
Name = t9  OK !
Now we have a representation of size = 167
Name = t4 No new state computed
Name = t2  I.N.C.R.E.A.S.E
Name = t12 No new state computed
Name = t7 No new state computed
Name = t6 No new state computed
Name = t1 No new state computed
Name = t11  OK !
Now we have a representation of size = 141
Name = t8 No new state computed
Name = t6 No new state computed
Name = t2  I.N.C.R.E.A.S.E
Name = t9 No new state computed
Name = t4 No new state computed
Name = t13 No new state computed
Name = t12 No new state computed
Name = t3  I.N.C.R.E.A.S.E
Name = t5 No new state computed
Name = t7 No new state computed
Name = t1 No new state computed
Name = t10  I.N.C.R.E.A.S.E
increase = 1
**********************
Random choose
Name = t10  OK !
Now we have a representation of size = 174
Minimization in Progress
Name = t8 No new state computed
Name = t11  OK !
Now we have a representation of size = 146
Name = t3  I.N.C.R.E.A.S.E
Name = t9  OK !
Now we have a representation of size = 145
Name = t1 No new state computed
Name = t7 No new state computed
Name = t4 No new state computed
Name = t2  I.N.C.R.E.A.S.E
Name = t12 No new state computed
Name = t11 No new state computed
Name = t6 No new state computed
Name = t5 No new state computed
Name = t8 No new state computed
Name = t10  I.N.C.R.E.A.S.E
Name = t3  I.N.C.R.E.A.S.E
Name = t13 No new state computed
increase = 1
**********************
Random choose
Name = t3  OK !
Now we have a representation of size = 150
Minimization in Progress
Name = t9 No new state computed
Name = t6 No new state computed
Name = t2  I.N.C.R.E.A.S.E
Name = t4 No new state computed
Name = t8 No new state computed
Name = t10  I.N.C.R.E.A.S.E
Name = t13 No new state computed
Name = t11 No new state computed
Name = t1  OK !
Now we have a representation of size = 138
Name = t13 No new state computed
Name = t11 No new state computed
Name = t9 No new state computed
Name = t8 No new state computed
Name = t2  I.N.C.R.E.A.S.E
Name = t5 No new state computed
Name = t3 No new state computed
Name = t10  I.N.C.R.E.A.S.E
Name = t4 No new state computed
Name = t12 No new state computed
Name = t6 No new state computed
Name = t7 No new state computed
increase = 1
**********************
Random choose
Name = t10  OK !
Now we have a representation of size = 208
Minimization in Progress
Name = t7 No new state computed
Name = t6 No new state computed
Name = t5 No new state computed
Name = t4 No new state computed
Name = t3  I.N.C.R.E.A.S.E
Name = t8 No new state computed
Name = t9  OK !
Now we have a representation of size = 208
Name = t5 No new state computed
Name = t13 No new state computed
Name = t12 No new state computed
Name = t2  I.N.C.R.E.A.S.E
Name = t11  OK !
Now we have a representation of size = 179
Name = t7 No new state computed
Name = t6 No new state computed
Name = t2  I.N.C.R.E.A.S.E
Name = t8 No new state computed
Name = t12 No new state computed
Name = t5 No new state computed
Name = t13 No new state computed
Name = t9 No new state computed
Name = t3  I.N.C.R.E.A.S.E
Name = t4 No new state computed
Name = t10  I.N.C.R.E.A.S.E
Name = t1 No new state computed
increase = 1
**********************
Random choose
Name = t10  OK !
Now we have a representation of size = 212
Minimization in Progress
Name = t6 No new state computed
Name = t1 No new state computed
Name = t11  OK !
Now we have a representation of size = 184
Name = t4 No new state computed
Name = t3  I.N.C.R.E.A.S.E
Name = t12 No new state computed
Name = t7 No new state computed
Name = t9  OK !
Now we have a representation of size = 183
Name = t10  I.N.C.R.E.A.S.E
Name = t2  I.N.C.R.E.A.S.E
Name = t3  I.N.C.R.E.A.S.E
Name = t11 No new state computed
Name = t5 No new state computed
Name = t6 No new state computed
Name = t4 No new state computed
Name = t13 No new state computed
Name = t8 No new state computed
Name = t7 No new state computed
Name = t1 No new state computed
Name = t12 No new state computed
increase = 1
**********************
Random choose
Name = t3  OK !
Now we have a representation of size = 188
Minimization in Progress
Name = t2  I.N.C.R.E.A.S.E
Name = t8 No new state computed
Name = t11 No new state computed
Name = t9 No new state computed
Name = t13 No new state computed
Name = t5 No new state computed
Name = t7 No new state computed
Name = t6 No new state computed
Name = t12 No new state computed
Name = t4 No new state computed
Name = t10  I.N.C.R.E.A.S.E
Name = t1  OK !
Now we have a representation of size = 154
Name = t7 No new state computed
Name = t9 No new state computed
Name = t3 No new state computed
Name = t8 No new state computed
Name = t13 No new state computed
Name = t12 No new state computed
Name = t4 No new state computed
Name = t5 No new state computed
Name = t11 No new state computed
Name = t10  I.N.C.R.E.A.S.E
Name = t6 No new state computed
Name = t2  I.N.C.R.E.A.S.E
increase = 1
**********************
Random choose
Name = t2  OK !
Now we have a representation of size = 160
Minimization in Progress
Name = t8 No new state computed
Name = t7 No new state computed
Name = t9 No new state computed
Name = t10  I.N.C.R.E.A.S.E
Name = t3 No new state computed
Name = t12 No new state computed
Name = t5 No new state computed
Name = t11 No new state computed
Name = t4 No new state computed
Name = t13 No new state computed
Name = t1  OK !
Now we have a representation of size = 145
Name = t4 No new state computed
Name = t2 No new state computed
Name = t3 No new state computed
Name = t11 No new state computed
Name = t5 No new state computed
Name = t8 No new state computed
Name = t6 No new state computed
Name = t10  I.N.C.R.E.A.S.E
Name = t13 No new state computed
Name = t9 No new state computed
Name = t7 No new state computed
Name = t12 No new state computed
increase = 1
**********************
Random choose
Name = t10  OK !
Now we have a representation of size = 258
Minimization in Progress
Name = t9  OK !
Now we have a representation of size = 258
Name = t8 No new state computed
Name = t12 No new state computed
Name = t7 No new state computed
Name = t10  I.N.C.R.E.A.S.E
Name = t5 No new state computed
Name = t11  OK !
Now we have a representation of size = 202
Name = t3  I.N.C.R.E.A.S.E
Name = t2  I.N.C.R.E.A.S.E
Name = t12 No new state computed
Name = t1 No new state computed
Name = t9 No new state computed
Name = t4 No new state computed
Name = t10  I.N.C.R.E.A.S.E
Name = t7 No new state computed
Name = t5 No new state computed
Name = t13 No new state computed
Name = t8 No new state computed
Name = t6 No new state computed
increase = 1
**********************
Random choose
Name = t10  OK !
Now we have a representation of size = 250
Minimization in Progress
Name = t8 No new state computed
Name = t4 No new state computed
Name = t6 No new state computed
Name = t7 No new state computed
Name = t12 No new state computed
Name = t2  I.N.C.R.E.A.S.E
Name = t11  OK !
Now we have a representation of size = 207
Name = t6 No new state computed
Name = t12 No new state computed
Name = t2  I.N.C.R.E.A.S.E
Name = t10 No new state computed
Name = t5 No new state computed
Name = t7 No new state computed
Name = t13 No new state computed
Name = t9  OK !
Now we have a representation of size = 206
Name = t7 No new state computed
Name = t6 No new state computed
Name = t8 No new state computed
Name = t2  I.N.C.R.E.A.S.E
Name = t11 No new state computed
Name = t12 No new state computed
Name = t3  I.N.C.R.E.A.S.E
Name = t4 No new state computed
Name = t5 No new state computed
Name = t1 No new state computed
Name = t10  I.N.C.R.E.A.S.E
Name = t13 No new state computed
increase = 1
**********************
Random choose
Name = t10  OK !
Now we have a representation of size = 268
Minimization in Progress
Name = t12 No new state computed
Name = t6 No new state computed
Name = t13 No new state computed
Name = t3  I.N.C.R.E.A.S.E
Name = t1 No new state computed
Name = t9  OK !
Now we have a representation of size = 264
Name = t11  OK !
Now we have a representation of size = 220
Name = t10  I.N.C.R.E.A.S.E
Name = t3  I.N.C.R.E.A.S.E
Name = t2  I.N.C.R.E.A.S.E
Name = t4 No new state computed
Name = t6 No new state computed
Name = t5 No new state computed
Name = t9 No new state computed
Name = t7 No new state computed
Name = t1 No new state computed
Name = t12 No new state computed
Name = t13 No new state computed
Name = t8 No new state computed
increase = 1
**********************
Random choose
Name = t2  OK !
Now we have a representation of size = 226
Minimization in Progress
Name = t1  OK !
Now we have a representation of size = 220
Name = t5 No new state computed
Name = t2 No new state computed
Name = t3  I.N.C.R.E.A.S.E
Name = t13 No new state computed
Name = t9 No new state computed
Name = t6 No new state computed
Name = t7 No new state computed
Name = t8 No new state computed
Name = t10  I.N.C.R.E.A.S.E
Name = t12 No new state computed
Name = t11 No new state computed
Name = t4 No new state computed
increase = 1
**********************
Random choose
Name = t10  OK !
Now we have a representation of size = 270
Minimization in Progress
Name = t7 No new state computed
Name = t8 No new state computed
Name = t13 No new state computed
Name = t6 No new state computed
Name = t1 No new state computed
Name = t9  OK !
Now we have a representation of size = 270
Name = t6 No new state computed
Name = t4 No new state computed
Name = t10  I.N.C.R.E.A.S.E
Name = t8 No new state computed
Name = t1 No new state computed
Name = t11  OK !
Now we have a representation of size = 227
Name = t5 No new state computed
Name = t1 No new state computed
Name = t8 No new state computed
Name = t10  I.N.C.R.E.A.S.E
Name = t7 No new state computed
Name = t2  I.N.C.R.E.A.S.E
Name = t6 No new state computed
Name = t13 No new state computed
Name = t9 No new state computed
Name = t12 No new state computed
Name = t3  I.N.C.R.E.A.S.E
Name = t4 No new state computed
increase = 1
**********************
Random choose
Name = t3  OK !
Now we have a representation of size = 232
Minimization in Progress
Name = t10  I.N.C.R.E.A.S.E
Name = t2  I.N.C.R.E.A.S.E
Name = t5 No new state computed
Name = t6 No new state computed
Name = t11 No new state computed
Name = t8 No new state computed
Name = t7 No new state computed
Name = t4 No new state computed
Name = t12 No new state computed
Name = t1  OK !
Now we have a representation of size = 196
Name = t5 No new state computed
Name = t11 No new state computed
Name = t13 No new state computed
Name = t8 No new state computed
Name = t2  I.N.C.R.E.A.S.E
Name = t7 No new state computed
Name = t4 No new state computed
Name = t9 No new state computed
Name = t3 No new state computed
Name = t10  I.N.C.R.E.A.S.E
Name = t6 No new state computed
Name = t12 No new state computed
increase = 1
**********************
Random choose
Name = t10  OK !
Now we have a representation of size = 311
Minimization in Progress
Name = t11  OK !
Now we have a representation of size = 253
Name = t1 No new state computed
Name = t5 No new state computed
Name = t7 No new state computed
Name = t3  I.N.C.R.E.A.S.E
Name = t6 No new state computed
Name = t8 No new state computed
Name = t4 No new state computed
Name = t12 No new state computed
Name = t9  OK !
Now we have a representation of size = 253
Name = t13 No new state computed
Name = t7 No new state computed
Name = t2  I.N.C.R.E.A.S.E
Name = t12 No new state computed
Name = t6 No new state computed
Name = t3  I.N.C.R.E.A.S.E
Name = t4 No new state computed
Name = t8 No new state computed
Name = t11 No new state computed
Name = t1 No new state computed
Name = t10  I.N.C.R.E.A.S.E
Name = t5 No new state computed
increase = 1
**********************
Random choose
Name = t10  OK !
Now we have a representation of size = 301
Minimization in Progress
Name = t11  OK !
Now we have a representation of size = 258
Name = t10 No new state computed
Name = t8 No new state computed
Name = t6 No new state computed
Name = t1 No new state computed
Name = t2  I.N.C.R.E.A.S.E
Name = t4 No new state computed
Name = t13 No new state computed
Name = t12 No new state computed
Name = t5 No new state computed
Name = t7 No new state computed
Name = t3  I.N.C.R.E.A.S.E
Name = t9  OK !
Now we have a representation of size = 257
Name = t8 No new state computed
Name = t6 No new state computed
Name = t13 No new state computed
Name = t2  I.N.C.R.E.A.S.E
Name = t5 No new state computed
Name = t3  I.N.C.R.E.A.S.E
Name = t12 No new state computed
Name = t1 No new state computed
Name = t7 No new state computed
Name = t4 No new state computed
Name = t10  I.N.C.R.E.A.S.E
Name = t11 No new state computed
increase = 1
**********************
Random choose
Name = t10  OK !
Now we have a representation of size = 319
Minimization in Progress
Name = t5 No new state computed
Name = t6 No new state computed
Name = t11  OK !
Now we have a representation of size = 276
Name = t6 No new state computed
Name = t1 No new state computed
Name = t3  I.N.C.R.E.A.S.E
Name = t10 No new state computed
Name = t7 No new state computed
Name = t8 No new state computed
Name = t5 No new state computed
Name = t12 No new state computed
Name = t13 No new state computed
Name = t4 No new state computed
Name = t9  OK !
Now we have a representation of size = 272
Name = t5 No new state computed
Name = t8 No new state computed
Name = t12 No new state computed
Name = t2  I.N.C.R.E.A.S.E
Name = t6 No new state computed
Name = t1 No new state computed
Name = t4 No new state computed
Name = t3  I.N.C.R.E.A.S.E
Name = t7 No new state computed
Name = t11 No new state computed
Name = t13 No new state computed
Name = t10  I.N.C.R.E.A.S.E
increase = 1
**********************
Random choose
Name = t10  OK !
Now we have a representation of size = 320
Minimization in Progress
Name = t6 No new state computed
Name = t12 No new state computed
Name = t8 No new state computed
Name = t4 No new state computed
Name = t9  OK !
Now we have a representation of size = 316
Name = t3  I.N.C.R.E.A.S.E
Name = t10  I.N.C.R.E.A.S.E
Name = t1 No new state computed
Name = t6 No new state computed
Name = t8 No new state computed
Name = t12 No new state computed
Name = t13 No new state computed
Name = t5 No new state computed
Name = t11  OK !
Now we have a representation of size = 273
Name = t9 No new state computed
Name = t8 No new state computed
Name = t3  I.N.C.R.E.A.S.E
Name = t1 No new state computed
Name = t7 No new state computed
Name = t5 No new state computed
Name = t13 No new state computed
Name = t2  I.N.C.R.E.A.S.E
Name = t4 No new state computed
Name = t6 No new state computed
Name = t12 No new state computed
Name = t10  I.N.C.R.E.A.S.E
increase = 1
**********************
Random choose
Name = t10  OK !
Now we have a representation of size = 393
Minimization in Progress
Name = t12 No new state computed
Name = t8 No new state computed
Name = t11  OK !
Now we have a representation of size = 291
Name = t13 No new state computed
Name = t8 No new state computed
Name = t3  I.N.C.R.E.A.S.E
Name = t4 No new state computed
Name = t5 No new state computed
Name = t9  OK !
Now we have a representation of size = 286
Name = t11 No new state computed
Name = t8 No new state computed
Name = t5 No new state computed
Name = t13 No new state computed
Name = t3  I.N.C.R.E.A.S.E
Name = t12 No new state computed
Name = t2  I.N.C.R.E.A.S.E
Name = t1 No new state computed
Name = t10  I.N.C.R.E.A.S.E
Name = t6 No new state computed
Name = t7 No new state computed
Name = t4 No new state computed
increase = 1
**********************
Random choose
Name = t10  OK !
Now we have a representation of size = 349
Minimization in Progress
Name = t9  OK !
Now we have a representation of size = 332
Name = t12 No new state computed
Name = t8 No new state computed
Name = t4 No new state computed
Name = t6 No new state computed
Name = t11  OK !
Now we have a representation of size = 274
Name = t3  I.N.C.R.E.A.S.E
Name = t1 No new state computed
Name = t5 No new state computed
Name = t7 No new state computed
Name = t8 No new state computed
Name = t13 No new state computed
Name = t4 No new state computed
Name = t10  I.N.C.R.E.A.S.E
Name = t6 No new state computed
Name = t12 No new state computed
Name = t9 No new state computed
Name = t2  I.N.C.R.E.A.S.E
increase = 1
**********************
Random choose
Name = t2  OK !
Now we have a representation of size = 280
Minimization in Progress
Name = t4 No new state computed
Name = t13 No new state computed
Name = t10  I.N.C.R.E.A.S.E
Name = t7 No new state computed
Name = t1  OK !
Now we have a representation of size = 269
Name = t4 No new state computed
Name = t2 No new state computed
Name = t12 No new state computed
Name = t5 No new state computed
Name = t3  I.N.C.R.E.A.S.E
Name = t6 No new state computed
Name = t8 No new state computed
Name = t11 No new state computed
Name = t9 No new state computed
Name = t13 No new state computed
Name = t10  I.N.C.R.E.A.S.E
Name = t7 No new state computed
increase = 1
**********************
Random choose
Name = t10  OK !
Now we have a representation of size = 348
Minimization in Progress
Name = t12 No new state computed
Name = t13 No new state computed
Name = t2 No new state computed
Name = t9  OK !
Now we have a representation of size = 348
Name = t4 No new state computed
Name = t10  I.N.C.R.E.A.S.E
Name = t11  OK !
Now we have a representation of size = 289
Name = t5 No new state computed
Name = t12 No new state computed
Name = t9 No new state computed
Name = t2  I.N.C.R.E.A.S.E
Name = t10  I.N.C.R.E.A.S.E
Name = t1 No new state computed
Name = t3  I.N.C.R.E.A.S.E
Name = t6 No new state computed
Name = t7 No new state computed
Name = t8 No new state computed
Name = t4 No new state computed
Name = t13 No new state computed
increase = 1
**********************
Random choose
Name = t3  OK !
Now we have a representation of size = 294
Minimization in Progress
Name = t9 No new state computed
Name = t4 No new state computed
Name = t6 No new state computed
Name = t2  I.N.C.R.E.A.S.E
Name = t10  I.N.C.R.E.A.S.E
Name = t13 No new state computed
Name = t11 No new state computed
Name = t5 No new state computed
Name = t8 No new state computed
Name = t7 No new state computed
Name = t12 No new state computed
Name = t1  OK !
Now we have a representation of size = 243
Name = t10  I.N.C.R.E.A.S.E
Name = t7 No new state computed
Name = t9 No new state computed
Name = t11 No new state computed
Name = t8 No new state computed
Name = t5 No new state computed
Name = t12 No new state computed
Name = t2  I.N.C.R.E.A.S.E
Name = t13 No new state computed
Name = t6 No new state computed
Name = t4 No new state computed
Name = t3 No new state computed
increase = 1
**********************
Random choose
Name = t2  OK !
Now we have a representation of size = 249
Minimization in Progress
Name = t8 No new state computed
Name = t10  I.N.C.R.E.A.S.E
Name = t7 No new state computed
Name = t12 No new state computed
Name = t3 No new state computed
Name = t11 No new state computed
Name = t1  OK !
Now we have a representation of size = 236
Name = t13 No new state computed
Name = t3 No new state computed
Name = t8 No new state computed
Name = t2 No new state computed
Name = t10  I.N.C.R.E.A.S.E
Name = t12 No new state computed
Name = t5 No new state computed
Name = t4 No new state computed
Name = t6 No new state computed
Name = t9 No new state computed
Name = t11 No new state computed
Name = t7 No new state computed
increase = 1
**********************
Random choose
Name = t10  OK !
Now we have a representation of size = 307
Minimization in Progress
Name = t4 No new state computed
Name = t2 No new state computed
Name = t5 No new state computed
Name = t1 No new state computed
Name = t9  OK !
Now we have a representation of size = 307
Name = t2  I.N.C.R.E.A.S.E
Name = t8 No new state computed
Name = t3  I.N.C.R.E.A.S.E
Name = t10  I.N.C.R.E.A.S.E
Name = t12 No new state computed
Name = t5 No new state computed
Name = t13 No new state computed
Name = t7 No new state computed
Name = t6 No new state computed
Name = t1 No new state computed
Name = t11  OK !
Now we have a representation of size = 249
Name = t13 No new state computed
Name = t1 No new state computed
Name = t8 No new state computed
Name = t10  I.N.C.R.E.A.S.E
Name = t3  I.N.C.R.E.A.S.E
Name = t4 No new state computed
Name = t12 No new state computed
Name = t6 No new state computed
Name = t9 No new state computed
Name = t7 No new state computed
Name = t2  I.N.C.R.E.A.S.E
Name = t5 No new state computed
increase = 1
**********************
Random choose
Name = t2  OK !
Now we have a representation of size = 255
Minimization in Progress
Name = t4 No new state computed
Name = t5 No new state computed
Name = t13 No new state computed
Name = t6 No new state computed
Name = t11 No new state computed
Name = t12 No new state computed
Name = t8 No new state computed
Name = t7 No new state computed
Name = t3  I.N.C.R.E.A.S.E
Name = t10  I.N.C.R.E.A.S.E
Name = t9 No new state computed
Name = t1  OK !
Now we have a representation of size = 249
Name = t8 No new state computed
Name = t7 No new state computed
Name = t5 No new state computed
Name = t4 No new state computed
Name = t2 No new state computed
Name = t10  I.N.C.R.E.A.S.E
Name = t13 No new state computed
Name = t6 No new state computed
Name = t3  I.N.C.R.E.A.S.E
Name = t9 No new state computed
Name = t12 No new state computed
Name = t11 No new state computed
increase = 1
**********************
Random choose
Name = t3  OK !
Now we have a representation of size = 254
Minimization in Progress
Name = t5 No new state computed
Name = t11 No new state computed
Name = t2 No new state computed
Name = t9 No new state computed
Name = t6 No new state computed
Name = t1  OK !
Now we have a representation of size = 222
Name = t5 No new state computed
Name = t13 No new state computed
Name = t12 No new state computed
Name = t10  I.N.C.R.E.A.S.E
Name = t6 No new state computed
Name = t11 No new state computed
Name = t7 No new state computed
Name = t2 No new state computed
Name = t3 No new state computed
Name = t4 No new state computed
Name = t9 No new state computed
Name = t8 No new state computed
increase = 1
**********************
Random choose
Name = t10  OK !
Now we have a representation of size = 352
Minimization in Progress
Name = t9  OK !
Now we have a representation of size = 352
Name = t4 No new state computed
Name = t3  I.N.C.R.E.A.S.E
Name = t2  I.N.C.R.E.A.S.E
Name = t7 No new state computed
Name = t12 No new state computed
Name = t5 No new state computed
Name = t13 No new state computed
Name = t10  I.N.C.R.E.A.S.E
Name = t6 No new state computed
Name = t11  OK !
Now we have a representation of size = 294
Name = t4 No new state computed
Name = t3  I.N.C.R.E.A.S.E
Name = t1 No new state computed
Name = t2  I.N.C.R.E.A.S.E
Name = t13 No new state computed
Name = t7 No new state computed
Name = t6 No new state computed
Name = t9 No new state computed
Name = t5 No new state computed
Name = t8 No new state computed
Name = t12 No new state computed
Name = t10  I.N.C.R.E.A.S.E
increase = 1
**********************
Random choose
Name = t10  OK !
Now we have a representation of size = 357
Minimization in Progress
Name = t7 No new state computed
Name = t11  OK !
Now we have a representation of size = 299
Name = t13 No new state computed
Name = t10 No new state computed
Name = t7 No new state computed
Name = t6 No new state computed
Name = t5 No new state computed
Name = t2  I.N.C.R.E.A.S.E
Name = t12 No new state computed
Name = t8 No new state computed
Name = t9  OK !
Now we have a representation of size = 298
Name = t5 No new state computed
Name = t8 No new state computed
Name = t13 No new state computed
Name = t1 No new state computed
Name = t12 No new state computed
Name = t2  I.N.C.R.E.A.S.E
Name = t3  I.N.C.R.E.A.S.E
Name = t10  I.N.C.R.E.A.S.E
Name = t6 No new state computed
Name = t7 No new state computed
Name = t11 No new state computed
Name = t4 No new state computed
increase = 1
**********************
Random choose
Name = t10  OK !
Now we have a representation of size = 375
Minimization in Progress
Name = t12 No new state computed
Name = t2  I.N.C.R.E.A.S.E
Name = t6 No new state computed
Name = t4 No new state computed
Name = t9  OK !
Now we have a representation of size = 371
Name = t6 No new state computed
Name = t3  I.N.C.R.E.A.S.E
Name = t11  OK !
Now we have a representation of size = 313
Name = t1 No new state computed
Name = t2  I.N.C.R.E.A.S.E
Name = t13 No new state computed
Name = t9 No new state computed
Name = t7 No new state computed
Name = t6 No new state computed
Name = t4 No new state computed
Name = t12 No new state computed
Name = t5 No new state computed
Name = t10  I.N.C.R.E.A.S.E
Name = t3  I.N.C.R.E.A.S.E
Name = t8 No new state computed
increase = 1
**********************
Random choose
Name = t3  OK !
Now we have a representation of size = 318
Minimization in Progress
Name = t2  I.N.C.R.E.A.S.E
Name = t5 No new state computed
Name = t6 No new state computed
Name = t10  I.N.C.R.E.A.S.E
Name = t9 No new state computed
Name = t7 No new state computed
Name = t11 No new state computed
Name = t1  OK !
Now we have a representation of size = 277
Name = t7 No new state computed
Name = t13 No new state computed
Name = t9 No new state computed
Name = t5 No new state computed
Name = t2  I.N.C.R.E.A.S.E
Name = t4 No new state computed
Name = t6 No new state computed
Name = t12 No new state computed
Name = t10  I.N.C.R.E.A.S.E
Name = t11 No new state computed
Name = t3 No new state computed
Name = t8 No new state computed
increase = 1
nb accelerations 100
All the cycles considered have been used without succes.
Inflating the linear system
(1/169)->
(2/169)->
(3/169)->
(4/169)->
(5/169)->
(6/169)->
(7/169)->
(8/169)->
(9/169)->
(10/169)->
(11/169)->
(12/169)->
(13/169)->
(14/169)->
(15/169)->
(16/169)->
(17/169)->
(18/169)->
(19/169)->
(20/169)->
(21/169)->
(22/169)->
(23/169)->
(24/169)->
(25/169)->
(26/169)->
(27/169)->
(28/169)->
(29/169)->
(30/169)->
(31/169)->
(32/169)->
(33/169)->
(34/169)->
(35/169)->
(36/169)->
(37/169)->
(38/169)->
(39/169)->
(40/169)->
(41/169)->
(42/169)->
(43/169)->
(44/169)->
(45/169)->
(46/169)->
(47/169)->
(48/169)->
(49/169)->
(50/169)->
(51/169)->
(52/169)->
(53/169)->
(54/169)->
(55/169)->
(56/169)->
(57/169)->
(58/169)->
(59/169)->
(60/169)->
(61/169)->
(62/169)->
(63/169)->
(64/169)->
(65/169)->
(66/169)->
(67/169)->
(68/169)->
(69/169)->
(70/169)->
(71/169)->
(72/169)->
(73/169)->
(74/169)->
(75/169)->
(76/169)->
(77/169)->
(78/169)->
(79/169)->
(80/169)->
(81/169)->
(82/169)->
(83/169)->
(84/169)->
(85/169)->
(86/169)->
(87/169)->
(88/169)->
(89/169)->
(90/169)->
(91/169)->
(92/169)->
(93/169)->
(94/169)->
(95/169)->
(96/169)->
(97/169)->
(98/169)->
(99/169)->
(100/169)->
(101/169)->
(102/169)->
(103/169)->
(104/169)->
(105/169)->
(106/169)->
(107/169)->
(108/169)->
(109/169)->
(110/169)->
(111/169)->
(112/169)->
(113/169)->
(114/169)->
(115/169)->
(116/169)->
(117/169)->
(118/169)->
(119/169)->
(120/169)->
(121/169)->
(122/169)->
(123/169)->
(124/169)->
(125/169)->
(126/169)->
(127/169)->
(128/169)->
(129/169)->
(130/169)->
(131/169)->
(132/169)->
(133/169)->
(134/169)->
(135/169)->
(136/169)->
(137/169)->
(138/169)->
(139/169)->
(140/169)->
(141/169)->
(142/169)->
(143/169)->
(144/169)->
(145/169)->
(146/169)->
(147/169)->
(148/169)->
(149/169)->
(150/169)->
(151/169)->
(152/169)->
(153/169)->
(154/169)->
(155/169)->
(156/169)->
(157/169)->
(158/169)->
(159/169)->
(160/169)->
(161/169)->
(162/169)->
(163/169)->
(164/169)->
(165/169)->
(166/169)->
(167/169)->
(168/169)->
(169/169)->
Simplification of the linear system 
2 functions have the same action, it remains only 1
2 functions have the same action, it remains only 1
1 functions have the same action, it remains only 1
1 functions have the same action, it remains only 1
2 functions have the same action, it remains only 1
2 functions have the same action, it remains only 1
2 functions have the same action, it remains only 1
1 functions have the same action, it remains only 1
2 functions have the same action, it remains only 1
2 functions have the same action, it remains only 1
1 functions have the same action, it remains only 1
2 functions have the same action, it remains only 1
1 functions have the same action, it remains only 1
2 functions have the same action, it remains only 1
1 functions have the same action, it remains only 1
2 functions have the same action, it remains only 1
1 functions have the same action, it remains only 1
2 functions have the same action, it remains only 1
1 functions have the same action, it remains only 1
2 functions have the same action, it remains only 1
1 functions have the same action, it remains only 1
2 functions have the same action, it remains only 1
1 functions have the same action, it remains only 1
2 functions have the same action, it remains only 1
1 functions have the same action, it remains only 1
2 functions have the same action, it remains only 1
2 functions have the same action, it remains only 1
4 functions have the same action, it remains only 1
1 functions have the same action, it remains only 1
2 functions have the same action, it remains only 1
2 functions have the same action, it remains only 1
2 functions have the same action, it remains only 1
1 functions have the same action, it remains only 1
2 functions have the same action, it remains only 1
Number of actions before simplification : 57
Number of actions after simplification  : 34
cycles of length 2
(1/34), name = (+t5.t1+t1.t5), size = 984
(2/34), name = (+t4.t1+t1.t4), size = 918
(3/34), name = +t1, size = 224
(4/34), name = +t5, size = 942
(5/34), name = (+t10.t5+t5.t10), size = 1918
(6/34), name = (+t6.t5+t5.t6), size = 930
(7/34), name = (+t9.t4+t4.t9), size = 1924
(8/34), name = +t4, size = 876
(9/34), name = (+t6.t4+t4.t6), size = 864
(10/34), name = (+t9.t8+t8.t9), size = 422
(11/34), name = +t9, size = 428
(12/34), name = (+t12.t9+t9.t12), size = 942
(13/34), name = +t8, size = 224
(14/34), name = (+t10.t9+t9.t10), size = 444
(15/34), name = +t11, size = 230
(16/34), name = (+t13.t11+t11.t13), size = 422
(17/34), name = +t13, size = 410
(18/34), name = (+t8.t7+t7.t8), size = 230
(19/34), name = +t12, size = 458
(20/34), name = (+t13.t12+t12.t13), size = 468
(21/34), name = +t7, size = 236
(22/34), name = (+t11.t10+t10.t11), size = 470
(23/34), name = +t10, size = 446
(24/34), name = (+t10.t7+t7.t10), size = 422
(25/34), name = +t6, size = 224
(26/34), name = (+t3.t1+t1.t3), size = 864
(27/34), name = (+t2.t1+t1.t2), size = 930
(28/34), name = (+t5.t2+t4.t3+t3.t4+t2.t5), size = 1644
(29/34), name = +t3, size = 906
(30/34), name = (+t10.t3+t3.t10), size = 2074
(31/34), name = (+t6.t3+t3.t6), size = 918
(32/34), name = (+t9.t2+t2.t9), size = 1900
(33/34), name = +t2, size = 972
(34/34), name = (+t6.t2+t2.t6), size = 984
**********************
Random choose
Name = (+t12.t9+t9.t12)  No new state computed
Name = (+t6.t5+t5.t6)  No new state computed
Name = (+t5.t2+t4.t3+t3.t4+t2.t5)  No new state computed
Name = (+t10.t5+t5.t10)  No new state computed
Name = (+t2.t1+t1.t2)  No new state computed
Name = (+t6.t2+t2.t6)  No new state computed
Name = (+t9.t4+t4.t9)  No new state computed
Name = (+t3.t1+t1.t3)  No new state computed
Name = (+t11.t10+t10.t11)  No new state computed
Name = +t12  No new state computed
Name = (+t6.t4+t4.t6)  No new state computed
Name = (+t10.t3+t3.t10)  No new state computed
Name = +t5  No new state computed
Name = +t6  OK !
Now we have a representation of size = 52
Minimization in Progress
Name = +t12 No new state computed
Name = (+t2.t1+t1.t2) No new state computed
Name = (+t10.t7+t7.t10) No new state computed
Name = (+t12.t9+t9.t12) No new state computed
Name = +t3  I.N.C.R.E.A.S.E
Name = (+t6.t4+t4.t6) No new state computed
Name = (+t10.t3+t3.t10) No new state computed
Name = (+t6.t3+t3.t6)  I.N.C.R.E.A.S.E
Name = (+t11.t10+t10.t11) No new state computed
Name = +t11 No new state computed
Name = (+t5.t2+t4.t3+t3.t4+t2.t5) No new state computed
Name = (+t8.t7+t7.t8) No new state computed
Name = (+t9.t4+t4.t9) No new state computed
Name = (+t6.t5+t5.t6) No new state computed
Name = (+t6.t2+t2.t6) No new state computed
Name = (+t13.t12+t12.t13) No new state computed
Name = (+t10.t5+t5.t10) No new state computed
Name = +t13 No new state computed
Name = +t4 No new state computed
Name = (+t4.t1+t1.t4) No new state computed
Name = +t2 No new state computed
Name = (+t13.t11+t11.t13) No new state computed
Name = +t8  OK !
Now we have a representation of size = 52
Name = (+t11.t10+t10.t11) No new state computed
Name = (+t9.t8+t8.t9)  I.N.C.R.E.A.S.E
Name = (+t9.t2+t2.t9)  I.N.C.R.E.A.S.E
Name = (+t6.t2+t2.t6) No new state computed
Name = (+t13.t12+t12.t13) No new state computed
Name = (+t9.t4+t4.t9) No new state computed
Name = (+t13.t11+t11.t13) No new state computed
Name = (+t10.t9+t9.t10)  OK !
Now we have a representation of size = 52
Name = (+t2.t1+t1.t2) No new state computed
Name = +t8 No new state computed
Name = (+t9.t8+t8.t9)  I.N.C.R.E.A.S.E
Name = (+t10.t5+t5.t10) No new state computed
Name = (+t12.t9+t9.t12) No new state computed
Name = (+t8.t7+t7.t8) No new state computed
Name = (+t13.t11+t11.t13)  OK !
Now we have a representation of size = 52
Name = (+t6.t4+t4.t6) No new state computed
Name = (+t6.t2+t2.t6) No new state computed
Name = (+t6.t5+t5.t6) No new state computed
Name = +t12 No new state computed
Name = +t4 No new state computed
Name = +t11  OK !
Now we have a representation of size = 52
Name = (+t10.t3+t3.t10) No new state computed
Name = (+t9.t4+t4.t9) No new state computed
Name = (+t3.t1+t1.t3)  I.N.C.R.E.A.S.E
Name = (+t10.t5+t5.t10) No new state computed
Name = (+t10.t9+t9.t10) No new state computed
Name = (+t6.t4+t4.t6) No new state computed
Name = (+t9.t2+t2.t9)  I.N.C.R.E.A.S.E
Name = +t6 No new state computed
Name = (+t8.t7+t7.t8) No new state computed
Name = (+t6.t3+t3.t6)  I.N.C.R.E.A.S.E
Name = +t3  I.N.C.R.E.A.S.E
Name = (+t11.t10+t10.t11) No new state computed
Name = (+t5.t1+t1.t5) No new state computed
Name = +t7 No new state computed
Name = +t8 No new state computed
Name = +t2 No new state computed
Name = (+t9.t8+t8.t9)  I.N.C.R.E.A.S.E
Name = +t5 No new state computed
Name = (+t13.t12+t12.t13) No new state computed
Name = +t10 No new state computed
Name = (+t2.t1+t1.t2) No new state computed
Name = +t1 No new state computed
Name = (+t13.t11+t11.t13) No new state computed
Name = (+t6.t2+t2.t6) No new state computed
Name = +t12 No new state computed
Name = (+t10.t7+t7.t10) No new state computed
Name = +t9  I.N.C.R.E.A.S.E
Name = (+t6.t5+t5.t6) No new state computed
Name = (+t4.t1+t1.t4) No new state computed
Name = (+t5.t2+t4.t3+t3.t4+t2.t5) No new state computed
Name = +t4 No new state computed
Name = +t13 No new state computed
Name = (+t12.t9+t9.t12)  I.N.C.R.E.A.S.E
increase = 1
**********************
Random choose
Name = (+t12.t9+t9.t12)  OK !
Now we have a representation of size = 57
Minimization in Progress
Name = (+t9.t8+t8.t9)  OK !
Now we have a representation of size = 55
Name = (+t6.t2+t2.t6)  I.N.C.R.E.A.S.E
Name = (+t13.t11+t11.t13) No new state computed
Name = +t12 No new state computed
Name = (+t9.t2+t2.t9)  I.N.C.R.E.A.S.E
Name = +t8 No new state computed
Name = (+t6.t4+t4.t6) No new state computed
Name = (+t9.t4+t4.t9) No new state computed
Name = (+t5.t1+t1.t5) No new state computed
Name = +t4 No new state computed
Name = (+t6.t5+t5.t6) No new state computed
Name = (+t3.t1+t1.t3)  I.N.C.R.E.A.S.E
Name = (+t11.t10+t10.t11) No new state computed
Name = +t9 No new state computed
Name = +t3  I.N.C.R.E.A.S.E
Name = +t1 No new state computed
Name = +t2  I.N.C.R.E.A.S.E
Name = (+t8.t7+t7.t8) No new state computed
Name = +t7 No new state computed
Name = (+t10.t3+t3.t10)  I.N.C.R.E.A.S.E
Name = (+t10.t9+t9.t10) No new state computed
Name = +t13 No new state computed
Name = (+t10.t7+t7.t10) No new state computed
Name = (+t2.t1+t1.t2)  I.N.C.R.E.A.S.E
Name = (+t6.t3+t3.t6)  I.N.C.R.E.A.S.E
Name = +t5 No new state computed
Name = +t11 No new state computed
Name = +t10 No new state computed
Name = (+t12.t9+t9.t12) No new state computed
Name = (+t10.t5+t5.t10) No new state computed
Name = +t6 No new state computed
Name = (+t5.t2+t4.t3+t3.t4+t2.t5) No new state computed
Name = (+t13.t12+t12.t13) No new state computed
Name = (+t4.t1+t1.t4) No new state computed
increase = 1
**********************
Random choose
Name = (+t6.t3+t3.t6)  OK !
Now we have a representation of size = 61
Minimization in Progress
Name = (+t3.t1+t1.t3)  OK !
Now we have a representation of size = 61
Name = (+t10.t7+t7.t10) No new state computed
Name = (+t5.t1+t1.t5) No new state computed
Name = (+t4.t1+t1.t4) No new state computed
Name = +t3 No new state computed
Name = (+t9.t2+t2.t9)  I.N.C.R.E.A.S.E
Name = (+t9.t8+t8.t9) No new state computed
Name = (+t10.t5+t5.t10) No new state computed
Name = (+t6.t3+t3.t6) No new state computed
Name = +t4 No new state computed
Name = +t13 No new state computed
Name = (+t13.t11+t11.t13) No new state computed
Name = (+t5.t2+t4.t3+t3.t4+t2.t5) No new state computed
Name = (+t2.t1+t1.t2)  I.N.C.R.E.A.S.E
Name = +t7 No new state computed
Name = (+t6.t2+t2.t6)  I.N.C.R.E.A.S.E
Name = +t2  I.N.C.R.E.A.S.E
Name = +t1 No new state computed
Name = +t8 No new state computed
Name = (+t9.t4+t4.t9) No new state computed
Name = +t9 No new state computed
Name = (+t10.t3+t3.t10) No new state computed
Name = (+t10.t9+t9.t10) No new state computed
Name = (+t6.t5+t5.t6) No new state computed
Name = +t12 No new state computed
Name = +t11 No new state computed
Name = +t5 No new state computed
Name = (+t11.t10+t10.t11) No new state computed
Name = (+t12.t9+t9.t12) No new state computed
Name = +t6 No new state computed
Name = (+t13.t12+t12.t13) No new state computed
Name = (+t6.t4+t4.t6) No new state computed
Name = +t10 No new state computed
Name = (+t8.t7+t7.t8) No new state computed
increase = 1
**********************
Random choose
Name = +t2  OK !
Now we have a representation of size = 67
Minimization in Progress
Name = (+t10.t7+t7.t10) No new state computed
Name = (+t9.t8+t8.t9) No new state computed
Name = +t3 No new state computed
Name = (+t4.t1+t1.t4) No new state computed
Name = +t11 No new state computed
Name = (+t2.t1+t1.t2)  OK !
Now we have a representation of size = 66
Name = (+t12.t9+t9.t12) No new state computed
Name = (+t6.t5+t5.t6) No new state computed
Name = (+t13.t12+t12.t13) No new state computed
Name = (+t10.t7+t7.t10) No new state computed
Name = +t9 No new state computed
Name = +t6 No new state computed
Name = (+t10.t3+t3.t10) No new state computed
Name = +t4 No new state computed
Name = (+t4.t1+t1.t4) No new state computed
Name = (+t13.t11+t11.t13) No new state computed
Name = +t13 No new state computed
Name = +t10 No new state computed
Name = (+t6.t2+t2.t6) No new state computed
Name = +t3 No new state computed
Name = (+t9.t2+t2.t9) No new state computed
Name = +t7 No new state computed
Name = (+t10.t5+t5.t10) No new state computed
Name = +t2 No new state computed
Name = +t1 No new state computed
Name = +t11 No new state computed
Name = (+t11.t10+t10.t11) No new state computed
Name = (+t8.t7+t7.t8) No new state computed
Name = (+t6.t4+t4.t6) No new state computed
Name = (+t3.t1+t1.t3) No new state computed
Name = (+t9.t8+t8.t9) No new state computed
Name = +t5 No new state computed
Name = (+t5.t1+t1.t5) No new state computed
Name = +t8 No new state computed
Name = (+t10.t9+t9.t10) No new state computed
Name = +t12 No new state computed
Name = (+t6.t3+t3.t6) No new state computed
Name = (+t5.t2+t4.t3+t3.t4+t2.t5) No new state computed
Name = (+t9.t4+t4.t9) No new state computed
increase = 0
nb accelerations 11
Fix point FOUND
seed is : 21768
