current set encoding is : prestaf
seed is : 2691
(1/25)->
(2/25)->
(3/25)->
(4/25)->
(5/25)->
(6/25)->
(7/25)->
(8/25)->
(9/25)->
(10/25)->
(11/25)->
(12/25)->
(13/25)->
(14/25)->
(15/25)->
(16/25)->
(17/25)->
(18/25)->
(19/25)->
(20/25)->
(21/25)->
(22/25)->
(23/25)->
(24/25)->
(25/25)->
Simplification of the linear system 
1 functions have the same action, it remains only 1
1 functions have the same action, it remains only 1
1 functions have the same action, it remains only 1
1 functions have the same action, it remains only 1
1 functions have the same action, it remains only 1
1 functions have the same action, it remains only 1
1 functions have the same action, it remains only 1
2 functions have the same action, it remains only 1
1 functions have the same action, it remains only 1
2 functions have the same action, it remains only 1
1 functions have the same action, it remains only 1
1 functions have the same action, it remains only 1
1 functions have the same action, it remains only 1
Number of actions before simplification : 15
Number of actions after simplification  : 13
(1/65)->
(2/65)->
(3/65)->
(4/65)->
(5/65)->
(6/65)->
(7/65)->
(8/65)->
(9/65)->
(10/65)->
(11/65)->
(12/65)->
(13/65)->
(14/65)->
(15/65)->
(16/65)->
(17/65)->
(18/65)->
(19/65)->
(20/65)->
(21/65)->
(22/65)->
(23/65)->
(24/65)->
(25/65)->
(26/65)->
(27/65)->
(28/65)->
(29/65)->
(30/65)->
(31/65)->
(32/65)->
(33/65)->
(34/65)->
(35/65)->
(36/65)->
(37/65)->
(38/65)->
(39/65)->
(40/65)->
(41/65)->
(42/65)->
(43/65)->
(44/65)->
(45/65)->
(46/65)->
(47/65)->
(48/65)->
(49/65)->
(50/65)->
(51/65)->
(52/65)->
(53/65)->
(54/65)->
(55/65)->
(56/65)->
(57/65)->
(58/65)->
(59/65)->
(60/65)->
(61/65)->
(62/65)->
(63/65)->
(64/65)->
(65/65)->
Simplification of the linear system 
1 functions have the same action, it remains only 1
2 functions have the same action, it remains only 1
1 functions have the same action, it remains only 1
2 functions have the same action, it remains only 1
2 functions have the same action, it remains only 1
1 functions have the same action, it remains only 1
1 functions have the same action, it remains only 1
2 functions have the same action, it remains only 1
2 functions have the same action, it remains only 1
1 functions have the same action, it remains only 1
2 functions have the same action, it remains only 1
1 functions have the same action, it remains only 1
2 functions have the same action, it remains only 1
2 functions have the same action, it remains only 1
1 functions have the same action, it remains only 1
1 functions have the same action, it remains only 1
3 functions have the same action, it remains only 1
3 functions have the same action, it remains only 1
3 functions have the same action, it remains only 1
1 functions have the same action, it remains only 1
2 functions have the same action, it remains only 1
2 functions have the same action, it remains only 1
1 functions have the same action, it remains only 1
1 functions have the same action, it remains only 1
Number of actions before simplification : 40
Number of actions after simplification  : 24
cycles of length 3
(1/24), name = +r3.+r5.r3, size = 57
(2/24), name = (+r1.+r3++r1.r3), size = 48
(3/24), name = ++r3, size = 33
(4/24), name = (+r1.+r3.r5+r3.(+r5.r1+r1.r5)), size = 130
(5/24), name = (+r3.+r5++r3.r5), size = 86
(6/24), name = +r3.(+r5.r2+r2.r5), size = 51
(7/24), name = +r4.(+r5.r1+r1.r5), size = 49
(8/24), name = (+r4.+r5++r4.r5), size = 86
(9/24), name = (+r2.+r4.r5+r4.(+r5.r2+r2.r5)), size = 159
(10/24), name = ++r4, size = 53
(11/24), name = (+r2.+r4++r2.r4), size = 70
(12/24), name = +r4.+r5.r4, size = 84
(13/24), name = (+r5.+r1.r3+r1.+r5.r3), size = 427
(14/24), name = (+r5.+r3++r5.r3), size = 170
(15/24), name = +r2.+r5.r3, size = 181
(16/24), name = +r5.+r3.r5, size = 132
(17/24), name = (+r1.+r5+r5.+r1+(+r5.r1+r1.r5)), size = 231
(18/24), name = (+r2.(+r5.r1+r1.r5)+r1.(+r5.r2+r2.r5)++r5), size = 58
(19/24), name = (+r2.+r5+r5.+r2+(+r5.r2+r2.r5)), size = 276
(20/24), name = +r5.+r4.r5, size = 118
(21/24), name = (+r5.+r4++r5.r4), size = 298
(22/24), name = (+r5.+r2.r4+r2.+r5.r4), size = 490
(23/24), name = ++r1, size = 55
(24/24), name = ++r2, size = 59
**********************
Random choose
Name = ++r4  No new state computed
Name = (+r1.+r3++r1.r3)  No new state computed
Name = (+r2.+r4.r5+r4.(+r5.r2+r2.r5))  OK !
Now we have a representation of size = 15
Minimization in Progress
Name = (+r5.+r4++r5.r4) No new state computed
Name = ++r4 No new state computed
Name = +r2.+r5.r3 No new state computed
Name = +r5.+r4.r5 No new state computed
Name = (+r1.+r5+r5.+r1+(+r5.r1+r1.r5)) No new state computed
Name = (+r1.+r3++r1.r3)  I.N.C.R.E.A.S.E
Name = +r3.(+r5.r2+r2.r5) No new state computed
Name = (+r4.+r5++r4.r5) No new state computed
Name = ++r3 No new state computed
Name = (+r5.+r1.r3+r1.+r5.r3) No new state computed
Name = (+r1.+r3.r5+r3.(+r5.r1+r1.r5)) No new state computed
Name = (+r3.+r5++r3.r5) No new state computed
Name = +r4.+r5.r4 No new state computed
Name = +r5.+r3.r5 No new state computed
Name = (+r2.+r5+r5.+r2+(+r5.r2+r2.r5)) No new state computed
Name = +r3.+r5.r3 No new state computed
Name = (+r5.+r3++r5.r3) No new state computed
Name = (+r2.+r4++r2.r4)  I.N.C.R.E.A.S.E
Name = ++r1  I.N.C.R.E.A.S.E
Name = +r4.(+r5.r1+r1.r5) No new state computed
Name = ++r2  I.N.C.R.E.A.S.E
Name = (+r2.(+r5.r1+r1.r5)+r1.(+r5.r2+r2.r5)++r5) No new state computed
Name = (+r5.+r2.r4+r2.+r5.r4) No new state computed
increase = 1
**********************
Random choose
Name = ++r2  OK !
Now we have a representation of size = 23
Minimization in Progress
Name = +r4.+r5.r4 No new state computed
Name = ++r1  I.N.C.R.E.A.S.E
Name = +r5.+r3.r5 No new state computed
Name = (+r5.+r2.r4+r2.+r5.r4) No new state computed
Name = (+r1.+r3.r5+r3.(+r5.r1+r1.r5)) No new state computed
Name = (+r1.+r3++r1.r3)  I.N.C.R.E.A.S.E
Name = (+r2.+r4++r2.r4)  I.N.C.R.E.A.S.E
Name = ++r4  I.N.C.R.E.A.S.E
Name = +r2.+r5.r3 No new state computed
Name = (+r2.(+r5.r1+r1.r5)+r1.(+r5.r2+r2.r5)++r5) No new state computed
Name = (+r2.+r5+r5.+r2+(+r5.r2+r2.r5)) No new state computed
Name = +r5.+r4.r5 No new state computed
Name = (+r1.+r5+r5.+r1+(+r5.r1+r1.r5)) No new state computed
Name = (+r5.+r1.r3+r1.+r5.r3) No new state computed
Name = ++r3 No new state computed
Name = (+r5.+r4++r5.r4) No new state computed
Name = (+r4.+r5++r4.r5) No new state computed
Name = (+r5.+r3++r5.r3) No new state computed
Name = +r4.(+r5.r1+r1.r5)  I.N.C.R.E.A.S.E
Name = (+r3.+r5++r3.r5) No new state computed
Name = +r3.(+r5.r2+r2.r5) No new state computed
Name = +r3.+r5.r3 No new state computed
Name = (+r2.+r4.r5+r4.(+r5.r2+r2.r5)) No new state computed
increase = 1
**********************
Random choose
Name = +r4.(+r5.r1+r1.r5)  OK !
Now we have a representation of size = 60
Minimization in Progress
Name = +r2.+r5.r3 No new state computed
Name = (+r5.+r2.r4+r2.+r5.r4) No new state computed
Name = ++r2 No new state computed
Name = +r3.+r5.r3 No new state computed
Name = (+r1.+r5+r5.+r1+(+r5.r1+r1.r5)) No new state computed
Name = +r5.+r4.r5 No new state computed
Name = (+r5.+r1.r3+r1.+r5.r3) No new state computed
Name = (+r5.+r3++r5.r3) No new state computed
Name = (+r2.+r4.r5+r4.(+r5.r2+r2.r5)) No new state computed
Name = (+r1.+r3.r5+r3.(+r5.r1+r1.r5)) No new state computed
Name = (+r4.+r5++r4.r5) No new state computed
Name = (+r1.+r3++r1.r3)  I.N.C.R.E.A.S.E
Name = (+r3.+r5++r3.r5) No new state computed
Name = (+r5.+r4++r5.r4) No new state computed
Name = ++r4  I.N.C.R.E.A.S.E
Name = (+r2.+r5+r5.+r2+(+r5.r2+r2.r5)) No new state computed
Name = (+r2.+r4++r2.r4)  I.N.C.R.E.A.S.E
Name = +r3.(+r5.r2+r2.r5) No new state computed
Name = +r4.+r5.r4 No new state computed
Name = ++r3  I.N.C.R.E.A.S.E
Name = +r5.+r3.r5 No new state computed
Name = ++r1 No new state computed
Name = (+r2.(+r5.r1+r1.r5)+r1.(+r5.r2+r2.r5)++r5) No new state computed
increase = 1
**********************
Random choose
Name = ++r3  OK !
Now we have a representation of size = 61
Minimization in Progress
Name = (+r3.+r5++r3.r5) No new state computed
Name = (+r1.+r3.r5+r3.(+r5.r1+r1.r5)) No new state computed
Name = ++r2 No new state computed
Name = (+r2.+r5+r5.+r2+(+r5.r2+r2.r5)) No new state computed
Name = (+r1.+r3++r1.r3) No new state computed
Name = +r4.+r5.r4 No new state computed
Name = +r3.(+r5.r2+r2.r5) No new state computed
Name = (+r2.+r4++r2.r4)  I.N.C.R.E.A.S.E
Name = ++r1 No new state computed
Name = +r2.+r5.r3 No new state computed
Name = (+r5.+r1.r3+r1.+r5.r3) No new state computed
Name = (+r5.+r3++r5.r3) No new state computed
Name = (+r5.+r4++r5.r4) No new state computed
Name = +r3.+r5.r3 No new state computed
Name = ++r4  I.N.C.R.E.A.S.E
Name = (+r2.+r4.r5+r4.(+r5.r2+r2.r5)) No new state computed
Name = (+r2.(+r5.r1+r1.r5)+r1.(+r5.r2+r2.r5)++r5) No new state computed
Name = +r5.+r4.r5 No new state computed
Name = (+r5.+r2.r4+r2.+r5.r4)  I.N.C.R.E.A.S.E
Name = +r5.+r3.r5 No new state computed
Name = +r4.(+r5.r1+r1.r5) No new state computed
Name = (+r4.+r5++r4.r5) No new state computed
Name = (+r1.+r5+r5.+r1+(+r5.r1+r1.r5)) No new state computed
increase = 1
**********************
Random choose
Name = (+r5.+r2.r4+r2.+r5.r4)  OK !
Now we have a representation of size = 73
Minimization in Progress
Name = +r5.+r3.r5 No new state computed
Name = ++r2 No new state computed
Name = +r3.(+r5.r2+r2.r5) No new state computed
Name = +r5.+r4.r5 No new state computed
Name = +r4.+r5.r4 No new state computed
Name = (+r1.+r3++r1.r3) No new state computed
Name = (+r2.+r4++r2.r4)  OK !
Now we have a representation of size = 73
Name = (+r5.+r1.r3+r1.+r5.r3) No new state computed
Name = +r4.(+r5.r1+r1.r5) No new state computed
Name = (+r1.+r5+r5.+r1+(+r5.r1+r1.r5)) No new state computed
Name = ++r1 No new state computed
Name = (+r3.+r5++r3.r5) No new state computed
Name = +r5.+r3.r5 No new state computed
Name = (+r2.+r5+r5.+r2+(+r5.r2+r2.r5)) No new state computed
Name = ++r4 No new state computed
Name = (+r4.+r5++r4.r5) No new state computed
Name = (+r2.+r4.r5+r4.(+r5.r2+r2.r5)) No new state computed
Name = +r4.+r5.r4 No new state computed
Name = (+r5.+r2.r4+r2.+r5.r4) No new state computed
Name = ++r2 No new state computed
Name = (+r1.+r3++r1.r3) No new state computed
Name = (+r5.+r4++r5.r4) No new state computed
Name = +r2.+r5.r3 No new state computed
Name = (+r2.(+r5.r1+r1.r5)+r1.(+r5.r2+r2.r5)++r5) No new state computed
Name = +r3.+r5.r3 No new state computed
Name = +r5.+r4.r5 No new state computed
Name = (+r1.+r3.r5+r3.(+r5.r1+r1.r5)) No new state computed
Name = ++r3 No new state computed
Name = (+r5.+r3++r5.r3) No new state computed
Name = +r3.(+r5.r2+r2.r5) No new state computed
increase = 0
nb accelerations 6
Fix point FOUND
seed is : 2691
