current set encoding is : lira
seed is : 2691
cycles of length 1
(1/9), name = t1, size = 9
(2/9), name = t2, size = 10
(3/9), name = t3, size = 10
(4/9), name = t4, size = 9
(5/9), name = t5, size = 10
(6/9), name = t6, size = 10
(7/9), name = t7, size = 9
(8/9), name = t8, size = 10
(9/9), name = t9, size = 10
**********************
Random choose
Name = t4  OK !
Now we have a representation of size = 8
Minimization in Progress
Name = t1  I.N.C.R.E.A.S.E
Name = t3 No new state computed
Name = t6 No new state computed
Name = t7  I.N.C.R.E.A.S.E
Name = t5  I.N.C.R.E.A.S.E
Name = t9 No new state computed
Name = t2 No new state computed
Name = t8 No new state computed
increase = 1
**********************
Random choose
Name = t5  OK !
Now we have a representation of size = 10
Minimization in Progress
Name = t3 No new state computed
Name = t4 No new state computed
Name = t1  I.N.C.R.E.A.S.E
Name = t9 No new state computed
Name = t2 No new state computed
Name = t7  I.N.C.R.E.A.S.E
Name = t6 No new state computed
Name = t8 No new state computed
increase = 1
**********************
Random choose
Name = t7  OK !
Now we have a representation of size = 17
Minimization in Progress
Name = t6 No new state computed
Name = t1  I.N.C.R.E.A.S.E
Name = t4  I.N.C.R.E.A.S.E
Name = t8  I.N.C.R.E.A.S.E
Name = t2 No new state computed
Name = t3 No new state computed
Name = t5 No new state computed
Name = t9 No new state computed
increase = 1
**********************
Random choose
Name = t8  OK !
Now we have a representation of size = 19
Minimization in Progress
Name = t9 No new state computed
Name = t4  I.N.C.R.E.A.S.E
Name = t7 No new state computed
Name = t6 No new state computed
Name = t3 No new state computed
Name = t1  I.N.C.R.E.A.S.E
Name = t5 No new state computed
Name = t2 No new state computed
increase = 1
**********************
Random choose
Name = t1  OK !
Now we have a representation of size = 42
Minimization in Progress
Name = t5 No new state computed
Name = t7  I.N.C.R.E.A.S.E
Name = t9 No new state computed
Name = t2  I.N.C.R.E.A.S.E
Name = t4  I.N.C.R.E.A.S.E
Name = t3 No new state computed
Name = t6 No new state computed
Name = t8 No new state computed
increase = 1
**********************
Random choose
Name = t4  OK !
Now we have a representation of size = 54
Minimization in Progress
Name = t9 No new state computed
Name = t8 No new state computed
Name = t2  I.N.C.R.E.A.S.E
Name = t7  I.N.C.R.E.A.S.E
Name = t5 No new state computed
Name = t6 No new state computed
Name = t1  OK !
Now we have a representation of size = 54
Name = t5 No new state computed
Name = t8 No new state computed
Name = t6 No new state computed
Name = t2  I.N.C.R.E.A.S.E
Name = t9 No new state computed
Name = t3 No new state computed
Name = t4 No new state computed
Name = t7  I.N.C.R.E.A.S.E
increase = 1
**********************
Random choose
Name = t7  OK !
Now we have a representation of size = 57
Minimization in Progress
Name = t9 No new state computed
Name = t4  OK !
Now we have a representation of size = 57
Name = t2  I.N.C.R.E.A.S.E
Name = t5 No new state computed
Name = t1 No new state computed
Name = t3 No new state computed
Name = t7 No new state computed
Name = t9 No new state computed
Name = t8 No new state computed
Name = t6 No new state computed
increase = 1
**********************
Random choose
Name = t2  OK !
Now we have a representation of size = 68
Minimization in Progress
Name = t7 No new state computed
Name = t3 No new state computed
Name = t4 No new state computed
Name = t6 No new state computed
Name = t8 No new state computed
Name = t5 No new state computed
Name = t1 No new state computed
Name = t9 No new state computed
increase = 0
nb accelerations 10
Fix point FOUND
seed is : 2691
