current set encoding is : lira
seed is : 2691
(1/196)->
(2/196)->
(3/196)->
(4/196)->
(5/196)->
(6/196)->
(7/196)->
(8/196)->
(9/196)->
(10/196)->
(11/196)->
(12/196)->
(13/196)->
(14/196)->
(15/196)->
(16/196)->
(17/196)->
(18/196)->
(19/196)->
(20/196)->
(21/196)->
(22/196)->
(23/196)->
(24/196)->
(25/196)->
(26/196)->
(27/196)->
(28/196)->
(29/196)->
(30/196)->
(31/196)->
(32/196)->
(33/196)->
(34/196)->
(35/196)->
(36/196)->
(37/196)->
(38/196)->
(39/196)->
(40/196)->
(41/196)->
(42/196)->
(43/196)->
(44/196)->
(45/196)->
(46/196)->
(47/196)->
(48/196)->
(49/196)->
(50/196)->
(51/196)->
(52/196)->
(53/196)->
(54/196)->
(55/196)->
(56/196)->
(57/196)->
(58/196)->
(59/196)->
(60/196)->
(61/196)->
(62/196)->
(63/196)->
(64/196)->
(65/196)->
(66/196)->
(67/196)->
(68/196)->
(69/196)->
(70/196)->
(71/196)->
(72/196)->
(73/196)->
(74/196)->
(75/196)->
(76/196)->
(77/196)->
(78/196)->
(79/196)->
(80/196)->
(81/196)->
(82/196)->
(83/196)->
(84/196)->
(85/196)->
(86/196)->
(87/196)->
(88/196)->
(89/196)->
(90/196)->
(91/196)->
(92/196)->
(93/196)->
(94/196)->
(95/196)->
(96/196)->
(97/196)->
(98/196)->
(99/196)->
(100/196)->
(101/196)->
(102/196)->
(103/196)->
(104/196)->
(105/196)->
(106/196)->
(107/196)->
(108/196)->
(109/196)->
(110/196)->
(111/196)->
(112/196)->
(113/196)->
(114/196)->
(115/196)->
(116/196)->
(117/196)->
(118/196)->
(119/196)->
(120/196)->
(121/196)->
(122/196)->
(123/196)->
(124/196)->
(125/196)->
(126/196)->
(127/196)->
(128/196)->
(129/196)->
(130/196)->
(131/196)->
(132/196)->
(133/196)->
(134/196)->
(135/196)->
(136/196)->
(137/196)->
(138/196)->
(139/196)->
(140/196)->
(141/196)->
(142/196)->
(143/196)->
(144/196)->
(145/196)->
(146/196)->
(147/196)->
(148/196)->
(149/196)->
(150/196)->
(151/196)->
(152/196)->
(153/196)->
(154/196)->
(155/196)->
(156/196)->
(157/196)->
(158/196)->
(159/196)->
(160/196)->
(161/196)->
(162/196)->
(163/196)->
(164/196)->
(165/196)->
(166/196)->
(167/196)->
(168/196)->
(169/196)->
(170/196)->
(171/196)->
(172/196)->
(173/196)->
(174/196)->
(175/196)->
(176/196)->
(177/196)->
(178/196)->
(179/196)->
(180/196)->
(181/196)->
(182/196)->
(183/196)->
(184/196)->
(185/196)->
(186/196)->
(187/196)->
(188/196)->
(189/196)->
(190/196)->
(191/196)->
(192/196)->
(193/196)->
(194/196)->
(195/196)->
(196/196)->
Simplification of the linear system 
2 functions have the same action, it remains only 1
2 functions have the same action, it remains only 1
1 functions have the same action, it remains only 1
1 functions have the same action, it remains only 1
1 functions have the same action, it remains only 1
1 functions have the same action, it remains only 1
1 functions have the same action, it remains only 1
1 functions have the same action, it remains only 1
2 functions have the same action, it remains only 1
1 functions have the same action, it remains only 1
1 functions have the same action, it remains only 1
2 functions have the same action, it remains only 1
2 functions have the same action, it remains only 1
2 functions have the same action, it remains only 1
2 functions have the same action, it remains only 1
2 functions have the same action, it remains only 1
1 functions have the same action, it remains only 1
1 functions have the same action, it remains only 1
2 functions have the same action, it remains only 1
1 functions have the same action, it remains only 1
1 functions have the same action, it remains only 1
1 functions have the same action, it remains only 1
2 functions have the same action, it remains only 1
2 functions have the same action, it remains only 1
1 functions have the same action, it remains only 1
2 functions have the same action, it remains only 1
1 functions have the same action, it remains only 1
1 functions have the same action, it remains only 1
1 functions have the same action, it remains only 1
1 functions have the same action, it remains only 1
2 functions have the same action, it remains only 1
1 functions have the same action, it remains only 1
1 functions have the same action, it remains only 1
1 functions have the same action, it remains only 1
1 functions have the same action, it remains only 1
1 functions have the same action, it remains only 1
1 functions have the same action, it remains only 1
1 functions have the same action, it remains only 1
1 functions have the same action, it remains only 1
1 functions have the same action, it remains only 1
1 functions have the same action, it remains only 1
1 functions have the same action, it remains only 1
1 functions have the same action, it remains only 1
2 functions have the same action, it remains only 1
1 functions have the same action, it remains only 1
1 functions have the same action, it remains only 1
1 functions have the same action, it remains only 1
1 functions have the same action, it remains only 1
1 functions have the same action, it remains only 1
1 functions have the same action, it remains only 1
1 functions have the same action, it remains only 1
1 functions have the same action, it remains only 1
1 functions have the same action, it remains only 1
1 functions have the same action, it remains only 1
1 functions have the same action, it remains only 1
1 functions have the same action, it remains only 1
1 functions have the same action, it remains only 1
1 functions have the same action, it remains only 1
1 functions have the same action, it remains only 1
1 functions have the same action, it remains only 1
1 functions have the same action, it remains only 1
1 functions have the same action, it remains only 1
1 functions have the same action, it remains only 1
1 functions have the same action, it remains only 1
1 functions have the same action, it remains only 1
1 functions have the same action, it remains only 1
1 functions have the same action, it remains only 1
1 functions have the same action, it remains only 1
1 functions have the same action, it remains only 1
1 functions have the same action, it remains only 1
1 functions have the same action, it remains only 1
1 functions have the same action, it remains only 1
1 functions have the same action, it remains only 1
1 functions have the same action, it remains only 1
Number of actions before simplification : 88
Number of actions after simplification  : 74
cycles of length 2
(1/74), name = (+r6.r5+r5.r6), size = 23
(2/74), name = (+r13.r12+r12.r13), size = 23
(3/74), name = +r3.r6, size = 39
(4/74), name = +r3.r13, size = 39
(5/74), name = +r6.r3, size = 39
(6/74), name = +r13.r3, size = 39
(7/74), name = +r10.r6, size = 39
(8/74), name = +r6.r10, size = 39
(9/74), name = (+r11.r6+r6.r11), size = 55
(10/74), name = +r10.r13, size = 39
(11/74), name = +r13.r10, size = 39
(12/74), name = (+r13.r11+r11.r13), size = 55
(13/74), name = (+r14.r13+r13.r14), size = 23
(14/74), name = (+r6.r4+r4.r6), size = 55
(15/74), name = (+r13.r4+r4.r13), size = 55
(16/74), name = (+r7.r6+r6.r7), size = 23
(17/74), name = +r6, size = 22
(18/74), name = +r13, size = 22
(19/74), name = (+r5.r2+r2.r5), size = 10
(20/74), name = +r5.r3, size = 14
(21/74), name = +r10.r5, size = 22
(22/74), name = +r3.r12, size = 22
(23/74), name = (+r5.r4+r4.r5), size = 10
(24/74), name = (+r12.r9+r9.r12), size = 10
(25/74), name = +r12.r10, size = 14
(26/74), name = (+r12.r11+r11.r12), size = 10
(27/74), name = +r12.r5, size = 21
(28/74), name = +r5.r12, size = 22
(29/74), name = +r5, size = 10
(30/74), name = +r12, size = 10
(31/74), name = (+r2.r1+r1.r2), size = 10
(32/74), name = +r2.r3, size = 9
(33/74), name = +r3.r2, size = 14
(34/74), name = +r2.r10, size = 22
(35/74), name = +r10.r2, size = 22
(36/74), name = +r2, size = 10
(37/74), name = +r2.r14, size = 21
(38/74), name = +r14.r2, size = 22
(39/74), name = +r9.r3, size = 21
(40/74), name = +r3.r9, size = 22
(41/74), name = +r3, size = 10
(42/74), name = +r11.r3, size = 21
(43/74), name = +r3.r11, size = 22
(44/74), name = (+r9.r8+r8.r9), size = 10
(45/74), name = +r9.r10, size = 10
(46/74), name = +r10.r9, size = 14
(47/74), name = +r9, size = 10
(48/74), name = +r10, size = 10
(49/74), name = +r11.r10, size = 10
(50/74), name = +r10.r11, size = 14
(51/74), name = +r11, size = 10
(52/74), name = +r9.r14, size = 13
(53/74), name = +r14.r9, size = 10
(54/74), name = +r14, size = 10
(55/74), name = +r11.r14, size = 21
(56/74), name = +r14.r11, size = 22
