current set encoding is : prestaf-no-among
seed is : 2691
cycles of length 1
(1/10), name = r1, size = 215
(2/10), name = r2, size = 273
(3/10), name = r3, size = 233
(4/10), name = r4, size = 227
(5/10), name = r5, size = 189
(6/10), name = r6, size = 272
(7/10), name = r7, size = 252
(8/10), name = r8, size = 392
(9/10), name = r9, size = 119
(10/10), name = r10, size = 119
**********************
Random choose
Name = r4  No new state computed
Name = r1  OK !
Now we have a representation of size = 17
Minimization in Progress
Name = r4  OK !
Now we have a representation of size = 17
Name = r8  I.N.C.R.E.A.S.E
Name = r10 No new state computed
Name = r5  I.N.C.R.E.A.S.E
Name = r6  I.N.C.R.E.A.S.E
Name = r7  I.N.C.R.E.A.S.E
Name = r1 No new state computed
Name = r9 No new state computed
Name = r3 No new state computed
Name = r2 No new state computed
increase = 1
**********************
Random choose
Name = r7  OK !
Now we have a representation of size = 48
Minimization in Progress
Name = r9 No new state computed
Name = r3 No new state computed
Name = r8  OK !
Now we have a representation of size = 36
Name = r4 No new state computed
Name = r6  I.N.C.R.E.A.S.E
Name = r5  I.N.C.R.E.A.S.E
Name = r1 No new state computed
Name = r3 No new state computed
Name = r7 No new state computed
Name = r2 No new state computed
Name = r9 No new state computed
Name = r10  I.N.C.R.E.A.S.E
increase = 1
**********************
Random choose
Name = r10  OK !
Now we have a representation of size = 38
Minimization in Progress
Name = r7 No new state computed
Name = r8 No new state computed
Name = r4 No new state computed
Name = r9 No new state computed
Name = r6  I.N.C.R.E.A.S.E
Name = r3 No new state computed
Name = r1 No new state computed
Name = r5  I.N.C.R.E.A.S.E
Name = r2 No new state computed
increase = 1
**********************
Random choose
Name = r5  OK !
Now we have a representation of size = 75
Minimization in Progress
Name = r6  OK !
Now we have a representation of size = 67
Name = r9  I.N.C.R.E.A.S.E
Name = r1 No new state computed
Name = r3 No new state computed
Name = r10 No new state computed
Name = r5 No new state computed
Name = r2 No new state computed
Name = r8 No new state computed
Name = r7 No new state computed
Name = r4 No new state computed
increase = 1
**********************
Random choose
Name = r9  OK !
Now we have a representation of size = 68
Minimization in Progress
Name = r2 No new state computed
Name = r6 No new state computed
Name = r7 No new state computed
Name = r4 No new state computed
Name = r3 No new state computed
Name = r5 No new state computed
Name = r10 No new state computed
Name = r8 No new state computed
Name = r1 No new state computed
increase = 0
nb accelerations 8
Fix point FOUND
seed is : 2691
