current set encoding is : mona
seed is : 21768
cycles of length 1
(1/12), name = t1, size = 930
(2/12), name = t2, size = 966
(3/12), name = t3, size = 492
(4/12), name = t4, size = 492
(5/12), name = t5, size = 492
(6/12), name = t6, size = 942
(7/12), name = t7, size = 858
(8/12), name = t8, size = 966
(9/12), name = t9, size = 492
(10/12), name = t10, size = 492
(11/12), name = t11, size = 492
(12/12), name = t12, size = 906
**********************
Random choose
Name = t3  No new state computed
Name = t4  No new state computed
Name = t6  No new state computed
Name = t10  No new state computed
Name = t11  No new state computed
Name = t12  No new state computed
Name = t2  No new state computed
Name = t7  OK !
Now we have a representation of size = 32
Minimization in Progress
Name = t1  I.N.C.R.E.A.S.E
Name = t2 No new state computed
Name = t6 No new state computed
Name = t8  I.N.C.R.E.A.S.E
Name = t3 No new state computed
Name = t11 No new state computed
Name = t9 No new state computed
Name = t12 No new state computed
Name = t5 No new state computed
Name = t10 No new state computed
Name = t4 No new state computed
increase = 1
**********************
Random choose
Name = t8  OK !
Now we have a representation of size = 38
Minimization in Progress
Name = t4 No new state computed
Name = t11 No new state computed
Name = t12 No new state computed
Name = t3 No new state computed
Name = t9 No new state computed
Name = t10  I.N.C.R.E.A.S.E
Name = t7 No new state computed
Name = t5 No new state computed
Name = t6 No new state computed
Name = t1  I.N.C.R.E.A.S.E
Name = t2 No new state computed
increase = 1
**********************
Random choose
Name = t1  OK !
Now we have a representation of size = 43
Minimization in Progress
Name = t9 No new state computed
Name = t4 No new state computed
Name = t11 No new state computed
Name = t3  I.N.C.R.E.A.S.E
Name = t7 No new state computed
Name = t8 No new state computed
Name = t10  I.N.C.R.E.A.S.E
Name = t12 No new state computed
Name = t6 No new state computed
Name = t2  I.N.C.R.E.A.S.E
Name = t5 No new state computed
increase = 1
**********************
Random choose
Name = t2  OK !
Now we have a representation of size = 49
Minimization in Progress
Name = t7 No new state computed
Name = t6 No new state computed
Name = t10  I.N.C.R.E.A.S.E
Name = t9 No new state computed
Name = t5 No new state computed
Name = t12 No new state computed
Name = t11  I.N.C.R.E.A.S.E
Name = t8 No new state computed
Name = t4 No new state computed
Name = t1 No new state computed
Name = t3  I.N.C.R.E.A.S.E
increase = 1
**********************
Random choose
Name = t3  OK !
Now we have a representation of size = 53
Minimization in Progress
Name = t5 No new state computed
Name = t11  I.N.C.R.E.A.S.E
Name = t1 No new state computed
Name = t9 No new state computed
Name = t7 No new state computed
Name = t4  I.N.C.R.E.A.S.E
Name = t10  I.N.C.R.E.A.S.E
Name = t8  OK !
Now we have a representation of size = 53
Name = t4  I.N.C.R.E.A.S.E
Name = t6 No new state computed
Name = t5  I.N.C.R.E.A.S.E
Name = t3 No new state computed
Name = t7 No new state computed
Name = t12 No new state computed
Name = t11  I.N.C.R.E.A.S.E
Name = t10  I.N.C.R.E.A.S.E
Name = t2 No new state computed
Name = t9 No new state computed
Name = t1 No new state computed
increase = 1
**********************
Random choose
Name = t10  OK !
Now we have a representation of size = 61
Minimization in Progress
Name = t9 No new state computed
Name = t4  I.N.C.R.E.A.S.E
Name = t8 No new state computed
Name = t12  OK !
Now we have a representation of size = 61
Name = t1  OK !
Now we have a representation of size = 60
Name = t7  OK !
Now we have a representation of size = 60
Name = t8 No new state computed
Name = t9 No new state computed
Name = t11  OK !
Now we have a representation of size = 56
Name = t4  I.N.C.R.E.A.S.E
Name = t1 No new state computed
Name = t5  I.N.C.R.E.A.S.E
Name = t6 No new state computed
Name = t12 No new state computed
Name = t7 No new state computed
Name = t8 No new state computed
Name = t2 No new state computed
Name = t10 No new state computed
Name = t9 No new state computed
Name = t3 No new state computed
increase = 1
**********************
Random choose
Name = t5  OK !
Now we have a representation of size = 60
Minimization in Progress
Name = t6 No new state computed
Name = t2 No new state computed
Name = t9 No new state computed
Name = t7 No new state computed
Name = t1 No new state computed
Name = t3 No new state computed
Name = t11 No new state computed
Name = t12 No new state computed
Name = t4  I.N.C.R.E.A.S.E
Name = t8 No new state computed
Name = t10 No new state computed
increase = 1
**********************
Random choose
Name = t4  OK !
Now we have a representation of size = 62
Minimization in Progress
Name = t8 No new state computed
Name = t7  OK !
Now we have a representation of size = 60
Name = t9 No new state computed
Name = t2 No new state computed
Name = t6 No new state computed
Name = t3 No new state computed
Name = t11 No new state computed
Name = t4 No new state computed
Name = t10 No new state computed
Name = t1 No new state computed
Name = t5 No new state computed
Name = t8 No new state computed
Name = t12 No new state computed
increase = 0
nb accelerations 14
Fix point FOUND
seed is : 21768
