current set encoding is : lash-msdf
seed is : 3284
(1/196)->
(2/196)->
(3/196)->
(4/196)->
(5/196)->
(6/196)->
(7/196)->
(8/196)->
(9/196)->
(10/196)->
(11/196)->
(12/196)->
(13/196)->
(14/196)->
(15/196)->
(16/196)->
(17/196)->
(18/196)->
(19/196)->
(20/196)->
(21/196)->
(22/196)->
(23/196)->
(24/196)->
(25/196)->
(26/196)->
(27/196)->
(28/196)->
(29/196)->
(30/196)->
(31/196)->
(32/196)->
(33/196)->
(34/196)->
(35/196)->
(36/196)->
(37/196)->
(38/196)->
(39/196)->
(40/196)->
(41/196)->
(42/196)->
(43/196)->
(44/196)->
(45/196)->
(46/196)->
(47/196)->
(48/196)->
(49/196)->
(50/196)->
(51/196)->
(52/196)->
(53/196)->
(54/196)->
(55/196)->
(56/196)->
(57/196)->
(58/196)->
(59/196)->
(60/196)->
(61/196)->
(62/196)->
(63/196)->
(64/196)->
(65/196)->
(66/196)->
(67/196)->
(68/196)->
(69/196)->
(70/196)->
(71/196)->
(72/196)->
(73/196)->
(74/196)->
(75/196)->
(76/196)->
(77/196)->
(78/196)->
(79/196)->
(80/196)->
(81/196)->
(82/196)->
(83/196)->
(84/196)->
(85/196)->
(86/196)->
(87/196)->
(88/196)->
(89/196)->
(90/196)->
(91/196)->
(92/196)->
(93/196)->
(94/196)->
(95/196)->
(96/196)->
(97/196)->
(98/196)->
(99/196)->
(100/196)->
(101/196)->
(102/196)->
(103/196)->
(104/196)->
(105/196)->
(106/196)->
(107/196)->
(108/196)->
(109/196)->
(110/196)->
(111/196)->
(112/196)->
(113/196)->
(114/196)->
(115/196)->
(116/196)->
(117/196)->
(118/196)->
(119/196)->
(120/196)->
(121/196)->
(122/196)->
(123/196)->
(124/196)->
(125/196)->
(126/196)->
(127/196)->
(128/196)->
(129/196)->
(130/196)->
(131/196)->
(132/196)->
(133/196)->
(134/196)->
(135/196)->
(136/196)->
(137/196)->
(138/196)->
(139/196)->
(140/196)->
(141/196)->
(142/196)->
(143/196)->
(144/196)->
(145/196)->
(146/196)->
(147/196)->
(148/196)->
(149/196)->
(150/196)->
(151/196)->
(152/196)->
(153/196)->
(154/196)->
(155/196)->
(156/196)->
(157/196)->
(158/196)->
(159/196)->
(160/196)->
(161/196)->
(162/196)->
(163/196)->
(164/196)->
(165/196)->
(166/196)->
(167/196)->
(168/196)->
(169/196)->
(170/196)->
(171/196)->
(172/196)->
(173/196)->
(174/196)->
(175/196)->
(176/196)->
(177/196)->
(178/196)->
(179/196)->
(180/196)->
(181/196)->
(182/196)->
(183/196)->
(184/196)->
(185/196)->
(186/196)->
(187/196)->
(188/196)->
(189/196)->
(190/196)->
(191/196)->
(192/196)->
(193/196)->
(194/196)->
(195/196)->
(196/196)->
Simplification of the linear system 
2 functions have the same action, it remains only 1
2 functions have the same action, it remains only 1
1 functions have the same action, it remains only 1
1 functions have the same action, it remains only 1
1 functions have the same action, it remains only 1
1 functions have the same action, it remains only 1
1 functions have the same action, it remains only 1
1 functions have the same action, it remains only 1
2 functions have the same action, it remains only 1
1 functions have the same action, it remains only 1
1 functions have the same action, it remains only 1
2 functions have the same action, it remains only 1
2 functions have the same action, it remains only 1
2 functions have the same action, it remains only 1
2 functions have the same action, it remains only 1
2 functions have the same action, it remains only 1
1 functions have the same action, it remains only 1
1 functions have the same action, it remains only 1
2 functions have the same action, it remains only 1
1 functions have the same action, it remains only 1
1 functions have the same action, it remains only 1
1 functions have the same action, it remains only 1
2 functions have the same action, it remains only 1
2 functions have the same action, it remains only 1
1 functions have the same action, it remains only 1
2 functions have the same action, it remains only 1
1 functions have the same action, it remains only 1
1 functions have the same action, it remains only 1
1 functions have the same action, it remains only 1
1 functions have the same action, it remains only 1
2 functions have the same action, it remains only 1
1 functions have the same action, it remains only 1
1 functions have the same action, it remains only 1
1 functions have the same action, it remains only 1
1 functions have the same action, it remains only 1
1 functions have the same action, it remains only 1
1 functions have the same action, it remains only 1
1 functions have the same action, it remains only 1
1 functions have the same action, it remains only 1
1 functions have the same action, it remains only 1
1 functions have the same action, it remains only 1
1 functions have the same action, it remains only 1
1 functions have the same action, it remains only 1
2 functions have the same action, it remains only 1
1 functions have the same action, it remains only 1
1 functions have the same action, it remains only 1
1 functions have the same action, it remains only 1
1 functions have the same action, it remains only 1
1 functions have the same action, it remains only 1
1 functions have the same action, it remains only 1
1 functions have the same action, it remains only 1
1 functions have the same action, it remains only 1
1 functions have the same action, it remains only 1
1 functions have the same action, it remains only 1
1 functions have the same action, it remains only 1
1 functions have the same action, it remains only 1
1 functions have the same action, it remains only 1
1 functions have the same action, it remains only 1
1 functions have the same action, it remains only 1
1 functions have the same action, it remains only 1
1 functions have the same action, it remains only 1
1 functions have the same action, it remains only 1
1 functions have the same action, it remains only 1
1 functions have the same action, it remains only 1
1 functions have the same action, it remains only 1
1 functions have the same action, it remains only 1
1 functions have the same action, it remains only 1
1 functions have the same action, it remains only 1
1 functions have the same action, it remains only 1
1 functions have the same action, it remains only 1
1 functions have the same action, it remains only 1
1 functions have the same action, it remains only 1
1 functions have the same action, it remains only 1
1 functions have the same action, it remains only 1
Number of actions before simplification : 88
Number of actions after simplification  : 74
cycles of length 2
(1/74), name = (+r6.r5+r5.r6), size = 889
(2/74), name = (+r13.r12+r12.r13), size = 890
(3/74), name = +r3.r6, size = 1589
(4/74), name = +r3.r13, size = 1589
(5/74), name = +r6.r3, size = 1706
(6/74), name = +r13.r3, size = 1817
(7/74), name = +r10.r6, size = 1592
(8/74), name = +r6.r10, size = 1606
(9/74), name = (+r11.r6+r6.r11), size = 2343
(10/74), name = +r10.r13, size = 1592
(11/74), name = +r13.r10, size = 1633
(12/74), name = (+r13.r11+r11.r13), size = 2343
(13/74), name = (+r14.r13+r13.r14), size = 886
(14/74), name = (+r6.r4+r4.r6), size = 2343
(15/74), name = (+r13.r4+r4.r13), size = 2343
(16/74), name = (+r7.r6+r6.r7), size = 886
(17/74), name = +r6, size = 916
(18/74), name = +r13, size = 916
(19/74), name = (+r5.r2+r2.r5), size = 277
(20/74), name = +r5.r3, size = 509
(21/74), name = +r10.r5, size = 825
(22/74), name = +r3.r12, size = 826
(23/74), name = (+r5.r4+r4.r5), size = 277
(24/74), name = (+r12.r9+r9.r12), size = 278
(25/74), name = +r12.r10, size = 488
(26/74), name = (+r12.r11+r11.r12), size = 278
(27/74), name = +r12.r5, size = 1154
(28/74), name = +r5.r12, size = 1161
(29/74), name = +r5, size = 282
(30/74), name = +r12, size = 283
(31/74), name = (+r2.r1+r1.r2), size = 280
(32/74), name = +r2.r3, size = 282
(33/74), name = +r3.r2, size = 478
(34/74), name = +r2.r10, size = 1120
(35/74), name = +r10.r2, size = 1120
(36/74), name = +r2, size = 280
(37/74), name = +r2.r14, size = 1262
(38/74), name = +r14.r2, size = 1266
(39/74), name = +r9.r3, size = 1042
(40/74), name = +r3.r9, size = 1046
(41/74), name = +r3, size = 275
(42/74), name = +r11.r3, size = 1120
(43/74), name = +r3.r11, size = 1124
(44/74), name = (+r9.r8+r8.r9), size = 280
(45/74), name = +r9.r10, size = 288
(46/74), name = +r10.r9, size = 480
(47/74), name = +r9, size = 280
(48/74), name = +r10, size = 278
(49/74), name = +r11.r10, size = 282
(50/74), name = +r10.r11, size = 470
(51/74), name = +r11, size = 280
(52/74), name = +r9.r14, size = 508
(53/74), name = +r14.r9, size = 302
(54/74), name = +r14, size = 279
(55/74), name = +r11.r14, size = 992
(56/74), name = +r14.r11, size = 996
(57/74), name = +r4.r3, size = 276
(58/74), name = +r3.r4, size = 468
(59/74), name = +r4.r10, size = 1072
(60/74), name = +r10.r4, size = 1072
(61/74), name = +r4, size = 280
(62/74), name = +r4.r14, size = 1214
(63/74), name = +r14.r4, size = 1218
(64/74), name = +r2.r7, size = 508
(65/74), name = +r7.r2, size = 302
(66/74), name = +r9.r7, size = 1046
(67/74), name = +r7.r9, size = 1050
(68/74), name = +r7, size = 279
(69/74), name = +r11.r7, size = 1124
(70/74), name = +r7.r11, size = 1128
(71/74), name = +r4.r7, size = 992
(72/74), name = +r7.r4, size = 996
(73/74), name = +r1, size = 284
(74/74), name = +r8, size = 284
**********************
Random choose
Name = +r12  No new state computed
Name = +r9.r3  No new state computed
Name = +r14.r4  No new state computed
Name = (+r7.r6+r6.r7)  No new state computed
Name = +r3.r4  No new state computed
Name = (+r13.r11+r11.r13)  No new state computed
Name = +r6.r3  No new state computed
Name = (+r5.r4+r4.r5)  No new state computed
Name = +r10  No new state computed
Name = +r3.r6  No new state computed
Name = +r7  No new state computed
Name = +r13.r10  No new state computed
Name = +r14.r11  No new state computed
Name = (+r6.r5+r5.r6)  No new state computed
Name = +r12.r5  No new state computed
Name = +r10.r4  No new state computed
Name = +r12.r10  No new state computed
Name = +r11  No new state computed
Name = +r1  OK !
Now we have a representation of size = 50
Minimization in Progress
Name = +r6.r3 No new state computed
Name = +r10.r11 No new state computed
Name = +r5.r12 No new state computed
Name = (+r6.r4+r4.r6) No new state computed
Name = (+r5.r4+r4.r5) No new state computed
Name = +r14.r4 No new state computed
Name = +r9.r14 No new state computed
Name = +r7 No new state computed
Name = +r3.r13 No new state computed
Name = +r3.r11 No new state computed
Name = +r7.r11 No new state computed
Name = (+r11.r6+r6.r11) No new state computed
Name = +r7.r2 No new state computed
Name = +r9.r10 No new state computed
Name = (+r6.r5+r5.r6) No new state computed
Name = +r6 No new state computed
Name = +r3.r2 No new state computed
Name = +r10.r13 No new state computed
Name = (+r5.r2+r2.r5) No new state computed
Name = +r11.r10 No new state computed
Name = +r10 No new state computed
Name = +r5.r3 No new state computed
Name = +r7.r4 No new state computed
Name = +r4 No new state computed
Name = +r9.r7 No new state computed
Name = +r9 No new state computed
Name = +r12.r10 No new state computed
Name = +r2.r10 No new state computed
Name = +r13 No new state computed
Name = +r10.r4 No new state computed
Name = (+r9.r8+r8.r9)  I.N.C.R.E.A.S.E
Name = +r7.r9 No new state computed
Name = +r11 No new state computed
Name = +r4.r3 No new state computed
Name = (+r12.r11+r11.r12) No new state computed
Name = (+r7.r6+r6.r7) No new state computed
Name = +r12.r5 No new state computed
Name = +r14.r2 No new state computed
Name = (+r14.r13+r13.r14) No new state computed
Name = +r2.r14 No new state computed
Name = +r3 No new state computed
Name = +r11.r14 No new state computed
Name = +r5 No new state computed
Name = +r8  I.N.C.R.E.A.S.E
Name = +r4.r14 No new state computed
Name = +r10.r9 No new state computed
Name = (+r13.r11+r11.r13) No new state computed
Name = +r11.r7 No new state computed
Name = +r3.r6 No new state computed
Name = +r2.r3  I.N.C.R.E.A.S.E
Name = +r2.r7 No new state computed
Name = +r4.r10 No new state computed
Name = +r3.r9 No new state computed
Name = (+r13.r4+r4.r13) No new state computed
Name = (+r13.r12+r12.r13) No new state computed
Name = +r6.r10 No new state computed
Name = +r10.r2 No new state computed
Name = +r14.r11 No new state computed
Name = +r14.r9 No new state computed
Name = (+r12.r9+r9.r12) No new state computed
Name = +r3.r4 No new state computed
Name = +r10.r6 No new state computed
Name = +r4.r7 No new state computed
Name = +r3.r12 No new state computed
Name = +r10.r5 No new state computed
Name = +r14 No new state computed
Name = (+r2.r1+r1.r2)  I.N.C.R.E.A.S.E
Name = +r2  I.N.C.R.E.A.S.E
Name = +r13.r10 No new state computed
Name = +r12 No new state computed
Name = +r11.r3 No new state computed
Name = +r9.r3 No new state computed
Name = +r13.r3 No new state computed
increase = 1
**********************
Random choose
Name = +r2  OK !
Now we have a representation of size = 70
Minimization in Progress
Name = +r10.r4 No new state computed
Name = +r7.r9 No new state computed
Name = +r10.r11 No new state computed
Name = +r14.r9 No new state computed
Name = (+r12.r11+r11.r12) No new state computed
Name = +r3.r9 No new state computed
Name = +r3.r4 No new state computed
Name = +r10.r13 No new state computed
Name = (+r5.r4+r4.r5) No new state computed
Name = +r14.r11 No new state computed
Name = +r5.r3 No new state computed
Name = +r13.r3 No new state computed
Name = +r4.r3 No new state computed
Name = +r9.r10 No new state computed
Name = +r10 No new state computed
Name = +r12 No new state computed
Name = +r9.r14 No new state computed
Name = +r11 No new state computed
Name = +r12.r5 No new state computed
Name = +r11.r7 No new state computed
Name = +r14 No new state computed
Name = +r5 No new state computed
Name = +r3.r11 No new state computed
Name = +r8  I.N.C.R.E.A.S.E
Name = (+r13.r12+r12.r13) No new state computed
Name = +r10.r9 No new state computed
Name = (+r5.r2+r2.r5) No new state computed
Name = +r7 No new state computed
Name = +r14.r2 No new state computed
Name = +r10.r6 No new state computed
Name = +r13.r10 No new state computed
Name = +r5.r12 No new state computed
Name = +r3.r13 No new state computed
Name = +r1 No new state computed
Name = (+r7.r6+r6.r7) No new state computed
Name = +r6 No new state computed
Name = +r14.r4 No new state computed
Name = +r9.r7 No new state computed
Name = +r10.r5 No new state computed
Name = +r7.r4 No new state computed
Name = +r6.r3 No new state computed
Name = +r4 No new state computed
Name = +r2.r10 No new state computed
Name = +r11.r10 No new state computed
Name = +r9 No new state computed
Name = +r3.r12 No new state computed
Name = +r9.r3 No new state computed
Name = (+r13.r4+r4.r13) No new state computed
Name = +r4.r10 No new state computed
Name = (+r2.r1+r1.r2) No new state computed
Name = (+r6.r5+r5.r6) No new state computed
Name = +r3  I.N.C.R.E.A.S.E
Name = (+r14.r13+r13.r14) No new state computed
Name = +r12.r10 No new state computed
Name = +r2.r14 No new state computed
Name = (+r13.r11+r11.r13) No new state computed
Name = (+r6.r4+r4.r6) No new state computed
Name = +r11.r3 No new state computed
Name = +r6.r10 No new state computed
Name = (+r11.r6+r6.r11) No new state computed
Name = +r4.r14 No new state computed
Name = +r2.r3  I.N.C.R.E.A.S.E
Name = +r11.r14 No new state computed
Name = +r3.r2  I.N.C.R.E.A.S.E
Name = (+r9.r8+r8.r9)  I.N.C.R.E.A.S.E
Name = +r10.r2 No new state computed
Name = +r13 No new state computed
Name = (+r12.r9+r9.r12) No new state computed
Name = +r4.r7 No new state computed
Name = +r7.r11 No new state computed
Name = +r7.r2 No new state computed
Name = +r3.r6 No new state computed
Name = +r2.r7 No new state computed
increase = 1
**********************
Random choose
Name = (+r9.r8+r8.r9)  OK !
Now we have a representation of size = 87
Minimization in Progress
Name = (+r13.r12+r12.r13)  I.N.C.R.E.A.S.E
Name = +r10.r13 No new state computed
Name = +r1 No new state computed
Name = +r11.r14 No new state computed
Name = +r11.r10 No new state computed
Name = +r9.r3 No new state computed
Name = +r12  I.N.C.R.E.A.S.E
Name = +r10.r11 No new state computed
Name = +r2.r14 No new state computed
Name = +r7.r2 No new state computed
Name = +r3.r12 No new state computed
Name = (+r12.r11+r11.r12) No new state computed
Name = +r4.r14 No new state computed
Name = +r4.r10 No new state computed
Name = (+r13.r11+r11.r13) No new state computed
Name = +r7 No new state computed
Name = +r4 No new state computed
Name = +r9 No new state computed
Name = +r3.r6 No new state computed
Name = +r7.r4 No new state computed
Name = +r13.r3 No new state computed
Name = +r12.r5 No new state computed
Name = +r8  I.N.C.R.E.A.S.E
Name = +r3.r4 No new state computed
Name = +r10.r5 No new state computed
Name = +r7.r11 No new state computed
Name = +r2.r10 No new state computed
Name = +r11.r3 No new state computed
Name = +r14.r9 No new state computed
Name = +r2 No new state computed
Name = (+r14.r13+r13.r14) No new state computed
Name = +r10.r6 No new state computed
Name = +r9.r7 No new state computed
Name = +r3.r11 No new state computed
Name = +r2.r7 No new state computed
Name = (+r12.r9+r9.r12) No new state computed
Name = +r3.r2  I.N.C.R.E.A.S.E
Name = (+r6.r4+r4.r6) No new state computed
Name = +r11 No new state computed
Name = (+r13.r4+r4.r13) No new state computed
Name = +r2.r3  I.N.C.R.E.A.S.E
Name = +r14.r2 No new state computed
Name = +r9.r14 No new state computed
Name = +r10.r4 No new state computed
Name = +r11.r7 No new state computed
Name = +r4.r7 No new state computed
Name = (+r6.r5+r5.r6) No new state computed
Name = +r3.r13 No new state computed
Name = +r14.r4 No new state computed
Name = +r5.r12 No new state computed
Name = +r6.r10 No new state computed
Name = +r12.r10 No new state computed
Name = +r3.r9 No new state computed
Name = +r4.r3 No new state computed
Name = +r14.r11 No new state computed
Name = +r13 No new state computed
Name = +r6.r3 No new state computed
Name = (+r5.r4+r4.r5) No new state computed
Name = +r10.r2 No new state computed
Name = +r9.r10 No new state computed
Name = +r5.r3 No new state computed
Name = +r10 No new state computed
Name = (+r5.r2+r2.r5) No new state computed
Name = +r7.r9 No new state computed
Name = +r6 No new state computed
Name = +r5 No new state computed
Name = +r13.r10 No new state computed
Name = +r14 No new state computed
Name = (+r11.r6+r6.r11) No new state computed
Name = (+r2.r1+r1.r2) No new state computed
Name = +r10.r9 No new state computed
Name = +r3  I.N.C.R.E.A.S.E
Name = (+r7.r6+r6.r7) No new state computed
increase = 1
**********************
Random choose
Name = +r3  OK !
Now we have a representation of size = 103
Minimization in Progress
Name = +r10 No new state computed
Name = +r13.r10 No new state computed
Name = (+r9.r8+r8.r9)  I.N.C.R.E.A.S.E
Name = +r10.r11 No new state computed
Name = (+r14.r13+r13.r14) No new state computed
Name = +r14.r9 No new state computed
Name = +r3.r9 No new state computed
Name = +r6 No new state computed
Name = +r10.r6 No new state computed
Name = +r2  I.N.C.R.E.A.S.E
Name = +r14 No new state computed
Name = (+r5.r2+r2.r5) No new state computed
Name = +r5.r3 No new state computed
Name = +r11 No new state computed
Name = +r3.r2  I.N.C.R.E.A.S.E
Name = +r10.r9 No new state computed
Name = +r3.r11 No new state computed
Name = +r9.r14 No new state computed
Name = +r3.r13 No new state computed
Name = +r10.r4 No new state computed
Name = +r12.r10 No new state computed
Name = (+r13.r4+r4.r13) No new state computed
Name = +r3.r12 No new state computed
Name = +r9 No new state computed
Name = +r6.r3 No new state computed
Name = +r14.r2 No new state computed
Name = +r2.r14 No new state computed
Name = +r14.r11 No new state computed
Name = +r12.r5 No new state computed
Name = +r7 No new state computed
Name = +r10.r13 No new state computed
Name = +r4.r3 No new state computed
Name = +r5 No new state computed
Name = +r2.r10 No new state computed
Name = +r7.r11 No new state computed
Name = +r7.r9 No new state computed
Name = (+r5.r4+r4.r5) No new state computed
Name = +r4.r14 No new state computed
Name = +r11.r10 No new state computed
Name = +r4.r7 No new state computed
Name = +r3.r6 No new state computed
Name = +r2.r3  I.N.C.R.E.A.S.E
Name = (+r6.r5+r5.r6) No new state computed
Name = (+r13.r11+r11.r13) No new state computed
Name = (+r12.r9+r9.r12) No new state computed
Name = (+r7.r6+r6.r7) No new state computed
Name = +r13.r3 No new state computed
Name = +r3.r4 No new state computed
Name = +r12  I.N.C.R.E.A.S.E
Name = +r7.r2 No new state computed
Name = +r1 No new state computed
Name = +r10.r5 No new state computed
Name = +r9.r3 No new state computed
Name = +r2.r7 No new state computed
Name = +r9.r7 No new state computed
Name = +r14.r4 No new state computed
Name = +r13 No new state computed
Name = +r7.r4 No new state computed
Name = (+r12.r11+r11.r12) No new state computed
Name = +r10.r2 No new state computed
Name = +r4.r10 No new state computed
Name = (+r13.r12+r12.r13)  I.N.C.R.E.A.S.E
Name = +r9.r10 No new state computed
Name = (+r11.r6+r6.r11) No new state computed
Name = (+r2.r1+r1.r2)  I.N.C.R.E.A.S.E
Name = +r11.r14 No new state computed
Name = +r5.r12 No new state computed
Name = +r6.r10 No new state computed
Name = (+r6.r4+r4.r6) No new state computed
Name = +r8  I.N.C.R.E.A.S.E
Name = +r4 No new state computed
Name = +r11.r3 No new state computed
Name = +r11.r7 No new state computed
increase = 1
**********************
Random choose
Name = +r8  OK !
Now we have a representation of size = 123
Minimization in Progress
Name = +r12.r5 No new state computed
Name = +r2.r10 No new state computed
Name = +r10.r11 No new state computed
Name = +r7.r2 No new state computed
Name = +r10.r9 No new state computed
Name = +r13 No new state computed
Name = +r1 No new state computed
Name = +r4 No new state computed
Name = +r11.r10 No new state computed
Name = +r3.r12 No new state computed
Name = +r5 No new state computed
Name = +r11.r3 No new state computed
Name = (+r14.r13+r13.r14) No new state computed
Name = +r13.r3 No new state computed
Name = +r2.r7 No new state computed
Name = +r7.r11 No new state computed
Name = (+r13.r12+r12.r13)  I.N.C.R.E.A.S.E
Name = +r2.r14 No new state computed
Name = +r4.r3 No new state computed
Name = +r13.r10 No new state computed
Name = +r10.r13 No new state computed
Name = +r9  I.N.C.R.E.A.S.E
Name = +r14 No new state computed
Name = +r3.r2  I.N.C.R.E.A.S.E
Name = +r4.r7 No new state computed
Name = +r3 No new state computed
Name = (+r2.r1+r1.r2)  I.N.C.R.E.A.S.E
Name = (+r12.r11+r11.r12) No new state computed
Name = (+r11.r6+r6.r11) No new state computed
Name = +r2.r3  I.N.C.R.E.A.S.E
Name = (+r5.r2+r2.r5) No new state computed
Name = (+r5.r4+r4.r5) No new state computed
Name = +r6.r10 No new state computed
Name = +r10.r4 No new state computed
Name = +r3.r11 No new state computed
Name = +r3.r4 No new state computed
Name = (+r13.r4+r4.r13) No new state computed
Name = +r9.r14 No new state computed
Name = +r7.r9 No new state computed
Name = +r6.r3 No new state computed
Name = +r10.r6 No new state computed
Name = +r10 No new state computed
Name = +r12.r10 No new state computed
Name = (+r13.r11+r11.r13) No new state computed
Name = +r9.r10 No new state computed
Name = +r7.r4 No new state computed
Name = +r14.r2 No new state computed
Name = +r14.r4 No new state computed
Name = +r10.r5 No new state computed
Name = +r3.r9  I.N.C.R.E.A.S.E
Name = +r12  I.N.C.R.E.A.S.E
Name = +r4.r10 No new state computed
Name = +r3.r13 No new state computed
Name = +r14.r11 No new state computed
Name = +r9.r7 No new state computed
Name = +r5.r3 No new state computed
Name = +r14.r9 No new state computed
Name = +r5.r12 No new state computed
Name = (+r12.r9+r9.r12)  I.N.C.R.E.A.S.E
Name = +r11 No new state computed
Name = +r9.r3 No new state computed
Name = +r6 No new state computed
Name = +r2  I.N.C.R.E.A.S.E
Name = +r11.r14 No new state computed
Name = +r11.r7 No new state computed
Name = +r7 No new state computed
Name = (+r6.r5+r5.r6) No new state computed
Name = +r4.r14 No new state computed
Name = (+r6.r4+r4.r6) No new state computed
Name = (+r7.r6+r6.r7) No new state computed
Name = (+r9.r8+r8.r9)  I.N.C.R.E.A.S.E
Name = +r3.r6 No new state computed
Name = +r10.r2 No new state computed
increase = 1
**********************
Random choose
Name = (+r9.r8+r8.r9)  OK !
Now we have a representation of size = 129
Minimization in Progress
Name = +r13 No new state computed
Name = (+r6.r4+r4.r6) No new state computed
Name = (+r12.r9+r9.r12)  I.N.C.R.E.A.S.E
Name = +r5.r12 No new state computed
Name = +r5 No new state computed
Name = +r9.r10 No new state computed
Name = (+r13.r4+r4.r13) No new state computed
Name = +r8 No new state computed
Name = (+r13.r11+r11.r13) No new state computed
Name = +r7.r4 No new state computed
Name = +r11 No new state computed
Name = +r14.r11 No new state computed
Name = +r9.r14 No new state computed
Name = +r14.r2 No new state computed
Name = +r12.r5 No new state computed
Name = +r6.r10 No new state computed
Name = +r4.r3 No new state computed
Name = +r10.r13 No new state computed
Name = +r3.r4 No new state computed
Name = +r9.r7 No new state computed
Name = +r12.r10 No new state computed
Name = +r6 No new state computed
Name = +r10.r4 No new state computed
Name = +r13.r10 No new state computed
Name = +r4 No new state computed
Name = +r3.r6 No new state computed
Name = +r14.r4 No new state computed
Name = +r10.r6 No new state computed
Name = (+r5.r4+r4.r5) No new state computed
Name = +r4.r10 No new state computed
Name = +r11.r14 No new state computed
Name = +r2.r3  I.N.C.R.E.A.S.E
Name = +r3.r2  I.N.C.R.E.A.S.E
Name = +r5.r3 No new state computed
Name = +r13.r3 No new state computed
Name = +r3.r11 No new state computed
Name = +r9.r3 No new state computed
Name = (+r14.r13+r13.r14) No new state computed
Name = +r12  I.N.C.R.E.A.S.E
Name = +r10.r11 No new state computed
Name = (+r5.r2+r2.r5) No new state computed
Name = +r10.r5 No new state computed
Name = +r10.r9 No new state computed
Name = +r2  I.N.C.R.E.A.S.E
Name = +r9 No new state computed
Name = +r3 No new state computed
Name = +r7.r9 No new state computed
Name = +r11.r7 No new state computed
Name = +r11.r3 No new state computed
Name = +r11.r10 No new state computed
Name = (+r13.r12+r12.r13)  I.N.C.R.E.A.S.E
Name = (+r2.r1+r1.r2)  I.N.C.R.E.A.S.E
Name = +r14.r9 No new state computed
Name = +r4.r7 No new state computed
Name = +r4.r14 No new state computed
Name = +r3.r12 No new state computed
Name = +r14 No new state computed
Name = +r6.r3 No new state computed
Name = (+r12.r11+r11.r12) No new state computed
Name = +r2.r14 No new state computed
Name = +r7.r2 No new state computed
Name = +r3.r9 No new state computed
Name = +r7 No new state computed
Name = +r1 No new state computed
Name = +r2.r10 No new state computed
Name = +r10 No new state computed
Name = +r7.r11 No new state computed
Name = (+r11.r6+r6.r11) No new state computed
Name = +r3.r13 No new state computed
Name = +r10.r2 No new state computed
Name = +r2.r7 No new state computed
Name = (+r6.r5+r5.r6) No new state computed
Name = (+r7.r6+r6.r7) No new state computed
increase = 1
**********************
Random choose
Name = (+r2.r1+r1.r2)  OK !
Now we have a representation of size = 147
Minimization in Progress
Name = +r10.r4 No new state computed
Name = (+r9.r8+r8.r9) No new state computed
Name = +r10.r9 No new state computed
Name = +r2.r3  I.N.C.R.E.A.S.E
Name = +r10.r13 No new state computed
Name = +r4.r14 No new state computed
Name = (+r5.r2+r2.r5) No new state computed
Name = +r11.r14 No new state computed
Name = +r2.r7 No new state computed
Name = +r2 No new state computed
Name = +r9.r14 No new state computed
Name = +r10.r11 No new state computed
Name = +r3.r13 No new state computed
Name = +r11.r7 No new state computed
Name = +r3  I.N.C.R.E.A.S.E
Name = +r10.r5 No new state computed
Name = +r2.r14 No new state computed
Name = +r4 No new state computed
Name = (+r6.r4+r4.r6) No new state computed
Name = (+r7.r6+r6.r7) No new state computed
Name = +r13.r10 No new state computed
Name = +r10 No new state computed
Name = +r3.r12 No new state computed
Name = (+r12.r9+r9.r12)  I.N.C.R.E.A.S.E
Name = +r9.r3 No new state computed
Name = +r10.r2 No new state computed
Name = +r13.r3 No new state computed
Name = +r7 No new state computed
Name = (+r13.r4+r4.r13) No new state computed
Name = +r9.r7 No new state computed
Name = +r14.r2 No new state computed
Name = +r9 No new state computed
Name = +r4.r3 No new state computed
Name = +r3.r4 No new state computed
Name = (+r5.r4+r4.r5) No new state computed
Name = (+r13.r12+r12.r13)  I.N.C.R.E.A.S.E
Name = +r14 No new state computed
Name = +r7.r11 No new state computed
Name = +r8 No new state computed
Name = +r7.r4 No new state computed
Name = +r9.r10 No new state computed
Name = +r11 No new state computed
Name = +r10.r6 No new state computed
Name = +r3.r2  I.N.C.R.E.A.S.E
Name = +r12.r10 No new state computed
Name = +r5 No new state computed
Name = +r11.r10 No new state computed
Name = (+r14.r13+r13.r14) No new state computed
Name = +r4.r7 No new state computed
Name = +r3.r11 No new state computed
Name = +r13 No new state computed
Name = +r14.r11 No new state computed
Name = +r3.r9  I.N.C.R.E.A.S.E
Name = +r7.r2 No new state computed
Name = (+r13.r11+r11.r13) No new state computed
Name = +r2.r10 No new state computed
Name = +r4.r10 No new state computed
Name = +r7.r9 No new state computed
Name = +r6.r3 No new state computed
Name = +r5.r3 No new state computed
Name = (+r6.r5+r5.r6) No new state computed
Name = +r5.r12 No new state computed
Name = +r12.r5 No new state computed
Name = +r1 No new state computed
Name = +r11.r3 No new state computed
Name = +r6.r10 No new state computed
Name = +r14.r4 No new state computed
Name = (+r12.r11+r11.r12) No new state computed
Name = +r12  I.N.C.R.E.A.S.E
Name = +r14.r9 No new state computed
Name = +r6 No new state computed
Name = (+r11.r6+r6.r11) No new state computed
Name = +r3.r6 No new state computed
increase = 1
**********************
Random choose
Name = +r12  OK !
Now we have a representation of size = 152
Minimization in Progress
Name = +r9 No new state computed
Name = +r9.r14 No new state computed
Name = (+r12.r11+r11.r12) No new state computed
Name = +r2 No new state computed
Name = +r14.r2 No new state computed
Name = +r4.r3 No new state computed
Name = (+r2.r1+r1.r2) No new state computed
Name = +r3  I.N.C.R.E.A.S.E
Name = +r11.r7 No new state computed
Name = +r9.r3 No new state computed
Name = +r7.r2 No new state computed
Name = +r10 No new state computed
Name = (+r6.r4+r4.r6) No new state computed
Name = (+r5.r4+r4.r5) No new state computed
Name = +r3.r9  I.N.C.R.E.A.S.E
Name = +r14.r11 No new state computed
Name = +r2.r14 No new state computed
Name = +r10.r11 No new state computed
Name = +r11.r14 No new state computed
Name = +r3.r11 No new state computed
Name = +r4 No new state computed
Name = +r11.r10 No new state computed
Name = +r3.r12 No new state computed
Name = +r10.r13 No new state computed
Name = +r9.r10 No new state computed
Name = +r10.r4 No new state computed
Name = (+r6.r5+r5.r6) No new state computed
Name = +r10.r2 No new state computed
Name = +r11.r3 No new state computed
Name = +r13.r10 No new state computed
Name = (+r13.r11+r11.r13) No new state computed
Name = (+r12.r9+r9.r12) No new state computed
Name = +r4.r10 No new state computed
Name = +r12.r10 No new state computed
Name = +r3.r6 No new state computed
Name = +r5.r3 No new state computed
Name = +r6 No new state computed
Name = (+r5.r2+r2.r5) No new state computed
Name = +r6.r3 No new state computed
Name = +r1 No new state computed
Name = +r3.r13 No new state computed
Name = +r7.r4 No new state computed
Name = +r9.r7 No new state computed
Name = (+r9.r8+r8.r9) No new state computed
Name = +r2.r7 No new state computed
Name = (+r14.r13+r13.r14)  I.N.C.R.E.A.S.E
Name = (+r11.r6+r6.r11) No new state computed
Name = +r14.r4 No new state computed
Name = +r12.r5 No new state computed
Name = +r6.r10 No new state computed
Name = +r14 No new state computed
Name = +r5.r12 No new state computed
Name = +r10.r9 No new state computed
Name = +r7.r11 No new state computed
Name = (+r13.r4+r4.r13) No new state computed
Name = +r5 No new state computed
Name = +r10.r6 No new state computed
Name = +r11 No new state computed
Name = (+r7.r6+r6.r7) No new state computed
Name = +r10.r5 No new state computed
Name = +r2.r10 No new state computed
Name = (+r13.r12+r12.r13)  I.N.C.R.E.A.S.E
Name = +r3.r4 No new state computed
Name = +r4.r7 No new state computed
Name = +r7 No new state computed
Name = +r2.r3  I.N.C.R.E.A.S.E
Name = +r3.r2  I.N.C.R.E.A.S.E
Name = +r4.r14 No new state computed
Name = +r13  I.N.C.R.E.A.S.E
Name = +r14.r9 No new state computed
Name = +r8 No new state computed
Name = +r13.r3 No new state computed
Name = +r7.r9 No new state computed
increase = 1
**********************
Random choose
Name = +r13  OK !
Now we have a representation of size = 168
Minimization in Progress
Name = (+r13.r12+r12.r13) No new state computed
Name = +r9.r7 No new state computed
Name = +r3.r2  I.N.C.R.E.A.S.E
Name = +r2.r10 No new state computed
Name = (+r7.r6+r6.r7) No new state computed
Name = (+r6.r4+r4.r6) No new state computed
Name = +r11.r14 No new state computed
Name = +r10.r2 No new state computed
Name = +r9 No new state computed
Name = (+r12.r11+r11.r12) No new state computed
Name = +r7.r2 No new state computed
Name = +r3  I.N.C.R.E.A.S.E
Name = (+r13.r11+r11.r13) No new state computed
Name = +r9.r14 No new state computed
Name = +r3.r13 No new state computed
Name = +r4.r3 No new state computed
Name = +r11.r3 No new state computed
Name = +r3.r12 No new state computed
Name = (+r6.r5+r5.r6) No new state computed
Name = +r14.r4  I.N.C.R.E.A.S.E
Name = +r7 No new state computed
Name = +r7.r9 No new state computed
Name = +r2.r3  I.N.C.R.E.A.S.E
Name = +r10.r13 No new state computed
Name = +r12.r5 No new state computed
Name = +r3.r9  I.N.C.R.E.A.S.E
Name = (+r2.r1+r1.r2) No new state computed
Name = (+r11.r6+r6.r11) No new state computed
Name = +r3.r6 No new state computed
Name = +r10.r11 No new state computed
Name = (+r12.r9+r9.r12) No new state computed
Name = +r4.r10 No new state computed
Name = +r13.r3 No new state computed
Name = +r10.r4 No new state computed
Name = +r14.r11 No new state computed
Name = +r14.r9  I.N.C.R.E.A.S.E
Name = +r6.r10 No new state computed
Name = +r14.r2  I.N.C.R.E.A.S.E
Name = +r14  I.N.C.R.E.A.S.E
Name = +r11 No new state computed
Name = +r2.r7 No new state computed
Name = +r5.r3 No new state computed
Name = (+r5.r2+r2.r5) No new state computed
Name = +r5 No new state computed
Name = +r2 No new state computed
Name = +r7.r4 No new state computed
Name = +r12.r10 No new state computed
Name = +r4.r14 No new state computed
Name = +r10 No new state computed
Name = (+r5.r4+r4.r5) No new state computed
Name = +r1 No new state computed
Name = +r10.r6 No new state computed
Name = +r7.r11 No new state computed
Name = +r12 No new state computed
Name = (+r9.r8+r8.r9) No new state computed
Name = +r10.r9 No new state computed
Name = +r8 No new state computed
Name = +r3.r11 No new state computed
Name = +r5.r12 No new state computed
Name = +r2.r14 No new state computed
Name = +r6.r3 No new state computed
Name = +r9.r10 No new state computed
Name = +r9.r3 No new state computed
Name = (+r14.r13+r13.r14)  I.N.C.R.E.A.S.E
Name = +r11.r7 No new state computed
Name = +r6 No new state computed
Name = +r4.r7 No new state computed
Name = +r4 No new state computed
Name = +r13.r10 No new state computed
Name = (+r13.r4+r4.r13) No new state computed
Name = +r10.r5 No new state computed
Name = +r11.r10 No new state computed
Name = +r3.r4 No new state computed
increase = 1
**********************
Random choose
Name = (+r14.r13+r13.r14)  OK !
Now we have a representation of size = 223
Minimization in Progress
Name = +r11.r7 No new state computed
Name = +r6 No new state computed
Name = +r14 No new state computed
Name = +r11.r3 No new state computed
Name = +r10.r13 No new state computed
Name = +r7.r2 No new state computed
Name = +r7.r11 No new state computed
Name = +r6.r3 No new state computed
Name = +r7 No new state computed
Name = +r3.r4 No new state computed
Name = +r14.r4  I.N.C.R.E.A.S.E
Name = +r7.r9 No new state computed
Name = (+r5.r4+r4.r5)  I.N.C.R.E.A.S.E
Name = +r5.r12 No new state computed
Name = (+r11.r6+r6.r11) No new state computed
Name = +r5 No new state computed
Name = +r13.r3 No new state computed
Name = +r9.r3 No new state computed
Name = +r10.r9 No new state computed
Name = +r7.r4 No new state computed
Name = (+r7.r6+r6.r7) No new state computed
Name = (+r13.r4+r4.r13) No new state computed
Name = +r12.r5 No new state computed
Name = +r4  I.N.C.R.E.A.S.E
Name = +r9.r7 No new state computed
Name = +r11.r14 No new state computed
Name = +r10 No new state computed
Name = +r2  I.N.C.R.E.A.S.E
Name = (+r6.r4+r4.r6) No new state computed
Name = (+r13.r11+r11.r13) No new state computed
Name = +r3.r6 No new state computed
Name = +r13.r10 No new state computed
Name = +r5.r3 No new state computed
Name = +r3.r2  I.N.C.R.E.A.S.E
Name = +r3.r9  I.N.C.R.E.A.S.E
Name = (+r12.r9+r9.r12) No new state computed
Name = +r2.r7 No new state computed
Name = +r4.r7 No new state computed
Name = +r12.r10 No new state computed
Name = (+r12.r11+r11.r12) No new state computed
Name = (+r9.r8+r8.r9)  I.N.C.R.E.A.S.E
Name = +r3.r12 No new state computed
Name = +r8 No new state computed
Name = +r2.r3  I.N.C.R.E.A.S.E
Name = +r3.r13 No new state computed
Name = +r14.r9  I.N.C.R.E.A.S.E
Name = +r10.r6 No new state computed
Name = +r4.r3 No new state computed
Name = +r11 No new state computed
Name = (+r13.r12+r12.r13) No new state computed
Name = (+r2.r1+r1.r2)  I.N.C.R.E.A.S.E
Name = +r10.r11 No new state computed
Name = +r6.r10 No new state computed
Name = (+r6.r5+r5.r6) No new state computed
Name = +r3  I.N.C.R.E.A.S.E
Name = +r10.r5 No new state computed
Name = +r9  I.N.C.R.E.A.S.E
Name = +r10.r4 No new state computed
Name = +r2.r14 No new state computed
Name = +r11.r10 No new state computed
Name = +r3.r11 No new state computed
Name = +r9.r14 No new state computed
Name = +r2.r10 No new state computed
Name = +r13 No new state computed
Name = (+r5.r2+r2.r5)  I.N.C.R.E.A.S.E
Name = +r14.r11 No new state computed
Name = +r12 No new state computed
Name = +r4.r14 No new state computed
Name = +r9.r10  I.N.C.R.E.A.S.E
Name = +r4.r10 No new state computed
Name = +r14.r2  I.N.C.R.E.A.S.E
Name = +r1 No new state computed
Name = +r10.r2 No new state computed
increase = 1
**********************
Random choose
Name = +r14.r2  OK !
Now we have a representation of size = 287
Minimization in Progress
Name = (+r13.r12+r12.r13) No new state computed
Name = +r9.r7 No new state computed
Name = +r10.r4 No new state computed
Name = +r11.r3 No new state computed
Name = +r10.r13 No new state computed
Name = +r6.r3 No new state computed
Name = +r4.r3 No new state computed
Name = (+r14.r13+r13.r14) No new state computed
Name = +r9.r3 No new state computed
Name = +r12.r10 No new state computed
Name = +r2.r10 No new state computed
Name = +r3.r9  I.N.C.R.E.A.S.E
Name = (+r12.r9+r9.r12) No new state computed
Name = +r4.r10 No new state computed
Name = +r2.r14 No new state computed
Name = +r3.r12 No new state computed
Name = +r13.r10 No new state computed
Name = +r9.r14 No new state computed
Name = +r3.r2  I.N.C.R.E.A.S.E
Name = +r2.r7 No new state computed
Name = +r14 No new state computed
Name = (+r7.r6+r6.r7) No new state computed
Name = +r5.r12 No new state computed
Name = +r7.r11 No new state computed
Name = +r2.r3  I.N.C.R.E.A.S.E
Name = +r5.r3 No new state computed
Name = +r11.r10 No new state computed
Name = +r9  OK !
Now we have a representation of size = 287
Name = (+r6.r5+r5.r6)  I.N.C.R.E.A.S.E
Name = +r4.r14 No new state computed
Name = +r5.r12 No new state computed
Name = (+r13.r12+r12.r13) No new state computed
Name = +r14 No new state computed
Name = (+r7.r6+r6.r7) No new state computed
Name = +r3  I.N.C.R.E.A.S.E
Name = +r4 No new state computed
Name = +r5.r3 No new state computed
Name = +r5  I.N.C.R.E.A.S.E
Name = +r10.r6 No new state computed
Name = +r14.r11 No new state computed
Name = +r9.r14 No new state computed
Name = +r9.r3 No new state computed
Name = +r2.r3  I.N.C.R.E.A.S.E
Name = (+r6.r4+r4.r6) No new state computed
Name = +r10.r2  I.N.C.R.E.A.S.E
Name = (+r11.r6+r6.r11) No new state computed
Name = +r3.r2  I.N.C.R.E.A.S.E
Name = +r3.r11 No new state computed
Name = +r3.r13 No new state computed
Name = +r10.r13 No new state computed
Name = (+r14.r13+r13.r14) No new state computed
Name = +r12.r5 No new state computed
Name = +r12.r10 No new state computed
Name = +r10.r4  I.N.C.R.E.A.S.E
Name = +r6 No new state computed
Name = +r14.r4 No new state computed
Name = +r7.r4 No new state computed
Name = +r7.r11 No new state computed
Name = +r2 No new state computed
Name = +r9.r10  I.N.C.R.E.A.S.E
Name = +r2.r14 No new state computed
Name = +r11.r3 No new state computed
Name = +r3.r9  I.N.C.R.E.A.S.E
Name = (+r12.r11+r11.r12) No new state computed
Name = +r8 No new state computed
Name = +r12 No new state computed
Name = +r10.r5 No new state computed
Name = +r14.r2 No new state computed
Name = +r10  OK !
Now we have a representation of size = 287
Name = +r10.r11 No new state computed
Name = +r9  I.N.C.R.E.A.S.E
Name = +r6.r10 No new state computed
Name = (+r5.r4+r4.r5)  I.N.C.R.E.A.S.E
Name = (+r14.r13+r13.r14) No new state computed
Name = +r7.r11 No new state computed
Name = +r14.r4 No new state computed
Name = +r3.r12 No new state computed
Name = +r4  I.N.C.R.E.A.S.E
Name = +r7.r4 No new state computed
Name = +r12.r10 No new state computed
Name = +r10.r6 No new state computed
Name = +r10.r4  I.N.C.R.E.A.S.E
Name = +r11.r14 No new state computed
Name = +r2  I.N.C.R.E.A.S.E
Name = +r9.r10  I.N.C.R.E.A.S.E
Name = (+r7.r6+r6.r7) No new state computed
Name = +r11.r3 No new state computed
Name = +r14 No new state computed
Name = +r6 No new state computed
Name = +r12 No new state computed
Name = (+r11.r6+r6.r11) No new state computed
Name = +r10.r13 No new state computed
Name = +r9.r3 No new state computed
Name = (+r5.r2+r2.r5)  I.N.C.R.E.A.S.E
Name = +r3  I.N.C.R.E.A.S.E
Name = +r13.r10 No new state computed
Name = +r11 No new state computed
Name = +r5.r3 No new state computed
Name = +r3.r11 No new state computed
Name = +r10.r5 No new state computed
Name = +r6.r3 No new state computed
Name = +r7.r9 No new state computed
Name = (+r12.r9+r9.r12) No new state computed
Name = +r7.r2 No new state computed
Name = +r14.r9 No new state computed
Name = +r10.r2  I.N.C.R.E.A.S.E
Name = +r11.r7 No new state computed
Name = +r3.r13 No new state computed
Name = +r5  I.N.C.R.E.A.S.E
Name = +r3.r6 No new state computed
Name = +r4.r3 No new state computed
Name = +r14.r2 No new state computed
Name = (+r13.r12+r12.r13) No new state computed
Name = (+r13.r11+r11.r13) No new state computed
Name = +r2.r3  I.N.C.R.E.A.S.E
Name = +r7 No new state computed
Name = +r13 No new state computed
Name = +r4.r7 No new state computed
Name = +r3.r4 No new state computed
Name = +r12.r5 No new state computed
Name = +r11.r10 No new state computed
Name = (+r9.r8+r8.r9)  I.N.C.R.E.A.S.E
Name = +r2.r14 No new state computed
Name = +r2.r10 No new state computed
Name = +r4.r14 No new state computed
Name = (+r6.r5+r5.r6)  I.N.C.R.E.A.S.E
Name = (+r6.r4+r4.r6) No new state computed
Name = +r9.r14 No new state computed
Name = (+r12.r11+r11.r12) No new state computed
Name = +r2.r7 No new state computed
Name = +r1 No new state computed
Name = +r13.r3 No new state computed
Name = +r3.r9  I.N.C.R.E.A.S.E
Name = +r4.r10 No new state computed
Name = +r8 No new state computed
Name = (+r2.r1+r1.r2)  I.N.C.R.E.A.S.E
Name = +r10.r9  I.N.C.R.E.A.S.E
Name = +r5.r12 No new state computed
Name = +r14.r11 No new state computed
Name = (+r13.r4+r4.r13) No new state computed
Name = +r9.r7 No new state computed
Name = +r3.r2  I.N.C.R.E.A.S.E
increase = 1
**********************
Random choose
Name = +r3.r2  OK !
Now we have a representation of size = 363
Minimization in Progress
Name = +r12.r10 No new state computed
Name = +r2.r10 No new state computed
Name = (+r13.r11+r11.r13) No new state computed
Name = +r14.r4 No new state computed
Name = +r5.r3 No new state computed
Name = +r4.r3 No new state computed
Name = (+r14.r13+r13.r14) No new state computed
Name = +r13.r3 No new state computed
Name = +r14.r9 No new state computed
Name = +r3.r13 No new state computed
Name = +r3.r6 No new state computed
Name = +r4  I.N.C.R.E.A.S.E
Name = +r11.r3 No new state computed
Name = (+r12.r9+r9.r12) No new state computed
Name = +r3.r4 No new state computed
Name = (+r2.r1+r1.r2)  I.N.C.R.E.A.S.E
Name = +r7.r2 No new state computed
Name = +r10.r4  I.N.C.R.E.A.S.E
Name = +r13 No new state computed
Name = +r9.r14 No new state computed
Name = +r11 No new state computed
Name = +r14.r2 No new state computed
Name = +r5  I.N.C.R.E.A.S.E
Name = +r10.r9  I.N.C.R.E.A.S.E
Name = (+r9.r8+r8.r9)  I.N.C.R.E.A.S.E
Name = +r6.r3 No new state computed
Name = +r4.r7 No new state computed
Name = +r6.r10 No new state computed
Name = +r10.r5 No new state computed
Name = +r7 No new state computed
Name = +r3  OK !
Now we have a representation of size = 349
Name = +r3.r4 No new state computed
Name = +r6.r10 No new state computed
Name = +r10.r6 No new state computed
Name = +r11.r10 No new state computed
Name = +r12.r5 No new state computed
Name = +r2.r7 No new state computed
Name = +r4.r10 No new state computed
Name = +r2.r3 No new state computed
Name = +r7.r11 No new state computed
Name = +r10.r4  I.N.C.R.E.A.S.E
Name = +r3.r2 No new state computed
Name = +r9.r10  I.N.C.R.E.A.S.E
Name = +r14.r2 No new state computed
Name = +r11.r14 No new state computed
Name = +r8 No new state computed
Name = +r7.r4 No new state computed
Name = +r10 No new state computed
Name = +r13.r3 No new state computed
Name = (+r12.r11+r11.r12) No new state computed
Name = +r3.r11 No new state computed
Name = +r3.r6 No new state computed
Name = +r10.r13 No new state computed
Name = +r13 No new state computed
Name = +r7.r2 No new state computed
Name = +r3.r13 No new state computed
Name = +r10.r5 No new state computed
Name = +r9.r14 No new state computed
Name = (+r13.r11+r11.r13) No new state computed
Name = +r3.r9  OK !
Now we have a representation of size = 349
Name = +r4.r14 No new state computed
Name = (+r14.r13+r13.r14) No new state computed
Name = +r11.r10 No new state computed
Name = +r9.r7 No new state computed
Name = (+r5.r2+r2.r5)  I.N.C.R.E.A.S.E
Name = +r12.r10 No new state computed
Name = +r3.r12 No new state computed
Name = (+r6.r4+r4.r6) No new state computed
Name = (+r7.r6+r6.r7) No new state computed
Name = +r9.r14 No new state computed
Name = +r10.r4  I.N.C.R.E.A.S.E
Name = +r13.r10 No new state computed
Name = +r5.r3 No new state computed
Name = +r8 No new state computed
Name = +r9  I.N.C.R.E.A.S.E
Name = +r7.r4 No new state computed
Name = +r10.r5 No new state computed
Name = +r2.r7 No new state computed
Name = +r3.r13 No new state computed
Name = +r7 No new state computed
Name = +r4.r3 No new state computed
Name = (+r9.r8+r8.r9)  I.N.C.R.E.A.S.E
Name = +r12.r5 No new state computed
Name = +r5  I.N.C.R.E.A.S.E
Name = (+r11.r6+r6.r11) No new state computed
Name = (+r5.r4+r4.r5)  I.N.C.R.E.A.S.E
Name = (+r2.r1+r1.r2)  I.N.C.R.E.A.S.E
Name = +r5.r12 No new state computed
Name = +r4.r10 No new state computed
Name = +r9.r3 No new state computed
Name = +r14.r9 No new state computed
Name = +r7.r9 No new state computed
Name = +r3.r6 No new state computed
Name = +r10.r6 No new state computed
Name = +r13 No new state computed
Name = +r3.r4 No new state computed
Name = +r4  I.N.C.R.E.A.S.E
Name = +r10.r9  I.N.C.R.E.A.S.E
Name = +r11.r7 No new state computed
Name = +r11 No new state computed
Name = +r10.r2  I.N.C.R.E.A.S.E
Name = +r7.r2 No new state computed
Name = +r12  OK !
Now we have a representation of size = 331
Name = +r7.r2 No new state computed
Name = +r10.r13 No new state computed
Name = +r9.r14 No new state computed
Name = +r6.r10 No new state computed
Name = +r2.r10 No new state computed
Name = +r9.r10  I.N.C.R.E.A.S.E
Name = (+r13.r11+r11.r13) No new state computed
Name = +r14.r4 No new state computed
Name = +r3.r6 No new state computed
Name = (+r6.r5+r5.r6)  I.N.C.R.E.A.S.E
Name = +r5  I.N.C.R.E.A.S.E
Name = +r2.r14 No new state computed
Name = +r7.r9 No new state computed
Name = +r14.r11 No new state computed
Name = (+r6.r4+r4.r6) No new state computed
Name = +r10.r9  I.N.C.R.E.A.S.E
Name = +r10.r2  I.N.C.R.E.A.S.E
Name = +r10.r6 No new state computed
Name = (+r13.r4+r4.r13) No new state computed
Name = +r13.r3 No new state computed
Name = +r7.r4 No new state computed
Name = (+r5.r4+r4.r5)  I.N.C.R.E.A.S.E
Name = +r9.r7 No new state computed
Name = (+r12.r11+r11.r12) No new state computed
Name = +r9  I.N.C.R.E.A.S.E
Name = (+r7.r6+r6.r7) No new state computed
Name = (+r13.r12+r12.r13)  I.N.C.R.E.A.S.E
Name = +r11.r7 No new state computed
Name = +r3 No new state computed
Name = +r4.r7 No new state computed
Name = +r11 No new state computed
Name = +r3.r2 No new state computed
Name = +r12.r5 No new state computed
Name = +r10 No new state computed
Name = +r4.r3 No new state computed
Name = +r14 No new state computed
Name = +r11.r10 No new state computed
Name = +r4.r14 No new state computed
Name = +r1 No new state computed
Name = +r9.r3 No new state computed
Name = +r2  I.N.C.R.E.A.S.E
Name = +r13  I.N.C.R.E.A.S.E
Name = +r10.r5 No new state computed
Name = +r7.r11 No new state computed
Name = +r4.r10 No new state computed
Name = +r10.r11 No new state computed
Name = +r2.r7 No new state computed
Name = +r3.r4 No new state computed
Name = +r7 No new state computed
Name = +r8 No new state computed
Name = +r6.r3 No new state computed
Name = (+r9.r8+r8.r9)  I.N.C.R.E.A.S.E
Name = +r3.r9 No new state computed
Name = +r11.r14 No new state computed
Name = +r3.r11 No new state computed
Name = (+r14.r13+r13.r14)  I.N.C.R.E.A.S.E
Name = +r11.r3 No new state computed
Name = +r4  I.N.C.R.E.A.S.E
Name = +r10.r4  I.N.C.R.E.A.S.E
Name = (+r5.r2+r2.r5)  I.N.C.R.E.A.S.E
Name = +r3.r13 No new state computed
Name = +r6 No new state computed
Name = (+r11.r6+r6.r11) No new state computed
Name = +r13.r10 No new state computed
Name = +r3.r12 No new state computed
Name = +r14.r9 No new state computed
Name = +r12.r10 No new state computed
Name = +r2.r3 No new state computed
Name = +r14.r2 No new state computed
Name = +r5.r3 No new state computed
Name = (+r2.r1+r1.r2)  I.N.C.R.E.A.S.E
Name = +r5.r12 No new state computed
Name = (+r12.r9+r9.r12) No new state computed
increase = 1
**********************
Random choose
Name = (+r2.r1+r1.r2)  OK !
Now we have a representation of size = 339
Minimization in Progress
Name = +r10.r5 No new state computed
Name = +r7.r11 No new state computed
Name = (+r11.r6+r6.r11) No new state computed
Name = (+r14.r13+r13.r14)  I.N.C.R.E.A.S.E
Name = +r11.r7 No new state computed
Name = (+r6.r4+r4.r6) No new state computed
Name = +r7 No new state computed
Name = +r5.r3 No new state computed
Name = (+r12.r11+r11.r12) No new state computed
Name = +r7.r2 No new state computed
Name = (+r13.r12+r12.r13)  I.N.C.R.E.A.S.E
Name = +r4.r7 No new state computed
Name = +r13.r3 No new state computed
Name = +r3.r11 No new state computed
Name = (+r13.r11+r11.r13) No new state computed
Name = +r10 No new state computed
Name = +r6.r10 No new state computed
Name = +r4.r14 No new state computed
Name = +r3.r6 No new state computed
Name = +r4.r10 No new state computed
Name = +r3.r4 No new state computed
Name = +r11.r10 No new state computed
Name = +r2 No new state computed
Name = +r2.r7 No new state computed
Name = +r9  I.N.C.R.E.A.S.E
Name = +r13.r10 No new state computed
Name = +r14.r11 No new state computed
Name = +r11.r14 No new state computed
Name = +r14.r2 No new state computed
Name = +r3 No new state computed
Name = +r12 No new state computed
Name = +r6.r3 No new state computed
Name = +r2.r14 No new state computed
Name = +r3.r2 No new state computed
Name = +r14 No new state computed
Name = +r2.r10 No new state computed
Name = (+r6.r5+r5.r6)  I.N.C.R.E.A.S.E
Name = +r13  I.N.C.R.E.A.S.E
Name = +r10.r6 No new state computed
Name = +r7.r9 No new state computed
Name = +r10.r4 No new state computed
Name = +r10.r2 No new state computed
Name = +r6 No new state computed
Name = +r3.r9 No new state computed
Name = +r12.r5 No new state computed
Name = +r1 No new state computed
Name = +r3.r12 No new state computed
Name = (+r9.r8+r8.r9)  I.N.C.R.E.A.S.E
Name = (+r5.r4+r4.r5)  I.N.C.R.E.A.S.E
Name = +r5.r12 No new state computed
Name = +r4 No new state computed
Name = +r11 No new state computed
Name = +r8 No new state computed
Name = (+r5.r2+r2.r5)  I.N.C.R.E.A.S.E
Name = +r12.r10 No new state computed
Name = +r9.r10  I.N.C.R.E.A.S.E
Name = +r10.r9  I.N.C.R.E.A.S.E
Name = +r4.r3 No new state computed
Name = +r9.r3 No new state computed
Name = +r5  I.N.C.R.E.A.S.E
Name = +r9.r7 No new state computed
Name = +r7.r4 No new state computed
Name = +r10.r11 No new state computed
Name = (+r12.r9+r9.r12) No new state computed
Name = +r10.r13 No new state computed
Name = +r9.r14 No new state computed
Name = +r14.r4 No new state computed
Name = +r2.r3 No new state computed
Name = +r11.r3 No new state computed
Name = (+r13.r4+r4.r13) No new state computed
Name = (+r7.r6+r6.r7) No new state computed
Name = +r3.r13 No new state computed
Name = +r14.r9 No new state computed
increase = 1
**********************
Random choose
Name = +r5  OK !
Now we have a representation of size = 353
Minimization in Progress
Name = +r13  I.N.C.R.E.A.S.E
Name = +r14 No new state computed
Name = +r3.r2 No new state computed
Name = +r7 No new state computed
Name = +r14.r2 No new state computed
Name = +r2.r10 No new state computed
Name = +r3.r4 No new state computed
Name = +r12.r5 No new state computed
Name = +r10 No new state computed
Name = +r3 No new state computed
Name = (+r14.r13+r13.r14)  I.N.C.R.E.A.S.E
Name = +r11.r3 No new state computed
Name = +r14.r11 No new state computed
Name = +r4 No new state computed
Name = +r11.r10 No new state computed
Name = (+r5.r4+r4.r5) No new state computed
Name = +r2.r7 No new state computed
Name = +r9.r10  I.N.C.R.E.A.S.E
Name = +r3.r11 No new state computed
Name = +r10.r13 No new state computed
Name = +r9  I.N.C.R.E.A.S.E
Name = +r3.r6 No new state computed
Name = (+r12.r9+r9.r12) No new state computed
Name = +r14.r4 No new state computed
Name = +r13.r10 No new state computed
Name = +r2.r14 No new state computed
Name = +r13.r3 No new state computed
Name = (+r12.r11+r11.r12) No new state computed
Name = +r10.r5 No new state computed
Name = +r9.r3 No new state computed
Name = +r6.r3 No new state computed
Name = +r12 No new state computed
Name = +r10.r9  I.N.C.R.E.A.S.E
Name = +r7.r9 No new state computed
Name = +r9.r7 No new state computed
Name = +r10.r6 No new state computed
Name = (+r13.r12+r12.r13)  I.N.C.R.E.A.S.E
Name = (+r5.r2+r2.r5) No new state computed
Name = +r10.r4 No new state computed
Name = (+r9.r8+r8.r9)  I.N.C.R.E.A.S.E
Name = +r14.r9 No new state computed
Name = +r12.r10 No new state computed
Name = (+r6.r4+r4.r6) No new state computed
Name = +r9.r14 No new state computed
Name = +r10.r2 No new state computed
Name = +r6.r10 No new state computed
Name = +r10.r11 No new state computed
Name = +r4.r10 No new state computed
Name = +r7.r2 No new state computed
Name = +r4.r7 No new state computed
Name = (+r2.r1+r1.r2) No new state computed
Name = +r8 No new state computed
Name = +r11 No new state computed
Name = +r2.r3 No new state computed
Name = +r3.r13 No new state computed
Name = (+r11.r6+r6.r11) No new state computed
Name = (+r13.r4+r4.r13) No new state computed
Name = +r11.r14 No new state computed
Name = (+r6.r5+r5.r6)  I.N.C.R.E.A.S.E
Name = (+r7.r6+r6.r7)  I.N.C.R.E.A.S.E
Name = +r4.r14 No new state computed
Name = +r5.r3 No new state computed
Name = +r4.r3 No new state computed
Name = +r5.r12 No new state computed
Name = +r11.r7 No new state computed
Name = +r3.r12 No new state computed
Name = +r1 No new state computed
Name = +r3.r9 No new state computed
Name = +r6  I.N.C.R.E.A.S.E
Name = +r7.r11 No new state computed
Name = (+r13.r11+r11.r13) No new state computed
Name = +r7.r4 No new state computed
Name = +r2 No new state computed
increase = 1
**********************
Random choose
Name = +r6  OK !
Now we have a representation of size = 364
Minimization in Progress
Name = +r4.r7 No new state computed
Name = (+r2.r1+r1.r2) No new state computed
Name = +r1 No new state computed
Name = (+r7.r6+r6.r7)  I.N.C.R.E.A.S.E
Name = +r4 No new state computed
Name = +r5.r12 No new state computed
Name = +r5.r3 No new state computed
Name = +r10.r6 No new state computed
Name = (+r6.r5+r5.r6) No new state computed
Name = (+r6.r4+r4.r6) No new state computed
Name = +r12.r10 No new state computed
Name = +r6.r3 No new state computed
Name = +r14.r4 No new state computed
Name = +r14.r9 No new state computed
Name = +r14 No new state computed
Name = +r3.r9 No new state computed
Name = +r10.r4 No new state computed
Name = (+r13.r11+r11.r13) No new state computed
Name = +r9  I.N.C.R.E.A.S.E
Name = +r3.r13 No new state computed
Name = +r13.r10 No new state computed
Name = +r2.r10 No new state computed
Name = +r3.r4 No new state computed
Name = (+r9.r8+r8.r9)  I.N.C.R.E.A.S.E
Name = +r5 No new state computed
Name = +r11.r7 No new state computed
Name = +r3.r6 No new state computed
Name = +r13.r3 No new state computed
Name = (+r13.r12+r12.r13)  I.N.C.R.E.A.S.E
Name = +r13  I.N.C.R.E.A.S.E
Name = (+r5.r2+r2.r5) No new state computed
Name = +r11.r3 No new state computed
Name = +r9.r14 No new state computed
Name = +r8 No new state computed
Name = (+r11.r6+r6.r11) No new state computed
Name = +r12.r5 No new state computed
Name = +r7.r4  I.N.C.R.E.A.S.E
Name = +r3.r11 No new state computed
Name = +r7  I.N.C.R.E.A.S.E
Name = +r11.r10 No new state computed
Name = (+r12.r9+r9.r12) No new state computed
Name = +r10.r9  I.N.C.R.E.A.S.E
Name = +r3 No new state computed
Name = +r4.r10 No new state computed
Name = +r9.r10  I.N.C.R.E.A.S.E
Name = (+r5.r4+r4.r5) No new state computed
Name = +r3.r12 No new state computed
Name = (+r12.r11+r11.r12) No new state computed
Name = +r7.r2  OK !
Now we have a representation of size = 352
Name = +r11.r10 No new state computed
Name = +r3.r6 No new state computed
Name = (+r13.r4+r4.r13) No new state computed
Name = +r10.r5 No new state computed
Name = +r14.r11 No new state computed
Name = +r6.r3 No new state computed
Name = +r10.r4 No new state computed
Name = +r7.r11  I.N.C.R.E.A.S.E
Name = (+r11.r6+r6.r11) No new state computed
Name = (+r6.r5+r5.r6) No new state computed
Name = +r3.r12 No new state computed
Name = +r3.r2  I.N.C.R.E.A.S.E
Name = +r12.r5 No new state computed
Name = +r9.r7 No new state computed
Name = +r7.r9  I.N.C.R.E.A.S.E
Name = +r10.r11 No new state computed
Name = +r4.r14 No new state computed
Name = (+r13.r12+r12.r13)  I.N.C.R.E.A.S.E
Name = +r14.r2 No new state computed
Name = +r7  I.N.C.R.E.A.S.E
Name = (+r9.r8+r8.r9)  I.N.C.R.E.A.S.E
Name = +r5.r12 No new state computed
Name = +r3  I.N.C.R.E.A.S.E
Name = +r3.r4  I.N.C.R.E.A.S.E
Name = +r14.r4 No new state computed
Name = +r9.r10  I.N.C.R.E.A.S.E
Name = +r7.r4 No new state computed
Name = (+r13.r11+r11.r13) No new state computed
Name = +r4.r3 No new state computed
Name = +r2.r7 No new state computed
Name = +r10.r9  I.N.C.R.E.A.S.E
Name = +r6 No new state computed
Name = +r9  I.N.C.R.E.A.S.E
Name = (+r5.r2+r2.r5) No new state computed
Name = +r4 No new state computed
Name = +r10 No new state computed
Name = +r5.r3 No new state computed
Name = +r4.r10 No new state computed
Name = +r10.r6 No new state computed
Name = (+r5.r4+r4.r5) No new state computed
Name = +r2.r14 No new state computed
Name = +r11.r3 No new state computed
Name = +r13.r3 No new state computed
Name = +r14.r9 No new state computed
Name = (+r12.r11+r11.r12) No new state computed
Name = +r4.r7 No new state computed
Name = (+r12.r9+r9.r12) No new state computed
Name = +r3.r11  I.N.C.R.E.A.S.E
Name = (+r6.r4+r4.r6) No new state computed
Name = +r12.r10 No new state computed
Name = +r5 No new state computed
Name = +r8 No new state computed
Name = +r11.r7 No new state computed
Name = +r10.r2 No new state computed
Name = +r6.r10 No new state computed
Name = +r10.r13 No new state computed
Name = +r3.r13 No new state computed
Name = +r11.r14 No new state computed
Name = +r2.r10 No new state computed
Name = +r9.r3 No new state computed
Name = (+r2.r1+r1.r2) No new state computed
Name = +r12 No new state computed
Name = +r2.r3 No new state computed
Name = +r14 No new state computed
Name = +r13  I.N.C.R.E.A.S.E
Name = +r9.r14 No new state computed
Name = +r11 No new state computed
Name = +r3.r9  I.N.C.R.E.A.S.E
Name = (+r7.r6+r6.r7)  I.N.C.R.E.A.S.E
Name = +r1 No new state computed
Name = +r13.r10 No new state computed
Name = (+r14.r13+r13.r14)  I.N.C.R.E.A.S.E
Name = +r2 No new state computed
increase = 1
**********************
Random choose
Name = (+r14.r13+r13.r14)  OK !
Now we have a representation of size = 522
Minimization in Progress
Name = +r2.r7 No new state computed
Name = (+r6.r4+r4.r6) No new state computed
Name = +r7.r2 No new state computed
Name = +r5.r12 No new state computed
Name = +r6.r3 No new state computed
Name = (+r12.r9+r9.r12) No new state computed
Name = +r4.r7 No new state computed
Name = +r3  I.N.C.R.E.A.S.E
Name = +r14.r11 No new state computed
Name = +r3.r12 No new state computed
Name = +r9.r10  I.N.C.R.E.A.S.E
Name = +r13.r10 No new state computed
Name = +r14.r4 No new state computed
Name = +r7.r4 No new state computed
Name = +r7  I.N.C.R.E.A.S.E
Name = (+r11.r6+r6.r11) No new state computed
Name = +r4.r3 No new state computed
Name = +r5.r3 No new state computed
Name = +r3.r2  I.N.C.R.E.A.S.E
Name = (+r6.r5+r5.r6) No new state computed
Name = +r2.r14 No new state computed
Name = +r11.r7 No new state computed
Name = +r12.r5 No new state computed
Name = +r2  I.N.C.R.E.A.S.E
Name = +r1 No new state computed
Name = (+r12.r11+r11.r12) No new state computed
Name = (+r13.r4+r4.r13) No new state computed
Name = +r4  I.N.C.R.E.A.S.E
Name = +r4.r14 No new state computed
Name = +r11.r10 No new state computed
Name = +r14 No new state computed
Name = +r9.r14 No new state computed
Name = +r5 No new state computed
Name = +r14.r9 No new state computed
Name = +r7.r9  I.N.C.R.E.A.S.E
Name = +r9.r7 No new state computed
Name = +r10.r13 No new state computed
Name = +r6 No new state computed
Name = +r8 No new state computed
Name = +r11.r3 No new state computed
Name = +r11 No new state computed
Name = (+r13.r12+r12.r13)  OK !
Now we have a representation of size = 519
Name = +r10.r5 No new state computed
Name = +r14.r2  I.N.C.R.E.A.S.E
Name = +r5.r3 No new state computed
Name = +r10 No new state computed
Name = +r9  I.N.C.R.E.A.S.E
Name = (+r5.r2+r2.r5)  I.N.C.R.E.A.S.E
Name = +r8 No new state computed
Name = +r13 No new state computed
Name = +r7  I.N.C.R.E.A.S.E
Name = +r10.r9  I.N.C.R.E.A.S.E
Name = (+r5.r4+r4.r5)  I.N.C.R.E.A.S.E
Name = +r10.r11 No new state computed
Name = +r12.r5 No new state computed
Name = +r11.r10 No new state computed
Name = +r4.r7 No new state computed
Name = (+r9.r8+r8.r9)  I.N.C.R.E.A.S.E
Name = +r3.r4  I.N.C.R.E.A.S.E
Name = +r2.r3 No new state computed
Name = (+r6.r4+r4.r6) No new state computed
Name = +r11.r3 No new state computed
Name = +r2  I.N.C.R.E.A.S.E
Name = +r10.r4 No new state computed
Name = +r14.r9  OK !
Now we have a representation of size = 519
Name = (+r14.r13+r13.r14) No new state computed
Name = +r11.r10 No new state computed
Name = +r11.r7 No new state computed
Name = (+r9.r8+r8.r9)  I.N.C.R.E.A.S.E
Name = +r3.r6 No new state computed
Name = +r13.r3 No new state computed
Name = +r5 No new state computed
Name = +r7  I.N.C.R.E.A.S.E
Name = (+r12.r9+r9.r12) No new state computed
Name = +r4  I.N.C.R.E.A.S.E
Name = +r7.r2 No new state computed
Name = +r4.r7 No new state computed
Name = +r9.r3 No new state computed
Name = +r2.r7 No new state computed
Name = +r3.r13 No new state computed
Name = +r9.r14 No new state computed
Name = +r8 No new state computed
Name = +r7.r11  I.N.C.R.E.A.S.E
Name = (+r13.r4+r4.r13) No new state computed
Name = +r10.r4  I.N.C.R.E.A.S.E
Name = (+r13.r11+r11.r13) No new state computed
Name = +r4.r14 No new state computed
Name = +r3.r4  I.N.C.R.E.A.S.E
Name = +r7.r4 No new state computed
Name = +r3  I.N.C.R.E.A.S.E
Name = +r12 No new state computed
Name = +r13.r10 No new state computed
Name = +r5.r12 No new state computed
Name = (+r6.r4+r4.r6) No new state computed
Name = +r10.r6 No new state computed
Name = +r1 No new state computed
Name = +r5.r3 No new state computed
Name = +r2.r10 No new state computed
Name = +r9  I.N.C.R.E.A.S.E
Name = +r4.r10 No new state computed
Name = +r3.r2  I.N.C.R.E.A.S.E
Name = +r3.r11  I.N.C.R.E.A.S.E
Name = (+r5.r2+r2.r5)  I.N.C.R.E.A.S.E
Name = +r10.r11 No new state computed
Name = +r14.r4  I.N.C.R.E.A.S.E
Name = (+r7.r6+r6.r7)  I.N.C.R.E.A.S.E
Name = +r3.r9  I.N.C.R.E.A.S.E
Name = (+r5.r4+r4.r5)  I.N.C.R.E.A.S.E
Name = +r11 No new state computed
Name = +r10.r9  I.N.C.R.E.A.S.E
Name = +r3.r12 No new state computed
Name = +r12.r5 No new state computed
Name = (+r2.r1+r1.r2)  I.N.C.R.E.A.S.E
Name = +r9.r10  I.N.C.R.E.A.S.E
Name = +r9.r7 No new state computed
Name = +r12.r10 No new state computed
Name = +r6 No new state computed
Name = +r14.r11 No new state computed
Name = +r2.r14 No new state computed
Name = +r11.r14 No new state computed
Name = +r10  OK !
Now we have a representation of size = 509
Name = +r5.r3 No new state computed
Name = +r11.r7 No new state computed
Name = +r11 No new state computed
Name = +r9.r3 No new state computed
Name = +r6.r10 No new state computed
Name = (+r6.r5+r5.r6) No new state computed
Name = +r7  I.N.C.R.E.A.S.E
Name = +r4.r14 No new state computed
Name = +r13 No new state computed
Name = +r10.r6 No new state computed
Name = +r10.r11 No new state computed
Name = +r14.r2  I.N.C.R.E.A.S.E
Name = +r9.r7 No new state computed
Name = +r9.r10  I.N.C.R.E.A.S.E
Name = +r7.r2 No new state computed
Name = +r6.r3 No new state computed
Name = +r3.r13 No new state computed
Name = (+r13.r12+r12.r13) No new state computed
Name = +r10.r13 No new state computed
Name = +r7.r9  I.N.C.R.E.A.S.E
Name = +r3.r11  I.N.C.R.E.A.S.E
Name = +r7.r4 No new state computed
Name = +r10.r4  I.N.C.R.E.A.S.E
Name = (+r5.r2+r2.r5)  OK !
Now we have a representation of size = 509
Name = +r5.r12 No new state computed
Name = +r3.r2  I.N.C.R.E.A.S.E
Name = +r13.r10 No new state computed
Name = +r10 No new state computed
Name = +r10.r6 No new state computed
Name = +r4  I.N.C.R.E.A.S.E
Name = +r14 No new state computed
Name = (+r12.r9+r9.r12) No new state computed
Name = +r11.r14 No new state computed
Name = +r7.r4 No new state computed
Name = +r3.r4  I.N.C.R.E.A.S.E
Name = +r4.r10 No new state computed
Name = +r2.r3 No new state computed
Name = +r14.r11 No new state computed
Name = +r9.r14 No new state computed
Name = +r9  I.N.C.R.E.A.S.E
Name = (+r13.r12+r12.r13) No new state computed
Name = +r14.r2  I.N.C.R.E.A.S.E
Name = (+r5.r4+r4.r5) No new state computed
Name = +r10.r2  I.N.C.R.E.A.S.E
Name = +r3.r12 No new state computed
Name = +r2.r14 No new state computed
Name = +r4.r14 No new state computed
Name = +r7.r2 No new state computed
Name = +r2  I.N.C.R.E.A.S.E
Name = +r3.r11  I.N.C.R.E.A.S.E
Name = +r14.r9 No new state computed
Name = +r12.r10 No new state computed
Name = +r4.r3 No new state computed
Name = (+r13.r4+r4.r13) No new state computed
Name = +r3.r9  I.N.C.R.E.A.S.E
Name = +r13 No new state computed
Name = +r2.r7 No new state computed
Name = +r3.r6 No new state computed
Name = +r3.r13 No new state computed
Name = +r2.r10 No new state computed
Name = +r7.r9  I.N.C.R.E.A.S.E
Name = +r7  I.N.C.R.E.A.S.E
Name = (+r11.r6+r6.r11) No new state computed
Name = +r12.r5 No new state computed
Name = (+r14.r13+r13.r14) No new state computed
Name = +r6.r3 No new state computed
Name = +r10.r11 No new state computed
Name = +r1 No new state computed
Name = +r9.r10  I.N.C.R.E.A.S.E
Name = +r6  OK !
Now we have a representation of size = 497
Name = +r9.r14 No new state computed
Name = +r10.r6 No new state computed
Name = (+r5.r2+r2.r5) No new state computed
Name = +r6.r10 No new state computed
Name = +r11 No new state computed
Name = +r9.r10  I.N.C.R.E.A.S.E
Name = +r11.r14 No new state computed
Name = +r12 No new state computed
Name = +r7.r11  I.N.C.R.E.A.S.E
Name = +r10.r2  I.N.C.R.E.A.S.E
Name = +r3.r12 No new state computed
Name = +r2  I.N.C.R.E.A.S.E
Name = +r6.r3 No new state computed
Name = (+r5.r4+r4.r5) No new state computed
Name = +r14.r9 No new state computed
Name = +r4.r3 No new state computed
Name = +r7  I.N.C.R.E.A.S.E
Name = +r9.r3 No new state computed
Name = (+r13.r12+r12.r13) No new state computed
Name = +r9  I.N.C.R.E.A.S.E
Name = +r9.r7 No new state computed
Name = +r11.r7 No new state computed
Name = +r14.r11 No new state computed
Name = +r3.r9  I.N.C.R.E.A.S.E
Name = +r2.r14 No new state computed
Name = +r7.r4  I.N.C.R.E.A.S.E
Name = (+r9.r8+r8.r9)  I.N.C.R.E.A.S.E
Name = +r14.r4  I.N.C.R.E.A.S.E
Name = +r3.r6 No new state computed
Name = +r14 No new state computed
Name = +r3.r4  I.N.C.R.E.A.S.E
Name = +r2.r3 No new state computed
Name = +r3.r13 No new state computed
Name = (+r14.r13+r13.r14) No new state computed
Name = +r2.r10 No new state computed
Name = (+r2.r1+r1.r2)  I.N.C.R.E.A.S.E
Name = +r4.r14 No new state computed
Name = +r12.r10 No new state computed
Name = +r10.r13 No new state computed
Name = +r3.r11  I.N.C.R.E.A.S.E
Name = +r10 No new state computed
Name = +r5.r3 No new state computed
Name = +r10.r5 No new state computed
Name = (+r11.r6+r6.r11) No new state computed
Name = +r5.r12 No new state computed
Name = (+r7.r6+r6.r7)  I.N.C.R.E.A.S.E
Name = +r3.r2  I.N.C.R.E.A.S.E
Name = +r11.r3 No new state computed
Name = +r13.r3 No new state computed
Name = +r12.r5 No new state computed
Name = (+r13.r4+r4.r13) No new state computed
Name = +r13 No new state computed
Name = +r11.r10 No new state computed
Name = +r7.r2  I.N.C.R.E.A.S.E
Name = +r13.r10 No new state computed
Name = +r10.r9  I.N.C.R.E.A.S.E
Name = +r4.r10 No new state computed
Name = +r8 No new state computed
Name = (+r12.r9+r9.r12) No new state computed
Name = (+r12.r11+r11.r12) No new state computed
Name = +r10.r4  I.N.C.R.E.A.S.E
Name = +r10.r11 No new state computed
Name = +r3  I.N.C.R.E.A.S.E
Name = +r14.r2  I.N.C.R.E.A.S.E
Name = (+r6.r4+r4.r6) No new state computed
Name = +r7.r9  I.N.C.R.E.A.S.E
Name = +r1 No new state computed
Name = +r4  I.N.C.R.E.A.S.E
Name = +r2.r7 No new state computed
Name = (+r13.r11+r11.r13) No new state computed
Name = +r4.r7 No new state computed
Name = (+r6.r5+r5.r6) No new state computed
Name = +r5 No new state computed
increase = 1
**********************
Random choose
Name = +r4  OK !
Now we have a representation of size = 532
Minimization in Progress
Name = +r14.r2 No new state computed
Name = (+r5.r4+r4.r5) No new state computed
Name = (+r7.r6+r6.r7)  I.N.C.R.E.A.S.E
Name = +r3.r13 No new state computed
Name = +r3.r9  I.N.C.R.E.A.S.E
Name = +r9.r7 No new state computed
Name = (+r5.r2+r2.r5) No new state computed
Name = +r4.r3 No new state computed
Name = +r1 No new state computed
Name = +r7.r11  I.N.C.R.E.A.S.E
Name = +r6.r10 No new state computed
Name = +r4.r10 No new state computed
Name = +r9.r3 No new state computed
Name = +r10.r6 No new state computed
Name = (+r12.r11+r11.r12) No new state computed
Name = (+r11.r6+r6.r11) No new state computed
Name = +r3.r2  I.N.C.R.E.A.S.E
Name = +r14.r11 No new state computed
Name = +r2 No new state computed
Name = +r6.r3 No new state computed
Name = +r4.r7 No new state computed
Name = (+r14.r13+r13.r14) No new state computed
Name = +r10.r9  I.N.C.R.E.A.S.E
Name = (+r12.r9+r9.r12) No new state computed
Name = (+r2.r1+r1.r2) No new state computed
Name = +r7  I.N.C.R.E.A.S.E
Name = (+r13.r4+r4.r13) No new state computed
Name = (+r6.r4+r4.r6) No new state computed
Name = +r12.r10 No new state computed
Name = +r14.r9 No new state computed
Name = +r10.r11 No new state computed
Name = +r3.r6 No new state computed
Name = +r5.r12 No new state computed
Name = +r11.r10 No new state computed
Name = +r14 No new state computed
Name = +r10.r13 No new state computed
Name = +r12.r5 No new state computed
Name = +r9  I.N.C.R.E.A.S.E
Name = +r2.r7 No new state computed
Name = +r7.r2  OK !
Now we have a representation of size = 504
Name = +r2.r10 No new state computed
Name = (+r7.r6+r6.r7)  I.N.C.R.E.A.S.E
Name = +r6 No new state computed
Name = +r10.r6 No new state computed
Name = (+r5.r4+r4.r5) No new state computed
Name = +r10.r9  I.N.C.R.E.A.S.E
Name = +r7.r4 No new state computed
Name = +r4.r10 No new state computed
Name = +r3.r11  I.N.C.R.E.A.S.E
Name = +r4.r3 No new state computed
Name = +r4.r14 No new state computed
Name = +r10.r4 No new state computed
Name = +r7.r11  I.N.C.R.E.A.S.E
Name = +r9.r14 No new state computed
Name = +r12.r10 No new state computed
Name = +r8 No new state computed
Name = +r2.r3 No new state computed
Name = +r3  I.N.C.R.E.A.S.E
Name = (+r13.r12+r12.r13) No new state computed
Name = +r13.r3 No new state computed
Name = +r6.r3 No new state computed
Name = +r12 No new state computed
Name = (+r11.r6+r6.r11) No new state computed
Name = +r14.r2 No new state computed
Name = +r4.r7 No new state computed
Name = (+r13.r4+r4.r13) No new state computed
Name = +r9  I.N.C.R.E.A.S.E
Name = +r3.r6 No new state computed
Name = +r2.r7 No new state computed
Name = +r3.r13 No new state computed
Name = +r10 No new state computed
Name = +r4 No new state computed
Name = (+r14.r13+r13.r14) No new state computed
Name = +r11.r7 No new state computed
Name = +r10.r13 No new state computed
Name = (+r12.r9+r9.r12) No new state computed
Name = +r11 No new state computed
Name = +r13 No new state computed
Name = (+r5.r2+r2.r5) No new state computed
Name = (+r2.r1+r1.r2) No new state computed
Name = +r14.r11 No new state computed
Name = +r7.r9  I.N.C.R.E.A.S.E
Name = +r12.r5 No new state computed
Name = +r3.r4  I.N.C.R.E.A.S.E
Name = +r13.r10 No new state computed
Name = +r6.r10 No new state computed
Name = +r14 No new state computed
Name = +r10.r11 No new state computed
Name = (+r6.r5+r5.r6) No new state computed
Name = +r1 No new state computed
Name = +r9.r7 No new state computed
Name = +r11.r14 No new state computed
Name = +r2 No new state computed
Name = (+r9.r8+r8.r9)  I.N.C.R.E.A.S.E
Name = +r9.r10  I.N.C.R.E.A.S.E
Name = +r7  I.N.C.R.E.A.S.E
Name = +r2.r14 No new state computed
Name = (+r6.r4+r4.r6) No new state computed
Name = +r10.r5 No new state computed
Name = +r14.r4 No new state computed
Name = (+r13.r11+r11.r13) No new state computed
Name = +r11.r3 No new state computed
Name = +r5.r3 No new state computed
Name = +r10.r2 No new state computed
Name = +r3.r9  I.N.C.R.E.A.S.E
Name = +r14.r9 No new state computed
Name = (+r12.r11+r11.r12) No new state computed
Name = +r9.r3 No new state computed
Name = +r11.r10 No new state computed
Name = +r3.r12 No new state computed
Name = +r5.r12 No new state computed
Name = +r3.r2  I.N.C.R.E.A.S.E
Name = +r5 No new state computed
increase = 1
**********************
Random choose
Name = +r3.r2  OK !
Now we have a representation of size = 767
Minimization in Progress
Name = +r10.r6 No new state computed
Name = +r9.r7 No new state computed
Name = (+r13.r4+r4.r13) No new state computed
Name = (+r12.r11+r11.r12) No new state computed
Name = (+r11.r6+r6.r11) No new state computed
Name = +r6.r10 No new state computed
Name = +r12.r10 No new state computed
Name = (+r12.r9+r9.r12) No new state computed
Name = +r7  I.N.C.R.E.A.S.E
Name = +r5 No new state computed
Name = +r13.r10 No new state computed
Name = (+r5.r2+r2.r5) No new state computed
Name = +r13 No new state computed
Name = +r4.r14 No new state computed
Name = +r10.r9  I.N.C.R.E.A.S.E
Name = +r13.r3 No new state computed
Name = +r2.r7 No new state computed
Name = +r14.r9 No new state computed
Name = (+r6.r5+r5.r6) No new state computed
Name = +r3.r6 No new state computed
Name = +r4.r7 No new state computed
Name = (+r13.r11+r11.r13) No new state computed
Name = +r7.r2 No new state computed
Name = (+r9.r8+r8.r9)  I.N.C.R.E.A.S.E
Name = +r14 No new state computed
Name = +r7.r4 No new state computed
Name = +r9.r10  I.N.C.R.E.A.S.E
Name = +r5.r3 No new state computed
Name = +r8 No new state computed
Name = +r6 No new state computed
Name = +r9.r14 No new state computed
Name = +r10.r2 No new state computed
Name = +r3.r11  OK !
Now we have a representation of size = 767
Name = +r2.r10 No new state computed
Name = (+r14.r13+r13.r14) No new state computed
Name = +r12  OK !
Now we have a representation of size = 767
Name = +r11.r3 No new state computed
Name = +r9.r3 No new state computed
Name = +r14.r11 No new state computed
Name = +r10 No new state computed
Name = +r7  I.N.C.R.E.A.S.E
Name = +r7.r2 No new state computed
Name = +r9.r7 No new state computed
Name = +r13 No new state computed
Name = +r7.r9  I.N.C.R.E.A.S.E
Name = +r7.r11  I.N.C.R.E.A.S.E
Name = (+r5.r4+r4.r5) No new state computed
Name = +r2.r7 No new state computed
Name = +r1 No new state computed
Name = +r14.r4 No new state computed
Name = +r4.r14 No new state computed
Name = +r11.r14 No new state computed
Name = +r2.r10 No new state computed
Name = +r14 No new state computed
Name = +r9.r10  I.N.C.R.E.A.S.E
Name = +r10.r2 No new state computed
Name = (+r12.r9+r9.r12) No new state computed
Name = +r7.r4 No new state computed
Name = +r3.r6 No new state computed
Name = (+r11.r6+r6.r11) No new state computed
Name = +r10.r6 No new state computed
Name = (+r7.r6+r6.r7)  I.N.C.R.E.A.S.E
Name = +r9  I.N.C.R.E.A.S.E
Name = +r5.r3 No new state computed
Name = +r2 No new state computed
Name = +r11.r10 No new state computed
Name = +r3.r4 No new state computed
Name = (+r13.r4+r4.r13) No new state computed
Name = +r5 No new state computed
Name = +r12.r10 No new state computed
Name = (+r13.r12+r12.r13) No new state computed
Name = (+r12.r11+r11.r12) No new state computed
Name = +r10.r5 