current set encoding is : prestaf
seed is : 3284
cycles of length 1
(1/9), name = r2, size = 1109
(2/9), name = r3, size = 255
(3/9), name = r4, size = 83
(4/9), name = r5, size = 191
(5/9), name = r6, size = 234
(6/9), name = r7, size = 944
(7/9), name = r8, size = 94
(8/9), name = r9, size = 243
(9/9), name = r10, size = 149
**********************
Random choose
Name = r5  No new state computed
Name = r6  No new state computed
Name = r8  No new state computed
Name = r3  No new state computed
Name = r9  No new state computed
Name = r2  OK !
Now we have a representation of size = 21
Minimization in Progress
Name = r10 No new state computed
Name = r4  I.N.C.R.E.A.S.E
Name = r6 No new state computed
Name = r9 No new state computed
Name = r7  I.N.C.R.E.A.S.E
Name = r5  I.N.C.R.E.A.S.E
Name = r3 No new state computed
Name = r8 No new state computed
increase = 1
**********************
Random choose
Name = r5  OK !
Now we have a representation of size = 52
Minimization in Progress
Name = r10 No new state computed
Name = r9  I.N.C.R.E.A.S.E
Name = r4  I.N.C.R.E.A.S.E
Name = r6 No new state computed
Name = r7  I.N.C.R.E.A.S.E
Name = r2  I.N.C.R.E.A.S.E
Name = r3 No new state computed
Name = r8 No new state computed
increase = 1
**********************
Random choose
Name = r2  OK !
Now we have a representation of size = 95
Minimization in Progress
Name = r3 No new state computed
Name = r4  I.N.C.R.E.A.S.E
Name = r7  I.N.C.R.E.A.S.E
Name = r5 No new state computed
Name = r6 No new state computed
Name = r10 No new state computed
Name = r9  I.N.C.R.E.A.S.E
Name = r8 No new state computed
increase = 1
**********************
Random choose
Name = r9  OK !
Now we have a representation of size = 115
Minimization in Progress
Name = r3 No new state computed
Name = r2  I.N.C.R.E.A.S.E
Name = r6 No new state computed
Name = r8 No new state computed
Name = r10 No new state computed
Name = r5 No new state computed
Name = r7  I.N.C.R.E.A.S.E
Name = r4  OK !
Now we have a representation of size = 115
Name = r9 No new state computed
Name = r8 No new state computed
Name = r10  OK !
Now we have a representation of size = 105
Name = r9 No new state computed
Name = r2  OK !
Now we have a representation of size = 102
Name = r4 No new state computed
Name = r8 No new state computed
Name = r5 No new state computed
Name = r7  I.N.C.R.E.A.S.E
Name = r3 No new state computed
Name = r6 No new state computed
Name = r10 No new state computed
Name = r9 No new state computed
increase = 1
**********************
Random choose
Name = r7  OK !
Now we have a representation of size = 106
Minimization in Progress
Name = r2 No new state computed
Name = r10 No new state computed
Name = r5 No new state computed
Name = r4 No new state computed
Name = r6 No new state computed
Name = r3 No new state computed
Name = r9 No new state computed
Name = r8 No new state computed
increase = 0
nb accelerations 8
Fix point FOUND
seed is : 3284
