current set encoding is : omega
seed is : 2691
cycles of length 1
(1/4), name = r1, size = 27
(2/4), name = r2, size = 38
(3/4), name = r3, size = 52
(4/4), name = r4, size = 77
**********************
Random choose
Name = r2  No new state computed
Name = r1  OK !
Now we have a representation of size = 13
Minimization in Progress
Name = r2 No new state computed
Name = r3  I.N.C.R.E.A.S.E
Name = r4  I.N.C.R.E.A.S.E
increase = 1
**********************
Random choose
Name = r4  OK !
Now we have a representation of size = 49
Minimization in Progress
Name = r3 No new state computed
Name = r2  I.N.C.R.E.A.S.E
Name = r1 No new state computed
increase = 1
**********************
Random choose
Name = r2  OK !
Now we have a representation of size = 67
Minimization in Progress
Name = r1  I.N.C.R.E.A.S.E
Name = r3 No new state computed
Name = r4 No new state computed
increase = 1
**********************
Random choose
Name = r1  OK !
Now we have a representation of size = 115
Minimization in Progress
Name = r4 No new state computed
Name = r2 No new state computed
Name = r3 No new state computed
increase = 0
nb accelerations 4
Fix point FOUND
seed is : 2691
