current set encoding is : mona
seed is : 21768
cycles of length 1
(1/17), name = t1, size = 350
(2/17), name = t2, size = 362
(3/17), name = t3, size = 606
(4/17), name = t4, size = 654
(5/17), name = t5, size = 642
(6/17), name = t6, size = 606
(7/17), name = t7, size = 344
(8/17), name = t8, size = 344
(9/17), name = t9, size = 356
(10/17), name = t10, size = 350
(11/17), name = t11, size = 344
(12/17), name = t12, size = 344
(13/17), name = t13, size = 350
(14/17), name = t14, size = 356
(15/17), name = t15, size = 362
(16/17), name = t16, size = 600
(17/17), name = t17, size = 696
**********************
Random choose
Name = t4  No new state computed
Name = t6  No new state computed
Name = t8  No new state computed
Name = t9  No new state computed
Name = t16  No new state computed
Name = t5  No new state computed
Name = t2  OK !
Now we have a representation of size = 487
Minimization in Progress
Name = t10  I.N.C.R.E.A.S.E
Name = t1  OK !
Now we have a representation of size = 469
Name = t3 No new state computed
Name = t10  I.N.C.R.E.A.S.E
Name = t13 No new state computed
Name = t5 No new state computed
Name = t2 No new state computed
Name = t12 No new state computed
Name = t7 No new state computed
Name = t11 No new state computed
Name = t14 No new state computed
Name = t16 No new state computed
Name = t9 No new state computed
Name = t6 No new state computed
Name = t4 No new state computed
Name = t17 No new state computed
Name = t15 No new state computed
Name = t8 No new state computed
increase = 1
**********************
Random choose
Name = t10  OK !
Now we have a representation of size = 509
Minimization in Progress
Name = t9  I.N.C.R.E.A.S.E
Name = t17 No new state computed
Name = t11  OK !
Now we have a representation of size = 509
Name = t3 No new state computed
Name = t17 No new state computed
Name = t15 No new state computed
Name = t5 No new state computed
Name = t12  I.N.C.R.E.A.S.E
Name = t4 No new state computed
Name = t10 No new state computed
Name = t14 No new state computed
Name = t6  I.N.C.R.E.A.S.E
Name = t1 No new state computed
Name = t8 No new state computed
Name = t9  I.N.C.R.E.A.S.E
Name = t2 No new state computed
Name = t13  I.N.C.R.E.A.S.E
Name = t16 No new state computed
Name = t7 No new state computed
increase = 1
**********************
Random choose
Name = t13  OK !
Now we have a representation of size = 549
Minimization in Progress
Name = t12  OK !
Now we have a representation of size = 549
Name = t17 No new state computed
Name = t4 No new state computed
Name = t16 No new state computed
Name = t15 No new state computed
Name = t8 No new state computed
Name = t2 No new state computed
Name = t7 No new state computed
Name = t13 No new state computed
Name = t9  I.N.C.R.E.A.S.E
Name = t1 No new state computed
Name = t10 No new state computed
Name = t5 No new state computed
Name = t3 No new state computed
Name = t14 No new state computed
Name = t6  I.N.C.R.E.A.S.E
Name = t11 No new state computed
increase = 1
**********************
Random choose
Name = t6  OK !
Now we have a representation of size = 553
Minimization in Progress
Name = t10 No new state computed
Name = t7 No new state computed
Name = t5 No new state computed
Name = t12 No new state computed
Name = t14 No new state computed
Name = t9  I.N.C.R.E.A.S.E
Name = t17 No new state computed
Name = t13 No new state computed
Name = t16 No new state computed
Name = t2 No new state computed
Name = t11 No new state computed
Name = t15 No new state computed
Name = t4 No new state computed
Name = t8 No new state computed
Name = t1 No new state computed
Name = t3 No new state computed
increase = 1
**********************
Random choose
Name = t9  OK !
Now we have a representation of size = 555
Minimization in Progress
Name = t11 No new state computed
Name = t14 No new state computed
Name = t13 No new state computed
Name = t4 No new state computed
Name = t1 No new state computed
Name = t6 No new state computed
Name = t8 No new state computed
Name = t5 No new state computed
Name = t17 No new state computed
Name = t16 No new state computed
Name = t3  I.N.C.R.E.A.S.E
Name = t12 No new state computed
Name = t7 No new state computed
Name = t2 No new state computed
Name = t10 No new state computed
Name = t15 No new state computed
increase = 1
**********************
Random choose
Name = t3  OK !
Now we have a representation of size = 559
Minimization in Progress
Name = t16 No new state computed
Name = t13 No new state computed
Name = t1 No new state computed
Name = t5 No new state computed
Name = t7 No new state computed
Name = t12 No new state computed
Name = t9 No new state computed
Name = t17 No new state computed
Name = t8 No new state computed
Name = t15 No new state computed
Name = t4 No new state computed
Name = t6 No new state computed
Name = t14 No new state computed
Name = t2 No new state computed
Name = t11 No new state computed
Name = t10 No new state computed
increase = 0
nb accelerations 9
Fix point FOUND
seed is : 21768
