current set encoding is : prestaf-no-among
seed is : 2691
cycles of length 1
(1/12), name = t1, size = 870
(2/12), name = t2, size = 906
(3/12), name = t3, size = 439
(4/12), name = t4, size = 439
(5/12), name = t5, size = 439
(6/12), name = t6, size = 882
(7/12), name = t7, size = 798
(8/12), name = t8, size = 906
(9/12), name = t9, size = 439
(10/12), name = t10, size = 439
(11/12), name = t11, size = 439
(12/12), name = t12, size = 846
**********************
Random choose
Name = t5  No new state computed
Name = t1  OK !
Now we have a representation of size = 18
Minimization in Progress
Name = t5 No new state computed
Name = t9 No new state computed
Name = t11 No new state computed
Name = t6 No new state computed
Name = t7  I.N.C.R.E.A.S.E
Name = t8 No new state computed
Name = t12 No new state computed
Name = t2 No new state computed
Name = t4 No new state computed
Name = t10 No new state computed
Name = t3  I.N.C.R.E.A.S.E
increase = 1
**********************
Random choose
Name = t3  OK !
Now we have a representation of size = 19
Minimization in Progress
Name = t4  I.N.C.R.E.A.S.E
Name = t5 No new state computed
Name = t11 No new state computed
Name = t6 No new state computed
Name = t10 No new state computed
Name = t1 No new state computed
Name = t12 No new state computed
Name = t7  I.N.C.R.E.A.S.E
Name = t2 No new state computed
Name = t9 No new state computed
Name = t8 No new state computed
increase = 1
**********************
Random choose
Name = t7  OK !
Now we have a representation of size = 21
Minimization in Progress
Name = t8  I.N.C.R.E.A.S.E
Name = t10 No new state computed
Name = t5 No new state computed
Name = t9 No new state computed
Name = t6 No new state computed
Name = t4  I.N.C.R.E.A.S.E
Name = t1 No new state computed
Name = t11 No new state computed
Name = t2 No new state computed
Name = t3 No new state computed
Name = t12 No new state computed
increase = 1
**********************
Random choose
Name = t4  OK !
Now we have a representation of size = 27
Minimization in Progress
Name = t1 No new state computed
Name = t3 No new state computed
Name = t9 No new state computed
Name = t8  I.N.C.R.E.A.S.E
Name = t10 No new state computed
Name = t2 No new state computed
Name = t7  OK !
Now we have a representation of size = 22
Name = t6 No new state computed
Name = t2 No new state computed
Name = t12 No new state computed
Name = t8  I.N.C.R.E.A.S.E
Name = t4 No new state computed
Name = t3 No new state computed
Name = t11 No new state computed
Name = t5 No new state computed
Name = t9 No new state computed
Name = t1 No new state computed
Name = t10 No new state computed
increase = 1
**********************
Random choose
Name = t8  OK !
Now we have a representation of size = 25
Minimization in Progress
Name = t10  I.N.C.R.E.A.S.E
Name = t1 No new state computed
Name = t7 No new state computed
Name = t9 No new state computed
Name = t4 No new state computed
Name = t2  I.N.C.R.E.A.S.E
Name = t3 No new state computed
Name = t11 No new state computed
Name = t6 No new state computed
Name = t5 No new state computed
Name = t12 No new state computed
increase = 1
**********************
Random choose
Name = t2  OK !
Now we have a representation of size = 34
Minimization in Progress
Name = t11  I.N.C.R.E.A.S.E
Name = t7 No new state computed
Name = t8 No new state computed
Name = t3 No new state computed
Name = t5 No new state computed
Name = t10  I.N.C.R.E.A.S.E
Name = t4 No new state computed
Name = t6 No new state computed
Name = t1 No new state computed
Name = t9 No new state computed
Name = t12 No new state computed
increase = 1
**********************
Random choose
Name = t10  OK !
Now we have a representation of size = 38
Minimization in Progress
Name = t11  I.N.C.R.E.A.S.E
Name = t1  I.N.C.R.E.A.S.E
Name = t6 No new state computed
Name = t3 No new state computed
Name = t5 No new state computed
Name = t2 No new state computed
Name = t9 No new state computed
Name = t4 No new state computed
Name = t7 No new state computed
Name = t12  OK !
Now we have a representation of size = 38
Name = t1  I.N.C.R.E.A.S.E
Name = t11  I.N.C.R.E.A.S.E
Name = t10 No new state computed
Name = t5 No new state computed
Name = t2 No new state computed
Name = t4 No new state computed
Name = t6 No new state computed
Name = t3 No new state computed
Name = t7  I.N.C.R.E.A.S.E
Name = t9 No new state computed
Name = t8 No new state computed
increase = 1
**********************
Random choose
Name = t7  OK !
Now we have a representation of size = 40
Minimization in Progress
Name = t11  OK !
Now we have a representation of size = 37
Name = t4 No new state computed
Name = t10 No new state computed
Name = t6 No new state computed
Name = t1  I.N.C.R.E.A.S.E
Name = t5 No new state computed
Name = t12 No new state computed
Name = t2 No new state computed
Name = t9 No new state computed
Name = t7 No new state computed
Name = t8 No new state computed
Name = t3 No new state computed
increase = 1
**********************
Random choose
Name = t1  OK !
Now we have a representation of size = 39
Minimization in Progress
Name = t4 No new state computed
Name = t6 No new state computed
Name = t5 No new state computed
Name = t9 No new state computed
Name = t7 No new state computed
Name = t11 No new state computed
Name = t8 No new state computed
Name = t12 No new state computed
Name = t2 No new state computed
Name = t3 No new state computed
Name = t10 No new state computed
increase = 0
nb accelerations 12
Fix point FOUND
seed is : 2691
