current set encoding is : omega
seed is : 21768
cycles of length 1
(1/8), name = r1, size = 40
(2/8), name = r2, size = 33
(3/8), name = r3, size = 55
(4/8), name = r4, size = 32
(5/8), name = r5, size = 41
(6/8), name = r6, size = 40
(7/8), name = r7, size = 33
(8/8), name = r8, size = 55
**********************
Random choose
Name = r2  No new state computed
Name = r3  No new state computed
Name = r4  No new state computed
Name = r7  No new state computed
Name = r8  No new state computed
Name = r6  OK !
Now we have a representation of size = 10
Minimization in Progress
Name = r2  I.N.C.R.E.A.S.E
Name = r4 No new state computed
Name = r1  I.N.C.R.E.A.S.E
Name = r5 No new state computed
Name = r7  I.N.C.R.E.A.S.E
Name = r3 No new state computed
Name = r8 No new state computed
increase = 1
**********************
Random choose
Name = r7  OK !
Now we have a representation of size = 15
Minimization in Progress
Name = r1  I.N.C.R.E.A.S.E
Name = r8  I.N.C.R.E.A.S.E
Name = r4 No new state computed
Name = r6 No new state computed
Name = r2 No new state computed
Name = r5 No new state computed
Name = r3  I.N.C.R.E.A.S.E
increase = 1
**********************
Random choose
Name = r3  OK !
Now we have a representation of size = 21
Minimization in Progress
Name = r8 No new state computed
Name = r6 No new state computed
Name = r2 No new state computed
Name = r5 No new state computed
Name = r4 No new state computed
Name = r7 No new state computed
Name = r1  I.N.C.R.E.A.S.E
increase = 1
**********************
Random choose
Name = r1  OK !
Now we have a representation of size = 26
Minimization in Progress
Name = r6 No new state computed
Name = r8 No new state computed
Name = r4 No new state computed
Name = r5 No new state computed
Name = r2 No new state computed
Name = r3 No new state computed
Name = r7 No new state computed
increase = 0
nb accelerations 4
Fix point FOUND
seed is : 21768
