current set encoding is : prestaf
seed is : 21768
cycles of length 1
(1/28), name = t1, size = 9304
(2/28), name = t2, size = 287
(3/28), name = t3, size = 11312
(4/28), name = t4, size = 29946
(5/28), name = t5, size = 280
(6/28), name = t6, size = 278
(7/28), name = t7, size = 11459
(8/28), name = t8, size = 30042
(9/28), name = t9, size = 271
(10/28), name = t10, size = 497
(11/28), name = t11, size = 449
(12/28), name = t12, size = 263
(13/28), name = t13, size = 256
(14/28), name = t14, size = 255
(15/28), name = t15, size = 11184
(16/28), name = t16, size = 10748
(17/28), name = t17, size = 9048
(18/28), name = t18, size = 248
(19/28), name = t19, size = 248
(20/28), name = t20, size = 246
(21/28), name = t21, size = 239
(22/28), name = t22, size = 238
(23/28), name = t23, size = 10791
(24/28), name = t24, size = 10211
(25/28), name = t25, size = 9114
(26/28), name = t26, size = 468
(27/28), name = t27, size = 231
(28/28), name = t28, size = 533
**********************
Random choose
Name = t6  No new state computed
Name = t9  No new state computed
Name = t14  No new state computed
Name = t15  No new state computed
Name = t11  No new state computed
Name = t27  No new state computed
Name = t4  No new state computed
Name = t12  No new state computed
Name = t1  No new state computed
Name = t22  No new state computed
Name = t24  No new state computed
Name = t16  No new state computed
Name = t28  No new state computed
Name = t3  No new state computed
Name = t2  No new state computed
Name = t23  No new state computed
Name = t26  No new state computed
Name = t7  No new state computed
Name = t19  OK !
Now we have a representation of size = 119
Minimization in Progress
Name = t9 No new state computed
Name = t27 No new state computed
Name = t22 No new state computed
Name = t7 No new state computed
Name = t26 No new state computed
Name = t14 No new state computed
Name = t11 No new state computed
Name = t13 No new state computed
Name = t25 No new state computed
Name = t3 No new state computed
Name = t12 No new state computed
Name = t20 No new state computed
Name = t6 No new state computed
Name = t28 No new state computed
Name = t4 No new state computed
Name = t17  I.N.C.R.E.A.S.E
Name = t5  I.N.C.R.E.A.S.E
Name = t24 No new state computed
Name = t2 No new state computed
Name = t8 No new state computed
Name = t21 No new state computed
Name = t23 No new state computed
Name = t18  I.N.C.R.E.A.S.E
Name = t10 No new state computed
Name = t15 No new state computed
Name = t16 No new state computed
Name = t1 No new state computed
increase = 1
**********************
Random choose
Name = t18  OK !
Now we have a representation of size = 121
Minimization in Progress
Name = t7 No new state computed
Name = t23 No new state computed
Name = t8 No new state computed
Name = t15 No new state computed
Name = t4 No new state computed
Name = t14 No new state computed
Name = t10 No new state computed
Name = t9 No new state computed
Name = t1 No new state computed
Name = t2 No new state computed
Name = t16  I.N.C.R.E.A.S.E
Name = t11 No new state computed
Name = t13 No new state computed
Name = t28 No new state computed
Name = t5  I.N.C.R.E.A.S.E
Name = t27 No new state computed
Name = t24 No new state computed
Name = t26 No new state computed
Name = t25 No new state computed
Name = t21 No new state computed
Name = t6 No new state computed
Name = t20 No new state computed
Name = t3 No new state computed
Name = t17  I.N.C.R.E.A.S.E
Name = t19 No new state computed
Name = t22 No new state computed
Name = t12 No new state computed
increase = 1
**********************
Random choose
Name = t17  OK !
Now we have a representation of size = 123
Minimization in Progress
Name = t24 No new state computed
Name = t12 No new state computed
Name = t1 No new state computed
Name = t14 No new state computed
Name = t16 No new state computed
Name = t20 No new state computed
Name = t19 No new state computed
Name = t6 No new state computed
Name = t25 No new state computed
Name = t10 No new state computed
Name = t13 No new state computed
Name = t8 No new state computed
Name = t23 No new state computed
Name = t26 No new state computed
Name = t22 No new state computed
Name = t2 No new state computed
Name = t7 No new state computed
Name = t5  I.N.C.R.E.A.S.E
Name = t18 No new state computed
Name = t27 No new state computed
Name = t11 No new state computed
Name = t9 No new state computed
Name = t21 No new state computed
Name = t15  I.N.C.R.E.A.S.E
Name = t4 No new state computed
Name = t3 No new state computed
Name = t28 No new state computed
increase = 1
**********************
Random choose
Name = t15  OK !
Now we have a representation of size = 175
Minimization in Progress
Name = t9 No new state computed
Name = t24 No new state computed
Name = t18 No new state computed
Name = t28 No new state computed
Name = t25 No new state computed
Name = t3 No new state computed
Name = t14  I.N.C.R.E.A.S.E
Name = t7 No new state computed
Name = t16 No new state computed
Name = t10 No new state computed
Name = t4 No new state computed
Name = t2 No new state computed
Name = t27 No new state computed
Name = t11 No new state computed
Name = t21 No new state computed
Name = t1 No new state computed
Name = t22 No new state computed
Name = t6 No new state computed
Name = t17 No new state computed
Name = t26 No new state computed
Name = t19 No new state computed
Name = t23 No new state computed
Name = t5  I.N.C.R.E.A.S.E
Name = t20 No new state computed
Name = t13 No new state computed
Name = t8 No new state computed
Name = t12  I.N.C.R.E.A.S.E
increase = 1
**********************
Random choose
Name = t12  OK !
Now we have a representation of size = 237
Minimization in Progress
Name = t7 No new state computed
Name = t8 No new state computed
Name = t2 No new state computed
Name = t3 No new state computed
Name = t14  OK !
Now we have a representation of size = 237
Name = t27  I.N.C.R.E.A.S.E
Name = t21  I.N.C.R.E.A.S.E
Name = t5  I.N.C.R.E.A.S.E
Name = t19  I.N.C.R.E.A.S.E
Name = t26  I.N.C.R.E.A.S.E
Name = t24 No new state computed
Name = t3 No new state computed
Name = t28 No new state computed
Name = t8 No new state computed
Name = t6 No new state computed
Name = t20 No new state computed
Name = t16 No new state computed
Name = t1 No new state computed
Name = t9  I.N.C.R.E.A.S.E
Name = t15 No new state computed
Name = t4 No new state computed
Name = t2 No new state computed
Name = t25 No new state computed
Name = t18  I.N.C.R.E.A.S.E
Name = t12 No new state computed
Name = t23 No new state computed
Name = t22 No new state computed
Name = t17 No new state computed
Name = t11  I.N.C.R.E.A.S.E
Name = t13 No new state computed
Name = t7 No new state computed
Name = t10 No new state computed
increase = 1
**********************
Random choose
Name = t11  OK !
Now we have a representation of size = 239
Minimization in Progress
Name = t14 No new state computed
Name = t7 No new state computed
Name = t16 No new state computed
Name = t3 No new state computed
Name = t6 No new state computed
Name = t10 No new state computed
Name = t23 No new state computed
Name = t1 No new state computed
Name = t26  I.N.C.R.E.A.S.E
Name = t24 No new state computed
Name = t2 No new state computed
Name = t20 No new state computed
Name = t8 No new state computed
Name = t19  I.N.C.R.E.A.S.E
Name = t28  OK !
Now we have a representation of size = 239
Name = t14 No new state computed
Name = t13 No new state computed
Name = t10 No new state computed
Name = t26  OK !
Now we have a representation of size = 239
Name = t20 No new state computed
Name = t15 No new state computed
Name = t25 No new state computed
Name = t10 No new state computed
Name = t22 No new state computed
Name = t8 No new state computed
Name = t27  OK !
Now we have a representation of size = 239
Name = t19  I.N.C.R.E.A.S.E
Name = t17 No new state computed
Name = t4 No new state computed
Name = t21  I.N.C.R.E.A.S.E
Name = t25  OK !
Now we have a representation of size = 239
Name = t18  I.N.C.R.E.A.S.E
Name = t4 No new state computed
Name = t20 No new state computed
Name = t19  I.N.C.R.E.A.S.E
Name = t9  I.N.C.R.E.A.S.E
Name = t5  I.N.C.R.E.A.S.E
Name = t1 No new state computed
Name = t8 No new state computed
Name = t10 No new state computed
Name = t26 No new state computed
Name = t23  I.N.C.R.E.A.S.E
Name = t17 No new state computed
Name = t11 No new state computed
Name = t13 No new state computed
Name = t22 No new state computed
Name = t3 No new state computed
Name = t14 No new state computed
Name = t7 No new state computed
Name = t24 No new state computed
Name = t21  I.N.C.R.E.A.S.E
Name = t2 No new state computed
Name = t27 No new state computed
Name = t12 No new state computed
Name = t28 No new state computed
Name = t15 No new state computed
Name = t6 No new state computed
Name = t16 No new state computed
increase = 1
**********************
Random choose
Name = t21  OK !
Now we have a representation of size = 317
Minimization in Progress
Name = t18  I.N.C.R.E.A.S.E
Name = t16 No new state computed
Name = t27 No new state computed
Name = t20 No new state computed
Name = t6 No new state computed
Name = t19  I.N.C.R.E.A.S.E
Name = t13 No new state computed
Name = t24 No new state computed
Name = t4 No new state computed
Name = t15 No new state computed
Name = t1 No new state computed
Name = t9  I.N.C.R.E.A.S.E
Name = t5  I.N.C.R.E.A.S.E
Name = t3 No new state computed
Name = t17 No new state computed
Name = t11 No new state computed
Name = t10 No new state computed
Name = t12 No new state computed
Name = t2 No new state computed
Name = t28 No new state computed
Name = t14 No new state computed
Name = t23  OK !
Now we have a representation of size = 317
Name = t20 No new state computed
Name = t13 No new state computed
Name = t3 No new state computed
Name = t9  I.N.C.R.E.A.S.E
Name = t28 No new state computed
Name = t7 No new state computed
Name = t8 No new state computed
Name = t24 No new state computed
Name = t25 No new state computed
Name = t1 No new state computed
Name = t17 No new state computed
Name = t14 No new state computed
Name = t26 No new state computed
Name = t4 No new state computed
Name = t27 No new state computed
Name = t5  I.N.C.R.E.A.S.E
Name = t19  I.N.C.R.E.A.S.E
Name = t15 No new state computed
Name = t2 No new state computed
Name = t11 No new state computed
Name = t21 No new state computed
Name = t16 No new state computed
Name = t22  I.N.C.R.E.A.S.E
Name = t10 No new state computed
Name = t6 No new state computed
Name = t18  I.N.C.R.E.A.S.E
Name = t12 No new state computed
increase = 1
**********************
Random choose
Name = t18  OK !
Now we have a representation of size = 331
Minimization in Progress
Name = t16  I.N.C.R.E.A.S.E
Name = t11 No new state computed
Name = t19  OK !
Now we have a representation of size = 331
Name = t13 No new state computed
Name = t4 No new state computed
Name = t6 No new state computed
Name = t14 No new state computed
Name = t12 No new state computed
Name = t5  I.N.C.R.E.A.S.E
Name = t28 No new state computed
Name = t17 No new state computed
Name = t23 No new state computed
Name = t18 No new state computed
Name = t15 No new state computed
Name = t10 No new state computed
Name = t21 No new state computed
Name = t16  I.N.C.R.E.A.S.E
Name = t11 No new state computed
Name = t25 No new state computed
Name = t1 No new state computed
Name = t27 No new state computed
Name = t3 No new state computed
Name = t9  I.N.C.R.E.A.S.E
Name = t8 No new state computed
Name = t22  I.N.C.R.E.A.S.E
Name = t20 No new state computed
Name = t26 No new state computed
Name = t24 No new state computed
Name = t7 No new state computed
Name = t2 No new state computed
increase = 1
**********************
Random choose
Name = t22  OK !
Now we have a representation of size = 398
Minimization in Progress
Name = t15 No new state computed
Name = t21 No new state computed
Name = t14 No new state computed
Name = t7 No new state computed
Name = t24 No new state computed
Name = t27 No new state computed
Name = t11 No new state computed
Name = t17 No new state computed
Name = t3 No new state computed
Name = t13 No new state computed
Name = t12 No new state computed
Name = t16  I.N.C.R.E.A.S.E
Name = t5  I.N.C.R.E.A.S.E
Name = t10 No new state computed
Name = t26 No new state computed
Name = t18  I.N.C.R.E.A.S.E
Name = t6 No new state computed
Name = t28 No new state computed
Name = t23 No new state computed
Name = t8 No new state computed
Name = t4 No new state computed
Name = t25 No new state computed
Name = t2 No new state computed
Name = t9  I.N.C.R.E.A.S.E
Name = t1 No new state computed
Name = t20 No new state computed
Name = t19  I.N.C.R.E.A.S.E
increase = 1
**********************
Random choose
Name = t19  OK !
Now we have a representation of size = 416
Minimization in Progress
Name = t25 No new state computed
Name = t1 No new state computed
Name = t21 No new state computed
Name = t2 No new state computed
Name = t13 No new state computed
Name = t14 No new state computed
Name = t23 No new state computed
Name = t17 No new state computed
Name = t18  OK !
Now we have a representation of size = 406
Name = t7 No new state computed
Name = t8 No new state computed
Name = t19 No new state computed
Name = t10 No new state computed
Name = t23 No new state computed
Name = t24 No new state computed
Name = t9  I.N.C.R.E.A.S.E
Name = t6 No new state computed
Name = t3 No new state computed
Name = t5  I.N.C.R.E.A.S.E
Name = t25 No new state computed
Name = t22 No new state computed
Name = t11 No new state computed
Name = t12 No new state computed
Name = t27 No new state computed
Name = t17 No new state computed
Name = t13 No new state computed
Name = t26 No new state computed
Name = t1 No new state computed
Name = t20 No new state computed
Name = t28 No new state computed
Name = t15 No new state computed
Name = t4 No new state computed
Name = t14 No new state computed
Name = t2 No new state computed
Name = t16  I.N.C.R.E.A.S.E
Name = t21 No new state computed
increase = 1
**********************
Random choose
Name = t16  OK !
Now we have a representation of size = 517
Minimization in Progress
Name = t4 No new state computed
Name = t8 No new state computed
Name = t2 No new state computed
Name = t25 No new state computed
Name = t13 No new state computed
Name = t26 No new state computed
Name = t17 No new state computed
Name = t19 No new state computed
Name = t7 No new state computed
Name = t5  I.N.C.R.E.A.S.E
Name = t6 No new state computed
Name = t10 No new state computed
Name = t21 No new state computed
Name = t22 No new state computed
Name = t28 No new state computed
Name = t12 No new state computed
Name = t3 No new state computed
Name = t15  I.N.C.R.E.A.S.E
Name = t18 No new state computed
Name = t9  I.N.C.R.E.A.S.E
Name = t24 No new state computed
Name = t20 No new state computed
Name = t11 No new state computed
Name = t27 No new state computed
Name = t14 No new state computed
Name = t1 No new state computed
Name = t23 No new state computed
increase = 1
**********************
Random choose
Name = t9  OK !
Now we have a representation of size = 541
Minimization in Progress
Name = t15  I.N.C.R.E.A.S.E
Name = t20 No new state computed
Name = t6 No new state computed
Name = t18 No new state computed
Name = t21 No new state computed
Name = t11 No new state computed
Name = t17 No new state computed
Name = t19 No new state computed
Name = t1 No new state computed
Name = t3 No new state computed
Name = t13 No new state computed
Name = t16 No new state computed
Name = t8  I.N.C.R.E.A.S.E
Name = t14 No new state computed
Name = t4 No new state computed
Name = t2 No new state computed
Name = t23 No new state computed
Name = t28 No new state computed
Name = t27 No new state computed
Name = t24 No new state computed
Name = t26 No new state computed
Name = t10 No new state computed
Name = t22 No new state computed
Name = t25 No new state computed
Name = t12 No new state computed
Name = t5  I.N.C.R.E.A.S.E
Name = t7 No new state computed
increase = 1
**********************
Random choose
Name = t5  OK !
Now we have a representation of size = 569
Minimization in Progress
Name = t13 No new state computed
Name = t22 No new state computed
Name = t11 No new state computed
Name = t1 No new state computed
Name = t8  I.N.C.R.E.A.S.E
Name = t4  I.N.C.R.E.A.S.E
Name = t28 No new state computed
Name = t2 No new state computed
Name = t20 No new state computed
Name = t14 No new state computed
Name = t16 No new state computed
Name = t24 No new state computed
Name = t12 No new state computed
Name = t17 No new state computed
Name = t10 No new state computed
Name = t9 No new state computed
Name = t6 No new state computed
Name = t23 No new state computed
Name = t15  I.N.C.R.E.A.S.E
Name = t25 No new state computed
Name = t18 No new state computed
Name = t21 No new state computed
Name = t3 No new state computed
Name = t19 No new state computed
Name = t27 No new state computed
Name = t26 No new state computed
Name = t7 No new state computed
increase = 1
**********************
Random choose
Name = t15  OK !
Now we have a representation of size = 581
Minimization in Progress
Name = t28 No new state computed
Name = t10 No new state computed
Name = t1 No new state computed
Name = t18 No new state computed
Name = t20 No new state computed
Name = t19 No new state computed
Name = t4  I.N.C.R.E.A.S.E
Name = t24 No new state computed
Name = t21 No new state computed
Name = t6 No new state computed
Name = t2 No new state computed
Name = t5 No new state computed
Name = t7 No new state computed
Name = t12  I.N.C.R.E.A.S.E
Name = t3 No new state computed
Name = t23 No new state computed
Name = t27 No new state computed
Name = t13 No new state computed
Name = t17 No new state computed
Name = t26 No new state computed
Name = t14  I.N.C.R.E.A.S.E
Name = t11 No new state computed
Name = t9 No new state computed
Name = t16 No new state computed
Name = t8  I.N.C.R.E.A.S.E
Name = t25 No new state computed
Name = t22 No new state computed
increase = 1
**********************
Random choose
Name = t8  OK !
Now we have a representation of size = 712
Minimization in Progress
Name = t6 No new state computed
Name = t26 No new state computed
Name = t16 No new state computed
Name = t7  I.N.C.R.E.A.S.E
Name = t12  I.N.C.R.E.A.S.E
Name = t1 No new state computed
Name = t27 No new state computed
Name = t5 No new state computed
Name = t25 No new state computed
Name = t2 No new state computed
Name = t24 No new state computed
Name = t23 No new state computed
Name = t4  I.N.C.R.E.A.S.E
Name = t11 No new state computed
Name = t14  I.N.C.R.E.A.S.E
Name = t17 No new state computed
Name = t18 No new state computed
Name = t21 No new state computed
Name = t19 No new state computed
Name = t20 No new state computed
Name = t13 No new state computed
Name = t10 No new state computed
Name = t15 No new state computed
Name = t9 No new state computed
Name = t28 No new state computed
Name = t3 No new state computed
Name = t22 No new state computed
increase = 1
**********************
Random choose
Name = t14  OK !
Now we have a representation of size = 773
Minimization in Progress
Name = t2 No new state computed
Name = t15 No new state computed
Name = t17 No new state computed
Name = t21  I.N.C.R.E.A.S.E
Name = t18 No new state computed
Name = t26  I.N.C.R.E.A.S.E
Name = t11 No new state computed
Name = t1 No new state computed
Name = t3 No new state computed
Name = t10 No new state computed
Name = t5 No new state computed
Name = t7  I.N.C.R.E.A.S.E
Name = t6 No new state computed
Name = t22 No new state computed
Name = t23 No new state computed
Name = t20 No new state computed
Name = t16 No new state computed
Name = t25 No new state computed
Name = t8 No new state computed
Name = t27  I.N.C.R.E.A.S.E
Name = t13 No new state computed
Name = t19 No new state computed
Name = t24 No new state computed
Name = t12  I.N.C.R.E.A.S.E
Name = t9  I.N.C.R.E.A.S.E
Name = t28 No new state computed
Name = t4  I.N.C.R.E.A.S.E
increase = 1
**********************
Random choose
Name = t4  OK !
Now we have a representation of size = 788
Minimization in Progress
Name = t26  I.N.C.R.E.A.S.E
Name = t10 No new state computed
Name = t14 No new state computed
Name = t15 No new state computed
Name = t27  I.N.C.R.E.A.S.E
Name = t2 No new state computed
Name = t6 No new state computed
Name = t7  I.N.C.R.E.A.S.E
Name = t17 No new state computed
Name = t19 No new state computed
Name = t25 No new state computed
Name = t18 No new state computed
Name = t1 No new state computed
Name = t5 No new state computed
Name = t22 No new state computed
Name = t16 No new state computed
Name = t8 No new state computed
Name = t12  I.N.C.R.E.A.S.E
Name = t13 No new state computed
Name = t21  I.N.C.R.E.A.S.E
Name = t24 No new state computed
Name = t28 No new state computed
Name = t3  I.N.C.R.E.A.S.E
Name = t20 No new state computed
Name = t11 No new state computed
Name = t9  I.N.C.R.E.A.S.E
Name = t23 No new state computed
increase = 1
**********************
Random choose
Name = t9  OK !
Now we have a representation of size = 806
Minimization in Progress
Name = t12  I.N.C.R.E.A.S.E
Name = t14 No new state computed
Name = t20 No new state computed
Name = t28 No new state computed
Name = t11 No new state computed
Name = t4 No new state computed
Name = t19 No new state computed
Name = t2 No new state computed
Name = t27  OK !
Now we have a representation of size = 803
Name = t26  OK !
Now we have a representation of size = 800
Name = t9 No new state computed
Name = t24  OK !
Now we have a representation of size = 793
Name = t22 No new state computed
Name = t6 No new state computed
Name = t18 No new state computed
Name = t17 No new state computed
Name = t26 No new state computed
Name = t1 No new state computed
Name = t25 No new state computed
Name = t14 No new state computed
Name = t20 No new state computed
Name = t23  I.N.C.R.E.A.S.E
Name = t15 No new state computed
Name = t7  I.N.C.R.E.A.S.E
Name = t16 No new state computed
Name = t8  I.N.C.R.E.A.S.E
Name = t13 No new state computed
Name = t19 No new state computed
Name = t9 No new state computed
Name = t11 No new state computed
Name = t28 No new state computed
Name = t2 No new state computed
Name = t3  I.N.C.R.E.A.S.E
Name = t4 No new state computed
Name = t10 No new state computed
Name = t21  I.N.C.R.E.A.S.E
Name = t5 No new state computed
Name = t27 No new state computed
Name = t12  I.N.C.R.E.A.S.E
increase = 1
**********************
Random choose
Name = t12  OK !
Now we have a representation of size = 852
Minimization in Progress
Name = t8  I.N.C.R.E.A.S.E
Name = t11  OK !
Now we have a representation of size = 845
Name = t7  I.N.C.R.E.A.S.E
Name = t5 No new state computed
Name = t26  I.N.C.R.E.A.S.E
Name = t12 No new state computed
Name = t21  I.N.C.R.E.A.S.E
Name = t20 No new state computed
Name = t16 No new state computed
Name = t19 No new state computed
Name = t13 No new state computed
Name = t8  I.N.C.R.E.A.S.E
Name = t28  OK !
Now we have a representation of size = 819
Name = t27  OK !
Now we have a representation of size = 816
Name = t7  I.N.C.R.E.A.S.E
Name = t2 No new state computed
Name = t11 No new state computed
Name = t19 No new state computed
Name = t23  I.N.C.R.E.A.S.E
Name = t26  OK !
Now we have a representation of size = 813
Name = t15 No new state computed
Name = t23  I.N.C.R.E.A.S.E
Name = t20 No new state computed
Name = t19 No new state computed
Name = t7  I.N.C.R.E.A.S.E
Name = t28 No new state computed
Name = t22 No new state computed
Name = t3  I.N.C.R.E.A.S.E
Name = t24  I.N.C.R.E.A.S.E
Name = t14 No new state computed
Name = t2 No new state computed
Name = t5 No new state computed
Name = t25  OK !
Now we have a representation of size = 801
Name = t9  OK !
Now we have a representation of size = 767
Name = t13 No new state computed
Name = t28 No new state computed
Name = t20 No new state computed
Name = t26 No new state computed
Name = t5 No new state computed
Name = t11 No new state computed
Name = t7  I.N.C.R.E.A.S.E
Name = t18 No new state computed
Name = t17 No new state computed
Name = t19 No new state computed
Name = t15 No new state computed
Name = t2 No new state computed
Name = t25 No new state computed
Name = t4 No new state computed
Name = t12 No new state computed
Name = t27 No new state computed
Name = t14 No new state computed
Name = t22 No new state computed
Name = t8  I.N.C.R.E.A.S.E
Name = t16 No new state computed
Name = t24  I.N.C.R.E.A.S.E
Name = t1 No new state computed
Name = t3  I.N.C.R.E.A.S.E
Name = t21  I.N.C.R.E.A.S.E
Name = t6 No new state computed
Name = t23  I.N.C.R.E.A.S.E
Name = t10 No new state computed
increase = 1
**********************
Random choose
Name = t23  OK !
Now we have a representation of size = 783
Minimization in Progress
Name = t8  I.N.C.R.E.A.S.E
Name = t19 No new state computed
Name = t9 No new state computed
Name = t15 No new state computed
Name = t5 No new state computed
Name = t24  I.N.C.R.E.A.S.E
Name = t27 No new state computed
Name = t11 No new state computed
Name = t17 No new state computed
Name = t16 No new state computed
Name = t22 No new state computed
Name = t13 No new state computed
Name = t20 No new state computed
Name = t26 No new state computed
Name = t25 No new state computed
Name = t10 No new state computed
Name = t21  OK !
Now we have a representation of size = 773
Name = t25 No new state computed
Name = t18 No new state computed
Name = t17 No new state computed
Name = t7  I.N.C.R.E.A.S.E
Name = t3  I.N.C.R.E.A.S.E
Name = t12 No new state computed
Name = t9 No new state computed
Name = t5 No new state computed
Name = t22 No new state computed
Name = t16 No new state computed
Name = t19 No new state computed
Name = t14 No new state computed
Name = t20 No new state computed
Name = t13 No new state computed
Name = t2 No new state computed
Name = t1 No new state computed
Name = t23 No new state computed
Name = t8  I.N.C.R.E.A.S.E
Name = t26 No new state computed
Name = t10 No new state computed
Name = t27 No new state computed
Name = t15 No new state computed
Name = t4 No new state computed
Name = t6 No new state computed
Name = t28 No new state computed
Name = t11 No new state computed
Name = t24  I.N.C.R.E.A.S.E
increase = 1
**********************
Random choose
Name = t24  OK !
Now we have a representation of size = 806
Minimization in Progress
Name = t9 No new state computed
Name = t4 No new state computed
Name = t12 No new state computed
Name = t1 No new state computed
Name = t28 No new state computed
Name = t26 No new state computed
Name = t15 No new state computed
Name = t6 No new state computed
Name = t5 No new state computed
Name = t22 No new state computed
Name = t25 No new state computed
Name = t8  I.N.C.R.E.A.S.E
Name = t13 No new state computed
Name = t16 No new state computed
Name = t3  I.N.C.R.E.A.S.E
Name = t14 No new state computed
Name = t10 No new state computed
Name = t23  I.N.C.R.E.A.S.E
Name = t7  I.N.C.R.E.A.S.E
Name = t27 No new state computed
Name = t2 No new state computed
Name = t21 No new state computed
Name = t11 No new state computed
Name = t19 No new state computed
Name = t17 No new state computed
Name = t20 No new state computed
Name = t18 No new state computed
increase = 1
**********************
Random choose
Name = t7  OK !
Now we have a representation of size = 870
Minimization in Progress
Name = t13 No new state computed
Name = t9 No new state computed
Name = t12 No new state computed
Name = t3  I.N.C.R.E.A.S.E
Name = t15 No new state computed
Name = t27 No new state computed
Name = t25 No new state computed
Name = t14 No new state computed
Name = t21 No new state computed
Name = t22 No new state computed
Name = t28 No new state computed
Name = t23  I.N.C.R.E.A.S.E
Name = t16 No new state computed
Name = t26 No new state computed
Name = t8  I.N.C.R.E.A.S.E
Name = t5 No new state computed
Name = t19 No new state computed
Name = t2 No new state computed
Name = t6 No new state computed
Name = t1 No new state computed
Name = t18 No new state computed
Name = t4 No new state computed
Name = t11 No new state computed
Name = t20 No new state computed
Name = t24 No new state computed
Name = t17 No new state computed
Name = t10 No new state computed
increase = 1
**********************
Random choose
Name = t8  OK !
Now we have a representation of size = 892
Minimization in Progress
Name = t3  I.N.C.R.E.A.S.E
Name = t24 No new state computed
Name = t18 No new state computed
Name = t1 No new state computed
Name = t9 No new state computed
Name = t26 No new state computed
Name = t11 No new state computed
Name = t10 No new state computed
Name = t13 No new state computed
Name = t2 No new state computed
Name = t22 No new state computed
Name = t6 No new state computed
Name = t21 No new state computed
Name = t15 No new state computed
Name = t20 No new state computed
Name = t28 No new state computed
Name = t12 No new state computed
Name = t4 No new state computed
Name = t27 No new state computed
Name = t17 No new state computed
Name = t16 No new state computed
Name = t23  I.N.C.R.E.A.S.E
Name = t19 No new state computed
Name = t5 No new state computed
Name = t25 No new state computed
Name = t14 No new state computed
Name = t7  I.N.C.R.E.A.S.E
increase = 1
**********************
Random choose
Name = t7  OK !
Now we have a representation of size = 904
Minimization in Progress
Name = t8 No new state computed
Name = t28 No new state computed
Name = t1 No new state computed
Name = t5 No new state computed
Name = t27 No new state computed
Name = t21 No new state computed
Name = t19 No new state computed
Name = t23  I.N.C.R.E.A.S.E
Name = t26 No new state computed
Name = t17 No new state computed
Name = t15 No new state computed
Name = t13 No new state computed
Name = t9 No new state computed
Name = t14 No new state computed
Name = t12 No new state computed
Name = t11 No new state computed
Name = t22 No new state computed
Name = t6  I.N.C.R.E.A.S.E
Name = t10 No new state computed
Name = t2 No new state computed
Name = t3  I.N.C.R.E.A.S.E
Name = t18 No new state computed
Name = t16 No new state computed
Name = t20 No new state computed
Name = t24 No new state computed
Name = t4 No new state computed
Name = t25 No new state computed
increase = 1
**********************
Random choose
Name = t3  OK !
Now we have a representation of size = 1033
Minimization in Progress
Name = t14 No new state computed
Name = t7 No new state computed
Name = t11 No new state computed
Name = t5 No new state computed
Name = t13 No new state computed
Name = t15 No new state computed
Name = t24 No new state computed
Name = t22 No new state computed
Name = t19 No new state computed
Name = t4 No new state computed
Name = t10 No new state computed
Name = t26 No new state computed
Name = t8 No new state computed
Name = t16 No new state computed
Name = t18 No new state computed
Name = t23  I.N.C.R.E.A.S.E
Name = t1 No new state computed
Name = t2  I.N.C.R.E.A.S.E
Name = t17 No new state computed
Name = t20 No new state computed
Name = t6  I.N.C.R.E.A.S.E
Name = t21 No new state computed
Name = t28 No new state computed
Name = t25 No new state computed
Name = t12 No new state computed
Name = t27 No new state computed
Name = t9 No new state computed
increase = 1
**********************
Random choose
Name = t6  OK !
Now we have a representation of size = 1091
Minimization in Progress
Name = t12 No new state computed
Name = t3 No new state computed
Name = t10 No new state computed
Name = t13 No new state computed
Name = t15 No new state computed
Name = t23  I.N.C.R.E.A.S.E
Name = t20 No new state computed
Name = t17 No new state computed
Name = t4 No new state computed
Name = t25 No new state computed
Name = t1 No new state computed
Name = t22 No new state computed
Name = t9  I.N.C.R.E.A.S.E
Name = t26 No new state computed
Name = t7 No new state computed
Name = t27 No new state computed
Name = t8 No new state computed
Name = t18 No new state computed
Name = t2  I.N.C.R.E.A.S.E
Name = t21  I.N.C.R.E.A.S.E
Name = t24 No new state computed
Name = t14 No new state computed
Name = t11 No new state computed
Name = t19 No new state computed
Name = t5  I.N.C.R.E.A.S.E
Name = t16 No new state computed
Name = t28 No new state computed
increase = 1
**********************
Random choose
Name = t5  OK !
Now we have a representation of size = 1108
Minimization in Progress
Name = t6 No new state computed
Name = t25 No new state computed
Name = t21  I.N.C.R.E.A.S.E
Name = t19 No new state computed
Name = t9  OK !
Now we have a representation of size = 1108
Name = t26 No new state computed
Name = t4 No new state computed
Name = t22 No new state computed
Name = t14 No new state computed
Name = t19 No new state computed
Name = t17 No new state computed
Name = t8 No new state computed
Name = t20 No new state computed
Name = t7 No new state computed
Name = t21  I.N.C.R.E.A.S.E
Name = t16 No new state computed
Name = t24 No new state computed
Name = t10 No new state computed
Name = t5 No new state computed
Name = t11 No new state computed
Name = t27 No new state computed
Name = t12 No new state computed
Name = t15 No new state computed
Name = t3 No new state computed
Name = t2  I.N.C.R.E.A.S.E
Name = t28 No new state computed
Name = t23  I.N.C.R.E.A.S.E
Name = t1 No new state computed
Name = t18 No new state computed
Name = t13 No new state computed
Name = t25 No new state computed
Name = t6 No new state computed
increase = 1
**********************
Random choose
Name = t23  OK !
Now we have a representation of size = 1143
Minimization in Progress
Name = t9 No new state computed
Name = t8 No new state computed
Name = t11 No new state computed
Name = t16 No new state computed
Name = t6 No new state computed
Name = t13 No new state computed
Name = t12 No new state computed
Name = t24 No new state computed
Name = t26 No new state computed
Name = t28 No new state computed
Name = t3 No new state computed
Name = t7 No new state computed
Name = t10 No new state computed
Name = t19 No new state computed
Name = t4 No new state computed
Name = t18 No new state computed
Name = t17 No new state computed
Name = t20 No new state computed
Name = t25 No new state computed
Name = t5 No new state computed
Name = t15 No new state computed
Name = t2  I.N.C.R.E.A.S.E
Name = t14 No new state computed
Name = t1 No new state computed
Name = t21  I.N.C.R.E.A.S.E
Name = t22  OK !
Now we have a representation of size = 1142
Name = t7 No new state computed
Name = t25 No new state computed
Name = t18 No new state computed
Name = t26 No new state computed
Name = t14 No new state computed
Name = t28 No new state computed
Name = t1 No new state computed
Name = t21  I.N.C.R.E.A.S.E
Name = t13 No new state computed
Name = t5 No new state computed
Name = t10 No new state computed
Name = t4 No new state computed
Name = t20 No new state computed
Name = t23 No new state computed
Name = t27 No new state computed
Name = t3 No new state computed
Name = t16 No new state computed
Name = t15 No new state computed
Name = t19 No new state computed
Name = t24 No new state computed
Name = t11 No new state computed
Name = t6 No new state computed
Name = t2  I.N.C.R.E.A.S.E
Name = t9  OK !
Now we have a representation of size = 1140
Name = t13 No new state computed
Name = t4 No new state computed
Name = t1 No new state computed
Name = t7 No new state computed
Name = t24 No new state computed
Name = t11 No new state computed
Name = t27 No new state computed
Name = t22 No new state computed
Name = t8  I.N.C.R.E.A.S.E
Name = t6 No new state computed
Name = t26 No new state computed
Name = t25 No new state computed
Name = t5 No new state computed
Name = t17 No new state computed
Name = t16 No new state computed
Name = t12 No new state computed
Name = t18 No new state computed
Name = t23 No new state computed
Name = t2  I.N.C.R.E.A.S.E
Name = t15 No new state computed
Name = t19 No new state computed
Name = t14 No new state computed
Name = t20 No new state computed
Name = t10 No new state computed
Name = t3 No new state computed
Name = t21  I.N.C.R.E.A.S.E
Name = t28 No new state computed
increase = 1
**********************
Random choose
Name = t21  OK !
Now we have a representation of size = 1179
Minimization in Progress
Name = t8  I.N.C.R.E.A.S.E
Name = t12 No new state computed
Name = t20 No new state computed
Name = t3 No new state computed
Name = t28 No new state computed
Name = t23 No new state computed
Name = t24 No new state computed
Name = t4 No new state computed
Name = t25 No new state computed
Name = t11 No new state computed
Name = t13 No new state computed
Name = t26 No new state computed
Name = t1 No new state computed
Name = t15 No new state computed
Name = t17 No new state computed
Name = t14 No new state computed
Name = t19 No new state computed
Name = t2  I.N.C.R.E.A.S.E
Name = t16 No new state computed
Name = t22 No new state computed
Name = t5 No new state computed
Name = t18 No new state computed
Name = t27 No new state computed
Name = t9 No new state computed
Name = t6 No new state computed
Name = t7 No new state computed
Name = t10 No new state computed
increase = 1
**********************
Random choose
Name = t2  OK !
Now we have a representation of size = 1780
Minimization in Progress
Name = t5  I.N.C.R.E.A.S.E
Name = t21  I.N.C.R.E.A.S.E
Name = t11 No new state computed
Name = t18  I.N.C.R.E.A.S.E
Name = t28 No new state computed
Name = t19  I.N.C.R.E.A.S.E
Name = t25 No new state computed
Name = t4 No new state computed
Name = t14 No new state computed
Name = t8  I.N.C.R.E.A.S.E
Name = t27  I.N.C.R.E.A.S.E
Name = t15 No new state computed
Name = t10 No new state computed
Name = t13  I.N.C.R.E.A.S.E
Name = t9  I.N.C.R.E.A.S.E
Name = t17 No new state computed
Name = t16 No new state computed
Name = t7 No new state computed
Name = t3 No new state computed
Name = t24 No new state computed
Name = t1  I.N.C.R.E.A.S.E
Name = t22 No new state computed
Name = t12 No new state computed
Name = t23 No new state computed
Name = t26  I.N.C.R.E.A.S.E
Name = t20 No new state computed
Name = t6 No new state computed
increase = 1
**********************
Random choose
Name = t26  OK !
Now we have a representation of size = 1798
Minimization in Progress
Name = t10 No new state computed
Name = t23 No new state computed
Name = t22 No new state computed
Name = t7 No new state computed
Name = t1  I.N.C.R.E.A.S.E
Name = t15 No new state computed
Name = t25 No new state computed
Name = t16 No new state computed
Name = t14 No new state computed
Name = t27  OK !
Now we have a representation of size = 1791
Name = t8  I.N.C.R.E.A.S.E
Name = t23 No new state computed
Name = t7 No new state computed
Name = t18  I.N.C.R.E.A.S.E
Name = t4 No new state computed
Name = t26 No new state computed
Name = t28 No new state computed
Name = t20 No new state computed
Name = t16 No new state computed
Name = t14 No new state computed
Name = t15 No new state computed
Name = t21  I.N.C.R.E.A.S.E
Name = t1  I.N.C.R.E.A.S.E
Name = t11 No new state computed
Name = t25  OK !
Now we have a representation of size = 1788
Name = t15 No new state computed
Name = t20 No new state computed
Name = t23  I.N.C.R.E.A.S.E
Name = t17 No new state computed
Name = t9  I.N.C.R.E.A.S.E
Name = t27 No new state computed
Name = t1  I.N.C.R.E.A.S.E
Name = t5  I.N.C.R.E.A.S.E
Name = t11 No new state computed
Name = t6 No new state computed
Name = t26 No new state computed
Name = t3 No new state computed
Name = t21  I.N.C.R.E.A.S.E
Name = t22 No new state computed
Name = t12 No new state computed
Name = t7 No new state computed
Name = t4 No new state computed
Name = t8  I.N.C.R.E.A.S.E
Name = t10 No new state computed
Name = t14 No new state computed
Name = t13  I.N.C.R.E.A.S.E
Name = t18  I.N.C.R.E.A.S.E
Name = t16 No new state computed
Name = t19  I.N.C.R.E.A.S.E
Name = t24 No new state computed
Name = t28 No new state computed
Name = t2 No new state computed
increase = 1
**********************
Random choose
Name = t19  OK !
Now we have a representation of size = 1801
Minimization in Progress
Name = t8  I.N.C.R.E.A.S.E
Name = t5  I.N.C.R.E.A.S.E
Name = t15 No new state computed
Name = t20 No new state computed
Name = t17  OK !
Now we have a representation of size = 1801
Name = t9  I.N.C.R.E.A.S.E
Name = t18  OK !
Now we have a representation of size = 1801
Name = t11 No new state computed
Name = t19 No new state computed
Name = t9  I.N.C.R.E.A.S.E
Name = t27 No new state computed
Name = t22 No new state computed
Name = t20 No new state computed
Name = t16 No new state computed
Name = t5  I.N.C.R.E.A.S.E
Name = t2 No new state computed
Name = t14 No new state computed
Name = t23  I.N.C.R.E.A.S.E
Name = t21  I.N.C.R.E.A.S.E
Name = t6 No new state computed
Name = t25 No new state computed
Name = t10 No new state computed
Name = t3 No new state computed
Name = t8  I.N.C.R.E.A.S.E
Name = t7 No new state computed
Name = t26 No new state computed
Name = t1  I.N.C.R.E.A.S.E
Name = t4 No new state computed
Name = t15  I.N.C.R.E.A.S.E
Name = t28 No new state computed
Name = t17 No new state computed
Name = t24 No new state computed
Name = t12 No new state computed
Name = t13  I.N.C.R.E.A.S.E
increase = 1
**********************
Random choose
Name = t13  OK !
Now we have a representation of size = 1911
Minimization in Progress
Name = t27 No new state computed
Name = t4 No new state computed
Name = t7 No new state computed
Name = t17 No new state computed
Name = t12 No new state computed
Name = t21  I.N.C.R.E.A.S.E
Name = t1  I.N.C.R.E.A.S.E
Name = t19 No new state computed
Name = t24 No new state computed
Name = t20 No new state computed
Name = t23  I.N.C.R.E.A.S.E
Name = t2 No new state computed
Name = t22 No new state computed
Name = t25 No new state computed
Name = t6 No new state computed
Name = t18 No new state computed
Name = t9  I.N.C.R.E.A.S.E
Name = t10 No new state computed
Name = t14 No new state computed
Name = t8  I.N.C.R.E.A.S.E
Name = t5  I.N.C.R.E.A.S.E
Name = t3 No new state computed
Name = t15  I.N.C.R.E.A.S.E
Name = t28 No new state computed
Name = t26 No new state computed
Name = t11 No new state computed
Name = t16 No new state computed
increase = 1
**********************
Random choose
Name = t15  OK !
Now we have a representation of size = 1987
Minimization in Progress
Name = t9  OK !
Now we have a representation of size = 1960
Name = t7 No new state computed
Name = t10 No new state computed
Name = t6 No new state computed
Name = t25 No new state computed
Name = t12 No new state computed
Name = t11 No new state computed
Name = t19 No new state computed
Name = t20 No new state computed
Name = t8  I.N.C.R.E.A.S.E
Name = t17 No new state computed
Name = t16 No new state computed
Name = t5  OK !
Now we have a representation of size = 1932
Name = t24 No new state computed
Name = t15 No new state computed
Name = t11 No new state computed
Name = t22 No new state computed
Name = t23  I.N.C.R.E.A.S.E
Name = t18 No new state computed
Name = t27 No new state computed
Name = t16 No new state computed
Name = t20 No new state computed
Name = t25 No new state computed
Name = t12 No new state computed
Name = t8  I.N.C.R.E.A.S.E
Name = t26 No new state computed
Name = t17 No new state computed
Name = t3 No new state computed
Name = t21  I.N.C.R.E.A.S.E
Name = t10 No new state computed
Name = t2 No new state computed
Name = t14 No new state computed
Name = t1  I.N.C.R.E.A.S.E
Name = t4  I.N.C.R.E.A.S.E
Name = t13 No new state computed
Name = t9 No new state computed
Name = t7 No new state computed
Name = t6 No new state computed
Name = t19 No new state computed
Name = t28 No new state computed
increase = 1
**********************
Random choose
Name = t4  OK !
Now we have a representation of size = 1966
Minimization in Progress
Name = t9 No new state computed
Name = t28 No new state computed
Name = t22 No new state computed
Name = t16 No new state computed
Name = t1  I.N.C.R.E.A.S.E
Name = t10 No new state computed
Name = t23  I.N.C.R.E.A.S.E
Name = t18 No new state computed
Name = t8  I.N.C.R.E.A.S.E
Name = t15 No new state computed
Name = t13 No new state computed
Name = t3  I.N.C.R.E.A.S.E
Name = t25 No new state computed
Name = t5 No new state computed
Name = t12 No new state computed
Name = t21  I.N.C.R.E.A.S.E
Name = t26 No new state computed
Name = t7 No new state computed
Name = t24 No new state computed
Name = t2 No new state computed
Name = t11 No new state computed
Name = t27 No new state computed
Name = t6 No new state computed
Name = t14 No new state computed
Name = t20 No new state computed
Name = t19 No new state computed
Name = t17 No new state computed
increase = 1
**********************
Random choose
Name = t21  OK !
Now we have a representation of size = 2183
Minimization in Progress
Name = t24 No new state computed
Name = t20 No new state computed
Name = t1  I.N.C.R.E.A.S.E
Name = t26 No new state computed
Name = t3  I.N.C.R.E.A.S.E
Name = t4 No new state computed
Name = t15 No new state computed
Name = t28 No new state computed
Name = t22 No new state computed
Name = t2 No new state computed
Name = t13 No new state computed
Name = t25 No new state computed
Name = t8  I.N.C.R.E.A.S.E
Name = t9 No new state computed
Name = t11 No new state computed
Name = t27 No new state computed
Name = t23  OK !
Now we have a representation of size = 2130
Name = t3  I.N.C.R.E.A.S.E
Name = t14 No new state computed
Name = t8  I.N.C.R.E.A.S.E
Name = t10 No new state computed
Name = t4 No new state computed
Name = t12 No new state computed
Name = t13 No new state computed
Name = t26 No new state computed
Name = t18 No new state computed
Name = t19 No new state computed
Name = t28 No new state computed
Name = t20 No new state computed
Name = t21 No new state computed
Name = t1  I.N.C.R.E.A.S.E
Name = t24 No new state computed
Name = t25 No new state computed
Name = t16 No new state computed
Name = t6 No new state computed
Name = t7 No new state computed
Name = t2 No new state computed
Name = t22 No new state computed
Name = t27 No new state computed
Name = t15 No new state computed
Name = t9 No new state computed
Name = t11 No new state computed
Name = t5 No new state computed
Name = t17 No new state computed
increase = 1
**********************
Random choose
Name = t1  OK !
Now we have a representation of size = 2131
Minimization in Progress
Name = t21 No new state computed
Name = t7 No new state computed
Name = t12 No new state computed
Name = t23 No new state computed
Name = t9 No new state computed
Name = t22 No new state computed
Name = t5 No new state computed
Name = t16 No new state computed
Name = t3  I.N.C.R.E.A.S.E
Name = t14 No new state computed
Name = t6 No new state computed
Name = t13 No new state computed
Name = t11 No new state computed
Name = t27 No new state computed
Name = t28 No new state computed
Name = t26 No new state computed
Name = t2 No new state computed
Name = t20 No new state computed
Name = t15 No new state computed
Name = t25 No new state computed
Name = t10  OK !
Now we have a representation of size = 2131
Name = t20 No new state computed
Name = t12 No new state computed
Name = t28 No new state computed
Name = t23 No new state computed
Name = t27 No new state computed
Name = t18 No new state computed
Name = t6 No new state computed
Name = t1 No new state computed
Name = t5 No new state computed
Name = t24 No new state computed
Name = t13 No new state computed
Name = t8  I.N.C.R.E.A.S.E
Name = t16 No new state computed
Name = t25 No new state computed
Name = t26 No new state computed
Name = t21 No new state computed
Name = t11 No new state computed
Name = t7 No new state computed
Name = t17 No new state computed
Name = t9  OK !
Now we have a representation of size = 2039
Name = t26 No new state computed
Name = t11 No new state computed
Name = t27 No new state computed
Name = t7 No new state computed
Name = t10 No new state computed
Name = t21 No new state computed
Name = t28 No new state computed
Name = t23 No new state computed
Name = t3  I.N.C.R.E.A.S.E
Name = t4 No new state computed
Name = t25 No new state computed
Name = t15 No new state computed
Name = t20 No new state computed
Name = t14 No new state computed
Name = t17 No new state computed
Name = t6 No new state computed
Name = t22 No new state computed
Name = t1 No new state computed
Name = t5 No new state computed
Name = t16 No new state computed
Name = t8  OK !
Now we have a representation of size = 1919
Name = t7  OK !
Now we have a representation of size = 1831
Name = t15 No new state computed
Name = t17 No new state computed
Name = t24 No new state computed
Name = t10 No new state computed
Name = t3  I.N.C.R.E.A.S.E
Name = t19 No new state computed
Name = t21 No new state computed
Name = t27 No new state computed
Name = t11 No new state computed
Name = t26 No new state computed
Name = t23 No new state computed
Name = t16 No new state computed
Name = t4 No new state computed
Name = t8 No new state computed
Name = t12 No new state computed
Name = t14 No new state computed
Name = t1 No new state computed
Name = t22 No new state computed
Name = t13 No new state computed
Name = t5 No new state computed
Name = t28 No new state computed
Name = t18 No new state computed
Name = t20 No new state computed
Name = t6  I.N.C.R.E.A.S.E
Name = t9 No new state computed
Name = t25 No new state computed
Name = t2 No new state computed
increase = 1
**********************
Random choose
Name = t6  OK !
Now we have a representation of size = 1845
Minimization in Progress
Name = t11 No new state computed
Name = t27  OK !
Now we have a representation of size = 1844
Name = t25  OK !
Now we have a representation of size = 1844
Name = t17 No new state computed
Name = t28 No new state computed
Name = t14 No new state computed
Name = t13  OK !
Now we have a representation of size = 1838
Name = t10 No new state computed
Name = t18 No new state computed
Name = t27 No new state computed
Name = t9 No new state computed
Name = t25 No new state computed
Name = t21  OK !
Now we have a representation of size = 1808
Name = t8 No new state computed
Name = t14 No new state computed
Name = t23  OK !
Now we have a representation of size = 1799
Name = t13 No new state computed
Name = t2 No new state computed
Name = t20 No new state computed
Name = t3  I.N.C.R.E.A.S.E
Name = t26  OK !
Now we have a representation of size = 1786
Name = t22 No new state computed
Name = t24 No new state computed
Name = t18 No new state computed
Name = t17 No new state computed
Name = t8 No new state computed
Name = t7 No new state computed
Name = t23 No new state computed
Name = t5  OK !
Now we have a representation of size = 1711
Name = t19 No new state computed
Name = t28 No new state computed
Name = t16 No new state computed
Name = t3  I.N.C.R.E.A.S.E
Name = t2 No new state computed
Name = t6 No new state computed
Name = t23 No new state computed
Name = t13 No new state computed
Name = t15 No new state computed
Name = t8 No new state computed
Name = t26 No new state computed
Name = t24 No new state computed
Name = t12 No new state computed
Name = t10 No new state computed
Name = t1 No new state computed
Name = t20 No new state computed
Name = t25 No new state computed
Name = t14 No new state computed
Name = t17 No new state computed
Name = t11 No new state computed
Name = t22 No new state computed
Name = t4  OK !
Now we have a representation of size = 1582
Name = t11 No new state computed
Name = t14 No new state computed
Name = t13 No new state computed
Name = t2 No new state computed
Name = t5 No new state computed
Name = t19 No new state computed
Name = t9 No new state computed
Name = t12 No new state computed
Name = t24 No new state computed
Name = t22 No new state computed
Name = t25 No new state computed
Name = t20 No new state computed
Name = t3  OK !
Now we have a representation of size = 1579
Name = t22 No new state computed
Name = t25 No new state computed
Name = t7 No new state computed
Name = t10 No new state computed
Name = t17 No new state computed
Name = t15 No new state computed
Name = t27 No new state computed
Name = t23 No new state computed
Name = t8 No new state computed
Name = t26 No new state computed
Name = t16 No new state computed
Name = t18 No new state computed
Name = t24 No new state computed
Name = t13 No new state computed
Name = t12 No new state computed
Name = t11 No new state computed
Name = t20 No new state computed
Name = t5 No new state computed
Name = t28 No new state computed
Name = t2  I.N.C.R.E.A.S.E
Name = t14 No new state computed
Name = t9 No new state computed
Name = t19 No new state computed
Name = t4 No new state computed
Name = t6 No new state computed
Name = t21 No new state computed
Name = t1 No new state computed
increase = 1
**********************
Random choose
Name = t2  OK !
Now we have a representation of size = 1705
Minimization in Progress
Name = t23 No new state computed
Name = t16 No new state computed
Name = t17 No new state computed
Name = t1  OK !
Now we have a representation of size = 1697
Name = t11 No new state computed
Name = t16 No new state computed
Name = t7 No new state computed
Name = t19 No new state computed
Name = t8 No new state computed
Name = t21  OK !
Now we have a representation of size = 1687
Name = t14 No new state computed
Name = t5 No new state computed
Name = t9  I.N.C.R.E.A.S.E
Name = t22 No new state computed
Name = t3 No new state computed
Name = t17 No new state computed
Name = t11 No new state computed
Name = t20 No new state computed
Name = t12 No new state computed
Name = t7 No new state computed
Name = t28 No new state computed
Name = t2 No new state computed
Name = t10  OK !
Now we have a representation of size = 1219
Name = t20 No new state computed
Name = t3 No new state computed
Name = t25 No new state computed
Name = t1 No new state computed
Name = t22 No new state computed
Name = t17 No new state computed
Name = t19 No new state computed
Name = t18 No new state computed
Name = t11 No new state computed
Name = t9  OK !
Now we have a representation of size = 1219
Name = t14 No new state computed
Name = t15 No new state computed
Name = t22 No new state computed
Name = t3 No new state computed
Name = t20 No new state computed
Name = t27 No new state computed
Name = t28 No new state computed
Name = t16 No new state computed
Name = t24 No new state computed
Name = t11 No new state computed
Name = t2 No new state computed
Name = t23 No new state computed
Name = t18 No new state computed
Name = t12 No new state computed
Name = t7 No new state computed
Name = t8  OK !
Now we have a representation of size = 1099
Name = t13 No new state computed
Name = t23 No new state computed
Name = t7  OK !
Now we have a representation of size = 1047
Name = t15 No new state computed
Name = t14 No new state computed
Name = t25 No new state computed
Name = t16 No new state computed
Name = t12 No new state computed
Name = t22 No new state computed
Name = t23 No new state computed
Name = t5 No new state computed
Name = t17 No new state computed
Name = t8 No new state computed
Name = t26 No new state computed
Name = t6 No new state computed
Name = t19 No new state computed
Name = t24 No new state computed
Name = t3 No new state computed
Name = t1 No new state computed
Name = t13 No new state computed
Name = t9 No new state computed
Name = t4 No new state computed
Name = t18 No new state computed
Name = t28 No new state computed
Name = t21 No new state computed
Name = t27 No new state computed
Name = t10 No new state computed
Name = t11 No new state computed
Name = t2 No new state computed
Name = t20 No new state computed
increase = 0
nb accelerations 86
Fix point FOUND
seed is : 21768
