current set encoding is : lira
seed is : 2691
cycles of length 1
(1/12), name = r1, size = 8
(2/12), name = r2, size = 21
(3/12), name = r3, size = 9
(4/12), name = r4, size = 8
(5/12), name = r5, size = 8
(6/12), name = r6, size = 11
(7/12), name = r7, size = 8
(8/12), name = r8, size = 20
(9/12), name = r9, size = 9
(10/12), name = r10, size = 9
(11/12), name = r11, size = 9
(12/12), name = r12, size = 9
**********************
Random choose
Name = r5  No new state computed
Name = r1  OK !
Now we have a representation of size = 7
Minimization in Progress
Name = r5 No new state computed
Name = r9 No new state computed
Name = r11 No new state computed
Name = r6 No new state computed
Name = r7  OK !
Now we have a representation of size = 7
Name = r10 No new state computed
Name = r1 No new state computed
Name = r3 No new state computed
Name = r4 No new state computed
Name = r2  I.N.C.R.E.A.S.E
Name = r6 No new state computed
Name = r12 No new state computed
Name = r5 No new state computed
Name = r8  I.N.C.R.E.A.S.E
Name = r9 No new state computed
Name = r11 No new state computed
increase = 1
**********************
Random choose
Name = r8  OK !
Now we have a representation of size = 8
Minimization in Progress
Name = r1 No new state computed
Name = r6 No new state computed
Name = r7 No new state computed
Name = r4 No new state computed
Name = r9 No new state computed
Name = r5 No new state computed
Name = r12 No new state computed
Name = r10  OK !
Now we have a representation of size = 8
Name = r6 No new state computed
Name = r11  I.N.C.R.E.A.S.E
Name = r7 No new state computed
Name = r5 No new state computed
Name = r2  I.N.C.R.E.A.S.E
Name = r1 No new state computed
Name = r4 No new state computed
Name = r3 No new state computed
Name = r8 No new state computed
Name = r12 No new state computed
Name = r9 No new state computed
increase = 1
**********************
Random choose
Name = r2  OK !
Now we have a representation of size = 9
Minimization in Progress
Name = r11  OK !
Now we have a representation of size = 9
Name = r12 No new state computed
Name = r4 No new state computed
Name = r3 No new state computed
Name = r10 No new state computed
Name = r8 No new state computed
Name = r2 No new state computed
Name = r7 No new state computed
Name = r5 No new state computed
Name = r6 No new state computed
Name = r1 No new state computed
Name = r9 No new state computed
increase = 0
nb accelerations 6
Fix point FOUND
seed is : 2691
