current set encoding is : lira
seed is : 3284
(1/36)->
(2/36)->
(3/36)->
(4/36)->
(5/36)->
(6/36)->
(7/36)->
(8/36)->
(9/36)->
(10/36)->
(11/36)->
(12/36)->
(13/36)->
(14/36)->
(15/36)->
(16/36)->
(17/36)->
(18/36)->
(19/36)->
(20/36)->
(21/36)->
(22/36)->
(23/36)->
(24/36)->
(25/36)->
(26/36)->
(27/36)->
(28/36)->
(29/36)->
(30/36)->
(31/36)->
(32/36)->
(33/36)->
(34/36)->
(35/36)->
(36/36)->
Simplification of the linear system 
2 functions have the same action, it remains only 1
2 functions have the same action, it remains only 1
1 functions have the same action, it remains only 1
2 functions have the same action, it remains only 1
1 functions have the same action, it remains only 1
2 functions have the same action, it remains only 1
2 functions have the same action, it remains only 1
1 functions have the same action, it remains only 1
2 functions have the same action, it remains only 1
1 functions have the same action, it remains only 1
1 functions have the same action, it remains only 1
2 functions have the same action, it remains only 1
2 functions have the same action, it remains only 1
2 functions have the same action, it remains only 1
1 functions have the same action, it remains only 1
Number of actions before simplification : 24
Number of actions after simplification  : 15
(1/90)->
(2/90)->
(3/90)->
(4/90)->
(5/90)->
(6/90)->
(7/90)->
(8/90)->
(9/90)->
(10/90)->
(11/90)->
(12/90)->
(13/90)->
(14/90)->
(15/90)->
(16/90)->
(17/90)->
(18/90)->
(19/90)->
(20/90)->
(21/90)->
(22/90)->
(23/90)->
(24/90)->
(25/90)->
(26/90)->
(27/90)->
(28/90)->
(29/90)->
(30/90)->
(31/90)->
(32/90)->
(33/90)->
(34/90)->
(35/90)->
(36/90)->
(37/90)->
(38/90)->
(39/90)->
(40/90)->
(41/90)->
(42/90)->
(43/90)->
(44/90)->
(45/90)->
(46/90)->
(47/90)->
(48/90)->
(49/90)->
(50/90)->
(51/90)->
(52/90)->
(53/90)->
(54/90)->
(55/90)->
(56/90)->
(57/90)->
(58/90)->
(59/90)->
(60/90)->
(61/90)->
(62/90)->
(63/90)->
(64/90)->
(65/90)->
(66/90)->
(67/90)->
(68/90)->
(69/90)->
(70/90)->
(71/90)->
(72/90)->
(73/90)->
(74/90)->
(75/90)->
(76/90)->
(77/90)->
(78/90)->
(79/90)->
(80/90)->
(81/90)->
(82/90)->
(83/90)->
(84/90)->
(85/90)->
(86/90)->
(87/90)->
(88/90)->
(89/90)->
(90/90)->
Simplification of the linear system 
2 functions have the same action, it remains only 1
2 functions have the same action, it remains only 1
3 functions have the same action, it remains only 1
2 functions have the same action, it remains only 1
2 functions have the same action, it remains only 1
3 functions have the same action, it remains only 1
1 functions have the same action, it remains only 1
2 functions have the same action, it remains only 1
1 functions have the same action, it remains only 1
3 functions have the same action, it remains only 1
1 functions have the same action, it remains only 1
3 functions have the same action, it remains only 1
3 functions have the same action, it remains only 1
3 functions have the same action, it remains only 1
1 functions have the same action, it remains only 1
3 functions have the same action, it remains only 1
1 functions have the same action, it remains only 1
1 functions have the same action, it remains only 1
3 functions have the same action, it remains only 1
2 functions have the same action, it remains only 1
2 functions have the same action, it remains only 1
3 functions have the same action, it remains only 1
1 functions have the same action, it remains only 1
3 functions have the same action, it remains only 1
2 functions have the same action, it remains only 1
3 functions have the same action, it remains only 1
1 functions have the same action, it remains only 1
Number of actions before simplification : 57
Number of actions after simplification  : 27
(1/162)->
(2/162)->
(3/162)->
(4/162)->
(5/162)->
(6/162)->
(7/162)->
(8/162)->
(9/162)->
(10/162)->
(11/162)->
(12/162)->
(13/162)->
(14/162)->
(15/162)->
(16/162)->
(17/162)->
(18/162)->
(19/162)->
(20/162)->
(21/162)->
(22/162)->
(23/162)->
(24/162)->
(25/162)->
(26/162)->
(27/162)->
(28/162)->
(29/162)->
(30/162)->
(31/162)->
(32/162)->
(33/162)->
(34/162)->
(35/162)->
(36/162)->
(37/162)->
(38/162)->
(39/162)->
(40/162)->
(41/162)->
(42/162)->
(43/162)->
(44/162)->
(45/162)->
(46/162)->
(47/162)->
(48/162)->
(49/162)->
(50/162)->
(51/162)->
(52/162)->
(53/162)->
(54/162)->
(55/162)->
(56/162)->
(57/162)->
(58/162)->
(59/162)->
(60/162)->
(61/162)->
(62/162)->
(63/162)->
(64/162)->
(65/162)->
(66/162)->
(67/162)->
(68/162)->
(69/162)->
(70/162)->
(71/162)->
(72/162)->
(73/162)->
(74/162)->
(75/162)->
(76/162)->
(77/162)->
(78/162)->
(79/162)->
(80/162)->
(81/162)->
(82/162)->
(83/162)->
(84/162)->
(85/162)->
(86/162)->
(87/162)->
(88/162)->
(89/162)->
(90/162)->
(91/162)->
(92/162)->
(93/162)->
(94/162)->
(95/162)->
(96/162)->
(97/162)->
(98/162)->
(99/162)->
(100/162)->
(101/162)->
(102/162)->
(103/162)->
(104/162)->
(105/162)->
(106/162)->
(107/162)->
(108/162)->
(109/162)->
(110/162)->
(111/162)->
(112/162)->
(113/162)->
(114/162)->
(115/162)->
(116/162)->
(117/162)->
(118/162)->
(119/162)->
(120/162)->
(121/162)->
(122/162)->
(123/162)->
(124/162)->
(125/162)->
(126/162)->
(127/162)->
(128/162)->
(129/162)->
(130/162)->
(131/162)->
(132/162)->
(133/162)->
(134/162)->
(135/162)->
(136/162)->
(137/162)->
(138/162)->
(139/162)->
(140/162)->
(141/162)->
(142/162)->
(143/162)->
(144/162)->
(145/162)->
(146/162)->
(147/162)->
(148/162)->
(149/162)->
(150/162)->
(151/162)->
(152/162)->
(153/162)->
(154/162)->
(155/162)->
(156/162)->
(157/162)->
(158/162)->
(159/162)->
(160/162)->
(161/162)->
(162/162)->
Simplification of the linear system 
1 functions have the same action, it remains only 1
4 functions have the same action, it remains only 1
1 functions have the same action, it remains only 1
3 functions have the same action, it remains only 1
2 functions have the same action, it remains only 1
3 functions have the same action, it remains only 1
3 functions have the same action, it remains only 1
3 functions have the same action, it remains only 1
3 functions have the same action, it remains only 1
1 functions have the same action, it remains only 1
1 functions have the same action, it remains only 1
3 functions have the same action, it remains only 1
3 functions have the same action, it remains only 1
1 functions have the same action, it remains only 1
1 functions have the same action, it remains only 1
3 functions have the same action, it remains only 1
3 functions have the same action, it remains only 1
2 functions have the same action, it remains only 1
3 functions have the same action, it remains only 1
1 functions have the same action, it remains only 1
4 functions have the same action, it remains only 1
3 functions have the same action, it remains only 1
3 functions have the same action, it remains only 1
1 functions have the same action, it remains only 1
3 functions have the same action, it remains only 1
1 functions have the same action, it remains only 1
1 functions have the same action, it remains only 1
3 functions have the same action, it remains only 1
3 functions have the same action, it remains only 1
2 functions have the same action, it remains only 1
4 functions have the same action, it remains only 1
2 functions have the same action, it remains only 1
4 functions have the same action, it remains only 1
3 functions have the same action, it remains only 1
3 functions have the same action, it remains only 1
3 functions have the same action, it remains only 1
1 functions have the same action, it remains only 1
1 functions have the same action, it remains only 1
1 functions have the same action, it remains only 1
2 functions have the same action, it remains only 1
2 functions have the same action, it remains only 1
3 functions have the same action, it remains only 1
2 functions have the same action, it remains only 1
3 functions have the same action, it remains only 1
3 functions have the same action, it remains only 1
1 functions have the same action, it remains only 1
Number of actions before simplification : 107
Number of actions after simplification  : 46
cycles of length 4
(1/46), name = +t2.(+t6.(+t5.t2+t2.t5)+t2.(+t6.t5+t5.t6)), size = 90
(2/46), name = (+t5.(+t4.(+t3.t2+t2.t3)+t2.(+t4.t3+t3.t4))+t4.(+t5.(+t3.t2+t2.t3)+t3.(+t5.t2+t2.t5))+t3.(+t4.(+t5.t2+t2.t5)+t2.(+t5.t4+t4.t5))+t2.(+t5.(+t4.t3+t3.t4)+t3.(+t5.t4+t4.t5))), size = 21
(3/46), name = +t2.+t3.(+t6.t4+t4.t6), size = 37
(4/46), name = (+t4.(+t3.+t2+t2.+t3+(+t3.t2+t2.t3))+t2.(+t4.+t3+t3.+t4+(+t4.t3+t3.t4))+(+t4.(+t3.t2+t2.t3)+t2.(+t4.t3+t3.t4))), size = 13
(5/46), name = (+t6.(+t5.(+t3.t2+t2.t3)+t3.(+t5.t2+t2.t5))+t3.(+t6.(+t5.t2+t2.t5)+t2.(+t6.t5+t5.t6))), size = 101
(6/46), name = (+t5.(+t3.+t2+t2.+t3+(+t3.t2+t2.t3))+t3.(+t5.+t2+t2.+t5+(+t5.t2+t2.t5))+(+t5.(+t3.t2+t2.t3)+t3.(+t5.t2+t2.t5))), size = 37
(7/46), name = (+t3.++t2+t2.++t3+(+t3.+t2+t2.+t3+(+t3.t2+t2.t3))), size = 21
(8/46), name = (+t6.(+t4.(+t5.t2+t2.t5)+t2.(+t5.t4+t4.t5))+t4.(+t6.(+t5.t2+t2.t5)+t2.(+t6.t5+t5.t6))+t2.(+t6.(+t5.t4+t4.t5)+t5.(+t6.t4+t4.t6)+t4.(+t6.t5+t5.t6))), size = 37
(9/46), name = (+t4.(+t5.+t2+t2.+t5+(+t5.t2+t2.t5))+t2.(+t5.+t4+t4.+t5+(+t5.t4+t4.t5))+(+t4.(+t5.t2+t2.t5)+t2.(+t5.t4+t4.t5))), size = 37
(10/46), name = +t5.(+t6.(+t5.t2+t2.t5)+t2.(+t6.t5+t5.t6)), size = 101
(11/46), name = +t6.(+t6.(+t5.t2+t2.t5)+t2.(+t6.t5+t5.t6)), size = 78
(12/46), name = (+t6.(+t5.+t2+t2.+t5+(+t5.t2+t2.t5))+t2.(+t6.+t5+t5.+t6+(+t6.t5+t5.t6))+(+t6.(+t5.t2+t2.t5)+t2.(+t6.t5+t5.t6))), size = 37
(13/46), name = (+t5.++t2+t2.++t5+(+t5.+t2+t2.+t5+(+t5.t2+t2.t5))), size = 21
(14/46), name = +++t2, size = 13
(15/46), name = +t4.+t3.(+t6.t4+t4.t6), size = 53
(16/46), name = (+t6.(+t5.(+t4.t3+t3.t4)+t3.(+t5.t4+t4.t5))+t5.+t3.(+t6.t4+t4.t6)+t3.(+t6.(+t5.t4+t4.t5)+t5.(+t6.t4+t4.t6)+t4.(+t6.t5+t5.t6))), size = 13
(17/46), name = (+t5.(+t4.+t3+t3.+t4+(+t4.t3+t3.t4))+t3.(+t5.+t4+t4.+t5+(+t5.t4+t4.t5))+(+t5.(+t4.t3+t3.t4)+t3.(+t5.t4+t4.t5))), size = 13
(18/46), name = (+t3.(+t6.+t4+t4.+t6+(+t6.t4+t4.t6))++t3.(+t6.t4+t4.t6)), size = 21
(19/46), name = (+t4.++t3+t3.++t4+(+t4.+t3+t3.+t4+(+t4.t3+t3.t4))), size = 9
(20/46), name = +++t3, size = 13
(21/46), name = (+t6.(+t5.+t4+t4.+t5+(+t5.t4+t4.t5))+t5.(+t6.+t4+t4.+t6+(+t6.t4+t4.t6))+t4.(+t6.+t5+t5.+t6+(+t6.t5+t5.t6))+(+t6.(+t5.t4+t4.t5)+t5.(+t6.t4+t4.t6)+t4.(+t6.t5+t5.t6))), size = 13
(22/46), name = (+t5.++t4+t4.++t5+(+t5.+t4+t4.+t5+(+t5.t4+t4.t5))), size = 21
(23/46), name = (+t6.++t4+t4.++t6+(+t6.+t4+t4.+t6+(+t6.t4+t4.t6))), size = 13
(24/46), name = +++t4, size = 13
(25/46), name = (+t6.++t5+t5.++t6+(+t6.+t5+t5.+t6+(+t6.t5+t5.t6))), size = 13
(26/46), name = +++t5, size = 13
(27/46), name = +++t6, size = 9
(28/46), name = (+t1.(+t4.(+t3.t2+t2.t3)+t2.(+t4.t3+t3.t4))+t4.(+t1.(+t3.t2+t2.t3)+t3.(+t2.t1+t1.t2)+t2.(+t3.t1+t1.t3))+t2.+t4.(+t3.t1+t1.t3)), size = 13
(29/46), name = (+t1.(+t5.(+t3.t2+t2.t3)+t3.(+t5.t2+t2.t5))+t5.(+t1.(+t3.t2+t2.t3)+t3.(+t2.t1+t1.t2)+t2.(+t3.t1+t1.t3))+t3.(+t1.(+t5.t2+t2.t5)+t5.(+t2.t1+t1.t2))), size = 21
(30/46), name = (+t6.(+t1.(+t3.t2+t2.t3)+t3.(+t2.t1+t1.t2)+t2.(+t3.t1+t1.t3))+t3.(+t6.(+t2.t1+t1.t2)+t2.(+t6.t1+t1.t6))), size = 21
(31/46), name = (+t1.(+t3.+t2+t2.+t3+(+t3.t2+t2.t3))+t3.(+t1.+t2+t2.+t1+(+t2.t1+t1.t2))+t2.(+t1.+t3+t3.+t1+(+t3.t1+t1.t3))+(+t1.(+t3.t2+t2.t3)+t3.(+t2.t1+t1.t2)+t2.(+t3.t1+t1.t3))), size = 13
(32/46), name = (+t1.(+t4.(+t5.t2+t2.t5)+t2.(+t5.t4+t4.t5))+t4.(+t1.(+t5.t2+t2.t5)+t5.(+t2.t1+t1.t2))), size = 29
(33/46), name = (+t1.(+t6.(+t5.t2+t2.t5)+t2.(+t6.t5+t5.t6))+t6.(+t1.(+t5.t2+t2.t5)+t5.(+t2.t1+t1.t2))+t5.(+t6.(+t2.t1+t1.t2)+t2.(+t6.t1+t1.t6))+t2.(+t1.(+t6.t5+t5.t6)+t5.(+t6.t1+t1.t6))), size = 9
(34/46), name = (+t1.(+t5.+t2+t2.+t5+(+t5.t2+t2.t5))+t5.(+t1.+t2+t2.+t1+(+t2.t1+t1.t2))+(+t1.(+t5.t2+t2.t5)+t5.(+t2.t1+t1.t2))), size = 21
(35/46), name = (+t6.(+t1.+t2+t2.+t1+(+t2.t1+t1.t2))+t2.(+t1.+t6+t6.+t1+(+t6.t1+t1.t6))+(+t6.(+t2.t1+t1.t2)+t2.(+t6.t1+t1.t6))), size = 13
(36/46), name = (+t1.++t2+t2.++t1+(+t1.+t2+t2.+t1+(+t2.t1+t1.t2))), size = 13
(37/46), name = +t3.+t4.(+t3.t1+t1.t3), size = 29
(38/46), name = +t4.+t4.(+t3.t1+t1.t3), size = 90
(39/46), name = +t5.+t4.(+t3.t1+t1.t3), size = 133
(40/46), name = (+t1.+t3.(+t6.t4+t4.t6)+t6.+t4.(+t3.t1+t1.t3)), size = 37
(41/46), name = (+t4.(+t1.+t3+t3.+t1+(+t3.t1+t1.t3))++t4.(+t3.t1+t1.t3)), size = 37
(42/46), name = (+t1.++t3+t3.++t1+(+t1.+t3+t3.+t1+(+t3.t1+t1.t3))), size = 13
(43/46), name = (+t1.(+t6.(+t5.t4+t4.t5)+t5.(+t6.t4+t4.t6)+t4.(+t6.t5+t5.t6))+t4.(+t1.(+t6.t5+t5.t6)+t5.(+t6.t1+t1.t6))), size = 21
(44/46), name = (+t1.(+t6.+t5+t5.+t6+(+t6.t5+t5.t6))+t5.(+t1.+t6+t6.+t1+(+t6.t1+t1.t6))+(+t1.(+t6.t5+t5.t6)+t5.(+t6.t1+t1.t6))), size = 13
(45/46), name = (+t1.++t6+t6.++t1+(+t1.+t6+t6.+t1+(+t6.t1+t1.t6))), size = 9
(46/46), name = +++t1, size = 9
**********************
Random choose
Name = (+t4.++t3+t3.++t4+(+t4.+t3+t3.+t4+(+t4.t3+t3.t4)))  No new state computed
Name = +++t4  No new state computed
Name = +t5.+t4.(+t3.t1+t1.t3)  No new state computed
Name = +t5.(+t6.(+t5.t2+t2.t5)+t2.(+t6.t5+t5.t6))  No new state computed
Name = (+t6.(+t1.+t2+t2.+t1+(+t2.t1+t1.t2))+t2.(+t1.+t6+t6.+t1+(+t6.t1+t1.t6))+(+t6.(+t2.t1+t1.t2)+t2.(+t6.t1+t1.t6)))  No new state computed
Name = (+t3.++t2+t2.++t3+(+t3.+t2+t2.+t3+(+t3.t2+t2.t3)))  No new state computed
Name = +t2.+t3.(+t6.t4+t4.t6)  No new state computed
Name = (+t5.++t2+t2.++t5+(+t5.+t2+t2.+t5+(+t5.t2+t2.t5)))  No new state computed
Name = (+t1.(+t4.(+t3.t2+t2.t3)+t2.(+t4.t3+t3.t4))+t4.(+t1.(+t3.t2+t2.t3)+t3.(+t2.t1+t1.t2)+t2.(+t3.t1+t1.t3))+t2.+t4.(+t3.t1+t1.t3))  OK !
Now we have a representation of size = 8
Minimization in Progress
Name = (+t5.(+t4.(+t3.t2+t2.t3)+t2.(+t4.t3+t3.t4))+t4.(+t5.(+t3.t2+t2.t3)+t3.(+t5.t2+t2.t5))+t3.(+t4.(+t5.t2+t2.t5)+t2.(+t5.t4+t4.t5))+t2.(+t5.(+t4.t3+t3.t4)+t3.(+t5.t4+t4.t5))) No new state computed
Name = +t2.+t3.(+t6.t4+t4.t6) No new state computed
Name = (+t6.(+t4.(+t5.t2+t2.t5)+t2.(+t5.t4+t4.t5))+t4.(+t6.(+t5.t2+t2.t5)+t2.(+t6.t5+t5.t6))+t2.(+t6.(+t5.t4+t4.t5)+t5.(+t6.t4+t4.t6)+t4.(+t6.t5+t5.t6))) No new state computed
Name = +t4.+t4.(+t3.t1+t1.t3) No new state computed
Name = +t2.(+t6.(+t5.t2+t2.t5)+t2.(+t6.t5+t5.t6)) No new state computed
Name = (+t3.(+t6.+t4+t4.+t6+(+t6.t4+t4.t6))++t3.(+t6.t4+t4.t6)) No new state computed
Name = (+t1.+t3.(+t6.t4+t4.t6)+t6.+t4.(+t3.t1+t1.t3)) No new state computed
Name = (+t6.(+t5.(+t4.t3+t3.t4)+t3.(+t5.t4+t4.t5))+t5.+t3.(+t6.t4+t4.t6)+t3.(+t6.(+t5.t4+t4.t5)+t5.(+t6.t4+t4.t6)+t4.(+t6.t5+t5.t6))) No new state computed
Name = (+t1.(+t6.(+t5.t2+t2.t5)+t2.(+t6.t5+t5.t6))+t6.(+t1.(+t5.t2+t2.t5)+t5.(+t2.t1+t1.t2))+t5.(+t6.(+t2.t1+t1.t2)+t2.(+t6.t1+t1.t6))+t2.(+t1.(+t6.t5+t5.t6)+t5.(+t6.t1+t1.t6)))  I.N.C.R.E.A.S.E
Name = (+t6.++t5+t5.++t6+(+t6.+t5+t5.+t6+(+t6.t5+t5.t6))) No new state computed
Name = (+t1.(+t6.+t5+t5.+t6+(+t6.t5+t5.t6))+t5.(+t1.+t6+t6.+t1+(+t6.t1+t1.t6))+(+t1.(+t6.t5+t5.t6)+t5.(+t6.t1+t1.t6)))  I.N.C.R.E.A.S.E
Name = +++t4 No new state computed
Name = (+t5.++t2+t2.++t5+(+t5.+t2+t2.+t5+(+t5.t2+t2.t5))) No new state computed
Name = (+t3.++t2+t2.++t3+(+t3.+t2+t2.+t3+(+t3.t2+t2.t3))) No new state computed
Name = +t6.(+t6.(+t5.t2+t2.t5)+t2.(+t6.t5+t5.t6)) No new state computed
Name = +++t1  I.N.C.R.E.A.S.E
Name = (+t6.++t4+t4.++t6+(+t6.+t4+t4.+t6+(+t6.t4+t4.t6))) No new state computed
Name = +++t6 No new state computed
Name = (+t1.++t6+t6.++t1+(+t1.+t6+t6.+t1+(+t6.t1+t1.t6))) No new state computed
Name = +t5.+t4.(+t3.t1+t1.t3) No new state computed
Name = (+t5.(+t3.+t2+t2.+t3+(+t3.t2+t2.t3))+t3.(+t5.+t2+t2.+t5+(+t5.t2+t2.t5))+(+t5.(+t3.t2+t2.t3)+t3.(+t5.t2+t2.t5))) No new state computed
Name = (+t4.(+t3.+t2+t2.+t3+(+t3.t2+t2.t3))+t2.(+t4.+t3+t3.+t4+(+t4.t3+t3.t4))+(+t4.(+t3.t2+t2.t3)+t2.(+t4.t3+t3.t4))) No new state computed
Name = (+t6.(+t1.(+t3.t2+t2.t3)+t3.(+t2.t1+t1.t2)+t2.(+t3.t1+t1.t3))+t3.(+t6.(+t2.t1+t1.t2)+t2.(+t6.t1+t1.t6))) No new state computed
Name = (+t5.(+t4.+t3+t3.+t4+(+t4.t3+t3.t4))+t3.(+t5.+t4+t4.+t5+(+t5.t4+t4.t5))+(+t5.(+t4.t3+t3.t4)+t3.(+t5.t4+t4.t5))) No new state computed
Name = (+t4.(+t1.+t3+t3.+t1+(+t3.t1+t1.t3))++t4.(+t3.t1+t1.t3)) No new state computed
Name = (+t1.++t2+t2.++t1+(+t1.+t2+t2.+t1+(+t2.t1+t1.t2)))  I.N.C.R.E.A.S.E
Name = (+t1.(+t3.+t2+t2.+t3+(+t3.t2+t2.t3))+t3.(+t1.+t2+t2.+t1+(+t2.t1+t1.t2))+t2.(+t1.+t3+t3.+t1+(+t3.t1+t1.t3))+(+t1.(+t3.t2+t2.t3)+t3.(+t2.t1+t1.t2)+t2.(+t3.t1+t1.t3)))  I.N.C.R.E.A.S.E
Name = (+t1.(+t5.+t2+t2.+t5+(+t5.t2+t2.t5))+t5.(+t1.+t2+t2.+t1+(+t2.t1+t1.t2))+(+t1.(+t5.t2+t2.t5)+t5.(+t2.t1+t1.t2)))  I.N.C.R.E.A.S.E
Name = +++t3 No new state computed
Name = +t4.+t3.(+t6.t4+t4.t6) No new state computed
Name = +++t2 No new state computed
Name = (+t5.++t4+t4.++t5+(+t5.+t4+t4.+t5+(+t5.t4+t4.t5))) No new state computed
Name = +t3.+t4.(+t3.t1+t1.t3) No new state computed
Name = (+t6.(+t5.+t4+t4.+t5+(+t5.t4+t4.t5))+t5.(+t6.+t4+t4.+t6+(+t6.t4+t4.t6))+t4.(+t6.+t5+t5.+t6+(+t6.t5+t5.t6))+(+t6.(+t5.t4+t4.t5)+t5.(+t6.t4+t4.t6)+t4.(+t6.t5+t5.t6))) No new state computed
Name = (+t6.(+t1.+t2+t2.+t1+(+t2.t1+t1.t2))+t2.(+t1.+t6+t6.+t1+(+t6.t1+t1.t6))+(+t6.(+t2.t1+t1.t2)+t2.(+t6.t1+t1.t6))) No new state computed
Name = +t5.(+t6.(+t5.t2+t2.t5)+t2.(+t6.t5+t5.t6)) No new state computed
Name = (+t6.(+t5.(+t3.t2+t2.t3)+t3.(+t5.t2+t2.t5))+t3.(+t6.(+t5.t2+t2.t5)+t2.(+t6.t5+t5.t6))) No new state computed
Name = (+t1.++t3+t3.++t1+(+t1.+t3+t3.+t1+(+t3.t1+t1.t3))) No new state computed
Name = (+t4.++t3+t3.++t4+(+t4.+t3+t3.+t4+(+t4.t3+t3.t4))) No new state computed
Name = (+t1.(+t4.(+t5.t2+t2.t5)+t2.(+t5.t4+t4.t5))+t4.(+t1.(+t5.t2+t2.t5)+t5.(+t2.t1+t1.t2))) No new state computed
Name = (+t1.(+t6.(+t5.t4+t4.t5)+t5.(+t6.t4+t4.t6)+t4.(+t6.t5+t5.t6))+t4.(+t1.(+t6.t5+t5.t6)+t5.(+t6.t1+t1.t6))) No new state computed
Name = (+t1.(+t5.(+t3.t2+t2.t3)+t3.(+t5.t2+t2.t5))+t5.(+t1.(+t3.t2+t2.t3)+t3.(+t2.t1+t1.t2)+t2.(+t3.t1+t1.t3))+t3.(+t1.(+t5.t2+t2.t5)+t5.(+t2.t1+t1.t2)))  I.N.C.R.E.A.S.E
Name = (+t6.(+t5.+t2+t2.+t5+(+t5.t2+t2.t5))+t2.(+t6.+t5+t5.+t6+(+t6.t5+t5.t6))+(+t6.(+t5.t2+t2.t5)+t2.(+t6.t5+t5.t6))) No new state computed
Name = +++t5  I.N.C.R.E.A.S.E
Name = (+t4.(+t5.+t2+t2.+t5+(+t5.t2+t2.t5))+t2.(+t5.+t4+t4.+t5+(+t5.t4+t4.t5))+(+t4.(+t5.t2+t2.t5)+t2.(+t5.t4+t4.t5))) No new state computed
increase = 1
**********************
Random choose
Name = +++t5  OK !
Now we have a representation of size = 14
Minimization in Progress
Name = (+t4.++t3+t3.++t4+(+t4.+t3+t3.+t4+(+t4.t3+t3.t4))) No new state computed
Name = (+t1.(+t6.(+t5.t2+t2.t5)+t2.(+t6.t5+t5.t6))+t6.(+t1.(+t5.t2+t2.t5)+t5.(+t2.t1+t1.t2))+t5.(+t6.(+t2.t1+t1.t2)+t2.(+t6.t1+t1.t6))+t2.(+t1.(+t6.t5+t5.t6)+t5.(+t6.t1+t1.t6)))  I.N.C.R.E.A.S.E
Name = (+t1.++t6+t6.++t1+(+t1.+t6+t6.+t1+(+t6.t1+t1.t6)))  I.N.C.R.E.A.S.E
Name = +t4.+t3.(+t6.t4+t4.t6) No new state computed
Name = (+t1.(+t6.+t5+t5.+t6+(+t6.t5+t5.t6))+t5.(+t1.+t6+t6.+t1+(+t6.t1+t1.t6))+(+t1.(+t6.t5+t5.t6)+t5.(+t6.t1+t1.t6)))  I.N.C.R.E.A.S.E
Name = (+t4.(+t3.+t2+t2.+t3+(+t3.t2+t2.t3))+t2.(+t4.+t3+t3.+t4+(+t4.t3+t3.t4))+(+t4.(+t3.t2+t2.t3)+t2.(+t4.t3+t3.t4))) No new state computed
Name = (+t6.++t4+t4.++t6+(+t6.+t4+t4.+t6+(+t6.t4+t4.t6))) No new state computed
Name = (+t1.++t2+t2.++t1+(+t1.+t2+t2.+t1+(+t2.t1+t1.t2)))  I.N.C.R.E.A.S.E
Name = (+t5.(+t3.+t2+t2.+t3+(+t3.t2+t2.t3))+t3.(+t5.+t2+t2.+t5+(+t5.t2+t2.t5))+(+t5.(+t3.t2+t2.t3)+t3.(+t5.t2+t2.t5))) No new state computed
Name = (+t6.(+t5.+t2+t2.+t5+(+t5.t2+t2.t5))+t2.(+t6.+t5+t5.+t6+(+t6.t5+t5.t6))+(+t6.(+t5.t2+t2.t5)+t2.(+t6.t5+t5.t6))) No new state computed
Name = (+t4.(+t1.+t3+t3.+t1+(+t3.t1+t1.t3))++t4.(+t3.t1+t1.t3)) No new state computed
Name = (+t1.++t3+t3.++t1+(+t1.+t3+t3.+t1+(+t3.t1+t1.t3))) No new state computed
Name = (+t1.(+t5.(+t3.t2+t2.t3)+t3.(+t5.t2+t2.t5))+t5.(+t1.(+t3.t2+t2.t3)+t3.(+t2.t1+t1.t2)+t2.(+t3.t1+t1.t3))+t3.(+t1.(+t5.t2+t2.t5)+t5.(+t2.t1+t1.t2)))  I.N.C.R.E.A.S.E
Name = (+t1.+t3.(+t6.t4+t4.t6)+t6.+t4.(+t3.t1+t1.t3)) No new state computed
Name = (+t6.++t5+t5.++t6+(+t6.+t5+t5.+t6+(+t6.t5+t5.t6))) No new state computed
Name = +++t4 No new state computed
Name = +t2.(+t6.(+t5.t2+t2.t5)+t2.(+t6.t5+t5.t6)) No new state computed
Name = (+t6.(+t5.(+t3.t2+t2.t3)+t3.(+t5.t2+t2.t5))+t3.(+t6.(+t5.t2+t2.t5)+t2.(+t6.t5+t5.t6))) No new state computed
Name = +++t3 No new state computed
Name = (+t5.(+t4.(+t3.t2+t2.t3)+t2.(+t4.t3+t3.t4))+t4.(+t5.(+t3.t2+t2.t3)+t3.(+t5.t2+t2.t5))+t3.(+t4.(+t5.t2+t2.t5)+t2.(+t5.t4+t4.t5))+t2.(+t5.(+t4.t3+t3.t4)+t3.(+t5.t4+t4.t5))) No new state computed
Name = +t6.(+t6.(+t5.t2+t2.t5)+t2.(+t6.t5+t5.t6)) No new state computed
Name = (+t3.(+t6.+t4+t4.+t6+(+t6.t4+t4.t6))++t3.(+t6.t4+t4.t6)) No new state computed
Name = +++t2 No new state computed
Name = (+t1.(+t4.(+t5.t2+t2.t5)+t2.(+t5.t4+t4.t5))+t4.(+t1.(+t5.t2+t2.t5)+t5.(+t2.t1+t1.t2))) No new state computed
Name = +t2.+t3.(+t6.t4+t4.t6) No new state computed
Name = +++t6 No new state computed
Name = (+t1.(+t3.+t2+t2.+t3+(+t3.t2+t2.t3))+t3.(+t1.+t2+t2.+t1+(+t2.t1+t1.t2))+t2.(+t1.+t3+t3.+t1+(+t3.t1+t1.t3))+(+t1.(+t3.t2+t2.t3)+t3.(+t2.t1+t1.t2)+t2.(+t3.t1+t1.t3)))  I.N.C.R.E.A.S.E
Name = (+t1.(+t6.(+t5.t4+t4.t5)+t5.(+t6.t4+t4.t6)+t4.(+t6.t5+t5.t6))+t4.(+t1.(+t6.t5+t5.t6)+t5.(+t6.t1+t1.t6))) No new state computed
Name = +++t1  I.N.C.R.E.A.S.E
Name = +t3.+t4.(+t3.t1+t1.t3) No new state computed
Name = (+t5.++t4+t4.++t5+(+t5.+t4+t4.+t5+(+t5.t4+t4.t5))) No new state computed
Name = (+t3.++t2+t2.++t3+(+t3.+t2+t2.+t3+(+t3.t2+t2.t3))) No new state computed
Name = (+t5.(+t4.+t3+t3.+t4+(+t4.t3+t3.t4))+t3.(+t5.+t4+t4.+t5+(+t5.t4+t4.t5))+(+t5.(+t4.t3+t3.t4)+t3.(+t5.t4+t4.t5))) No new state computed
Name = (+t4.(+t5.+t2+t2.+t5+(+t5.t2+t2.t5))+t2.(+t5.+t4+t4.+t5+(+t5.t4+t4.t5))+(+t4.(+t5.t2+t2.t5)+t2.(+t5.t4+t4.t5))) No new state computed
Name = +t5.(+t6.(+t5.t2+t2.t5)+t2.(+t6.t5+t5.t6)) No new state computed
Name = +t4.+t4.(+t3.t1+t1.t3) No new state computed
Name = +t5.+t4.(+t3.t1+t1.t3) No new state computed
Name = (+t1.(+t5.+t2+t2.+t5+(+t5.t2+t2.t5))+t5.(+t1.+t2+t2.+t1+(+t2.t1+t1.t2))+(+t1.(+t5.t2+t2.t5)+t5.(+t2.t1+t1.t2)))  I.N.C.R.E.A.S.E
Name = (+t6.(+t5.(+t4.t3+t3.t4)+t3.(+t5.t4+t4.t5))+t5.+t3.(+t6.t4+t4.t6)+t3.(+t6.(+t5.t4+t4.t5)+t5.(+t6.t4+t4.t6)+t4.(+t6.t5+t5.t6))) No new state computed
Name = (+t6.(+t1.(+t3.t2+t2.t3)+t3.(+t2.t1+t1.t2)+t2.(+t3.t1+t1.t3))+t3.(+t6.(+t2.t1+t1.t2)+t2.(+t6.t1+t1.t6)))  I.N.C.R.E.A.S.E
Name = (+t6.(+t4.(+t5.t2+t2.t5)+t2.(+t5.t4+t4.t5))+t4.(+t6.(+t5.t2+t2.t5)+t2.(+t6.t5+t5.t6))+t2.(+t6.(+t5.t4+t4.t5)+t5.(+t6.t4+t4.t6)+t4.(+t6.t5+t5.t6))) No new state computed
Name = (+t1.(+t4.(+t3.t2+t2.t3)+t2.(+t4.t3+t3.t4))+t4.(+t1.(+t3.t2+t2.t3)+t3.(+t2.t1+t1.t2)+t2.(+t3.t1+t1.t3))+t2.+t4.(+t3.t1+t1.t3))  I.N.C.R.E.A.S.E
Name = (+t5.++t2+t2.++t5+(+t5.+t2+t2.+t5+(+t5.t2+t2.t5))) No new state computed
Name = (+t6.(+t5.+t4+t4.+t5+(+t5.t4+t4.t5))+t5.(+t6.+t4+t4.+t6+(+t6.t4+t4.t6))+t4.(+t6.+t5+t5.+t6+(+t6.t5+t5.t6))+(+t6.(+t5.t4+t4.t5)+t5.(+t6.t4+t4.t6)+t4.(+t6.t5+t5.t6))) No new state computed
Name = (+t6.(+t1.+t2+t2.+t1+(+t2.t1+t1.t2))+t2.(+t1.+t6+t6.+t1+(+t6.t1+t1.t6))+(+t6.(+t2.t1+t1.t2)+t2.(+t6.t1+t1.t6)))  I.N.C.R.E.A.S.E
increase = 1
**********************
Random choose
Name = (+t6.(+t1.+t2+t2.+t1+(+t2.t1+t1.t2))+t2.(+t1.+t6+t6.+t1+(+t6.t1+t1.t6))+(+t6.(+t2.t1+t1.t2)+t2.(+t6.t1+t1.t6)))  OK !
Now we have a representation of size = 20
Minimization in Progress
Name = (+t3.++t2+t2.++t3+(+t3.+t2+t2.+t3+(+t3.t2+t2.t3))) No new state computed
Name = (+t6.(+t5.(+t4.t3+t3.t4)+t3.(+t5.t4+t4.t5))+t5.+t3.(+t6.t4+t4.t6)+t3.(+t6.(+t5.t4+t4.t5)+t5.(+t6.t4+t4.t6)+t4.(+t6.t5+t5.t6))) No new state computed
Name = +t4.+t4.(+t3.t1+t1.t3) No new state computed
Name = (+t5.++t2+t2.++t5+(+t5.+t2+t2.+t5+(+t5.t2+t2.t5))) No new state computed
Name = (+t4.(+t3.+t2+t2.+t3+(+t3.t2+t2.t3))+t2.(+t4.+t3+t3.+t4+(+t4.t3+t3.t4))+(+t4.(+t3.t2+t2.t3)+t2.(+t4.t3+t3.t4))) No new state computed
Name = (+t1.(+t6.(+t5.t4+t4.t5)+t5.(+t6.t4+t4.t6)+t4.(+t6.t5+t5.t6))+t4.(+t1.(+t6.t5+t5.t6)+t5.(+t6.t1+t1.t6))) No new state computed
Name = (+t6.(+t1.(+t3.t2+t2.t3)+t3.(+t2.t1+t1.t2)+t2.(+t3.t1+t1.t3))+t3.(+t6.(+t2.t1+t1.t2)+t2.(+t6.t1+t1.t6)))  I.N.C.R.E.A.S.E
Name = (+t1.(+t3.+t2+t2.+t3+(+t3.t2+t2.t3))+t3.(+t1.+t2+t2.+t1+(+t2.t1+t1.t2))+t2.(+t1.+t3+t3.+t1+(+t3.t1+t1.t3))+(+t1.(+t3.t2+t2.t3)+t3.(+t2.t1+t1.t2)+t2.(+t3.t1+t1.t3)))  I.N.C.R.E.A.S.E
Name = (+t4.++t3+t3.++t4+(+t4.+t3+t3.+t4+(+t4.t3+t3.t4))) No new state computed
Name = (+t1.(+t6.(+t5.t2+t2.t5)+t2.(+t6.t5+t5.t6))+t6.(+t1.(+t5.t2+t2.t5)+t5.(+t2.t1+t1.t2))+t5.(+t6.(+t2.t1+t1.t2)+t2.(+t6.t1+t1.t6))+t2.(+t1.(+t6.t5+t5.t6)+t5.(+t6.t1+t1.t6))) No new state computed
Name = (+t1.(+t4.(+t5.t2+t2.t5)+t2.(+t5.t4+t4.t5))+t4.(+t1.(+t5.t2+t2.t5)+t5.(+t2.t1+t1.t2))) No new state computed
Name = (+t5.(+t4.+t3+t3.+t4+(+t4.t3+t3.t4))+t3.(+t5.+t4+t4.+t5+(+t5.t4+t4.t5))+(+t5.(+t4.t3+t3.t4)+t3.(+t5.t4+t4.t5))) No new state computed
Name = (+t1.(+t6.+t5+t5.+t6+(+t6.t5+t5.t6))+t5.(+t1.+t6+t6.+t1+(+t6.t1+t1.t6))+(+t1.(+t6.t5+t5.t6)+t5.(+t6.t1+t1.t6)))  I.N.C.R.E.A.S.E
Name = (+t1.++t2+t2.++t1+(+t1.+t2+t2.+t1+(+t2.t1+t1.t2)))  I.N.C.R.E.A.S.E
Name = (+t3.(+t6.+t4+t4.+t6+(+t6.t4+t4.t6))++t3.(+t6.t4+t4.t6)) No new state computed
Name = +++t5 No new state computed
Name = (+t6.(+t5.+t4+t4.+t5+(+t5.t4+t4.t5))+t5.(+t6.+t4+t4.+t6+(+t6.t4+t4.t6))+t4.(+t6.+t5+t5.+t6+(+t6.t5+t5.t6))+(+t6.(+t5.t4+t4.t5)+t5.(+t6.t4+t4.t6)+t4.(+t6.t5+t5.t6))) No new state computed
Name = +t2.(+t6.(+t5.t2+t2.t5)+t2.(+t6.t5+t5.t6)) No new state computed
Name = +t5.+t4.(+t3.t1+t1.t3) No new state computed
Name = +t5.(+t6.(+t5.t2+t2.t5)+t2.(+t6.t5+t5.t6)) No new state computed
Name = (+t5.++t4+t4.++t5+(+t5.+t4+t4.+t5+(+t5.t4+t4.t5))) No new state computed
Name = (+t1.(+t5.(+t3.t2+t2.t3)+t3.(+t5.t2+t2.t5))+t5.(+t1.(+t3.t2+t2.t3)+t3.(+t2.t1+t1.t2)+t2.(+t3.t1+t1.t3))+t3.(+t1.(+t5.t2+t2.t5)+t5.(+t2.t1+t1.t2)))  I.N.C.R.E.A.S.E
Name = (+t4.(+t1.+t3+t3.+t1+(+t3.t1+t1.t3))++t4.(+t3.t1+t1.t3)) No new state computed
Name = (+t5.(+t3.+t2+t2.+t3+(+t3.t2+t2.t3))+t3.(+t5.+t2+t2.+t5+(+t5.t2+t2.t5))+(+t5.(+t3.t2+t2.t3)+t3.(+t5.t2+t2.t5))) No new state computed
Name = +++t2 No new state computed
Name = (+t5.(+t4.(+t3.t2+t2.t3)+t2.(+t4.t3+t3.t4))+t4.(+t5.(+t3.t2+t2.t3)+t3.(+t5.t2+t2.t5))+t3.(+t4.(+t5.t2+t2.t5)+t2.(+t5.t4+t4.t5))+t2.(+t5.(+t4.t3+t3.t4)+t3.(+t5.t4+t4.t5))) No new state computed
Name = +t3.+t4.(+t3.t1+t1.t3)  I.N.C.R.E.A.S.E
Name = (+t6.(+t4.(+t5.t2+t2.t5)+t2.(+t5.t4+t4.t5))+t4.(+t6.(+t5.t2+t2.t5)+t2.(+t6.t5+t5.t6))+t2.(+t6.(+t5.t4+t4.t5)+t5.(+t6.t4+t4.t6)+t4.(+t6.t5+t5.t6))) No new state computed
Name = (+t1.+t3.(+t6.t4+t4.t6)+t6.+t4.(+t3.t1+t1.t3))  I.N.C.R.E.A.S.E
Name = (+t4.(+t5.+t2+t2.+t5+(+t5.t2+t2.t5))+t2.(+t5.+t4+t4.+t5+(+t5.t4+t4.t5))+(+t4.(+t5.t2+t2.t5)+t2.(+t5.t4+t4.t5))) No new state computed
Name = (+t6.++t4+t4.++t6+(+t6.+t4+t4.+t6+(+t6.t4+t4.t6))) No new state computed
Name = +++t1  I.N.C.R.E.A.S.E
Name = (+t6.(+t5.+t2+t2.+t5+(+t5.t2+t2.t5))+t2.(+t6.+t5+t5.+t6+(+t6.t5+t5.t6))+(+t6.(+t5.t2+t2.t5)+t2.(+t6.t5+t5.t6))) No new state computed
Name = +++t3  I.N.C.R.E.A.S.E
Name = +++t6 No new state computed
Name = +t6.(+t6.(+t5.t2+t2.t5)+t2.(+t6.t5+t5.t6)) No new state computed
Name = (+t1.(+t4.(+t3.t2+t2.t3)+t2.(+t4.t3+t3.t4))+t4.(+t1.(+t3.t2+t2.t3)+t3.(+t2.t1+t1.t2)+t2.(+t3.t1+t1.t3))+t2.+t4.(+t3.t1+t1.t3))  I.N.C.R.E.A.S.E
Name = (+t6.++t5+t5.++t6+(+t6.+t5+t5.+t6+(+t6.t5+t5.t6))) No new state computed
Name = (+t1.(+t5.+t2+t2.+t5+(+t5.t2+t2.t5))+t5.(+t1.+t2+t2.+t1+(+t2.t1+t1.t2))+(+t1.(+t5.t2+t2.t5)+t5.(+t2.t1+t1.t2)))  I.N.C.R.E.A.S.E
Name = +t4.+t3.(+t6.t4+t4.t6) No new state computed
Name = +t2.+t3.(+t6.t4+t4.t6) No new state computed
Name = (+t6.(+t5.(+t3.t2+t2.t3)+t3.(+t5.t2+t2.t5))+t3.(+t6.(+t5.t2+t2.t5)+t2.(+t6.t5+t5.t6))) No new state computed
Name = +++t4 No new state computed
Name = (+t1.++t6+t6.++t1+(+t1.+t6+t6.+t1+(+t6.t1+t1.t6)))  I.N.C.R.E.A.S.E
Name = (+t1.++t3+t3.++t1+(+t1.+t3+t3.+t1+(+t3.t1+t1.t3)))  I.N.C.R.E.A.S.E
increase = 1
**********************
Random choose
Name = (+t1.++t3+t3.++t1+(+t1.+t3+t3.+t1+(+t3.t1+t1.t3)))  OK !
Now we have a representation of size = 26
Minimization in Progress
Name = (+t1.(+t4.(+t3.t2+t2.t3)+t2.(+t4.t3+t3.t4))+t4.(+t1.(+t3.t2+t2.t3)+t3.(+t2.t1+t1.t2)+t2.(+t3.t1+t1.t3))+t2.+t4.(+t3.t1+t1.t3))  I.N.C.R.E.A.S.E
Name = +t4.+t4.(+t3.t1+t1.t3)  I.N.C.R.E.A.S.E
Name = +t3.+t4.(+t3.t1+t1.t3) No new state computed
Name = +++t6 No new state computed
Name = (+t1.(+t6.(+t5.t2+t2.t5)+t2.(+t6.t5+t5.t6))+t6.(+t1.(+t5.t2+t2.t5)+t5.(+t2.t1+t1.t2))+t5.(+t6.(+t2.t1+t1.t2)+t2.(+t6.t1+t1.t6))+t2.(+t1.(+t6.t5+t5.t6)+t5.(+t6.t1+t1.t6))) No new state computed
Name = +t5.(+t6.(+t5.t2+t2.t5)+t2.(+t6.t5+t5.t6)) 