current set encoding is : mona
seed is : 3284
cycles of length 1
(1/4), name = r1, size = 144
(2/4), name = r2, size = 92
(3/4), name = r3, size = 147
(4/4), name = r4, size = 156
**********************
Random choose
Name = r2  No new state computed
Name = r4  OK !
Now we have a representation of size = 15
Minimization in Progress
Name = r3 No new state computed
Name = r1  I.N.C.R.E.A.S.E
Name = r2  OK !
Now we have a representation of size = 15
Name = r1  I.N.C.R.E.A.S.E
Name = r3 No new state computed
Name = r4 No new state computed
increase = 1
**********************
Random choose
Name = r1  OK !
Now we have a representation of size = 19
Minimization in Progress
Name = r3 No new state computed
Name = r4 No new state computed
Name = r2 No new state computed
increase = 0
nb accelerations 3
Fix point FOUND
seed is : 3284
