current set encoding is : omega
seed is : 21768
cycles of length 1
(1/9), name = r1, size = 40
(2/9), name = r2, size = 33
(3/9), name = r3, size = 55
(4/9), name = r4, size = 32
(5/9), name = r5, size = 41
(6/9), name = r6, size = 65
(7/9), name = r7, size = 32
(8/9), name = r8, size = 22
(9/9), name = r9, size = 32
**********************
Random choose
Name = r2  No new state computed
Name = r3  No new state computed
Name = r4  No new state computed
Name = r7  No new state computed
Name = r8  No new state computed
Name = r9  No new state computed
Name = r1  OK !
Now we have a representation of size = 10
Minimization in Progress
Name = r5 No new state computed
Name = r9 No new state computed
Name = r7 No new state computed
Name = r4  I.N.C.R.E.A.S.E
Name = r8 No new state computed
Name = r6  I.N.C.R.E.A.S.E
Name = r3  I.N.C.R.E.A.S.E
Name = r2 No new state computed
increase = 1
**********************
Random choose
Name = r3  OK !
Now we have a representation of size = 16
Minimization in Progress
Name = r6  I.N.C.R.E.A.S.E
Name = r1 No new state computed
Name = r4  I.N.C.R.E.A.S.E
Name = r2 No new state computed
Name = r5  I.N.C.R.E.A.S.E
Name = r8  I.N.C.R.E.A.S.E
Name = r9 No new state computed
Name = r7 No new state computed
increase = 1
**********************
Random choose
Name = r8  OK !
Now we have a representation of size = 22
Minimization in Progress
Name = r4  I.N.C.R.E.A.S.E
Name = r5  I.N.C.R.E.A.S.E
Name = r9 No new state computed
Name = r6  I.N.C.R.E.A.S.E
Name = r3 No new state computed
Name = r1 No new state computed
Name = r2 No new state computed
Name = r7 No new state computed
increase = 1
**********************
Random choose
Name = r6  OK !
Now we have a representation of size = 62
Minimization in Progress
Name = r3 No new state computed
Name = r7 No new state computed
Name = r2 No new state computed
Name = r5 No new state computed
Name = r9 No new state computed
Name = r8 No new state computed
Name = r1 No new state computed
Name = r4 No new state computed
increase = 0
nb accelerations 4
Fix point FOUND
seed is : 21768
