current set encoding is : omega
seed is : 2691
cycles of length 1
(1/9), name = t1, size = 86
(2/9), name = t2, size = 88
(3/9), name = t3, size = 87
(4/9), name = t4, size = 88
(5/9), name = t5, size = 86
(6/9), name = t6, size = 88
(7/9), name = t7, size = 60
(8/9), name = t8, size = 61
(9/9), name = t9, size = 88
**********************
Random choose
Name = t4  No new state computed
Name = t1  No new state computed
Name = t3  OK !
Now we have a representation of size = 28
Minimization in Progress
Name = t8 No new state computed
Name = t4  I.N.C.R.E.A.S.E
Name = t5 No new state computed
Name = t6 No new state computed
Name = t7  I.N.C.R.E.A.S.E
Name = t1 No new state computed
Name = t9 No new state computed
Name = t2 No new state computed
increase = 1
**********************
Random choose
Name = t7  OK !
Now we have a representation of size = 56
Minimization in Progress
Name = t2  I.N.C.R.E.A.S.E
Name = t9 No new state computed
Name = t8 No new state computed
Name = t3 No new state computed
Name = t6 No new state computed
Name = t5 No new state computed
Name = t4  I.N.C.R.E.A.S.E
Name = t1 No new state computed
increase = 1
**********************
Random choose
Name = t4  OK !
Now we have a representation of size = 84
Minimization in Progress
Name = t5 No new state computed
Name = t6 No new state computed
Name = t3 No new state computed
Name = t8  I.N.C.R.E.A.S.E
Name = t7 No new state computed
Name = t9 No new state computed
Name = t2  I.N.C.R.E.A.S.E
Name = t1 No new state computed
increase = 1
**********************
Random choose
Name = t2  OK !
Now we have a representation of size = 98
Minimization in Progress
Name = t5 No new state computed
Name = t6  I.N.C.R.E.A.S.E
Name = t4 No new state computed
Name = t1  I.N.C.R.E.A.S.E
Name = t8  I.N.C.R.E.A.S.E
Name = t9 No new state computed
Name = t3 No new state computed
Name = t7 No new state computed
increase = 1
**********************
Random choose
Name = t8  OK !
Now we have a representation of size = 112
Minimization in Progress
Name = t1  I.N.C.R.E.A.S.E
Name = t3 No new state computed
Name = t6  I.N.C.R.E.A.S.E
Name = t5 No new state computed
Name = t2 No new state computed
Name = t9 No new state computed
Name = t7 No new state computed
Name = t4 No new state computed
increase = 1
**********************
Random choose
Name = t6  OK !
Now we have a representation of size = 126
Minimization in Progress
Name = t2 No new state computed
Name = t5  I.N.C.R.E.A.S.E
Name = t9 No new state computed
Name = t3 No new state computed
Name = t8 No new state computed
Name = t4 No new state computed
Name = t7 No new state computed
Name = t1  I.N.C.R.E.A.S.E
increase = 1
**********************
Random choose
Name = t1  OK !
Now we have a representation of size = 154
Minimization in Progress
Name = t3 No new state computed
Name = t9 No new state computed
Name = t6 No new state computed
Name = t7 No new state computed
Name = t8 No new state computed
Name = t4  I.N.C.R.E.A.S.E
Name = t2  I.N.C.R.E.A.S.E
Name = t5  I.N.C.R.E.A.S.E
increase = 1
**********************
Random choose
Name = t5  OK !
Now we have a representation of size = 182
Minimization in Progress
Name = t9 No new state computed
Name = t1 No new state computed
Name = t3 No new state computed
Name = t4  I.N.C.R.E.A.S.E
Name = t8 No new state computed
Name = t6 No new state computed
Name = t2  I.N.C.R.E.A.S.E
Name = t7 No new state computed
increase = 1
**********************
Random choose
Name = t2  OK !
Now we have a representation of size = 238
Minimization in Progress
Name = t3 No new state computed
Name = t5 No new state computed
Name = t7 No new state computed
Name = t4  I.N.C.R.E.A.S.E
Name = t6 No new state computed
Name = t1  I.N.C.R.E.A.S.E
Name = t8 No new state computed
Name = t9 No new state computed
increase = 1
**********************
Random choose
Name = t1  OK !
Now we have a representation of size = 336
Minimization in Progress
Name = t8 No new state computed
Name = t9 No new state computed
Name = t4  I.N.C.R.E.A.S.E
Name = t2  I.N.C.R.E.A.S.E
Name = t3 No new state computed
Name = t7 No new state computed
Name = t6 No new state computed
Name = t5 No new state computed
increase = 1
**********************
Random choose
Name = t2  OK !
Now we have a representation of size = 490
Minimization in Progress
Name = t3 No new state computed
Name = t9 No new state computed
Name = t1  I.N.C.R.E.A.S.E
Name = t6 No new state computed
Name = t5 No new state computed
Name = t7 No new state computed
Name = t4  I.N.C.R.E.A.S.E
Name = t8 No new state computed
increase = 1
**********************
Random choose
Name = t4  OK !
Now we have a representation of size = 658
Minimization in Progress
Name = t6 No new state computed
Name = t5 No new state computed
Name = t3 No new state computed
Name = t8 No new state computed
Name = t7 No new state computed
Name = t9 No new state computed
Name = t1  I.N.C.R.E.A.S.E
Name = t2 No new state computed
increase = 1
**********************
Random choose
Name = t1  OK !
Now we have a representation of size = 910
Minimization in Progress
Name = t5 No new state computed
Name = t9 No new state computed
Name = t4  I.N.C.R.E.A.S.E
Name = t3 No new state computed
Name = t2  I.N.C.R.E.A.S.E
Name = t8 No new state computed
Name = t6 No new state computed
Name = t7 No new state computed
increase = 1
**********************
Random choose
Name = t2  OK !
Now we have a representation of size = 1316
Minimization in Progress
Name = t7 No new state computed
Name = t3 No new state computed
Name = t4  I.N.C.R.E.A.S.E
Name = t8 No new state computed
Name = t5 No new state computed
Name = t6 No new state computed
Name = t9 No new state computed
Name = t1  I.N.C.R.E.A.S.E
increase = 1
**********************
Random choose
Name = t1  OK !
Now we have a representation of size = 1974
Minimization in Progress
Name = t2  I.N.C.R.E.A.S.E
Name = t4  I.N.C.R.E.A.S.E
Name = t6 No new state computed
Name = t8 No new state computed
Name = t9 No new state computed
Name = t7 No new state computed
Name = t5 No new state computed
Name = t3 No new state computed
increase = 1
**********************
Random choose
Name = t4  OK !
Now we have a representation of size = 3052
Minimization in Progress
Name = t8 No new state computed
Name = t2  I.N.C.R.E.A.S.E
Name = t7 No new state computed
Name = t3 No new state computed
Name = t1 No new state computed
Name = t6 No new state computed
Name = t5 No new state computed
Name = t9 No new state computed
increase = 1
**********************
Random choose
Name = t2  OK !
Now we have a representation of size = 4116
Minimization in Progress
Name = t5 No new state computed
Name = t9 No new state computed
Name = t3 No new state computed
Name = t8 No new state computed
Name = t4 No new state computed
Name = t6 No new state computed
Name = t1  I.N.C.R.E.A.S.E
Name = t7 No new state computed
increase = 1
**********************
Random choose
Name = t1  OK !
Now we have a representation of size = 5838
Minimization in Progress
Name = t3 No new state computed
Name = t5 No new state computed
Name = t2  I.N.C.R.E.A.S.E
Name = t7 No new state computed
Name = t8 No new state computed
Name = t4  I.N.C.R.E.A.S.E
Name = t6 No new state computed
Name = t9 No new state computed
increase = 1
**********************
Random choose
Name = t4  OK !
Now we have a representation of size = 8638
Minimization in Progress
Name = t3 No new state computed
Name = t6 No new state computed
Name = t7 No new state computed
Name = t8 No new state computed
Name = t9 No new state computed
Name = t5 No new state computed
Name = t1 No new state computed
Name = t2  I.N.C.R.E.A.S.E
increase = 1
**********************
Random choose
Name = t2  OK !
Now we have a representation of size = 11410
Minimization in Progress
Name = t1  I.N.C.R.E.A.S.E
Name = t4 No new state computed
Name = t3 No new state computed
Name = t9 No new state computed
Name = t8 No new state computed
Name = t6 