current set encoding is : prestaf
seed is : 2691
cycles of length 1
(1/4), name = r1, size = 122
(2/4), name = r2, size = 74
(3/4), name = r3, size = 124
(4/4), name = r4, size = 132
**********************
Random choose
Name = r2  No new state computed
Name = r1  OK !
Now we have a representation of size = 11
Minimization in Progress
Name = r2 No new state computed
Name = r3  I.N.C.R.E.A.S.E
Name = r4  I.N.C.R.E.A.S.E
increase = 1
**********************
Random choose
Name = r4  OK !
Now we have a representation of size = 18
Minimization in Progress
Name = r3 No new state computed
Name = r2  OK !
Now we have a representation of size = 18
Name = r3 No new state computed
Name = r1 No new state computed
Name = r4 No new state computed
increase = 0
nb accelerations 3
Fix point FOUND
seed is : 2691
