current set encoding is : prestaf-no-among
seed is : 2691
cycles of length 1
(1/14), name = t1, size = 284
(2/14), name = t2, size = 1470
(3/14), name = t3, size = 2835
(4/14), name = t4, size = 1440
(5/14), name = t5, size = 665
(6/14), name = t6, size = 938
(7/14), name = t7, size = 1494
(8/14), name = t8, size = 284
(9/14), name = t9, size = 1218
(10/14), name = t10, size = 2331
(11/14), name = t11, size = 1188
(12/14), name = t12, size = 694
(13/14), name = t13, size = 938
(14/14), name = t14, size = 1242
**********************
Random choose
Name = t6  No new state computed
Name = t1  OK !
Now we have a representation of size = 49
Minimization in Progress
Name = t6 No new state computed
Name = t11 No new state computed
Name = t5 No new state computed
Name = t8  I.N.C.R.E.A.S.E
Name = t9 No new state computed
Name = t10 No new state computed
Name = t14 No new state computed
Name = t2  I.N.C.R.E.A.S.E
Name = t3 No new state computed
Name = t7 No new state computed
Name = t12 No new state computed
Name = t4 No new state computed
Name = t13 No new state computed
increase = 1
**********************
Random choose
Name = t2  OK !
Now we have a representation of size = 65
Minimization in Progress
Name = t5 No new state computed
Name = t9 No new state computed
Name = t8  I.N.C.R.E.A.S.E
Name = t1 No new state computed
Name = t6 No new state computed
Name = t12 No new state computed
Name = t3  I.N.C.R.E.A.S.E
Name = t11 No new state computed
Name = t4 No new state computed
Name = t7 No new state computed
Name = t13 No new state computed
Name = t14 No new state computed
Name = t10 No new state computed
increase = 1
**********************
Random choose
Name = t3  OK !
Now we have a representation of size = 66
Minimization in Progress
Name = t10 No new state computed
Name = t7 No new state computed
Name = t14 No new state computed
Name = t1 No new state computed
Name = t6 No new state computed
Name = t5 No new state computed
Name = t12 No new state computed
Name = t13 No new state computed
Name = t2  I.N.C.R.E.A.S.E
Name = t4 No new state computed
Name = t11 No new state computed
Name = t9 No new state computed
Name = t8  I.N.C.R.E.A.S.E
increase = 1
**********************
Random choose
Name = t8  OK !
Now we have a representation of size = 94
Minimization in Progress
Name = t6 No new state computed
Name = t7 No new state computed
Name = t3 No new state computed
Name = t14 No new state computed
Name = t9  I.N.C.R.E.A.S.E
Name = t5 No new state computed
Name = t11 No new state computed
Name = t4 No new state computed
Name = t13 No new state computed
Name = t10 No new state computed
Name = t1 No new state computed
Name = t12 No new state computed
Name = t2  I.N.C.R.E.A.S.E
increase = 1
**********************
Random choose
Name = t2  OK !
Now we have a representation of size = 95
Minimization in Progress
Name = t1 No new state computed
Name = t9  I.N.C.R.E.A.S.E
Name = t10 No new state computed
Name = t6 No new state computed
Name = t14 No new state computed
Name = t5 No new state computed
Name = t13 No new state computed
Name = t3  I.N.C.R.E.A.S.E
Name = t4 No new state computed
Name = t8 No new state computed
Name = t11 No new state computed
Name = t12 No new state computed
Name = t7 No new state computed
increase = 1
**********************
Random choose
Name = t3  OK !
Now we have a representation of size = 100
Minimization in Progress
Name = t4 No new state computed
Name = t8 No new state computed
Name = t9  I.N.C.R.E.A.S.E
Name = t7 No new state computed
Name = t11 No new state computed
Name = t2 No new state computed
Name = t12 No new state computed
Name = t1 No new state computed
Name = t5 No new state computed
Name = t6 No new state computed
Name = t10 No new state computed
Name = t13 No new state computed
Name = t14 No new state computed
increase = 1
**********************
Random choose
Name = t9  OK !
Now we have a representation of size = 110
Minimization in Progress
Name = t4 No new state computed
Name = t5 No new state computed
Name = t11 No new state computed
Name = t13 No new state computed
Name = t2 No new state computed
Name = t1 No new state computed
Name = t8 No new state computed
Name = t7 No new state computed
Name = t3 No new state computed
Name = t14 No new state computed
Name = t10 No new state computed
Name = t12  I.N.C.R.E.A.S.E
Name = t6 No new state computed
increase = 1
**********************
Random choose
Name = t12  OK !
Now we have a representation of size = 119
Minimization in Progress
Name = t5 No new state computed
Name = t6 No new state computed
Name = t8 No new state computed
Name = t10 No new state computed
Name = t3 No new state computed
Name = t11 No new state computed
Name = t13  I.N.C.R.E.A.S.E
Name = t1 No new state computed
Name = t4 No new state computed
Name = t9 No new state computed
Name = t14 No new state computed
Name = t2 No new state computed
Name = t7 No new state computed
increase = 1
**********************
Random choose
Name = t13  OK !
Now we have a representation of size = 149
Minimization in Progress
Name = t3 No new state computed
Name = t11 No new state computed
Name = t4 No new state computed
Name = t6 No new state computed
Name = t5 No new state computed
Name = t9 No new state computed
Name = t7 No new state computed
Name = t12 No new state computed
Name = t8 No new state computed
Name = t1 No new state computed
Name = t2 No new state computed
Name = t14  I.N.C.R.E.A.S.E
Name = t10 No new state computed
increase = 1
**********************
Random choose
Name = t14  OK !
Now we have a representation of size = 195
Minimization in Progress
Name = t2  I.N.C.R.E.A.S.E
Name = t3 No new state computed
Name = t10 No new state computed
Name = t9  I.N.C.R.E.A.S.E
Name = t11 No new state computed
Name = t13 No new state computed
Name = t8 No new state computed
Name = t4  I.N.C.R.E.A.S.E
Name = t7 No new state computed
Name = t12 No new state computed
Name = t5 No new state computed
Name = t6 No new state computed
Name = t1 No new state computed
increase = 1
**********************
Random choose
Name = t4  OK !
Now we have a representation of size = 228
Minimization in Progress
Name = t2 No new state computed
Name = t5  I.N.C.R.E.A.S.E
Name = t11 No new state computed
Name = t10 No new state computed
Name = t9  OK !
Now we have a representation of size = 228
Name = t2 No new state computed
Name = t10  I.N.C.R.E.A.S.E
Name = t4 No new state computed
Name = t7 No new state computed
Name = t3 No new state computed
Name = t12 No new state computed
Name = t5  I.N.C.R.E.A.S.E
Name = t8 No new state computed
Name = t11 No new state computed
Name = t14 No new state computed
Name = t13 No new state computed
Name = t6 No new state computed
Name = t1 No new state computed
increase = 1
**********************
Random choose
Name = t5  OK !
Now we have a representation of size = 239
Minimization in Progress
Name = t6  I.N.C.R.E.A.S.E
Name = t12 No new state computed
Name = t10  I.N.C.R.E.A.S.E
Name = t3 No new state computed
Name = t9 No new state computed
Name = t1 No new state computed
Name = t4 No new state computed
Name = t11 No new state computed
Name = t2 No new state computed
Name = t8 No new state computed
Name = t13 No new state computed
Name = t7 No new state computed
Name = t14 No new state computed
increase = 1
**********************
Random choose
Name = t10  OK !
Now we have a representation of size = 243
Minimization in Progress
Name = t2  I.N.C.R.E.A.S.E
Name = t6  I.N.C.R.E.A.S.E
Name = t7 No new state computed
Name = t1 No new state computed
Name = t4  I.N.C.R.E.A.S.E
Name = t12 No new state computed
Name = t11 No new state computed
Name = t5 No new state computed
Name = t3 No new state computed
Name = t14 No new state computed
Name = t13 No new state computed
Name = t9  I.N.C.R.E.A.S.E
Name = t8 No new state computed
increase = 1
**********************
Random choose
Name = t9  OK !
Now we have a representation of size = 248
Minimization in Progress
Name = t5 No new state computed
Name = t10  I.N.C.R.E.A.S.E
Name = t13 No new state computed
Name = t1 No new state computed
Name = t7 No new state computed
Name = t14 No new state computed
Name = t12 No new state computed
Name = t4  I.N.C.R.E.A.S.E
Name = t8 No new state computed
Name = t6  I.N.C.R.E.A.S.E
Name = t2  I.N.C.R.E.A.S.E
Name = t3 No new state computed
Name = t11 No new state computed
increase = 1
**********************
Random choose
Name = t2  OK !
Now we have a representation of size = 249
Minimization in Progress
Name = t11 No new state computed
Name = t9 No new state computed
Name = t5  I.N.C.R.E.A.S.E
Name = t12 No new state computed
Name = t4 No new state computed
Name = t13 No new state computed
Name = t3 No new state computed
Name = t6  I.N.C.R.E.A.S.E
Name = t10  I.N.C.R.E.A.S.E
Name = t7 No new state computed
Name = t14 No new state computed
Name = t8 No new state computed
Name = t1 No new state computed
increase = 1
**********************
Random choose
Name = t10  OK !
Now we have a representation of size = 258
Minimization in Progress
Name = t1 No new state computed
Name = t9 No new state computed
Name = t11 No new state computed
Name = t2  I.N.C.R.E.A.S.E
Name = t7 No new state computed
Name = t3 No new state computed
Name = t12 No new state computed
Name = t13 No new state computed
Name = t14 No new state computed
Name = t8 No new state computed
Name = t4  I.N.C.R.E.A.S.E
Name = t6  I.N.C.R.E.A.S.E
Name = t5  I.N.C.R.E.A.S.E
increase = 1
**********************
Random choose
Name = t5  OK !
Now we have a representation of size = 261
Minimization in Progress
Name = t1 No new state computed
Name = t14 No new state computed
Name = t8 No new state computed
Name = t7 No new state computed
Name = t10 No new state computed
Name = t4  I.N.C.R.E.A.S.E
Name = t3 No new state computed
Name = t2  I.N.C.R.E.A.S.E
Name = t6  I.N.C.R.E.A.S.E
Name = t9 No new state computed
Name = t11 No new state computed
Name = t12 No new state computed
Name = t13 No new state computed
increase = 1
**********************
Random choose
Name = t6  OK !
Now we have a representation of size = 268
Minimization in Progress
Name = t14 No new state computed
Name = t5 No new state computed
Name = t3 No new state computed
Name = t10 No new state computed
Name = t7  I.N.C.R.E.A.S.E
Name = t11 No new state computed
Name = t12 No new state computed
Name = t9 No new state computed
Name = t8 No new state computed
Name = t2  I.N.C.R.E.A.S.E
Name = t13 No new state computed
Name = t1 No new state computed
Name = t4  I.N.C.R.E.A.S.E
increase = 1
**********************
Random choose
Name = t4  OK !
Now we have a representation of size = 270
Minimization in Progress
Name = t14 No new state computed
Name = t11 No new state computed
Name = t5  I.N.C.R.E.A.S.E
Name = t7  I.N.C.R.E.A.S.E
Name = t9 No new state computed
Name = t13 No new state computed
Name = t1 No new state computed
Name = t8 No new state computed
Name = t10 No new state computed
Name = t6 No new state computed
Name = t12 No new state computed
Name = t3 No new state computed
Name = t2 No new state computed
increase = 1
**********************
Random choose
Name = t7  OK !
Now we have a representation of size = 294
Minimization in Progress
Name = t14 No new state computed
Name = t3 No new state computed
Name = t9  I.N.C.R.E.A.S.E
Name = t2  OK !
Now we have a representation of size = 294
Name = t11  OK !
Now we have a representation of size = 294
Name = t2 No new state computed
Name = t7 No new state computed
Name = t1 No new state computed
Name = t14 No new state computed
Name = t4 No new state computed
Name = t3  I.N.C.R.E.A.S.E
Name = t5  I.N.C.R.E.A.S.E
Name = t10 No new state computed
Name = t9  I.N.C.R.E.A.S.E
Name = t6 No new state computed
Name = t8 No new state computed
Name = t12  OK !
Now we have a representation of size = 290
Name = t8 No new state computed
Name = t4 No new state computed
Name = t11 No new state computed
Name = t1 No new state computed
Name = t9  I.N.C.R.E.A.S.E
Name = t13 No new state computed
Name = t14 No new state computed
Name = t10 No new state computed
Name = t3  I.N.C.R.E.A.S.E
Name = t5  I.N.C.R.E.A.S.E
Name = t7 No new state computed
Name = t2 No new state computed
Name = t6 No new state computed
increase = 1
**********************
Random choose
Name = t5  OK !
Now we have a representation of size = 297
Minimization in Progress
Name = t11 No new state computed
Name = t4 No new state computed
Name = t12 No new state computed
Name = t6  I.N.C.R.E.A.S.E
Name = t14 No new state computed
Name = t1 No new state computed
Name = t9  I.N.C.R.E.A.S.E
Name = t8 No new state computed
Name = t10 No new state computed
Name = t3  I.N.C.R.E.A.S.E
Name = t2 No new state computed
Name = t13 No new state computed
Name = t7 No new state computed
increase = 1
**********************
Random choose
Name = t3  OK !
Now we have a representation of size = 311
Minimization in Progress
Name = t6  I.N.C.R.E.A.S.E
Name = t4  OK !
Now we have a representation of size = 310
Name = t7 No new state computed
Name = t5 No new state computed
Name = t12 No new state computed
Name = t1 No new state computed
Name = t13 No new state computed
Name = t3  I.N.C.R.E.A.S.E
Name = t10 No new state computed
Name = t14 No new state computed
Name = t2 No new state computed
Name = t8 No new state computed
Name = t11  OK !
Now we have a representation of size = 310
Name = t14 No new state computed
Name = t4 No new state computed
Name = t6  I.N.C.R.E.A.S.E
Name = t13 No new state computed
Name = t5 No new state computed
Name = t3  I.N.C.R.E.A.S.E
Name = t7 No new state computed
Name = t9  I.N.C.R.E.A.S.E
Name = t10 No new state computed
Name = t2 No new state computed
Name = t8 No new state computed
Name = t12  OK !
Now we have a representation of size = 307
Name = t6  I.N.C.R.E.A.S.E
Name = t2 No new state computed
Name = t4 No new state computed
Name = t9  I.N.C.R.E.A.S.E
Name = t13 No new state computed
Name = t10 No new state computed
Name = t14 No new state computed
Name = t8 No new state computed
Name = t7 No new state computed
Name = t3  I.N.C.R.E.A.S.E
Name = t1 No new state computed
Name = t11 No new state computed
Name = t5 No new state computed
increase = 1
**********************
Random choose
Name = t3  OK !
Now we have a representation of size = 309
Minimization in Progress
Name = t8 No new state computed
Name = t5 No new state computed
Name = t11 No new state computed
Name = t9  I.N.C.R.E.A.S.E
Name = t1 No new state computed
Name = t12 No new state computed
Name = t13 No new state computed
Name = t2 No new state computed
Name = t10 No new state computed
Name = t6  I.N.C.R.E.A.S.E
Name = t14 No new state computed
Name = t7 No new state computed
Name = t4 No new state computed
increase = 1
**********************
Random choose
Name = t6  OK !
Now we have a representation of size = 321
Minimization in Progress
Name = t9  I.N.C.R.E.A.S.E
Name = t3 No new state computed
Name = t14 No new state computed
Name = t11 No new state computed
Name = t7  I.N.C.R.E.A.S.E
Name = t8 No new state computed
Name = t5 No new state computed
Name = t1 No new state computed
Name = t4 No new state computed
Name = t2 No new state computed
Name = t12 No new state computed
Name = t13 No new state computed
Name = t10 No new state computed
increase = 1
**********************
Random choose
Name = t7  OK !
Now we have a representation of size = 333
Minimization in Progress
Name = t1 No new state computed
Name = t8 No new state computed
Name = t6 No new state computed
Name = t4  I.N.C.R.E.A.S.E
Name = t9  I.N.C.R.E.A.S.E
Name = t13 No new state computed
Name = t11  I.N.C.R.E.A.S.E
Name = t14 No new state computed
Name = t5 No new state computed
Name = t3 No new state computed
Name = t2  OK !
Now we have a representation of size = 333
Name = t8 No new state computed
Name = t1 No new state computed
Name = t6 No new state computed
Name = t9  I.N.C.R.E.A.S.E
Name = t13 No new state computed
Name = t10 No new state computed
Name = t7 No new state computed
Name = t4 No new state computed
Name = t12 No new state computed
Name = t14 No new state computed
Name = t5 No new state computed
Name = t11  I.N.C.R.E.A.S.E
Name = t3  OK !
Now we have a representation of size = 320
Name = t11  I.N.C.R.E.A.S.E
Name = t12 No new state computed
Name = t2  OK !
Now we have a representation of size = 315
Name = t14 No new state computed
Name = t9  I.N.C.R.E.A.S.E
Name = t13 No new state computed
Name = t4 No new state computed
Name = t7 No new state computed
Name = t6 No new state computed
Name = t8 No new state computed
Name = t1 No new state computed
Name = t10 No new state computed
Name = t5 No new state computed
Name = t3  OK !
Now we have a representation of size = 315
Name = t6 No new state computed
Name = t10 No new state computed
Name = t13 No new state computed
Name = t9  I.N.C.R.E.A.S.E
Name = t14 No new state computed
Name = t5 No new state computed
Name = t12 No new state computed
Name = t1 No new state computed
Name = t7 No new state computed
Name = t2 No new state computed
Name = t11  I.N.C.R.E.A.S.E
Name = t4 No new state computed
Name = t8 No new state computed
increase = 1
**********************
Random choose
Name = t11  OK !
Now we have a representation of size = 320
Minimization in Progress
Name = t8 No new state computed
Name = t2 No new state computed
Name = t3 No new state computed
Name = t1 No new state computed
Name = t9 No new state computed
Name = t12  I.N.C.R.E.A.S.E
Name = t13 No new state computed
Name = t10 No new state computed
Name = t5 No new state computed
Name = t7 No new state computed
Name = t4 No new state computed
Name = t14 No new state computed
Name = t6 No new state computed
increase = 1
**********************
Random choose
Name = t12  OK !
Now we have a representation of size = 323
Minimization in Progress
Name = t3 No new state computed
Name = t9 No new state computed
Name = t8 No new state computed
Name = t1 No new state computed
Name = t5 No new state computed
Name = t10 No new state computed
Name = t6 No new state computed
Name = t11 No new state computed
Name = t14 No new state computed
Name = t7 No new state computed
Name = t2 No new state computed
Name = t4 No new state computed
Name = t13  I.N.C.R.E.A.S.E
increase = 1
**********************
Random choose
Name = t13  OK !
Now we have a representation of size = 327
Minimization in Progress
Name = t1 No new state computed
Name = t8 No new state computed
Name = t5 No new state computed
Name = t14  I.N.C.R.E.A.S.E
Name = t9 No new state computed
Name = t10 No new state computed
Name = t2 No new state computed
Name = t7 No new state computed
Name = t12 No new state computed
Name = t11 No new state computed
Name = t6 No new state computed
Name = t4 No new state computed
Name = t3 No new state computed
increase = 1
**********************
Random choose
Name = t14  OK !
Now we have a representation of size = 342
Minimization in Progress
Name = t6 No new state computed
Name = t7 No new state computed
Name = t13 No new state computed
Name = t2  I.N.C.R.E.A.S.E
Name = t11 No new state computed
Name = t9  I.N.C.R.E.A.S.E
Name = t8 No new state computed
Name = t10 No new state computed
Name = t4  I.N.C.R.E.A.S.E
Name = t12 No new state computed
Name = t1 No new state computed
Name = t5 No new state computed
Name = t3 No new state computed
increase = 1
**********************
Random choose
Name = t4  OK !
Now we have a representation of size = 345
Minimization in Progress
Name = t14 No new state computed
Name = t10 No new state computed
Name = t11 No new state computed
Name = t7 No new state computed
Name = t1 No new state computed
Name = t9  I.N.C.R.E.A.S.E
Name = t2 No new state computed
Name = t3 No new state computed
Name = t8 No new state computed
Name = t5  I.N.C.R.E.A.S.E
Name = t12 No new state computed
Name = t13 No new state computed
Name = t6 No new state computed
increase = 1
**********************
Random choose
Name = t5  OK !
Now we have a representation of size = 347
Minimization in Progress
Name = t8 No new state computed
Name = t14 No new state computed
Name = t11 No new state computed
Name = t9  I.N.C.R.E.A.S.E
Name = t12 No new state computed
Name = t4 No new state computed
Name = t3 No new state computed
Name = t1 No new state computed
Name = t7 No new state computed
Name = t13 No new state computed
Name = t10 No new state computed
Name = t6 No new state computed
Name = t2 No new state computed
increase = 1
**********************
Random choose
Name = t9  OK !
Now we have a representation of size = 348
Minimization in Progress
Name = t7 No new state computed
Name = t14 No new state computed
Name = t13 No new state computed
Name = t2 No new state computed
Name = t1 No new state computed
Name = t11 No new state computed
Name = t8 No new state computed
Name = t12 No new state computed
Name = t3 No new state computed
Name = t4 No new state computed
Name = t6 No new state computed
Name = t10  I.N.C.R.E.A.S.E
Name = t5 No new state computed
increase = 1
**********************
Random choose
Name = t10  OK !
Now we have a representation of size = 353
Minimization in Progress
Name = t3 No new state computed
Name = t12 No new state computed
Name = t11 No new state computed
Name = t5 No new state computed
Name = t14 No new state computed
Name = t9 No new state computed
Name = t6 No new state computed
Name = t13 No new state computed
Name = t2  OK !
Now we have a representation of size = 353
Name = t4 No new state computed
Name = t11 No new state computed
Name = t9 No new state computed
Name = t3 No new state computed
Name = t13 No new state computed
Name = t6 No new state computed
Name = t1 No new state computed
Name = t5  OK !
Now we have a representation of size = 353
Name = t13 No new state computed
Name = t7 No new state computed
Name = t6 No new state computed
Name = t11 No new state computed
Name = t12 No new state computed
Name = t14 No new state computed
Name = t3 No new state computed
Name = t4 No new state computed
Name = t10 No new state computed
Name = t8 No new state computed
Name = t2 No new state computed
Name = t9 No new state computed
Name = t1 No new state computed
increase = 0
nb accelerations 46
Fix point FOUND
seed is : 2691
