current set encoding is : lash-msdf
seed is : 21768
cycles of length 1
(1/9), name = t1, size = 701
(2/9), name = t2, size = 665
(3/9), name = t3, size = 347
(4/9), name = t4, size = 347
(5/9), name = t5, size = 349
(6/9), name = t6, size = 359
(7/9), name = t7, size = 335
(8/9), name = t8, size = 385
(9/9), name = t9, size = 391
**********************
Random choose
Name = t2  OK !
Now we have a representation of size = 28
Minimization in Progress
Name = t3  I.N.C.R.E.A.S.E
Name = t4 No new state computed
Name = t7 No new state computed
Name = t8 No new state computed
Name = t9  I.N.C.R.E.A.S.E
Name = t1 No new state computed
Name = t6 No new state computed
Name = t5 No new state computed
increase = 1
**********************
Random choose
Name = t9  OK !
Now we have a representation of size = 33
Minimization in Progress
Name = t2 No new state computed
Name = t5 No new state computed
Name = t6 No new state computed
Name = t8 No new state computed
Name = t1 No new state computed
Name = t4  I.N.C.R.E.A.S.E
Name = t7  I.N.C.R.E.A.S.E
Name = t3  I.N.C.R.E.A.S.E
increase = 1
**********************
Random choose
Name = t3  OK !
Now we have a representation of size = 38
Minimization in Progress
Name = t5 No new state computed
Name = t9  OK !
Now we have a representation of size = 35
Name = t3 No new state computed
Name = t8 No new state computed
Name = t6 No new state computed
Name = t2 No new state computed
Name = t5 No new state computed
Name = t4  I.N.C.R.E.A.S.E
Name = t7  I.N.C.R.E.A.S.E
Name = t1 No new state computed
increase = 1
**********************
Random choose
Name = t7  OK !
Now we have a representation of size = 40
Minimization in Progress
Name = t6 No new state computed
Name = t2  I.N.C.R.E.A.S.E
Name = t5 No new state computed
Name = t4  I.N.C.R.E.A.S.E
Name = t9 No new state computed
Name = t3 No new state computed
Name = t1 No new state computed
Name = t8 No new state computed
increase = 1
**********************
Random choose
Name = t4  OK !
Now we have a representation of size = 42
Minimization in Progress
Name = t9 No new state computed
Name = t5  I.N.C.R.E.A.S.E
Name = t1  OK !
Now we have a representation of size = 42
Name = t8 No new state computed
Name = t5  OK !
Now we have a representation of size = 42
Name = t3 No new state computed
Name = t9 No new state computed
Name = t4 No new state computed
Name = t6 No new state computed
Name = t8 No new state computed
Name = t7 No new state computed
Name = t1 No new state computed
Name = t2  I.N.C.R.E.A.S.E
increase = 1
**********************
Random choose
Name = t2  OK !
Now we have a representation of size = 44
Minimization in Progress
Name = t3 No new state computed
Name = t5 No new state computed
Name = t1 No new state computed
Name = t4 No new state computed
Name = t9 No new state computed
Name = t7 No new state computed
Name = t6 No new state computed
Name = t8 No new state computed
increase = 0
nb accelerations 9
Fix point FOUND
seed is : 21768
