current set encoding is : lash-msdf
seed is : 21768
(1/9)->
(2/9)->
(3/9)->
(4/9)->
(5/9)->
(6/9)->
(7/9)->
(8/9)->
(9/9)->
Simplification of the linear system 
1 functions have the same action, it remains only 1
2 functions have the same action, it remains only 1
1 functions have the same action, it remains only 1
2 functions have the same action, it remains only 1
1 functions have the same action, it remains only 1
2 functions have the same action, it remains only 1
Number of actions before simplification : 9
Number of actions after simplification  : 6
cycles of length 2
(1/6), name = +f3, size = 245
(2/6), name = (+f3.f1+f1.f3), size = 181
(3/6), name = +f1, size = 187
(4/6), name = (+f3.f2+f2.f3), size = 274
(5/6), name = +f2, size = 277
(6/6), name = (+f2.f1+f1.f2), size = 169
**********************
Random choose
Name = (+f3.f1+f1.f3)  OK !
Now we have a representation of size = 43
Minimization in Progress
Name = (+f2.f1+f1.f2)  I.N.C.R.E.A.S.E
Name = +f1  I.N.C.R.E.A.S.E
Name = +f2  I.N.C.R.E.A.S.E
Name = +f3  I.N.C.R.E.A.S.E
Name = (+f3.f2+f2.f3)  I.N.C.R.E.A.S.E
increase = 1
**********************
Random choose
Name = (+f3.f2+f2.f3)  OK !
Now we have a representation of size = 192
Minimization in Progress
Name = +f3  I.N.C.R.E.A.S.E
Name = +f1  I.N.C.R.E.A.S.E
Name = +f2  I.N.C.R.E.A.S.E
Name = (+f2.f1+f1.f2)  I.N.C.R.E.A.S.E
Name = (+f3.f1+f1.f3) No new state computed
increase = 1
**********************
Random choose
Name = (+f2.f1+f1.f2)  OK !
Now we have a representation of size = 1080
Minimization in Progress
Name = +f2  I.N.C.R.E.A.S.E
Name = (+f3.f1+f1.f3) No new state computed
Name = +f3  I.N.C.R.E.A.S.E
Name = +f1  OK !
Now we have a representation of size = 886
Name = (+f3.f2+f2.f3)  OK !
Now we have a representation of size = 753
Name = +f3  I.N.C.R.E.A.S.E
Name = +f1 No new state computed
Name = (+f3.f1+f1.f3) No new state computed
Name = +f2  I.N.C.R.E.A.S.E
Name = (+f2.f1+f1.f2) No new state computed
increase = 1
**********************
Random choose
Name = +f2  OK !
Now we have a representation of size = 914
Minimization in Progress
Name = (+f2.f1+f1.f2) No new state computed
Name = (+f3.f1+f1.f3) No new state computed
Name = (+f3.f2+f2.f3) No new state computed
Name = +f1 No new state computed
Name = +f3  OK !
Now we have a representation of size = 808
Name = (+f3.f2+f2.f3) No new state computed
Name = +f1 No new state computed
Name = (+f2.f1+f1.f2) No new state computed
Name = (+f3.f1+f1.f3) No new state computed
Name = +f2 No new state computed
increase = 0
nb accelerations 7
Fix point FOUND
seed is : 21768
