current set encoding is : lash-msdf
seed is : 21768
cycles of length 1
(1/5), name = t1, size = 436
(2/5), name = t2, size = 190
(3/5), name = t3, size = 190
(4/5), name = t4, size = 221
(5/5), name = t5, size = 225
**********************
Random choose
Name = t1  OK !
Now we have a representation of size = 23
Minimization in Progress
Name = t2 No new state computed
Name = t4 No new state computed
Name = t3 No new state computed
Name = t5  OK !
Now we have a representation of size = 23
Name = t2 No new state computed
Name = t1 No new state computed
Name = t4 No new state computed
Name = t3 No new state computed
increase = 0
nb accelerations 2
Fix point FOUND
seed is : 21768
