current set encoding is : lira
seed is : 3284
cycles of length 1
(1/8), name = r1, size = 8
(2/8), name = r2, size = 17
(3/8), name = r3, size = 15
(4/8), name = r4, size = 9
(5/8), name = r5, size = 8
(6/8), name = r6, size = 8
(7/8), name = r7, size = 17
(8/8), name = r8, size = 15
**********************
Random choose
Name = r4  No new state computed
Name = r8  No new state computed
Name = r6  OK !
Now we have a representation of size = 7
Minimization in Progress
Name = r2  I.N.C.R.E.A.S.E
Name = r5 No new state computed
Name = r1  OK !
Now we have a representation of size = 7
Name = r8  I.N.C.R.E.A.S.E
Name = r2  I.N.C.R.E.A.S.E
Name = r4 No new state computed
Name = r7  I.N.C.R.E.A.S.E
Name = r5 No new state computed
Name = r3  I.N.C.R.E.A.S.E
Name = r6 No new state computed
increase = 1
**********************
Random choose
Name = r3  OK !
Now we have a representation of size = 9
Minimization in Progress
Name = r1 No new state computed
Name = r8 No new state computed
Name = r6 No new state computed
Name = r2 No new state computed
Name = r5 No new state computed
Name = r4 No new state computed
Name = r7 No new state computed
increase = 0
nb accelerations 3
Fix point FOUND
seed is : 3284
