current set encoding is : lash-msdf
seed is : 3284
cycles of length 1
(1/14), name = t1, size = 318
(2/14), name = t2, size = 1504
(3/14), name = t3, size = 2814
(4/14), name = t4, size = 1456
(5/14), name = t5, size = 746
(6/14), name = t6, size = 1028
(7/14), name = t7, size = 1456
(8/14), name = t8, size = 318
(9/14), name = t9, size = 1252
(10/14), name = t10, size = 2310
(11/14), name = t11, size = 1204
(12/14), name = t12, size = 750
(13/14), name = t13, size = 1028
(14/14), name = t14, size = 1204
**********************
Random choose
Name = t6  No new state computed
Name = t7  No new state computed
Name = t11  No new state computed
Name = t3  No new state computed
Name = t9  No new state computed
Name = t2  No new state computed
Name = t1  OK !
Now we have a representation of size = 78
Minimization in Progress
Name = t5 No new state computed
Name = t9 No new state computed
Name = t14 No new state computed
Name = t11 No new state computed
Name = t2  I.N.C.R.E.A.S.E
Name = t8  I.N.C.R.E.A.S.E
Name = t10 No new state computed
Name = t3 No new state computed
Name = t6 No new state computed
Name = t12 No new state computed
Name = t13 No new state computed
Name = t4 No new state computed
Name = t7 No new state computed
increase = 1
**********************
Random choose
Name = t8  OK !
Now we have a representation of size = 99
Minimization in Progress
Name = t9  I.N.C.R.E.A.S.E
Name = t5 No new state computed
Name = t3 No new state computed
Name = t4 No new state computed
Name = t13 No new state computed
Name = t7 No new state computed
Name = t14 No new state computed
Name = t1 No new state computed
Name = t10 No new state computed
Name = t6 No new state computed
Name = t12 No new state computed
Name = t11 No new state computed
Name = t2  I.N.C.R.E.A.S.E
increase = 1
**********************
Random choose
Name = t2  OK !
Now we have a representation of size = 122
Minimization in Progress
Name = t1 No new state computed
Name = t4 No new state computed
Name = t7 No new state computed
Name = t14 No new state computed
Name = t12 No new state computed
Name = t8 No new state computed
Name = t11 No new state computed
Name = t3  I.N.C.R.E.A.S.E
Name = t5 No new state computed
Name = t13 No new state computed
Name = t9  I.N.C.R.E.A.S.E
Name = t10 No new state computed
Name = t6 No new state computed
increase = 1
**********************
Random choose
Name = t9  OK !
Now we have a representation of size = 124
Minimization in Progress
Name = t10 No new state computed
Name = t5 No new state computed
Name = t12  I.N.C.R.E.A.S.E
Name = t11 No new state computed
Name = t13 No new state computed
Name = t1 No new state computed
Name = t6 No new state computed
Name = t4 No new state computed
Name = t3  I.N.C.R.E.A.S.E
Name = t14 No new state computed
Name = t2 No new state computed
Name = t8 No new state computed
Name = t7 No new state computed
increase = 1
**********************
Random choose
Name = t3  OK !
Now we have a representation of size = 130
Minimization in Progress
Name = t2  I.N.C.R.E.A.S.E
Name = t7 No new state computed
Name = t11 No new state computed
Name = t13 No new state computed
Name = t14 No new state computed
Name = t8 No new state computed
Name = t4 No new state computed
Name = t6 No new state computed
Name = t1 No new state computed
Name = t12  I.N.C.R.E.A.S.E
Name = t9  OK !
Now we have a representation of size = 125
Name = t1 No new state computed
Name = t2  I.N.C.R.E.A.S.E
Name = t14 No new state computed
Name = t13 No new state computed
Name = t4 No new state computed
Name = t6 No new state computed
Name = t5 No new state computed
Name = t10 No new state computed
Name = t8 No new state computed
Name = t11 No new state computed
Name = t12  I.N.C.R.E.A.S.E
Name = t3 No new state computed
Name = t7 No new state computed
increase = 1
**********************
Random choose
Name = t12  OK !
Now we have a representation of size = 131
Minimization in Progress
Name = t5 No new state computed
Name = t3 No new state computed
Name = t6 No new state computed
Name = t2  I.N.C.R.E.A.S.E
Name = t7 No new state computed
Name = t9 No new state computed
Name = t8 No new state computed
Name = t13  I.N.C.R.E.A.S.E
Name = t10 No new state computed
Name = t4 No new state computed
Name = t14 No new state computed
Name = t11 No new state computed
Name = t1 No new state computed
increase = 1
**********************
Random choose
Name = t13  OK !
Now we have a representation of size = 151
Minimization in Progress
Name = t5 No new state computed
Name = t7 No new state computed
Name = t10 No new state computed
Name = t2  I.N.C.R.E.A.S.E
Name = t4 No new state computed
Name = t12 No new state computed
Name = t3 No new state computed
Name = t1 No new state computed
Name = t14  I.N.C.R.E.A.S.E
Name = t8 No new state computed
Name = t9 No new state computed
Name = t11 No new state computed
Name = t6 No new state computed
increase = 1
**********************
Random choose
Name = t14  OK !
Now we have a representation of size = 203
Minimization in Progress
Name = t12 No new state computed
Name = t6 No new state computed
Name = t13 No new state computed
Name = t5 No new state computed
Name = t10 No new state computed
Name = t7 No new state computed
Name = t9  I.N.C.R.E.A.S.E
Name = t1 No new state computed
Name = t8 No new state computed
Name = t2  I.N.C.R.E.A.S.E
Name = t3 No new state computed
Name = t4  I.N.C.R.E.A.S.E
Name = t11 No new state computed
increase = 1
**********************
Random choose
Name = t4  OK !
Now we have a representation of size = 215
Minimization in Progress
Name = t14 No new state computed
Name = t8 No new state computed
Name = t1 No new state computed
Name = t10 No new state computed
Name = t13 No new state computed
Name = t9  I.N.C.R.E.A.S.E
Name = t12 No new state computed
Name = t2  I.N.C.R.E.A.S.E
Name = t3 No new state computed
Name = t7 No new state computed
Name = t11 No new state computed
Name = t6 No new state computed
Name = t5  I.N.C.R.E.A.S.E
increase = 1
**********************
Random choose
Name = t5  OK !
Now we have a representation of size = 219
Minimization in Progress
Name = t1 No new state computed
Name = t8 No new state computed
Name = t9  I.N.C.R.E.A.S.E
Name = t6  I.N.C.R.E.A.S.E
Name = t14 No new state computed
Name = t10 No new state computed
Name = t13 No new state computed
Name = t7 No new state computed
Name = t12 No new state computed
Name = t3 No new state computed
Name = t4 No new state computed
Name = t2  I.N.C.R.E.A.S.E
Name = t11 No new state computed
increase = 1
**********************
Random choose
Name = t2  OK !
Now we have a representation of size = 240
Minimization in Progress
Name = t11 No new state computed
Name = t3  I.N.C.R.E.A.S.E
Name = t6  I.N.C.R.E.A.S.E
Name = t7 No new state computed
Name = t4 No new state computed
Name = t13 No new state computed
Name = t14 No new state computed
Name = t12 No new state computed
Name = t9  OK !
Now we have a representation of size = 240
Name = t14 No new state computed
Name = t11 No new state computed
Name = t3  I.N.C.R.E.A.S.E
Name = t10  OK !
Now we have a representation of size = 240
Name = t7 No new state computed
Name = t1 No new state computed
Name = t12 No new state computed
Name = t4  I.N.C.R.E.A.S.E
Name = t11 No new state computed
Name = t2  I.N.C.R.E.A.S.E
Name = t9  I.N.C.R.E.A.S.E
Name = t5  I.N.C.R.E.A.S.E
Name = t14 No new state computed
Name = t3  I.N.C.R.E.A.S.E
Name = t8 No new state computed
Name = t6  I.N.C.R.E.A.S.E
Name = t13 No new state computed
increase = 1
**********************
Random choose
Name = t6  OK !
Now we have a representation of size = 241
Minimization in Progress
Name = t8 No new state computed
Name = t5  I.N.C.R.E.A.S.E
Name = t12 No new state computed
Name = t11 No new state computed
Name = t9  I.N.C.R.E.A.S.E
Name = t2  I.N.C.R.E.A.S.E
Name = t10 No new state computed
Name = t3  I.N.C.R.E.A.S.E
Name = t7 No new state computed
Name = t1 No new state computed
Name = t4  I.N.C.R.E.A.S.E
Name = t14 No new state computed
Name = t13 No new state computed
increase = 1
**********************
Random choose
Name = t4  OK !
Now we have a representation of size = 244
Minimization in Progress
Name = t12 No new state computed
Name = t10 No new state computed
Name = t5  I.N.C.R.E.A.S.E
Name = t1 No new state computed
Name = t7 No new state computed
Name = t8 No new state computed
Name = t13 No new state computed
Name = t11 No new state computed
Name = t2  OK !
Now we have a representation of size = 244
Name = t3  I.N.C.R.E.A.S.E
Name = t12 No new state computed
Name = t4 No new state computed
Name = t10 No new state computed
Name = t6 No new state computed
Name = t7 No new state computed
Name = t13 No new state computed
Name = t8 No new state computed
Name = t9  I.N.C.R.E.A.S.E
Name = t11 No new state computed
Name = t5  I.N.C.R.E.A.S.E
Name = t14 No new state computed
Name = t1 No new state computed
increase = 1
**********************
Random choose
Name = t5  OK !
Now we have a representation of size = 254
Minimization in Progress
Name = t10 No new state computed
Name = t1 No new state computed
Name = t12 No new state computed
Name = t2 No new state computed
Name = t8 No new state computed
Name = t11 No new state computed
Name = t3  I.N.C.R.E.A.S.E
Name = t6  I.N.C.R.E.A.S.E
Name = t7 No new state computed
Name = t9  I.N.C.R.E.A.S.E
Name = t14 No new state computed
Name = t13 No new state computed
Name = t4 No new state computed
increase = 1
**********************
Random choose
Name = t9  OK !
Now we have a representation of size = 255
Minimization in Progress
Name = t7 No new state computed
Name = t11 No new state computed
Name = t5 No new state computed
Name = t3  I.N.C.R.E.A.S.E
Name = t2 No new state computed
Name = t12 No new state computed
Name = t14 No new state computed
Name = t10  I.N.C.R.E.A.S.E
Name = t6  I.N.C.R.E.A.S.E
Name = t4 No new state computed
Name = t13 No new state computed
Name = t8 No new state computed
Name = t1 No new state computed
increase = 1
**********************
Random choose
Name = t6  OK !
Now we have a representation of size = 261
Minimization in Progress
Name = t11 No new state computed
Name = t10  I.N.C.R.E.A.S.E
Name = t13 No new state computed
Name = t7  I.N.C.R.E.A.S.E
Name = t2 No new state computed
Name = t5 No new state computed
Name = t8 No new state computed
Name = t9 No new state computed
Name = t4 No new state computed
Name = t3  I.N.C.R.E.A.S.E
Name = t1 No new state computed
Name = t12 No new state computed
Name = t14 No new state computed
increase = 1
**********************
Random choose
Name = t3  OK !
Now we have a representation of size = 285
Minimization in Progress
Name = t11 No new state computed
Name = t4 No new state computed
Name = t12 No new state computed
Name = t9  I.N.C.R.E.A.S.E
Name = t5 No new state computed
Name = t7  I.N.C.R.E.A.S.E
Name = t6 No new state computed
Name = t8 No new state computed
Name = t1 No new state computed
Name = t13 No new state computed
Name = t2 No new state computed
Name = t10  I.N.C.R.E.A.S.E
Name = t14 No new state computed
increase = 1
**********************
Random choose
Name = t10  OK !
Now we have a representation of size = 314
Minimization in Progress
Name = t13 No new state computed
Name = t2  I.N.C.R.E.A.S.E
Name = t9  I.N.C.R.E.A.S.E
Name = t8 No new state computed
Name = t3 No new state computed
Name = t5 No new state computed
Name = t4  I.N.C.R.E.A.S.E
Name = t12 No new state computed
Name = t6 No new state computed
Name = t11 No new state computed
Name = t7  I.N.C.R.E.A.S.E
Name = t14 No new state computed
Name = t1 No new state computed
increase = 1
**********************
Random choose
Name = t7  OK !
Now we have a representation of size = 355
Minimization in Progress
Name = t9  I.N.C.R.E.A.S.E
Name = t14 No new state computed
Name = t2  I.N.C.R.E.A.S.E
Name = t8 No new state computed
Name = t1 No new state computed
Name = t10 No new state computed
Name = t13 No new state computed
Name = t3 No new state computed
Name = t5 No new state computed
Name = t6 No new state computed
Name = t12 No new state computed
Name = t11  OK !
Now we have a representation of size = 355
Name = t7 No new state computed
Name = t4  I.N.C.R.E.A.S.E
Name = t6 No new state computed
Name = t10 No new state computed
Name = t5 No new state computed
Name = t8 No new state computed
Name = t13 No new state computed
Name = t12  OK !
Now we have a representation of size = 347
Name = t10 No new state computed
Name = t8 No new state computed
Name = t11 No new state computed
Name = t3 No new state computed
Name = t2  I.N.C.R.E.A.S.E
Name = t9  I.N.C.R.E.A.S.E
Name = t4  I.N.C.R.E.A.S.E
Name = t6 No new state computed
Name = t1 No new state computed
Name = t14 No new state computed
Name = t13 No new state computed
Name = t7 No new state computed
Name = t5 No new state computed
increase = 1
**********************
Random choose
Name = t4  OK !
Now we have a representation of size = 358
Minimization in Progress
Name = t12 No new state computed
Name = t5  I.N.C.R.E.A.S.E
Name = t1 No new state computed
Name = t9  I.N.C.R.E.A.S.E
Name = t14 No new state computed
Name = t10 No new state computed
Name = t13 No new state computed
Name = t6 No new state computed
Name = t8 No new state computed
Name = t2  OK !
Now we have a representation of size = 349
Name = t6 No new state computed
Name = t12 No new state computed
Name = t9  I.N.C.R.E.A.S.E
Name = t4 No new state computed
Name = t5  I.N.C.R.E.A.S.E
Name = t13 No new state computed
Name = t14 No new state computed
Name = t1 No new state computed
Name = t7 No new state computed
Name = t10 No new state computed
Name = t8 No new state computed
Name = t11 No new state computed
Name = t3  I.N.C.R.E.A.S.E
increase = 1
**********************
Random choose
Name = t3  OK !
Now we have a representation of size = 358
Minimization in Progress
Name = t14 No new state computed
Name = t13 No new state computed
Name = t10 No new state computed
Name = t12 No new state computed
Name = t6 No new state computed
Name = t9  I.N.C.R.E.A.S.E
Name = t8 No new state computed
Name = t4  OK !
Now we have a representation of size = 356
Name = t8 No new state computed
Name = t3  OK !
Now we have a representation of size = 352
Name = t10 No new state computed
Name = t6 No new state computed
Name = t7 No new state computed
Name = t2 No new state computed
Name = t13 No new state computed
Name = t4 No new state computed
Name = t12 No new state computed
Name = t14 No new state computed
Name = t5  I.N.C.R.E.A.S.E
Name = t8 No new state computed
Name = t1 No new state computed
Name = t11  OK !
Now we have a representation of size = 352
Name = t3 No new state computed
Name = t10 No new state computed
Name = t5  I.N.C.R.E.A.S.E
Name = t4 No new state computed
Name = t2 No new state computed
Name = t9  I.N.C.R.E.A.S.E
Name = t13 No new state computed
Name = t14 No new state computed
Name = t8 No new state computed
Name = t7 No new state computed
Name = t12  OK !
Now we have a representation of size = 343
Name = t2 No new state computed
Name = t9  I.N.C.R.E.A.S.E
Name = t8 No new state computed
Name = t14 No new state computed
Name = t5  I.N.C.R.E.A.S.E
Name = t3 No new state computed
Name = t11 No new state computed
Name = t10 No new state computed
Name = t6 No new state computed
Name = t4 No new state computed
Name = t1 No new state computed
Name = t7 No new state computed
Name = t13  I.N.C.R.E.A.S.E
increase = 1
**********************
Random choose
Name = t13  OK !
Now we have a representation of size = 367
Minimization in Progress
Name = t10 No new state computed
Name = t1 No new state computed
Name = t4 No new state computed
Name = t7 No new state computed
Name = t8 No new state computed
Name = t11 No new state computed
Name = t6 No new state computed
Name = t12 No new state computed
Name = t2 No new state computed
Name = t14  I.N.C.R.E.A.S.E
Name = t9  I.N.C.R.E.A.S.E
Name = t3 No new state computed
Name = t5  I.N.C.R.E.A.S.E
increase = 1
**********************
Random choose
Name = t5  OK !
Now we have a representation of size = 370
Minimization in Progress
Name = t9  I.N.C.R.E.A.S.E
Name = t3 No new state computed
Name = t8 No new state computed
Name = t2 No new state computed
Name = t10 No new state computed
Name = t7 No new state computed
Name = t11 No new state computed
Name = t6  I.N.C.R.E.A.S.E
Name = t4 No new state computed
Name = t13 No new state computed
Name = t1 No new state computed
Name = t14  I.N.C.R.E.A.S.E
Name = t12 No new state computed
increase = 1
**********************
Random choose
Name = t14  OK !
Now we have a representation of size = 372
Minimization in Progress
Name = t2 No new state computed
Name = t10 No new state computed
Name = t6  I.N.C.R.E.A.S.E
Name = t4 No new state computed
Name = t7 No new state computed
Name = t13 No new state computed
Name = t3 No new state computed
Name = t1 No new state computed
Name = t5 No new state computed
Name = t11 No new state computed
Name = t8 No new state computed
Name = t9  I.N.C.R.E.A.S.E
Name = t12 No new state computed
increase = 1
**********************
Random choose
Name = t9  OK !
Now we have a representation of size = 374
Minimization in Progress
Name = t10  OK !
Now we have a representation of size = 371
Name = t11 No new state computed
Name = t6  I.N.C.R.E.A.S.E
Name = t2 No new state computed
Name = t13 No new state computed
Name = t14 No new state computed
Name = t3 No new state computed
Name = t12  I.N.C.R.E.A.S.E
Name = t9  OK !
Now we have a representation of size = 367
Name = t8 No new state computed
Name = t13 No new state computed
Name = t3 No new state computed
Name = t5 No new state computed
Name = t11 No new state computed
Name = t6  I.N.C.R.E.A.S.E
Name = t4 No new state computed
Name = t2 No new state computed
Name = t10  OK !
Now we have a representation of size = 367
Name = t9 No new state computed
Name = t1 No new state computed
Name = t4 No new state computed
Name = t14 No new state computed
Name = t8 No new state computed
Name = t11 No new state computed
Name = t3 No new state computed
Name = t6  I.N.C.R.E.A.S.E
Name = t2 No new state computed
Name = t5 No new state computed
Name = t13 No new state computed
Name = t7 No new state computed
Name = t12  I.N.C.R.E.A.S.E
increase = 1
**********************
Random choose
Name = t12  OK !
Now we have a representation of size = 369
Minimization in Progress
Name = t2 No new state computed
Name = t9 No new state computed
Name = t13  I.N.C.R.E.A.S.E
Name = t3 No new state computed
Name = t8 No new state computed
Name = t10 No new state computed
Name = t5 No new state computed
Name = t7 No new state computed
Name = t4 No new state computed
Name = t1 No new state computed
Name = t11 No new state computed
Name = t14 No new state computed
Name = t6  I.N.C.R.E.A.S.E
increase = 1
**********************
Random choose
Name = t6  OK !
Now we have a representation of size = 387
Minimization in Progress
Name = t9 No new state computed
Name = t14 No new state computed
Name = t2 No new state computed
Name = t10 No new state computed
Name = t3 No new state computed
Name = t7  I.N.C.R.E.A.S.E
Name = t8 No new state computed
Name = t4 No new state computed
Name = t5 No new state computed
Name = t12 No new state computed
Name = t1 No new state computed
Name = t13  I.N.C.R.E.A.S.E
Name = t11 No new state computed
increase = 1
**********************
Random choose
Name = t13  OK !
Now we have a representation of size = 392
Minimization in Progress
Name = t5 No new state computed
Name = t8 No new state computed
Name = t1 No new state computed
Name = t3 No new state computed
Name = t10 No new state computed
Name = t2 No new state computed
Name = t7  I.N.C.R.E.A.S.E
Name = t9 No new state computed
Name = t6 No new state computed
Name = t4 No new state computed
Name = t14  I.N.C.R.E.A.S.E
Name = t11 No new state computed
Name = t12 No new state computed
increase = 1
**********************
Random choose
Name = t14  OK !
Now we have a representation of size = 398
Minimization in Progress
Name = t5 No new state computed
Name = t4  I.N.C.R.E.A.S.E
Name = t10 No new state computed
Name = t2  I.N.C.R.E.A.S.E
Name = t9  I.N.C.R.E.A.S.E
Name = t13 No new state computed
Name = t8 No new state computed
Name = t1 No new state computed
Name = t3 No new state computed
Name = t12 No new state computed
Name = t7  I.N.C.R.E.A.S.E
Name = t6 No new state computed
Name = t11 No new state computed
increase = 1
**********************
Random choose
Name = t7  OK !
Now we have a representation of size = 401
Minimization in Progress
Name = t9  I.N.C.R.E.A.S.E
Name = t3 No new state computed
Name = t6 No new state computed
Name = t13 No new state computed
Name = t8 No new state computed
Name = t14 No new state computed
Name = t4  I.N.C.R.E.A.S.E
Name = t11 No new state computed
Name = t1 No new state computed
Name = t10 No new state computed
Name = t5 No new state computed
Name = t2  I.N.C.R.E.A.S.E
Name = t12 No new state computed
increase = 1
**********************
Random choose
Name = t2  OK !
Now we have a representation of size = 406
Minimization in Progress
Name = t9  I.N.C.R.E.A.S.E
Name = t10 No new state computed
Name = t12 No new state computed
Name = t8 No new state computed
Name = t3  OK !
Now we have a representation of size = 406
Name = t14 No new state computed
Name = t1 No new state computed
Name = t2  OK !
Now we have a representation of size = 406
Name = t5  I.N.C.R.E.A.S.E
Name = t12 No new state computed
Name = t8 No new state computed
Name = t10 No new state computed
Name = t9  I.N.C.R.E.A.S.E
Name = t1 No new state computed
Name = t6 No new state computed
Name = t7 No new state computed
Name = t3  OK !
Now we have a representation of size = 406
Name = t4 No new state computed
Name = t7 No new state computed
Name = t12 No new state computed
Name = t8 No new state computed
Name = t13 No new state computed
Name = t5  I.N.C.R.E.A.S.E
Name = t9  I.N.C.R.E.A.S.E
Name = t10 No new state computed
Name = t14 No new state computed
Name = t6 No new state computed
Name = t2 No new state computed
Name = t11 No new state computed
Name = t1 No new state computed
increase = 1
**********************
Random choose
Name = t9  OK !
Now we have a representation of size = 408
Minimization in Progress
Name = t10  I.N.C.R.E.A.S.E
Name = t3 No new state computed
Name = t5  I.N.C.R.E.A.S.E
Name = t7 No new state computed
Name = t14 No new state computed
Name = t6 No new state computed
Name = t13 No new state computed
Name = t8 No new state computed
Name = t4 No new state computed
Name = t1 No new state computed
Name = t12 No new state computed
Name = t11 No new state computed
Name = t2 No new state computed
increase = 1
**********************
Random choose
Name = t5  OK !
Now we have a representation of size = 410
Minimization in Progress
Name = t12 No new state computed
Name = t6 No new state computed
Name = t1 No new state computed
Name = t8 No new state computed
Name = t9 No new state computed
Name = t2 No new state computed
Name = t10  I.N.C.R.E.A.S.E
Name = t4 No new state computed
Name = t14 No new state computed
Name = t3 No new state computed
Name = t11 No new state computed
Name = t7 No new state computed
Name = t13 No new state computed
increase = 1
**********************
Random choose
Name = t10  OK !
Now we have a representation of size = 411
Minimization in Progress
Name = t7 No new state computed
Name = t2  I.N.C.R.E.A.S.E
Name = t1 No new state computed
Name = t12 No new state computed
Name = t13 No new state computed
Name = t9 No new state computed
Name = t3 No new state computed
Name = t11 No new state computed
Name = t8 No new state computed
Name = t14 No new state computed
Name = t5 No new state computed
Name = t6 No new state computed
Name = t4  I.N.C.R.E.A.S.E
increase = 1
**********************
Random choose
Name = t4  OK !
Now we have a representation of size = 413
Minimization in Progress
Name = t7 No new state computed
Name = t8 No new state computed
Name = t3 No new state computed
Name = t10 No new state computed
Name = t12 No new state computed
Name = t1 No new state computed
Name = t11 No new state computed
Name = t5  I.N.C.R.E.A.S.E
Name = t6 No new state computed
Name = t2 No new state computed
Name = t9 No new state computed
Name = t13 No new state computed
Name = t14 No new state computed
increase = 1
**********************
Random choose
Name = t5  OK !
Now we have a representation of size = 415
Minimization in Progress
Name = t1 No new state computed
Name = t10 No new state computed
Name = t11 No new state computed
Name = t6 No new state computed
Name = t2 No new state computed
Name = t4 No new state computed
Name = t14 No new state computed
Name = t9 No new state computed
Name = t3 No new state computed
Name = t12 No new state computed
Name = t13 No new state computed
Name = t8 No new state computed
Name = t7 No new state computed
increase = 0
nb accelerations 53
Fix point FOUND
seed is : 3284
