current set encoding is : prestaf
seed is : 3284
cycles of length 1
(1/9), name = t1, size = 681
(2/9), name = t2, size = 645
(3/9), name = t3, size = 361
(4/9), name = t4, size = 361
(5/9), name = t5, size = 329
(6/9), name = t6, size = 373
(7/9), name = t7, size = 349
(8/9), name = t8, size = 383
(9/9), name = t9, size = 377
**********************
Random choose
Name = t4  No new state computed
Name = t5  No new state computed
Name = t7  No new state computed
Name = t2  OK !
Now we have a representation of size = 16
Minimization in Progress
Name = t7 No new state computed
Name = t9  OK !
Now we have a representation of size = 16
Name = t1 No new state computed
Name = t3  I.N.C.R.E.A.S.E
Name = t5 No new state computed
Name = t8 No new state computed
Name = t6 No new state computed
Name = t4  I.N.C.R.E.A.S.E
Name = t2 No new state computed
Name = t7  I.N.C.R.E.A.S.E
increase = 1
**********************
Random choose
Name = t7  OK !
Now we have a representation of size = 20
Minimization in Progress
Name = t4  I.N.C.R.E.A.S.E
Name = t8 No new state computed
Name = t3  I.N.C.R.E.A.S.E
Name = t5 No new state computed
Name = t6 No new state computed
Name = t1 No new state computed
Name = t2  OK !
Now we have a representation of size = 19
Name = t4  I.N.C.R.E.A.S.E
Name = t9 No new state computed
Name = t7 No new state computed
Name = t5 No new state computed
Name = t8 No new state computed
Name = t3  I.N.C.R.E.A.S.E
Name = t1 No new state computed
Name = t6 No new state computed
increase = 1
**********************
Random choose
Name = t3  OK !
Now we have a representation of size = 24
Minimization in Progress
Name = t2 No new state computed
Name = t1 No new state computed
Name = t7 No new state computed
Name = t4  I.N.C.R.E.A.S.E
Name = t6 No new state computed
Name = t5 No new state computed
Name = t8 No new state computed
Name = t9  OK !
Now we have a representation of size = 24
Name = t3 No new state computed
Name = t7 No new state computed
Name = t6 No new state computed
Name = t2 No new state computed
Name = t4  I.N.C.R.E.A.S.E
Name = t1 No new state computed
Name = t8 No new state computed
Name = t5 No new state computed
increase = 1
**********************
Random choose
Name = t4  OK !
Now we have a representation of size = 27
Minimization in Progress
Name = t5  I.N.C.R.E.A.S.E
Name = t6 No new state computed
Name = t3 No new state computed
Name = t7 No new state computed
Name = t2 No new state computed
Name = t9 No new state computed
Name = t1  OK !
Now we have a representation of size = 25
Name = t7 No new state computed
Name = t5  OK !
Now we have a representation of size = 25
Name = t4 No new state computed
Name = t6 No new state computed
Name = t3 No new state computed
Name = t2 No new state computed
Name = t8 No new state computed
Name = t1 No new state computed
Name = t9 No new state computed
Name = t7 No new state computed
increase = 0
nb accelerations 9
Fix point FOUND
seed is : 3284
