current set encoding is : mona
seed is : 2691
cycles of length 1
(1/9), name = t1, size = 83
(2/9), name = t2, size = 122
(3/9), name = t3, size = 123
(4/9), name = t4, size = 89
(5/9), name = t5, size = 131
(6/9), name = t6, size = 129
(7/9), name = t7, size = 95
(8/9), name = t8, size = 140
(9/9), name = t9, size = 135
**********************
Random choose
Name = t4  OK !
Now we have a representation of size = 30
Minimization in Progress
Name = t1  I.N.C.R.E.A.S.E
Name = t3 No new state computed
Name = t6 No new state computed
Name = t7  I.N.C.R.E.A.S.E
Name = t5  I.N.C.R.E.A.S.E
Name = t9 No new state computed
Name = t2 No new state computed
Name = t8 No new state computed
increase = 1
**********************
Random choose
Name = t5  OK !
Now we have a representation of size = 44
Minimization in Progress
Name = t3 No new state computed
Name = t4 No new state computed
Name = t1  I.N.C.R.E.A.S.E
Name = t9 No new state computed
Name = t2 No new state computed
Name = t7  I.N.C.R.E.A.S.E
Name = t6 No new state computed
Name = t8 No new state computed
increase = 1
**********************
Random choose
Name = t7  OK !
Now we have a representation of size = 113
Minimization in Progress
Name = t6 No new state computed
Name = t1  I.N.C.R.E.A.S.E
Name = t4  I.N.C.R.E.A.S.E
Name = t8  I.N.C.R.E.A.S.E
Name = t2 No new state computed
Name = t3 No new state computed
Name = t5 No new state computed
Name = t9 No new state computed
increase = 1
**********************
Random choose
Name = t8  OK !
Now we have a representation of size = 135
Minimization in Progress
Name = t9 No new state computed
Name = t4  I.N.C.R.E.A.S.E
Name = t7 No new state computed
Name = t6 No new state computed
Name = t3 No new state computed
Name = t1  I.N.C.R.E.A.S.E
Name = t5 No new state computed
Name = t2 No new state computed
increase = 1
**********************
Random choose
Name = t1  OK !
Now we have a representation of size = 346
Minimization in Progress
Name = t5 No new state computed
Name = t7  I.N.C.R.E.A.S.E
Name = t9 No new state computed
Name = t2  I.N.C.R.E.A.S.E
Name = t4  I.N.C.R.E.A.S.E
Name = t3 No new state computed
Name = t6 No new state computed
Name = t8 No new state computed
increase = 1
**********************
Random choose
Name = t4  OK !
Now we have a representation of size = 445
Minimization in Progress
Name = t9 No new state computed
Name = t8 No new state computed
Name = t2  I.N.C.R.E.A.S.E
Name = t7  I.N.C.R.E.A.S.E
Name = t5 No new state computed
Name = t6 No new state computed
Name = t1  I.N.C.R.E.A.S.E
Name = t3 No new state computed
increase = 1
**********************
Random choose
Name = t1  OK !
Now we have a representation of size = 454
Minimization in Progress
Name = t6 No new state computed
Name = t7  I.N.C.R.E.A.S.E
Name = t2  I.N.C.R.E.A.S.E
Name = t9 No new state computed
Name = t4 No new state computed
Name = t5 No new state computed
Name = t8 No new state computed
Name = t3 No new state computed
increase = 1
**********************
Random choose
Name = t2  OK !
Now we have a representation of size = 504
Minimization in Progress
Name = t5 No new state computed
Name = t9 No new state computed
Name = t4 No new state computed
Name = t1 No new state computed
Name = t7  I.N.C.R.E.A.S.E
Name = t3 No new state computed
Name = t6 No new state computed
Name = t8 No new state computed
increase = 1
**********************
Random choose
Name = t7  OK !
Now we have a representation of size = 625
Minimization in Progress
Name = t6 No new state computed
Name = t8 No new state computed
Name = t2 No new state computed
Name = t4  I.N.C.R.E.A.S.E
Name = t5 No new state computed
Name = t9 No new state computed
Name = t3 No new state computed
Name = t1 No new state computed
increase = 1
**********************
Random choose
Name = t4  OK !
Now we have a representation of size = 647
Minimization in Progress
Name = t2 No new state computed
Name = t1 No new state computed
Name = t6 No new state computed
Name = t7 No new state computed
Name = t3 No new state computed
Name = t8 No new state computed
Name = t9 No new state computed
Name = t5 No new state computed
increase = 0
nb accelerations 10
Fix point FOUND
seed is : 2691
