current set encoding is : mona
seed is : 21768
cycles of length 1
(1/28), name = t1, size = 9462
(2/28), name = t2, size = 378
(3/28), name = t3, size = 11361
(4/28), name = t4, size = 30264
(5/28), name = t5, size = 371
(6/28), name = t6, size = 369
(7/28), name = t7, size = 11508
(8/28), name = t8, size = 30360
(9/28), name = t9, size = 362
(10/28), name = t10, size = 590
(11/28), name = t11, size = 542
(12/28), name = t12, size = 354
(13/28), name = t13, size = 347
(14/28), name = t14, size = 346
(15/28), name = t15, size = 11341
(16/28), name = t16, size = 10797
(17/28), name = t17, size = 9096
(18/28), name = t18, size = 339
(19/28), name = t19, size = 339
(20/28), name = t20, size = 337
(21/28), name = t21, size = 330
(22/28), name = t22, size = 329
(23/28), name = t23, size = 10948
(24/28), name = t24, size = 10260
(25/28), name = t25, size = 9162
(26/28), name = t26, size = 561
(27/28), name = t27, size = 322
(28/28), name = t28, size = 626
**********************
Random choose
Name = t6  No new state computed
Name = t9  No new state computed
Name = t14  No new state computed
Name = t15  No new state computed
Name = t11  No new state computed
Name = t27  No new state computed
Name = t4  No new state computed
Name = t12  No new state computed
Name = t1  No new state computed
Name = t22  No new state computed
Name = t24  No new state computed
Name = t16  No new state computed
Name = t28  No new state computed
Name = t3  No new state computed
Name = t2  No new state computed
Name = t23  No new state computed
Name = t26  No new state computed
Name = t7  No new state computed
Name = t19  OK !
Now we have a representation of size = 50
Minimization in Progress
Name = t9 No new state computed
Name = t27 No new state computed
Name = t22 No new state computed
Name = t7 No new state computed
Name = t26 No new state computed
Name = t14 No new state computed
Name = t11 No new state computed
Name = t13 No new state computed
Name = t25 No new state computed
Name = t3 No new state computed
Name = t12 No new state computed
Name = t20 No new state computed
Name = t6 No new state computed
Name = t28 No new state computed
Name = t4 No new state computed
Name = t17  I.N.C.R.E.A.S.E
Name = t5  I.N.C.R.E.A.S.E
Name = t24 No new state computed
Name = t2 No new state computed
Name = t8 No new state computed
Name = t21 No new state computed
Name = t23 No new state computed
Name = t18  I.N.C.R.E.A.S.E
Name = t10 No new state computed
Name = t15 No new state computed
Name = t16 No new state computed
Name = t1 No new state computed
increase = 1
**********************
Random choose
Name = t18  OK !
Now we have a representation of size = 52
Minimization in Progress
Name = t7 No new state computed
Name = t23 No new state computed
Name = t8 No new state computed
Name = t15 No new state computed
Name = t4 No new state computed
Name = t14 No new state computed
Name = t10 No new state computed
Name = t9 No new state computed
Name = t1 No new state computed
Name = t2 No new state computed
Name = t16  I.N.C.R.E.A.S.E
Name = t11 No new state computed
Name = t13 No new state computed
Name = t28 No new state computed
Name = t5  I.N.C.R.E.A.S.E
Name = t27 No new state computed
Name = t24 No new state computed
Name = t26 No new state computed
Name = t25 No new state computed
Name = t21 No new state computed
Name = t6 No new state computed
Name = t20 No new state computed
Name = t3 No new state computed
Name = t17  I.N.C.R.E.A.S.E
Name = t19 No new state computed
Name = t22 No new state computed
Name = t12 No new state computed
increase = 1
**********************
Random choose
Name = t17  OK !
Now we have a representation of size = 54
Minimization in Progress
Name = t24 No new state computed
Name = t12 No new state computed
Name = t1 No new state computed
Name = t14 No new state computed
Name = t16 No new state computed
Name = t20 No new state computed
Name = t19 No new state computed
Name = t6 No new state computed
Name = t25 No new state computed
Name = t10 No new state computed
Name = t13 No new state computed
Name = t8 No new state computed
Name = t23 No new state computed
Name = t26 No new state computed
Name = t22 No new state computed
Name = t2 No new state computed
Name = t7 No new state computed
Name = t5  I.N.C.R.E.A.S.E
Name = t18 No new state computed
Name = t27 No new state computed
Name = t11 No new state computed
Name = t9 No new state computed
Name = t21 No new state computed
Name = t15  I.N.C.R.E.A.S.E
Name = t4 No new state computed
Name = t3 No new state computed
Name = t28 No new state computed
increase = 1
**********************
Random choose
Name = t15  OK !
Now we have a representation of size = 88
Minimization in Progress
Name = t9 No new state computed
Name = t24 No new state computed
Name = t18 No new state computed
Name = t28 No new state computed
Name = t25 No new state computed
Name = t3 No new state computed
Name = t14  I.N.C.R.E.A.S.E
Name = t7 No new state computed
Name = t16 No new state computed
Name = t10 No new state computed
Name = t4 No new state computed
Name = t2 No new state computed
Name = t27 No new state computed
Name = t11 No new state computed
Name = t21 No new state computed
Name = t1 No new state computed
Name = t22 No new state computed
Name = t6 No new state computed
Name = t17 No new state computed
Name = t26 No new state computed
Name = t19 No new state computed
Name = t23 No new state computed
Name = t5  I.N.C.R.E.A.S.E
Name = t20 No new state computed
Name = t13 No new state computed
Name = t8 No new state computed
Name = t12  I.N.C.R.E.A.S.E
increase = 1
**********************
Random choose
Name = t12  OK !
Now we have a representation of size = 133
Minimization in Progress
Name = t7 No new state computed
Name = t8 No new state computed
Name = t2 No new state computed
Name = t3 No new state computed
Name = t14  I.N.C.R.E.A.S.E
Name = t22 No new state computed
Name = t17 No new state computed
Name = t4 No new state computed
Name = t15 No new state computed
Name = t21  I.N.C.R.E.A.S.E
Name = t19  I.N.C.R.E.A.S.E
Name = t25 No new state computed
Name = t11  I.N.C.R.E.A.S.E
Name = t6 No new state computed
Name = t5  I.N.C.R.E.A.S.E
Name = t10 No new state computed
Name = t18  I.N.C.R.E.A.S.E
Name = t1 No new state computed
Name = t23 No new state computed
Name = t28 No new state computed
Name = t16 No new state computed
Name = t27  I.N.C.R.E.A.S.E
Name = t24 No new state computed
Name = t13 No new state computed
Name = t9  I.N.C.R.E.A.S.E
Name = t26  I.N.C.R.E.A.S.E
Name = t20 No new state computed
increase = 1
**********************
Random choose
Name = t26  OK !
Now we have a representation of size = 136
Minimization in Progress
Name = t21  I.N.C.R.E.A.S.E
Name = t8 No new state computed
Name = t6 No new state computed
Name = t5  I.N.C.R.E.A.S.E
Name = t12 No new state computed
Name = t23 No new state computed
Name = t25 No new state computed
Name = t13 No new state computed
Name = t2 No new state computed
Name = t24  I.N.C.R.E.A.S.E
Name = t28 No new state computed
Name = t18  I.N.C.R.E.A.S.E
Name = t1 No new state computed
Name = t16 No new state computed
Name = t19  I.N.C.R.E.A.S.E
Name = t20 No new state computed
Name = t15 No new state computed
Name = t27  OK !
Now we have a representation of size = 136
Name = t12 No new state computed
Name = t21  I.N.C.R.E.A.S.E
Name = t13 No new state computed
Name = t28 No new state computed
Name = t9  I.N.C.R.E.A.S.E
Name = t24  I.N.C.R.E.A.S.E
Name = t16 No new state computed
Name = t11  I.N.C.R.E.A.S.E
Name = t19  I.N.C.R.E.A.S.E
Name = t7 No new state computed
Name = t26 No new state computed
Name = t6 No new state computed
Name = t14  I.N.C.R.E.A.S.E
Name = t10 No new state computed
Name = t23 No new state computed
Name = t2 No new state computed
Name = t15 No new state computed
Name = t22 No new state computed
Name = t17 No new state computed
Name = t1 No new state computed
Name = t25  I.N.C.R.E.A.S.E
Name = t5  I.N.C.R.E.A.S.E
Name = t20 No new state computed
Name = t8 No new state computed
Name = t4 No new state computed
Name = t3 No new state computed
Name = t18  I.N.C.R.E.A.S.E
increase = 1
**********************
Random choose
Name = t18  OK !
Now we have a representation of size = 143
Minimization in Progress
Name = t5  I.N.C.R.E.A.S.E
Name = t13 No new state computed
Name = t14  I.N.C.R.E.A.S.E
Name = t17 No new state computed
Name = t22 No new state computed
Name = t8 No new state computed
Name = t4 No new state computed
Name = t23 No new state computed
Name = t25  OK !
Now we have a representation of size = 143
Name = t19  OK !
Now we have a representation of size = 143
Name = t4 No new state computed
Name = t7 No new state computed
Name = t16  I.N.C.R.E.A.S.E
Name = t13 No new state computed
Name = t27 No new state computed
Name = t22 No new state computed
Name = t10 No new state computed
Name = t17 No new state computed
Name = t24 No new state computed
Name = t11  I.N.C.R.E.A.S.E
Name = t12 No new state computed
Name = t28 No new state computed
Name = t23  I.N.C.R.E.A.S.E
Name = t20 No new state computed
Name = t8 No new state computed
Name = t14  I.N.C.R.E.A.S.E
Name = t3 No new state computed
Name = t9  I.N.C.R.E.A.S.E
Name = t1 No new state computed
Name = t5  I.N.C.R.E.A.S.E
Name = t18 No new state computed
Name = t2 No new state computed
Name = t21  I.N.C.R.E.A.S.E
Name = t15 No new state computed
Name = t26 No new state computed
Name = t6 No new state computed
Name = t25 No new state computed
increase = 1
**********************
Random choose
Name = t21  OK !
Now we have a representation of size = 198
Minimization in Progress
Name = t2 No new state computed
Name = t9  I.N.C.R.E.A.S.E
Name = t22 No new state computed
Name = t18 No new state computed
Name = t11  I.N.C.R.E.A.S.E
Name = t3 No new state computed
Name = t8 No new state computed
Name = t20 No new state computed
Name = t6 No new state computed
Name = t7 No new state computed
Name = t28 No new state computed
Name = t27 No new state computed
Name = t1 No new state computed
Name = t14  I.N.C.R.E.A.S.E
Name = t23  OK !
Now we have a representation of size = 196
Name = t22 No new state computed
Name = t7 No new state computed
Name = t17 No new state computed
Name = t10 No new state computed
Name = t6 No new state computed
Name = t19 No new state computed
Name = t5  I.N.C.R.E.A.S.E
Name = t28 No new state computed
Name = t8 No new state computed
Name = t24 No new state computed
Name = t27 No new state computed
Name = t25 No new state computed
Name = t26 No new state computed
Name = t21 No new state computed
Name = t20 No new state computed
Name = t16  I.N.C.R.E.A.S.E
Name = t14  I.N.C.R.E.A.S.E
Name = t12 No new state computed
Name = t11  I.N.C.R.E.A.S.E
Name = t1 No new state computed
Name = t2 No new state computed
Name = t4 No new state computed
Name = t3 No new state computed
Name = t18 No new state computed
Name = t9  I.N.C.R.E.A.S.E
Name = t15 No new state computed
Name = t13 No new state computed
increase = 1
**********************
Random choose
Name = t9  OK !
Now we have a representation of size = 210
Minimization in Progress
Name = t27 No new state computed
Name = t22 No new state computed
Name = t15 No new state computed
Name = t20 No new state computed
Name = t25 No new state computed
Name = t19 No new state computed
Name = t10 No new state computed
Name = t2 No new state computed
Name = t24 No new state computed
Name = t6 No new state computed
Name = t5  I.N.C.R.E.A.S.E
Name = t18 No new state computed
Name = t11  I.N.C.R.E.A.S.E
Name = t12 No new state computed
Name = t23 No new state computed
Name = t26 No new state computed
Name = t3 No new state computed
Name = t14  I.N.C.R.E.A.S.E
Name = t17 No new state computed
Name = t7 No new state computed
Name = t4 No new state computed
Name = t21 No new state computed
Name = t16  I.N.C.R.E.A.S.E
Name = t13 No new state computed
Name = t28 No new state computed
Name = t8  I.N.C.R.E.A.S.E
Name = t1 No new state computed
increase = 1
**********************
Random choose
Name = t8  OK !
Now we have a representation of size = 212
Minimization in Progress
Name = t19 No new state computed
Name = t27 No new state computed
Name = t25 No new state computed
Name = t7  I.N.C.R.E.A.S.E
Name = t16  I.N.C.R.E.A.S.E
Name = t26 No new state computed
Name = t22 No new state computed
Name = t10 No new state computed
Name = t20 No new state computed
Name = t13 No new state computed
Name = t23 No new state computed
Name = t9 No new state computed
Name = t12 No new state computed
Name = t3 No new state computed
Name = t11  I.N.C.R.E.A.S.E
Name = t2 No new state computed
Name = t21 No new state computed
Name = t24 No new state computed
Name = t17 No new state computed
Name = t1 No new state computed
Name = t6 No new state computed
Name = t28 No new state computed
Name = t14  I.N.C.R.E.A.S.E
Name = t5  I.N.C.R.E.A.S.E
Name = t15 No new state computed
Name = t4 No new state computed
Name = t18 No new state computed
increase = 1
**********************
Random choose
Name = t5  OK !
Now we have a representation of size = 228
Minimization in Progress
Name = t7  I.N.C.R.E.A.S.E
Name = t8 No new state computed
Name = t19 No new state computed
Name = t10 No new state computed
Name = t23 No new state computed
Name = t24 No new state computed
Name = t9 No new state computed
Name = t6 No new state computed
Name = t3 No new state computed
Name = t28 No new state computed
Name = t25 No new state computed
Name = t22 No new state computed
Name = t11  I.N.C.R.E.A.S.E
Name = t12 No new state computed
Name = t27 No new state computed
Name = t17 No new state computed
Name = t13 No new state computed
Name = t26 No new state computed
Name = t1 No new state computed
Name = t20 No new state computed
Name = t18 No new state computed
Name = t15 No new state computed
Name = t4  I.N.C.R.E.A.S.E
Name = t14  I.N.C.R.E.A.S.E
Name = t2 No new state computed
Name = t16  I.N.C.R.E.A.S.E
Name = t21 No new state computed
increase = 1
**********************
Random choose
Name = t16  OK !
Now we have a representation of size = 255
Minimization in Progress
Name = t4  I.N.C.R.E.A.S.E
Name = t8 No new state computed
Name = t2 No new state computed
Name = t25 No new state computed
Name = t13 No new state computed
Name = t26 No new state computed
Name = t17 No new state computed
Name = t19 No new state computed
Name = t7  I.N.C.R.E.A.S.E
Name = t5 No new state computed
Name = t6 No new state computed
Name = t10 No new state computed
Name = t21 No new state computed
Name = t22 No new state computed
Name = t28 No new state computed
Name = t12 No new state computed
Name = t3 No new state computed
Name = t15  I.N.C.R.E.A.S.E
Name = t18 No new state computed
Name = t9 No new state computed
Name = t24 No new state computed
Name = t20 No new state computed
Name = t11  I.N.C.R.E.A.S.E
Name = t27 No new state computed
Name = t14  I.N.C.R.E.A.S.E
Name = t1 No new state computed
Name = t23 No new state computed
increase = 1
**********************
Random choose
Name = t14  OK !
Now we have a representation of size = 291
Minimization in Progress
Name = t15  I.N.C.R.E.A.S.E
Name = t20 No new state computed
Name = t6 No new state computed
Name = t18  I.N.C.R.E.A.S.E
Name = t21  I.N.C.R.E.A.S.E
Name = t11  I.N.C.R.E.A.S.E
Name = t17 No new state computed
Name = t19  I.N.C.R.E.A.S.E
Name = t1 No new state computed
Name = t3 No new state computed
Name = t13 No new state computed
Name = t16 No new state computed
Name = t8 No new state computed
Name = t28 No new state computed
Name = t4  I.N.C.R.E.A.S.E
Name = t2 No new state computed
Name = t23 No new state computed
Name = t9  I.N.C.R.E.A.S.E
Name = t27  I.N.C.R.E.A.S.E
Name = t24 No new state computed
Name = t26  I.N.C.R.E.A.S.E
Name = t10 No new state computed
Name = t22 No new state computed
Name = t25 No new state computed
Name = t12 No new state computed
Name = t5  I.N.C.R.E.A.S.E
Name = t7  I.N.C.R.E.A.S.E
increase = 1
**********************
Random choose
Name = t7  OK !
Now we have a representation of size = 293
Minimization in Progress
Name = t13 No new state computed
Name = t22 No new state computed
Name = t11  I.N.C.R.E.A.S.E
Name = t1 No new state computed
Name = t8 No new state computed
Name = t4  I.N.C.R.E.A.S.E
Name = t5  I.N.C.R.E.A.S.E
Name = t2 No new state computed
Name = t20 No new state computed
Name = t14 No new state computed
Name = t16 No new state computed
Name = t24 No new state computed
Name = t12 No new state computed
Name = t17 No new state computed
Name = t10 No new state computed
Name = t9  I.N.C.R.E.A.S.E
Name = t6 No new state computed
Name = t23 No new state computed
Name = t15  I.N.C.R.E.A.S.E
Name = t25 No new state computed
Name = t18  I.N.C.R.E.A.S.E
Name = t21  I.N.C.R.E.A.S.E
Name = t3 No new state computed
Name = t19  I.N.C.R.E.A.S.E
Name = t27  I.N.C.R.E.A.S.E
Name = t26  I.N.C.R.E.A.S.E
Name = t28 No new state computed
increase = 1
**********************
Random choose
Name = t26  OK !
Now we have a representation of size = 296
Minimization in Progress
Name = t15  I.N.C.R.E.A.S.E
Name = t10 No new state computed
Name = t1 No new state computed
Name = t18  I.N.C.R.E.A.S.E
Name = t20 No new state computed
Name = t19  I.N.C.R.E.A.S.E
Name = t4  I.N.C.R.E.A.S.E
Name = t24  I.N.C.R.E.A.S.E
Name = t21  I.N.C.R.E.A.S.E
Name = t6 No new state computed
Name = t2 No new state computed
Name = t5  I.N.C.R.E.A.S.E
Name = t7 No new state computed
Name = t12 No new state computed
Name = t3 No new state computed
Name = t23 No new state computed
Name = t27  OK !
Now we have a representation of size = 294
Name = t6 No new state computed
Name = t5  I.N.C.R.E.A.S.E
Name = t7 No new state computed
Name = t19  I.N.C.R.E.A.S.E
Name = t21  I.N.C.R.E.A.S.E
Name = t28 No new state computed
Name = t9  I.N.C.R.E.A.S.E
Name = t24  OK !
Now we have a representation of size = 294
Name = t2 No new state computed
Name = t22 No new state computed
Name = t6 No new state computed
Name = t28 No new state computed
Name = t15  I.N.C.R.E.A.S.E
Name = t25 No new state computed
Name = t11  I.N.C.R.E.A.S.E
Name = t1 No new state computed
Name = t5  I.N.C.R.E.A.S.E
Name = t19  I.N.C.R.E.A.S.E
Name = t23  I.N.C.R.E.A.S.E
Name = t27 No new state computed
Name = t26 No new state computed
Name = t10 No new state computed
Name = t4  I.N.C.R.E.A.S.E
Name = t9  I.N.C.R.E.A.S.E
Name = t12 No new state computed
Name = t17 No new state computed
Name = t16 No new state computed
Name = t18  I.N.C.R.E.A.S.E
Name = t8 No new state computed
Name = t13 No new state computed
Name = t20 No new state computed
Name = t14 No new state computed
Name = t3 No new state computed
Name = t7 No new state computed
Name = t21  I.N.C.R.E.A.S.E
increase = 1
**********************
Random choose
Name = t21  OK !
Now we have a representation of size = 324
Minimization in Progress
Name = t18  I.N.C.R.E.A.S.E
Name = t17 No new state computed
Name = t2 No new state computed
Name = t14 No new state computed
Name = t16 No new state computed
Name = t20 No new state computed
Name = t26 No new state computed
Name = t13 No new state computed
Name = t10 No new state computed
Name = t1 No new state computed
Name = t3 No new state computed
Name = t9  I.N.C.R.E.A.S.E
Name = t5  I.N.C.R.E.A.S.E
Name = t6 No new state computed
Name = t15  I.N.C.R.E.A.S.E
Name = t22 No new state computed
Name = t23  OK !
Now we have a representation of size = 289
Name = t2 No new state computed
Name = t16 No new state computed
Name = t13 No new state computed
Name = t20 No new state computed
Name = t4  I.N.C.R.E.A.S.E
Name = t14 No new state computed
Name = t9  I.N.C.R.E.A.S.E
Name = t17 No new state computed
Name = t28 No new state computed
Name = t11  I.N.C.R.E.A.S.E
Name = t25 No new state computed
Name = t15  I.N.C.R.E.A.S.E
Name = t26 No new state computed
Name = t6 No new state computed
Name = t7 No new state computed
Name = t8 No new state computed
Name = t5  I.N.C.R.E.A.S.E
Name = t1 No new state computed
Name = t3 No new state computed
Name = t21 No new state computed
Name = t22 No new state computed
Name = t24 No new state computed
Name = t18  I.N.C.R.E.A.S.E
Name = t19  I.N.C.R.E.A.S.E
Name = t10 No new state computed
Name = t12 No new state computed
Name = t27 No new state computed
increase = 1
**********************
Random choose
Name = t19  OK !
Now we have a representation of size = 291
Minimization in Progress
Name = t12 No new state computed
Name = t18  OK !
Now we have a representation of size = 291
Name = t14 No new state computed
Name = t5  OK !
Now we have a representation of size = 290
Name = t20 No new state computed
Name = t3 No new state computed
Name = t17 No new state computed
Name = t13 No new state computed
Name = t6 No new state computed
Name = t23 No new state computed
Name = t27 No new state computed
Name = t2 No new state computed
Name = t9  I.N.C.R.E.A.S.E
Name = t10 No new state computed
Name = t14 No new state computed
Name = t22 No new state computed
Name = t8 No new state computed
Name = t26 No new state computed
Name = t12 No new state computed
Name = t1 No new state computed
Name = t7 No new state computed
Name = t18 No new state computed
Name = t25 No new state computed
Name = t15  I.N.C.R.E.A.S.E
Name = t16  OK !
Now we have a representation of size = 290
Name = t6 No new state computed
Name = t19 No new state computed
Name = t17 No new state computed
Name = t7 No new state computed
Name = t1 No new state computed
Name = t18 No new state computed
Name = t15  I.N.C.R.E.A.S.E
Name = t21 No new state computed
Name = t27 No new state computed
Name = t28 No new state computed
Name = t24 No new state computed
Name = t25 No new state computed
Name = t8 No new state computed
Name = t14 No new state computed
Name = t9  I.N.C.R.E.A.S.E
Name = t10 No new state computed
Name = t12 No new state computed
Name = t20 No new state computed
Name = t2 No new state computed
Name = t4  I.N.C.R.E.A.S.E
Name = t11  I.N.C.R.E.A.S.E
Name = t22 No new state computed
Name = t5 No new state computed
Name = t3 No new state computed
Name = t13 No new state computed
Name = t26 No new state computed
Name = t23 No new state computed
increase = 1
**********************
Random choose
Name = t11  OK !
Now we have a representation of size = 299
Minimization in Progress
Name = t28  I.N.C.R.E.A.S.E
Name = t7 No new state computed
Name = t5 No new state computed
Name = t25 No new state computed
Name = t27 No new state computed
Name = t20 No new state computed
Name = t19 No new state computed
Name = t15  I.N.C.R.E.A.S.E
Name = t18 No new state computed
Name = t13 No new state computed
Name = t26 No new state computed
Name = t23 No new state computed
Name = t22 No new state computed
Name = t4  I.N.C.R.E.A.S.E
Name = t1 No new state computed
Name = t24 No new state computed
Name = t9  I.N.C.R.E.A.S.E
Name = t10 No new state computed
Name = t21 No new state computed
Name = t12 No new state computed
Name = t17 No new state computed
Name = t8 No new state computed
Name = t14 No new state computed
Name = t2 No new state computed
Name = t16 No new state computed
Name = t3 No new state computed
Name = t6 No new state computed
increase = 1
**********************
Random choose
Name = t9  OK !
Now we have a representation of size = 315
Minimization in Progress
Name = t27 No new state computed
Name = t20 No new state computed
Name = t2 No new state computed
Name = t7 No new state computed
Name = t4  I.N.C.R.E.A.S.E
Name = t24 No new state computed
Name = t10 No new state computed
Name = t22 No new state computed
Name = t15  I.N.C.R.E.A.S.E
Name = t26 No new state computed
Name = t23 No new state computed
Name = t8  I.N.C.R.E.A.S.E
Name = t5 No new state computed
Name = t13 No new state computed
Name = t12 No new state computed
Name = t14 No new state computed
Name = t21 No new state computed
Name = t25 No new state computed
Name = t28  I.N.C.R.E.A.S.E
Name = t3 No new state computed
Name = t18 No new state computed
Name = t6 No new state computed
Name = t11 No new state computed
Name = t19 No new state computed
Name = t16 No new state computed
Name = t1 No new state computed
Name = t17 No new state computed
increase = 1
**********************
Random choose
Name = t28  OK !
Now we have a representation of size = 324
Minimization in Progress
Name = t3 No new state computed
Name = t12 No new state computed
Name = t26  OK !
Now we have a representation of size = 324
Name = t7 No new state computed
Name = t12 No new state computed
Name = t5 No new state computed
Name = t27  OK !
Now we have a representation of size = 324
Name = t20 No new state computed
Name = t9 No new state computed
Name = t15  I.N.C.R.E.A.S.E
Name = t5 No new state computed
Name = t16 No new state computed
Name = t8  I.N.C.R.E.A.S.E
Name = t12 No new state computed
Name = t18 No new state computed
Name = t17 No new state computed
Name = t25  OK !
Now we have a representation of size = 324
Name = t21 No new state computed
Name = t19 No new state computed
Name = t26 No new state computed
Name = t15  I.N.C.R.E.A.S.E
Name = t20 No new state computed
Name = t16 No new state computed
Name = t23  I.N.C.R.E.A.S.E
Name = t14 No new state computed
Name = t13 No new state computed
Name = t5 No new state computed
Name = t2 No new state computed
Name = t9 No new state computed
Name = t6 No new state computed
Name = t4  I.N.C.R.E.A.S.E
Name = t8  I.N.C.R.E.A.S.E
Name = t11 No new state computed
Name = t28 No new state computed
Name = t22 No new state computed
Name = t3 No new state computed
Name = t12 No new state computed
Name = t1 No new state computed
Name = t7 No new state computed
Name = t17 No new state computed
Name = t10 No new state computed
Name = t24 No new state computed
Name = t18 No new state computed
Name = t27 No new state computed
increase = 1
**********************
Random choose
Name = t8  OK !
Now we have a representation of size = 376
Minimization in Progress
Name = t20 No new state computed
Name = t27 No new state computed
Name = t23  I.N.C.R.E.A.S.E
Name = t14 No new state computed
Name = t12 No new state computed
Name = t24 No new state computed
Name = t7  OK !
Now we have a representation of size = 330
Name = t4  I.N.C.R.E.A.S.E
Name = t12 No new state computed
Name = t1 No new state computed
Name = t25 No new state computed
Name = t27 No new state computed
Name = t16 No new state computed
Name = t28 No new state computed
Name = t5 No new state computed
Name = t20 No new state computed
Name = t13 No new state computed
Name = t9 No new state computed
Name = t14 No new state computed
Name = t17 No new state computed
Name = t3 No new state computed
Name = t15  I.N.C.R.E.A.S.E
Name = t11 No new state computed
Name = t24 No new state computed
Name = t8 No new state computed
Name = t10 No new state computed
Name = t22 No new state computed
Name = t23  I.N.C.R.E.A.S.E
Name = t26 No new state computed
Name = t6 No new state computed
Name = t18 No new state computed
Name = t21 No new state computed
Name = t2 No new state computed
Name = t19 No new state computed
increase = 1
**********************
Random choose
Name = t23  OK !
Now we have a representation of size = 331
Minimization in Progress
Name = t9 No new state computed
Name = t12 No new state computed
Name = t3 No new state computed
Name = t16 No new state computed
Name = t14 No new state computed
Name = t13 No new state computed
Name = t15  I.N.C.R.E.A.S.E
Name = t22  I.N.C.R.E.A.S.E
Name = t28 No new state computed
Name = t7 No new state computed
Name = t24 No new state computed
Name = t17 No new state computed
Name = t10 No new state computed
Name = t27 No new state computed
Name = t6 No new state computed
Name = t20 No new state computed
Name = t2 No new state computed
Name = t26 No new state computed
Name = t1 No new state computed
Name = t19 No new state computed
Name = t5 No new state computed
Name = t21 No new state computed
Name = t18 No new state computed
Name = t4  I.N.C.R.E.A.S.E
Name = t11 No new state computed
Name = t25 No new state computed
Name = t8 No new state computed
increase = 1
**********************
Random choose
Name = t4  OK !
Now we have a representation of size = 345
Minimization in Progress
Name = t25 No new state computed
Name = t18 No new state computed
Name = t1 No new state computed
Name = t10 No new state computed
Name = t27 No new state computed
Name = t11 No new state computed
Name = t22  I.N.C.R.E.A.S.E
Name = t14 No new state computed
Name = t2 No new state computed
Name = t23 No new state computed
Name = t6 No new state computed
Name = t12 No new state computed
Name = t16 No new state computed
Name = t21 No new state computed
Name = t8 No new state computed
Name = t9 No new state computed
Name = t28 No new state computed
Name = t3  I.N.C.R.E.A.S.E
Name = t26 No new state computed
Name = t17 No new state computed
Name = t24 No new state computed
Name = t5 No new state computed
Name = t13 No new state computed
Name = t19 No new state computed
Name = t15  I.N.C.R.E.A.S.E
Name = t20 No new state computed
Name = t7 No new state computed
increase = 1
**********************
Random choose
Name = t15  OK !
Now we have a representation of size = 353
Minimization in Progress
Name = t7 No new state computed
Name = t1 No new state computed
Name = t5 No new state computed
Name = t9 No new state computed
Name = t22  I.N.C.R.E.A.S.E
Name = t20 No new state computed
Name = t24 No new state computed
Name = t27 No new state computed
Name = t17 No new state computed
Name = t16 No new state computed
Name = t14  I.N.C.R.E.A.S.E
Name = t21 No new state computed
Name = t28 No new state computed
Name = t12  I.N.C.R.E.A.S.E
Name = t19 No new state computed
Name = t8 No new state computed
Name = t23 No new state computed
Name = t11 No new state computed
Name = t3  I.N.C.R.E.A.S.E
Name = t18 No new state computed
Name = t10 No new state computed
Name = t13 No new state computed
Name = t2 No new state computed
Name = t6 No new state computed
Name = t4 No new state computed
Name = t26 No new state computed
Name = t25 No new state computed
increase = 1
**********************
Random choose
Name = t3  OK !
Now we have a representation of size = 400
Minimization in Progress
Name = t8 No new state computed
Name = t11 No new state computed
Name = t5 No new state computed
Name = t13 No new state computed
Name = t15 No new state computed
Name = t6 No new state computed
Name = t23 No new state computed
Name = t20 No new state computed
Name = t4 No new state computed
Name = t26 No new state computed
Name = t7 No new state computed
Name = t27 No new state computed
Name = t16 No new state computed
Name = t19 No new state computed
Name = t14  I.N.C.R.E.A.S.E
Name = t1 No new state computed
Name = t2  I.N.C.R.E.A.S.E
Name = t18 No new state computed
Name = t9 No new state computed
Name = t17 No new state computed
Name = t22  I.N.C.R.E.A.S.E
Name = t24 No new state computed
Name = t12  I.N.C.R.E.A.S.E
Name = t25 No new state computed
Name = t10 No new state computed
Name = t28 No new state computed
Name = t21 No new state computed
increase = 1
**********************
Random choose
Name = t12  OK !
Now we have a representation of size = 446
Minimization in Progress
Name = t4 No new state computed
Name = t11  OK !
Now we have a representation of size = 446
Name = t14  OK !
Now we have a representation of size = 443
Name = t17 No new state computed
Name = t18 No new state computed
Name = t23 No new state computed
Name = t20 No new state computed
Name = t5 No new state computed
Name = t13 No new state computed
Name = t1 No new state computed
Name = t26  I.N.C.R.E.A.S.E
Name = t11 No new state computed
Name = t4 No new state computed
Name = t8 No new state computed
Name = t15 No new state computed
Name = t19 No new state computed
Name = t28  OK !
Now we have a representation of size = 419
Name = t5 No new state computed
Name = t1 No new state computed
Name = t24 No new state computed
Name = t9  I.N.C.R.E.A.S.E
Name = t4 No new state computed
Name = t20 No new state computed
Name = t23 No new state computed
Name = t18 No new state computed
Name = t8 No new state computed
Name = t21  I.N.C.R.E.A.S.E
Name = t16 No new state computed
Name = t14 No new state computed
Name = t12 No new state computed
Name = t27  OK !
Now we have a representation of size = 417
Name = t26  OK !
Now we have a representation of size = 415
Name = t5 No new state computed
Name = t23 No new state computed
Name = t14 No new state computed
Name = t20 No new state computed
Name = t18 No new state computed
Name = t9  I.N.C.R.E.A.S.E
Name = t21  I.N.C.R.E.A.S.E
Name = t7 No new state computed
Name = t8 No new state computed
Name = t16 No new state computed
Name = t15 No new state computed
Name = t10 No new state computed
Name = t6 No new state computed
Name = t11 No new state computed
Name = t27 No new state computed
Name = t4 No new state computed
Name = t25  OK !
Now we have a representation of size = 413
Name = t9  I.N.C.R.E.A.S.E
Name = t7 No new state computed
Name = t8 No new state computed
Name = t12 No new state computed
Name = t3 No new state computed
Name = t10 No new state computed
Name = t28 No new state computed
Name = t22  I.N.C.R.E.A.S.E
Name = t13 No new state computed
Name = t6 No new state computed
Name = t18 No new state computed
Name = t26 No new state computed
Name = t20 No new state computed
Name = t4 No new state computed
Name = t21  I.N.C.R.E.A.S.E
Name = t16 No new state computed
Name = t27 No new state computed
Name = t14 No new state computed
Name = t23  I.N.C.R.E.A.S.E
Name = t2  I.N.C.R.E.A.S.E
Name = t11 No new state computed
Name = t15 No new state computed
Name = t24 No new state computed
Name = t19 No new state computed
Name = t17 No new state computed
Name = t1 No new state computed
Name = t5 No new state computed
increase = 1
**********************
Random choose
Name = t2  OK !
Now we have a representation of size = 599
Minimization in Progress
Name = t7 No new state computed
Name = t14 No new state computed
Name = t23  I.N.C.R.E.A.S.E
Name = t5  I.N.C.R.E.A.S.E
Name = t20 No new state computed
Name = t3 No new state computed
Name = t11 No new state computed
Name = t27  I.N.C.R.E.A.S.E
Name = t24 No new state computed
Name = t17 No new state computed
Name = t12 No new state computed
Name = t18  I.N.C.R.E.A.S.E
Name = t9  I.N.C.R.E.A.S.E
Name = t26  I.N.C.R.E.A.S.E
Name = t1  I.N.C.R.E.A.S.E
Name = t13  I.N.C.R.E.A.S.E
Name = t8 No new state computed
Name = t22  I.N.C.R.E.A.S.E
Name = t6 No new state computed
Name = t28 No new state computed
Name = t16 No new state computed
Name = t15 No new state computed
Name = t10 No new state computed
Name = t25 No new state computed
Name = t21  I.N.C.R.E.A.S.E
Name = t4 No new state computed
Name = t19  I.N.C.R.E.A.S.E
increase = 1
**********************
Random choose
Name = t19  OK !
Now we have a representation of size = 615
Minimization in Progress
Name = t17  I.N.C.R.E.A.S.E
Name = t15 No new state computed
Name = t24 No new state computed
Name = t6 No new state computed
Name = t28 No new state computed
Name = t10 No new state computed
Name = t3 No new state computed
Name = t1  I.N.C.R.E.A.S.E
Name = t25 No new state computed
Name = t5  I.N.C.R.E.A.S.E
Name = t9  I.N.C.R.E.A.S.E
Name = t22  I.N.C.R.E.A.S.E
Name = t8 No new state computed
Name = t23  I.N.C.R.E.A.S.E
Name = t4 No new state computed
Name = t21  I.N.C.R.E.A.S.E
Name = t20 No new state computed
Name = t12 No new state computed
Name = t16 No new state computed
Name = t11 No new state computed
Name = t7 No new state computed
Name = t27  OK !
Now we have a representation of size = 614
Name = t17  I.N.C.R.E.A.S.E
Name = t4 No new state computed
Name = t14 No new state computed
Name = t25  OK !
Now we have a representation of size = 614
Name = t17  I.N.C.R.E.A.S.E
Name = t19 No new state computed
Name = t24 No new state computed
Name = t18  I.N.C.R.E.A.S.E
Name = t12 No new state computed
Name = t13  I.N.C.R.E.A.S.E
Name = t6 No new state computed
Name = t9  I.N.C.R.E.A.S.E
Name = t16 No new state computed
Name = t2 No new state computed
Name = t15 No new state computed
Name = t27 No new state computed
Name = t28 No new state computed
Name = t3 No new state computed
Name = t14 No new state computed
Name = t8 No new state computed
Name = t20 No new state computed
Name = t23  I.N.C.R.E.A.S.E
Name = t1  I.N.C.R.E.A.S.E
Name = t11 No new state computed
Name = t7 No new state computed
Name = t10 No new state computed
Name = t26  OK !
Now we have a representation of size = 611
Name = t5  I.N.C.R.E.A.S.E
Name = t2 No new state computed
Name = t8 No new state computed
Name = t17  I.N.C.R.E.A.S.E
Name = t16 No new state computed
Name = t10 No new state computed
Name = t27 No new state computed
Name = t21  I.N.C.R.E.A.S.E
Name = t28 No new state computed
Name = t24 No new state computed
Name = t3 No new state computed
Name = t13  I.N.C.R.E.A.S.E
Name = t7 No new state computed
Name = t11 No new state computed
Name = t1  I.N.C.R.E.A.S.E
Name = t14 No new state computed
Name = t6 No new state computed
Name = t19 No new state computed
Name = t15 No new state computed
Name = t4 No new state computed
Name = t22  I.N.C.R.E.A.S.E
Name = t12 No new state computed
Name = t25 No new state computed
Name = t20 No new state computed
Name = t9  I.N.C.R.E.A.S.E
Name = t23  I.N.C.R.E.A.S.E
Name = t18  I.N.C.R.E.A.S.E
increase = 1
**********************
Random choose
Name = t18  OK !
Now we have a representation of size = 613
Minimization in Progress
Name = t19 No new state computed
Name = t8 No new state computed
Name = t23  I.N.C.R.E.A.S.E
Name = t2 No new state computed
Name = t12 No new state computed
Name = t22  I.N.C.R.E.A.S.E
Name = t26 No new state computed
Name = t4 No new state computed
Name = t25 No new state computed
Name = t15 No new state computed
Name = t7 No new state computed
Name = t14 No new state computed
Name = t13  I.N.C.R.E.A.S.E
Name = t5  I.N.C.R.E.A.S.E
Name = t1  I.N.C.R.E.A.S.E
Name = t21  I.N.C.R.E.A.S.E
Name = t27 No new state computed
Name = t11 No new state computed
Name = t17  I.N.C.R.E.A.S.E
Name = t16  I.N.C.R.E.A.S.E
Name = t24 No new state computed
Name = t6 No new state computed
Name = t9  I.N.C.R.E.A.S.E
Name = t3 No new state computed
Name = t28 No new state computed
Name = t20 No new state computed
Name = t10 No new state computed
increase = 1
**********************
Random choose
Name = t9  OK !
Now we have a representation of size = 647
Minimization in Progress
Name = t27 No new state computed
Name = t21  I.N.C.R.E.A.S.E
Name = t19 No new state computed
Name = t22  I.N.C.R.E.A.S.E
Name = t12 No new state computed
Name = t1  I.N.C.R.E.A.S.E
Name = t17  I.N.C.R.E.A.S.E
Name = t11 No new state computed
Name = t10 No new state computed
Name = t14 No new state computed
Name = t16  I.N.C.R.E.A.S.E
Name = t20 No new state computed
Name = t6 No new state computed
Name = t25 No new state computed
Name = t24 No new state computed
Name = t3 No new state computed
Name = t15 No new state computed
Name = t4 No new state computed
Name = t23  I.N.C.R.E.A.S.E
Name = t2 No new state computed
Name = t13  I.N.C.R.E.A.S.E
Name = t7 No new state computed
Name = t5  I.N.C.R.E.A.S.E
Name = t28 No new state computed
Name = t26 No new state computed
Name = t8  I.N.C.R.E.A.S.E
Name = t18 No new state computed
increase = 1
**********************
Random choose
Name = t8  OK !
Now we have a representation of size = 741
Minimization in Progress
Name = t2 No new state computed
Name = t24 No new state computed
Name = t25 No new state computed
Name = t11 No new state computed
Name = t21  I.N.C.R.E.A.S.E
Name = t18 No new state computed
Name = t4 No new state computed
Name = t16  I.N.C.R.E.A.S.E
Name = t6 No new state computed
Name = t23  I.N.C.R.E.A.S.E
Name = t10 No new state computed
Name = t13  I.N.C.R.E.A.S.E
Name = t26 No new state computed
Name = t5  I.N.C.R.E.A.S.E
Name = t9 No new state computed
Name = t14 No new state computed
Name = t28 No new state computed
Name = t22  I.N.C.R.E.A.S.E
Name = t17  I.N.C.R.E.A.S.E
Name = t15 No new state computed
Name = t7  OK !
Now we have a representation of size = 715
Name = t21  I.N.C.R.E.A.S.E
Name = t6  I.N.C.R.E.A.S.E
Name = t2 No new state computed
Name = t19 No new state computed
Name = t28 No new state computed
Name = t22  I.N.C.R.E.A.S.E
Name = t8 No new state computed
Name = t13  I.N.C.R.E.A.S.E
Name = t15 No new state computed
Name = t4 No new state computed
Name = t12 No new state computed
Name = t11 No new state computed
Name = t3 No new state computed
Name = t25 No new state computed
Name = t27 No new state computed
Name = t17  I.N.C.R.E.A.S.E
Name = t24 No new state computed
Name = t18 No new state computed
Name = t14 No new state computed
Name = t10 No new state computed
Name = t23  I.N.C.R.E.A.S.E
Name = t26 No new state computed
Name = t1  I.N.C.R.E.A.S.E
Name = t5  I.N.C.R.E.A.S.E
Name = t16  I.N.C.R.E.A.S.E
Name = t20 No new state computed
Name = t9 No new state computed
increase = 1
**********************
Random choose
Name = t16  OK !
Now we have a representation of size = 716
Minimization in Progress
Name = t2 No new state computed
Name = t24 No new state computed
Name = t23  I.N.C.R.E.A.S.E
Name = t25 No new state computed
Name = t28 No new state computed
Name = t3 No new state computed
Name = t1  I.N.C.R.E.A.S.E
Name = t9 No new state computed
Name = t8 No new state computed
Name = t18 No new state computed
Name = t14 No new state computed
Name = t26 No new state computed
Name = t11 No new state computed
Name = t17 No new state computed
Name = t20 No new state computed
Name = t5  I.N.C.R.E.A.S.E
Name = t27 No new state computed
Name = t19 No new state computed
Name = t13  I.N.C.R.E.A.S.E
Name = t21  I.N.C.R.E.A.S.E
Name = t7 No new state computed
Name = t15  I.N.C.R.E.A.S.E
Name = t6  I.N.C.R.E.A.S.E
Name = t12 No new state computed
Name = t10 No new state computed
Name = t22  I.N.C.R.E.A.S.E
Name = t4 No new state computed
increase = 1
**********************
Random choose
Name = t22  OK !
Now we have a representation of size = 782
Minimization in Progress
Name = t13  I.N.C.R.E.A.S.E
Name = t24 No new state computed
Name = t25 No new state computed
Name = t10 No new state computed
Name = t28 No new state computed
Name = t20 No new state computed
Name = t7 No new state computed
Name = t18  I.N.C.R.E.A.S.E
Name = t11 No new state computed
Name = t8 No new state computed
Name = t15  I.N.C.R.E.A.S.E
Name = t16 No new state computed
Name = t12 No new state computed
Name = t17 No new state computed
Name = t26 No new state computed
Name = t27 No new state computed
Name = t21  I.N.C.R.E.A.S.E
Name = t23  I.N.C.R.E.A.S.E
Name = t5  I.N.C.R.E.A.S.E
Name = t14 No new state computed
Name = t6  I.N.C.R.E.A.S.E
Name = t2 No new state computed
Name = t9  I.N.C.R.E.A.S.E
Name = t4 No new state computed
Name = t1  I.N.C.R.E.A.S.E
Name = t3 No new state computed
Name = t19  I.N.C.R.E.A.S.E
increase = 1
**********************
Random choose
Name = t19  OK !
Now we have a representation of size = 799
Minimization in Progress
Name = t14 No new state computed
Name = t12 No new state computed
Name = t8 No new state computed
Name = t24 No new state computed
Name = t22 No new state computed
Name = t5  I.N.C.R.E.A.S.E
Name = t21  I.N.C.R.E.A.S.E
Name = t7 No new state computed
Name = t3 No new state computed
Name = t16 No new state computed
Name = t11 No new state computed
Name = t1  I.N.C.R.E.A.S.E
Name = t20 No new state computed
Name = t18  OK !
Now we have a representation of size = 798
Name = t24 No new state computed
Name = t11 No new state computed
Name = t21  I.N.C.R.E.A.S.E
Name = t28 No new state computed
Name = t4 No new state computed
Name = t14 No new state computed
Name = t7 No new state computed
Name = t27 No new state computed
Name = t2 No new state computed
Name = t6  I.N.C.R.E.A.S.E
Name = t12 No new state computed
Name = t5  I.N.C.R.E.A.S.E
Name = t3 No new state computed
Name = t25 No new state computed
Name = t20 No new state computed
Name = t16  I.N.C.R.E.A.S.E
Name = t22 No new state computed
Name = t9  OK !
Now we have a representation of size = 798
Name = t23  I.N.C.R.E.A.S.E
Name = t22 No new state computed
Name = t26 No new state computed
Name = t19 No new state computed
Name = t1  I.N.C.R.E.A.S.E
Name = t24 No new state computed
Name = t2 No new state computed
Name = t4 No new state computed
Name = t14 No new state computed
Name = t13  I.N.C.R.E.A.S.E
Name = t3 No new state computed
Name = t21  I.N.C.R.E.A.S.E
Name = t12 No new state computed
Name = t27 No new state computed
Name = t7 No new state computed
Name = t18 No new state computed
Name = t28 No new state computed
Name = t15  I.N.C.R.E.A.S.E
Name = t16  I.N.C.R.E.A.S.E
Name = t25 No new state computed
Name = t20 No new state computed
Name = t11 No new state computed
Name = t6  I.N.C.R.E.A.S.E
Name = t8  I.N.C.R.E.A.S.E
Name = t5  I.N.C.R.E.A.S.E
Name = t17 No new state computed
Name = t10 No new state computed
increase = 1
**********************
Random choose
Name = t5  OK !
Now we have a representation of size = 803
Minimization in Progress
Name = t26 No new state computed
Name = t27 No new state computed
Name = t6  I.N.C.R.E.A.S.E
Name = t20 No new state computed
Name = t24 No new state computed
Name = t2 No new state computed
Name = t15  I.N.C.R.E.A.S.E
Name = t12 No new state computed
Name = t22 No new state computed
Name = t10 No new state computed
Name = t23  I.N.C.R.E.A.S.E
Name = t4  I.N.C.R.E.A.S.E
Name = t16  I.N.C.R.E.A.S.E
Name = t25 No new state computed
Name = t14 No new state computed
Name = t21  I.N.C.R.E.A.S.E
Name = t19 No new state computed
Name = t28 No new state computed
Name = t8  I.N.C.R.E.A.S.E
Name = t13  I.N.C.R.E.A.S.E
Name = t11 No new state computed
Name = t3 No new state computed
Name = t18 No new state computed
Name = t7 No new state computed
Name = t9 No new state computed
Name = t1  I.N.C.R.E.A.S.E
Name = t17 No new state computed
increase = 1
**********************
Random choose
Name = t1  OK !
Now we have a representation of size = 814
Minimization in Progress
Name = t4  I.N.C.R.E.A.S.E
Name = t21  I.N.C.R.E.A.S.E
Name = t9 No new state computed
Name = t20 No new state computed
Name = t17 No new state computed
Name = t8  I.N.C.R.E.A.S.E
Name = t28 No new state computed
Name = t11 No new state computed
Name = t27 No new state computed
Name = t2 No new state computed
Name = t19 No new state computed
Name = t13  I.N.C.R.E.A.S.E
Name = t3 No new state computed
Name = t24 No new state computed
Name = t6  I.N.C.R.E.A.S.E
Name = t5 No new state computed
Name = t14 No new state computed
Name = t25 No new state computed
Name = t22 No new state computed
Name = t15  I.N.C.R.E.A.S.E
Name = t26 No new state computed
Name = t18 No new state computed
Name = t7 No new state computed
Name = t10  I.N.C.R.E.A.S.E
Name = t16  I.N.C.R.E.A.S.E
Name = t23  I.N.C.R.E.A.S.E
Name = t12 No new state computed
increase = 1
**********************
Random choose
Name = t23  OK !
Now we have a representation of size = 938
Minimization in Progress
Name = t24 No new state computed
Name = t13  I.N.C.R.E.A.S.E
Name = t27 No new state computed
Name = t15  I.N.C.R.E.A.S.E
Name = t25 No new state computed
Name = t16  I.N.C.R.E.A.S.E
Name = t20 No new state computed
Name = t9 No new state computed
Name = t8  I.N.C.R.E.A.S.E
Name = t5 No new state computed
Name = t7 No new state computed
Name = t28 No new state computed
Name = t17 No new state computed
Name = t22  I.N.C.R.E.A.S.E
Name = t2 No new state computed
Name = t3 No new state computed
Name = t14 No new state computed
Name = t21  I.N.C.R.E.A.S.E
Name = t6  I.N.C.R.E.A.S.E
Name = t19 No new state computed
Name = t10  I.N.C.R.E.A.S.E
Name = t12 No new state computed
Name = t4  I.N.C.R.E.A.S.E
Name = t1 No new state computed
Name = t26 No new state computed
Name = t18 No new state computed
Name = t11 No new state computed
increase = 1
**********************
Random choose
Name = t4  OK !
Now we have a representation of size = 977
Minimization in Progress
Name = t7 No new state computed
Name = t14 No new state computed
Name = t16  I.N.C.R.E.A.S.E
Name = t23 No new state computed
Name = t9 No new state computed
Name = t3  I.N.C.R.E.A.S.E
Name = t18 No new state computed
Name = t20 No new state computed
Name = t26 No new state computed
Name = t10  I.N.C.R.E.A.S.E
Name = t25 No new state computed
Name = t22  I.N.C.R.E.A.S.E
Name = t15  I.N.C.R.E.A.S.E
Name = t17 No new state computed
Name = t8  I.N.C.R.E.A.S.E
Name = t11 No new state computed
Name = t27 No new state computed
Name = t1 No new state computed
Name = t21  I.N.C.R.E.A.S.E
Name = t12 No new state computed
Name = t5 No new state computed
Name = t6  I.N.C.R.E.A.S.E
Name = t19 No new state computed
Name = t13  I.N.C.R.E.A.S.E
Name = t28 No new state computed
Name = t2 No new state computed
Name = t24 No new state computed
increase = 1
**********************
Random choose
Name = t13  OK !
Now we have a representation of size = 1022
Minimization in Progress
Name = t22  I.N.C.R.E.A.S.E
Name = t10  I.N.C.R.E.A.S.E
Name = t11 No new state computed
Name = t27 No new state computed
Name = t14 No new state computed
Name = t21  I.N.C.R.E.A.S.E
Name = t12 No new state computed
Name = t25 No new state computed
Name = t7 No new state computed
Name = t28 No new state computed
Name = t19 No new state computed
Name = t6  I.N.C.R.E.A.S.E
Name = t16  I.N.C.R.E.A.S.E
Name = t23 No new state computed
Name = t4 No new state computed
Name = t17 No new state computed
Name = t26 No new state computed
Name = t5 No new state computed
Name = t1 No new state computed
Name = t24 No new state computed
Name = t9 No new state computed
Name = t8  I.N.C.R.E.A.S.E
Name = t18 No new state computed
Name = t20 No new state computed
Name = t3  I.N.C.R.E.A.S.E
Name = t2 No new state computed
Name = t15  OK !
Now we have a representation of size = 1013
Name = t9 No new state computed
Name = t10  I.N.C.R.E.A.S.E
Name = t7 No new state computed
Name = t17 No new state computed
Name = t4 No new state computed
Name = t14 No new state computed
Name = t3  I.N.C.R.E.A.S.E
Name = t2 No new state computed
Name = t5 No new state computed
Name = t20 No new state computed
Name = t11 No new state computed
Name = t13 No new state computed
Name = t25 No new state computed
Name = t19 No new state computed
Name = t18 No new state computed
Name = t27 No new state computed
Name = t8  I.N.C.R.E.A.S.E
Name = t1 No new state computed
Name = t26 No new state computed
Name = t16  I.N.C.R.E.A.S.E
Name = t28 No new state computed
Name = t21  I.N.C.R.E.A.S.E
Name = t24 No new state computed
Name = t6  I.N.C.R.E.A.S.E
Name = t22  I.N.C.R.E.A.S.E
Name = t12 No new state computed
Name = t23 No new state computed
increase = 1
**********************
Random choose
Name = t22  OK !
Now we have a representation of size = 1196
Minimization in Progress
Name = t14 No new state computed
Name = t3  I.N.C.R.E.A.S.E
Name = t5 No new state computed
Name = t21  I.N.C.R.E.A.S.E
Name = t9  I.N.C.R.E.A.S.E
Name = t13 No new state computed
Name = t26  OK !
Now we have a representation of size = 1196
Name = t3  I.N.C.R.E.A.S.E
Name = t19 No new state computed
Name = t28 No new state computed
Name = t5 No new state computed
Name = t25 No new state computed
Name = t21  I.N.C.R.E.A.S.E
Name = t6  I.N.C.R.E.A.S.E
Name = t9  I.N.C.R.E.A.S.E
Name = t14 No new state computed
Name = t12 No new state computed
Name = t18 No new state computed
Name = t23 No new state computed
Name = t22 No new state computed
Name = t15 No new state computed
Name = t13 No new state computed
Name = t24  I.N.C.R.E.A.S.E
Name = t7 No new state computed
Name = t20 No new state computed
Name = t8  I.N.C.R.E.A.S.E
Name = t10  I.N.C.R.E.A.S.E
Name = t17 No new state computed
Name = t27  OK !
Now we have a representation of size = 1196
Name = t8  I.N.C.R.E.A.S.E
Name = t4 No new state computed
Name = t25 No new state computed
Name = t9  I.N.C.R.E.A.S.E
Name = t7 No new state computed
Name = t19 No new state computed
Name = t16  I.N.C.R.E.A.S.E
Name = t18 No new state computed
Name = t20 No new state computed
Name = t15 No new state computed
Name = t10  I.N.C.R.E.A.S.E
Name = t11 No new state computed
Name = t1 No new state computed
Name = t6  I.N.C.R.E.A.S.E
Name = t28 No new state computed
Name = t26 No new state computed
Name = t24  I.N.C.R.E.A.S.E
Name = t12 No new state computed
Name = t21  I.N.C.R.E.A.S.E
Name = t17 No new state computed
Name = t2 No new state computed
Name = t23 No new state computed
Name = t5 No new state computed
Name = t22 No new state computed
Name = t3 