current set encoding is : prestaf
seed is : 3284
cycles of length 1
(1/17), name = t1, size = 290
(2/17), name = t2, size = 302
(3/17), name = t3, size = 542
(4/17), name = t4, size = 590
(5/17), name = t5, size = 578
(6/17), name = t6, size = 542
(7/17), name = t7, size = 284
(8/17), name = t8, size = 284
(9/17), name = t9, size = 296
(10/17), name = t10, size = 290
(11/17), name = t11, size = 284
(12/17), name = t12, size = 284
(13/17), name = t13, size = 290
(14/17), name = t14, size = 296
(15/17), name = t15, size = 302
(16/17), name = t16, size = 536
(17/17), name = t17, size = 632
**********************
Random choose
Name = t7  No new state computed
Name = t9  No new state computed
Name = t14  No new state computed
Name = t3  No new state computed
Name = t11  No new state computed
Name = t2  OK !
Now we have a representation of size = 520
Minimization in Progress
Name = t17 No new state computed
Name = t5 No new state computed
Name = t11 No new state computed
Name = t1  OK !
Now we have a representation of size = 520
Name = t2 No new state computed
Name = t3 No new state computed
Name = t13 No new state computed
Name = t17 No new state computed
Name = t6 No new state computed
Name = t5 No new state computed
Name = t11 No new state computed
Name = t8 No new state computed
Name = t12 No new state computed
Name = t14 No new state computed
Name = t10  I.N.C.R.E.A.S.E
Name = t16 No new state computed
Name = t7 No new state computed
Name = t4 No new state computed
Name = t9 No new state computed
Name = t15 No new state computed
increase = 1
**********************
Random choose
Name = t10  OK !
Now we have a representation of size = 560
Minimization in Progress
Name = t16 No new state computed
Name = t1 No new state computed
Name = t17 No new state computed
Name = t3 No new state computed
Name = t2 No new state computed
Name = t15 No new state computed
Name = t8 No new state computed
Name = t11  OK !
Now we have a representation of size = 560
Name = t5 No new state computed
Name = t9  I.N.C.R.E.A.S.E
Name = t3 No new state computed
Name = t16 No new state computed
Name = t17 No new state computed
Name = t10 No new state computed
Name = t4 No new state computed
Name = t15 No new state computed
Name = t1 No new state computed
Name = t2 No new state computed
Name = t6  I.N.C.R.E.A.S.E
Name = t14 No new state computed
Name = t13  I.N.C.R.E.A.S.E
Name = t7 No new state computed
Name = t8 No new state computed
Name = t12  I.N.C.R.E.A.S.E
increase = 1
**********************
Random choose
Name = t12  OK !
Now we have a representation of size = 580
Minimization in Progress
Name = t8 No new state computed
Name = t2 No new state computed
Name = t17 No new state computed
Name = t9  I.N.C.R.E.A.S.E
Name = t5 No new state computed
Name = t13  I.N.C.R.E.A.S.E
Name = t14 No new state computed
Name = t4 No new state computed
Name = t7 No new state computed
Name = t1 No new state computed
Name = t11 No new state computed
Name = t10 No new state computed
Name = t16 No new state computed
Name = t6  I.N.C.R.E.A.S.E
Name = t15 No new state computed
Name = t3 No new state computed
increase = 1
**********************
Random choose
Name = t6  OK !
Now we have a representation of size = 586
Minimization in Progress
Name = t14 No new state computed
Name = t2 No new state computed
Name = t11 No new state computed
Name = t16 No new state computed
Name = t1 No new state computed
Name = t15 No new state computed
Name = t8 No new state computed
Name = t12 No new state computed
Name = t4 No new state computed
Name = t5 No new state computed
Name = t10 No new state computed
Name = t9  I.N.C.R.E.A.S.E
Name = t7 No new state computed
Name = t3 No new state computed
Name = t13  I.N.C.R.E.A.S.E
Name = t17 No new state computed
increase = 1
**********************
Random choose
Name = t13  OK !
Now we have a representation of size = 606
Minimization in Progress
Name = t2 No new state computed
Name = t6 No new state computed
Name = t4 No new state computed
Name = t7 No new state computed
Name = t16 No new state computed
Name = t8 No new state computed
Name = t9  I.N.C.R.E.A.S.E
Name = t10 No new state computed
Name = t17 No new state computed
Name = t3 No new state computed
Name = t5 No new state computed
Name = t15 No new state computed
Name = t11 No new state computed
Name = t14 No new state computed
Name = t1 No new state computed
Name = t12 No new state computed
increase = 1
**********************
Random choose
Name = t9  OK !
Now we have a representation of size = 608
Minimization in Progress
Name = t14 No new state computed
Name = t3  I.N.C.R.E.A.S.E
Name = t5 No new state computed
Name = t12 No new state computed
Name = t4 No new state computed
Name = t1 No new state computed
Name = t10 No new state computed
Name = t7 No new state computed
Name = t17 No new state computed
Name = t13 No new state computed
Name = t6 No new state computed
Name = t16 No new state computed
Name = t2 No new state computed
Name = t8 No new state computed
Name = t11 No new state computed
Name = t15 No new state computed
increase = 1
**********************
Random choose
Name = t3  OK !
Now we have a representation of size = 612
Minimization in Progress
Name = t14 No new state computed
Name = t11 No new state computed
Name = t1 No new state computed
Name = t13 No new state computed
Name = t5 No new state computed
Name = t10 No new state computed
Name = t9 No new state computed
Name = t2 No new state computed
Name = t15 No new state computed
Name = t12 No new state computed
Name = t16 No new state computed
Name = t7 No new state computed
Name = t8 No new state computed
Name = t4 No new state computed
Name = t17 No new state computed
Name = t6 No new state computed
increase = 0
nb accelerations 9
Fix point FOUND
seed is : 3284
