current set encoding is : rva
seed is : 3284
(1/144)->
(2/144)->
(3/144)->
(4/144)->
(5/144)->
(6/144)->
(7/144)->
(8/144)->
(9/144)->
(10/144)->
(11/144)->
(12/144)->
(13/144)->
(14/144)->
(15/144)->
(16/144)->
(17/144)->
(18/144)->
(19/144)->
(20/144)->
(21/144)->
(22/144)->
(23/144)->
(24/144)->
(25/144)->
(26/144)->
(27/144)->
(28/144)->
(29/144)->
(30/144)->
(31/144)->
(32/144)->
(33/144)->
(34/144)->
(35/144)->
(36/144)->
(37/144)->
(38/144)->
(39/144)->
(40/144)->
(41/144)->
(42/144)->
(43/144)->
(44/144)->
(45/144)->
(46/144)->
(47/144)->
(48/144)->
(49/144)->
(50/144)->
(51/144)->
(52/144)->
(53/144)->
(54/144)->
(55/144)->
(56/144)->
(57/144)->
(58/144)->
(59/144)->
(60/144)->
(61/144)->
(62/144)->
(63/144)->
(64/144)->
(65/144)->
(66/144)->
(67/144)->
(68/144)->
(69/144)->
(70/144)->
(71/144)->
(72/144)->
(73/144)->
(74/144)->
(75/144)->
(76/144)->
(77/144)->
(78/144)->
(79/144)->
(80/144)->
(81/144)->
(82/144)->
(83/144)->
(84/144)->
(85/144)->
(86/144)->
(87/144)->
(88/144)->
(89/144)->
(90/144)->
(91/144)->
(92/144)->
(93/144)->
(94/144)->
(95/144)->
(96/144)->
(97/144)->
(98/144)->
(99/144)->
(100/144)->
(101/144)->
(102/144)->
(103/144)->
(104/144)->
(105/144)->
(106/144)->
(107/144)->
(108/144)->
(109/144)->
(110/144)->
(111/144)->
(112/144)->
(113/144)->
(114/144)->
(115/144)->
(116/144)->
(117/144)->
(118/144)->
(119/144)->
(120/144)->
(121/144)->
(122/144)->
(123/144)->
(124/144)->
(125/144)->
(126/144)->
(127/144)->
(128/144)->
(129/144)->
(130/144)->
(131/144)->
(132/144)->
(133/144)->
(134/144)->
(135/144)->
(136/144)->
(137/144)->
(138/144)->
(139/144)->
(140/144)->
(141/144)->
(142/144)->
(143/144)->
(144/144)->
Simplification of the linear system 
2 functions have the same action, it remains only 1
4 functions have the same action, it remains only 1
1 functions have the same action, it remains only 1
4 functions have the same action, it remains only 1
2 functions have the same action, it remains only 1
1 functions have the same action, it remains only 1
1 functions have the same action, it remains only 1
1 functions have the same action, it remains only 1
1 functions have the same action, it remains only 1
1 functions have the same action, it remains only 1
1 functions have the same action, it remains only 1
1 functions have the same action, it remains only 1
2 functions have the same action, it remains only 1
1 functions have the same action, it remains only 1
1 functions have the same action, it remains only 1
1 functions have the same action, it remains only 1
3 functions have the same action, it remains only 1
2 functions have the same action, it remains only 1
2 functions have the same action, it remains only 1
2 functions have the same action, it remains only 1
2 functions have the same action, it remains only 1
1 functions have the same action, it remains only 1
Number of actions before simplification : 37
Number of actions after simplification  : 22
cycles of length 2
(1/22), name = (+t4+t12), size = 7888
(2/22), name = (+t4.t2+t12.t2+t9.t4+t11.t12), size = 9782
(3/22), name = +t3, size = 10471
(4/22), name = (+t10.t4+t8.t12+t4.t13+t12.t13), size = 11786
(5/22), name = (+t2.t3+t3.t9), size = 11162
(6/22), name = +t13.t3, size = 11348
(7/22), name = +t3.t10, size = 7606
(8/22), name = +t2, size = 20739
(9/22), name = +t6, size = 7109
