current set encoding is : lira
seed is : 21768
cycles of length 1
(1/16), name = t1, size = 9
(2/16), name = t2, size = 9
(3/16), name = t3, size = 9
(4/16), name = t4, size = 9
(5/16), name = t5, size = 69
(6/16), name = t6, size = 9
(7/16), name = t7, size = 9
(8/16), name = t8, size = 9
(9/16), name = t9, size = 69
(10/16), name = t10, size = 9
(11/16), name = t11, size = 9
(12/16), name = t12, size = 9
(13/16), name = t13, size = 9
(14/16), name = t14, size = 9
(15/16), name = t15, size = 9
(16/16), name = t16, size = 9
**********************
Random choose
Name = t4  No new state computed
Name = t5  No new state computed
Name = t8  No new state computed
Name = t14  No new state computed
Name = t6  No new state computed
Name = t15  No new state computed
Name = t2  No new state computed
Name = t12  No new state computed
Name = t1  OK !
Now we have a representation of size = 6
Minimization in Progress
Name = t3 No new state computed
Name = t9 No new state computed
Name = t12 No new state computed
Name = t4  OK !
Now we have a representation of size = 6
Name = t3 No new state computed
Name = t2  OK !
Now we have a representation of size = 6
Name = t10 No new state computed
Name = t16 No new state computed
Name = t8 No new state computed
Name = t5  OK !
Now we have a representation of size = 6
Name = t16 No new state computed
Name = t15 No new state computed
Name = t11 No new state computed
Name = t4 No new state computed
Name = t14 No new state computed
Name = t7 No new state computed
Name = t13 No new state computed
Name = t6  OK !
Now we have a representation of size = 6
Name = t11 No new state computed
Name = t3 No new state computed
Name = t9 No new state computed
Name = t10  OK !
Now we have a representation of size = 6
Name = t6 No new state computed
Name = t14 No new state computed
Name = t4 No new state computed
Name = t12  OK !
Now we have a representation of size = 6
Name = t7 No new state computed
Name = t10 No new state computed
Name = t2 No new state computed
Name = t16 No new state computed
Name = t8  OK !
Now we have a representation of size = 6
Name = t5 No new state computed
Name = t9  OK !
Now we have a representation of size = 6
Name = t16 No new state computed
Name = t15  OK !
Now we have a representation of size = 6
Name = t11 No new state computed
Name = t10 No new state computed
Name = t4 No new state computed
Name = t16 No new state computed
Name = t13  OK !
Now we have a representation of size = 6
Name = t9 No new state computed
Name = t3 No new state computed
Name = t15 No new state computed
Name = t6 No new state computed
Name = t5 No new state computed
Name = t1  OK !
Now we have a representation of size = 6
Name = t2  OK !
Now we have a representation of size = 6
Name = t15 No new state computed
Name = t10 No new state computed
Name = t11 No new state computed
Name = t16 No new state computed
Name = t4  OK !
Now we have a representation of size = 6
Name = t9 No new state computed
Name = t7 No new state computed
Name = t5  OK !
Now we have a representation of size = 6
Name = t14 No new state computed
Name = t6  OK !
Now we have a representation of size = 6
Name = t12  OK !
Now we have a representation of size = 6
Name = t9 No new state computed
Name = t8  OK !
Now we have a representation of size = 6
Name = t11 No new state computed
Name = t4 No new state computed
Name = t15 No new state computed
Name = t14 No new state computed
Name = t10  OK !
Now we have a representation of size = 6
Name = t7 No new state computed
Name = t1  OK !
Now we have a representation of size = 6
Name = t9 No new state computed
Name = t10 No new state computed
Name = t12 No new state computed
Name = t11 No new state computed
Name = t4  OK !
Now we have a representation of size = 6
Name = t1 No new state computed
Name = t8 No new state computed
Name = t10 No new state computed
Name = t6 No new state computed
Name = t12 No new state computed
Name = t14 No new state computed
Name = t16 No new state computed
Name = t2  OK !
Now we have a representation of size = 6
Name = t9 No new state computed
Name = t7 No new state computed
Name = t14 No new state computed
Name = t3 No new state computed
Name = t11 No new state computed
Name = t15 No new state computed
Name = t1 No new state computed
Name = t12 No new state computed
Name = t5 No new state computed
Name = t4 No new state computed
Name = t13 No new state computed
Name = t16 No new state computed
Name = t8 No new state computed
Name = t6 No new state computed
Name = t10 No new state computed
increase = 0
nb accelerations 22
Fix point FOUND
seed is : 21768
