let
  G0 := int * (1, 0, 0, 0) + int * (0, 1, 0, 0);
  G1 := int * (1, 0, 0, 0);
  nat4 := (nat, nat, nat, nat);
  R := 
    let
      PCF5_0 := 
        let
          CF0 := (0, 1, 0, 0) + G0;
          CF1 := (0, 0, 0, 0);
        in
          CF0 ^ CF1;
      I_F4_3 := 2 * PCF5_0;
      I_F6_3 := 2 * G1;
      I_F3_2 := I_F4_3 || I_F6_3 + (0, 0, 1, 0);
      I_F9_3 := 2 * G0;
      I_F2_1 := I_F3_2 || I_F9_3 + (0, 1, 0, 0);
      I_F12_2 := I_F9_3 || I_F6_3 + (0, 0, 1, 0);
      I_F11_1 := I_F12_2 || I_F9_3 + (0, 1, 0, 0);
    in
      I_F2_1 || I_F11_1 + (1, 0, 0, 0);
in
  { (invalid, valid, dirty, state) | (invalid, valid, dirty, state) in nat4 && R };
// Automata size             : #SA=9 #EA=6 #S=18 #D=5 #Refs=15 #to0=3/36
// Formula size              : 162 nodes
// Time to synthesis formula : 0 ms
