current set encoding is : lash-msdf
seed is : 21768
cycles of length 1
(1/9), name = t1, size = 233
(2/9), name = t2, size = 807
(3/9), name = t3, size = 551
(4/9), name = t4, size = 969
(5/9), name = t5, size = 233
(6/9), name = t6, size = 807
(7/9), name = t7, size = 2881
(8/9), name = t8, size = 5117
(9/9), name = t9, size = 771
**********************
Random choose
Name = t2  No new state computed
Name = t3  OK !
Now we have a representation of size = 39
Minimization in Progress
Name = t5 No new state computed
Name = t8 No new state computed
Name = t9 No new state computed
Name = t2 No new state computed
Name = t1 No new state computed
Name = t7  I.N.C.R.E.A.S.E
Name = t4  I.N.C.R.E.A.S.E
Name = t6 No new state computed
increase = 1
**********************
Random choose
Name = t4  OK !
Now we have a representation of size = 43
Minimization in Progress
Name = t5 No new state computed
Name = t7  I.N.C.R.E.A.S.E
Name = t2 No new state computed
Name = t1 No new state computed
Name = t8 No new state computed
Name = t6 No new state computed
Name = t9 No new state computed
Name = t3 No new state computed
increase = 1
**********************
Random choose
Name = t7  OK !
Now we have a representation of size = 95
Minimization in Progress
Name = t3 No new state computed
Name = t8  I.N.C.R.E.A.S.E
Name = t9 No new state computed
Name = t5 No new state computed
Name = t2  I.N.C.R.E.A.S.E
Name = t4 No new state computed
Name = t6 No new state computed
Name = t1 No new state computed
increase = 1
**********************
Random choose
Name = t2  OK !
Now we have a representation of size = 99
Minimization in Progress
Name = t6  I.N.C.R.E.A.S.E
Name = t8  I.N.C.R.E.A.S.E
Name = t1  OK !
Now we have a representation of size = 99
Name = t6  I.N.C.R.E.A.S.E
Name = t8  I.N.C.R.E.A.S.E
Name = t3 No new state computed
Name = t5 No new state computed
Name = t2  I.N.C.R.E.A.S.E
Name = t7 No new state computed
Name = t9 No new state computed
Name = t4  I.N.C.R.E.A.S.E
increase = 1
**********************
Random choose
Name = t4  OK !
Now we have a representation of size = 101
Minimization in Progress
Name = t1 No new state computed
Name = t7 No new state computed
Name = t5 No new state computed
Name = t2  I.N.C.R.E.A.S.E
Name = t3 No new state computed
Name = t6  I.N.C.R.E.A.S.E
Name = t9 No new state computed
Name = t8  I.N.C.R.E.A.S.E
increase = 1
**********************
Random choose
Name = t8  OK !
Now we have a representation of size = 102
Minimization in Progress
Name = t6  I.N.C.R.E.A.S.E
Name = t2  I.N.C.R.E.A.S.E
Name = t9 No new state computed
Name = t7 No new state computed
Name = t3 No new state computed
Name = t1 No new state computed
Name = t5 No new state computed
Name = t4 No new state computed
increase = 1
**********************
Random choose
Name = t2  OK !
Now we have a representation of size = 116
Minimization in Progress
Name = t4 No new state computed
Name = t1  I.N.C.R.E.A.S.E
Name = t7 No new state computed
Name = t5 No new state computed
Name = t3 No new state computed
Name = t8 No new state computed
Name = t6  I.N.C.R.E.A.S.E
Name = t9 No new state computed
increase = 1
**********************
Random choose
Name = t6  OK !
Now we have a representation of size = 126
Minimization in Progress
Name = t5  OK !
Now we have a representation of size = 123
Name = t4 No new state computed
Name = t3 No new state computed
Name = t6 No new state computed
Name = t7 No new state computed
Name = t9 No new state computed
Name = t2 No new state computed
Name = t8 No new state computed
Name = t1  OK !
Now we have a representation of size = 121
Name = t3 No new state computed
Name = t6 No new state computed
Name = t2  I.N.C.R.E.A.S.E
Name = t5 No new state computed
Name = t7 No new state computed
Name = t9 No new state computed
Name = t4  I.N.C.R.E.A.S.E
Name = t8 No new state computed
increase = 1
**********************
Random choose
Name = t4  OK !
Now we have a representation of size = 125
Minimization in Progress
Name = t8 No new state computed
Name = t7 No new state computed
Name = t2  I.N.C.R.E.A.S.E
Name = t1 No new state computed
Name = t3 No new state computed
Name = t9 No new state computed
Name = t5 No new state computed
Name = t6 No new state computed
increase = 1
**********************
Random choose
Name = t2  OK !
Now we have a representation of size = 128
Minimization in Progress
Name = t7 No new state computed
Name = t3 No new state computed
Name = t1  OK !
Now we have a representation of size = 125
Name = t5 No new state computed
Name = t4  I.N.C.R.E.A.S.E
Name = t3 No new state computed
Name = t9 No new state computed
Name = t7 No new state computed
Name = t6 No new state computed
Name = t8 No new state computed
Name = t2  I.N.C.R.E.A.S.E
increase = 1
**********************
Random choose
Name = t2  OK !
Now we have a representation of size = 152
Minimization in Progress
Name = t5 No new state computed
Name = t8 No new state computed
Name = t6 No new state computed
Name = t9 No new state computed
Name = t4  I.N.C.R.E.A.S.E
Name = t3 No new state computed
Name = t7 No new state computed
Name = t1  OK !
Now we have a representation of size = 150
Name = t9 No new state computed
Name = t5 No new state computed
Name = t3 No new state computed
Name = t4  I.N.C.R.E.A.S.E
Name = t6 No new state computed
Name = t8 No new state computed
Name = t7 No new state computed
Name = t2  I.N.C.R.E.A.S.E
increase = 1
**********************
Random choose
Name = t2  OK !
Now we have a representation of size = 153
Minimization in Progress
Name = t6 No new state computed
Name = t8 No new state computed
Name = t1  OK !
Now we have a representation of size = 150
Name = t2  OK !
Now we have a representation of size = 149
Name = t5 No new state computed
Name = t4  I.N.C.R.E.A.S.E
Name = t3 No new state computed
Name = t1  OK !
Now we have a representation of size = 144
Name = t8 No new state computed
Name = t7 No new state computed
Name = t3 No new state computed
Name = t5 No new state computed
Name = t6 No new state computed
Name = t2 No new state computed
Name = t9 No new state computed
Name = t4  OK !
Now we have a representation of size = 131
Name = t1 No new state computed
Name = t8 No new state computed
Name = t9 No new state computed
Name = t5 No new state computed
Name = t6 No new state computed
Name = t7 No new state computed
Name = t2 No new state computed
Name = t3 No new state computed
increase = 0
nb accelerations 21
Fix point FOUND
seed is : 21768
