current set encoding is : lira
seed is : 2691
cycles of length 1
(1/9), name = r1, size = 8
(2/9), name = r2, size = 17
(3/9), name = r3, size = 15
(4/9), name = r4, size = 9
(5/9), name = r5, size = 13
(6/9), name = r6, size = 16
(7/9), name = r7, size = 9
(8/9), name = r8, size = 9
(9/9), name = r9, size = 9
**********************
Random choose
Name = r4  No new state computed
Name = r1  OK !
Now we have a representation of size = 7
Minimization in Progress
Name = r4  OK !
Now we have a representation of size = 7
Name = r8 No new state computed
Name = r9 No new state computed
Name = r5 No new state computed
Name = r6 No new state computed
Name = r7 No new state computed
Name = r1 No new state computed
Name = r3  I.N.C.R.E.A.S.E
Name = r2  I.N.C.R.E.A.S.E
increase = 1
**********************
Random choose
Name = r2  OK !
Now we have a representation of size = 8
Minimization in Progress
Name = r9 No new state computed
Name = r7 No new state computed
Name = r8  I.N.C.R.E.A.S.E
Name = r3  I.N.C.R.E.A.S.E
Name = r6 No new state computed
Name = r5 No new state computed
Name = r4 No new state computed
Name = r1 No new state computed
increase = 1
**********************
Random choose
Name = r3  OK !
Now we have a representation of size = 9
Minimization in Progress
Name = r5 No new state computed
Name = r6 No new state computed
Name = r9 No new state computed
Name = r8  OK !
Now we have a representation of size = 9
Name = r6 No new state computed
Name = r5 No new state computed
Name = r9 No new state computed
Name = r3 No new state computed
Name = r7 No new state computed
Name = r4 No new state computed
Name = r2 No new state computed
Name = r1 No new state computed
increase = 0
nb accelerations 5
Fix point FOUND
seed is : 2691
