current set encoding is : lash-lsdf
seed is : 21768
(1/16)->
(2/16)->
(3/16)->
(4/16)->
(5/16)->
(6/16)->
(7/16)->
(8/16)->
(9/16)->
(10/16)->
(11/16)->
(12/16)->
(13/16)->
(14/16)->
(15/16)->
(16/16)->
Simplification of the linear system 
1 functions have the same action, it remains only 1
2 functions have the same action, it remains only 1
1 functions have the same action, it remains only 1
1 functions have the same action, it remains only 1
1 functions have the same action, it remains only 1
1 functions have the same action, it remains only 1
1 functions have the same action, it remains only 1
1 functions have the same action, it remains only 1
Number of actions before simplification : 9
Number of actions after simplification  : 8
(1/32)->
(2/32)->
(3/32)->
(4/32)->
(5/32)->
(6/32)->
(7/32)->
(8/32)->
(9/32)->
(10/32)->
(11/32)->
(12/32)->
(13/32)->
(14/32)->
(15/32)->
(16/32)->
(17/32)->
(18/32)->
(19/32)->
(20/32)->
(21/32)->
(22/32)->
(23/32)->
(24/32)->
(25/32)->
(26/32)->
(27/32)->
(28/32)->
(29/32)->
(30/32)->
(31/32)->
(32/32)->
Simplification of the linear system 
1 functions have the same action, it remains only 1
2 functions have the same action, it remains only 1
2 functions have the same action, it remains only 1
1 functions have the same action, it remains only 1
3 functions have the same action, it remains only 1
1 functions have the same action, it remains only 1
3 functions have the same action, it remains only 1
2 functions have the same action, it remains only 1
1 functions have the same action, it remains only 1
1 functions have the same action, it remains only 1
1 functions have the same action, it remains only 1
1 functions have the same action, it remains only 1
1 functions have the same action, it remains only 1
Number of actions before simplification : 20
Number of actions after simplification  : 13
cycles of length 3
(1/13), name = ++t4, size = 142
(2/13), name = (+t4.(+t4.t2+t2)+(+t4.t2+t2)), size = 238
(3/13), name = (+t3.+t4++t3.t4), size = 247
(4/13), name = +t3.(+t4.t2+t2), size = 247
(5/13), name = (+t4.+t2.t3+t2.+t3++t2.t3), size = 228
(6/13), name = +t3.+t3.t4, size = 168
(7/13), name = (+t1.(+t4.t2+t2)+t4.+t1.t2++t1.t2), size = 569
(8/13), name = (+t4.+t1++t4.t1), size = 404
(9/13), name = +t3.+t4.t1, size = 410
(10/13), name = +t1.+t2.t3, size = 184
(11/13), name = +t1.+t1.t2, size = 199
(12/13), name = ++t3, size = 118
(13/13), name = ++t1, size = 444
**********************
Random choose
Name = (+t3.+t4++t3.t4)  No new state computed
Name = +t3.(+t4.t2+t2)  No new state computed
Name = +t3.+t3.t4  No new state computed
Name = +t1.+t1.t2  OK !
Now we have a representation of size = 13
Minimization in Progress
Name = +t3.+t3.t4 No new state computed
Name = (+t4.+t2.t3+t2.+t3++t2.t3)  I.N.C.R.E.A.S.E
Name = (+t4.(+t4.t2+t2)+(+t4.t2+t2))  OK !
Now we have a representation of size = 13
Name = (+t1.(+t4.t2+t2)+t4.+t1.t2++t1.t2)  I.N.C.R.E.A.S.E
Name = ++t4 No new state computed
Name = ++t1  I.N.C.R.E.A.S.E
Name = +t3.+t3.t4 No new state computed
Name = (+t4.+t1++t4.t1) No new state computed
Name = (+t3.+t4++t3.t4) No new state computed
Name = +t1.+t1.t2 No new state computed
Name = +t3.+t4.t1 No new state computed
Name = ++t3  I.N.C.R.E.A.S.E
Name = (+t4.+t2.t3+t2.+t3++t2.t3)  I.N.C.R.E.A.S.E
Name = +t1.+t2.t3  I.N.C.R.E.A.S.E
Name = +t3.(+t4.t2+t2) No new state computed
increase = 1
**********************
Random choose
Name = +t1.+t2.t3  OK !
Now we have a representation of size = 17
Minimization in Progress
Name = +t3.(+t4.t2+t2) No new state computed
Name = ++t3  I.N.C.R.E.A.S.E
Name = +t3.+t4.t1 No new state computed
Name = (+t3.+t4++t3.t4) No new state computed
Name = +t1.+t1.t2 No new state computed
Name = (+t4.+t2.t3+t2.+t3++t2.t3)  I.N.C.R.E.A.S.E
Name = (+t4.+t1++t4.t1) No new state computed
Name = +t3.+t3.t4 No new state computed
Name = ++t1  I.N.C.R.E.A.S.E
Name = ++t4 No new state computed
Name = (+t4.(+t4.t2+t2)+(+t4.t2+t2)) No new state computed
Name = (+t1.(+t4.t2+t2)+t4.+t1.t2++t1.t2)  I.N.C.R.E.A.S.E
increase = 1
**********************
Random choose
Name = (+t1.(+t4.t2+t2)+t4.+t1.t2++t1.t2)  OK !
Now we have a representation of size = 19
Minimization in Progress
Name = (+t4.+t2.t3+t2.+t3++t2.t3)  I.N.C.R.E.A.S.E
Name = +t1.+t1.t2 No new state computed
Name = +t3.(+t4.t2+t2) No new state computed
Name = +t3.+t4.t1 No new state computed
Name = +t1.+t2.t3 No new state computed
Name = ++t3  I.N.C.R.E.A.S.E
Name = ++t4 No new state computed
Name = ++t1  I.N.C.R.E.A.S.E
Name = (+t3.+t4++t3.t4) No new state computed
Name = +t3.+t3.t4 No new state computed
Name = (+t4.(+t4.t2+t2)+(+t4.t2+t2)) No new state computed
Name = (+t4.+t1++t4.t1) No new state computed
increase = 1
**********************
Random choose
Name = ++t1  OK !
Now we have a representation of size = 40
Minimization in Progress
Name = (+t4.+t1++t4.t1) No new state computed
Name = ++t3  I.N.C.R.E.A.S.E
Name = +t1.+t1.t2  I.N.C.R.E.A.S.E
Name = (+t3.+t4++t3.t4) No new state computed
Name = (+t1.(+t4.t2+t2)+t4.+t1.t2++t1.t2)  I.N.C.R.E.A.S.E
Name = +t3.+t4.t1 No new state computed
Name = +t3.(+t4.t2+t2) No new state computed
Name = ++t4 No new state computed
Name = +t1.+t2.t3  I.N.C.R.E.A.S.E
Name = (+t4.(+t4.t2+t2)+(+t4.t2+t2))  I.N.C.R.E.A.S.E
Name = (+t4.+t2.t3+t2.+t3++t2.t3)  I.N.C.R.E.A.S.E
Name = +t3.+t3.t4 No new state computed
increase = 1
**********************
Random choose
Name = (+t4.+t2.t3+t2.+t3++t2.t3)  OK !
Now we have a representation of size = 63
Minimization in Progress
Name = ++t4 No new state computed
Name = +t1.+t1.t2  I.N.C.R.E.A.S.E
Name = (+t1.(+t4.t2+t2)+t4.+t1.t2++t1.t2)  I.N.C.R.E.A.S.E
Name = (+t4.+t1++t4.t1) No new state computed
Name = ++t3  I.N.C.R.E.A.S.E
Name = (+t3.+t4++t3.t4) No new state computed
Name = +t3.(+t4.t2+t2) No new state computed
Name = +t1.+t2.t3 No new state computed
Name = (+t4.(+t4.t2+t2)+(+t4.t2+t2))  I.N.C.R.E.A.S.E
Name = ++t1 No new state computed
Name = +t3.+t4.t1 No new state computed
Name = +t3.+t3.t4 No new state computed
increase = 1
**********************
Random choose
Name = (+t4.(+t4.t2+t2)+(+t4.t2+t2))  OK !
Now we have a representation of size = 67
Minimization in Progress
Name = (+t1.(+t4.t2+t2)+t4.+t1.t2++t1.t2) No new state computed
Name = +t3.+t3.t4 No new state computed
Name = (+t4.+t1++t4.t1) No new state computed
Name = (+t3.+t4++t3.t4) No new state computed
Name = ++t3  I.N.C.R.E.A.S.E
Name = +t3.+t4.t1 No new state computed
Name = +t1.+t1.t2 No new state computed
Name = +t1.+t2.t3 No new state computed
Name = ++t4 No new state computed
Name = ++t1 No new state computed
Name = (+t4.+t2.t3+t2.+t3++t2.t3) No new state computed
Name = +t3.(+t4.t2+t2) No new state computed
increase = 1
**********************
Random choose
Name = ++t3  OK !
Now we have a representation of size = 81
Minimization in Progress
Name = +t1.+t1.t2 No new state computed
Name = +t3.(+t4.t2+t2)  I.N.C.R.E.A.S.E
Name = ++t4  I.N.C.R.E.A.S.E
Name = (+t4.+t2.t3+t2.+t3++t2.t3)  I.N.C.R.E.A.S.E
Name = +t3.+t3.t4  I.N.C.R.E.A.S.E
Name = ++t1 No new state computed
Name = (+t1.(+t4.t2+t2)+t4.+t1.t2++t1.t2)  I.N.C.R.E.A.S.E
Name = (+t4.+t1++t4.t1)  I.N.C.R.E.A.S.E
Name = (+t4.(+t4.t2+t2)+(+t4.t2+t2))  I.N.C.R.E.A.S.E
Name = +t1.+t2.t3 No new state computed
Name = +t3.+t4.t1  I.N.C.R.E.A.S.E
Name = (+t3.+t4++t3.t4)  I.N.C.R.E.A.S.E
increase = 1
**********************
Random choose
Name = (+t3.+t4++t3.t4)  OK !
Now we have a representation of size = 169
Minimization in Progress
Name = +t3.+t3.t4 No new state computed
Name = (+t4.(+t4.t2+t2)+(+t4.t2+t2))  I.N.C.R.E.A.S.E
Name = +t1.+t2.t3  I.N.C.R.E.A.S.E
Name = (+t4.+t1++t4.t1)  I.N.C.R.E.A.S.E
Name = ++t4 No new state computed
Name = ++t1  I.N.C.R.E.A.S.E
Name = +t3.(+t4.t2+t2)  I.N.C.R.E.A.S.E
Name = ++t3 No new state computed
Name = (+t4.+t2.t3+t2.+t3++t2.t3)  I.N.C.R.E.A.S.E
Name = +t3.+t4.t1  I.N.C.R.E.A.S.E
Name = +t1.+t1.t2  I.N.C.R.E.A.S.E
Name = (+t1.(+t4.t2+t2)+t4.+t1.t2++t1.t2)  I.N.C.R.E.A.S.E
increase = 1
**********************
Random choose
Name = (+t1.(+t4.t2+t2)+t4.+t1.t2++t1.t2)  OK !
Now we have a representation of size = 254
Minimization in Progress
Name = (+t4.+t1++t4.t1)  OK !
Now we have a representation of size = 251
Name = +t1.+t2.t3  I.N.C.R.E.A.S.E
Name = (+t4.(+t4.t2+t2)+(+t4.t2+t2))  OK !
Now we have a representation of size = 241
Name = (+t4.+t1++t4.t1) No new state computed
Name = +t3.(+t4.t2+t2) No new state computed
Name = ++t3  I.N.C.R.E.A.S.E
Name = (+t4.+t2.t3+t2.+t3++t2.t3)  I.N.C.R.E.A.S.E
Name = ++t1  I.N.C.R.E.A.S.E
Name = ++t4 No new state computed
Name = +t1.+t1.t2  I.N.C.R.E.A.S.E
Name = +t3.+t3.t4 No new state computed
Name = +t3.+t4.t1 No new state computed
Name = (+t1.(+t4.t2+t2)+t4.+t1.t2++t1.t2)  I.N.C.R.E.A.S.E
Name = (+t3.+t4++t3.t4) No new state computed
Name = +t1.+t2.t3  I.N.C.R.E.A.S.E
increase = 1
**********************
Random choose
Name = +t1.+t2.t3  OK !
Now we have a representation of size = 261
Minimization in Progress
Name = +t3.+t3.t4 No new state computed
Name = (+t4.+t2.t3+t2.+t3++t2.t3)  OK !
Now we have a representation of size = 256
Name = (+t3.+t4++t3.t4) No new state computed
Name = +t1.+t1.t2  OK !
Now we have a representation of size = 253
Name = ++t1  I.N.C.R.E.A.S.E
Name = (+t4.+t2.t3+t2.+t3++t2.t3) No new state computed
Name = +t3.+t4.t1 No new state computed
Name = (+t1.(+t4.t2+t2)+t4.+t1.t2++t1.t2) No new state computed
Name = +t3.(+t4.t2+t2) No new state computed
Name = (+t4.(+t4.t2+t2)+(+t4.t2+t2)) No new state computed
Name = +t1.+t2.t3 No new state computed
Name = ++t4 No new state computed
Name = ++t3  I.N.C.R.E.A.S.E
Name = +t3.+t3.t4 No new state computed
Name = (+t3.+t4++t3.t4) No new state computed
Name = (+t4.+t1++t4.t1) No new state computed
increase = 1
**********************
Random choose
Name = ++t3  OK !
Now we have a representation of size = 325
Minimization in Progress
Name = (+t3.+t4++t3.t4)  I.N.C.R.E.A.S.E
Name = +t3.+t4.t1  I.N.C.R.E.A.S.E
Name = +t1.+t2.t3 No new state computed
Name = (+t4.+t1++t4.t1)  I.N.C.R.E.A.S.E
Name = ++t4  I.N.C.R.E.A.S.E
Name = (+t4.+t2.t3+t2.+t3++t2.t3) No new state computed
Name = ++t1  I.N.C.R.E.A.S.E
Name = (+t4.(+t4.t2+t2)+(+t4.t2+t2)) No new state computed
Name = +t3.(+t4.t2+t2) No new state computed
Name = +t3.+t3.t4  I.N.C.R.E.A.S.E
Name = +t1.+t1.t2 No new state computed
Name = (+t1.(+t4.t2+t2)+t4.+t1.t2++t1.t2)  I.N.C.R.E.A.S.E
increase = 1
**********************
Random choose
Name = (+t1.(+t4.t2+t2)+t4.+t1.t2++t1.t2)  OK !
Now we have a representation of size = 350
Minimization in Progress
Name = ++t4  I.N.C.R.E.A.S.E
Name = (+t3.+t4++t3.t4)  I.N.C.R.E.A.S.E
Name = (+t4.(+t4.t2+t2)+(+t4.t2+t2)) No new state computed
Name = (+t4.+t2.t3+t2.+t3++t2.t3) No new state computed
Name = +t3.+t3.t4  I.N.C.R.E.A.S.E
Name = +t1.+t1.t2 No new state computed
Name = ++t1  I.N.C.R.E.A.S.E
Name = (+t4.+t1++t4.t1)  I.N.C.R.E.A.S.E
Name = +t3.(+t4.t2+t2) No new state computed
Name = ++t3  I.N.C.R.E.A.S.E
Name = +t3.+t4.t1  I.N.C.R.E.A.S.E
Name = +t1.+t2.t3 No new state computed
increase = 1
**********************
Random choose
Name = +t3.+t4.t1  OK !
Now we have a representation of size = 378
Minimization in Progress
Name = (+t1.(+t4.t2+t2)+t4.+t1.t2++t1.t2)  I.N.C.R.E.A.S.E
Name = +t3.+t3.t4  OK !
Now we have a representation of size = 376
Name = +t3.(+t4.t2+t2) No new state computed
Name = (+t1.(+t4.t2+t2)+t4.+t1.t2++t1.t2)  I.N.C.R.E.A.S.E
Name = ++t4 No new state computed
Name = (+t3.+t4++t3.t4) No new state computed
Name = ++t3  I.N.C.R.E.A.S.E
Name = (+t4.(+t4.t2+t2)+(+t4.t2+t2)) No new state computed
Name = +t1.+t2.t3  I.N.C.R.E.A.S.E
Name = +t1.+t1.t2  I.N.C.R.E.A.S.E
Name = ++t1  I.N.C.R.E.A.S.E
Name = (+t4.+t1++t4.t1) No new state computed
Name = +t3.+t4.t1 No new state computed
Name = (+t4.+t2.t3+t2.+t3++t2.t3)  I.N.C.R.E.A.S.E
increase = 1
**********************
Random choose
Name = (+t4.+t2.t3+t2.+t3++t2.t3)  OK !
Now we have a representation of size = 379
Minimization in Progress
Name = +t3.+t3.t4 No new state computed
Name = +t3.+t4.t1 No new state computed
Name = ++t1  I.N.C.R.E.A.S.E
Name = +t1.+t2.t3  I.N.C.R.E.A.S.E
Name = (+t3.+t4++t3.t4) No new state computed
Name = +t3.(+t4.t2+t2) No new state computed
Name = +t1.+t1.t2  I.N.C.R.E.A.S.E
Name = (+t4.+t1++t4.t1) No new state computed
Name = (+t1.(+t4.t2+t2)+t4.+t1.t2++t1.t2)  OK !
Now we have a representation of size = 376
Name = (+t4.+t2.t3+t2.+t3++t2.t3) No new state computed
Name = +t1.+t1.t2  I.N.C.R.E.A.S.E
Name = +t3.(+t4.t2+t2) No new state computed
Name = +t3.+t4.t1 No new state computed
Name = +t3.+t3.t4 No new state computed
Name = ++t3  I.N.C.R.E.A.S.E
Name = ++t4 No new state computed
Name = ++t1  I.N.C.R.E.A.S.E
Name = (+t4.+t1++t4.t1) No new state computed
Name = (+t4.(+t4.t2+t2)+(+t4.t2+t2)) No new state computed
Name = +t1.+t2.t3  I.N.C.R.E.A.S.E
Name = (+t3.+t4++t3.t4) No new state computed
increase = 1
**********************
Random choose
Name = +t1.+t2.t3  OK !
Now we have a representation of size = 377
Minimization in Progress
Name = ++t1  I.N.C.R.E.A.S.E
Name = (+t4.+t2.t3+t2.+t3++t2.t3) No new state computed
Name = (+t3.+t4++t3.t4) No new state computed
Name = ++t4 No new state computed
Name = ++t3  OK !
Now we have a representation of size = 377
Name = (+t1.(+t4.t2+t2)+t4.+t1.t2++t1.t2)  I.N.C.R.E.A.S.E
Name = (+t4.(+t4.t2+t2)+(+t4.t2+t2)) No new state computed
Name = (+t4.+t2.t3+t2.+t3++t2.t3) No new state computed
Name = +t1.+t2.t3 No new state computed
Name = +t3.+t3.t4  I.N.C.R.E.A.S.E
Name = ++t1  I.N.C.R.E.A.S.E
Name = +t1.+t1.t2  I.N.C.R.E.A.S.E
Name = ++t4  I.N.C.R.E.A.S.E
Name = (+t4.+t1++t4.t1)  I.N.C.R.E.A.S.E
Name = (+t3.+t4++t3.t4)  I.N.C.R.E.A.S.E
Name = +t3.(+t4.t2+t2) No new state computed
Name = +t3.+t4.t1  I.N.C.R.E.A.S.E
increase = 1
**********************
Random choose
Name = +t3.+t4.t1  OK !
Now we have a representation of size = 416
Minimization in Progress
Name = (+t3.+t4++t3.t4)  OK !
Now we have a representation of size = 413
Name = (+t4.+t1++t4.t1) No new state computed
Name = +t3.+t3.t4 No new state computed
Name = (+t4.(+t4.t2+t2)+(+t4.t2+t2))  I.N.C.R.E.A.S.E
Name = +t3.+t4.t1 No new state computed
Name = +t3.(+t4.t2+t2) No new state computed
Name = +t1.+t1.t2  I.N.C.R.E.A.S.E
Name = ++t3 No new state computed
Name = ++t1  I.N.C.R.E.A.S.E
Name = (+t4.+t2.t3+t2.+t3++t2.t3)  I.N.C.R.E.A.S.E
Name = (+t1.(+t4.t2+t2)+t4.+t1.t2++t1.t2)  I.N.C.R.E.A.S.E
Name = ++t4 No new state computed
Name = +t1.+t2.t3  I.N.C.R.E.A.S.E
increase = 1
**********************
Random choose
Name = +t1.+t2.t3  OK !
Now we have a representation of size = 463
Minimization in Progress
Name = (+t4.+t1++t4.t1) No new state computed
Name = +t1.+t1.t2  I.N.C.R.E.A.S.E
Name = (+t4.(+t4.t2+t2)+(+t4.t2+t2))  OK !
Now we have a representation of size = 462
Name = +t1.+t2.t3 No new state computed
Name = ++t4 No new state computed
Name = +t3.+t3.t4 No new state computed
Name = (+t3.+t4++t3.t4) No new state computed
Name = ++t1  I.N.C.R.E.A.S.E
Name = +t1.+t1.t2  I.N.C.R.E.A.S.E
Name = ++t3  I.N.C.R.E.A.S.E
Name = (+t4.+t2.t3+t2.+t3++t2.t3) No new state computed
Name = +t3.(+t4.t2+t2) No new state computed
Name = (+t1.(+t4.t2+t2)+t4.+t1.t2++t1.t2)  OK !
Now we have a representation of size = 449
Name = ++t4 No new state computed
Name = +t3.(+t4.t2+t2) No new state computed
Name = +t3.+t4.t1 No new state computed
Name = ++t1  I.N.C.R.E.A.S.E
Name = +t1.+t1.t2  I.N.C.R.E.A.S.E
Name = ++t3  I.N.C.R.E.A.S.E
Name = (+t3.+t4++t3.t4) No new state computed
Name = (+t4.+t2.t3+t2.+t3++t2.t3) No new state computed
Name = (+t4.(+t4.t2+t2)+(+t4.t2+t2)) No new state computed
Name = (+t4.+t1++t4.t1) No new state computed
Name = +t1.+t2.t3 No new state computed
Name = +t3.+t3.t4 No new state computed
increase = 1
**********************
Random choose
Name = ++t3  OK !
Now we have a representation of size = 482
Minimization in Progress
Name = ++t4  I.N.C.R.E.A.S.E
Name = +t1.+t1.t2  I.N.C.R.E.A.S.E
Name = +t3.+t4.t1  I.N.C.R.E.A.S.E
Name = (+t4.+t1++t4.t1)  I.N.C.R.E.A.S.E
Name = (+t4.(+t4.t2+t2)+(+t4.t2+t2)) No new state computed
Name = (+t4.+t2.t3+t2.+t3++t2.t3) No new state computed
Name = (+t3.+t4++t3.t4)  I.N.C.R.E.A.S.E
Name = +t1.+t2.t3 No new state computed
Name = +t3.(+t4.t2+t2) No new state computed
Name = ++t1  I.N.C.R.E.A.S.E
Name = +t3.+t3.t4  I.N.C.R.E.A.S.E
Name = (+t1.(+t4.t2+t2)+t4.+t1.t2++t1.t2)  I.N.C.R.E.A.S.E
increase = 1
**********************
Random choose
Name = (+t1.(+t4.t2+t2)+t4.+t1.t2++t1.t2)  OK !
Now we have a representation of size = 525
Minimization in Progress
Name = ++t1  I.N.C.R.E.A.S.E
Name = +t3.+t3.t4  I.N.C.R.E.A.S.E
Name = (+t4.+t2.t3+t2.+t3++t2.t3) No new state computed
Name = +t3.(+t4.t2+t2) No new state computed
Name = (+t3.+t4++t3.t4)  I.N.C.R.E.A.S.E
Name = (+t4.+t1++t4.t1)  I.N.C.R.E.A.S.E
Name = +t3.+t4.t1  I.N.C.R.E.A.S.E
Name = (+t4.(+t4.t2+t2)+(+t4.t2+t2)) No new state computed
Name = ++t3  I.N.C.R.E.A.S.E
Name = +t1.+t2.t3 No new state computed
Name = ++t4  I.N.C.R.E.A.S.E
Name = +t1.+t1.t2  I.N.C.R.E.A.S.E
increase = 1
**********************
Random choose
Name = +t1.+t1.t2  OK !
Now we have a representation of size = 605
Minimization in Progress
Name = (+t1.(+t4.t2+t2)+t4.+t1.t2++t1.t2) No new state computed
Name = +t3.+t3.t4  I.N.C.R.E.A.S.E
Name = (+t4.(+t4.t2+t2)+(+t4.t2+t2)) No new state computed
Name = (+t4.+t1++t4.t1)  I.N.C.R.E.A.S.E
Name = ++t3  OK !
Now we have a representation of size = 554
Name = (+t4.+t1++t4.t1)  I.N.C.R.E.A.S.E
Name = +t1.+t1.t2 No new state computed
Name = +t3.+t4.t1  I.N.C.R.E.A.S.E
Name = +t3.+t3.t4  I.N.C.R.E.A.S.E
Name = (+t1.(+t4.t2+t2)+t4.+t1.t2++t1.t2)  I.N.C.R.E.A.S.E
Name = (+t4.+t2.t3+t2.+t3++t2.t3) No new state computed
Name = +t1.+t2.t3 No new state computed
Name = (+t3.+t4++t3.t4)  I.N.C.R.E.A.S.E
Name = ++t4  I.N.C.R.E.A.S.E
Name = +t3.(+t4.t2+t2) No new state computed
Name = ++t1  I.N.C.R.E.A.S.E
Name = (+t4.(+t4.t2+t2)+(+t4.t2+t2)) No new state computed
increase = 1
**********************
Random choose
Name = ++t1  OK !
Now we have a representation of size = 746
Minimization in Progress
Name = +t3.(+t4.t2+t2) No new state computed
Name = (+t4.+t1++t4.t1)  I.N.C.R.E.A.S.E
Name = +t3.+t4.t1  I.N.C.R.E.A.S.E
Name = +t1.+t1.t2  I.N.C.R.E.A.S.E
Name = (+t4.(+t4.t2+t2)+(+t4.t2+t2))  I.N.C.R.E.A.S.E
Name = +t1.+t2.t3  I.N.C.R.E.A.S.E
Name = ++t4  I.N.C.R.E.A.S.E
Name = (+t3.+t4++t3.t4)  I.N.C.R.E.A.S.E
Name = ++t3 No new state computed
Name = (+t1.(+t4.t2+t2)+t4.+t1.t2++t1.t2)  I.N.C.R.E.A.S.E
Name = +t3.+t3.t4  I.N.C.R.E.A.S.E
Name = (+t4.+t2.t3+t2.+t3++t2.t3)  I.N.C.R.E.A.S.E
increase = 1
**********************
Random choose
Name = (+t4.+t2.t3+t2.+t3++t2.t3)  OK !
Now we have a representation of size = 1043
Minimization in Progress
Name = (+t4.+t1++t4.t1)  I.N.C.R.E.A.S.E
Name = +t3.+t3.t4  I.N.C.R.E.A.S.E
Name = +t3.+t4.t1  I.N.C.R.E.A.S.E
Name = (+t4.(+t4.t2+t2)+(+t4.t2+t2))  OK !
Now we have a representation of size = 1020
Name = +t3.+t4.t1  I.N.C.R.E.A.S.E
Name = (+t4.+t1++t4.t1)  I.N.C.R.E.A.S.E
Name = +t1.+t2.t3 No new state computed
Name = (+t3.+t4++t3.t4)  I.N.C.R.E.A.S.E
Name = +t3.+t3.t4  I.N.C.R.E.A.S.E
Name = +t1.+t1.t2 No new state computed
Name = (+t1.(+t4.t2+t2)+t4.+t1.t2++t1.t2) No new state computed
Name = ++t3  OK !
Now we have a representation of size = 735
Name = +t3.+t3.t4  I.N.C.R.E.A.S.E
Name = (+t4.+t1++t4.t1)  I.N.C.R.E.A.S.E
Name = +t1.+t2.t3 No new state computed
Name = (+t4.+t2.t3+t2.+t3++t2.t3) No new state computed
Name = (+t1.(+t4.t2+t2)+t4.+t1.t2++t1.t2)  I.N.C.R.E.A.S.E
Name = (+t4.(+t4.t2+t2)+(+t4.t2+t2)) No new state computed
Name = +t3.+t4.t1  I.N.C.R.E.A.S.E
Name = ++t4  I.N.C.R.E.A.S.E
Name = +t3.(+t4.t2+t2) No new state computed
Name = +t1.+t1.t2 No new state computed
Name = (+t3.+t4++t3.t4)  I.N.C.R.E.A.S.E
Name = ++t1 No new state computed
increase = 1
**********************
Random choose
Name = (+t3.+t4++t3.t4)  OK !
Now we have a representation of size = 879
Minimization in Progress
Name = +t1.+t1.t2  I.N.C.R.E.A.S.E
Name = ++t4 No new state computed
Name = +t3.+t3.t4 No new state computed
Name = +t1.+t2.t3  I.N.C.R.E.A.S.E
Name = (+t4.+t2.t3+t2.+t3++t2.t3) No new state computed
Name = +t3.+t4.t1  I.N.C.R.E.A.S.E
Name = (+t1.(+t4.t2+t2)+t4.+t1.t2++t1.t2)  I.N.C.R.E.A.S.E
Name = (+t4.(+t4.t2+t2)+(+t4.t2+t2)) No new state computed
Name = (+t4.+t1++t4.t1)  I.N.C.R.E.A.S.E
Name = ++t1  I.N.C.R.E.A.S.E
Name = ++t3 No new state computed
Name = +t3.(+t4.t2+t2) No new state computed
increase = 1
**********************
Random choose
Name = ++t1  OK !
Now we have a representation of size = 908
Minimization in Progress
Name = +t3.+t3.t4 No new state computed
Name = (+t4.+t2.t3+t2.+t3++t2.t3)  I.N.C.R.E.A.S.E
Name = (+t3.+t4++t3.t4) No new state computed
Name = (+t4.(+t4.t2+t2)+(+t4.t2+t2))  I.N.C.R.E.A.S.E
Name = +t3.+t4.t1 No new state computed
Name = ++t4 No new state computed
Name = +t3.(+t4.t2+t2) No new state computed
Name = ++t3 No new state computed
Name = +t1.+t1.t2  I.N.C.R.E.A.S.E
Name = (+t4.+t1++t4.t1) No new state computed
Name = (+t1.(+t4.t2+t2)+t4.+t1.t2++t1.t2)  I.N.C.R.E.A.S.E
Name = +t1.+t2.t3  I.N.C.R.E.A.S.E
increase = 1
**********************
Random choose
Name = +t1.+t2.t3  OK !
Now we have a representation of size = 1220
Minimization in Progress
Name = +t3.+t4.t1 No new state computed
Name = ++t4 No new state computed
Name = (+t4.+t1++t4.t1) No new state computed
Name = +t3.+t3.t4 No new state computed
Name = ++t3  I.N.C.R.E.A.S.E
Name = (+t4.+t2.t3+t2.+t3++t2.t3) No new state computed
Name = (+t1.(+t4.t2+t2)+t4.+t1.t2++t1.t2)  OK !
Now we have a representation of size = 1186
Name = ++t1 No new state computed
Name = (+t4.+t1++t4.t1) No new state computed
Name = (+t3.+t4++t3.t4) No new state computed
Name = (+t4.(+t4.t2+t2)+(+t4.t2+t2)) No new state computed
Name = +t1.+t2.t3 No new state computed
Name = ++t4 No new state computed
Name = ++t3  OK !
Now we have a representation of size = 1109
Name = (+t1.(+t4.t2+t2)+t4.+t1.t2++t1.t2)  I.N.C.R.E.A.S.E
Name = +t3.(+t4.t2+t2) No new state computed
Name = (+t4.+t1++t4.t1)  I.N.C.R.E.A.S.E
Name = +t3.+t4.t1  I.N.C.R.E.A.S.E
Name = (+t3.+t4++t3.t4)  I.N.C.R.E.A.S.E
Name = (+t4.(+t4.t2+t2)+(+t4.t2+t2)) No new state computed
Name = ++t1 No new state computed
Name = +t1.+t2.t3 No new state computed
Name = +t3.+t3.t4  I.N.C.R.E.A.S.E
Name = +t1.+t1.t2 No new state computed
Name = (+t4.+t2.t3+t2.+t3++t2.t3) No new state computed
Name = ++t4  I.N.C.R.E.A.S.E
increase = 1
**********************
Random choose
Name = ++t4  OK !
Now we have a representation of size = 1328
Minimization in Progress
Name = +t3.(+t4.t2+t2) No new state computed
Name = (+t1.(+t4.t2+t2)+t4.+t1.t2++t1.t2)  I.N.C.R.E.A.S.E
Name = (+t4.+t2.t3+t2.+t3++t2.t3) No new state computed
Name = +t1.+t2.t3  I.N.C.R.E.A.S.E
Name = (+t4.(+t4.t2+t2)+(+t4.t2+t2)) No new state computed
Name = (+t4.+t1++t4.t1)  I.N.C.R.E.A.S.E
Name = ++t3 No new state computed
Name = +t3.+t4.t1  I.N.C.R.E.A.S.E
Name = +t3.+t3.t4 No new state computed
Name = ++t1  I.N.C.R.E.A.S.E
Name = +t1.+t1.t2  I.N.C.R.E.A.S.E
Name = (+t3.+t4++t3.t4) No new state computed
increase = 1
**********************
Random choose
Name = +t1.+t1.t2  OK !
Now we have a representation of size = 1430
Minimization in Progress
Name = +t1.+t2.t3  OK !
Now we have a representation of size = 1421
Name = (+t3.+t4++t3.t4) No new state computed
Name = +t3.+t4.t1  I.N.C.R.E.A.S.E
Name = +t1.+t1.t2 No new state computed
Name = (+t4.+t2.t3+t2.+t3++t2.t3) No new state computed
Name = (+t1.(+t4.t2+t2)+t4.+t1.t2++t1.t2) No new state computed
Name = (+t4.+t1++t4.t1)  I.N.C.R.E.A.S.E
Name = ++t4 No new state computed
Name = +t3.+t3.t4 No new state computed
Name = ++t3  I.N.C.R.E.A.S.E
Name = +t3.(+t4.t2+t2) No new state computed
Name = ++t1  I.N.C.R.E.A.S.E
Name = (+t4.(+t4.t2+t2)+(+t4.t2+t2)) No new state computed
increase = 1
**********************
Random choose
Name = ++t1  OK !
Now we have a representation of size = 1449
Minimization in Progress
Name = +t3.(+t4.t2+t2) No new state computed
Name = ++t4 No new state computed
Name = ++t3  I.N.C.R.E.A.S.E
Name = (+t4.+t1++t4.t1) No new state computed
Name = (+t1.(+t4.t2+t2)+t4.+t1.t2++t1.t2)  I.N.C.R.E.A.S.E
Name = (+t4.(+t4.t2+t2)+(+t4.t2+t2))  I.N.C.R.E.A.S.E
Name = +t1.+t1.t2  I.N.C.R.E.A.S.E
Name = +t3.+t4.t1 No new state computed
Name = (+t3.+t4++t3.t4) No new state computed
Name = (+t4.+t2.t3+t2.+t3++t2.t3)  I.N.C.R.E.A.S.E
Name = +t1.+t2.t3  I.N.C.R.E.A.S.E
Name = +t3.+t3.t4 No new state computed
increase = 1
**********************
Random choose
Name = +t1.+t2.t3  OK !
Now we have a representation of size = 1808
Minimization in Progress
Name = (+t3.+t4++t3.t4) No new state computed
Name = +t3.+t3.t4 No new state computed
Name = +t3.+t4.t1 No new state computed
Name = +t3.(+t4.t2+t2) No new state computed
Name = ++t4 No new state computed
Name = ++t3 