current set encoding is : omega
seed is : 3284
cycles of length 1
(1/5), name = t1, size = 46
(2/5), name = t2, size = 58
(3/5), name = t3, size = 44
(4/5), name = t4, size = 45
(5/5), name = t5, size = 45
**********************
Random choose
Name = t3  No new state computed
Name = t5  No new state computed
Name = t4  No new state computed
Name = t1  OK !
Now we have a representation of size = 14
Minimization in Progress
Name = t4 No new state computed
Name = t5  I.N.C.R.E.A.S.E
Name = t3 No new state computed
Name = t2 No new state computed
increase = 1
**********************
Random choose
Name = t5  OK !
Now we have a representation of size = 21
Minimization in Progress
Name = t3 No new state computed
Name = t1 No new state computed
Name = t4 No new state computed
Name = t2 No new state computed
increase = 0
nb accelerations 2
Fix point FOUND
seed is : 3284
