current set encoding is : lira
seed is : 2691
cycles of length 1
(1/14), name = t1, size = 9
(2/14), name = t2, size = 21
(3/14), name = t3, size = 37
(4/14), name = t4, size = 21
(5/14), name = t5, size = 17
(6/14), name = t6, size = 22
(7/14), name = t7, size = 21
(8/14), name = t8, size = 9
(9/14), name = t9, size = 21
(10/14), name = t10, size = 37
