current set encoding is : lash-lsdf
seed is : 21768
cycles of length 1
(1/9), name = r2, size = 1180
(2/9), name = r3, size = 339
(3/9), name = r4, size = 149
(4/9), name = r5, size = 275
(5/9), name = r6, size = 318
(6/9), name = r7, size = 1003
(7/9), name = r8, size = 177
(8/9), name = r9, size = 309
(9/9), name = r10, size = 232
**********************
Random choose
Name = r3  No new state computed
Name = r4  No new state computed
Name = r5  No new state computed
Name = r8  No new state computed
Name = r9  No new state computed
Name = r10  No new state computed
Name = r2  OK !
Now we have a representation of size = 27
Minimization in Progress
Name = r6 No new state computed
Name = r10 No new state computed
Name = r8 No new state computed
Name = r5  I.N.C.R.E.A.S.E
Name = r9 No new state computed
Name = r7  I.N.C.R.E.A.S.E
Name = r4  I.N.C.R.E.A.S.E
Name = r3 No new state computed
increase = 1
**********************
Random choose
Name = r4  OK !
Now we have a representation of size = 48
Minimization in Progress
Name = r7  I.N.C.R.E.A.S.E
Name = r2  I.N.C.R.E.A.S.E
Name = r5  I.N.C.R.E.A.S.E
Name = r3 No new state computed
Name = r6 No new state computed
Name = r9 No new state computed
Name = r10  I.N.C.R.E.A.S.E
Name = r8 No new state computed
increase = 1
**********************
Random choose
Name = r10  OK !
Now we have a representation of size = 49
Minimization in Progress
Name = r5  I.N.C.R.E.A.S.E
Name = r6 No new state computed
Name = r9 No new state computed
Name = r7  I.N.C.R.E.A.S.E
Name = r4 No new state computed
Name = r2  I.N.C.R.E.A.S.E
Name = r3 No new state computed
Name = r8 No new state computed
increase = 1
**********************
Random choose
Name = r2  OK !
Now we have a representation of size = 70
Minimization in Progress
Name = r4 No new state computed
Name = r8 No new state computed
Name = r3  I.N.C.R.E.A.S.E
Name = r6  I.N.C.R.E.A.S.E
Name = r7  I.N.C.R.E.A.S.E
Name = r9 No new state computed
Name = r10 No new state computed
Name = r5  I.N.C.R.E.A.S.E
increase = 1
**********************
Random choose
Name = r5  OK !
Now we have a representation of size = 117
Minimization in Progress
Name = r7  I.N.C.R.E.A.S.E
Name = r4 No new state computed
Name = r10 No new state computed
Name = r8 No new state computed
Name = r6 No new state computed
Name = r9 No new state computed
Name = r3 No new state computed
Name = r2  I.N.C.R.E.A.S.E
increase = 1
**********************
Random choose
Name = r2  OK !
Now we have a representation of size = 141
Minimization in Progress
Name = r8 No new state computed
Name = r4 No new state computed
Name = r5 No new state computed
Name = r10 No new state computed
Name = r9 No new state computed
Name = r3 No new state computed
Name = r6 No new state computed
Name = r7  I.N.C.R.E.A.S.E
increase = 1
**********************
Random choose
Name = r7  OK !
Now we have a representation of size = 145
Minimization in Progress
Name = r2 No new state computed
Name = r8 No new state computed
Name = r5 No new state computed
Name = r6 No new state computed
Name = r9 No new state computed
Name = r10 No new state computed
Name = r3 No new state computed
Name = r4 No new state computed
increase = 0
nb accelerations 7
Fix point FOUND
seed is : 21768
