current set encoding is : omega
seed is : 21768
(1/64)->
(2/64)->
(3/64)->
(4/64)->
(5/64)->
(6/64)->
(7/64)->
(8/64)->
(9/64)->
(10/64)->
(11/64)->
(12/64)->
(13/64)->
(14/64)->
(15/64)->
(16/64)->
(17/64)->
(18/64)->
(19/64)->
(20/64)->
(21/64)->
(22/64)->
(23/64)->
(24/64)->
(25/64)->
(26/64)->
(27/64)->
(28/64)->
(29/64)->
(30/64)->
(31/64)->
(32/64)->
(33/64)->
(34/64)->
(35/64)->
(36/64)->
(37/64)->
(38/64)->
(39/64)->
(40/64)->
(41/64)->
(42/64)->
(43/64)->
(44/64)->
(45/64)->
(46/64)->
(47/64)->
(48/64)->
(49/64)->
(50/64)->
(51/64)->
(52/64)->
(53/64)->
(54/64)->
(55/64)->
(56/64)->
(57/64)->
(58/64)->
(59/64)->
(60/64)->
(61/64)->
(62/64)->
(63/64)->
(64/64)->
Simplification of the linear system 
1 functions have the same action, it remains only 1
1 functions have the same action, it remains only 1
1 functions have the same action, it remains only 1
2 functions have the same action, it remains only 1
1 functions have the same action, it remains only 1
2 functions have the same action, it remains only 1
1 functions have the same action, it remains only 1
2 functions have the same action, it remains only 1
1 functions have the same action, it remains only 1
2 functions have the same action, it remains only 1
1 functions have the same action, it remains only 1
1 functions have the same action, it remains only 1
2 functions have the same action, it remains only 1
2 functions have the same action, it remains only 1
2 functions have the same action, it remains only 1
1 functions have the same action, it remains only 1
2 functions have the same action, it remains only 1
1 functions have the same action, it remains only 1
1 functions have the same action, it remains only 1
1 functions have the same action, it remains only 1
1 functions have the same action, it remains only 1
2 functions have the same action, it remains only 1
1 functions have the same action, it remains only 1
1 functions have the same action, it remains only 1
Number of actions before simplification : 33
Number of actions after simplification  : 24
cycles of length 2
(1/24), name = +useC.stop, size = 132
(2/24), name = +stop.useC, size = 81
(3/24), name = +releaseC2.stop, size = 132
(4/24), name = (+return.stop+stop), size = 81
(5/24), name = +releaseC1.stop, size = 132
(6/24), name = (+useC.req+req.useC), size = 82
(7/24), name = +req, size = 80
(8/24), name = (+releaseC2.useC+useC.releaseC2), size = 240
(9/24), name = +useC, size = 82
(10/24), name = (+useD.releaseC2+releaseC2.useD), size = 298
(11/24), name = +releaseC2, size = 82
(12/24), name = +useD, size = 82
(13/24), name = (+releaseD.useC+useC.releaseD), size = 162
(14/24), name = (+releaseC1.req+req.releaseC1), size = 134
(15/24), name = (+releaseD.useD+useD.releaseD), size = 294
(16/24), name = +releaseD, size = 56
(17/24), name = (+releaseC1.useC+useC.releaseC1), size = 108
(18/24), name = +releaseC1, size = 82
(19/24), name = +useC.return, size = 132
(20/24), name = +releaseC2.return, size = 132
(21/24), name = +return.releaseC2, size = 81
(22/24), name = (+stop.return+return), size = 81
(23/24), name = +releaseC1.return, size = 132
(24/24), name = +return.releaseC1, size = 81
**********************
Random choose
Name = +releaseC1.stop  No new state computed
Name = (+releaseC2.useC+useC.releaseC2)  No new state computed
Name = +useD  No new state computed
Name = (+releaseD.useC+useC.releaseD)  No new state computed
Name = +useC  No new state computed
Name = +releaseC1.return  No new state computed
Name = (+return.stop+stop)  OK !
Now we have a representation of size = 26
Minimization in Progress
Name = (+releaseD.useC+useC.releaseD) No new state computed
Name = +useC.stop No new state computed
Name = +return.releaseC1 No new state computed
Name = +releaseC1.return No new state computed
Name = (+releaseC1.useC+useC.releaseC1) No new state computed
Name = (+useC.req+req.useC)  I.N.C.R.E.A.S.E
Name = +releaseC2.stop No new state computed
Name = +stop.useC No new state computed
Name = (+useD.releaseC2+releaseC2.useD) No new state computed
Name = +releaseD No new state computed
Name = (+releaseC2.useC+useC.releaseC2) No new state computed
Name = +releaseC1.stop No new state computed
Name = +return.releaseC2 No new state computed
Name = +releaseC2 No new state computed
Name = +releaseC2.return No new state computed
Name = +useC.return No new state computed
Name = +useC No new state computed
Name = (+releaseD.useD+useD.releaseD) No new state computed
Name = +req  I.N.C.R.E.A.S.E
Name = +useD No new state computed
Name = +releaseC1 No new state computed
Name = (+stop.return+return)  I.N.C.R.E.A.S.E
Name = (+releaseC1.req+req.releaseC1) No new state computed
increase = 1
**********************
Random choose
Name = (+stop.return+return)  OK !
Now we have a representation of size = 52
Minimization in Progress
Name = +releaseC1 No new state computed
Name = (+releaseC2.useC+useC.releaseC2) No new state computed
Name = +return.releaseC2 No new state computed
Name = +req  I.N.C.R.E.A.S.E
Name = +releaseC1.return No new state computed
Name = +return.releaseC1 No new state computed
Name = +useD No new state computed
Name = +stop.useC No new state computed
Name = (+releaseD.useD+useD.releaseD) No new state computed
Name = (+useD.releaseC2+releaseC2.useD) No new state computed
Name = (+return.stop+stop) No new state computed
Name = +releaseC2.return No new state computed
Name = (+releaseC1.useC+useC.releaseC1) No new state computed
Name = +releaseC2 No new state computed
Name = (+releaseC1.req+req.releaseC1) No new state computed
Name = (+useC.req+req.useC)  I.N.C.R.E.A.S.E
Name = +releaseD No new state computed
Name = +useC.return No new state computed
Name = +useC No new state computed
Name = +releaseC2.stop No new state computed
Name = +useC.stop No new state computed
Name = +releaseC1.stop No new state computed
Name = (+releaseD.useC+useC.releaseD) No new state computed
increase = 1
**********************
Random choose
Name = (+useC.req+req.useC)  OK !
Now we have a representation of size = 78
Minimization in Progress
Name = (+useD.releaseC2+releaseC2.useD)  I.N.C.R.E.A.S.E
Name = +useC.stop No new state computed
Name = +stop.useC No new state computed
Name = +useC.return No new state computed
Name = (+releaseD.useC+useC.releaseD) No new state computed
Name = (+releaseD.useD+useD.releaseD) No new state computed
Name = +return.releaseC2  I.N.C.R.E.A.S.E
Name = +return.releaseC1 No new state computed
Name = +useC No new state computed
Name = +req  I.N.C.R.E.A.S.E
Name = +releaseC1.stop No new state computed
Name = +releaseC2  I.N.C.R.E.A.S.E
Name = +releaseC2.return  I.N.C.R.E.A.S.E
Name = (+releaseC2.useC+useC.releaseC2) No new state computed
Name = +releaseD No new state computed
Name = +useD No new state computed
Name = +releaseC1 No new state computed
Name = (+releaseC1.useC+useC.releaseC1) No new state computed
Name = +releaseC1.return No new state computed
Name = (+releaseC1.req+req.releaseC1)  I.N.C.R.E.A.S.E
Name = +releaseC2.stop  I.N.C.R.E.A.S.E
Name = (+stop.return+return) No new state computed
Name = (+return.stop+stop)  I.N.C.R.E.A.S.E
increase = 1
**********************
Random choose
Name = (+return.stop+stop)  OK !
Now we have a representation of size = 156
Minimization in Progress
Name = (+releaseC1.req+req.releaseC1)  I.N.C.R.E.A.S.E
Name = +releaseD No new state computed
Name = +useC.return No new state computed
Name = +releaseC1 No new state computed
Name = (+useC.req+req.useC) No new state computed
Name = +useC.stop No new state computed
Name = +useC No new state computed
Name = +useD No new state computed
Name = +req  I.N.C.R.E.A.S.E
Name = (+releaseC2.useC+useC.releaseC2) No new state computed
Name = +releaseC2  I.N.C.R.E.A.S.E
Name = +releaseC1.stop No new state computed
Name = +stop.useC No new state computed
Name = +return.releaseC2  I.N.C.R.E.A.S.E
Name = (+stop.return+return) No new state computed
Name = +return.releaseC1 No new state computed
Name = (+releaseD.useC+useC.releaseD) No new state computed
Name = (+useD.releaseC2+releaseC2.useD)  I.N.C.R.E.A.S.E
Name = (+releaseC1.useC+useC.releaseC1) No new state computed
Name = +releaseC2.return  I.N.C.R.E.A.S.E
Name = (+releaseD.useD+useD.releaseD) No new state computed
Name = +releaseC2.stop  I.N.C.R.E.A.S.E
Name = +releaseC1.return No new state computed
increase = 1
**********************
Random choose
Name = +releaseC2.stop  OK !
Now we have a representation of size = 169
Minimization in Progress
Name = +return.releaseC2  I.N.C.R.E.A.S.E
Name = +req  I.N.C.R.E.A.S.E
Name = +releaseC2.return  I.N.C.R.E.A.S.E
Name = (+releaseC1.req+req.releaseC1)  I.N.C.R.E.A.S.E
Name = +useD  I.N.C.R.E.A.S.E
Name = +releaseC1.return No new state computed
Name = +stop.useC No new state computed
Name = +releaseC2  I.N.C.R.E.A.S.E
Name = (+useC.req+req.useC)  I.N.C.R.E.A.S.E
Name = +useC.return No new state computed
Name = (+releaseC2.useC+useC.releaseC2) No new state computed
Name = +return.releaseC1 No new state computed
Name = +useC.stop No new state computed
Name = (+releaseD.useD+useD.releaseD)  I.N.C.R.E.A.S.E
Name = (+stop.return+return)  I.N.C.R.E.A.S.E
Name = +useC No new state computed
Name = +releaseD No new state computed
Name = (+releaseC1.useC+useC.releaseC1) No new state computed
Name = +releaseC1 No new state computed
Name = (+useD.releaseC2+releaseC2.useD)  I.N.C.R.E.A.S.E
Name = (+return.stop+stop) No new state computed
Name = (+releaseD.useC+useC.releaseD) No new state computed
Name = +releaseC1.stop No new state computed
increase = 1
**********************
Random choose
Name = (+useD.releaseC2+releaseC2.useD)  OK !
Now we have a representation of size = 195
Minimization in Progress
Name = +return.releaseC2  I.N.C.R.E.A.S.E
Name = +useC No new state computed
Name = +useC.return No new state computed
Name = (+releaseD.useD+useD.releaseD)  I.N.C.R.E.A.S.E
Name = (+stop.return+return)  I.N.C.R.E.A.S.E
Name = +releaseC1.stop No new state computed
Name = +releaseC1 No new state computed
Name = +stop.useC No new state computed
Name = +releaseD  I.N.C.R.E.A.S.E
Name = +releaseC1.return No new state computed
Name = (+releaseD.useC+useC.releaseD) No new state computed
Name = +return.releaseC1 No new state computed
Name = +releaseC2.stop No new state computed
Name = (+releaseC2.useC+useC.releaseC2) No new state computed
Name = (+releaseC1.req+req.releaseC1)  I.N.C.R.E.A.S.E
Name = +req  I.N.C.R.E.A.S.E
Name = +useC.stop No new state computed
Name = (+releaseC1.useC+useC.releaseC1) No new state computed
Name = +releaseC2.return  I.N.C.R.E.A.S.E
Name = (+useC.req+req.useC)  I.N.C.R.E.A.S.E
Name = +releaseC2  I.N.C.R.E.A.S.E
Name = (+return.stop+stop) No new state computed
Name = +useD No new state computed
increase = 1
**********************
Random choose
Name = +releaseC2  OK !
Now we have a representation of size = 221
Minimization in Progress
Name = (+releaseC1.req+req.releaseC1)  I.N.C.R.E.A.S.E
Name = +useC.stop No new state computed
Name = (+useC.req+req.useC)  I.N.C.R.E.A.S.E
Name = (+return.stop+stop) No new state computed
Name = +useC No new state computed
Name = +useD No new state computed
Name = +req  I.N.C.R.E.A.S.E
Name = (+releaseC1.useC+useC.releaseC1) No new state computed
Name = (+releaseC2.useC+useC.releaseC2) No new state computed
Name = +return.releaseC1 No new state computed
Name = +releaseC2.return  I.N.C.R.E.A.S.E
Name = +releaseC2.stop No new state computed
Name = +releaseC1 No new state computed
Name = +return.releaseC2 No new state computed
Name = +releaseC1.stop No new state computed
Name = +releaseC1.return No new state computed
Name = +useC.return No new state computed
Name = (+stop.return+return)  I.N.C.R.E.A.S.E
Name = +stop.useC No new state computed
Name = +releaseD  I.N.C.R.E.A.S.E
Name = (+useD.releaseC2+releaseC2.useD) No new state computed
Name = (+releaseD.useD+useD.releaseD)  I.N.C.R.E.A.S.E
Name = (+releaseD.useC+useC.releaseD) No new state computed
increase = 1
**********************
Random choose
Name = (+releaseD.useD+useD.releaseD)  OK !
Now we have a representation of size = 260
Minimization in Progress
Name = +releaseC2.stop No new state computed
Name = +releaseC1.return No new state computed
Name = +useC.stop No new state computed
Name = +releaseC2 No new state computed
Name = +useC No new state computed
Name = +return.releaseC1 No new state computed
Name = +useC.return No new state computed
Name = (+releaseC2.useC+useC.releaseC2) No new state computed
Name = (+useC.req+req.useC)  I.N.C.R.E.A.S.E
Name = +releaseD No new state computed
Name = (+useD.releaseC2+releaseC2.useD) No new state computed
Name = +req  I.N.C.R.E.A.S.E
Name = +releaseC2.return  I.N.C.R.E.A.S.E
Name = (+return.stop+stop) No new state computed
Name = (+releaseC1.useC+useC.releaseC1) No new state computed
Name = (+stop.return+return)  I.N.C.R.E.A.S.E
Name = +useD No new state computed
Name = +releaseC1.stop No new state computed
Name = (+releaseD.useC+useC.releaseD) No new state computed
Name = +return.releaseC2 No new state computed
Name = (+releaseC1.req+req.releaseC1) No new state computed
Name = +releaseC1 No new state computed
Name = +stop.useC No new state computed
increase = 1
**********************
Random choose
Name = (+stop.return+return)  OK !
Now we have a representation of size = 520
Minimization in Progress
Name = +releaseC2.stop No new state computed
Name = +releaseC1 No new state computed
Name = +releaseD No new state computed
Name = (+releaseC2.useC+useC.releaseC2) No new state computed
Name = (+return.stop+stop) No new state computed
Name = +useC.stop No new state computed
Name = +req  I.N.C.R.E.A.S.E
Name = +useC No new state computed
Name = +releaseC1.return No new state computed
Name = (+releaseC1.useC+useC.releaseC1) No new state computed
Name = (+releaseC1.req+req.releaseC1) No new state computed
Name = +return.releaseC2 No new state computed
Name = +releaseC2 No new state computed
Name = +useC.return No new state computed
Name = +stop.useC No new state computed
Name = (+useD.releaseC2+releaseC2.useD) No new state computed
Name = +releaseC1.stop No new state computed
Name = (+releaseD.useC+useC.releaseD) No new state computed
Name = +return.releaseC1 No new state computed
Name = (+useC.req+req.useC)  I.N.C.R.E.A.S.E
Name = +useD No new state computed
Name = (+releaseD.useD+useD.releaseD) No new state computed
Name = +releaseC2.return No new state computed
increase = 1
**********************
Random choose
Name = (+useC.req+req.useC)  OK !
Now we have a representation of size = 702
Minimization in Progress
Name = +releaseC1.return No new state computed
Name = (+useD.releaseC2+releaseC2.useD)  I.N.C.R.E.A.S.E
Name = +releaseC1 No new state computed
Name = (+releaseD.useC+useC.releaseD) No new state computed
Name = +useD No new state computed
Name = +releaseC2.return  I.N.C.R.E.A.S.E
Name = (+releaseC1.req+req.releaseC1)  I.N.C.R.E.A.S.E
Name = (+return.stop+stop)  I.N.C.R.E.A.S.E
Name = +return.releaseC2  I.N.C.R.E.A.S.E
Name = +useC No new state computed
Name = (+releaseD.useD+useD.releaseD) No new state computed
Name = +releaseC2.stop  I.N.C.R.E.A.S.E
Name = (+releaseC1.useC+useC.releaseC1) No new state computed
Name = +useC.stop No new state computed
Name = +return.releaseC1 No new state computed
Name = +useC.return No new state computed
Name = +stop.useC No new state computed
Name = (+stop.return+return) No new state computed
Name = +releaseC1.stop No new state computed
Name = +releaseD No new state computed
Name = (+releaseC2.useC+useC.releaseC2) No new state computed
Name = +releaseC2  I.N.C.R.E.A.S.E
Name = +req  I.N.C.R.E.A.S.E
increase = 1
**********************
Random choose
Name = +req  OK !
Now we have a representation of size = 1458
Minimization in Progress
Name = (+releaseC2.useC+useC.releaseC2)  I.N.C.R.E.A.S.E
Name = +releaseC2.return  I.N.C.R.E.A.S.E
Name = +releaseD No new state computed
Name = (+useD.releaseC2+releaseC2.useD)  I.N.C.R.E.A.S.E
Name = +releaseC2.stop  I.N.C.R.E.A.S.E
Name = +return.releaseC1 No new state computed
Name = (+releaseC1.useC+useC.releaseC1) No new state computed
Name = +releaseC1.stop No new state computed
Name = (+useC.req+req.useC) No new state computed
Name = (+releaseD.useD+useD.releaseD) No new state computed
Name = +stop.useC No new state computed
Name = +useC.stop  I.N.C.R.E.A.S.E
Name = +releaseC2  I.N.C.R.E.A.S.E
Name = +useC No new state computed
Name = +releaseC1.return No new state computed
Name = (+releaseD.useC+useC.releaseD) No new state computed
Name = +return.releaseC2  I.N.C.R.E.A.S.E
Name = +useC.return No new state computed
Name = (+stop.return+return) No new state computed
Name = (+return.stop+stop)  I.N.C.R.E.A.S.E
Name = +useD No new state computed
Name = (+releaseC1.req+req.releaseC1) No new state computed
Name = +releaseC1 No new state computed
increase = 1
**********************
Random choose
Name = (+return.stop+stop)  OK !
Now we have a representation of size = 2916
Minimization in Progress
Name = (+releaseD.useC+useC.releaseD) No new state computed
Name = +releaseC2  I.N.C.R.E.A.S.E
Name = (+useD.releaseC2+releaseC2.useD)  I.N.C.R.E.A.S.E
Name = +useC No new state computed
Name = +req No new state computed
Name = (+releaseC2.useC+useC.releaseC2)  I.N.C.R.E.A.S.E
Name = +return.releaseC2  I.N.C.R.E.A.S.E
Name = +useC.return No new state computed
Name = +useD No new state computed
Name = +releaseD No new state computed
Name = +stop.useC No new state computed
Name = +releaseC2.stop  I.N.C.R.E.A.S.E
Name = (+releaseC1.req+req.releaseC1) No new state computed
Name = +releaseC1.stop No new state computed
Name = +releaseC1.return No new state computed
Name = (+stop.return+return) No new state computed
Name = (+useC.req+req.useC) No new state computed
Name = +return.releaseC1 No new state computed
Name = (+releaseC1.useC+useC.releaseC1) No new state computed
Name = +releaseC1 No new state computed
Name = +releaseC2.return  I.N.C.R.E.A.S.E
Name = (+releaseD.useD+useD.releaseD) No new state computed
Name = +useC.stop No new state computed
increase = 1
**********************
Random choose
Name = +releaseC2.return  OK !
Now we have a representation of size = 3213
Minimization in Progress
Name = +return.releaseC1 No new state computed
Name = (+useD.releaseC2+releaseC2.useD)  I.N.C.R.E.A.S.E
Name = +stop.useC  I.N.C.R.E.A.S.E
Name = +return.releaseC2  I.N.C.R.E.A.S.E
Name = (+useC.req+req.useC) No new state computed
Name = +releaseC1.stop No new state computed
Name = +useC.return No new state computed
Name = +releaseC2  I.N.C.R.E.A.S.E
Name = (+releaseD.useC+useC.releaseD) No new state computed
Name = +useD No new state computed
Name = +releaseC1.return No new state computed
Name = +releaseC2.stop  I.N.C.R.E.A.S.E
Name = (+releaseD.useD+useD.releaseD) No new state computed
Name = (+releaseC1.useC+useC.releaseC1) No new state computed
Name = (+releaseC2.useC+useC.releaseC2)  I.N.C.R.E.A.S.E
Name = +releaseC1 No new state computed
Name = +releaseD No new state computed
Name = +req No new state computed
Name = (+return.stop+stop)  I.N.C.R.E.A.S.E
Name = (+stop.return+return) No new state computed
Name = (+releaseC1.req+req.releaseC1) No new state computed
Name = +useC.stop No new state computed
Name = +useC No new state computed
increase = 1
**********************
Random choose
Name = (+return.stop+stop)  OK !
Now we have a representation of size = 6426
Minimization in Progress
Name = (+releaseC1.useC+useC.releaseC1) No new state computed
Name = (+stop.return+return) No new state computed
Name = (+useC.req+req.useC)  I.N.C.R.E.A.S.E
Name = (+releaseC1.req+req.releaseC1) No new state computed
Name = +releaseD No new state computed
Name = +useC.return  I.N.C.R.E.A.S.E
Name = +useC  I.N.C.R.E.A.S.E
Name = (+releaseC2.useC+useC.releaseC2)  I.N.C.R.E.A.S.E
Name = +releaseC2  I.N.C.R.E.A.S.E
Name = (+releaseD.useC+useC.releaseD) No new state computed
Name = +req No new state computed
Name = (+useD.releaseC2+releaseC2.useD)  I.N.C.R.E.A.S.E
Name = +releaseC2.stop No new state computed
Name = +releaseC1.return No new state computed
Name = +useC.stop No new state computed
Name = +releaseC1 No new state computed
Name = +releaseC1.stop No new state computed
Name = +return.releaseC2  I.N.C.R.E.A.S.E
Name = +useD No new state computed
Name = +return.releaseC1 No new state computed
Name = +releaseC2.return No new state computed
Name = +stop.useC  I.N.C.R.E.A.S.E
Name = (+releaseD.useD+useD.releaseD) No new state computed
increase = 1
**********************
Random choose
Name = +stop.useC  OK !
Now we have a representation of size = 6966
Minimization in Progress
Name = (+releaseC1.req+req.releaseC1) No new state computed
Name = +useC.return  I.N.C.R.E.A.S.E
Name = (+stop.return+return)  I.N.C.R.E.A.S.E
Name = (+useC.req+req.useC) No new state computed
Name = +releaseC2.return  I.N.C.R.E.A.S.E
Name = +releaseC1.return No new state computed
Name = +req No new state computed
Name = +releaseD No new state computed
Name = (+releaseC1.useC+useC.releaseC1) No new state computed
Name = +return.releaseC2  I.N.C.R.E.A.S.E
Name = (+return.stop+stop)  I.N.C.R.E.A.S.E
Name = +return.releaseC1  I.N.C.R.E.A.S.E
Name = +releaseC2.stop No new state computed
Name = +useD No new state computed
Name = +releaseC1 No new state computed
Name = +useC No new state computed
Name = (+releaseC2.useC+useC.releaseC2) 