current set encoding is : lash-lsdf
seed is : 21768
cycles of length 1
(1/9), name = t1, size = 112
(2/9), name = t2, size = 150
(3/9), name = t3, size = 156
(4/9), name = t4, size = 121
(5/9), name = t5, size = 160
(6/9), name = t6, size = 164
(7/9), name = t7, size = 129
(8/9), name = t8, size = 171
(9/9), name = t9, size = 170
**********************
Random choose
Name = t2  No new state computed
Name = t3  No new state computed
Name = t4  OK !
Now we have a representation of size = 44
Minimization in Progress
Name = t5  I.N.C.R.E.A.S.E
Name = t3 No new state computed
Name = t7  I.N.C.R.E.A.S.E
Name = t1  I.N.C.R.E.A.S.E
Name = t6 No new state computed
Name = t8 No new state computed
Name = t9 No new state computed
Name = t2 No new state computed
increase = 1
**********************
Random choose
Name = t1  OK !
Now we have a representation of size = 114
Minimization in Progress
Name = t8 No new state computed
Name = t3 No new state computed
Name = t9 No new state computed
Name = t6 No new state computed
Name = t7  I.N.C.R.E.A.S.E
Name = t5  I.N.C.R.E.A.S.E
Name = t2  I.N.C.R.E.A.S.E
Name = t4  I.N.C.R.E.A.S.E
increase = 1
**********************
Random choose
Name = t4  OK !
Now we have a representation of size = 127
Minimization in Progress
Name = t3 No new state computed
Name = t8 No new state computed
Name = t6 No new state computed
Name = t2  I.N.C.R.E.A.S.E
Name = t5  I.N.C.R.E.A.S.E
Name = t9 No new state computed
Name = t7  I.N.C.R.E.A.S.E
Name = t1 No new state computed
increase = 1
**********************
Random choose
Name = t7  OK !
Now we have a representation of size = 331
Minimization in Progress
Name = t6 No new state computed
Name = t2  I.N.C.R.E.A.S.E
Name = t5  I.N.C.R.E.A.S.E
Name = t4  I.N.C.R.E.A.S.E
Name = t9 No new state computed
Name = t3 No new state computed
Name = t1  I.N.C.R.E.A.S.E
Name = t8  I.N.C.R.E.A.S.E
increase = 1
**********************
Random choose
Name = t8  OK !
Now we have a representation of size = 349
Minimization in Progress
Name = t4  I.N.C.R.E.A.S.E
Name = t5  I.N.C.R.E.A.S.E
Name = t1  I.N.C.R.E.A.S.E
Name = t7 No new state computed
Name = t3 No new state computed
Name = t6 No new state computed
Name = t2  I.N.C.R.E.A.S.E
Name = t9 No new state computed
increase = 1
**********************
Random choose
Name = t2  OK !
Now we have a representation of size = 401
Minimization in Progress
Name = t5  I.N.C.R.E.A.S.E
Name = t6 No new state computed
Name = t8 No new state computed
Name = t9 No new state computed
Name = t4  I.N.C.R.E.A.S.E
Name = t1  I.N.C.R.E.A.S.E
Name = t7 No new state computed
Name = t3 No new state computed
increase = 1
**********************
Random choose
Name = t1  OK !
Now we have a representation of size = 446
Minimization in Progress
Name = t6 No new state computed
Name = t4  I.N.C.R.E.A.S.E
Name = t3 No new state computed
Name = t9 No new state computed
Name = t5  I.N.C.R.E.A.S.E
Name = t8 No new state computed
Name = t2 No new state computed
Name = t7 No new state computed
increase = 1
**********************
Random choose
Name = t5  OK !
Now we have a representation of size = 521
Minimization in Progress
Name = t1 No new state computed
Name = t3 No new state computed
Name = t4  I.N.C.R.E.A.S.E
Name = t7 No new state computed
Name = t2 No new state computed
Name = t9 No new state computed
Name = t8 No new state computed
Name = t6 No new state computed
increase = 1
**********************
Random choose
Name = t4  OK !
Now we have a representation of size = 637
Minimization in Progress
Name = t5 No new state computed
Name = t9 No new state computed
Name = t8 No new state computed
Name = t2 No new state computed
Name = t7 No new state computed
Name = t1  I.N.C.R.E.A.S.E
Name = t6 No new state computed
Name = t3 No new state computed
increase = 1
**********************
Random choose
Name = t1  OK !
Now we have a representation of size = 661
Minimization in Progress
Name = t9 No new state computed
Name = t5 No new state computed
Name = t7 No new state computed
Name = t6 No new state computed
Name = t4 No new state computed
Name = t8 No new state computed
Name = t3 No new state computed
Name = t2 No new state computed
increase = 0
nb accelerations 10
Fix point FOUND
seed is : 21768
