current set encoding is : prestaf-no-among
seed is : 2691
cycles of length 1
(1/3), name = r1, size = 148
(2/3), name = r2, size = 97
(3/3), name = r3, size = 108
**********************
Random choose
Name = r2  No new state computed
Name = r1  OK !
Now we have a representation of size = 9
Minimization in Progress
Name = r3  I.N.C.R.E.A.S.E
Name = r2  I.N.C.R.E.A.S.E
increase = 1
**********************
Random choose
Name = r2  OK !
Now we have a representation of size = 18
Minimization in Progress
Name = r1 No new state computed
Name = r3 No new state computed
increase = 0
nb accelerations 2
Fix point FOUND
seed is : 2691
