current set encoding is : lira
seed is : 2691
(1/400)->
(2/400)->
(3/400)->
(4/400)->
(5/400)->
(6/400)->
(7/400)->
(8/400)->
(9/400)->
(10/400)->
(11/400)->
(12/400)->
(13/400)->
(14/400)->
(15/400)->
(16/400)->
(17/400)->
(18/400)->
(19/400)->
(20/400)->
(21/400)->
(22/400)->
(23/400)->
(24/400)->
(25/400)->
(26/400)->
(27/400)->
(28/400)->
