current set encoding is : mona
seed is : 3284
cycles of length 1
(1/17), name = r2, size = 364
(2/17), name = r3, size = 352
(3/17), name = r4, size = 100
(4/17), name = r5, size = 207
(5/17), name = r6, size = 497
(6/17), name = r7, size = 1504
(7/17), name = r8, size = 5788
(8/17), name = r9, size = 1782
(9/17), name = r10, size = 6956
(10/17), name = r11, size = 145
(11/17), name = r12, size = 791
(12/17), name = r13, size = 1308
(13/17), name = r14, size = 5037
(14/17), name = r15, size = 1371
(15/17), name = r16, size = 5466
(16/17), name = r17, size = 631
(17/17), name = r18, size = 152
**********************
Random choose
Name = r8  No new state computed
Name = r10  No new state computed
Name = r15  No new state computed
Name = r4  No new state computed
Name = r12  No new state computed
Name = r3  No new state computed
Name = r2  OK !
Now we have a representation of size = 134
Minimization in Progress
Name = r7 No new state computed
Name = r12 No new state computed
Name = r18 No new state computed
Name = r15 No new state computed
Name = r4 No new state computed
Name = r11 No new state computed
Name = r14 No new state computed
Name = r6 No new state computed
Name = r5  I.N.C.R.E.A.S.E
Name = r13 No new state computed
Name = r17 No new state computed
Name = r9 No new state computed
Name = r16 No new state computed
Name = r8 No new state computed
Name = r10 No new state computed
Name = r3 No new state computed
increase = 1
**********************
Random choose
Name = r5  OK !
Now we have a representation of size = 262
Minimization in Progress
Name = r7  I.N.C.R.E.A.S.E
Name = r15 No new state computed
Name = r12 No new state computed
Name = r14 No new state computed
Name = r2 No new state computed
Name = r9  I.N.C.R.E.A.S.E
Name = r4 No new state computed
Name = r3 No new state computed
Name = r13 No new state computed
Name = r17 No new state computed
Name = r16 No new state computed
Name = r10  I.N.C.R.E.A.S.E
Name = r11  I.N.C.R.E.A.S.E
Name = r8 No new state computed
Name = r18 No new state computed
Name = r6 No new state computed
increase = 1
**********************
Random choose
Name = r11  OK !
Now we have a representation of size = 289
Minimization in Progress
Name = r16 No new state computed
Name = r7  I.N.C.R.E.A.S.E
Name = r15 No new state computed
Name = r2 No new state computed
Name = r5 No new state computed
Name = r12 No new state computed
Name = r17 No new state computed
Name = r8 No new state computed
Name = r13  I.N.C.R.E.A.S.E
Name = r4 No new state computed
Name = r10  I.N.C.R.E.A.S.E
Name = r18 No new state computed
Name = r14 No new state computed
Name = r6 No new state computed
Name = r3 No new state computed
Name = r9  I.N.C.R.E.A.S.E
increase = 1
**********************
Random choose
Name = r9  OK !
Now we have a representation of size = 634
Minimization in Progress
Name = r13  I.N.C.R.E.A.S.E
Name = r8  I.N.C.R.E.A.S.E
Name = r6 No new state computed
Name = r12 No new state computed
Name = r3 No new state computed
Name = r16 No new state computed
Name = r11  I.N.C.R.E.A.S.E
Name = r17 No new state computed
Name = r4 No new state computed
Name = r14 No new state computed
Name = r18 No new state computed
Name = r15 No new state computed
Name = r2 No new state computed
Name = r7  I.N.C.R.E.A.S.E
Name = r10  I.N.C.R.E.A.S.E
Name = r5 No new state computed
increase = 1
**********************
Random choose
Name = r10  OK !
Now we have a representation of size = 658
Minimization in Progress
Name = r4 No new state computed
Name = r13  I.N.C.R.E.A.S.E
Name = r2 No new state computed
Name = r7  I.N.C.R.E.A.S.E
Name = r18 No new state computed
Name = r8  I.N.C.R.E.A.S.E
Name = r3 No new state computed
Name = r15 No new state computed
Name = r9 No new state computed
Name = r5 No new state computed
Name = r12 No new state computed
Name = r16 No new state computed
Name = r11  I.N.C.R.E.A.S.E
Name = r6 No new state computed
Name = r17 No new state computed
Name = r14 No new state computed
increase = 1
**********************
Random choose
Name = r11  OK !
Now we have a representation of size = 806
Minimization in Progress
Name = r12  OK !
Now we have a representation of size = 806
Name = r15  I.N.C.R.E.A.S.E
Name = r17 No new state computed
Name = r18 No new state computed
Name = r7  I.N.C.R.E.A.S.E
Name = r11 No new state computed
Name = r16 No new state computed
Name = r9 No new state computed
Name = r8  I.N.C.R.E.A.S.E
Name = r4 No new state computed
Name = r6 No new state computed
Name = r14  I.N.C.R.E.A.S.E
Name = r2 No new state computed
Name = r3 No new state computed
Name = r13  I.N.C.R.E.A.S.E
Name = r10 No new state computed
Name = r5 No new state computed
increase = 1
**********************
Random choose
Name = r13  OK !
Now we have a representation of size = 830
Minimization in Progress
Name = r16 No new state computed
Name = r18  I.N.C.R.E.A.S.E
Name = r17 No new state computed
Name = r8  I.N.C.R.E.A.S.E
Name = r12 No new state computed
Name = r11 No new state computed
Name = r6 No new state computed
Name = r15  I.N.C.R.E.A.S.E
Name = r5 No new state computed
Name = r9 No new state computed
Name = r7  I.N.C.R.E.A.S.E
Name = r14  I.N.C.R.E.A.S.E
Name = r2 No new state computed
Name = r4 No new state computed
Name = r10 No new state computed
Name = r3 No new state computed
increase = 1
**********************
Random choose
Name = r14  OK !
Now we have a representation of size = 843
Minimization in Progress
Name = r15  I.N.C.R.E.A.S.E
Name = r4 No new state computed
Name = r5 No new state computed
Name = r10 No new state computed
Name = r2 No new state computed
Name = r12 No new state computed
Name = r6 No new state computed
Name = r17 No new state computed
Name = r11 No new state computed
Name = r3 No new state computed
Name = r18  I.N.C.R.E.A.S.E
Name = r9 No new state computed
Name = r13 No new state computed
Name = r16 No new state computed
Name = r8  I.N.C.R.E.A.S.E
Name = r7  I.N.C.R.E.A.S.E
increase = 1
**********************
Random choose
Name = r7  OK !
Now we have a representation of size = 2467
Minimization in Progress
Name = r12 No new state computed
Name = r13 No new state computed
Name = r9  OK !
Now we have a representation of size = 1237
Name = r10  I.N.C.R.E.A.S.E
Name = r11  I.N.C.R.E.A.S.E
Name = r2 No new state computed
Name = r15  I.N.C.R.E.A.S.E
Name = r3 No new state computed
Name = r8  I.N.C.R.E.A.S.E
Name = r17 No new state computed
Name = r18  I.N.C.R.E.A.S.E
Name = r7 No new state computed
Name = r16 No new state computed
Name = r13 No new state computed
Name = r4 No new state computed
Name = r6 No new state computed
Name = r12 No new state computed
Name = r5 No new state computed
Name = r14 No new state computed
increase = 1
**********************
Random choose
Name = r18  OK !
Now we have a representation of size = 1252
Minimization in Progress
Name = r9 No new state computed
Name = r12 No new state computed
Name = r11  I.N.C.R.E.A.S.E
Name = r13 No new state computed
Name = r4 No new state computed
Name = r16 No new state computed
Name = r6 No new state computed
Name = r2 No new state computed
Name = r10  I.N.C.R.E.A.S.E
Name = r14 No new state computed
Name = r17 No new state computed
Name = r7 No new state computed
Name = r15  I.N.C.R.E.A.S.E
Name = r8  I.N.C.R.E.A.S.E
Name = r3 No new state computed
Name = r5 No new state computed
increase = 1
**********************
Random choose
Name = r8  OK !
Now we have a representation of size = 5399
Minimization in Progress
Name = r18 No new state computed
Name = r13 No new state computed
Name = r9 No new state computed
Name = r15  I.N.C.R.E.A.S.E
Name = r6 No new state computed
Name = r16 No new state computed
Name = r12 No new state computed
Name = r10  I.N.C.R.E.A.S.E
Name = r3 No new state computed
Name = r11  I.N.C.R.E.A.S.E
Name = r4 No new state computed
Name = r17 No new state computed
Name = r2 No new state computed
Name = r5 No new state computed
Name = r7 No new state computed
Name = r14 No new state computed
increase = 1
**********************
Random choose
Name = r11  OK !
Now we have a representation of size = 6201
Minimization in Progress
Name = r15  I.N.C.R.E.A.S.E
Name = r13  I.N.C.R.E.A.S.E
Name = r7 No new state computed
Name = r2 No new state computed
Name = r10  I.N.C.R.E.A.S.E
Name = r18 No new state computed
Name = r3 No new state computed
Name = r9 No new state computed
Name = r4 No new state computed
Name = r12  I.N.C.R.E.A.S.E
Name = r17 No new state computed
Name = r8 No new state computed
Name = r5 No new state computed
Name = r6 No new state computed
Name = r16  I.N.C.R.E.A.S.E
Name = r14  I.N.C.R.E.A.S.E
increase = 1
**********************
Random choose
Name = r14  OK !
Now we have a representation of size = 6625
Minimization in Progress
Name = r7 No new state computed
Name = r8 No new state computed
Name = r15  I.N.C.R.E.A.S.E
Name = r11 No new state computed
Name = r12  OK !
Now we have a representation of size = 6508
Name = r7 No new state computed
Name = r18 No new state computed
Name = r2 No new state computed
Name = r15  I.N.C.R.E.A.S.E
Name = r3 No new state computed
Name = r11 No new state computed
Name = r14 No new state computed
Name = r4 No new state computed
Name = r9 No new state computed
Name = r6 No new state computed
Name = r13  I.N.C.R.E.A.S.E
Name = r5 No new state computed
Name = r8 No new state computed
Name = r16  I.N.C.R.E.A.S.E
Name = r10  I.N.C.R.E.A.S.E
Name = r17 No new state computed
increase = 1
**********************
Random choose
Name = r10  OK !
Now we have a representation of size = 10626
Minimization in Progress
Name = r8 No new state computed
Name = r6 No new state computed
Name = r4 No new state computed
Name = r17 No new state computed
Name = r15  I.N.C.R.E.A.S.E
Name = r7 No new state computed
Name = r16  I.N.C.R.E.A.S.E
Name = r9 No new state computed
Name = r13  I.N.C.R.E.A.S.E
Name = r12 No new state computed
Name = r3 No new state computed
Name = r5 No new state computed
Name = r11  I.N.C.R.E.A.S.E
Name = r18 No new state computed
Name = r14 No new state computed
Name = r2 No new state computed
increase = 1
**********************
Random choose
Name = r11  OK !
Now we have a representation of size = 10900
Minimization in Progress
Name = r18 No new state computed
Name = r12  OK !
Now we have a representation of size = 10859
Name = r4 No new state computed
Name = r13  I.N.C.R.E.A.S.E
Name = r10 No new state computed
Name = r5 No new state computed
Name = r3 No new state computed
Name = r8 No new state computed
Name = r15  I.N.C.R.E.A.S.E
Name = r17 No new state computed
Name = r11 No new state computed
Name = r7 No new state computed
Name = r14 No new state computed
Name = r18 No new state computed
Name = r9 No new state computed
Name = r6 No new state computed
Name = r2 No new state computed
Name = r16 No new state computed
increase = 1
**********************
Random choose
Name = r15  OK !
Now we have a representation of size = 14040
Minimization in Progress
Name = r9 No new state computed
Name = r6 No new state computed
Name = r7 No new state computed
Name = r14 No new state computed
Name = r3 No new state computed
Name = r10 No new state computed
Name = r17 No new state computed
Name = r4 No new state computed
Name = r16 No new state computed
Name = r5 No new state computed
Name = r13  I.N.C.R.E.A.S.E
Name = r18  I.N.C.R.E.A.S.E
Name = r12 No new state computed
Name = r8 No new state computed
Name = r11 No new state computed
Name = r2 No new state computed
increase = 1
**********************
Random choose
Name = r18  OK !
Now we have a representation of size = 14403
Minimization in Progress
Name = r11 No new state computed
Name = r9 No new state computed
Name = r3 No new state computed
Name = r17 No new state computed
Name = r2 No new state computed
Name = r12 No new state computed
Name = r13  I.N.C.R.E.A.S.E
Name = r5 No new state computed
Name = r8 No new state computed
Name = r10 No new state computed
Name = r15 No new state computed
Name = r4 No new state computed
Name = r7 No new state computed
Name = r14 No new state computed
Name = r6 No new state computed
Name = r16 No new state computed
increase = 1
**********************
Random choose
Name = r13  OK !
Now we have a representation of size = 17109
Minimization in Progress
Name = r10 No new state computed
Name = r15 No new state computed
Name = r14 No new state computed
Name = r17 No new state computed
Name = r16 No new state computed
Name = r8 No new state computed
Name = r11 No new state computed
Name = r4 No new state computed
Name = r3 No new state computed
Name = r9 No new state computed
Name = r5 No new state computed
Name = r6 No new state computed
Name = r2 No new state computed
Name = r12 No new state computed
Name = r18  I.N.C.R.E.A.S.E
Name = r7 No new state computed
increase = 1
**********************
Random choose
Name = r18  OK !
Now we have a representation of size = 17412
Minimization in Progress
Name = r17 No new state computed
Name = r15 No new state computed
Name = r6 No new state computed
Name = r2 No new state computed
Name = r12 No new state computed
Name = r5 No new state computed
Name = r16 No new state computed
Name = r8 No new state computed
Name = r9 No new state computed
Name = r11 No new state computed
Name = r3 No new state computed
Name = r7 No new state computed
Name = r13 No new state computed
Name = r4 No new state computed
Name = r14 No new state computed
Name = r10 No new state computed
increase = 0
nb accelerations 23
Fix point FOUND
seed is : 3284
