current set encoding is : lash-msdf
seed is : 2691
cycles of length 1
(1/12), name = t1, size = 165
(2/12), name = t2, size = 165
(3/12), name = t3, size = 165
(4/12), name = t4, size = 165
(5/12), name = t5, size = 189
(6/12), name = t6, size = 165
(7/12), name = t7, size = 177
(8/12), name = t8, size = 165
(9/12), name = t9, size = 171
(10/12), name = t10, size = 171
(11/12), name = t11, size = 165
(12/12), name = t12, size = 201
**********************
Random choose
Name = t5  No new state computed
Name = t1  OK !
Now we have a representation of size = 22
Minimization in Progress
Name = t5 No new state computed
Name = t9 No new state computed
Name = t11 No new state computed
Name = t6 No new state computed
Name = t7 No new state computed
Name = t8 No new state computed
Name = t12 No new state computed
Name = t2  I.N.C.R.E.A.S.E
Name = t4 No new state computed
Name = t10 No new state computed
Name = t3 No new state computed
increase = 1
**********************
Random choose
Name = t2  OK !
Now we have a representation of size = 23
Minimization in Progress
Name = t4 No new state computed
Name = t5 No new state computed
Name = t11 No new state computed
Name = t6 No new state computed
Name = t10 No new state computed
Name = t1 No new state computed
Name = t3  I.N.C.R.E.A.S.E
Name = t7 No new state computed
Name = t12 No new state computed
Name = t9 No new state computed
Name = t8 No new state computed
increase = 1
**********************
Random choose
Name = t3  OK !
Now we have a representation of size = 24
Minimization in Progress
Name = t8 No new state computed
Name = t10 No new state computed
Name = t5  I.N.C.R.E.A.S.E
Name = t9 No new state computed
Name = t6 No new state computed
Name = t4  I.N.C.R.E.A.S.E
Name = t1 No new state computed
Name = t11 No new state computed
Name = t2 No new state computed
Name = t12 No new state computed
Name = t7 No new state computed
increase = 1
**********************
Random choose
Name = t4  OK !
Now we have a representation of size = 25
Minimization in Progress
Name = t1 No new state computed
Name = t3 No new state computed
Name = t9 No new state computed
Name = t8 No new state computed
Name = t10 No new state computed
Name = t2 No new state computed
Name = t7 No new state computed
Name = t5  I.N.C.R.E.A.S.E
Name = t11 No new state computed
Name = t6  I.N.C.R.E.A.S.E
Name = t12 No new state computed
increase = 1
**********************
Random choose
Name = t6  OK !
Now we have a representation of size = 26
Minimization in Progress
Name = t7  I.N.C.R.E.A.S.E
Name = t5  I.N.C.R.E.A.S.E
Name = t12 No new state computed
Name = t9  I.N.C.R.E.A.S.E
Name = t11 No new state computed
Name = t2 No new state computed
Name = t1 No new state computed
Name = t4 No new state computed
Name = t10 No new state computed
Name = t8  I.N.C.R.E.A.S.E
Name = t3 No new state computed
increase = 1
**********************
Random choose
Name = t8  OK !
Now we have a representation of size = 27
Minimization in Progress
Name = t7  I.N.C.R.E.A.S.E
Name = t3 No new state computed
Name = t6 No new state computed
Name = t1 No new state computed
Name = t10  I.N.C.R.E.A.S.E
Name = t5  I.N.C.R.E.A.S.E
Name = t4 No new state computed
Name = t9  I.N.C.R.E.A.S.E
Name = t2 No new state computed
Name = t11 No new state computed
Name = t12 No new state computed
increase = 1
**********************
Random choose
Name = t9  OK !
Now we have a representation of size = 28
Minimization in Progress
Name = t7  I.N.C.R.E.A.S.E
Name = t8 No new state computed
Name = t6 No new state computed
Name = t10  I.N.C.R.E.A.S.E
Name = t2 No new state computed
Name = t1 No new state computed
Name = t12 No new state computed
Name = t4 No new state computed
Name = t5  I.N.C.R.E.A.S.E
Name = t11  I.N.C.R.E.A.S.E
Name = t3 No new state computed
increase = 1
**********************
Random choose
Name = t11  OK !
Now we have a representation of size = 29
Minimization in Progress
Name = t8 No new state computed
Name = t3 No new state computed
Name = t4 No new state computed
Name = t12 No new state computed
Name = t10 No new state computed
Name = t2 No new state computed
Name = t1 No new state computed
Name = t5 No new state computed
Name = t9 No new state computed
Name = t6 No new state computed
Name = t7 No new state computed
increase = 0
nb accelerations 8
Fix point FOUND
seed is : 2691
