current set encoding is : lira
seed is : 3284
cycles of length 1
(1/12), name = t1, size = 9
(2/12), name = t2, size = 9
(3/12), name = t3, size = 9
(4/12), name = t4, size = 9
(5/12), name = t5, size = 9
(6/12), name = t6, size = 9
(7/12), name = t7, size = 9
(8/12), name = t8, size = 9
(9/12), name = t9, size = 9
(10/12), name = t10, size = 9
(11/12), name = t11, size = 9
(12/12), name = t12, size = 9
**********************
Random choose
Name = t5  No new state computed
Name = t6  No new state computed
Name = t9  No new state computed
Name = t2  No new state computed
Name = t7  No new state computed
Name = t10  No new state computed
Name = t1  OK !
Now we have a representation of size = 6
Minimization in Progress
Name = t4 No new state computed
Name = t8 No new state computed
Name = t12 No new state computed
Name = t9 No new state computed
Name = t2  OK !
Now we have a representation of size = 6
Name = t10 No new state computed
Name = t1 No new state computed
Name = t5 No new state computed
Name = t4 No new state computed
Name = t3  OK !
Now we have a representation of size = 6
Name = t10 No new state computed
Name = t7 No new state computed
Name = t1 No new state computed
Name = t6 No new state computed
Name = t12 No new state computed
Name = t2 No new state computed
Name = t8 No new state computed
Name = t4  OK !
Now we have a representation of size = 6
Name = t9 No new state computed
Name = t10 No new state computed
Name = t1 No new state computed
Name = t6  OK !
Now we have a representation of size = 6
Name = t3 No new state computed
Name = t2 No new state computed
Name = t1 No new state computed
Name = t12 No new state computed
Name = t9  OK !
Now we have a representation of size = 6
Name = t4 No new state computed
Name = t6 No new state computed
Name = t2 No new state computed
Name = t3 No new state computed
Name = t7  OK !
Now we have a representation of size = 6
Name = t10 No new state computed
Name = t4 No new state computed
Name = t9 No new state computed
Name = t1 No new state computed
Name = t2 No new state computed
Name = t6 No new state computed
Name = t3 No new state computed
Name = t5 No new state computed
Name = t12 No new state computed
Name = t8  OK !
Now we have a representation of size = 6
Name = t5 No new state computed
Name = t11 No new state computed
Name = t1 No new state computed
Name = t7 No new state computed
Name = t10 No new state computed
Name = t3 No new state computed
Name = t4 No new state computed
Name = t2 No new state computed
Name = t12 No new state computed
Name = t6 No new state computed
Name = t9 No new state computed
increase = 0
nb accelerations 8
Fix point FOUND
seed is : 3284
