current set encoding is : mona
seed is : 3284
cycles of length 1
(1/12), name = t1, size = 155
(2/12), name = t2, size = 94
(3/12), name = t3, size = 167
(4/12), name = t4, size = 100
(5/12), name = t5, size = 179
(6/12), name = t6, size = 106
(7/12), name = t7, size = 191
(8/12), name = t8, size = 112
(9/12), name = t9, size = 122
(10/12), name = t10, size = 170
(11/12), name = t11, size = 169
(12/12), name = t12, size = 102
**********************
Random choose
Name = t5  No new state computed
Name = t6  No new state computed
Name = t9  OK !
Now we have a representation of size = 20
Minimization in Progress
Name = t3  I.N.C.R.E.A.S.E
Name = t12 No new state computed
Name = t2 No new state computed
Name = t1  I.N.C.R.E.A.S.E
Name = t11 No new state computed
Name = t5  I.N.C.R.E.A.S.E
Name = t8 No new state computed
Name = t6 No new state computed
Name = t4 No new state computed
Name = t10 No new state computed
Name = t7  I.N.C.R.E.A.S.E
increase = 1
**********************
Random choose
Name = t7  OK !
Now we have a representation of size = 26
Minimization in Progress
Name = t5  OK !
Now we have a representation of size = 26
Name = t12 No new state computed
Name = t11 No new state computed
Name = t8 No new state computed
Name = t6 No new state computed
Name = t1  OK !
Now we have a representation of size = 26
Name = t8 No new state computed
Name = t4 No new state computed
Name = t2 No new state computed
Name = t3  OK !
Now we have a representation of size = 26
Name = t11 No new state computed
Name = t8 No new state computed
Name = t9 No new state computed
Name = t1 No new state computed
Name = t5 No new state computed
Name = t2 No new state computed
Name = t10  I.N.C.R.E.A.S.E
Name = t7 No new state computed
Name = t12 No new state computed
Name = t4 No new state computed
Name = t6 No new state computed
increase = 1
**********************
Random choose
Name = t10  OK !
Now we have a representation of size = 38
Minimization in Progress
Name = t7 No new state computed
Name = t2 No new state computed
Name = t4 No new state computed
Name = t8 No new state computed
Name = t11  I.N.C.R.E.A.S.E
Name = t3 No new state computed
Name = t5 No new state computed
Name = t1 No new state computed
Name = t9 No new state computed
Name = t12 No new state computed
Name = t6 No new state computed
increase = 1
**********************
Random choose
Name = t11  OK !
Now we have a representation of size = 46
Minimization in Progress
Name = t8  I.N.C.R.E.A.S.E
Name = t4  I.N.C.R.E.A.S.E
Name = t10 No new state computed
Name = t9 No new state computed
Name = t12 No new state computed
Name = t1 No new state computed
Name = t5 No new state computed
Name = t3 No new state computed
Name = t2  I.N.C.R.E.A.S.E
Name = t7 No new state computed
Name = t6  I.N.C.R.E.A.S.E
increase = 1
**********************
Random choose
Name = t6  OK !
Now we have a representation of size = 47
Minimization in Progress
Name = t4 No new state computed
Name = t8 No new state computed
Name = t1 No new state computed
Name = t5 No new state computed
Name = t7 No new state computed
Name = t9 No new state computed
Name = t2 No new state computed
Name = t11 No new state computed
Name = t10 No new state computed
Name = t3 No new state computed
Name = t12 No new state computed
increase = 0
nb accelerations 8
Fix point FOUND
seed is : 3284
