current set encoding is : lira
seed is : 21768
cycles of length 1
(1/10), name = r1, size = 14
(2/10), name = r2, size = 17
(3/10), name = r3, size = 14
(4/10), name = r4, size = 14
(5/10), name = r5, size = 14
(6/10), name = r6, size = 17
(7/10), name = r7, size = 14
(8/10), name = r8, size = 17
(9/10), name = r9, size = 9
(10/10), name = r10, size = 9
**********************
Random choose
Name = r2  No new state computed
Name = r3  OK !
Now we have a representation of size = 6
Minimization in Progress
Name = r5 No new state computed
Name = r9 No new state computed
Name = r10 No new state computed
Name = r7  I.N.C.R.E.A.S.E
Name = r1  OK !
Now we have a representation of size = 6
Name = r6  I.N.C.R.E.A.S.E
Name = r10 No new state computed
Name = r2 No new state computed
Name = r4 No new state computed
Name = r5  I.N.C.R.E.A.S.E
Name = r7  I.N.C.R.E.A.S.E
Name = r8  I.N.C.R.E.A.S.E
Name = r3 No new state computed
Name = r9 No new state computed
increase = 1
**********************
Random choose
Name = r8  OK !
Now we have a representation of size = 8
Minimization in Progress
Name = r2 No new state computed
Name = r5  I.N.C.R.E.A.S.E
Name = r3 No new state computed
Name = r9 No new state computed
Name = r6  I.N.C.R.E.A.S.E
Name = r4 No new state computed
Name = r1 No new state computed
Name = r7 No new state computed
Name = r10  OK !
Now we have a representation of size = 8
Name = r5  I.N.C.R.E.A.S.E
Name = r6  I.N.C.R.E.A.S.E
Name = r8 No new state computed
Name = r1 No new state computed
Name = r4 No new state computed
Name = r9 No new state computed
Name = r2 No new state computed
Name = r3 No new state computed
Name = r7 No new state computed
increase = 1
**********************
Random choose
Name = r6  OK !
Now we have a representation of size = 10
Minimization in Progress
Name = r9  OK !
Now we have a representation of size = 10
Name = r4 No new state computed
Name = r6 No new state computed
Name = r1 No new state computed
Name = r8 No new state computed
Name = r10 No new state computed
Name = r2 No new state computed
Name = r5  OK !
Now we have a representation of size = 10
Name = r6 No new state computed
Name = r10 No new state computed
Name = r9  OK !
Now we have a representation of size = 10
Name = r7 No new state computed
Name = r3 No new state computed
Name = r6 No new state computed
Name = r2 No new state computed
Name = r8 No new state computed
Name = r1 No new state computed
Name = r10 No new state computed
Name = r4 No new state computed
Name = r5 No new state computed
increase = 0
nb accelerations 8
Fix point FOUND
seed is : 21768
