current set encoding is : lira
seed is : 3284
cycles of length 1
(1/3), name = r2, size = 13
(2/3), name = r3, size = 13
(3/3), name = r4, size = 7
**********************
Random choose
Name = r3  No new state computed
Name = r4  No new state computed
Name = r2  OK !
Now we have a representation of size = 11
Minimization in Progress
Name = r4 No new state computed
Name = r3 No new state computed
increase = 0
nb accelerations 1
Fix point FOUND
cycles of length 1
(1/1), name = r5, size = 12
**********************
Random choose
Name = r5  OK !
Now we have a representation of size = 21
Minimization in Progress
increase = 0
nb accelerations 1
Fix point FOUND
cycles of length 1
(1/5), name = r6, size = 14
(2/5), name = r7, size = 38
(3/5), name = r8, size = 134
(4/5), name = r9, size = 38
(5/5), name = r10, size = 134
**********************
Random choose
Name = r6  No new state computed
Name = r7  OK !
Now we have a representation of size = 35
Minimization in Progress
Name = r8 No new state computed
Name = r6 No new state computed
Name = r9  I.N.C.R.E.A.S.E
Name = r10  I.N.C.R.E.A.S.E
increase = 1
**********************
Random choose
Name = r10  OK !
Now we have a representation of size = 118
Minimization in Progress
Name = r9  I.N.C.R.E.A.S.E
Name = r6 No new state computed
Name = r8 No new state computed
Name = r7 No new state computed
increase = 1
**********************
Random choose
Name = r9  OK !
Now we have a representation of size = 243
Minimization in Progress
Name = r7  OK !
Now we have a representation of size = 229
Name = r9 No new state computed
Name = r8  I.N.C.R.E.A.S.E
Name = r6 No new state computed
Name = r10  I.N.C.R.E.A.S.E
increase = 1
**********************
Random choose
Name = r10  OK !
Now we have a representation of size = 309
Minimization in Progress
Name = r7 No new state computed
Name = r6 No new state computed
Name = r8  I.N.C.R.E.A.S.E
Name = r9 No new state computed
increase = 1
**********************
Random choose
Name = r8  OK !
Now we have a representation of size = 611
Minimization in Progress
Name = r9 No new state computed
Name = r10 No new state computed
Name = r6 No new state computed
Name = r7 No new state computed
increase = 0
nb accelerations 6
Fix point FOUND
cycles of length 1
(1/1), name = r11, size = 9
**********************
Random choose
Name = r11  OK !
Now we have a representation of size = 696
Minimization in Progress
increase = 0
nb accelerations 1
Fix point FOUND
cycles of length 1
(1/6), name = r12, size = 21
(2/6), name = r13, size = 33
(3/6), name = r14, size = 113
(4/6), name = r15, size = 33
(5/6), name = r16, size = 113
(6/6), name = r17, size = 50
**********************
Random choose
Name = r12  OK !
Now we have a representation of size = 745
Minimization in Progress
Name = r17 No new state computed
Name = r14  OK !
Now we have a representation of size = 737
Name = r12 No new state computed
Name = r13  I.N.C.R.E.A.S.E
Name = r15  I.N.C.R.E.A.S.E
Name = r16 No new state computed
Name = r17 No new state computed
increase = 1
**********************
Random choose
Name = r15  OK !
Now we have a representation of size = 904
Minimization in Progress
Name = r16 No new state computed
Name = r17 No new state computed
Name = r13  I.N.C.R.E.A.S.E
Name = r14 No new state computed
Name = r12 No new state computed
increase = 1
**********************
Random choose
Name = r13  OK !
Now we have a representation of size = 1197
Minimization in Progress
Name = r17 No new state computed
Name = r15 No new state computed
Name = r16 