current set encoding is : prestaf-no-among
seed is : 3284
(1/64)->
(2/64)->
(3/64)->
(4/64)->
(5/64)->
(6/64)->
(7/64)->
(8/64)->
(9/64)->
(10/64)->
(11/64)->
(12/64)->
(13/64)->
(14/64)->
(15/64)->
(16/64)->
(17/64)->
(18/64)->
(19/64)->
(20/64)->
(21/64)->
(22/64)->
(23/64)->
(24/64)->
(25/64)->
(26/64)->
(27/64)->
(28/64)->
(29/64)->
(30/64)->
(31/64)->
(32/64)->
(33/64)->
(34/64)->
(35/64)->
(36/64)->
(37/64)->
(38/64)->
(39/64)->
(40/64)->
(41/64)->
(42/64)->
(43/64)->
(44/64)->
(45/64)->
(46/64)->
(47/64)->
(48/64)->
(49/64)->
(50/64)->
(51/64)->
(52/64)->
(53/64)->
(54/64)->
(55/64)->
(56/64)->
(57/64)->
(58/64)->
(59/64)->
(60/64)->
(61/64)->
(62/64)->
(63/64)->
(64/64)->
Simplification of the linear system 
2 functions have the same action, it remains only 1
2 functions have the same action, it remains only 1
1 functions have the same action, it remains only 1
1 functions have the same action, it remains only 1
2 functions have the same action, it remains only 1
2 functions have the same action, it remains only 1
2 functions have the same action, it remains only 1
2 functions have the same action, it remains only 1
1 functions have the same action, it remains only 1
1 functions have the same action, it remains only 1
1 functions have the same action, it remains only 1
1 functions have the same action, it remains only 1
1 functions have the same action, it remains only 1
1 functions have the same action, it remains only 1
1 functions have the same action, it remains only 1
1 functions have the same action, it remains only 1
1 functions have the same action, it remains only 1
2 functions have the same action, it remains only 1
1 functions have the same action, it remains only 1
1 functions have the same action, it remains only 1
2 functions have the same action, it remains only 1
2 functions have the same action, it remains only 1
2 functions have the same action, it remains only 1
2 functions have the same action, it remains only 1
1 functions have the same action, it remains only 1
3 functions have the same action, it remains only 1
2 functions have the same action, it remains only 1
1 functions have the same action, it remains only 1
1 functions have the same action, it remains only 1
1 functions have the same action, it remains only 1
Number of actions before simplification : 44
Number of actions after simplification  : 30
(1/240)->
(2/240)->
(3/240)->
(4/240)->
(5/240)->
(6/240)->
(7/240)->
(8/240)->
(9/240)->
(10/240)->
(11/240)->
(12/240)->
(13/240)->
(14/240)->
(15/240)->
(16/240)->
(17/240)->
(18/240)->
(19/240)->
(20/240)->
(21/240)->
(22/240)->
(23/240)->
(24/240)->
(25/240)->
(26/240)->
(27/240)->
(28/240)->
(29/240)->
(30/240)->
(31/240)->
(32/240)->
(33/240)->
(34/240)->
(35/240)->
(36/240)->
(37/240)->
(38/240)->
(39/240)->
(40/240)->
(41/240)->
(42/240)->
(43/240)->
(44/240)->
(45/240)->
(46/240)->
(47/240)->
(48/240)->
(49/240)->
(50/240)->
(51/240)->
(52/240)->
(53/240)->
(54/240)->
(55/240)->
(56/240)->
(57/240)->
(58/240)->
(59/240)->
(60/240)->
(61/240)->
(62/240)->
(63/240)->
(64/240)->
(65/240)->
(66/240)->
(67/240)->
(68/240)->
(69/240)->
(70/240)->
(71/240)->
(72/240)->
(73/240)->
(74/240)->
(75/240)->
(76/240)->
(77/240)->
(78/240)->
(79/240)->
(80/240)->
(81/240)->
(82/240)->
(83/240)->
(84/240)->
(85/240)->
(86/240)->
(87/240)->
(88/240)->
(89/240)->
(90/240)->
(91/240)->
(92/240)->
(93/240)->
(94/240)->
(95/240)->
(96/240)->
(97/240)->
(98/240)->
(99/240)->
(100/240)->
(101/240)->
(102/240)->
(103/240)->
(104/240)->
(105/240)->
(106/240)->
(107/240)->
(108/240)->
(109/240)->
(110/240)->
(111/240)->
(112/240)->
(113/240)->
(114/240)->
(115/240)->
(116/240)->
(117/240)->
(118/240)->
(119/240)->
(120/240)->
(121/240)->
(122/240)->
(123/240)->
(124/240)->
(125/240)->
(126/240)->
(127/240)->
(128/240)->
(129/240)->
(130/240)->
(131/240)->
(132/240)->
(133/240)->
(134/240)->
(135/240)->
(136/240)->
(137/240)->
(138/240)->
(139/240)->
(140/240)->
(141/240)->
(142/240)->
(143/240)->
(144/240)->
(145/240)->
(146/240)->
(147/240)->
(148/240)->
(149/240)->
(150/240)->
(151/240)->
(152/240)->
(153/240)->
(154/240)->
(155/240)->
(156/240)->
(157/240)->
(158/240)->
(159/240)->
(160/240)->
(161/240)->
(162/240)->
(163/240)->
(164/240)->
(165/240)->
(166/240)->
(167/240)->
(168/240)->
(169/240)->
(170/240)->
(171/240)->
(172/240)->
(173/240)->
(174/240)->
(175/240)->
(176/240)->
(177/240)->
(178/240)->
(179/240)->
(180/240)->
(181/240)->
(182/240)->
(183/240)->
(184/240)->
(185/240)->
(186/240)->
(187/240)->
(188/240)->
(189/240)->
(190/240)->
(191/240)->
(192/240)->
(193/240)->
(194/240)->
(195/240)->
(196/240)->
(197/240)->
(198/240)->
(199/240)->
(200/240)->
(201/240)->
(202/240)->
(203/240)->
(204/240)->
(205/240)->
(206/240)->
(207/240)->
(208/240)->
(209/240)->
(210/240)->
(211/240)->
(212/240)->
(213/240)->
(214/240)->
(215/240)->
(216/240)->
(217/240)->
(218/240)->
(219/240)->
(220/240)->
(221/240)->
(222/240)->
(223/240)->
(224/240)->
(225/240)->
(226/240)->
(227/240)->
(228/240)->
(229/240)->
(230/240)->
(231/240)->
(232/240)->
(233/240)->
(234/240)->
(235/240)->
(236/240)->
(237/240)->
(238/240)->
(239/240)->
(240/240)->
Simplification of the linear system 
2 functions have the same action, it remains only 1
1 functions have the same action, it remains only 1
3 functions have the same action, it remains only 1
2 functions have the same action, it remains only 1
3 functions have the same action, it remains only 1
2 functions have the same action, it remains only 1
2 functions have the same action, it remains only 1
2 functions have the same action, it remains only 1
3 functions have the same action, it remains only 1
2 functions have the same action, it remains only 1
1 functions have the same action, it remains only 1
2 functions have the same action, it remains only 1
1 functions have the same action, it remains only 1
2 functions have the same action, it remains only 1
2 functions have the same action, it remains only 1
2 functions have the same action, it remains only 1
2 functions have the same action, it remains only 1
3 functions have the same action, it remains only 1
3 functions have the same action, it remains only 1
3 functions have the same action, it remains only 1
2 functions have the same action, it remains only 1
2 functions have the same action, it remains only 1
2 functions have the same action, it remains only 1
3 functions have the same action, it remains only 1
2 functions have the same action, it remains only 1
2 functions have the same action, it remains only 1
1 functions have the same action, it remains only 1
1 functions have the same action, it remains only 1
1 functions have the same action, it remains only 1
3 functions have the same action, it remains only 1
2 functions have the same action, it remains only 1
2 functions have the same action, it remains only 1
2 functions have the same action, it remains only 1
2 functions have the same action, it remains only 1
2 functions have the same action, it remains only 1
1 functions have the same action, it remains only 1
2 functions have the same action, it remains only 1
2 functions have the same action, it remains only 1
1 functions have the same action, it remains only 1
1 functions have the same action, it remains only 1
1 functions have the same action, it remains only 1
1 functions have the same action, it remains only 1
3 functions have the same action, it remains only 1
2 functions have the same action, it remains only 1
2 functions have the same action, it remains only 1
3 functions have the same action, it remains only 1
3 functions have the same action, it remains only 1
2 functions have the same action, it remains only 1
2 functions have the same action, it remains only 1
1 functions have the same action, it remains only 1
2 functions have the same action, it remains only 1
2 functions have the same action, it remains only 1
3 functions have the same action, it remains only 1
2 functions have the same action, it remains only 1
1 functions have the same action, it remains only 1
1 functions have the same action, it remains only 1
2 functions have the same action, it remains only 1
2 functions have the same action, it remains only 1
1 functions have the same action, it remains only 1
1 functions have the same action, it remains only 1
2 functions have the same action, it remains only 1
1 functions have the same action, it remains only 1
1 functions have the same action, it remains only 1
1 functions have the same action, it remains only 1
1 functions have the same action, it remains only 1
1 functions have the same action, it remains only 1
3 functions have the same action, it remains only 1
2 functions have the same action, it remains only 1
2 functions have the same action, it remains only 1
1 functions have the same action, it remains only 1
2 functions have the same action, it remains only 1
2 functions have the same action, it remains only 1
1 functions have the same action, it remains only 1
3 functions have the same action, it remains only 1
3 functions have the same action, it remains only 1
3 functions have the same action, it remains only 1
3 functions have the same action, it remains only 1
3 functions have the same action, it remains only 1
1 functions have the same action, it remains only 1
2 functions have the same action, it remains only 1
3 functions have the same action, it remains only 1
1 functions have the same action, it remains only 1
4 functions have the same action, it remains only 1
2 functions have the same action, it remains only 1
3 functions have the same action, it remains only 1
3 functions have the same action, it remains only 1
4 functions have the same action, it remains only 1
1 functions have the same action, it remains only 1
2 functions have the same action, it remains only 1
2 functions have the same action, it remains only 1
2 functions have the same action, it remains only 1
1 functions have the same action, it remains only 1
1 functions have the same action, it remains only 1
2 functions have the same action, it remains only 1
2 functions have the same action, it remains only 1
1 functions have the same action, it remains only 1
1 functions have the same action, it remains only 1
Number of actions before simplification : 189
Number of actions after simplification  : 97
cycles of length 3
(1/97), name = (+reqS.(+reqE1.inv1+inv1.reqE1)+reqE1.(+inv1.reqS+reqS.inv1)), size = 3687
(2/97), name = +reqE1.+inv1.nonex, size = 3883
(3/97), name = (+reqE1.+inv1+inv1.+reqE1+(+reqE1.inv1+inv1.reqE1)), size = 2047
(4/97), name = (+reqS.+inv1.nonex+inv1.(+nonex.reqS+reqS.nonex)), size = 1048
(5/97), name = (+reqS.+inv1+inv1.+reqS+(+inv1.reqS+reqS.inv1)), size = 1064
(6/97), name = (+reqS.(+grantE.reqE1+reqE1.grantE)+reqE1.(+grantE.reqS+reqS.grantE)), size = 9031
(7/97), name = (+reqS.(+grantE.reqE2+reqE2.grantE)+reqE2.(+grantE.reqS+reqS.grantE)), size = 13335
(8/97), name = (+inv1.+nonex++inv1.nonex), size = 516
(9/97), name = (+grantS.(+reqE1.inv1+inv1.reqE1)+reqE1.(+grantS.inv1+inv1.grantS)+inv1.(+reqE1.grantS+grantS.reqE1)), size = 1770
(10/97), name = (+reqE2.(+grantS.inv1+inv1.grantS)+inv1.(+reqE2.grantS+grantS.reqE2)), size = 1960
(11/97), name = ++inv1, size = 543
(12/97), name = (+grantE.(+reqE1.inv1+inv1.reqE1)+reqE1.+grantE.inv1), size = 2381
(13/97), name = +reqE2.+grantE.inv1, size = 5779
(14/97), name = (+nonex.(+grantE.reqE1+reqE1.grantE)+reqE1.+nonex.grantE), size = 3952
(15/97), name = (+nonex.(+grantE.reqE2+reqE2.grantE)+reqE2.+nonex.grantE), size = 3952
(16/97), name = (+inv1.(+grantE.reqE1+reqE1.grantE)+reqE1.+inv1.grantE), size = 2577
(17/97), name = (+inv1.(+grantE.reqE2+reqE2.grantE)+reqE2.+inv1.grantE), size = 11409
(18/97), name = (+grantS.(+inv1.reqS+reqS.inv1)+reqS.(+grantS.inv1+inv1.grantS)+inv1.(+grantS.reqS+reqS.grantS)), size = 961
(19/97), name = (+reqE1.+grantE+grantE.+reqE1+(+grantE.reqE1+reqE1.grantE)), size = 1453
(20/97), name = (+reqE2.+grantE+grantE.+reqE2+(+grantE.reqE2+reqE2.grantE)), size = 1521
(21/97), name = (+grantE.(+inv1.reqS+reqS.inv1)+reqS.+grantE.inv1), size = 1410
(22/97), name = (+nonex.(+grantE.reqS+reqS.grantE)+reqS.+nonex.grantE), size = 3873
(23/97), name = (+inv1.(+grantE.reqS+reqS.grantE)+reqS.+inv1.grantE), size = 5559
(24/97), name = (+reqS.+grantE+grantE.+reqS+(+grantE.reqS+reqS.grantE)), size = 3263
(25/97), name = (+grantS.+inv1.nonex+inv1.(+nonex.grantS+grantS.nonex)), size = 3699
(26/97), name = (+grantE.+inv1.nonex+nonex.+grantE.inv1), size = 4098
(27/97), name = +inv1.+grantE.inv1, size = 3695
(28/97), name = +nonex.+nonex.grantE, size = 2002
(29/97), name = +inv1.+nonex.grantE, size = 8128
(30/97), name = (+grantS.+inv1+inv1.+grantS+(+grantS.inv1+inv1.grantS)), size = 1785
(31/97), name = (+grantE.+inv1++grantE.inv1), size = 2996
(32/97), name = (+nonex.+grantE++nonex.grantE), size = 2056
(33/97), name = (+inv1.+grantE++inv1.grantE), size = 6038
(34/97), name = (+grantS.(+grantE.reqE1+reqE1.grantE)+grantE.(+reqE1.grantS+grantS.reqE1)), size = 13335
(35/97), name = (+grantS.(+grantE.reqE2+reqE2.grantE)+grantE.(+reqE2.grantS+grantS.reqE2)), size = 3335
(36/97), name = ++grantE, size = 919
(37/97), name = (+grantS.(+grantE.reqS+reqS.grantE)+grantE.(+grantS.reqS+reqS.grantS)), size = 13431
(38/97), name = (+grantE.(+grantS.inv1+inv1.grantS)+grantS.+grantE.inv1), size = 6808
(39/97), name = +grantS.+nonex.grantE, size = 7662
(40/97), name = +grantS.+inv1.grantE, size = 26395
(41/97), name = +grantE.+grantE.inv1, size = 10260
(42/97), name = +grantE.+inv1.grantE, size = 10311
(43/97), name = (+reqE1.+inv1.inv2+reqE2.+inv1.inv2+inv1.(+reqE1.inv2+reqE2.inv2+inv2.reqE1)), size = 6793
(44/97), name = (+reqS.+inv1.inv2+inv1.(+inv2.reqS+reqS.inv2)), size = 11041
(45/97), name = (+inv1.+inv2++inv1.inv2), size = 3044
(46/97), name = (+inv2.(+grantE.reqE1+reqE1.grantE)+reqE1.+inv2.grantE+reqE2.+inv2.grantE), size = 1163
(47/97), name = (+reqE1.+grantE.inv2+reqE2.+grantE.inv2+grantE.(+reqE1.inv2+reqE2.inv2+inv2.reqE1)), size = 1303
(48/97), name = (+inv2.(+grantE.reqS+reqS.grantE)+reqS.+inv2.grantE), size = 3504
(49/97), name = (+reqS.+grantE.inv2+grantE.(+inv2.reqS+reqS.inv2)), size = 4914
(50/97), name = +inv1.+inv2.grantS, size = 6445
(51/97), name = (+grantS.+inv1.inv2+inv1.+grantS.inv2), size = 5869
(52/97), name = (+inv2.+grantE.inv1+grantE.+inv1.inv2), size = 6502
(53/97), name = (+inv2.+nonex.grantE+inv1.+inv2.grantE+nonex.+inv2.grantE), size = 12845
(54/97), name = (+inv1.+grantE.inv2+nonex.+grantE.inv2), size = 11553
(55/97), name = +inv2.+inv2.grantE, size = 4657
(56/97), name = +inv2.+grantE.inv2, size = 4445
(57/97), name = (+inv2.+grantE++inv2.grantE), size = 1948
(58/97), name = (+grantE.+inv2++grantE.inv2), size = 3388
(59/97), name = +grantS.+inv2.grantE, size = 8821
(60/97), name = +grantE.+inv2.grantS, size = 17054
(61/97), name = (+grantS.+grantE.inv2+grantE.+grantS.inv2), size = 16640
(62/97), name = +grantE.+inv2.grantE, size = 5349
(63/97), name = +grantE.+grantE.inv2, size = 7837
(64/97), name = +reqE2.(+reqE1.grantS+grantS.reqE1), size = 10721
(65/97), name = ++reqE1, size = 825
(66/97), name = ++reqE2, size = 873
(67/97), name = (+nonex.+reqS+reqS.+nonex+(+nonex.reqS+reqS.nonex)), size = 766
(68/97), name = (+reqS.(+reqE1.grantS+grantS.reqE1)+reqE1.(+grantS.reqS+reqS.grantS)), size = 9229
(69/97), name = (+reqS.(+reqE2.grantS+grantS.reqE2)+reqE2.(+grantS.reqS+reqS.grantS)), size = 3085
(70/97), name = ++reqS, size = 789
(71/97), name = (+nonex.(+reqE1.grantS+grantS.reqE1)+reqE1.(+nonex.grantS+grantS.nonex)), size = 3122
(72/97), name = (+nonex.(+reqE2.grantS+grantS.reqE2)+reqE2.(+nonex.grantS+grantS.nonex)), size = 766
(73/97), name = ++nonex, size = 174
(74/97), name = (+grantS.+reqE1+reqE1.+grantS+(+reqE1.grantS+grantS.reqE1)), size = 3061
(75/97), name = (+grantS.+reqE2+reqE2.+grantS+(+reqE2.grantS+grantS.reqE2)), size = 753
(76/97), name = (+grantS.(+nonex.reqS+reqS.nonex)+nonex.(+grantS.reqS+reqS.grantS)+reqS.(+nonex.grantS+grantS.nonex)), size = 683
(77/97), name = (+grantS.+reqS+reqS.+grantS+(+grantS.reqS+reqS.grantS)), size = 1556
(78/97), name = (+grantS.+nonex+nonex.+grantS+(+nonex.grantS+grantS.nonex)), size = 820
(79/97), name = ++grantS, size = 855
(80/97), name = (+reqE1.(+reqE1.inv2+reqE2.inv2+inv2.reqE1)+reqE2.(+reqE1.inv2+reqE2.inv2+inv2.reqE1)), size = 8278
(81/97), name = (+reqS.(+reqE1.inv2+reqE2.inv2+inv2.reqE1)+reqE1.(+inv2.reqS+reqS.inv2)+reqE2.(+inv2.reqS+reqS.inv2)), size = 14730
(82/97), name = +reqS.(+inv2.reqS+reqS.inv2), size = 18312
(83/97), name = (+inv2.+reqE1+reqE1.+inv2+reqE2.+inv2+(+reqE1.inv2+reqE2.inv2+inv2.reqE1)), size = 2679
(84/97), name = (+inv2.(+nonex.reqS+reqS.nonex)+nonex.(+inv2.reqS+reqS.inv2)), size = 6388
(85/97), name = (+inv2.+reqS+reqS.+inv2+(+inv2.reqS+reqS.inv2)), size = 6579
(86/97), name = (+inv2.(+reqE1.grantS+grantS.reqE1)+reqE1.+inv2.grantS+reqE2.+inv2.grantS), size = 9014
(87/97), name = (+inv2.(+reqE2.grantS+grantS.reqE2)+grantS.(+reqE1.inv2+reqE2.inv2+inv2.reqE1)+reqE1.+grantS.inv2+reqE2.+grantS.inv2), size = 2453
(88/97), name = ++inv2, size = 513
(89/97), name = (+inv2.(+grantS.reqS+reqS.grantS)+reqS.+inv2.grantS), size = 6062
(90/97), name = (+grantS.(+inv2.reqS+reqS.inv2)+reqS.+grantS.inv2), size = 6607
(91/97), name = (+inv2.(+nonex.grantS+grantS.nonex)+nonex.+inv2.grantS), size = 7069
(92/97), name = +nonex.+grantS.inv2, size = 6370
(93/97), name = +inv2.+inv2.grantS, size = 10320
(94/97), name = (+inv2.+grantS++inv2.grantS), size = 7307
(95/97), name = (+grantS.+inv2++grantS.inv2), size = 6597
(96/97), name = +grantS.+inv2.grantS, size = 10700
(97/97), name = +grantS.+grantS.inv2, size = 10543
**********************
Random choose
Name = +grantS.+nonex.grantE  No new state computed
Name = (+grantS.+inv1.inv2+inv1.+grantS.inv2)  No new state computed
Name = (+inv2.(+nonex.reqS+reqS.nonex)+nonex.(+inv2.reqS+reqS.inv2))  No new state computed
Name = (+grantE.(+inv1.reqS+reqS.inv1)+reqS.+grantE.inv1)  No new state computed
Name = (+grantS.+reqS+reqS.+grantS+(+grantS.reqS+reqS.grantS))  No new state computed
Name = (+nonex.(+grantE.reqE2+reqE2.grantE)+reqE2.+nonex.grantE)  No new state computed
Name = (+reqS.(+grantE.reqE2+reqE2.grantE)+reqE2.(+grantE.reqS+reqS.grantE))  No new state computed
Name = (+grantS.+inv1+inv1.+grantS+(+grantS.inv1+inv1.grantS))  No new state computed
Name = ++reqE1  OK !
Now we have a representation of size = 34
Minimization in Progress
Name = (+reqS.+inv1.nonex+inv1.(+nonex.reqS+reqS.nonex)) No new state computed
Name = (+reqS.(+grantE.reqE2+reqE2.grantE)+reqE2.(+grantE.reqS+reqS.grantE)) No new state computed
Name = (+inv1.(+grantE.reqE2+reqE2.grantE)+reqE2.+inv1.grantE) No new state computed
Name = (+inv2.+reqE1+reqE1.+inv2+reqE2.+inv2+(+reqE1.inv2+reqE2.inv2+inv2.reqE1))  I.N.C.R.E.A.S.E
Name = +reqE1.+inv1.nonex No new state computed
Name = +grantE.+grantE.inv1 No new state computed
Name = (+inv2.(+nonex.grantS+grantS.nonex)+nonex.+inv2.grantS) No new state computed
Name = (+grantE.(+grantS.inv1+inv1.grantS)+grantS.+grantE.inv1) No new state computed
Name = ++grantS No new state computed
Name = (+grantS.+grantE.inv2+grantE.+grantS.inv2) No new state computed
Name = (+reqS.(+grantE.reqE1+reqE1.grantE)+reqE1.(+grantE.reqS+reqS.grantE)) No new state computed
Name = +grantS.+inv2.grantE No new state computed
Name = (+grantS.(+grantE.reqE1+reqE1.grantE)+grantE.(+reqE1.grantS+grantS.reqE1)) No new state computed
Name = (+inv2.+grantS++inv2.grantS) No new state computed
Name = +inv1.+grantE.inv1 No new state computed
Name = (+grantS.+reqE2+reqE2.+grantS+(+reqE2.grantS+grantS.reqE2)) No new state computed
Name = +grantE.+inv2.grantE No new state computed
Name = (+reqS.(+reqE1.inv2+reqE2.inv2+inv2.reqE1)+reqE1.(+inv2.reqS+reqS.inv2)+reqE2.(+inv2.reqS+reqS.inv2)) No new state computed
Name = (+reqS.+inv1+inv1.+reqS+(+inv1.reqS+reqS.inv1)) No new state computed
Name = (+grantS.+inv1.inv2+inv1.+grantS.inv2) No new state computed
Name = +inv2.+inv2.grantS No new state computed
Name = ++inv1 No new state computed
Name = (+grantS.+nonex+nonex.+grantS+(+nonex.grantS+grantS.nonex)) No new state computed
Name = (+inv1.+grantE.inv2+nonex.+grantE.inv2) No new state computed
Name = (+reqS.(+reqE1.inv1+inv1.reqE1)+reqE1.(+inv1.reqS+reqS.inv1)) No new state computed
Name = (+reqE2.+grantE+grantE.+reqE2+(+grantE.reqE2+reqE2.grantE)) No new state computed
Name = +grantS.+inv1.grantE No new state computed
Name = (+grantE.(+reqE1.inv1+inv1.reqE1)+reqE1.+grantE.inv1) No new state computed
Name = (+reqS.+grantE+grantE.+reqS+(+grantE.reqS+reqS.grantE)) No new state computed
Name = (+inv2.(+reqE2.grantS+grantS.reqE2)+grantS.(+reqE1.inv2+reqE2.inv2+inv2.reqE1)+reqE1.+grantS.inv2+reqE2.+grantS.inv2) No new state computed
Name = (+inv2.+reqS+reqS.+inv2+(+inv2.reqS+reqS.inv2)) No new state computed
Name = (+grantS.+inv1.nonex+inv1.(+nonex.grantS+grantS.nonex)) No new state computed
Name = (+reqE1.(+reqE1.inv2+reqE2.inv2+inv2.reqE1)+reqE2.(+reqE1.inv2+reqE2.inv2+inv2.reqE1)) No new state computed
Name = (+grantS.+reqE1+reqE1.+grantS+(+reqE1.grantS+grantS.reqE1)) No new state computed
Name = (+grantS.(+nonex.reqS+reqS.nonex)+nonex.(+grantS.reqS+reqS.grantS)+reqS.(+nonex.grantS+grantS.nonex))  I.N.C.R.E.A.S.E
Name = +grantE.+inv2.grantS No new state computed
Name = (+grantE.+inv1++grantE.inv1) No new state computed
Name = (+reqE1.+inv1.inv2+reqE2.+inv1.inv2+inv1.(+reqE1.inv2+reqE2.inv2+inv2.reqE1)) No new state computed
Name = (+inv1.(+grantE.reqS+reqS.grantE)+reqS.+inv1.grantE) No new state computed
Name = (+grantE.+inv2++grantE.inv2) No new state computed
Name = (+reqS.(+reqE1.grantS+grantS.reqE1)+reqE1.(+grantS.reqS+reqS.grantS)) No new state computed
Name = (+grantE.+inv1.nonex+nonex.+grantE.inv1) No new state computed
Name = +grantE.+grantE.inv2 No new state computed
Name = ++reqE2 No new state computed
Name = (+grantS.(+grantE.reqE2+reqE2.grantE)+grantE.(+reqE2.grantS+grantS.reqE2)) No new state computed
Name = (+grantE.(+inv1.reqS+reqS.inv1)+reqS.+grantE.inv1) No new state computed
Name = (+grantS.(+grantE.reqS+reqS.grantE)+grantE.(+grantS.reqS+reqS.grantS)) No new state computed
Name = (+nonex.(+grantE.reqS+reqS.grantE)+reqS.+nonex.grantE) No new state computed
Name = +reqE2.(+reqE1.grantS+grantS.reqE1) No new state computed
Name = (+inv2.(+grantS.reqS+reqS.grantS)+reqS.+inv2.grantS) No new state computed
Name = ++nonex No new state computed
Name = +inv2.+inv2.grantE No new state computed
Name = (+grantS.(+inv2.reqS+reqS.inv2)+reqS.+grantS.inv2) No new state computed
Name = (+grantS.+inv2++grantS.inv2) No new state computed
Name = +reqE2.+grantE.inv1 No new state computed
Name = +grantS.+nonex.grantE No new state computed
Name = (+grantS.(+inv1.reqS+reqS.inv1)+reqS.(+grantS.inv1+inv1.grantS)+inv1.(+grantS.reqS+reqS.grantS)) No new state computed
Name = (+inv2.+grantE.inv1+grantE.+inv1.inv2) No new state computed
Name = (+inv2.(+grantE.reqE1+reqE1.grantE)+reqE1.+inv2.grantE+reqE2.+inv2.grantE)  I.N.C.R.E.A.S.E
Name = +inv1.+nonex.grantE No new state computed
Name = +nonex.+nonex.grantE No new state computed
Name = (+nonex.(+reqE2.grantS+grantS.reqE2)+reqE2.(+nonex.grantS+grantS.nonex)) No new state computed
Name = (+inv2.(+reqE1.grantS+grantS.reqE1)+reqE1.+inv2.grantS+reqE2.+inv2.grantS) No new state computed
Name = +grantS.+grantS.inv2 No new state computed
Name = (+reqE1.+inv1+inv1.+reqE1+(+reqE1.inv1+inv1.reqE1)) No new state computed
Name = (+nonex.(+grantE.reqE1+reqE1.grantE)+reqE1.+nonex.grantE) No new state computed
Name = (+reqS.+grantE.inv2+grantE.(+inv2.reqS+reqS.inv2)) No new state computed
Name = (+inv2.(+grantE.reqS+reqS.grantE)+reqS.+inv2.grantE)  I.N.C.R.E.A.S.E
Name = (+reqE1.+grantE.inv2+reqE2.+grantE.inv2+grantE.(+reqE1.inv2+reqE2.inv2+inv2.reqE1)) No new state computed
Name = (+nonex.+grantE++nonex.grantE) No new state computed
Name = (+inv1.+inv2++inv1.inv2) No new state computed
Name = (+nonex.(+grantE.reqE2+reqE2.grantE)+reqE2.+nonex.grantE) No new state computed
Name = (+nonex.+reqS+reqS.+nonex+(+nonex.reqS+reqS.nonex))  I.N.C.R.E.A.S.E
Name = +nonex.+grantS.inv2 No new state computed
Name = (+grantS.(+reqE1.inv1+inv1.reqE1)+reqE1.(+grantS.inv1+inv1.grantS)+inv1.(+reqE1.grantS+grantS.reqE1)) No new state computed
Name = ++grantE No new state computed
Name = (+reqE2.(+grantS.inv1+inv1.grantS)+inv1.(+reqE2.grantS+grantS.reqE2)) No new state computed
Name = (+inv2.+grantE++inv2.grantE)  I.N.C.R.E.A.S.E
Name = +grantE.+inv1.grantE No new state computed
Name = (+inv1.+grantE++inv1.grantE) No new state computed
Name = +inv1.+inv2.grantS No new state computed
Name = (+reqS.(+reqE2.grantS+grantS.reqE2)+reqE2.(+grantS.reqS+reqS.grantS)) No new state computed
Name = (+inv2.(+nonex.reqS+reqS.nonex)+nonex.(+inv2.reqS+reqS.inv2)) No new state computed
Name = ++inv2  I.N.C.R.E.A.S.E
Name = (+inv1.(+grantE.reqE1+reqE1.grantE)+reqE1.+inv1.grantE) No new state computed
Name = (+inv1.+nonex++inv1.nonex) No new state computed
Name = ++reqS  I.N.C.R.E.A.S.E
Name = +grantS.+inv2.grantS No new state computed
Name = (+grantS.+reqS+reqS.+grantS+(+grantS.reqS+reqS.grantS)) No new state computed
Name = (+inv2.+nonex.grantE+inv1.+inv2.grantE+nonex.+inv2.grantE) No new state computed
Name = (+reqS.+inv1.inv2+inv1.(+inv2.reqS+reqS.inv2)) No new state computed
Name = (+reqE1.+grantE+grantE.+reqE1+(+grantE.reqE1+reqE1.grantE)) No new state computed
Name = (+grantS.+inv1+inv1.+grantS+(+grantS.inv1+inv1.grantS)) No new state computed
Name = +inv2.+grantE.inv2 No new state computed
Name = +reqS.(+inv2.reqS+reqS.inv2) No new state computed
Name = (+nonex.(+reqE1.grantS+grantS.reqE1)+reqE1.(+nonex.grantS+grantS.nonex)) No new state computed
increase = 1
**********************
Random choose
Name = ++reqS  OK !
Now we have a representation of size = 40
Minimization in Progress
Name = (+nonex.(+reqE2.grantS+grantS.reqE2)+reqE2.(+nonex.grantS+grantS.nonex)) No new state computed
Name = (+grantS.(+nonex.reqS+reqS.nonex)+nonex.(+grantS.reqS+reqS.grantS)+reqS.(+nonex.grantS+grantS.nonex))  I.N.C.R.E.A.S.E
Name = (+inv2.(+grantE.reqS+reqS.grantE)+reqS.+inv2.grantE)  I.N.C.R.E.A.S.E
Name = (+inv2.(+nonex.reqS+reqS.nonex)+nonex.(+inv2.reqS+reqS.inv2)) No new state computed
Name = +inv2.+inv2.grantS No new state computed
Name = (+inv1.+inv2++inv1.inv2) No new state computed
Name = (+reqE1.+inv1.inv2+reqE2.+inv1.inv2+inv1.(+reqE1.inv2+reqE2.inv2+inv2.reqE1)) No new state computed
Name = (+grantS.(+inv2.reqS+reqS.inv2)+reqS.+grantS.inv2) No new state computed
Name = (+reqS.+grantE.inv2+grantE.(+inv2.reqS+reqS.inv2)) No new state computed
Name = (+grantS.+reqE1+reqE1.+grantS+(+reqE1.grantS+grantS.reqE1)) No new state computed
Name = +grantE.+inv2.grantE No new state computed
Name = (+reqE1.+inv1+inv1.+reqE1+(+reqE1.inv1+inv1.reqE1)) No new state computed
Name = (+reqE1.(+reqE1.inv2+reqE2.inv2+inv2.reqE1)+reqE2.(+reqE1.inv2+reqE2.inv2+inv2.reqE1)) No new state computed
Name = (+nonex.+grantE++nonex.grantE) No new state computed
Name = +grantS.+grantS.inv2 No new state computed
Name = (+reqS.(+reqE1.grantS+grantS.reqE1)+reqE1.(+grantS.reqS+reqS.grantS)) No new state computed
Name = (+grantE.(+reqE1.inv1+inv1.reqE1)+reqE1.+grantE.inv1) No new state computed
Name = (+reqE2.+grantE+grantE.+reqE2+(+grantE.reqE2+reqE2.grantE)) No new state computed
Name = (+grantS.+inv1.inv2+inv1.+grantS.inv2) No new state computed
Name = (+reqS.(+grantE.reqE1+reqE1.grantE)+reqE1.(+grantE.reqS+reqS.grantE)) No new state computed
Name = ++nonex  OK !
Now we have a representation of size = 40
Name = +grantS.+nonex.grantE No new state computed
Name = +grantE.+inv1.grantE No new state computed
Name = +inv1.+inv2.grantS No new state computed
Name = (+grantS.+inv1.nonex+inv1.(+nonex.grantS+grantS.nonex)) No new state computed
Name = (+inv1.+grantE.inv2+nonex.+grantE.inv2) No new state computed
Name = (+reqE1.(+reqE1.inv2+reqE2.inv2+inv2.reqE1)+reqE2.(+reqE1.inv2+reqE2.inv2+inv2.reqE1)) No new state computed
Name = (+grantE.(+reqE1.inv1+inv1.reqE1)+reqE1.+grantE.inv1) No new state computed
Name = (+inv2.(+nonex.grantS+grantS.nonex)+nonex.+inv2.grantS) No new state computed
Name = (+inv2.(+nonex.reqS+reqS.nonex)+nonex.(+inv2.reqS+reqS.inv2)) No new state computed
Name = (+reqS.(+grantE.reqE1+reqE1.grantE)+reqE1.(+grantE.reqS+reqS.grantE)) No new state computed
Name = +inv2.+inv2.grantE No new state computed
Name = +reqE2.(+reqE1.grantS+grantS.reqE1) No new state computed
Name = (+inv2.(+grantE.reqS+reqS.grantE)+reqS.+inv2.grantE)  I.N.C.R.E.A.S.E
Name = (+inv1.+inv2++inv1.inv2) No new state computed
Name = +nonex.+grantS.inv2 No new state computed
Name = (+reqS.+inv1+inv1.+reqS+(+inv1.reqS+reqS.inv1)) No new state computed
Name = (+reqS.(+reqE1.inv1+inv1.reqE1)+reqE1.(+inv1.reqS+reqS.inv1)) No new state computed
Name = ++inv1 No new state computed
Name = (+reqE1.+grantE.inv2+reqE2.+grantE.inv2+grantE.(+reqE1.inv2+reqE2.inv2+inv2.reqE1)) No new state computed
Name = ++reqE2 No new state computed
Name = ++reqE1 No new state computed
Name = ++inv2  I.N.C.R.E.A.S.E
Name = +grantS.+inv2.grantE No new state computed
Name = (+grantS.(+inv1.reqS+reqS.inv1)+reqS.(+grantS.inv1+inv1.grantS)+inv1.(+grantS.reqS+reqS.grantS)) No new state computed
Name = (+grantS.(+grantE.reqE2+reqE2.grantE)+grantE.(+reqE2.grantS+grantS.reqE2)) No new state computed
Name = (+inv2.+reqE1+reqE1.+inv2+reqE2.+inv2+(+reqE1.inv2+reqE2.inv2+inv2.reqE1))  I.N.C.R.E.A.S.E
Name = +inv1.+grantE.inv1 No new state computed
Name = (+grantS.+inv1.inv2+inv1.+grantS.inv2) No new state computed
Name = (+reqE1.+grantE+grantE.+reqE1+(+grantE.reqE1+reqE1.grantE)) No new state computed
Name = (+grantE.+inv1++grantE.inv1) No new state computed
Name = (+nonex.(+reqE1.grantS+grantS.reqE1)+reqE1.(+nonex.grantS+grantS.nonex))  I.N.C.R.E.A.S.E
Name = (+grantS.+reqS+reqS.+grantS+(+grantS.reqS+reqS.grantS))  I.N.C.R.E.A.S.E
Name = (+grantE.+inv2++grantE.inv2) No new state computed
Name = +reqE2.+grantE.inv1 No new state computed
Name = (+grantS.+reqE1+reqE1.+grantS+(+reqE1.grantS+grantS.reqE1))  I.N.C.R.E.A.S.E
Name = (+grantS.+inv1+inv1.+grantS+(+grantS.inv1+inv1.grantS)) No new state computed
Name = (+reqS.(+reqE1.inv2+reqE2.inv2+inv2.reqE1)+reqE1.(+inv2.reqS+reqS.inv2)+reqE2.(+inv2.reqS+reqS.inv2)) No new state computed
Name = +grantE.+inv2.grantS No new state computed
Name = (+inv1.(+grantE.reqS+reqS.grantE)+reqS.+inv1.grantE) No new state computed
Name = +reqE1.+inv1.nonex No new state computed
Name = (+inv1.+nonex++inv1.nonex) No new state computed
Name = (+inv2.+grantE++inv2.grantE)  I.N.C.R.E.A.S.E
Name = (+grantS.+inv2++grantS.inv2) No new state computed
Name = (+grantS.(+grantE.reqS+reqS.grantE)+grantE.(+grantS.reqS+reqS.grantS)) No new state computed
Name = (+grantS.+grantE.inv2+grantE.+grantS.inv2) No new state computed
Name = (+inv2.+reqS+reqS.+inv2+(+inv2.reqS+reqS.inv2)) No new state computed
Name = (+grantE.(+grantS.inv1+inv1.grantS)+grantS.+grantE.inv1) No new state computed
Name = +nonex.+nonex.grantE No new state computed
Name = (+reqS.+grantE.inv2+grantE.(+inv2.reqS+reqS.inv2)) No new state computed
Name = (+inv1.(+grantE.reqE2+reqE2.grantE)+reqE2.+inv1.grantE) No new state computed
Name = (+reqE2.+grantE+grantE.+reqE2+(+grantE.reqE2+reqE2.grantE)) No new state computed
Name = (+inv2.(+grantE.reqE1+reqE1.grantE)+reqE1.+inv2.grantE+reqE2.+inv2.grantE)  I.N.C.R.E.A.S.E
Name = (+reqE1.+inv1.inv2+reqE2.+inv1.inv2+inv1.(+reqE1.inv2+reqE2.inv2+inv2.reqE1)) No new state computed
Name = (+grantS.(+reqE1.inv1+inv1.reqE1)+reqE1.(+grantS.inv1+inv1.grantS)+inv1.(+reqE1.grantS+grantS.reqE1)) No new state computed
Name = (+grantS.+reqE2+reqE2.+grantS+(+reqE2.grantS+grantS.reqE2)) No new state computed
Name = (+reqS.(+reqE1.grantS+grantS.reqE1)+reqE1.(+grantS.reqS+reqS.grantS)) No new state computed
Name = (+grantS.(+grantE.reqE1+reqE1.grantE)+grantE.(+reqE1.grantS+grantS.reqE1)) No new state computed
Name = (+inv2.(+reqE1.grantS+grantS.reqE1)+reqE1.+inv2.grantS+reqE2.+inv2.grantS) No new state computed
Name = (+reqS.(+grantE.reqE2+reqE2.grantE)+reqE2.(+grantE.reqS+reqS.grantE)) No new state computed
Name = (+reqS.+inv1.nonex+inv1.(+nonex.reqS+reqS.nonex)) No new state computed
Name = +grantE.+grantE.inv1 No new state computed
Name = (+nonex.+reqS+reqS.+nonex+(+nonex.reqS+reqS.nonex)) No new state computed
Name = ++reqS No new state computed
Name = (+nonex.(+grantE.reqE1+reqE1.grantE)+reqE1.+nonex.grantE) No new state computed
Name = +grantS.+inv2.grantS No new state computed
Name = (+reqS.(+reqE2.grantS+grantS.reqE2)+reqE2.(+grantS.reqS+reqS.grantS)) No new state computed
Name = +reqS.(+inv2.reqS+reqS.inv2) No new state computed
Name = (+inv2.+nonex.grantE+inv1.+inv2.grantE+nonex.+inv2.grantE) No new state computed
Name = (+nonex.(+reqE2.grantS+grantS.reqE2)+reqE2.(+nonex.grantS+grantS.nonex)) No new state computed
Name = +inv2.+grantE.inv2 No new state computed
Name = +grantE.+inv2.grantE No new state computed
Name = (+reqS.+grantE+grantE.+reqS+(+grantE.reqS+reqS.grantE)) No new state computed
Name = +grantS.+inv1.grantE No new state computed
Name = (+nonex.(+grantE.reqS+reqS.grantE)+reqS.+nonex.grantE) No new state computed
Name = (+inv1.+grantE++inv1.grantE) No new state computed
Name = ++grantE No new state computed
Name = +inv2.+inv2.grantS No new state computed
Name = (+grantS.(+nonex.reqS+reqS.nonex)+nonex.(+grantS.reqS+reqS.grantS)+reqS.(+nonex.grantS+grantS.nonex))  I.N.C.R.E.A.S.E
Name = (+grantE.(+inv1.reqS+reqS.inv1)+reqS.+grantE.inv1) No new state computed
Name = (+grantS.+nonex+nonex.+grantS+(+nonex.grantS+grantS.nonex))  I.N.C.R.E.A.S.E
Name = (+grantS.(+inv2.reqS+reqS.inv2)+reqS.+grantS.inv2) No new state computed
Name = +grantE.+grantE.inv2 No new state computed
Name = (+inv2.(+reqE2.grantS+grantS.reqE2)+grantS.(+reqE1.inv2+reqE2.inv2+inv2.reqE1)+reqE1.+grantS.inv2+reqE2.+grantS.inv2)  I.N.C.R.E.A.S.E
Name = (+reqE2.(+grantS.inv1+inv1.grantS)+inv1.(+reqE2.grantS+grantS.reqE2)) No new state computed
Name = (+inv2.(+grantS.reqS+reqS.grantS)+reqS.+inv2.grantS) No new state computed
Name = (+inv1.(+grantE.reqE1+reqE1.grantE)+reqE1.+inv1.grantE) No new state computed
Name = (+nonex.+grantE++nonex.grantE) No new state computed
Name = +grantS.+grantS.inv2 No new state computed
Name = ++grantS  I.N.C.R.E.A.S.E
Name = (+reqE1.+inv1+inv1.+reqE1+(+reqE1.inv1+inv1.reqE1)) No new state computed
Name = (+inv2.+grantE.inv1+grantE.+inv1.inv2) No new state computed
Name = (+inv2.+grantS++inv2.grantS) No new state computed
Name = (+reqS.+inv1.inv2+inv1.(+inv2.reqS+reqS.inv2)) No new state computed
Name = (+grantE.+inv1.nonex+nonex.+grantE.inv1) No new state computed
Name = (+nonex.(+grantE.reqE2+reqE2.grantE)+reqE2.+nonex.grantE) No new state computed
Name = +inv1.+nonex.grantE No new state computed
increase = 1
**********************
Random choose
Name = ++grantS  OK !
Now we have a representation of size = 52
Minimization in Progress
Name = (+inv2.(+grantE.reqE1+reqE1.grantE)+reqE1.+inv2.grantE+reqE2.+inv2.grantE)  I.N.C.R.E.A.S.E
Name = (+inv2.(+reqE1.grantS+grantS.reqE1)+reqE1.+inv2.grantS+reqE2.+inv2.grantS) No new state computed
Name = ++grantE No new state computed
Name = (+grantE.+inv1.nonex+nonex.+grantE.inv1) No new state computed
Name = (+grantS.(+inv1.reqS+reqS.inv1)+reqS.(+grantS.inv1+inv1.grantS)+inv1.(+grantS.reqS+reqS.grantS)) No new state computed
Name = (+reqS.+grantE.inv2+grantE.(+inv2.reqS+reqS.inv2)) No new state computed
Name = (+reqE1.+grantE+grantE.+reqE1+(+grantE.reqE1+reqE1.grantE)) No new state computed
Name = (+inv1.+inv2++inv1.inv2) No new state computed
Name = +grantE.+inv1.grantE No new state computed
Name = ++nonex No new state computed
Name = (+nonex.+grantE++nonex.grantE) No new state computed
Name = (+nonex.(+reqE2.grantS+grantS.reqE2)+reqE2.(+nonex.grantS+grantS.nonex)) No new state computed
Name = +nonex.+grantS.inv2 No new state computed
Name = (+nonex.+reqS+reqS.+nonex+(+nonex.reqS+reqS.nonex))  I.N.C.R.E.A.S.E
Name = ++reqE1  OK !
Now we have a representation of size = 52
Name = (+inv2.(+grantS.reqS+reqS.grantS)+reqS.+inv2.grantS) No new state computed
Name = +grantE.+inv2.grantE No new state computed
Name = (+nonex.(+grantE.reqE2+reqE2.grantE)+reqE2.+nonex.grantE) No new state computed
Name = (+grantE.+inv2++grantE.inv2) No new state computed
Name = +grantS.+grantS.inv2 No new state computed
Name = (+inv1.(+grantE.reqE2+reqE2.grantE)+reqE2.+inv1.grantE) No new state computed
Name = ++reqS  I.N.C.R.E.A.S.E
Name = (+inv2.+grantE.inv1+grantE.+inv1.inv2) No new state computed
Name = (+inv1.(+grantE.reqS+reqS.grantE)+reqS.+inv1.grantE) No new state computed
Name = (+grantS.(+reqE1.inv1+inv1.reqE1)+reqE1.(+grantS.inv1+inv1.grantS)+inv1.(+reqE1.grantS+grantS.reqE1)) No new state computed
Name = (+reqS.+grantE.inv2+grantE.(+inv2.reqS+reqS.inv2)) No new state computed
Name = (+nonex.(+reqE2.grantS+grantS.reqE2)+reqE2.(+nonex.grantS+grantS.nonex)) No new state computed
Name = (+grantS.+inv1.nonex+inv1.(+nonex.grantS+grantS.nonex)) No new state computed
Name = +inv1.+grantE.inv1 No new state computed
Name = (+grantS.(+inv2.reqS+reqS.inv2)+reqS.+grantS.inv2) No new state computed
Name = (+reqS.+inv1.inv2+inv1.(+inv2.reqS+reqS.inv2)) No new state computed
Name = +reqE2.(+reqE1.grantS+grantS.reqE1) No new state computed
Name = +grantS.+inv2.grantE No new state computed
Name = ++nonex No new state computed
Name = (+reqS.(+grantE.reqE1+reqE1.grantE)+reqE1.(+grantE.reqS+reqS.grantE)) No new state computed
Name = (+nonex.(+reqE1.grantS+grantS.reqE1)+reqE1.(+nonex.grantS+grantS.nonex)) No new state computed
Name = (+grantS.(+grantE.reqE2+reqE2.grantE)+grantE.(+reqE2.grantS+grantS.reqE2)) No new state computed
Name = (+grantE.(+inv1.reqS+reqS.inv1)+reqS.+grantE.inv1) No new state computed
Name = (+grantE.+inv1++grantE.inv1) No new state computed
Name = (+nonex.+reqS+reqS.+nonex+(+nonex.reqS+reqS.nonex))  I.N.C.R.E.A.S.E
Name = (+inv1.+nonex++inv1.nonex) No new state computed
Name = +inv2.+grantE.inv2 No new state computed
Name = (+inv2.+nonex.grantE+inv1.+inv2.grantE+nonex.+inv2.grantE) No new state computed
Name = (+grantS.+reqE1+reqE1.+grantS+(+reqE1.grantS+grantS.reqE1)) No new state computed
Name = +grantS.+inv1.grantE No new state computed
Name = (+grantS.(+grantE.reqS+reqS.grantE)+grantE.(+grantS.reqS+reqS.grantS)) No new state computed
Name = (+inv2.+grantS++inv2.grantS) No new state computed
Name = (+inv1.(+grantE.reqE1+reqE1.grantE)+reqE1.+inv1.grantE) No new state computed
Name = (+reqS.(+reqE1.inv2+reqE2.inv2+inv2.reqE1)+reqE1.(+inv2.reqS+reqS.inv2)+reqE2.(+inv2.reqS+reqS.inv2)) No new state computed
Name = (+reqS.(+reqE2.grantS+grantS.reqE2)+reqE2.(+grantS.reqS+reqS.grantS)) No new state computed
Name = +inv2.+inv2.grantS No new state computed
Name = (+grantS.+inv2++grantS.inv2) No new state computed
Name = ++reqE2 No new state computed
Name = (+grantS.+nonex+nonex.+grantS+(+nonex.grantS+grantS.nonex)) No new state computed
Name = (+grantS.(+nonex.reqS+reqS.nonex)+nonex.(+grantS.reqS+reqS.grantS)+reqS.(+nonex.grantS+grantS.nonex))  I.N.C.R.E.A.S.E
Name = +grantE.+grantE.inv1 No new state computed
Name = (+reqS.+inv1+inv1.+reqS+(+inv1.reqS+reqS.inv1)) No new state computed
Name = +grantE.+inv2.grantS No new state computed
Name = (+reqS.(+reqE1.inv1+inv1.reqE1)+reqE1.(+inv1.reqS+reqS.inv1)) No new state computed
Name = (+reqS.(+reqE1.grantS+grantS.reqE1)+reqE1.(+grantS.reqS+reqS.grantS)) No new state computed
Name = +grantE.+inv1.grantE No new state computed
Name = +nonex.+nonex.grantE No new state computed
Name = (+reqE2.(+grantS.inv1+inv1.grantS)+inv1.(+reqE2.grantS+grantS.reqE2)) No new state computed
Name = (+inv2.+reqE1+reqE1.+inv2+reqE2.+inv2+(+reqE1.inv2+reqE2.inv2+inv2.reqE1))  I.N.C.R.E.A.S.E
Name = ++inv2  I.N.C.R.E.A.S.E
Name = (+grantE.(+reqE1.inv1+inv1.reqE1)+reqE1.+grantE.inv1) No new state computed
Name = (+reqE1.+grantE.inv2+reqE2.+grantE.inv2+grantE.(+reqE1.inv2+reqE2.inv2+inv2.reqE1)) No new state computed
Name = (+grantS.+inv1.inv2+inv1.+grantS.inv2) No new state computed
Name = (+inv1.+inv2++inv1.inv2) No new state computed
Name = +grantS.+nonex.grantE No new state computed
Name = ++grantE No new state computed
Name = (+grantE.+inv1.nonex+nonex.+grantE.inv1) No new state computed
Name = +inv1.+inv2.grantS No new state computed
Name = (+inv2.(+nonex.reqS+reqS.nonex)+nonex.(+inv2.reqS+reqS.inv2)) No new state computed
Name = (+grantS.+reqE2+reqE2.+grantS+(+reqE2.grantS+grantS.reqE2)) No new state computed
Name = ++inv1 No new state computed
Name = (+reqS.(+grantE.reqE2+reqE2.grantE)+reqE2.(+grantE.reqS+reqS.grantE)) No new state computed
Name = (+grantS.+reqS+reqS.+grantS+(+grantS.reqS+reqS.grantS))  I.N.C.R.E.A.S.E
Name = (+grantS.(+inv1.reqS+reqS.inv1)+reqS.(+grantS.inv1+inv1.grantS)+inv1.(+grantS.reqS+reqS.grantS)) No new state computed
Name = +inv1.+nonex.grantE No new state computed
Name = (+inv1.+grantE.inv2+nonex.+grantE.inv2) No new state computed
Name = +nonex.+grantS.inv2 No new state computed
Name = (+reqE1.+inv1.inv2+reqE2.+inv1.inv2+inv1.(+reqE1.inv2+reqE2.inv2+inv2.reqE1)) No new state computed
Name = (+inv1.+grantE++inv1.grantE) No new state computed
Name = (+inv2.(+grantE.reqS+reqS.grantE)+reqS.+inv2.grantE)  I.N.C.R.E.A.S.E
Name = (+reqS.+grantE+grantE.+reqS+(+grantE.reqS+reqS.grantE)) No new state computed
Name = (+inv2.(+reqE2.grantS+grantS.reqE2)+grantS.(+reqE1.inv2+reqE2.inv2+inv2.reqE1)+reqE1.+grantS.inv2+reqE2.+grantS.inv2)  I.N.C.R.E.A.S.E
Name = +reqE1.+inv1.nonex No new state computed
Name = +grantS.+inv2.grantS No new state computed
Name = (+inv2.+grantE++inv2.grantE)  I.N.C.R.E.A.S.E
Name = (+inv2.(+reqE1.grantS+grantS.reqE1)+reqE1.+inv2.grantS+reqE2.+inv2.grantS) No new state computed
Name = (+nonex.(+grantE.reqE1+reqE1.grantE)+reqE1.+nonex.grantE) No new state computed
Name = +grantE.+grantE.inv2 No new state computed
Name = (+inv2.(+grantE.reqE1+reqE1.grantE)+reqE1.+inv2.grantE+reqE2.+inv2.grantE)  I.N.C.R.E.A.S.E
Name = +inv2.+inv2.grantE No new state computed
Name = ++grantS No new state computed
Name = (+reqE2.+grantE+grantE.+reqE2+(+grantE.reqE2+reqE2.grantE)) No new state computed
Name = +reqS.(+inv2.reqS+reqS.inv2) No new state computed
Name = (+inv2.(+nonex.grantS+grantS.nonex)+nonex.+inv2.grantS) No new state computed
Name = (+grantS.(+grantE.reqE1+reqE1.grantE)+grantE.(+reqE1.grantS+grantS.reqE1)) No new state computed
Name = (+nonex.(+grantE.reqS+reqS.grantE)+reqS.+nonex.grantE) No new state computed
Name = (+reqE1.+inv1+inv1.+reqE1+(+reqE1.inv1+inv1.reqE1)) No new state computed
Name = (+grantS.+grantE.inv2+grantE.+grantS.inv2) No new state computed
Name = (+nonex.+grantE++nonex.grantE) No new state computed
Name = (+reqE1.+grantE+grantE.+reqE1+(+grantE.reqE1+reqE1.grantE)) No new state computed
Name = (+grantE.(+grantS.inv1+inv1.grantS)+grantS.+grantE.inv1) No new state computed
Name = (+reqS.+inv1.nonex+inv1.(+nonex.reqS+reqS.nonex)) No new state computed
Name = (+reqE1.(+reqE1.inv2+reqE2.inv2+inv2.reqE1)+reqE2.(+reqE1.inv2+reqE2.inv2+inv2.reqE1)) No new state computed
Name = +reqE2.+grantE.inv1 No new state computed
Name = (+grantS.+inv1+inv1.+grantS+(+grantS.inv1+inv1.grantS)) No new state computed
Name = (+inv2.+reqS+reqS.+inv2+(+inv2.reqS+reqS.inv2)) No new state computed
increase = 1
**********************
Random choose
Name = (+inv2.(+grantE.reqE1+reqE1.grantE)+reqE1.+inv2.grantE+reqE2.+inv2.grantE)  OK !
Now we have a representation of size = 60
Minimization in Progress
Name = (+reqE2.+grantE+grantE.+reqE2+(+grantE.reqE2+reqE2.grantE)) No new state computed
Name = +grantE.+inv2.grantE No new state computed
Name = +grantE.+grantE.inv2 No new state computed
Name = (+grantS.+nonex+nonex.+grantS+(+nonex.grantS+grantS.nonex)) No new state computed
Name = +grantS.+inv2.grantE No new state computed
Name = (+grantS.+inv1.inv2+inv1.+grantS.inv2) No new state computed
Name = (+inv1.(+grantE.reqE2+reqE2.grantE)+reqE2.+inv1.grantE) No new state computed
Name = +reqE2.(+reqE1.grantS+grantS.reqE1) No new state computed
Name = +grantS.+nonex.grantE No new state computed
Name = (+inv2.(+grantE.reqS+reqS.grantE)+reqS.+inv2.grantE)  I.N.C.R.E.A.S.E
Name = (+inv1.(+grantE.reqE1+reqE1.grantE)+reqE1.+inv1.grantE) No new state computed
Name = ++inv1 No new state computed
Name = ++inv2  I.N.C.R.E.A.S.E
Name = (+nonex.(+reqE1.grantS+grantS.reqE1)+reqE1.(+nonex.grantS+grantS.nonex)) No new state computed
Name = (+nonex.+grantE++nonex.grantE) No new state computed
Name = ++reqS  I.N.C.R.E.A.S.E
Name = (+grantS.+inv2++grantS.inv2) No new state computed
Name = (+inv2.+reqS+reqS.+inv2+(+inv2.reqS+reqS.inv2)) No new state computed
Name = (+nonex.(+grantE.reqE2+reqE2.grantE)+reqE2.+nonex.grantE) No new state computed
Name = (+grantS.(+inv1.reqS+reqS.inv1)+reqS.(+grantS.inv1+inv1.grantS)+inv1.(+grantS.reqS+reqS.grantS)) No new state computed
Name = (+grantS.+grantE.inv2+grantE.+grantS.inv2) No new state computed
Name = (+grantS.+inv1+inv1.+grantS+(+grantS.inv1+inv1.grantS)) No new state computed
Name = (+inv1.(+grantE.reqS+reqS.grantE)+reqS.+inv1.grantE) No new state computed
Name = (+grantE.(+reqE1.inv1+inv1.reqE1)+reqE1.+grantE.inv1) No new state computed
Name = (+grantS.(+inv2.reqS+reqS.inv2)+reqS.+grantS.inv2) No new state computed
Name = (+reqS.+grantE+grantE.+reqS+(+grantE.reqS+reqS.grantE)) No new state computed
Name = (+inv2.+grantE++inv2.grantE) No new state computed
Name = (+grantS.+reqS+reqS.+grantS+(+grantS.reqS+reqS.grantS))  I.N.C.R.E.A.S.E
Name = ++grantE No new state computed
Name = (+nonex.+reqS+reqS.+nonex+(+nonex.reqS+reqS.nonex))  I.N.C.R.E.A.S.E
Name = (+reqE2.(+grantS.inv1+inv1.grantS)+inv1.(+reqE2.grantS+grantS.reqE2)) No new state computed
Name = (+reqE1.+grantE.inv2+reqE2.+grantE.inv2+grantE.(+reqE1.inv2+reqE2.inv2+inv2.reqE1)) No new state computed
Name = +grantE.+inv1.grantE No new state computed
Name = (+inv2.+grantE.inv1+grantE.+inv1.inv2) No new state computed
Name = (+grantS.(+grantE.reqE2+reqE2.grantE)+grantE.(+reqE2.grantS+grantS.reqE2)) No new state computed
Name = (+reqS.(+reqE2.grantS+grantS.reqE2)+reqE2.(+grantS.reqS+reqS.grantS)) No new state computed
Name = (+grantS.+reqE1+reqE1.+grantS+(+reqE1.grantS+grantS.reqE1)) No new state computed
Name = (+reqS.+inv1.inv2+inv1.(+inv2.reqS+reqS.inv2)) No new state computed
Name = (+grantE.+inv2++grantE.inv2) No new state computed
Name = ++reqE1 No new state computed
Name = (+inv2.(+reqE1.grantS+grantS.reqE1)+reqE1.+inv2.grantS+reqE2.+inv2.grantS) No new state computed
Name = ++grantS No new state computed
Name = (+inv2.(+nonex.grantS+grantS.nonex)+nonex.+inv2.grantS) No new state computed
Name = +grantS.+inv1.grantE No new state computed
Name = +reqE1.+inv1.nonex No new state computed
Name = (+nonex.(+reqE2.grantS+grantS.reqE2)+reqE2.(+nonex.grantS+grantS.nonex)) No new state computed
Name = (+grantE.+inv1++grantE.inv1) No new state computed
Name = (+inv2.+nonex.grantE+inv1.+inv2.grantE+nonex.+inv2.grantE) No new state computed
Name = (+nonex.(+grantE.reqS+reqS.grantE)+reqS.+nonex.grantE) No new state computed
Name = (+grantE.(+grantS.inv1+inv1.grantS)+grantS.+grantE.inv1) No new state computed
Name = (+reqS.(+reqE1.inv1+inv1.reqE1)+reqE1.(+inv1.reqS+reqS.inv1)) No new state computed
Name = +inv2.+inv2.grantE No new state computed
Name = (+grantS.(+reqE1.inv1+inv1.reqE1)+reqE1.(+grantS.inv1+inv1.grantS)+inv1.(+reqE1.grantS+grantS.reqE1)) No new state computed
Name = +inv2.+inv2.grantS No new state computed
Name = (+inv1.+grantE.inv2+nonex.+grantE.inv2) No new state computed
Name = (+inv2.(+grantS.reqS+reqS.grantS)+reqS.+inv2.grantS) No new state computed
Name = +inv1.+grantE.inv1 No new state computed
Name = +nonex.+grantS.inv2 No new state computed
Name = (+grantS.+inv1.nonex+inv1.(+nonex.grantS+grantS.nonex)) No new state computed
Name = (+reqS.(+grantE.reqE2+reqE2.grantE)+reqE2.(+grantE.reqS+reqS.grantE)) No new state computed
Name = (+inv1.+nonex++inv1.nonex) No new state computed
Name = +inv1.+nonex.grantE No new state computed
Name = +inv1.+inv2.grantS No new state computed
Name = (+reqE1.(+reqE1.inv2+reqE2.inv2+inv2.reqE1)+reqE2.(+reqE1.inv2+reqE2.inv2+inv2.reqE1)) No new state computed
Name = +grantS.+inv2.grantS No new state computed
Name = (+nonex.(+grantE.reqE1+reqE1.grantE)+reqE1.+nonex.grantE) No new state computed
Name = (+reqS.+inv1+inv1.+reqS+(+inv1.reqS+reqS.inv1)) No new state computed
Name = (+inv1.+grantE++inv1.grantE) No new state computed
Name = (+grantS.+reqE2+reqE2.+grantS+(+reqE2.grantS+grantS.reqE2)) No new state computed
Name = (+reqS.+inv1.nonex+inv1.(+nonex.reqS+reqS.nonex)) No new state computed
Name = (+grantE.(+inv1.reqS+reqS.inv1)+reqS.+grantE.inv1) No new state computed
Name = ++nonex No new state computed
Name = (+reqS.(+reqE1.grantS+grantS.reqE1)+reqE1.(+grantS.reqS+reqS.grantS)) No new state computed
Name = (+grantS.(+nonex.reqS+reqS.nonex)+nonex.(+grantS.reqS+reqS.grantS)+reqS.(+nonex.grantS+grantS.nonex))  I.N.C.R.E.A.S.E
Name = +nonex.+nonex.grantE No new state computed
Name = (+inv2.+reqE1+reqE1.+inv2+reqE2.+inv2+(+reqE1.inv2+reqE2.inv2+inv2.reqE1))  I.N.C.R.E.A.S.E
Name = (+inv2.+grantS++inv2.grantS) No new state computed
Name = +inv2.+grantE.inv2 No new state computed
Name = (+reqE1.+inv1+inv1.+reqE1+(+reqE1.inv1+inv1.reqE1)) No new state computed
Name = (+inv2.(+nonex.reqS+reqS.nonex)+nonex.(+inv2.reqS+reqS.inv2)) No new state computed
Name = ++reqE2 No new state computed
Name = +grantE.+inv2.grantS No new state computed
Name = (+inv1.+inv2++inv1.inv2) No new state computed
Name = (+grantS.(+grantE.reqE1+reqE1.grantE)+grantE.(+reqE1.grantS+grantS.reqE1)) No new state computed
Name = (+reqS.(+grantE.reqE1+reqE1.grantE)+reqE1.(+grantE.reqS+reqS.grantE)) No new state computed
Name = +reqS.(+inv2.reqS+reqS.inv2) No new state computed
Name = +reqE2.+grantE.inv1 No new state computed
Name = (+reqE1.+grantE+grantE.+reqE1+(+grantE.reqE1+reqE1.grantE)) No new state computed
Name = (+reqE1.+inv1.inv2+reqE2.+inv1.inv2+inv1.(+reqE1.inv2+reqE2.inv2+inv2.reqE1)) No new state computed
Name = (+reqS.(+reqE1.inv2+reqE2.inv2+inv2.reqE1)+reqE1.(+inv2.reqS+reqS.inv2)+reqE2.(+inv2.reqS+reqS.inv2)) No new state computed
Name = +grantE.+grantE.inv1 No new state computed
Name = (+grantE.+inv1.nonex+nonex.+grantE.inv1) No new state computed
Name = (+inv2.(+reqE2.grantS+grantS.reqE2)+grantS.(+reqE1.inv2+reqE2.inv2+inv2.reqE1)+reqE1.+grantS.inv2+reqE2.+grantS.inv2)  I.N.C.R.E.A.S.E
Name = +grantS.+grantS.inv2 No new state computed
Name = (+reqS.+grantE.inv2+grantE.(+inv2.reqS+reqS.inv2)) No new state computed
Name = (+grantS.(+grantE.reqS+reqS.grantE)+grantE.(+grantS.reqS+reqS.grantS)) No new state computed
increase = 1
**********************
Random choose
Name = (+inv2.(+reqE2.grantS+grantS.reqE2)+grantS.(+reqE1.inv2+reqE2.inv2+inv2.reqE1)+reqE1.+grantS.inv2+reqE2.+grantS.inv2)  OK !
Now we have a representation of size = 65
Minimization in Progress
Name = +grantE.+inv2.grantE No new state computed
Name = (+inv2.+grantE.inv1+grantE.+inv1.inv2) No new state computed
Name = (+grantE.+inv1.nonex+nonex.+grantE.inv1) No new state computed
Name = (+grantS.+reqS+reqS.+grantS+(+grantS.reqS+reqS.grantS))  I.N.C.R.E.A.S.E
Name = +grantE.+grantE.inv2 No new state computed
Name = (+reqS.(+grantE.reqE2+reqE2.grantE)+reqE2.(+grantE.reqS+reqS.grantE)) No new state computed
Name = (+inv2.+grantS++inv2.grantS) No new state computed
Name = (+inv2.(+grantS.reqS+reqS.grantS)+reqS.+inv2.grantS) No new state computed
Name = ++nonex No new state computed
Name = (+reqE1.+inv1.inv2+reqE2.+inv1.inv2+inv1.(+reqE1.inv2+reqE2.inv2+inv2.reqE1)) No new state computed
Name = (+grantS.+inv1+inv1.+grantS+(+grantS.inv1+inv1.grantS)) No new state computed
Name = (+grantS.+reqE2+reqE2.+grantS+(+reqE2.grantS+grantS.reqE2)) No new state computed
Name = (+grantS.+inv1.nonex+inv1.(+nonex.grantS+grantS.nonex)) No new state computed
Name = +grantE.+grantE.inv1 No new state computed
Name = (+nonex.+grantE++nonex.grantE) No new state computed
Name = ++inv2  I.N.C.R.E.A.S.E
Name = (+grantS.+inv2++grantS.inv2) No new state computed
Name = ++inv1 No new state computed
Name = (+inv2.+nonex.grantE+inv1.+inv2.grantE+nonex.+inv2.grantE) No new state computed
Name = ++grantS No new state computed
Name = (+nonex.(+grantE.reqS+reqS.grantE)+reqS.+nonex.grantE) No new state computed
Name = ++reqE2 No new state computed
Name = (+grantS.(+nonex.reqS+reqS.nonex)+nonex.(+grantS.reqS+reqS.grantS)+reqS.(+nonex.grantS+grantS.nonex))  I.N.C.R.E.A.S.E
Name = (+reqE1.+grantE.inv2+reqE2.+grantE.inv2+grantE.(+reqE1.inv2+reqE2.inv2+inv2.reqE1))  I.N.C.R.E.A.S.E
Name = (+reqE1.(+reqE1.inv2+reqE2.inv2+inv2.reqE1)+reqE2.(+reqE1.inv2+reqE2.inv2+inv2.reqE1)) No new state computed
Name = +grantS.+grantS.inv2 No new state computed
Name = (+nonex.(+grantE.reqE1+reqE1.grantE)+reqE1.+nonex.grantE) No new state computed
Name = (+grantS.(+inv2.reqS+reqS.inv2)+reqS.+grantS.inv2) No new state computed
Name = +inv2.+grantE.inv2 No new state computed
Name = (+inv2.+reqE1+reqE1.+inv2+reqE2.+inv2+(+reqE1.inv2+reqE2.inv2+inv2.reqE1))  I.N.C.R.E.A.S.E
Name = (+nonex.(+reqE1.grantS+grantS.reqE1)+reqE1.(+nonex.grantS+grantS.nonex)) No new state computed
Name = (+inv2.(+reqE1.grantS+grantS.reqE1)+reqE1.+inv2.grantS+reqE2.+inv2.grantS) No new state computed
Name = (+reqE2.(+grantS.inv1+inv1.grantS)+inv1.(+reqE2.grantS+grantS.reqE2)) No new state computed
Name = (+grantE.+inv2++grantE.inv2) No new state computed
Name = (+grantS.(+inv1.reqS+reqS.inv1)+reqS.(+grantS.inv1+inv1.grantS)+inv1.(+grantS.reqS+reqS.grantS)) No new state computed
Name = (+grantS.+inv1.inv2+inv1.+grantS.inv2) No new state computed
Name = +grantE.+inv2.grantS No new state computed
Name = (+grantS.(+grantE.reqE1+reqE1.grantE)+grantE.(+reqE1.grantS+grantS.reqE1)) No new state computed
Name = (+inv2.(+grantE.reqS+reqS.grantE)+reqS.+inv2.grantE)  I.N.C.R.E.A.S.E
Name = (+inv2.(+grantE.reqE1+reqE1.grantE)+reqE1.+inv2.grantE+reqE2.+inv2.grantE) No new state computed
Name = (+reqE1.+inv1+inv1.+reqE1+(+reqE1.inv1+inv1.reqE1)) No new state computed
Name = (+grantS.(+reqE1.inv1+inv1.reqE1)+reqE1.(+grantS.inv1+inv1.grantS)+inv1.(+reqE1.grantS+grantS.reqE1)) No new state computed
Name = (+grantS.(+grantE.reqS+reqS.grantE)+grantE.(+grantS.reqS+reqS.grantS)) No new state computed
Name = (+reqE1.+grantE+grantE.+reqE1+(+grantE.reqE1+reqE1.grantE)) No new state computed
Name = +grantS.+inv2.grantE No new state computed
Name = (+reqS.+inv1.nonex+inv1.(+nonex.reqS+reqS.nonex)) No new state computed
Name = +reqE2.+grantE.inv1 No new state computed
Name = (+nonex.(+grantE.reqE2+reqE2.grantE)+reqE2.+nonex.grantE) No new state computed
Name = +reqE2.(+reqE1.grantS+grantS.reqE1) No new state computed
Name = (+reqS.+inv1.inv2+inv1.(+inv2.reqS+reqS.inv2)) No new state computed
Name = (+reqE2.+grantE+grantE.+reqE2+(+grantE.reqE2+reqE2.grantE)) No new state computed
Name = (+grantS.+reqE1+reqE1.+grantS+(+reqE1.grantS+grantS.reqE1)) No new state computed
Name = (+grantS.(+grantE.reqE2+reqE2.grantE)+grantE.(+reqE2.grantS+grantS.reqE2)) No new state computed
Name = (+grantE.+inv1++grantE.inv1) No new state computed
Name = (+reqS.+inv1+inv1.+reqS+(+inv1.reqS+reqS.inv1)) No new state computed
Name = (+grantE.(+inv1.reqS+reqS.inv1)+reqS.+grantE.inv1) No new state computed
Name = +inv1.+inv2.grantS No new state computed
Name = (+grantE.(+reqE1.inv1+inv1.reqE1)+reqE1.+grantE.inv1) No new state computed
Name = (+inv1.+grantE++inv1.grantE) No new state computed
Name = +grantE.+inv1.grantE No new state computed
Name = (+grantE.(+grantS.inv1+inv1.grantS)+grantS.+grantE.inv1) No new state computed
Name = +grantS.+inv2.grantS No new state computed
Name = (+nonex.+reqS+reqS.+nonex+(+nonex.reqS+reqS.nonex))  I.N.C.R.E.A.S.E
Name = +reqE1.+inv1.nonex No new state computed
Name = ++reqS  I.N.C.R.E.A.S.E
Name = +inv1.+grantE.inv1 No new state computed
Name = (+reqS.(+reqE2.grantS+grantS.reqE2)+reqE2.(+grantS.reqS+reqS.grantS)) No new state computed
Name = +grantS.+nonex.grantE No new state computed
Name = +inv1.+nonex.grantE No new state computed
Name = (+grantS.+nonex+nonex.+grantS+(+nonex.grantS+grantS.nonex)) No new state computed
Name = (+reqS.(+grantE.reqE1+reqE1.grantE)+reqE1.(+grantE.reqS+reqS.grantE)) No new state computed
Name = +nonex.+nonex.grantE No new state computed
Name = (+inv2.+grantE++inv2.grantE) No new state computed
Name = (+nonex.(+reqE2.grantS+grantS.reqE2)+reqE2.(+nonex.grantS+grantS.nonex)) No new state computed
Name = (+inv2.+reqS+reqS.+inv2+(+inv2.reqS+reqS.inv2)) No new state computed
Name = +nonex.+grantS.inv2 No new state computed
Name = (+inv1.+inv2++inv1.inv2) No new state computed
Name = ++grantE No new state computed
Name = +reqS.(+inv2.reqS+reqS.inv2) No new state computed
Name = (+reqS.(+reqE1.grantS+grantS.reqE1)+reqE1.(+grantS.reqS+reqS.grantS)) No new state computed
Name = (+inv1.(+grantE.reqE1+reqE1.grantE)+reqE1.+inv1.grantE) No new state computed
Name = (+inv1.(+grantE.reqE2+reqE2.grantE)+reqE2.+inv1.grantE) No new state computed
Name = +inv2.+inv2.grantE No new state computed
Name = +inv2.+inv2.grantS No new state computed
Name = +grantS.+inv1.grantE No new state computed
Name = (+reqS.(+reqE1.inv2+reqE2.inv2+inv2.reqE1)+reqE1.(+inv2.reqS+reqS.inv2)+reqE2.(+inv2.reqS+reqS.inv2)) No new state computed
Name = (+reqS.+grantE.inv2+grantE.(+inv2.reqS+reqS.inv2)) No new state computed
Name = (+inv1.(+grantE.reqS+reqS.grantE)+reqS.+inv1.grantE) No new state computed
Name = (+reqS.(+reqE1.inv1+inv1.reqE1)+reqE1.(+inv1.reqS+reqS.inv1)) No new state computed
Name = (+inv1.+nonex++inv1.nonex) No new state computed
Name = (+inv2.(+nonex.reqS+reqS.nonex)+nonex.(+inv2.reqS+reqS.inv2)) No new state computed
Name = (+inv1.+grantE.inv2+nonex.+grantE.inv2) No new state computed
Name = ++reqE1 No new state computed
Name = (+grantS.+grantE.inv2+grantE.+grantS.inv2) No new state computed
Name = (+reqS.+grantE+grantE.+reqS+(+grantE.reqS+reqS.grantE))  I.N.C.R.E.A.S.E
Name = (+inv2.(+nonex.grantS+grantS.nonex)+nonex.+inv2.grantS) No new state computed
increase = 1
**********************
Random choose
Name = (+reqS.+grantE+grantE.+reqS+(+grantE.reqS+reqS.grantE))  OK !
Now we have a representation of size = 70
Minimization in Progress
Name = ++grantS No new state computed
Name = (+reqS.(+reqE1.inv2+reqE2.inv2+inv2.reqE1)+reqE1.(+inv2.reqS+reqS.inv2)+reqE2.(+inv2.reqS+reqS.inv2)) No new state computed
Name = +grantE.+inv1.grantE No new state computed
Name = (+inv1.(+grantE.reqS+reqS.grantE)+reqS.+inv1.grantE) No new state computed
Name = (+reqS.+grantE.inv2+grantE.(+inv2.reqS+reqS.inv2)) No new state computed
Name = (+grantE.+inv2++grantE.inv2) No new state computed
Name = ++reqE1 No new state computed
Name = (+nonex.+grantE++nonex.grantE) No new state computed
Name = (+inv2.(+grantE.reqE1+reqE1.grantE)+reqE1.+inv2.grantE+reqE2.+inv2.grantE) No new state computed
Name = (+inv2.(+grantE.reqS+reqS.grantE)+reqS.+inv2.grantE) No new state computed
Name = (+nonex.(+reqE1.grantS+grantS.reqE1)+reqE1.(+nonex.grantS+grantS.nonex)) No new state computed
Name = +grantS.+nonex.grantE No new state computed
Name = (+inv2.+grantE.inv1+grantE.+inv1.inv2) No new state computed
Name = +nonex.+grantS.inv2 No new state computed
Name = +inv1.+inv2.grantS No new state computed
Name = (+inv2.+reqE1+reqE1.+inv2+reqE2.+inv2+(+reqE1.inv2+reqE2.inv2+inv2.reqE1))  I.N.C.R.E.A.S.E
Name = (+grantS.+grantE.inv2+grantE.+grantS.inv2) No new state computed
Name = (+grantS.(+inv1.reqS+reqS.inv1)+reqS.(+grantS.inv1+inv1.grantS)+inv1.(+grantS.reqS+reqS.grantS))  I.N.C.R.E.A.S.E
Name = +inv1.+nonex.grantE No new state computed
Name = (+inv2.(+nonex.reqS+reqS.nonex)+nonex.(+inv2.reqS+reqS.inv2)) No new state computed
Name = ++nonex No new state computed
Name = (+grantS.+inv2++grantS.inv2) No new state computed
Name = ++reqE2 No new state computed
Name = (+grantS.(+nonex.reqS+reqS.nonex)+nonex.(+grantS.reqS+reqS.grantS)+reqS.(+nonex.grantS+grantS.nonex))  I.N.C.R.E.A.S.E
Name = (+inv2.+grantE++inv2.grantE) No new state computed
Name = +grantS.+inv2.grantS No new state computed
Name = (+grantS.(+inv2.reqS+reqS.inv2)+reqS.+grantS.inv2) No new state computed
Name = (+grantS.+inv1+inv1.+grantS+(+grantS.inv1+inv1.grantS)) No new state computed
Name = (+nonex.(+grantE.reqE1+reqE1.grantE)+reqE1.+nonex.grantE) No new state computed
Name = (+reqE1.(+reqE1.inv2+reqE2.inv2+inv2.reqE1)+reqE2.(+reqE1.inv2+reqE2.inv2+inv2.reqE1)) No new state computed
Name = (+inv2.(+grantS.reqS+reqS.grantS)+reqS.+inv2.grantS) No new state computed
Name = (+reqS.(+reqE1.inv1+inv1.reqE1)+reqE1.(+inv1.reqS+reqS.inv1)) No new state computed
Name = (+inv2.(+reqE2.grantS+grantS.reqE2)+grantS.(+reqE1.inv2+reqE2.inv2+inv2.reqE1)+reqE1.+grantS.inv2+reqE2.+grantS.inv2) No new state computed
Name = (+inv2.(+nonex.grantS+grantS.nonex)+nonex.+inv2.grantS) No new state computed
Name = (+inv1.(+grantE.reqE1+reqE1.grantE)+reqE1.+inv1.grantE) No new state computed
Name = (+inv1.(+grantE.reqE2+reqE2.grantE)+reqE2.+inv1.grantE) No new state computed
Name = (+inv1.+grantE++inv1.grantE) No new state computed
Name = +grantE.+grantE.inv2 No new state computed
Name = (+grantS.(+grantE.reqS+reqS.grantE)+grantE.(+grantS.reqS+reqS.grantS)) No new state computed
Name = (+reqS.+inv1.nonex+inv1.(+nonex.reqS+reqS.nonex)) No new state computed
Name = (+grantS.+nonex+nonex.+grantS+(+nonex.grantS+grantS.nonex)) No new state computed
Name = (+grantS.+inv1.nonex+inv1.(+nonex.grantS+grantS.nonex)) No new state computed
Name = +nonex.+nonex.grantE No new state computed
Name = (+reqS.(+grantE.reqE2+reqE2.grantE)+reqE2.(+grantE.reqS+reqS.grantE)) No new state computed
Name = +reqE1.+inv1.nonex No new state computed
Name = (+inv2.+nonex.grantE+inv1.+inv2.grantE+nonex.+inv2.grantE) No new state computed
Name = +grantS.+inv2.grantE No new state computed
Name = (+inv2.+reqS+reqS.+inv2+(+inv2.reqS+reqS.inv2)) No new state computed
Name = (+nonex.+reqS+reqS.+nonex+(+nonex.reqS+reqS.nonex))  I.N.C.R.E.A.S.E
Name = (+reqS.+inv1+inv1.+reqS+(+inv1.reqS+reqS.inv1)) No new state computed
Name = (+grantE.(+inv1.reqS+reqS.inv1)+reqS.+grantE.inv1) No new state computed
Name = (+reqS.(+reqE1.grantS+grantS.reqE1)+reqE1.(+grantS.reqS+reqS.grantS)) No new state computed
Name = +grantE.+inv2.grantS No new state computed
Name = (+nonex.(+grantE.reqE2+reqE2.grantE)+reqE2.+nonex.grantE) No new state computed
Name = +reqE2.+grantE.inv1 No new state computed
Name = (+nonex.(+grantE.reqS+reqS.grantE)+reqS.+nonex.grantE) No new state computed
Name = +grantS.+grantS.inv2 No new state computed
Name = (+grantS.(+reqE1.inv1+inv1.reqE1)+reqE1.(+grantS.inv1+inv1.grantS)+inv1.(+reqE1.grantS+grantS.reqE1)) No new state computed
Name = ++grantE No new state computed
Name = +inv2.+grantE.inv2 No new state computed
Name = (+reqE1.+grantE.inv2+reqE2.+grantE.inv2+grantE.(+reqE1.inv2+reqE2.inv2+inv2.reqE1))  I.N.C.R.E.A.S.E
Name = (+reqE1.+inv1.inv2+reqE2.+inv1.inv2+inv1.(+reqE1.inv2+reqE2.inv2+inv2.reqE1)) No new state computed
Name = +inv1.+grantE.inv1 No new state computed
Name = +reqS.(+inv2.reqS+reqS.inv2) No new state computed
Name = ++inv1 No new state computed
Name = (+grantS.+reqS+reqS.+grantS+(+grantS.reqS+reqS.grantS))  I.N.C.R.E.A.S.E
Name = (+nonex.(+reqE2.grantS+grantS.reqE2)+reqE2.(+nonex.grantS+grantS.nonex)) No new state computed
Name = (+grantE.+inv1.nonex+nonex.+grantE.inv1) No new state computed
Name = ++reqS  I.N.C.R.E.A.S.E
Name = ++inv2  I.N.C.R.E.A.S.E
Name = +inv2.+inv2.grantE No new state computed
Name = (+inv1.+inv2++inv1.inv2) No new state computed
Name = (+grantE.(+grantS.inv1+inv1.grantS)+grantS.+grantE.inv1) No new state computed
Name = (+grantS.+reqE1+reqE1.+grantS+(+reqE1.grantS+grantS.reqE1)) No new state computed
Name = (+grantS.(+grantE.reqE2+reqE2.grantE)+grantE.(+reqE2.grantS+grantS.reqE2)) No new state computed
Name = +grantS.+inv1.grantE No new state computed
Name = (+grantE.(+reqE1.inv1+inv1.reqE1)+reqE1.+grantE.inv1) No new state computed
Name = (+inv1.+nonex++inv1.nonex) No new state computed
Name = (+inv1.+grantE.inv2+nonex.+grantE.inv2) No new state computed
Name = +grantE.+inv2.grantE No new state computed
Name = (+reqE1.+grantE+grantE.+reqE1+(+grantE.reqE1+reqE1.grantE)) No new state computed
Name = +reqE2.(+reqE1.grantS+grantS.reqE1) No new state computed
Name = (+reqS.(+reqE2.grantS+grantS.reqE2)+reqE2.(+grantS.reqS+reqS.grantS)) No new state computed
Name = (+reqE1.+inv1+inv1.+reqE1+(+reqE1.inv1+inv1.reqE1)) No new state computed
Name = (+reqE2.(+grantS.inv1+inv1.grantS)+inv1.(+reqE2.grantS+grantS.reqE2)) No new state computed
Name = (+reqS.(+grantE.reqE1+reqE1.grantE)+reqE1.(+grantE.reqS+reqS.grantE)) No new state computed
Name = +grantE.+grantE.inv1 No new state computed
Name = (+reqS.+inv1.inv2+inv1.(+inv2.reqS+reqS.inv2)) No new state computed
Name = +inv2.+inv2.grantS No new state computed
Name = (+grantS.(+grantE.reqE1+reqE1.grantE)+grantE.(+reqE1.grantS+grantS.reqE1)) No new state computed
Name = (+grantE.+inv1++grantE.inv1) No new state computed
Name = (+grantS.+inv1.inv2+inv1.+grantS.inv2) No new state computed
Name = (+inv2.(+reqE1.grantS+grantS.reqE1)+reqE1.+inv2.grantS+reqE2.+inv2.grantS) No new state computed
Name = (+inv2.+grantS++inv2.grantS) No new state computed
Name = (+reqE2.+grantE+grantE.+reqE2+(+grantE.reqE2+reqE2.grantE)) No new state computed
Name = (+grantS.+reqE2+reqE2.+grantS+(+reqE2.grantS+grantS.reqE2)) No new state computed
increase = 1
**********************
Random choose
Name = ++inv2  OK !
Now we have a representation of size = 73
Minimization in Progress
Name = (+reqS.(+reqE1.inv1+inv1.reqE1)+reqE1.(+inv1.reqS+reqS.inv1)) No new state computed
Name = +reqS.(+inv2.reqS+reqS.inv2) No new state computed
Name = (+grantS.+inv1.nonex+inv1.(+nonex.grantS+grantS.nonex)) No new state computed
Name = +reqE1.+inv1.nonex No new state computed
Name = (+inv2.+grantE++inv2.grantE) No new state computed
Name = (+grantS.(+inv1.reqS+reqS.inv1)+reqS.(+grantS.inv1+inv1.grantS)+inv1.(+grantS.reqS+reqS.grantS))  I.N.C.R.E.A.S.E
Name = (+reqS.+grantE.inv2+grantE.(+inv2.reqS+reqS.inv2)) No new state computed
Name = ++nonex No new state computed
Name = +nonex.+grantS.inv2 No new state computed
Name = (+inv1.(+grantE.reqE1+reqE1.grantE)+reqE1.+inv1.grantE) No new state computed
Name = (+reqS.+inv1+inv1.+reqS+(+inv1.reqS+reqS.inv1)) No new state computed
Name = (+reqE1.+grantE+grantE.+reqE1+(+grantE.reqE1+reqE1.grantE)) No new state computed
Name = (+reqE1.+grantE.inv2+reqE2.+grantE.inv2+grantE.(+reqE1.inv2+reqE2.inv2+inv2.reqE1)) No new state computed
Name = (+reqS.(+grantE.reqE2+reqE2.grantE)+reqE2.(+grantE.reqS+reqS.grantE)) No new state computed
Name = ++inv1 No new state computed
Name = +inv2.+inv2.grantS No new state computed
Name = (+reqS.+inv1.inv2+inv1.(+inv2.reqS+reqS.inv2)) No new state computed
Name = +nonex.+nonex.grantE No new state computed
Name = (+inv1.(+grantE.reqE2+reqE2.grantE)+reqE2.+inv1.grantE) No new state computed
Name = ++grantS No new state computed
Name = ++reqE2 No new state computed
Name = ++reqS  I.N.C.R.E.A.S.E
Name = +grantS.+grantS.inv2 No new state computed
Name = (+inv1.+inv2++inv1.inv2) No new state computed
Name = +grantE.+inv1.grantE No new state computed
Name = (+reqS.(+reqE1.grantS+grantS.reqE1)+reqE1.(+grantS.reqS+reqS.grantS)) No new state computed
Name = (+inv1.+grantE++inv1.grantE) No new state computed
Name = (+inv2.(+grantS.reqS+reqS.grantS)+reqS.+inv2.grantS) No new state computed
Name = +grantE.+grantE.inv2 No new state computed
Name = +reqE2.+grantE.inv1 No new state computed
Name = (+reqS.(+reqE1.inv2+reqE2.inv2+inv2.reqE1)+reqE1.(+inv2.reqS+reqS.inv2)+reqE2.(+inv2.reqS+reqS.inv2)) No new state computed
Name = +grantE.+inv2.grantS No new state computed
Name = (+reqS.+inv1.nonex+inv1.(+nonex.reqS+reqS.nonex)) No new state computed
Name = (+inv2.(+nonex.grantS+grantS.nonex)+nonex.+inv2.grantS) No new state computed
Name = (+grantE.+inv2++grantE.inv2) No new state computed
Name = +grantE.+grantE.inv1 No new state computed
Name = +inv1.+nonex.grantE No new state computed
Name = (+grantS.+reqS+reqS.+grantS+(+grantS.reqS+reqS.grantS))  I.N.C.R.E.A.S.E
Name = ++reqE1 No new state computed
Name = (+inv2.+reqE1+reqE1.+inv2+reqE2.+inv2+(+reqE1.inv2+reqE2.inv2+inv2.reqE1)) No new state computed
Name = (+grantS.(+grantE.reqS+reqS.grantE)+grantE.(+grantS.reqS+reqS.grantS)) No new state computed
Name = (+grantS.+inv1+inv1.+grantS+(+grantS.inv1+inv1.grantS)) No new state computed
Name = (+nonex.(+reqE1.grantS+grantS.reqE1)+reqE1.(+nonex.grantS+grantS.nonex)) No new state computed
Name = (+grantS.+inv2++grantS.inv2) No new state computed
Name = (+nonex.+grantE++nonex.grantE) No new state computed
Name = (+reqS.+grantE+grantE.+reqS+(+grantE.reqS+reqS.grantE)) No new state computed
Name = (+inv2.+nonex.grantE+inv1.+inv2.grantE+nonex.+inv2.grantE) No new state computed
Name = (+inv1.+nonex++inv1.nonex) No new state computed
Name = +grantS.+nonex.grantE No new state computed
Name = (+grantE.(+inv1.reqS+reqS.inv1)+reqS.+grantE.inv1) No new state computed
Name = (+grantS.+inv1.inv2+inv1.+grantS.inv2) No new state computed
Name = (+grantE.+inv1++grantE.inv1) No new state computed
Name = (+inv2.(+reqE2.grantS+grantS.reqE2)+grantS.(+reqE1.inv2+reqE2.inv2+inv2.reqE1)+reqE1.+grantS.inv2+reqE2.+grantS.inv2) No new state computed
Name = (+nonex.+reqS+reqS.+nonex+(+nonex.reqS+reqS.nonex))  I.N.C.R.E.A.S.E
Name = (+grantE.(+reqE1.inv1+inv1.reqE1)+reqE1.+grantE.inv1) No new state computed
Name = (+inv2.(+grantE.reqS+reqS.grantE)+reqS.+inv2.grantE) No new state computed
Name = (+reqE2.(+grantS.inv1+inv1.grantS)+inv1.(+reqE2.grantS+grantS.reqE2)) No new state computed
Name = +inv2.+inv2.grantE No new state computed
Name = (+inv1.(+grantE.reqS+reqS.grantE)+reqS.+inv1.grantE) No new state computed
Name = (+reqS.(+grantE.reqE1+reqE1.grantE)+reqE1.(+grantE.reqS+reqS.grantE)) No new state computed
Name = (+grantS.(+grantE.reqE2+reqE2.grantE)+grantE.(+reqE2.grantS+grantS.reqE2)) No new state computed
Name = (+nonex.(+grantE.reqS+reqS.grantE)+reqS.+nonex.grantE) No new state computed
Name = (+reqE1.+inv1+inv1.+reqE1+(+reqE1.inv1+inv1.reqE1)) No new state computed
Name = (+grantS.+reqE2+reqE2.+grantS+(+reqE2.grantS+grantS.reqE2)) No new state computed
Name = +grantE.+inv2.grantE No new state computed
Name = (+reqS.(+reqE2.grantS+grantS.reqE2)+reqE2.(+grantS.reqS+reqS.grantS)) No new state computed
Name = (+reqE2.+grantE+grantE.+reqE2+(+grantE.reqE2+reqE2.grantE)) No new state computed
Name = +inv1.+inv2.grantS No new state computed
Name = (+reqE1.+inv1.inv2+reqE2.+inv1.inv2+inv1.(+reqE1.inv2+reqE2.inv2+inv2.reqE1)) No new state computed
Name = (+inv2.(+reqE1.grantS+grantS.reqE1)+reqE1.+inv2.grantS+reqE2.+inv2.grantS) No new state computed
Name = +grantS.+inv2.grantE No new state computed
Name = (+grantS.(+grantE.reqE1+reqE1.grantE)+grantE.(+reqE1.grantS+grantS.reqE1)) No new state computed
Name = (+grantS.+nonex+nonex.+grantS+(+nonex.grantS+grantS.nonex)) No new state computed
Name = (+grantS.+grantE.inv2+grantE.+grantS.inv2) No new state computed
Name = (+grantS.+reqE1+reqE1.+grantS+(+reqE1.grantS+grantS.reqE1)) No new state computed
Name = ++grantE No new state computed
Name = +inv2.+grantE.inv2 No new state computed
Name = +grantS.+inv1.grantE No new state computed
Name = (+grantS.(+reqE1.inv1+inv1.reqE1)+reqE1.(+grantS.inv1+inv1.grantS)+inv1.(+reqE1.grantS+grantS.reqE1)) No new state computed
Name = (+grantS.(+nonex.reqS+reqS.nonex)+nonex.(+grantS.reqS+reqS.grantS)+reqS.(+nonex.grantS+grantS.nonex))  I.N.C.R.E.A.S.E
Name = (+reqE1.(+reqE1.inv2+reqE2.inv2+inv2.reqE1)+reqE2.(+reqE1.inv2+reqE2.inv2+inv2.reqE1)) No new state computed
Name = (+nonex.(+grantE.reqE2+reqE2.grantE)+reqE2.+nonex.grantE) No new state computed
Name = (+inv2.+grantE.inv1+grantE.+inv1.inv2) No new state computed
Name = +reqE2.(+reqE1.grantS+grantS.reqE1) No new state computed
Name = (+grantE.+inv1.nonex+nonex.+grantE.inv1) No new state computed
Name = +grantS.+inv2.grantS No new state computed
Name = (+inv2.+grantS++inv2.grantS) No new state computed
Name = +inv1.+grantE.inv1 No new state computed
Name = (+inv2.(+nonex.reqS+reqS.nonex)+nonex.(+inv2.reqS+reqS.inv2)) No new state computed
Name = (+grantE.(+grantS.inv1+inv1.grantS)+grantS.+grantE.inv1) No new state computed
Name = (+nonex.(+reqE2.grantS+grantS.reqE2)+reqE2.(+nonex.grantS+grantS.nonex)) No new state computed
Name = (+grantS.(+inv2.reqS+reqS.inv2)+reqS.+grantS.inv2) No new state computed
Name = (+inv2.(+grantE.reqE1+reqE1.grantE)+reqE1.+inv2.grantE+reqE2.+inv2.grantE) No new state computed
Name = (+inv2.+reqS+reqS.+inv2+(+inv2.reqS+reqS.inv2)) No new state computed
Name = (+inv1.+grantE.inv2+nonex.+grantE.inv2) No new state computed
Name = (+nonex.(+grantE.reqE1+reqE1.grantE)+reqE1.+nonex.grantE) No new state computed
increase = 1
**********************
Random choose
Name = (+grantS.(+nonex.reqS+reqS.nonex)+nonex.(+grantS.reqS+reqS.grantS)+reqS.(+nonex.grantS+grantS.nonex))  OK !
Now we have a representation of size = 91
Minimization in Progress
Name = ++reqE2  OK !
Now we have a representation of size = 90
Name = +grantE.+grantE.inv1 No new state computed
Name = ++reqS No new state computed
Name = +reqE2.+grantE.inv1 No new state computed
Name = (+inv2.+nonex.grantE+inv1.+inv2.grantE+nonex.+inv2.grantE) No new state computed
Name = (+grantE.(+inv1.reqS+reqS.inv1)+reqS.+grantE.inv1) No new state computed
Name = +nonex.+grantS.inv2 No new state computed
Name = (+inv1.(+grantE.reqS+reqS.grantE)+reqS.+inv1.grantE) No new state computed
Name = (+reqS.+inv1+inv1.+reqS+(+inv1.reqS+reqS.inv1)) No new state computed
Name = (+reqE1.+grantE.inv2+reqE2.+grantE.inv2+grantE.(+reqE1.inv2+reqE2.inv2+inv2.reqE1)) No new state computed
Name = (+inv2.(+grantE.reqS+reqS.grantE)+reqS.+inv2.grantE) No new state computed
Name = (+grantS.+inv1+inv1.+grantS+(+grantS.inv1+inv1.grantS)) No new state computed
Name = (+reqS.+inv1.nonex+inv1.(+nonex.reqS+reqS.nonex)) No new state computed
Name = (+reqS.(+reqE1.inv1+inv1.reqE1)+reqE1.(+inv1.reqS+reqS.inv1)) No new state computed
Name = (+grantS.(+grantE.reqS+reqS.grantE)+grantE.(+grantS.reqS+reqS.grantS)) No new state computed
Name = (+reqS.(+reqE1.inv2+reqE2.inv2+inv2.reqE1)+reqE1.(+inv2.reqS+reqS.inv2)+reqE2.(+inv2.reqS+reqS.inv2)) No new state computed
Name = ++grantS No new state computed
Name = (+grantS.(+inv1.reqS+reqS.inv1)+reqS.(+grantS.inv1+inv1.grantS)+inv1.(+grantS.reqS+reqS.grantS)) No new state computed
Name = (+reqS.+grantE+grantE.+reqS+(+grantE.reqS+reqS.grantE)) No new state computed
Name = (+reqE1.(+reqE1.inv2+reqE2.inv2+inv2.reqE1)+reqE2.(+reqE1.inv2+reqE2.inv2+inv2.reqE1)) No new state computed
Name = (+nonex.(+grantE.reqS+reqS.grantE)+reqS.+nonex.grantE) No new state computed
Name = +grantE.+inv1.grantE No new state computed
Name = (+inv1.+grantE.inv2+nonex.+grantE.inv2) No new state computed
Name = (+reqS.(+grantE.reqE2+reqE2.grantE)+reqE2.(+grantE.reqS+reqS.grantE)) No new state computed
Name = +nonex.+nonex.grantE No new state computed
Name = (+grantS.+inv1.nonex+inv1.(+nonex.grantS+grantS.nonex)) No new state computed
Name = (+grantS.+grantE.inv2+grantE.+grantS.inv2) No new state computed
Name = +grantS.+inv2.grantE No new state computed
Name = (+reqE1.+inv1+inv1.+reqE1+(+reqE1.inv1+inv1.reqE1)) No new state computed
Name = (+grantS.(+nonex.reqS+reqS.nonex)+nonex.(+grantS.reqS+reqS.grantS)+reqS.(+nonex.grantS+grantS.nonex)) No new state computed
Name = (+inv2.+grantS++inv2.grantS) No new state computed
Name = ++inv2 No new state computed
Name = +reqE1.+inv1.nonex No new state computed
Name = (+grantS.+inv2++grantS.inv2) No new state computed
Name = (+grantS.+reqE2+reqE2.+grantS+(+reqE2.grantS+grantS.reqE2)) No new state computed
Name = (+inv2.+reqE1+reqE1.+inv2+reqE2.+inv2+(+reqE1.inv2+reqE2.inv2+inv2.reqE1)) No new state computed
Name = (+grantS.(+reqE1.inv1+inv1.reqE1)+reqE1.(+grantS.inv1+inv1.grantS)+inv1.(+reqE1.grantS+grantS.reqE1)) No new state computed
Name = (+inv2.(+grantS.reqS+reqS.grantS)+reqS.+inv2.grantS) No new state computed
Name = +inv1.+inv2.grantS No new state computed
Name = (+grantE.(+reqE1.inv1+inv1.reqE1)+reqE1.+grantE.inv1) No new state computed
Name = (+grantS.(+grantE.reqE1+reqE1.grantE)+grantE.(+reqE1.grantS+grantS.reqE1)) No new state computed
Name = (+grantS.+reqS+reqS.+grantS+(+grantS.reqS+reqS.grantS)) No new state computed
Name = (+inv2.(+reqE1.grantS+grantS.reqE1)+reqE1.+inv2.grantS+reqE2.+inv2.grantS) No new state computed
Name = (+grantS.(+grantE.reqE2+reqE2.grantE)+grantE.(+reqE2.grantS+grantS.reqE2)) No new state computed
Name = (+inv2.(+nonex.grantS+grantS.nonex)+nonex.+inv2.grantS) No new state computed
Name = (+grantS.+inv1.inv2+inv1.+grantS.inv2) No new state computed
Name = (+nonex.+grantE++nonex.grantE) No new state computed
Name = (+reqE1.+grantE+grantE.+reqE1+(+grantE.reqE1+reqE1.grantE)) No new state computed
Name = (+nonex.(+reqE1.grantS+grantS.reqE1)+reqE1.(+nonex.grantS+grantS.nonex)) No new state computed
Name = (+reqS.+inv1.inv2+inv1.(+inv2.reqS+reqS.inv2)) No new state computed
Name = ++nonex No new state computed
Name = +inv2.+grantE.inv2 No new state computed
Name = +inv2.+inv2.grantS No new state computed
Name = (+nonex.(+grantE.reqE1+reqE1.grantE)+reqE1.+nonex.grantE) No new state computed
Name = +reqS.(+inv2.reqS+reqS.inv2) No new state computed
Name = ++grantE No new state computed
Name = +inv1.+grantE.inv1 No new state computed
Name = (+inv1.(+grantE.reqE1+reqE1.grantE)+reqE1.+inv1.grantE) No new state computed
Name = +grantS.+inv2.grantS No new state computed
Name = (+grantE.+inv1.nonex+nonex.+grantE.inv1) No new state computed
Name = (+inv2.(+nonex.reqS+reqS.nonex)+nonex.(+inv2.reqS+reqS.inv2)) No new state computed
Name = (+grantE.+inv1++grantE.inv1) No new state computed
Name = (+inv2.(+reqE2.grantS+grantS.reqE2)+grantS.(+reqE1.inv2+reqE2.inv2+inv2.reqE1)+reqE1.+grantS.inv2+reqE2.+grantS.inv2) No new state computed
Name = +grantE.+inv2.grantE No new state computed
Name = (+grantE.(+grantS.inv1+inv1.grantS)+grantS.+grantE.inv1) No new state computed
Name = (+inv1.+nonex++inv1.nonex) No new state computed
Name = +reqE2.(+reqE1.grantS+grantS.reqE1) No new state computed
Name = +grantS.+grantS.inv2 No new state computed
Name = (+reqS.+grantE.inv2+grantE.(+inv2.reqS+reqS.inv2)) No new state computed
Name = (+nonex.+reqS+reqS.+nonex+(+nonex.reqS+reqS.nonex)) No new state computed
Name = (+reqS.(+reqE2.grantS+grantS.reqE2)+reqE2.(+grantS.reqS+reqS.grantS)) No new state computed
Name = (+reqE1.+inv1.inv2+reqE2.+inv1.inv2+inv1.(+reqE1.inv2+reqE2.inv2+inv2.reqE1)) No new state computed
Name = (+inv1.+inv2++inv1.inv2) No new state computed
Name = +grantS.+inv1.grantE No new state computed
Name = +inv2.+inv2.grantE No new state computed
Name = +grantE.+inv2.grantS No new state computed
Name = (+grantS.(+inv2.reqS+reqS.inv2)+reqS.+grantS.inv2) No new state computed
Name = (+inv2.+reqS+reqS.+inv2+(+inv2.reqS+reqS.inv2)) No new state computed
Name = (+grantE.+inv2++grantE.inv2) No new state computed
Name = (+nonex.(+grantE.reqE2+reqE2.grantE)+reqE2.+nonex.grantE) No new state computed
Name = ++reqE1 No new state computed
Name = +grantS.+nonex.grantE No new state computed
Name = (+reqE2.+grantE+grantE.+reqE2+(+grantE.reqE2+reqE2.grantE)) No new state computed
Name = (+inv2.+grantE.inv1+grantE.+inv1.inv2) No new state computed
Name = (+grantS.+reqE1+reqE1.+grantS+(+reqE1.grantS+grantS.reqE1)) No new state computed
Name = (+reqE2.(+grantS.inv1+inv1.grantS)+inv1.(+reqE2.grantS+grantS.reqE2)) No new state computed
Name = (+grantS.+nonex+nonex.+grantS+(+nonex.grantS+grantS.nonex)) No new state computed
Name = (+inv1.(+grantE.reqE2+reqE2.grantE)+reqE2.+inv1.grantE) No new state computed
Name = (+reqS.(+reqE1.grantS+grantS.reqE1)+reqE1.(+grantS.reqS+reqS.grantS)) No new state computed
Name = (+inv2.+grantE++inv2.grantE) No new state computed
Name = (+reqS.(+grantE.reqE1+reqE1.grantE)+reqE1.(+grantE.reqS+reqS.grantE)) No new state computed
Name = +inv1.+nonex.grantE No new state computed
Name = (+inv2.(+grantE.reqE1+reqE1.grantE)+reqE1.+inv2.grantE+reqE2.+inv2.grantE) No new state computed
Name = +grantE.+grantE.inv2 No new state computed
Name = ++inv1 No new state computed
Name = (+nonex.(+reqE2.grantS+grantS.reqE2)+reqE2.(+nonex.grantS+grantS.nonex)) No new state computed
Name = (+inv1.+grantE++inv1.grantE) No new state computed
increase = 0
nb accelerations 11
Fix point FOUND
seed is : 3284
