current set encoding is : omega
seed is : 2691
cycles of length 1
(1/17), name = t1, size = 116
(2/17), name = t2, size = 116
(3/17), name = t3, size = 117
(4/17), name = t4, size = 117
(5/17), name = t5, size = 117
(6/17), name = t6, size = 117
(7/17), name = t7, size = 116
(8/17), name = t8, size = 116
(9/17), name = t9, size = 116
(10/17), name = t10, size = 116
(11/17), name = t11, size = 116
(12/17), name = t12, size = 116
(13/17), name = t13, size = 116
(14/17), name = t14, size = 116
(15/17), name = t15, size = 116
(16/17), name = t16, size = 117
(17/17), name = t17, size = 117
**********************
Random choose
Name = t7  No new state computed
Name = t2  OK !
Now we have a representation of size = 39
Minimization in Progress
Name = t7 No new state computed
Name = t14 No new state computed
Name = t16 No new state computed
Name = t10  I.N.C.R.E.A.S.E
Name = t12 No new state computed
Name = t13 No new state computed
Name = t1  I.N.C.R.E.A.S.E
Name = t3 No new state computed
Name = t4 No new state computed
Name = t17 No new state computed
Name = t6 No new state computed
Name = t15 No new state computed
Name = t5 No new state computed
Name = t8 No new state computed
Name = t9 No new state computed
Name = t11 No new state computed
increase = 1
**********************
Random choose
Name = t1  OK !
Now we have a representation of size = 80
Minimization in Progress
Name = t2 No new state computed
Name = t9 No new state computed
Name = t11 No new state computed
Name = t6 No new state computed
Name = t14 No new state computed
Name = t8 No new state computed
Name = t7 No new state computed
Name = t15 No new state computed
Name = t5 No new state computed
Name = t4 No new state computed
Name = t12 No new state computed
Name = t3 No new state computed
Name = t17 No new state computed
Name = t10  I.N.C.R.E.A.S.E
Name = t16 No new state computed
Name = t13 No new state computed
increase = 1
**********************
Random choose
Name = t10  OK !
Now we have a representation of size = 164
Minimization in Progress
Name = t16 No new state computed
Name = t2 No new state computed
Name = t5 No new state computed
Name = t13  I.N.C.R.E.A.S.E
Name = t12  I.N.C.R.E.A.S.E
Name = t4 No new state computed
Name = t3 No new state computed
Name = t11  I.N.C.R.E.A.S.E
Name = t14 No new state computed
Name = t15 No new state computed
Name = t8 No new state computed
Name = t6 No new state computed
Name = t17 No new state computed
Name = t7 No new state computed
Name = t9  I.N.C.R.E.A.S.E
Name = t1 No new state computed
increase = 1
**********************
Random choose
Name = t9  OK !
Now we have a representation of size = 252
Minimization in Progress
Name = t16 No new state computed
Name = t5 No new state computed
Name = t1 No new state computed
Name = t12  I.N.C.R.E.A.S.E
Name = t14 No new state computed
Name = t8 No new state computed
Name = t17 No new state computed
Name = t15 No new state computed
Name = t2 No new state computed
Name = t10 No new state computed
Name = t13  I.N.C.R.E.A.S.E
Name = t3  I.N.C.R.E.A.S.E
Name = t7 No new state computed
Name = t4 No new state computed
Name = t11  I.N.C.R.E.A.S.E
Name = t6 No new state computed
increase = 1
**********************
Random choose
Name = t11  OK !
Now we have a representation of size = 432
Minimization in Progress
Name = t14 No new state computed
Name = t5 No new state computed
Name = t9 No new state computed
Name = t17 No new state computed
Name = t8 No new state computed
Name = t13  I.N.C.R.E.A.S.E
Name = t3  I.N.C.R.E.A.S.E
Name = t2 No new state computed
Name = t1 No new state computed
Name = t7 No new state computed
Name = t12  I.N.C.R.E.A.S.E
Name = t4 No new state computed
Name = t16 No new state computed
Name = t15 No new state computed
Name = t6  I.N.C.R.E.A.S.E
Name = t10 No new state computed
increase = 1
**********************
Random choose
Name = t6  OK !
Now we have a representation of size = 532
Minimization in Progress
Name = t16 No new state computed
Name = t17 No new state computed
Name = t4 No new state computed
Name = t1 No new state computed
Name = t13  I.N.C.R.E.A.S.E
Name = t12  I.N.C.R.E.A.S.E
Name = t15 No new state computed
Name = t3  I.N.C.R.E.A.S.E
Name = t10 No new state computed
Name = t5 No new state computed
Name = t7 No new state computed
Name = t2 No new state computed
Name = t8 No new state computed
Name = t9 No new state computed
Name = t14 No new state computed
Name = t11 No new state computed
increase = 1
**********************
Random choose
Name = t3  OK !
Now we have a representation of size = 660
Minimization in Progress
Name = t16 No new state computed
Name = t10 No new state computed
Name = t2 No new state computed
Name = t9 No new state computed
Name = t7 No new state computed
Name = t4 No new state computed
Name = t8 No new state computed
Name = t6 No new state computed
Name = t14 No new state computed
Name = t12  I.N.C.R.E.A.S.E
Name = t15 No new state computed
Name = t17 No new state computed
Name = t5 No new state computed
Name = t13  I.N.C.R.E.A.S.E
Name = t11 No new state computed
Name = t1 No new state computed
increase = 1
**********************
Random choose
Name = t13  OK !
Now we have a representation of size = 1251
Minimization in Progress
Name = t15 No new state computed
Name = t2 No new state computed
Name = t8 No new state computed
Name = t17 No new state computed
Name = t3 No new state computed
Name = t16 No new state computed
Name = t12  I.N.C.R.E.A.S.E
Name = t14 No new state computed
Name = t7 No new state computed
Name = t9 No new state computed
Name = t11 No new state computed
Name = t6 No new state computed
Name = t10 No new state computed
Name = t1 No new state computed
Name = t5 No new state computed
Name = t4 No new state computed
increase = 1
**********************
Random choose
Name = t12  OK !
Now we have a representation of size = 2205
Minimization in Progress
Name = t14 No new state computed
Name = t10 No new state computed
Name = t3 No new state computed
Name = t5 No new state computed
Name = t11 No new state computed
Name = t17 No new state computed
Name = t15 No new state computed
Name = t2 No new state computed
Name = t7 No new state computed
Name = t9 No new state computed
Name = t13 No new state computed
Name = t8 No new state computed
Name = t4 No new state computed
Name = t6 No new state computed
Name = t16 No new state computed
Name = t1 No new state computed
increase = 0
nb accelerations 9
Fix point FOUND
seed is : 2691
