current set encoding is : lash-lsdf
seed is : 3284
cycles of length 1
(1/3), name = r1, size = 183
(2/3), name = r2, size = 130
(3/3), name = r3, size = 141
**********************
Random choose
Name = r2  No new state computed
Name = r3  OK !
Now we have a representation of size = 17
Minimization in Progress
Name = r2 No new state computed
Name = r1  I.N.C.R.E.A.S.E
increase = 1
**********************
Random choose
Name = r1  OK !
Now we have a representation of size = 25
Minimization in Progress
Name = r2 No new state computed
Name = r3 No new state computed
increase = 0
nb accelerations 2
Fix point FOUND
seed is : 3284
