current set encoding is : lash-msdf
seed is : 2691
cycles of length 1
(1/13), name = t1, size = 150
(2/13), name = t2, size = 148
(3/13), name = t3, size = 148
(4/13), name = t4, size = 145
(5/13), name = t5, size = 145
(6/13), name = t6, size = 149
(7/13), name = t7, size = 385
(8/13), name = t8, size = 357
(9/13), name = t9, size = 184
(10/13), name = t10, size = 189
(11/13), name = t11, size = 409
(12/13), name = t12, size = 226
(13/13), name = t13, size = 240
**********************
Random choose
Name = t5  No new state computed
Name = t1  No new state computed
Name = t13  No new state computed
Name = t9  No new state computed
Name = t11  No new state computed
Name = t6  No new state computed
Name = t7  No new state computed
Name = t8  No new state computed
Name = t12  No new state computed
Name = t2  No new state computed
Name = t4  No new state computed
Name = t10  No new state computed
Name = t3  No new state computed
nb accelerations 0
Fix point FOUND
seed is : 2691
