let
  nat14 := (nat, nat, nat, nat, nat, nat, nat, nat, nat, nat, nat, nat, nat, nat);
  R := 
    let
      PCF15_0 := (0, 0, 0, 0, 0, 0, 0, 0, 0, 0, 0, 0, 0, 0);
      I_F14_13 := 2 * PCF15_0;
      I_F13_12 := I_F14_13 + (0, 0, 0, 0, 0, 0, 0, 0, 0, 0, 0, 0, 1, 0);
      I_F12_11 := I_F13_12 + (0, 0, 0, 0, 0, 0, 0, 0, 0, 0, 0, 1, 0, 0);
      I_F16_10 := I_F14_13 + (0, 0, 0, 0, 0, 0, 0, 0, 0, 0, 1, 0, 0, 0);
      I_F10_9 := I_F12_11 || I_F16_10 + (0, 0, 0, 0, 0, 0, 0, 0, 0, 1, 0, 0, 0, 0);
      I_F9_8 := I_F10_9 + (0, 0, 0, 0, 0, 0, 0, 0, 1, 0, 0, 0, 0, 0);
      I_F22_9 := I_F13_12 + (0, 0, 0, 0, 0, 0, 0, 0, 0, 1, 0, 0, 0, 0);
      I_F21_8 := I_F22_9 + (0, 0, 0, 0, 0, 0, 0, 0, 1, 0, 0, 0, 0, 0);
      I_F6_5 := I_F9_8 || I_F21_8 + (0, 0, 0, 0, 0, 1, 0, 0, 0, 0, 0, 0, 0, 0);
      I_F52_4 := I_F14_13 + (0, 0, 0, 0, 1, 0, 0, 0, 0, 0, 0, 0, 0, 0);
      I_F47_13 := 2 * I_F52_4;
      I_F33_13 := 2 * I_F47_13;
      I_F31_11 := I_F33_13 + (0, 0, 0, 0, 0, 0, 0, 0, 0, 0, 0, 1, 0, 0);
      I_F27_7 := I_F31_11 + (0, 0, 0, 0, 0, 0, 0, 1, 0, 0, 0, 0, 0, 0);
      I_F84_3 := I_F52_4 || I_F14_13 + (0, 0, 0, 1, 0, 0, 0, 0, 0, 0, 0, 0, 0, 0);
      I_F80_13 := 2 * I_F84_3;
      I_F70_3 := I_F80_13 || I_F52_4 + (0, 0, 0, 1, 0, 0, 0, 0, 0, 0, 0, 0, 0, 0);
      I_F66_13 := 2 * I_F70_3;
      I_F62_9 := I_F66_13 + (0, 0, 0, 0, 0, 0, 0, 0, 0, 1, 0, 0, 0, 0);
      I_F60_7 := I_F62_9 + (0, 0, 0, 0, 0, 0, 0, 1, 0, 0, 0, 0, 0, 0);
      I_F59_6 := I_F60_7 || I_F62_9 + (0, 0, 0, 0, 0, 0, 1, 0, 0, 0, 0, 0, 0, 0);
      I_F25_5 := I_F27_7 || I_F59_6 + (0, 0, 0, 0, 0, 1, 0, 0, 0, 0, 0, 0, 0, 0);
      I_F5_4 := I_F6_5 || I_F25_5 + (0, 0, 0, 0, 1, 0, 0, 0, 0, 0, 0, 0, 0, 0);
      I_F88_5 := I_F59_6 + (0, 0, 0, 0, 0, 1, 0, 0, 0, 0, 0, 0, 0, 0);
      I_F4_3 := I_F5_4 || I_F88_5 + (0, 0, 0, 1, 0, 0, 0, 0, 0, 0, 0, 0, 0, 0);
      I_F3_2 := I_F4_3 + (0, 0, 1, 0, 0, 0, 0, 0, 0, 0, 0, 0, 0, 0);
      I_F95_8 := I_F13_12 + (0, 0, 0, 0, 0, 0, 0, 0, 1, 0, 0, 0, 0, 0);
      I_F99_7 := I_F66_13 + (0, 0, 0, 0, 0, 0, 0, 1, 0, 0, 0, 0, 0, 0);
      I_F98_6 := I_F99_7 || I_F66_13 + (0, 0, 0, 0, 0, 0, 1, 0, 0, 0, 0, 0, 0, 0);
      I_F91_4 := I_F95_8 || I_F98_6 + (0, 0, 0, 0, 1, 0, 0, 0, 0, 0, 0, 0, 0, 0);
      I_F90_3 := I_F91_4 || I_F98_6 + (0, 0, 0, 1, 0, 0, 0, 0, 0, 0, 0, 0, 0, 0);
      I_F2_1 := I_F3_2 || I_F90_3 + (0, 1, 0, 0, 0, 0, 0, 0, 0, 0, 0, 0, 0, 0);
      I_F107_4 := I_F98_6 + (0, 0, 0, 0, 1, 0, 0, 0, 0, 0, 0, 0, 0, 0);
      I_F106_3 := I_F107_4 || I_F98_6 + (0, 0, 0, 1, 0, 0, 0, 0, 0, 0, 0, 0, 0, 0);
    in
      I_F2_1 || I_F106_3 + (1, 0, 0, 0, 0, 0, 0, 0, 0, 0, 0, 0, 0, 0);
in
  { (x0, x1, x2, x3, x4, x5, x6, x7, x8, x9, x10, x11, x12, state) | (x0, x1, x2, x3, x4, x5, x6, x7, x8, x9, x10, x11, x12, state) in nat14 && R };
// Automata size             : #SA=93 #EA=4 #S=93 #D=34 #Refs=39 #to0=78/186
// Formula size              : 733 nodes
// Time to synthesis formula : 0 ms
