current set encoding is : lira
seed is : 2691
cycles of length 1
(1/4), name = r1, size = 18
(2/4), name = r2, size = 9
(3/4), name = r3, size = 16
(4/4), name = r4, size = 18
**********************
Random choose
Name = r2  No new state computed
Name = r1  OK !
Now we have a representation of size = 6
Minimization in Progress
Name = r2 No new state computed
Name = r3  I.N.C.R.E.A.S.E
Name = r4  I.N.C.R.E.A.S.E
increase = 1
**********************
Random choose
Name = r4  OK !
Now we have a representation of size = 8
Minimization in Progress
Name = r3 No new state computed
Name = r2  OK !
Now we have a representation of size = 8
Name = r3 No new state computed
Name = r1  OK !
Now we have a representation of size = 8
Name = r4 No new state computed
Name = r3 No new state computed
Name = r2 No new state computed
increase = 0
nb accelerations 4
Fix point FOUND
seed is : 2691
