current set encoding is : mona
seed is : 21768
cycles of length 1
(1/9), name = t1, size = 254
(2/9), name = t2, size = 840
(3/9), name = t3, size = 528
(4/9), name = t4, size = 948
(5/9), name = t5, size = 254
(6/9), name = t6, size = 840
(7/9), name = t7, size = 2224
(8/9), name = t8, size = 4208
(9/9), name = t9, size = 804
**********************
Random choose
Name = t2  No new state computed
Name = t3  OK !
Now we have a representation of size = 40
Minimization in Progress
Name = t5 No new state computed
Name = t8 No new state computed
Name = t9 No new state computed
Name = t2 No new state computed
Name = t1 No new state computed
Name = t7  I.N.C.R.E.A.S.E
Name = t4  I.N.C.R.E.A.S.E
Name = t6 No new state computed
increase = 1
**********************
Random choose
Name = t4  OK !
Now we have a representation of size = 44
Minimization in Progress
Name = t5 No new state computed
Name = t7  I.N.C.R.E.A.S.E
Name = t2 No new state computed
Name = t1 No new state computed
Name = t8 No new state computed
Name = t6 No new state computed
Name = t9 No new state computed
Name = t3 No new state computed
increase = 1
**********************
Random choose
Name = t7  OK !
Now we have a representation of size = 85
Minimization in Progress
Name = t3 No new state computed
Name = t8  I.N.C.R.E.A.S.E
Name = t9 No new state computed
Name = t5 No new state computed
Name = t2  I.N.C.R.E.A.S.E
Name = t4 No new state computed
Name = t6 No new state computed
Name = t1 No new state computed
increase = 1
**********************
Random choose
Name = t2  OK !
Now we have a representation of size = 89
Minimization in Progress
Name = t6  I.N.C.R.E.A.S.E
Name = t8  I.N.C.R.E.A.S.E
Name = t1  OK !
Now we have a representation of size = 89
Name = t6  I.N.C.R.E.A.S.E
Name = t8  I.N.C.R.E.A.S.E
Name = t3 No new state computed
Name = t5 No new state computed
Name = t2  I.N.C.R.E.A.S.E
Name = t7 No new state computed
Name = t9 No new state computed
Name = t4  I.N.C.R.E.A.S.E
increase = 1
**********************
Random choose
Name = t4  OK !
Now we have a representation of size = 91
Minimization in Progress
Name = t1 No new state computed
Name = t7 No new state computed
Name = t5 No new state computed
Name = t2  I.N.C.R.E.A.S.E
Name = t3 No new state computed
Name = t6  I.N.C.R.E.A.S.E
Name = t9 No new state computed
Name = t8  I.N.C.R.E.A.S.E
increase = 1
**********************
Random choose
Name = t8  OK !
Now we have a representation of size = 92
Minimization in Progress
Name = t6  I.N.C.R.E.A.S.E
Name = t2  I.N.C.R.E.A.S.E
Name = t9 No new state computed
Name = t7 No new state computed
Name = t3 No new state computed
Name = t1 No new state computed
Name = t5 No new state computed
Name = t4 No new state computed
increase = 1
**********************
Random choose
Name = t2  OK !
Now we have a representation of size = 107
Minimization in Progress
Name = t4 No new state computed
Name = t1  I.N.C.R.E.A.S.E
Name = t7 No new state computed
Name = t5 No new state computed
Name = t3 No new state computed
Name = t8 No new state computed
Name = t6  I.N.C.R.E.A.S.E
Name = t9 No new state computed
increase = 1
**********************
Random choose
Name = t6  OK !
Now we have a representation of size = 113
Minimization in Progress
Name = t5  OK !
Now we have a representation of size = 113
Name = t4 No new state computed
Name = t3 No new state computed
Name = t6 No new state computed
Name = t7 No new state computed
Name = t9 No new state computed
Name = t2 No new state computed
Name = t8 No new state computed
Name = t1  OK !
Now we have a representation of size = 110
Name = t3 No new state computed
Name = t6 No new state computed
Name = t2  I.N.C.R.E.A.S.E
Name = t5 No new state computed
Name = t7 No new state computed
Name = t9 No new state computed
Name = t4  I.N.C.R.E.A.S.E
Name = t8 No new state computed
increase = 1
**********************
Random choose
Name = t4  OK !
Now we have a representation of size = 113
Minimization in Progress
Name = t8 No new state computed
Name = t7 No new state computed
Name = t2  I.N.C.R.E.A.S.E
Name = t1 No new state computed
Name = t3 No new state computed
Name = t9 No new state computed
Name = t5 No new state computed
Name = t6 No new state computed
increase = 1
**********************
Random choose
Name = t2  OK !
Now we have a representation of size = 117
Minimization in Progress
Name = t7 No new state computed
Name = t3 No new state computed
Name = t1  OK !
Now we have a representation of size = 113
Name = t5 No new state computed
Name = t4  OK !
Now we have a representation of size = 113
Name = t9 No new state computed
Name = t2  I.N.C.R.E.A.S.E
Name = t6 No new state computed
Name = t5 No new state computed
Name = t1 No new state computed
Name = t7 No new state computed
Name = t3 No new state computed
Name = t8 No new state computed
increase = 1
**********************
Random choose
Name = t2  OK !
Now we have a representation of size = 143
Minimization in Progress
Name = t7 No new state computed
Name = t3 No new state computed
Name = t6 No new state computed
Name = t4 No new state computed
Name = t8 No new state computed
Name = t5 No new state computed
Name = t1  OK !
Now we have a representation of size = 137
Name = t6 No new state computed
Name = t3 No new state computed
Name = t5 No new state computed
Name = t7 No new state computed
Name = t9 No new state computed
Name = t4  OK !
Now we have a representation of size = 135
Name = t5 No new state computed
Name = t6 No new state computed
Name = t8 No new state computed
Name = t1 No new state computed
Name = t7 No new state computed
Name = t2  I.N.C.R.E.A.S.E
Name = t9 No new state computed
Name = t3 No new state computed
increase = 1
**********************
Random choose
Name = t2  OK !
Now we have a representation of size = 139
Minimization in Progress
Name = t9 No new state computed
Name = t7 No new state computed
Name = t6 No new state computed
Name = t8 No new state computed
Name = t4 No new state computed
Name = t3 No new state computed
Name = t1  OK !
Now we have a representation of size = 135
Name = t2  I.N.C.R.E.A.S.E
Name = t8 No new state computed
Name = t9 No new state computed
Name = t6 No new state computed
Name = t3 No new state computed
Name = t4  OK !
Now we have a representation of size = 135
Name = t7 No new state computed
Name = t2  I.N.C.R.E.A.S.E
Name = t5 No new state computed
Name = t6 No new state computed
Name = t9 No new state computed
Name = t1 No new state computed
Name = t8 No new state computed
Name = t3 No new state computed
increase = 1
**********************
Random choose
Name = t2  OK !
Now we have a representation of size = 136
Minimization in Progress
Name = t3 No new state computed
Name = t6 No new state computed
Name = t7 No new state computed
Name = t1  OK !
Now we have a representation of size = 130
Name = t5 No new state computed
Name = t9 No new state computed
Name = t2 No new state computed
Name = t7 No new state computed
Name = t6 No new state computed
Name = t4  OK !
Now we have a representation of size = 117
Name = t9 No new state computed
Name = t3 No new state computed
Name = t8 No new state computed
Name = t6 No new state computed
Name = t2 No new state computed
Name = t1 No new state computed
Name = t7 No new state computed
Name = t5 No new state computed
increase = 0
nb accelerations 24
Fix point FOUND
seed is : 21768
