let
  nat15 := (nat, nat, nat, nat, nat, nat, nat, nat, nat, nat, nat, nat, nat, nat, nat);
  R := 
    let
      PCF16_0 := (0, 0, 0, 0, 0, 0, 0, 0, 0, 0, 0, 0, 0, 0, 0);
      I_F15_14 := 2 * PCF16_0;
      I_F11_10 := I_F15_14 + (0, 0, 0, 0, 0, 0, 0, 0, 0, 0, 1, 0, 0, 0, 0);
      I_F10_9 := I_F11_10 + (0, 0, 0, 0, 0, 0, 0, 0, 0, 1, 0, 0, 0, 0, 0);
      I_F19_11 := I_F15_14 + (0, 0, 0, 0, 0, 0, 0, 0, 0, 0, 0, 1, 0, 0, 0);
      I_F9_8 := I_F10_9 || I_F19_11 + (0, 0, 0, 0, 0, 0, 0, 0, 1, 0, 0, 0, 0, 0, 0);
      I_F8_7 := I_F9_8 + (0, 0, 0, 0, 0, 0, 0, 1, 0, 0, 0, 0, 0, 0, 0);
      I_F25_12 := I_F15_14 + (0, 0, 0, 0, 0, 0, 0, 0, 0, 0, 0, 0, 1, 0, 0);
      I_F21_8 := I_F25_12 + (0, 0, 0, 0, 0, 0, 0, 0, 1, 0, 0, 0, 0, 0, 0);
      I_F7_6 := I_F8_7 || I_F21_8 + (0, 0, 0, 0, 0, 0, 1, 0, 0, 0, 0, 0, 0, 0, 0);
      I_F6_5 := I_F7_6 + (0, 0, 0, 0, 0, 1, 0, 0, 0, 0, 0, 0, 0, 0, 0);
      I_F4_3 := I_F6_5 + (0, 0, 0, 1, 0, 0, 0, 0, 0, 0, 0, 0, 0, 0, 0);
      I_F36_13 := I_F15_14 + (0, 0, 0, 0, 0, 0, 0, 0, 0, 0, 0, 0, 0, 1, 0);
      I_F35_12 := I_F36_13 || I_F15_14 + (0, 0, 0, 0, 0, 0, 0, 0, 0, 0, 0, 0, 1, 0, 0);
      I_F34_11 := I_F35_12 || I_F15_14 + (0, 0, 0, 0, 0, 0, 0, 0, 0, 0, 0, 1, 0, 0, 0);
      I_F31_8 := I_F10_9 || I_F34_11 + (0, 0, 0, 0, 0, 0, 0, 0, 1, 0, 0, 0, 0, 0, 0);
      I_F30_7 := I_F31_8 + (0, 0, 0, 0, 0, 0, 0, 1, 0, 0, 0, 0, 0, 0, 0);
      I_F29_6 := I_F30_7 || I_F21_8 + (0, 0, 0, 0, 0, 0, 1, 0, 0, 0, 0, 0, 0, 0, 0);
      I_F28_5 := I_F29_6 + (0, 0, 0, 0, 0, 1, 0, 0, 0, 0, 0, 0, 0, 0, 0);
      I_F3_2 := I_F4_3 || I_F28_5 + (0, 0, 1, 0, 0, 0, 0, 0, 0, 0, 0, 0, 0, 0, 0);
      I_F41_6 := I_F8_7 || I_F31_8 + (0, 0, 0, 0, 0, 0, 1, 0, 0, 0, 0, 0, 0, 0, 0);
      I_F40_5 := I_F41_6 + (0, 0, 0, 0, 0, 1, 0, 0, 0, 0, 0, 0, 0, 0, 0);
      I_F2_1 := I_F3_2 || I_F40_5 + (0, 1, 0, 0, 0, 0, 0, 0, 0, 0, 0, 0, 0, 0, 0);
      I_F46_4 := I_F41_6 + (0, 0, 0, 0, 1, 0, 0, 0, 0, 0, 0, 0, 0, 0, 0);
    in
      I_F2_1 || I_F46_4 + (1, 0, 0, 0, 0, 0, 0, 0, 0, 0, 0, 0, 0, 0, 0);
in
  { (x0, x1, x2, x3, x4, x5, x6, x7, x8, x9, x10, x11, x12, x13, state) | (x0, x1, x2, x3, x4, x5, x6, x7, x8, x9, x10, x11, x12, x13, state) in nat15 && R };
// Automata size             : #SA=39 #EA=4 #S=39 #D=15 #Refs=51 #to0=28/78
// Formula size              : 588 nodes
// Time to synthesis formula : 0 ms
