current set encoding is : lira
seed is : 21768
cycles of length 1
(1/12), name = t1, size = 10
(2/12), name = t2, size = 8
(3/12), name = t3, size = 10
(4/12), name = t4, size = 8
(5/12), name = t5, size = 10
(6/12), name = t6, size = 8
(7/12), name = t7, size = 10
(8/12), name = t8, size = 8
(9/12), name = t9, size = 8
(10/12), name = t10, size = 10
(11/12), name = t11, size = 10
(12/12), name = t12, size = 8
**********************
Random choose
Name = t3  No new state computed
Name = t4  No new state computed
Name = t6  No new state computed
Name = t10  No new state computed
Name = t11  No new state computed
Name = t12  No new state computed
Name = t2  No new state computed
Name = t7  No new state computed
Name = t1  No new state computed
Name = t8  No new state computed
Name = t9  OK !
Now we have a representation of size = 6
Minimization in Progress
Name = t10 No new state computed
Name = t4 No new state computed
Name = t2 No new state computed
Name = t1  OK !
Now we have a representation of size = 6
Name = t8 No new state computed
Name = t2 No new state computed
Name = t6 No new state computed
Name = t3  OK !
Now we have a representation of size = 6
Name = t4 No new state computed
Name = t11 No new state computed
Name = t8 No new state computed
Name = t12 No new state computed
Name = t9 No new state computed
Name = t10  I.N.C.R.E.A.S.E
Name = t7  OK !
Now we have a representation of size = 6
Name = t8 No new state computed
Name = t11 No new state computed
Name = t2 No new state computed
Name = t6 No new state computed
Name = t10  I.N.C.R.E.A.S.E
Name = t3 No new state computed
Name = t5  OK !
Now we have a representation of size = 6
Name = t4 No new state computed
Name = t10  I.N.C.R.E.A.S.E
Name = t11 No new state computed
Name = t6 No new state computed
Name = t1 No new state computed
Name = t8 No new state computed
Name = t9 No new state computed
Name = t2 No new state computed
Name = t12 No new state computed
Name = t3 No new state computed
Name = t7 No new state computed
increase = 1
**********************
Random choose
Name = t10  OK !
Now we have a representation of size = 7
Minimization in Progress
Name = t8 No new state computed
Name = t11  OK !
Now we have a representation of size = 7
Name = t3 No new state computed
Name = t9 No new state computed
Name = t12 No new state computed
Name = t5 No new state computed
Name = t2  OK !
Now we have a representation of size = 7
Name = t7 No new state computed
Name = t5 No new state computed
Name = t4 No new state computed
Name = t1 No new state computed
Name = t8 No new state computed
Name = t6 No new state computed
Name = t9 No new state computed
Name = t10 No new state computed
Name = t11 No new state computed
Name = t3 No new state computed
Name = t12 No new state computed
increase = 0
nb accelerations 8
Fix point FOUND
seed is : 21768
