current set encoding is : lira
seed is : 2691
cycles of length 1
(1/6), name = t1, size = 10
(2/6), name = t2, size = 9
(3/6), name = t3, size = 9
(4/6), name = t4, size = 25
(5/6), name = t5, size = 9
(6/6), name = t6, size = 85
**********************
Random choose
Name = t3  OK !
Now we have a representation of size = 5
Minimization in Progress
Name = t1  I.N.C.R.E.A.S.E
Name = t2  OK !
Now we have a representation of size = 5
Name = t5  OK !
Now we have a representation of size = 5
Name = t3 No new state computed
Name = t6 No new state computed
Name = t4 No new state computed
Name = t2 No new state computed
Name = t1 No new state computed
increase = 0
nb accelerations 3
Fix point FOUND
seed is : 2691
