current set encoding is : lash-lsdf
seed is : 21768
cycles of length 1
(1/9), name = r1, size = 63
(2/9), name = r2, size = 268
(3/9), name = r3, size = 200
(4/9), name = r4, size = 112
(5/9), name = r5, size = 168
(6/9), name = r6, size = 193
(7/9), name = r7, size = 113
(8/9), name = r8, size = 125
(9/9), name = r9, size = 119
**********************
Random choose
Name = r2  No new state computed
Name = r3  No new state computed
Name = r4  No new state computed
Name = r7  No new state computed
Name = r8  No new state computed
Name = r9  No new state computed
Name = r1  OK !
Now we have a representation of size = 20
Minimization in Progress
Name = r5 No new state computed
Name = r9 No new state computed
Name = r7 No new state computed
Name = r4  OK !
Now we have a representation of size = 20
Name = r8 No new state computed
Name = r3  I.N.C.R.E.A.S.E
Name = r1 No new state computed
Name = r6 No new state computed
Name = r7 No new state computed
Name = r5 No new state computed
Name = r2  I.N.C.R.E.A.S.E
Name = r9 No new state computed
increase = 1
**********************
Random choose
Name = r2  OK !
Now we have a representation of size = 35
Minimization in Progress
Name = r3  I.N.C.R.E.A.S.E
Name = r8  OK !
Now we have a representation of size = 35
Name = r7 No new state computed
Name = r2 No new state computed
Name = r3  OK !
Now we have a representation of size = 31
Name = r6 No new state computed
Name = r4 No new state computed
Name = r7 No new state computed
Name = r8 No new state computed
Name = r1 No new state computed
Name = r9 No new state computed
Name = r2 No new state computed
Name = r5 No new state computed
increase = 0
nb accelerations 5
Fix point FOUND
seed is : 21768
