current set encoding is : mona
seed is : 2691
cycles of length 1
(1/14), name = r1, size = 2168
(2/14), name = r2, size = 215
(3/14), name = r3, size = 208
(4/14), name = r4, size = 207
(5/14), name = r5, size = 1708
(6/14), name = r6, size = 6487
(7/14), name = r7, size = 217
(8/14), name = r8, size = 2168
(9/14), name = r9, size = 197
(10/14), name = r10, size = 190
(11/14), name = r11, size = 189
(12/14), name = r12, size = 1685
(13/14), name = r13, size = 6651
(14/14), name = r14, size = 199
**********************
Random choose
Name = r6  No new state computed
Name = r1  No new state computed
Name = r5  No new state computed
Name = r10  OK !
Now we have a representation of size = 41
Minimization in Progress
Name = r6 No new state computed
Name = r9  I.N.C.R.E.A.S.E
Name = r11  I.N.C.R.E.A.S.E
Name = r12 No new state computed
Name = r1 No new state computed
Name = r3  I.N.C.R.E.A.S.E
Name = r4 No new state computed
Name = r14 No new state computed
Name = r5 No new state computed
Name = r2 No new state computed
Name = r7 No new state computed
Name = r13 No new state computed
Name = r8 No new state computed
increase = 1
**********************
Random choose
Name = r3  OK !
Now we have a representation of size = 72
Minimization in Progress
Name = r9  I.N.C.R.E.A.S.E
Name = r1 No new state computed
Name = r7 No new state computed
Name = r8 No new state computed
Name = r4  I.N.C.R.E.A.S.E
Name = r10 No new state computed
Name = r6 No new state computed
Name = r5 No new state computed
Name = r11  I.N.C.R.E.A.S.E
Name = r14 No new state computed
Name = r2  I.N.C.R.E.A.S.E
Name = r13 No new state computed
Name = r12 No new state computed
increase = 1
**********************
Random choose
Name = r2  OK !
Now we have a representation of size = 107
Minimization in Progress
Name = r3  I.N.C.R.E.A.S.E
Name = r14  I.N.C.R.E.A.S.E
Name = r7  OK !
Now we have a representation of size = 107
Name = r8 No new state computed
Name = r12 No new state computed
Name = r1  I.N.C.R.E.A.S.E
Name = r3  I.N.C.R.E.A.S.E
Name = r9  I.N.C.R.E.A.S.E
Name = r13 No new state computed
Name = r10 No new state computed
Name = r2 No new state computed
Name = r14  I.N.C.R.E.A.S.E
Name = r5 No new state computed
Name = r11  I.N.C.R.E.A.S.E
Name = r6 No new state computed
Name = r4  I.N.C.R.E.A.S.E
increase = 1
**********************
Random choose
Name = r4  OK !
Now we have a representation of size = 110
Minimization in Progress
Name = r8 No new state computed
Name = r6 No new state computed
Name = r7 No new state computed
Name = r11  I.N.C.R.E.A.S.E
Name = r9  I.N.C.R.E.A.S.E
Name = r3  I.N.C.R.E.A.S.E
Name = r1  I.N.C.R.E.A.S.E
Name = r12 No new state computed
Name = r10 No new state computed
Name = r13 No new state computed
Name = r14  I.N.C.R.E.A.S.E
Name = r2 No new state computed
Name = r5 No new state computed
increase = 1
**********************
Random choose
Name = r14  OK !
Now we have a representation of size = 116
Minimization in Progress
Name = r8 No new state computed
Name = r2 No new state computed
Name = r5 No new state computed
Name = r7 No new state computed
Name = r10 No new state computed
Name = r13 No new state computed
Name = r11  I.N.C.R.E.A.S.E
Name = r6 No new state computed
Name = r12 No new state computed
Name = r3  I.N.C.R.E.A.S.E
Name = r4 No new state computed
Name = r9  I.N.C.R.E.A.S.E
Name = r1  I.N.C.R.E.A.S.E
increase = 1
**********************
Random choose
Name = r1  OK !
Now we have a representation of size = 119
Minimization in Progress
Name = r3  I.N.C.R.E.A.S.E
Name = r2 No new state computed
Name = r12 No new state computed
Name = r10 No new state computed
Name = r14 No new state computed
Name = r6 No new state computed
Name = r13 No new state computed
Name = r4 No new state computed
Name = r11  I.N.C.R.E.A.S.E
Name = r5 No new state computed
Name = r7 No new state computed
Name = r9  I.N.C.R.E.A.S.E
Name = r8 No new state computed
increase = 1
**********************
Random choose
Name = r9  OK !
Now we have a representation of size = 174
Minimization in Progress
Name = r1 No new state computed
Name = r13 No new state computed
Name = r12 No new state computed
Name = r6 No new state computed
Name = r3  I.N.C.R.E.A.S.E
Name = r10  I.N.C.R.E.A.S.E
Name = r5 No new state computed
Name = r7  I.N.C.R.E.A.S.E
Name = r2 No new state computed
Name = r8  I.N.C.R.E.A.S.E
Name = r14  I.N.C.R.E.A.S.E
Name = r4 No new state computed
Name = r11  I.N.C.R.E.A.S.E
increase = 1
**********************
Random choose
Name = r11  OK !
Now we have a representation of size = 179
Minimization in Progress
Name = r13 No new state computed
Name = r8  I.N.C.R.E.A.S.E
Name = r1 No new state computed
Name = r7  I.N.C.R.E.A.S.E
Name = r5 No new state computed
Name = r3  I.N.C.R.E.A.S.E
Name = r6 No new state computed
Name = r4 No new state computed
Name = r2 No new state computed
Name = r10  I.N.C.R.E.A.S.E
Name = r14  I.N.C.R.E.A.S.E
Name = r9 No new state computed
Name = r12 No new state computed
increase = 1
**********************
Random choose
Name = r14  OK !
Now we have a representation of size = 181
Minimization in Progress
Name = r8  I.N.C.R.E.A.S.E
Name = r11 No new state computed
Name = r6 No new state computed
Name = r10  I.N.C.R.E.A.S.E
Name = r2 No new state computed
Name = r5 No new state computed
Name = r7  I.N.C.R.E.A.S.E
Name = r9 No new state computed
Name = r1 No new state computed
Name = r13 No new state computed
Name = r3  I.N.C.R.E.A.S.E
Name = r12 No new state computed
Name = r4 No new state computed
increase = 1
**********************
Random choose
Name = r3  OK !
Now we have a representation of size = 187
Minimization in Progress
Name = r14 No new state computed
Name = r4  I.N.C.R.E.A.S.E
Name = r7  I.N.C.R.E.A.S.E
Name = r13 No new state computed
Name = r5 No new state computed
Name = r9 No new state computed
Name = r6 No new state computed
Name = r12 No new state computed
Name = r1 No new state computed
Name = r2  I.N.C.R.E.A.S.E
Name = r10  I.N.C.R.E.A.S.E
Name = r11 No new state computed
Name = r8  I.N.C.R.E.A.S.E
increase = 1
**********************
Random choose
Name = r8  OK !
Now we have a representation of size = 192
Minimization in Progress
Name = r2  I.N.C.R.E.A.S.E
Name = r10  I.N.C.R.E.A.S.E
Name = r4  I.N.C.R.E.A.S.E
Name = r7  I.N.C.R.E.A.S.E
Name = r3 No new state computed
Name = r12 No new state computed
Name = r5 No new state computed
Name = r14 No new state computed
Name = r11 No new state computed
Name = r9 No new state computed
Name = r13 No new state computed
Name = r6 No new state computed
Name = r1 No new state computed
increase = 1
**********************
Random choose
Name = r7  OK !
Now we have a representation of size = 214
Minimization in Progress
Name = r6 No new state computed
Name = r12 No new state computed
Name = r10  I.N.C.R.E.A.S.E
Name = r3 No new state computed
Name = r9 No new state computed
Name = r1 No new state computed
Name = r4  I.N.C.R.E.A.S.E
Name = r11 No new state computed
Name = r2  I.N.C.R.E.A.S.E
Name = r8 No new state computed
Name = r13 No new state computed
Name = r14 No new state computed
Name = r5 No new state computed
increase = 1
**********************
Random choose
Name = r2  OK !
Now we have a representation of size = 271
Minimization in Progress
Name = r14  OK !
Now we have a representation of size = 254
Name = r6 No new state computed
Name = r8 No new state computed
Name = r1  OK !
Now we have a representation of size = 254
Name = r6 No new state computed
Name = r9 No new state computed
Name = r10  I.N.C.R.E.A.S.E
Name = r7  OK !
Now we have a representation of size = 254
Name = r6 No new state computed
Name = r3 No new state computed
Name = r13 No new state computed
Name = r1 No new state computed
Name = r10  I.N.C.R.E.A.S.E
Name = r12 No new state computed
Name = r11 No new state computed
Name = r8 No new state computed
Name = r9 No new state computed
Name = r14 No new state computed
Name = r4  OK !
Now we have a representation of size = 252
Name = r1 No new state computed
Name = r7 No new state computed
Name = r2 No new state computed
Name = r10  I.N.C.R.E.A.S.E
Name = r6 No new state computed
Name = r5 No new state computed
Name = r3 No new state computed
Name = r8 No new state computed
Name = r14  OK !
Now we have a representation of size = 207
Name = r6 No new state computed
Name = r11 No new state computed
Name = r4 No new state computed
Name = r13 No new state computed
Name = r3 No new state computed
Name = r8 No new state computed
Name = r5 No new state computed
Name = r7 No new state computed
Name = r12 No new state computed
Name = r9 No new state computed
Name = r2 No new state computed
Name = r1 No new state computed
Name = r10  I.N.C.R.E.A.S.E
increase = 1
**********************
Random choose
Name = r10  OK !
Now we have a representation of size = 211
Minimization in Progress
Name = r13 No new state computed
Name = r2 No new state computed
Name = r9  I.N.C.R.E.A.S.E
Name = r3 No new state computed
Name = r8 No new state computed
Name = r1 No new state computed
Name = r14 No new state computed
Name = r4 No new state computed
Name = r5 No new state computed
Name = r12 No new state computed
Name = r11  I.N.C.R.E.A.S.E
Name = r7 No new state computed
Name = r6 No new state computed
increase = 1
**********************
Random choose
Name = r11  OK !
Now we have a representation of size = 250
Minimization in Progress
Name = r9  I.N.C.R.E.A.S.E
Name = r8 No new state computed
Name = r13 No new state computed
Name = r5 No new state computed
Name = r3 No new state computed
Name = r2 No new state computed
Name = r14  OK !
Now we have a representation of size = 245
Name = r9  I.N.C.R.E.A.S.E
Name = r13 No new state computed
Name = r8 No new state computed
Name = r7  I.N.C.R.E.A.S.E
Name = r4 No new state computed
Name = r3 No new state computed
Name = r2 No new state computed
Name = r6 No new state computed
Name = r12 No new state computed
Name = r10 No new state computed
Name = r5 No new state computed
Name = r11 No new state computed
Name = r1 No new state computed
increase = 1
**********************
Random choose
Name = r7  OK !
Now we have a representation of size = 253
Minimization in Progress
Name = r5 No new state computed
Name = r12 No new state computed
Name = r4 No new state computed
Name = r13 No new state computed
Name = r3 No new state computed
Name = r14 No new state computed
Name = r11 No new state computed
Name = r10 No new state computed
Name = r6 No new state computed
Name = r2 No new state computed
Name = r1 No new state computed
Name = r8 No new state computed
Name = r9  I.N.C.R.E.A.S.E
increase = 1
**********************
Random choose
Name = r9  OK !
Now we have a representation of size = 302
Minimization in Progress
Name = r11 No new state computed
Name = r2 No new state computed
Name = r6 No new state computed
Name = r10 No new state computed
Name = r5 No new state computed
Name = r12 No new state computed
Name = r13 No new state computed
Name = r8  OK !
Now we have a representation of size = 263
Name = r11 No new state computed
Name = r2 No new state computed
Name = r7  OK !
Now we have a representation of size = 259
Name = r1 No new state computed
Name = r13 No new state computed
Name = r4 No new state computed
Name = r11 No new state computed
Name = r14  OK !
Now we have a representation of size = 221
Name = r1 No new state computed
Name = r10 No new state computed
Name = r13 No new state computed
Name = r12 No new state computed
Name = r11 No new state computed
Name = r5 No new state computed
Name = r2 No new state computed
Name = r6 No new state computed
Name = r9 No new state computed
Name = r4 No new state computed
Name = r3 No new state computed
Name = r7 No new state computed
Name = r8 No new state computed
increase = 0
nb accelerations 27
Fix point FOUND
seed is : 2691
