let
  nat17 := (nat, nat, nat, nat, nat, nat, nat, nat, nat, nat, nat, nat, nat, nat, nat, nat, nat);
  R := 
    let
      PCF18_0 := (0, 0, 0, 0, 0, 0, 0, 0, 0, 0, 0, 0, 0, 0, 0, 0, 0);
      I_F17_16 := 2 * PCF18_0;
      I_F16_15 := I_F17_16 + (0, 0, 0, 0, 0, 0, 0, 0, 0, 0, 0, 0, 0, 0, 0, 1, 0);
      I_F15_14 := I_F16_15 || I_F17_16 + (0, 0, 0, 0, 0, 0, 0, 0, 0, 0, 0, 0, 0, 0, 1, 0, 0);
      I_F14_13 := I_F15_14 || I_F17_16 + (0, 0, 0, 0, 0, 0, 0, 0, 0, 0, 0, 0, 0, 1, 0, 0, 0);
      I_F13_12 := I_F14_13 || I_F17_16 + (0, 0, 0, 0, 0, 0, 0, 0, 0, 0, 0, 0, 1, 0, 0, 0, 0);
      I_F12_11 := I_F13_12 + (0, 0, 0, 0, 0, 0, 0, 0, 0, 0, 0, 1, 0, 0, 0, 0, 0);
      I_F10_9 := I_F12_11 || I_F13_12 + (0, 0, 0, 0, 0, 0, 0, 0, 0, 1, 0, 0, 0, 0, 0, 0, 0);
      I_F9_8 := I_F10_9 || I_F13_12 + (0, 0, 0, 0, 0, 0, 0, 0, 1, 0, 0, 0, 0, 0, 0, 0, 0);
      I_F8_7 := I_F9_8 + (0, 0, 0, 0, 0, 0, 0, 1, 0, 0, 0, 0, 0, 0, 0, 0, 0);
      I_F28_10 := I_F13_12 + (0, 0, 0, 0, 0, 0, 0, 0, 0, 0, 1, 0, 0, 0, 0, 0, 0);
      I_F7_6 := I_F8_7 || I_F28_10 + (0, 0, 0, 0, 0, 0, 1, 0, 0, 0, 0, 0, 0, 0, 0, 0, 0);
      I_F6_5 := I_F7_6 || I_F9_8 + (0, 0, 0, 0, 0, 1, 0, 0, 0, 0, 0, 0, 0, 0, 0, 0, 0);
      I_F5_4 := I_F6_5 || I_F9_8 + (0, 0, 0, 0, 1, 0, 0, 0, 0, 0, 0, 0, 0, 0, 0, 0, 0);
      I_F4_3 := I_F5_4 + (0, 0, 0, 1, 0, 0, 0, 0, 0, 0, 0, 0, 0, 0, 0, 0, 0);
      I_F3_2 := I_F4_3 || I_F5_4 + (0, 0, 1, 0, 0, 0, 0, 0, 0, 0, 0, 0, 0, 0, 0, 0, 0);
      I_F2_1 := I_F3_2 || I_F5_4 + (0, 1, 0, 0, 0, 0, 0, 0, 0, 0, 0, 0, 0, 0, 0, 0, 0);
    in
      I_F2_1 || I_F5_4 + (1, 0, 0, 0, 0, 0, 0, 0, 0, 0, 0, 0, 0, 0, 0, 0, 0);
in
  { (x0, x1, x2, x3, x4, x5, x6, x7, x8, x9, x10, x11, x12, x13, x14, x15, state) | (x0, x1, x2, x3, x4, x5, x6, x7, x8, x9, x10, x11, x12, x13, x14, x15, state) in nat17 && R };
// Automata size             : #SA=31 #EA=4 #S=31 #D=17 #Refs=65 #to0=19/62
// Formula size              : 483 nodes
// Time to synthesis formula : 0 ms
