current set encoding is : lash-lsdf
seed is : 3284
cycles of length 1
(1/3), name = r2, size = 467
(2/3), name = r3, size = 457
(3/3), name = r4, size = 168
**********************
Random choose
Name = r3  No new state computed
Name = r4  No new state computed
Name = r2  OK !
Now we have a representation of size = 143
Minimization in Progress
Name = r4 No new state computed
Name = r3 No new state computed
increase = 0
nb accelerations 1
Fix point FOUND
cycles of length 1
(1/1), name = r5, size = 307
**********************
Random choose
Name = r5  OK !
Now we have a representation of size = 295
Minimization in Progress
increase = 0
nb accelerations 1
Fix point FOUND
cycles of length 1
(1/5), name = r6, size = 644
(2/5), name = r7, size = 1870
(3/5), name = r8, size = 6466
(4/5), name = r9, size = 2148
(5/5), name = r10, size = 7634
**********************
Random choose
Name = r6  No new state computed
Name = r7  OK !
Now we have a representation of size = 430
Minimization in Progress
Name = r8 No new state computed
Name = r6 No new state computed
Name = r9  I.N.C.R.E.A.S.E
Name = r10  I.N.C.R.E.A.S.E
increase = 1
**********************
Random choose
Name = r10  OK !
Now we have a representation of size = 1694
Minimization in Progress
Name = r9  I.N.C.R.E.A.S.E
Name = r6 No new state computed
Name = r8 No new state computed
Name = r7 No new state computed
increase = 1
**********************
Random choose
Name = r9  OK !
Now we have a representation of size = 3194
Minimization in Progress
Name = r7  OK !
Now we have a representation of size = 2566
Name = r9 No new state computed
Name = r8  I.N.C.R.E.A.S.E
Name = r6 No new state computed
Name = r10  I.N.C.R.E.A.S.E
increase = 1
**********************
Random choose
Name = r10  OK !
Now we have a representation of size = 4711
Minimization in Progress
Name = r7 No new state computed
Name = r6 No new state computed
Name = r8  I.N.C.R.E.A.S.E
Name = r9 No new state computed
increase = 1
**********************
Random choose
Name = r8  OK !
Now we have a representation of size = 9949
Minimization in Progress
Name = r9 No new state computed
Name = r10 No new state computed
Name = r6 No new state computed
Name = r7 No new state computed
increase = 0
nb accelerations 6
Fix point FOUND
cycles of length 1
(1/1), name = r11, size = 223
**********************
Random choose
Name = r11 