current set encoding is : lira
seed is : 3284
cycles of length 1
(1/9), name = t1, size = 21
(2/9), name = t2, size = 21
(3/9), name = t3, size = 13
(4/9), name = t4, size = 13
(5/9), name = t5, size = 13
(6/9), name = t6, size = 13
(7/9), name = t7, size = 13
(8/9), name = t8, size = 13
(9/9), name = t9, size = 13
**********************
Random choose
Name = t4  No new state computed
Name = t5  No new state computed
Name = t7  No new state computed
Name = t2  OK !
Now we have a representation of size = 6
Minimization in Progress
Name = t7 No new state computed
Name = t9  OK !
Now we have a representation of size = 6
Name = t1 No new state computed
Name = t3  OK !
Now we have a representation of size = 6
Name = t6 No new state computed
Name = t1 No new state computed
Name = t7  OK !
Now we have a representation of size = 6
Name = t2  OK !
Now we have a representation of size = 6
Name = t8 No new state computed
Name = t1 No new state computed
Name = t3 No new state computed
Name = t6 No new state computed
Name = t9  OK !
Now we have a representation of size = 6
Name = t8 No new state computed
Name = t5 No new state computed
Name = t1 No new state computed
Name = t4  OK !
Now we have a representation of size = 6
Name = t9 No new state computed
Name = t2 No new state computed
Name = t7 No new state computed
Name = t5  OK !
Now we have a representation of size = 6
Name = t7 No new state computed
Name = t8 No new state computed
Name = t1  OK !
Now we have a representation of size = 6
Name = t6 No new state computed
Name = t2 No new state computed
Name = t9 No new state computed
Name = t8 No new state computed
Name = t3 No new state computed
Name = t5 No new state computed
Name = t4 No new state computed
Name = t7 No new state computed
increase = 0
nb accelerations 9
Fix point FOUND
seed is : 3284
