current set encoding is : lash-msdf
seed is : 2691
cycles of length 1
(1/9), name = r1, size = 51
(2/9), name = r2, size = 154
(3/9), name = r3, size = 172
(4/9), name = r4, size = 80
(5/9), name = r5, size = 137
(6/9), name = r6, size = 175
(7/9), name = r7, size = 80
(8/9), name = r8, size = 92
(9/9), name = r9, size = 86
**********************
Random choose
Name = r4  No new state computed
Name = r1  OK !
Now we have a representation of size = 16
Minimization in Progress
Name = r4  I.N.C.R.E.A.S.E
Name = r7 No new state computed
Name = r3  I.N.C.R.E.A.S.E
Name = r8 No new state computed
Name = r5 No new state computed
Name = r6  I.N.C.R.E.A.S.E
Name = r9 No new state computed
Name = r2 No new state computed
increase = 1
**********************
Random choose
Name = r6  OK !
Now we have a representation of size = 17
Minimization in Progress
Name = r4 No new state computed
Name = r2  I.N.C.R.E.A.S.E
Name = r9 No new state computed
Name = r7 No new state computed
Name = r5 No new state computed
Name = r8 No new state computed
Name = r3  I.N.C.R.E.A.S.E
Name = r1 No new state computed
increase = 1
**********************
Random choose
Name = r3  OK !
Now we have a representation of size = 25
Minimization in Progress
Name = r1 No new state computed
Name = r4 No new state computed
Name = r5 No new state computed
Name = r9 No new state computed
Name = r7 No new state computed
Name = r6 No new state computed
Name = r2 No new state computed
Name = r8  OK !
Now we have a representation of size = 25
Name = r5 No new state computed
Name = r4 No new state computed
Name = r9 No new state computed
Name = r3 No new state computed
Name = r1 No new state computed
Name = r7 No new state computed
Name = r2 No new state computed
Name = r6 No new state computed
increase = 0
nb accelerations 4
Fix point FOUND
seed is : 2691
