let
  G0 := int * (1, 0, 0, 0, -1, 0) + int * (0, 1, 0, 0, -1, 0) + int * (0, 0, 1, 0, 1, 0) + int * (0, 0, 0, 1, -1, 0);
  nat6 := (nat, nat, nat, nat, nat, nat);
in
  { (i, b, a, o1, o2, state) | (i, b, a, o1, o2, state) in nat6 && G0 };
// Automata size             : #SA=2 #EA=2 #S=35 #D=1 #Refs=15 #to0=1/70
// Formula size              : 77 nodes
// Time to synthesis formula : 0 ms
