current set encoding is : lash-msdf
seed is : 21768
cycles of length 1
(1/3), name = r1, size = 149
(2/3), name = r2, size = 149
(3/3), name = r3, size = 162
**********************
Random choose
Name = r1  OK !
Now we have a representation of size = 12
Minimization in Progress
Name = r3  I.N.C.R.E.A.S.E
Name = r2  I.N.C.R.E.A.S.E
increase = 1
**********************
Random choose
Name = r2  OK !
Now we have a representation of size = 21
Minimization in Progress
Name = r3 No new state computed
Name = r1  I.N.C.R.E.A.S.E
increase = 1
**********************
Random choose
Name = r1  OK !
Now we have a representation of size = 22
Minimization in Progress
Name = r3 No new state computed
Name = r2 No new state computed
increase = 0
nb accelerations 3
Fix point FOUND
seed is : 21768
