current set encoding is : prestaf
seed is : 2691
cycles of length 1
(1/16), name = t1, size = 260
(2/16), name = t2, size = 254
(3/16), name = t3, size = 254
(4/16), name = t4, size = 266
(5/16), name = t5, size = 4084
(6/16), name = t6, size = 254
(7/16), name = t7, size = 254
(8/16), name = t8, size = 266
(9/16), name = t9, size = 4132
(10/16), name = t10, size = 254
(11/16), name = t11, size = 254
(12/16), name = t12, size = 266
(13/16), name = t13, size = 254
(14/16), name = t14, size = 254
(15/16), name = t15, size = 266
(16/16), name = t16, size = 254
**********************
Random choose
Name = t7  No new state computed
Name = t1  OK !
Now we have a representation of size = 19
Minimization in Progress
Name = t7 No new state computed
Name = t13 No new state computed
Name = t6 No new state computed
Name = t9 No new state computed
Name = t11 No new state computed
Name = t12 No new state computed
Name = t16 No new state computed
Name = t3 No new state computed
Name = t4  I.N.C.R.E.A.S.E
Name = t10 No new state computed
Name = t5 No new state computed
Name = t2  OK !
Now we have a representation of size = 19
Name = t7 No new state computed
Name = t6 No new state computed
Name = t10 No new state computed
Name = t8 No new state computed
Name = t1 No new state computed
Name = t14 No new state computed
Name = t15 No new state computed
Name = t4  I.N.C.R.E.A.S.E
Name = t9 No new state computed
Name = t5 No new state computed
Name = t12 No new state computed
Name = t13 No new state computed
Name = t16 No new state computed
Name = t3 No new state computed
Name = t11 No new state computed
increase = 1
**********************
Random choose
Name = t4  OK !
Now we have a representation of size = 20
Minimization in Progress
Name = t9 No new state computed
Name = t3 No new state computed
Name = t2 No new state computed
Name = t8 No new state computed
Name = t7 No new state computed
Name = t10 No new state computed
Name = t1 No new state computed
Name = t14 No new state computed
Name = t11 No new state computed
Name = t6 No new state computed
Name = t13 No new state computed
Name = t5  I.N.C.R.E.A.S.E
Name = t16 No new state computed
Name = t12 No new state computed
Name = t15 No new state computed
increase = 1
**********************
Random choose
Name = t5  OK !
Now we have a representation of size = 28
Minimization in Progress
Name = t11 No new state computed
Name = t13 No new state computed
Name = t8  I.N.C.R.E.A.S.E
Name = t6  I.N.C.R.E.A.S.E
Name = t7 No new state computed
Name = t15 No new state computed
Name = t9 No new state computed
Name = t3 No new state computed
Name = t1  I.N.C.R.E.A.S.E
Name = t12  I.N.C.R.E.A.S.E
Name = t10  I.N.C.R.E.A.S.E
Name = t14 No new state computed
Name = t4 No new state computed
Name = t2 No new state computed
Name = t16 No new state computed
increase = 1
**********************
Random choose
Name = t10  OK !
Now we have a representation of size = 29
Minimization in Progress
Name = t9 No new state computed
Name = t2 No new state computed
Name = t6  I.N.C.R.E.A.S.E
Name = t15 No new state computed
Name = t12  I.N.C.R.E.A.S.E
Name = t16 No new state computed
Name = t13 No new state computed
Name = t7 No new state computed
Name = t3 No new state computed
Name = t4 No new state computed
Name = t11 No new state computed
Name = t8  I.N.C.R.E.A.S.E
Name = t5 No new state computed
Name = t1  I.N.C.R.E.A.S.E
Name = t14 No new state computed
increase = 1
**********************
Random choose
Name = t1  OK !
Now we have a representation of size = 30
Minimization in Progress
Name = t2  OK !
Now we have a representation of size = 28
Name = t14 No new state computed
Name = t16 No new state computed
Name = t9 No new state computed
Name = t5 No new state computed
Name = t8  I.N.C.R.E.A.S.E
Name = t3 No new state computed
Name = t4  OK !
Now we have a representation of size = 27
Name = t15 No new state computed
Name = t5 No new state computed
Name = t3 No new state computed
Name = t1 No new state computed
Name = t12  I.N.C.R.E.A.S.E
Name = t11 No new state computed
Name = t6  OK !
Now we have a representation of size = 27
Name = t4 No new state computed
Name = t10 No new state computed
Name = t14 No new state computed
Name = t9 No new state computed
Name = t15 No new state computed
Name = t5 No new state computed
Name = t7 No new state computed
Name = t8  I.N.C.R.E.A.S.E
Name = t2 No new state computed
Name = t16 No new state computed
Name = t11 No new state computed
Name = t1 No new state computed
Name = t12  I.N.C.R.E.A.S.E
Name = t3 No new state computed
Name = t13 No new state computed
increase = 1
**********************
Random choose
Name = t12  OK !
Now we have a representation of size = 29
Minimization in Progress
Name = t16 No new state computed
Name = t9 No new state computed
Name = t3 No new state computed
Name = t11 No new state computed
Name = t4 No new state computed
Name = t6 No new state computed
Name = t5 No new state computed
Name = t14 No new state computed
Name = t7 No new state computed
Name = t15 No new state computed
Name = t8  I.N.C.R.E.A.S.E
Name = t1 No new state computed
Name = t2 No new state computed
Name = t13 No new state computed
Name = t10 No new state computed
increase = 1
**********************
Random choose
Name = t8  OK !
Now we have a representation of size = 30
Minimization in Progress
Name = t2 No new state computed
Name = t4 No new state computed
Name = t12 No new state computed
Name = t10 No new state computed
Name = t13 No new state computed
Name = t3 No new state computed
Name = t11 No new state computed
Name = t5 No new state computed
Name = t15 No new state computed
Name = t14 No new state computed
Name = t9  I.N.C.R.E.A.S.E
Name = t6 No new state computed
Name = t7 No new state computed
Name = t1 No new state computed
Name = t16 No new state computed
increase = 1
**********************
Random choose
Name = t9  OK !
Now we have a representation of size = 32
Minimization in Progress
Name = t14 No new state computed
Name = t15  I.N.C.R.E.A.S.E
Name = t13  I.N.C.R.E.A.S.E
Name = t2 No new state computed
Name = t16 No new state computed
Name = t3 No new state computed
Name = t7 No new state computed
Name = t10 No new state computed
Name = t11 No new state computed
Name = t4 No new state computed
Name = t5  I.N.C.R.E.A.S.E
Name = t6 No new state computed
Name = t8 No new state computed
Name = t1 No new state computed
Name = t12 No new state computed
increase = 1
**********************
Random choose
Name = t5  OK !
Now we have a representation of size = 40
Minimization in Progress
Name = t15  I.N.C.R.E.A.S.E
Name = t7 No new state computed
Name = t13  I.N.C.R.E.A.S.E
Name = t10  I.N.C.R.E.A.S.E
Name = t3 No new state computed
Name = t9 No new state computed
Name = t1  I.N.C.R.E.A.S.E
Name = t16 No new state computed
Name = t4 No new state computed
Name = t2 No new state computed
Name = t12  I.N.C.R.E.A.S.E
Name = t14 No new state computed
Name = t8  I.N.C.R.E.A.S.E
Name = t6  I.N.C.R.E.A.S.E
Name = t11 No new state computed
increase = 1
**********************
Random choose
Name = t6  OK !
Now we have a representation of size = 41
Minimization in Progress
Name = t7 No new state computed
Name = t9 No new state computed
Name = t2 No new state computed
Name = t5 No new state computed
Name = t8  I.N.C.R.E.A.S.E
Name = t14 No new state computed
Name = t15  I.N.C.R.E.A.S.E
Name = t4 No new state computed
Name = t13  I.N.C.R.E.A.S.E
Name = t11 No new state computed
Name = t1  I.N.C.R.E.A.S.E
Name = t12  I.N.C.R.E.A.S.E
Name = t16 No new state computed
Name = t10  I.N.C.R.E.A.S.E
Name = t3 No new state computed
increase = 1
**********************
Random choose
Name = t10  OK !
Now we have a representation of size = 42
Minimization in Progress
Name = t2 No new state computed
Name = t16 No new state computed
Name = t11 No new state computed
Name = t1  I.N.C.R.E.A.S.E
Name = t6 No new state computed
Name = t12  I.N.C.R.E.A.S.E
Name = t9 No new state computed
Name = t5 No new state computed
Name = t8  I.N.C.R.E.A.S.E
Name = t3 No new state computed
Name = t7 No new state computed
Name = t13  I.N.C.R.E.A.S.E
Name = t15  I.N.C.R.E.A.S.E
Name = t4 No new state computed
Name = t14 No new state computed
increase = 1
**********************
Random choose
Name = t15  OK !
Now we have a representation of size = 44
Minimization in Progress
Name = t9 No new state computed
Name = t5 No new state computed
Name = t13  OK !
Now we have a representation of size = 44
Name = t10 No new state computed
Name = t15 No new state computed
Name = t9 No new state computed
Name = t7 No new state computed
Name = t5 No new state computed
Name = t1  I.N.C.R.E.A.S.E
Name = t12  I.N.C.R.E.A.S.E
Name = t8  I.N.C.R.E.A.S.E
Name = t14 No new state computed
Name = t11 No new state computed
Name = t2 No new state computed
Name = t4 No new state computed
Name = t16 No new state computed
Name = t3 No new state computed
Name = t6 No new state computed
increase = 1
**********************
Random choose
Name = t8  OK !
Now we have a representation of size = 46
Minimization in Progress
Name = t15 No new state computed
Name = t6 No new state computed
Name = t2 No new state computed
Name = t1  I.N.C.R.E.A.S.E
Name = t4 No new state computed
Name = t7 No new state computed
Name = t14 No new state computed
Name = t10 No new state computed
Name = t11 No new state computed
Name = t13 No new state computed
Name = t12  I.N.C.R.E.A.S.E
Name = t9 No new state computed
Name = t3 No new state computed
Name = t16 No new state computed
Name = t5 No new state computed
increase = 1
**********************
Random choose
Name = t12  OK !
Now we have a representation of size = 48
Minimization in Progress
Name = t10 No new state computed
Name = t6 No new state computed
Name = t5 No new state computed
Name = t4 No new state computed
Name = t11 No new state computed
Name = t8 No new state computed
Name = t3 No new state computed
Name = t14 No new state computed
Name = t13 No new state computed
Name = t9 No new state computed
Name = t2 No new state computed
Name = t16 No new state computed
Name = t1  I.N.C.R.E.A.S.E
Name = t15 No new state computed
Name = t7 No new state computed
increase = 1
**********************
Random choose
Name = t1  OK !
Now we have a representation of size = 49
Minimization in Progress
Name = t14 No new state computed
Name = t7 No new state computed
Name = t10 No new state computed
Name = t12 No new state computed
Name = t6 No new state computed
Name = t16 No new state computed
Name = t11 No new state computed
Name = t2  OK !
Now we have a representation of size = 47
Name = t13 No new state computed
Name = t3 No new state computed
Name = t7 No new state computed
Name = t12 No new state computed
Name = t6 No new state computed
Name = t16 No new state computed
Name = t15 No new state computed
Name = t10 No new state computed
Name = t11 No new state computed
Name = t1 No new state computed
Name = t14 No new state computed
Name = t9 No new state computed
Name = t4  OK !
Now we have a representation of size = 31
Name = t6 No new state computed
Name = t5 No new state computed
Name = t10 No new state computed
Name = t1 No new state computed
Name = t9 No new state computed
Name = t12 No new state computed
Name = t11 No new state computed
Name = t13 No new state computed
Name = t14 No new state computed
Name = t2 No new state computed
Name = t7 No new state computed
Name = t8 No new state computed
Name = t3 No new state computed
Name = t15 No new state computed
Name = t16 No new state computed
increase = 0
nb accelerations 22
Fix point FOUND
seed is : 2691
