current set encoding is : prestaf
seed is : 21768
cycles of length 1
(1/9), name = r1, size = 34
(2/9), name = r2, size = 230
(3/9), name = r3, size = 153
(4/9), name = r4, size = 74
(5/9), name = r5, size = 136
(6/9), name = r6, size = 147
(7/9), name = r7, size = 74
(8/9), name = r8, size = 86
(9/9), name = r9, size = 80
**********************
Random choose
Name = r2  No new state computed
Name = r3  No new state computed
Name = r4  No new state computed
Name = r7  No new state computed
Name = r8  No new state computed
Name = r9  No new state computed
Name = r1  OK !
Now we have a representation of size = 16
Minimization in Progress
Name = r5 No new state computed
Name = r9 No new state computed
Name = r7 No new state computed
Name = r4  OK !
Now we have a representation of size = 16
Name = r8 No new state computed
Name = r3  I.N.C.R.E.A.S.E
Name = r1 No new state computed
Name = r6 No new state computed
Name = r7 No new state computed
Name = r5 No new state computed
Name = r2  I.N.C.R.E.A.S.E
Name = r9 No new state computed
increase = 1
**********************
Random choose
Name = r2  OK !
Now we have a representation of size = 28
Minimization in Progress
Name = r3  OK !
Now we have a representation of size = 28
Name = r9 No new state computed
Name = r6 No new state computed
Name = r2 No new state computed
Name = r7 No new state computed
Name = r8  OK !
Now we have a representation of size = 22
Name = r5 No new state computed
Name = r9 No new state computed
Name = r7 No new state computed
Name = r1 No new state computed
Name = r3 No new state computed
Name = r4 No new state computed
Name = r6 No new state computed
Name = r2 No new state computed
increase = 0
nb accelerations 5
Fix point FOUND
seed is : 21768
