current set encoding is : omega
seed is : 3284
cycles of length 1
(1/4), name = r1, size = 33
(2/4), name = r2, size = 32
(3/4), name = r3, size = 41
(4/4), name = r4, size = 65
**********************
Random choose
Name = r2  No new state computed
Name = r4  OK !
Now we have a representation of size = 20
Minimization in Progress
Name = r3 No new state computed
Name = r1  I.N.C.R.E.A.S.E
Name = r2  I.N.C.R.E.A.S.E
increase = 1
**********************
Random choose
Name = r2  OK !
Now we have a representation of size = 30
Minimization in Progress
Name = r1  I.N.C.R.E.A.S.E
Name = r3 No new state computed
Name = r4 No new state computed
increase = 1
**********************
Random choose
Name = r1  OK !
Now we have a representation of size = 53
Minimization in Progress
Name = r3 No new state computed
Name = r4 No new state computed
Name = r2 No new state computed
increase = 0
nb accelerations 3
Fix point FOUND
seed is : 3284
