current set encoding is : lash-lsdf
seed is : 21768
(1/64)->
(2/64)->
(3/64)->
(4/64)->
(5/64)->
(6/64)->
(7/64)->
(8/64)->
(9/64)->
(10/64)->
(11/64)->
(12/64)->
(13/64)->
(14/64)->
(15/64)->
(16/64)->
(17/64)->
(18/64)->
(19/64)->
(20/64)->
(21/64)->
(22/64)->
(23/64)->
(24/64)->
(25/64)->
(26/64)->
(27/64)->
(28/64)->
(29/64)->
(30/64)->
(31/64)->
(32/64)->
(33/64)->
(34/64)->
(35/64)->
(36/64)->
(37/64)->
(38/64)->
(39/64)->
(40/64)->
(41/64)->
(42/64)->
(43/64)->
(44/64)->
(45/64)->
(46/64)->
(47/64)->
(48/64)->
(49/64)->
(50/64)->
(51/64)->
(52/64)->
(53/64)->
(54/64)->
(55/64)->
(56/64)->
(57/64)->
(58/64)->
(59/64)->
(60/64)->
(61/64)->
(62/64)->
(63/64)->
(64/64)->
Simplification of the linear system 
2 functions have the same action, it remains only 1
2 functions have the same action, it remains only 1
1 functions have the same action, it remains only 1
1 functions have the same action, it remains only 1
2 functions have the same action, it remains only 1
2 functions have the same action, it remains only 1
2 functions have the same action, it remains only 1
2 functions have the same action, it remains only 1
1 functions have the same action, it remains only 1
1 functions have the same action, it remains only 1
1 functions have the same action, it remains only 1
1 functions have the same action, it remains only 1
1 functions have the same action, it remains only 1
1 functions have the same action, it remains only 1
1 functions have the same action, it remains only 1
1 functions have the same action, it remains only 1
1 functions have the same action, it remains only 1
2 functions have the same action, it remains only 1
1 functions have the same action, it remains only 1
1 functions have the same action, it remains only 1
2 functions have the same action, it remains only 1
2 functions have the same action, it remains only 1
2 functions have the same action, it remains only 1
2 functions have the same action, it remains only 1
1 functions have the same action, it remains only 1
3 functions have the same action, it remains only 1
2 functions have the same action, it remains only 1
1 functions have the same action, it remains only 1
1 functions have the same action, it remains only 1
1 functions have the same action, it remains only 1
Number of actions before simplification : 44
Number of actions after simplification  : 30
(1/240)->
(2/240)->
(3/240)->
(4/240)->
(5/240)->
(6/240)->
(7/240)->
(8/240)->
(9/240)->
(10/240)->
(11/240)->
(12/240)->
(13/240)->
(14/240)->
(15/240)->
(16/240)->
(17/240)->
(18/240)->
(19/240)->
(20/240)->
(21/240)->
(22/240)->
(23/240)->
(24/240)->
(25/240)->
(26/240)->
(27/240)->
(28/240)->
(29/240)->
(30/240)->
(31/240)->
(32/240)->
(33/240)->
(34/240)->
(35/240)->
(36/240)->
(37/240)->
(38/240)->
(39/240)->
(40/240)->
(41/240)->
(42/240)->
(43/240)->
(44/240)->
(45/240)->
(46/240)->
(47/240)->
(48/240)->
(49/240)->
(50/240)->
(51/240)->
(52/240)->
(53/240)->
(54/240)->
(55/240)->
(56/240)->
(57/240)->
(58/240)->
(59/240)->
(60/240)->
(61/240)->
(62/240)->
(63/240)->
(64/240)->
(65/240)->
(66/240)->
(67/240)->
(68/240)->
(69/240)->
(70/240)->
(71/240)->
(72/240)->
(73/240)->
(74/240)->
(75/240)->
(76/240)->
(77/240)->
(78/240)->
(79/240)->
(80/240)->
(81/240)->
(82/240)->
(83/240)->
(84/240)->
(85/240)->
(86/240)->
(87/240)->
(88/240)->
(89/240)->
(90/240)->
(91/240)->
(92/240)->
(93/240)->
(94/240)->
(95/240)->
(96/240)->
(97/240)->
(98/240)->
(99/240)->
(100/240)->
(101/240)->
(102/240)->
(103/240)->
(104/240)->
(105/240)->
(106/240)->
(107/240)->
(108/240)->
(109/240)->
(110/240)->
(111/240)->
(112/240)->
(113/240)->
(114/240)->
(115/240)->
(116/240)->
(117/240)->
(118/240)->
(119/240)->
(120/240)->
(121/240)->
(122/240)->
(123/240)->
(124/240)->
(125/240)->
(126/240)->
(127/240)->
(128/240)->
(129/240)->
(130/240)->
(131/240)->
(132/240)->
(133/240)->
(134/240)->
(135/240)->
(136/240)->
(137/240)->
(138/240)->
(139/240)->
(140/240)->
(141/240)->
(142/240)->
(143/240)->
(144/240)->
(145/240)->
(146/240)->
(147/240)->
(148/240)->
(149/240)->
(150/240)->
(151/240)->
(152/240)->
(153/240)->
(154/240)->
(155/240)->
(156/240)->
(157/240)->
(158/240)->
(159/240)->
(160/240)->
(161/240)->
(162/240)->
(163/240)->
(164/240)->
(165/240)->
(166/240)->
(167/240)->
(168/240)->
(169/240)->
(170/240)->
(171/240)->
(172/240)->
(173/240)->
(174/240)->
(175/240)->
(176/240)->
(177/240)->
(178/240)->
(179/240)->
(180/240)->
(181/240)->
(182/240)->
(183/240)->
(184/240)->
(185/240)->
(186/240)->
(187/240)->
(188/240)->
(189/240)->
(190/240)->
(191/240)->
(192/240)->
(193/240)->
(194/240)->
(195/240)->
(196/240)->
(197/240)->
(198/240)->
(199/240)->
(200/240)->
(201/240)->
(202/240)->
(203/240)->
(204/240)->
(205/240)->
(206/240)->
(207/240)->
(208/240)->
(209/240)->
(210/240)->
(211/240)->
(212/240)->
(213/240)->
(214/240)->
(215/240)->
(216/240)->
(217/240)->
(218/240)->
(219/240)->
(220/240)->
(221/240)->
(222/240)->
(223/240)->
(224/240)->
(225/240)->
(226/240)->
(227/240)->
(228/240)->
(229/240)->
(230/240)->
(231/240)->
(232/240)->
(233/240)->
(234/240)->
(235/240)->
(236/240)->
(237/240)->
(238/240)->
(239/240)->
(240/240)->
Simplification of the linear system 
2 functions have the same action, it remains only 1
1 functions have the same action, it remains only 1
3 functions have the same action, it remains only 1
2 functions have the same action, it remains only 1
3 functions have the same action, it remains only 1
2 functions have the same action, it remains only 1
2 functions have the same action, it remains only 1
2 functions have the same action, it remains only 1
3 functions have the same action, it remains only 1
2 functions have the same action, it remains only 1
1 functions have the same action, it remains only 1
2 functions have the same action, it remains only 1
1 functions have the same action, it remains only 1
2 functions have the same action, it remains only 1
2 functions have the same action, it remains only 1
2 functions have the same action, it remains only 1
2 functions have the same action, it remains only 1
3 functions have the same action, it remains only 1
3 functions have the same action, it remains only 1
3 functions have the same action, it remains only 1
2 functions have the same action, it remains only 1
2 functions have the same action, it remains only 1
2 functions have the same action, it remains only 1
3 functions have the same action, it remains only 1
2 functions have the same action, it remains only 1
2 functions have the same action, it remains only 1
1 functions have the same action, it remains only 1
1 functions have the same action, it remains only 1
1 functions have the same action, it remains only 1
3 functions have the same action, it remains only 1
2 functions have the same action, it remains only 1
2 functions have the same action, it remains only 1
2 functions have the same action, it remains only 1
2 functions have the same action, it remains only 1
2 functions have the same action, it remains only 1
1 functions have the same action, it remains only 1
2 functions have the same action, it remains only 1
2 functions have the same action, it remains only 1
1 functions have the same action, it remains only 1
1 functions have the same action, it remains only 1
1 functions have the same action, it remains only 1
1 functions have the same action, it remains only 1
3 functions have the same action, it remains only 1
2 functions have the same action, it remains only 1
2 functions have the same action, it remains only 1
3 functions have the same action, it remains only 1
3 functions have the same action, it remains only 1
2 functions have the same action, it remains only 1
2 functions have the same action, it remains only 1
1 functions have the same action, it remains only 1
2 functions have the same action, it remains only 1
2 functions have the same action, it remains only 1
3 functions have the same action, it remains only 1
2 functions have the same action, it remains only 1
1 functions have the same action, it remains only 1
1 functions have the same action, it remains only 1
2 functions have the same action, it remains only 1
2 functions have the same action, it remains only 1
1 functions have the same action, it remains only 1
1 functions have the same action, it remains only 1
2 functions have the same action, it remains only 1
1 functions have the same action, it remains only 1
1 functions have the same action, it remains only 1
1 functions have the same action, it remains only 1
1 functions have the same action, it remains only 1
1 functions have the same action, it remains only 1
3 functions have the same action, it remains only 1
2 functions have the same action, it remains only 1
2 functions have the same action, it remains only 1
1 functions have the same action, it remains only 1
2 functions have the same action, it remains only 1
2 functions have the same action, it remains only 1
1 functions have the same action, it remains only 1
3 functions have the same action, it remains only 1
3 functions have the same action, it remains only 1
3 functions have the same action, it remains only 1
3 functions have the same action, it remains only 1
3 functions have the same action, it remains only 1
1 functions have the same action, it remains only 1
2 functions have the same action, it remains only 1
3 functions have the same action, it remains only 1
1 functions have the same action, it remains only 1
4 functions have the same action, it remains only 1
2 functions have the same action, it remains only 1
3 functions have the same action, it remains only 1
3 functions have the same action, it remains only 1
4 functions have the same action, it remains only 1
1 functions have the same action, it remains only 1
2 functions have the same action, it remains only 1
2 functions have the same action, it remains only 1
2 functions have the same action, it remains only 1
1 functions have the same action, it remains only 1
1 functions have the same action, it remains only 1
2 functions have the same action, it remains only 1
2 functions have the same action, it remains only 1
1 functions have the same action, it remains only 1
1 functions have the same action, it remains only 1
Number of actions before simplification : 189
Number of actions after simplification  : 97
cycles of length 3
(1/97), name = (+reqS.(+reqE1.inv1+inv1.reqE1)+reqE1.(+inv1.reqS+reqS.inv1)), size = 4025
(2/97), name = +reqE1.+inv1.nonex, size = 4027
(3/97), name = (+reqE1.+inv1+inv1.+reqE1+(+reqE1.inv1+inv1.reqE1)), size = 2191
(4/97), name = (+reqS.+inv1.nonex+inv1.(+nonex.reqS+reqS.nonex)), size = 1143
(5/97), name = (+reqS.+inv1+inv1.+reqS+(+inv1.reqS+reqS.inv1)), size = 1159
(6/97), name = (+reqS.(+grantE.reqE1+reqE1.grantE)+reqE1.(+grantE.reqS+reqS.grantE)), size = 9141
(7/97), name = (+reqS.(+grantE.reqE2+reqE2.grantE)+reqE2.(+grantE.reqS+reqS.grantE)), size = 13445
(8/97), name = (+inv1.+nonex++inv1.nonex), size = 621
(9/97), name = (+grantS.(+reqE1.inv1+inv1.reqE1)+reqE1.(+grantS.inv1+inv1.grantS)+inv1.(+reqE1.grantS+grantS.reqE1)), size = 2106
(10/97), name = (+reqE2.(+grantS.inv1+inv1.grantS)+inv1.(+reqE2.grantS+grantS.reqE2)), size = 2106
(11/97), name = ++inv1, size = 640
(12/97), name = (+grantE.(+reqE1.inv1+inv1.reqE1)+reqE1.+grantE.inv1), size = 2547
(13/97), name = +reqE2.+grantE.inv1, size = 5901
(14/97), name = (+nonex.(+grantE.reqE1+reqE1.grantE)+reqE1.+nonex.grantE), size = 4047
(15/97), name = (+nonex.(+grantE.reqE2+reqE2.grantE)+reqE2.+nonex.grantE), size = 4047
(16/97), name = (+inv1.(+grantE.reqE1+reqE1.grantE)+reqE1.+inv1.grantE), size = 2750
(17/97), name = (+inv1.(+grantE.reqE2+reqE2.grantE)+reqE2.+inv1.grantE), size = 11582
(18/97), name = (+grantS.(+inv1.reqS+reqS.inv1)+reqS.(+grantS.inv1+inv1.grantS)+inv1.(+grantS.reqS+reqS.grantS)), size = 1107
(19/97), name = (+reqE1.+grantE+grantE.+reqE1+(+grantE.reqE1+reqE1.grantE)), size = 1582
(20/97), name = (+reqE2.+grantE+grantE.+reqE2+(+grantE.reqE2+reqE2.grantE)), size = 1650
(21/97), name = (+grantE.(+inv1.reqS+reqS.inv1)+reqS.+grantE.inv1), size = 1534
(22/97), name = (+nonex.(+grantE.reqS+reqS.grantE)+reqS.+nonex.grantE), size = 3968
(23/97), name = (+inv1.(+grantE.reqS+reqS.grantE)+reqS.+inv1.grantE), size = 5810
(24/97), name = (+reqS.+grantE+grantE.+reqS+(+grantE.reqS+reqS.grantE)), size = 3373
(25/97), name = (+grantS.+inv1.nonex+inv1.(+nonex.grantS+grantS.nonex)), size = 4034
(26/97), name = (+grantE.+inv1.nonex+nonex.+grantE.inv1), size = 4200
(27/97), name = +inv1.+grantE.inv1, size = 4030
(28/97), name = +nonex.+nonex.grantE, size = 2098
