current set encoding is : prestaf
seed is : 3284
cycles of length 1
(1/17), name = r2, size = 326
(2/17), name = r3, size = 314
(3/17), name = r4, size = 74
(4/17), name = r5, size = 204
(5/17), name = r6, size = 458
(6/17), name = r7, size = 1435
(7/17), name = r8, size = 5623
(8/17), name = r9, size = 1713
(9/17), name = r10, size = 6791
(10/17), name = r11, size = 124
(11/17), name = r12, size = 744
(12/17), name = r13, size = 1246
(13/17), name = r14, size = 4897
(14/17), name = r15, size = 1309
(15/17), name = r16, size = 5326
(16/17), name = r17, size = 621
(17/17), name = r18, size = 121
**********************
Random choose
Name = r8  No new state computed
Name = r10  No new state computed
Name = r15  No new state computed
Name = r4  No new state computed
Name = r12  No new state computed
Name = r3  No new state computed
Name = r2  OK !
Now we have a representation of size = 127
Minimization in Progress
Name = r7 No new state computed
Name = r12 No new state computed
Name = r18 No new state computed
Name = r15 No new state computed
Name = r4 No new state computed
Name = r11 No new state computed
Name = r14 No new state computed
Name = r6 No new state computed
Name = r5  I.N.C.R.E.A.S.E
Name = r13 No new state computed
Name = r17 No new state computed
Name = r9 No new state computed
Name = r16 No new state computed
Name = r8 No new state computed
Name = r10 No new state computed
Name = r3 No new state computed
increase = 1
**********************
Random choose
Name = r5  OK !
Now we have a representation of size = 255
Minimization in Progress
Name = r7  I.N.C.R.E.A.S.E
Name = r15 No new state computed
Name = r12 No new state computed
Name = r14 No new state computed
Name = r2 No new state computed
Name = r9  I.N.C.R.E.A.S.E
Name = r4 No new state computed
Name = r3 No new state computed
Name = r13 No new state computed
Name = r17 No new state computed
Name = r16 No new state computed
Name = r10  I.N.C.R.E.A.S.E
Name = r11  I.N.C.R.E.A.S.E
Name = r8 No new state computed
Name = r18 No new state computed
Name = r6 No new state computed
increase = 1
**********************
Random choose
Name = r11  OK !
Now we have a representation of size = 271
Minimization in Progress
Name = r16 No new state computed
Name = r7  I.N.C.R.E.A.S.E
Name = r15 No new state computed
Name = r2 No new state computed
Name = r5 No new state computed
Name = r12 No new state computed
Name = r17 No new state computed
Name = r8 No new state computed
Name = r13  I.N.C.R.E.A.S.E
Name = r4 No new state computed
Name = r10  I.N.C.R.E.A.S.E
Name = r18 No new state computed
Name = r14 No new state computed
Name = r6 No new state computed
Name = r3 No new state computed
Name = r9  I.N.C.R.E.A.S.E
increase = 1
**********************
Random choose
Name = r9  OK !
Now we have a representation of size = 614
Minimization in Progress
Name = r13  I.N.C.R.E.A.S.E
Name = r8  I.N.C.R.E.A.S.E
Name = r6 No new state computed
Name = r12 No new state computed
Name = r3 No new state computed
Name = r16 No new state computed
Name = r11  I.N.C.R.E.A.S.E
Name = r17 No new state computed
Name = r4 No new state computed
Name = r14 No new state computed
Name = r18 No new state computed
Name = r15 No new state computed
Name = r2 No new state computed
Name = r7  I.N.C.R.E.A.S.E
Name = r10  I.N.C.R.E.A.S.E
Name = r5 No new state computed
increase = 1
**********************
Random choose
Name = r10  OK !
Now we have a representation of size = 633
Minimization in Progress
Name = r4 No new state computed
Name = r13  I.N.C.R.E.A.S.E
Name = r2 No new state computed
Name = r7  I.N.C.R.E.A.S.E
Name = r18 No new state computed
Name = r8  I.N.C.R.E.A.S.E
Name = r3 No new state computed
Name = r15 No new state computed
Name = r9 No new state computed
Name = r5 No new state computed
Name = r12 No new state computed
Name = r16 No new state computed
Name = r11  I.N.C.R.E.A.S.E
Name = r6 No new state computed
Name = r17 No new state computed
Name = r14 No new state computed
increase = 1
**********************
Random choose
Name = r11  OK !
Now we have a representation of size = 780
Minimization in Progress
Name = r12  OK !
Now we have a representation of size = 780
Name = r15  I.N.C.R.E.A.S.E
Name = r17 No new state computed
Name = r18 No new state computed
Name = r7  I.N.C.R.E.A.S.E
Name = r11 No new state computed
Name = r16 No new state computed
Name = r9 No new state computed
Name = r8  I.N.C.R.E.A.S.E
Name = r4 No new state computed
Name = r6 No new state computed
Name = r14  I.N.C.R.E.A.S.E
Name = r2 No new state computed
Name = r3 No new state computed
Name = r13  I.N.C.R.E.A.S.E
Name = r10 No new state computed
Name = r5 No new state computed
increase = 1
**********************
Random choose
Name = r13  OK !
Now we have a representation of size = 801
Minimization in Progress
Name = r16 No new state computed
Name = r18  I.N.C.R.E.A.S.E
Name = r17 No new state computed
Name = r8  I.N.C.R.E.A.S.E
Name = r12 No new state computed
Name = r11 No new state computed
Name = r6 No new state computed
Name = r15  I.N.C.R.E.A.S.E
Name = r5 No new state computed
Name = r9 No new state computed
Name = r7  I.N.C.R.E.A.S.E
Name = r14  I.N.C.R.E.A.S.E
Name = r2 No new state computed
Name = r4 No new state computed
Name = r10 No new state computed
Name = r3 No new state computed
increase = 1
**********************
Random choose
Name = r14  OK !
Now we have a representation of size = 814
Minimization in Progress
Name = r15  I.N.C.R.E.A.S.E
Name = r4 No new state computed
Name = r5 No new state computed
Name = r10 No new state computed
Name = r2 No new state computed
Name = r12 No new state computed
Name = r6 No new state computed
Name = r17 No new state computed
Name = r11 No new state computed
Name = r3 No new state computed
Name = r18  I.N.C.R.E.A.S.E
Name = r9 No new state computed
Name = r13 No new state computed
Name = r16 No new state computed
Name = r8  I.N.C.R.E.A.S.E
Name = r7  I.N.C.R.E.A.S.E
increase = 1
**********************
Random choose
Name = r7  OK !
Now we have a representation of size = 2402
Minimization in Progress
Name = r12 No new state computed
Name = r13 No new state computed
Name = r9  OK !
Now we have a representation of size = 1207
Name = r10  I.N.C.R.E.A.S.E
Name = r11  I.N.C.R.E.A.S.E
Name = r2 No new state computed
Name = r15  I.N.C.R.E.A.S.E
Name = r3 No new state computed
Name = r8  I.N.C.R.E.A.S.E
Name = r17 No new state computed
Name = r18  I.N.C.R.E.A.S.E
Name = r7 No new state computed
Name = r16 No new state computed
Name = r13 No new state computed
Name = r4 No new state computed
Name = r6 No new state computed
Name = r12 No new state computed
Name = r5 No new state computed
Name = r14 No new state computed
increase = 1
**********************
Random choose
Name = r18  OK !
Now we have a representation of size = 1226
Minimization in Progress
Name = r9 No new state computed
Name = r12 No new state computed
Name = r11  I.N.C.R.E.A.S.E
Name = r13 No new state computed
Name = r4 No new state computed
Name = r16 No new state computed
Name = r6 No new state computed
Name = r2 No new state computed
Name = r10  I.N.C.R.E.A.S.E
Name = r14 No new state computed
Name = r17 No new state computed
Name = r7 No new state computed
Name = r15  I.N.C.R.E.A.S.E
Name = r8  I.N.C.R.E.A.S.E
Name = r3 No new state computed
Name = r5 No new state computed
increase = 1
**********************
Random choose
Name = r8  OK !
Now we have a representation of size = 5415
Minimization in Progress
Name = r18 No new state computed
Name = r13 No new state computed
Name = r9 No new state computed
Name = r15  I.N.C.R.E.A.S.E
Name = r6 No new state computed
Name = r16 No new state computed
Name = r12 No new state computed
Name = r10  I.N.C.R.E.A.S.E
Name = r3 No new state computed
Name = r11  I.N.C.R.E.A.S.E
Name = r4 No new state computed
Name = r17 No new state computed
Name = r2 No new state computed
Name = r5 No new state computed
Name = r7 No new state computed
Name = r14 No new state computed
increase = 1
**********************
Random choose
Name = r11  OK !
Now we have a representation of size = 6219
Minimization in Progress
Name = r15  I.N.C.R.E.A.S.E
Name = r13  I.N.C.R.E.A.S.E
Name = r7 No new state computed
Name = r2 No new state computed
Name = r10  I.N.C.R.E.A.S.E
Name = r18 No new state computed
Name = r3 No new state computed
Name = r9 No new state computed
Name = r4 No new state computed
Name = r12  I.N.C.R.E.A.S.E
Name = r17 No new state computed
Name = r8 No new state computed
Name = r5 No new state computed
Name = r6 No new state computed
Name = r16  I.N.C.R.E.A.S.E
Name = r14  I.N.C.R.E.A.S.E
increase = 1
**********************
Random choose
Name = r14  OK !
Now we have a representation of size = 6655
Minimization in Progress
Name = r7 No new state computed
Name = r8 No new state computed
Name = r15  I.N.C.R.E.A.S.E
Name = r11 No new state computed
Name = r12  OK !
Now we have a representation of size = 6536
Name = r7 No new state computed
Name = r18 No new state computed
Name = r2 No new state computed
Name = r15  I.N.C.R.E.A.S.E
Name = r3 No new state computed
Name = r11 No new state computed
Name = r14 No new state computed
Name = r4 No new state computed
Name = r9 No new state computed
Name = r6 No new state computed
Name = r13  I.N.C.R.E.A.S.E
Name = r5 No new state computed
Name = r8 No new state computed
Name = r16  I.N.C.R.E.A.S.E
Name = r10  I.N.C.R.E.A.S.E
Name = r17 No new state computed
increase = 1
**********************
Random choose
Name = r10  OK !
Now we have a representation of size = 10496
Minimization in Progress
Name = r8 No new state computed
Name = r6 No new state computed
Name = r4 No new state computed
Name = r17 No new state computed
Name = r15  I.N.C.R.E.A.S.E
Name = r7 No new state computed
Name = r16  I.N.C.R.E.A.S.E
Name = r9 No new state computed
Name = r13  I.N.C.R.E.A.S.E
Name = r12 No new state computed
Name = r3 No new state computed
Name = r5 No new state computed
Name = r11  I.N.C.R.E.A.S.E
Name = r18 No new state computed
Name = r14 No new state computed
Name = r2 No new state computed
increase = 1
**********************
Random choose
Name = r11  OK !
Now we have a representation of size = 10778
Minimization in Progress
Name = r18 No new state computed
Name = r12  OK !
Now we have a representation of size = 10721
Name = r4 No new state computed
Name = r13  I.N.C.R.E.A.S.E
Name = r10 No new state computed
Name = r5 No new state computed
Name = r3 No new state computed
Name = r8 No new state computed
Name = r15  I.N.C.R.E.A.S.E
Name = r17 No new state computed
Name = r11 No new state computed
Name = r7 No new state computed
Name = r14 No new state computed
Name = r18 No new state computed
Name = r9 No new state computed
Name = r6 No new state computed
Name = r2 No new state computed
Name = r16 No new state computed
increase = 1
**********************
Random choose
Name = r15  OK !
Now we have a representation of size = 13941
Minimization in Progress
Name = r9 No new state computed
Name = r6 No new state computed
Name = r7 No new state computed
Name = r14 No new state computed
Name = r3 No new state computed
Name = r10 No new state computed
Name = r17 No new state computed
Name = r4 No new state computed
Name = r16 No new state computed
Name = r5 No new state computed
Name = r13  I.N.C.R.E.A.S.E
Name = r18  I.N.C.R.E.A.S.E
Name = r12 No new state computed
Name = r8 No new state computed
Name = r11 No new state computed
Name = r2 No new state computed
increase = 1
**********************
Random choose
Name = r18  OK !
Now we have a representation of size = 14310
Minimization in Progress
Name = r11 No new state computed
Name = r9 No new state computed
Name = r3 No new state computed
Name = r17 No new state computed
Name = r2 No new state computed
Name = r12 No new state computed
Name = r13  I.N.C.R.E.A.S.E
Name = r5 No new state computed
Name = r8 No new state computed
Name = r10 No new state computed
Name = r15 No new state computed
Name = r4 No new state computed
Name = r7 No new state computed
Name = r14 No new state computed
Name = r6 No new state computed
Name = r16 No new state computed
increase = 1
**********************
Random choose
Name = r13  OK !
Now we have a representation of size = 17046
Minimization in Progress
Name = r10 No new state computed
Name = r15 No new state computed
Name = r14 No new state computed
Name = r17 No new state computed
Name = r16 No new state computed
Name = r8 No new state computed
Name = r11 No new state computed
Name = r4 No new state computed
Name = r3 No new state computed
Name = r9 No new state computed
Name = r5 No new state computed
Name = r6 No new state computed
Name = r2 No new state computed
Name = r12 No new state computed
Name = r18  I.N.C.R.E.A.S.E
Name = r7 No new state computed
increase = 1
**********************
Random choose
Name = r18  OK !
Now we have a representation of size = 17373
Minimization in Progress
Name = r17 No new state computed
Name = r15 No new state computed
Name = r6 No new state computed
Name = r2 No new state computed
Name = r12 No new state computed
Name = r5 No new state computed
Name = r16 No new state computed
Name = r8 No new state computed
Name = r9 No new state computed
Name = r11 No new state computed
Name = r3 No new state computed
Name = r7 No new state computed
Name = r13 No new state computed
Name = r4 No new state computed
Name = r14 No new state computed
Name = r10 No new state computed
increase = 0
nb accelerations 23
Fix point FOUND
seed is : 3284
