current set encoding is : lash-lsdf
seed is : 21768
cycles of length 1
(1/17), name = t1, size = 454
(2/17), name = t2, size = 466
(3/17), name = t3, size = 706
(4/17), name = t4, size = 755
(5/17), name = t5, size = 742
(6/17), name = t6, size = 706
(7/17), name = t7, size = 448
(8/17), name = t8, size = 448
(9/17), name = t9, size = 460
(10/17), name = t10, size = 454
(11/17), name = t11, size = 448
(12/17), name = t12, size = 448
(13/17), name = t13, size = 454
(14/17), name = t14, size = 460
(15/17), name = t15, size = 466
(16/17), name = t16, size = 700
(17/17), name = t17, size = 796
**********************
Random choose
Name = t4  No new state computed
Name = t6  No new state computed
Name = t8  No new state computed
Name = t9  No new state computed
Name = t16  No new state computed
Name = t5  No new state computed
Name = t2  OK !
Now we have a representation of size = 538
Minimization in Progress
Name = t10  I.N.C.R.E.A.S.E
Name = t1  OK !
Now we have a representation of size = 538
Name = t3 No new state computed
Name = t10  I.N.C.R.E.A.S.E
Name = t13 No new state computed
Name = t5 No new state computed
Name = t2 No new state computed
Name = t12 No new state computed
Name = t7 No new state computed
Name = t11 No new state computed
Name = t14 No new state computed
Name = t16 No new state computed
Name = t9 No new state computed
Name = t6 No new state computed
Name = t4 No new state computed
Name = t17 No new state computed
Name = t15 No new state computed
Name = t8 No new state computed
increase = 1
**********************
Random choose
Name = t10  OK !
Now we have a representation of size = 578
Minimization in Progress
Name = t9  I.N.C.R.E.A.S.E
Name = t17 No new state computed
Name = t11  OK !
Now we have a representation of size = 578
Name = t3 No new state computed
Name = t17 No new state computed
Name = t15 No new state computed
Name = t5 No new state computed
Name = t12  I.N.C.R.E.A.S.E
Name = t4 No new state computed
Name = t10 No new state computed
Name = t14 No new state computed
Name = t6  I.N.C.R.E.A.S.E
Name = t1 No new state computed
Name = t8 No new state computed
Name = t9  I.N.C.R.E.A.S.E
Name = t2 No new state computed
Name = t13  I.N.C.R.E.A.S.E
Name = t16 No new state computed
Name = t7 No new state computed
increase = 1
**********************
Random choose
Name = t13  OK !
Now we have a representation of size = 618
Minimization in Progress
Name = t12  OK !
Now we have a representation of size = 618
Name = t17 No new state computed
Name = t4 No new state computed
Name = t16 No new state computed
Name = t15 No new state computed
Name = t8 No new state computed
Name = t2 No new state computed
Name = t7 No new state computed
Name = t13 No new state computed
Name = t9  I.N.C.R.E.A.S.E
Name = t1 No new state computed
Name = t10 No new state computed
Name = t5 No new state computed
Name = t3 No new state computed
Name = t14 No new state computed
Name = t6  I.N.C.R.E.A.S.E
Name = t11 No new state computed
increase = 1
**********************
Random choose
Name = t6  OK !
Now we have a representation of size = 624
Minimization in Progress
Name = t10 No new state computed
Name = t7 No new state computed
Name = t5 No new state computed
Name = t12 No new state computed
Name = t14 No new state computed
Name = t9  I.N.C.R.E.A.S.E
Name = t17 No new state computed
Name = t13 No new state computed
Name = t16 No new state computed
Name = t2 No new state computed
Name = t11 No new state computed
Name = t15 No new state computed
Name = t4 No new state computed
Name = t8 No new state computed
Name = t1 No new state computed
Name = t3 No new state computed
increase = 1
**********************
Random choose
Name = t9  OK !
Now we have a representation of size = 626
Minimization in Progress
Name = t11 No new state computed
Name = t14 No new state computed
Name = t13 No new state computed
Name = t4 No new state computed
Name = t1 No new state computed
Name = t6 No new state computed
Name = t8 No new state computed
Name = t5 No new state computed
Name = t17 No new state computed
Name = t16 No new state computed
Name = t3  I.N.C.R.E.A.S.E
Name = t12 No new state computed
Name = t7 No new state computed
Name = t2 No new state computed
Name = t10 No new state computed
Name = t15 No new state computed
increase = 1
**********************
Random choose
Name = t3  OK !
Now we have a representation of size = 630
Minimization in Progress
Name = t16 No new state computed
Name = t13 No new state computed
Name = t1 No new state computed
Name = t5 No new state computed
Name = t7 No new state computed
Name = t12 No new state computed
Name = t9 No new state computed
Name = t17 No new state computed
Name = t8 No new state computed
Name = t15 No new state computed
Name = t4 No new state computed
Name = t6 No new state computed
Name = t14 No new state computed
Name = t2 No new state computed
Name = t11 No new state computed
Name = t10 No new state computed
increase = 0
nb accelerations 9
Fix point FOUND
seed is : 21768
