current set encoding is : prestaf
seed is : 21768
cycles of length 1
(1/9), name = t1, size = 57
(2/9), name = t2, size = 92
(3/9), name = t3, size = 93
(4/9), name = t4, size = 63
(5/9), name = t5, size = 101
(6/9), name = t6, size = 99
(7/9), name = t7, size = 69
(8/9), name = t8, size = 110
(9/9), name = t9, size = 105
**********************
Random choose
Name = t2  No new state computed
Name = t3  No new state computed
Name = t4  OK !
Now we have a representation of size = 34
Minimization in Progress
Name = t5  I.N.C.R.E.A.S.E
Name = t3 No new state computed
Name = t7  I.N.C.R.E.A.S.E
Name = t1  I.N.C.R.E.A.S.E
Name = t6 No new state computed
Name = t8 No new state computed
Name = t9 No new state computed
Name = t2 No new state computed
increase = 1
**********************
Random choose
Name = t1  OK !
Now we have a representation of size = 92
Minimization in Progress
Name = t8 No new state computed
Name = t3 No new state computed
Name = t9 No new state computed
Name = t6 No new state computed
Name = t7  I.N.C.R.E.A.S.E
Name = t5  I.N.C.R.E.A.S.E
Name = t2  I.N.C.R.E.A.S.E
Name = t4  I.N.C.R.E.A.S.E
increase = 1
**********************
Random choose
Name = t4  OK !
Now we have a representation of size = 105
Minimization in Progress
Name = t3 No new state computed
Name = t8 No new state computed
Name = t6 No new state computed
Name = t2  I.N.C.R.E.A.S.E
Name = t5  I.N.C.R.E.A.S.E
Name = t9 No new state computed
Name = t7  I.N.C.R.E.A.S.E
Name = t1 No new state computed
increase = 1
**********************
Random choose
Name = t7  OK !
Now we have a representation of size = 285
Minimization in Progress
Name = t6 No new state computed
Name = t2  I.N.C.R.E.A.S.E
Name = t5  I.N.C.R.E.A.S.E
Name = t4  I.N.C.R.E.A.S.E
Name = t9 No new state computed
Name = t3 No new state computed
Name = t1  I.N.C.R.E.A.S.E
Name = t8  I.N.C.R.E.A.S.E
increase = 1
**********************
Random choose
Name = t8  OK !
Now we have a representation of size = 302
Minimization in Progress
Name = t4  I.N.C.R.E.A.S.E
Name = t5  I.N.C.R.E.A.S.E
Name = t1  I.N.C.R.E.A.S.E
Name = t7 No new state computed
Name = t3 No new state computed
Name = t6 No new state computed
Name = t2  I.N.C.R.E.A.S.E
Name = t9 No new state computed
increase = 1
**********************
Random choose
Name = t2  OK !
Now we have a representation of size = 351
Minimization in Progress
Name = t5  I.N.C.R.E.A.S.E
Name = t6 No new state computed
Name = t8 No new state computed
Name = t9 No new state computed
Name = t4  I.N.C.R.E.A.S.E
Name = t1  I.N.C.R.E.A.S.E
Name = t7 No new state computed
Name = t3 No new state computed
increase = 1
**********************
Random choose
Name = t1  OK !
Now we have a representation of size = 396
Minimization in Progress
Name = t6 No new state computed
Name = t4  I.N.C.R.E.A.S.E
Name = t3 No new state computed
Name = t9 No new state computed
Name = t5  I.N.C.R.E.A.S.E
Name = t8 No new state computed
Name = t2 No new state computed
Name = t7 No new state computed
increase = 1
**********************
Random choose
Name = t5  OK !
Now we have a representation of size = 469
Minimization in Progress
Name = t1 No new state computed
Name = t3 No new state computed
Name = t4  I.N.C.R.E.A.S.E
Name = t7 No new state computed
Name = t2 No new state computed
Name = t9 No new state computed
Name = t8 No new state computed
Name = t6 No new state computed
increase = 1
**********************
Random choose
Name = t4  OK !
Now we have a representation of size = 585
Minimization in Progress
Name = t5 No new state computed
Name = t9 No new state computed
Name = t8 No new state computed
Name = t2 No new state computed
Name = t7 No new state computed
Name = t1  I.N.C.R.E.A.S.E
Name = t6 No new state computed
Name = t3 No new state computed
increase = 1
**********************
Random choose
Name = t1  OK !
Now we have a representation of size = 609
Minimization in Progress
Name = t9 No new state computed
Name = t5 No new state computed
Name = t7 No new state computed
Name = t6 No new state computed
Name = t4 No new state computed
Name = t8 No new state computed
Name = t3 No new state computed
Name = t2 No new state computed
increase = 0
nb accelerations 10
Fix point FOUND
seed is : 21768
