current set encoding is : lash-msdf
seed is : 2691
cycles of length 1
(1/4), name = r1, size = 338
(2/4), name = r2, size = 97
(3/4), name = r3, size = 233
(4/4), name = r4, size = 268
**********************
Random choose
Name = r2  No new state computed
Name = r1  OK !
Now we have a representation of size = 16
Minimization in Progress
Name = r2 No new state computed
Name = r3  I.N.C.R.E.A.S.E
Name = r4  I.N.C.R.E.A.S.E
increase = 1
**********************
Random choose
Name = r4  OK !
Now we have a representation of size = 27
Minimization in Progress
Name = r3 No new state computed
Name = r2  I.N.C.R.E.A.S.E
Name = r1 No new state computed
increase = 1
**********************
Random choose
Name = r2  OK !
Now we have a representation of size = 28
Minimization in Progress
Name = r1  OK !
Now we have a representation of size = 28
Name = r4 No new state computed
Name = r3 No new state computed
Name = r2 No new state computed
increase = 0
nb accelerations 4
Fix point FOUND
seed is : 2691
