current set encoding is : mona
seed is : 2691
cycles of length 1
(1/9), name = t1, size = 732
(2/9), name = t2, size = 696
(3/9), name = t3, size = 405
(4/9), name = t4, size = 405
(5/9), name = t5, size = 372
(6/9), name = t6, size = 417
(7/9), name = t7, size = 393
(8/9), name = t8, size = 426
(9/9), name = t9, size = 420
**********************
Random choose
Name = t4  No new state computed
Name = t1  No new state computed
Name = t3  No new state computed
Name = t6  No new state computed
Name = t7  No new state computed
Name = t5  No new state computed
Name = t9  OK !
Now we have a representation of size = 29
Minimization in Progress
Name = t8 No new state computed
Name = t1 No new state computed
Name = t2  I.N.C.R.E.A.S.E
Name = t3 No new state computed
Name = t7  I.N.C.R.E.A.S.E
Name = t5 No new state computed
Name = t4 No new state computed
Name = t6 No new state computed
increase = 1
**********************
Random choose
Name = t7  OK !
Now we have a representation of size = 30
Minimization in Progress
Name = t3 No new state computed
Name = t5 No new state computed
Name = t4 No new state computed
Name = t1 No new state computed
Name = t8 No new state computed
Name = t6 No new state computed
Name = t9 No new state computed
Name = t2  I.N.C.R.E.A.S.E
increase = 1
**********************
Random choose
Name = t2  OK !
Now we have a representation of size = 33
Minimization in Progress
Name = t6 No new state computed
Name = t5 No new state computed
Name = t8 No new state computed
Name = t3  I.N.C.R.E.A.S.E
Name = t7 No new state computed
Name = t4  I.N.C.R.E.A.S.E
Name = t9 No new state computed
Name = t1 No new state computed
increase = 1
**********************
Random choose
Name = t4  OK !
Now we have a representation of size = 35
Minimization in Progress
Name = t1 No new state computed
Name = t5  I.N.C.R.E.A.S.E
Name = t9 No new state computed
Name = t7 No new state computed
Name = t8 No new state computed
Name = t6 No new state computed
Name = t2 No new state computed
Name = t3  I.N.C.R.E.A.S.E
increase = 1
**********************
Random choose
Name = t3  OK !
Now we have a representation of size = 40
Minimization in Progress
Name = t9  I.N.C.R.E.A.S.E
Name = t8 No new state computed
Name = t7 No new state computed
Name = t6 No new state computed
Name = t1 No new state computed
Name = t5  I.N.C.R.E.A.S.E
Name = t2 No new state computed
Name = t4 No new state computed
increase = 1
**********************
Random choose
Name = t5  OK !
Now we have a representation of size = 42
Minimization in Progress
Name = t4 No new state computed
Name = t9  I.N.C.R.E.A.S.E
Name = t8 No new state computed
Name = t7 No new state computed
Name = t2 No new state computed
Name = t1 No new state computed
Name = t6 No new state computed
Name = t3  OK !
Now we have a representation of size = 42
Name = t6 No new state computed
Name = t7 No new state computed
Name = t4 No new state computed
Name = t2 No new state computed
Name = t9  I.N.C.R.E.A.S.E
Name = t1  OK !
Now we have a representation of size = 40
Name = t4 No new state computed
Name = t5 No new state computed
Name = t7 No new state computed
Name = t6 No new state computed
Name = t3 No new state computed
Name = t8 No new state computed
Name = t9  I.N.C.R.E.A.S.E
Name = t2 No new state computed
increase = 1
**********************
Random choose
Name = t9  OK !
Now we have a representation of size = 43
Minimization in Progress
Name = t7 No new state computed
Name = t5 No new state computed
Name = t6 No new state computed
Name = t2 No new state computed
Name = t1 No new state computed
Name = t4  OK !
Now we have a representation of size = 43
Name = t8 No new state computed
Name = t1  OK !
Now we have a representation of size = 41
Name = t6 No new state computed
Name = t3 No new state computed
Name = t4 No new state computed
Name = t2 No new state computed
Name = t5 No new state computed
Name = t7 No new state computed
Name = t9 No new state computed
Name = t8 No new state computed
increase = 0
nb accelerations 11
Fix point FOUND
seed is : 2691
