current set encoding is : mona
seed is : 2691
cycles of length 1
(1/9), name = r2, size = 1162
(2/9), name = r3, size = 290
(3/9), name = r4, size = 114
(4/9), name = r5, size = 225
(5/9), name = r6, size = 268
(6/9), name = r7, size = 997
(7/9), name = r8, size = 125
(8/9), name = r9, size = 280
(9/9), name = r10, size = 182
**********************
Random choose
Name = r5  No new state computed
Name = r2  OK !
Now we have a representation of size = 21
Minimization in Progress
Name = r5  I.N.C.R.E.A.S.E
Name = r8 No new state computed
Name = r4  I.N.C.R.E.A.S.E
Name = r9 No new state computed
Name = r6 No new state computed
Name = r7  I.N.C.R.E.A.S.E
Name = r10 No new state computed
Name = r3 No new state computed
increase = 1
**********************
Random choose
Name = r7  OK !
Now we have a representation of size = 38
Minimization in Progress
Name = r5  I.N.C.R.E.A.S.E
Name = r3 No new state computed
Name = r10 No new state computed
Name = r8  OK !
Now we have a representation of size = 38
Name = r5  I.N.C.R.E.A.S.E
Name = r4  OK !
Now we have a representation of size = 38
Name = r7  I.N.C.R.E.A.S.E
Name = r6 No new state computed
Name = r2  I.N.C.R.E.A.S.E
Name = r10 No new state computed
Name = r8 No new state computed
Name = r3 No new state computed
Name = r5  I.N.C.R.E.A.S.E
Name = r9 No new state computed
increase = 1
**********************
Random choose
Name = r5  OK !
Now we have a representation of size = 67
Minimization in Progress
Name = r7  I.N.C.R.E.A.S.E
Name = r8 No new state computed
Name = r10 No new state computed
Name = r4 No new state computed
Name = r6 No new state computed
Name = r3 No new state computed
Name = r2  I.N.C.R.E.A.S.E
Name = r9 No new state computed
increase = 1
**********************
Random choose
Name = r2  OK !
Now we have a representation of size = 99
Minimization in Progress
Name = r7  I.N.C.R.E.A.S.E
Name = r6 No new state computed
Name = r9 No new state computed
Name = r10 No new state computed
Name = r3 No new state computed
Name = r4 No new state computed
Name = r5 No new state computed
Name = r8 No new state computed
increase = 1
**********************
Random choose
Name = r7  OK !
Now we have a representation of size = 102
Minimization in Progress
Name = r4 No new state computed
Name = r9 No new state computed
Name = r5 No new state computed
Name = r2 No new state computed
Name = r8 No new state computed
Name = r10 No new state computed
Name = r3 No new state computed
Name = r6 No new state computed
increase = 0
nb accelerations 7
Fix point FOUND
seed is : 2691
