current set encoding is : lash-msdf
seed is : 2691
cycles of length 1
(1/7), name = reqS, size = 153
(2/7), name = inv1, size = 224
(3/7), name = inv2, size = 218
(4/7), name = grantS, size = 162
(5/7), name = reqE1, size = 153
(6/7), name = reqE2, size = 160
(7/7), name = grantE, size = 189
**********************
Random choose
Name = inv2  No new state computed
Name = reqS  No new state computed
Name = grantE  OK !
Now we have a representation of size = 97
Minimization in Progress
Name = reqE2 No new state computed
Name = inv2 No new state computed
Name = reqE1 No new state computed
Name = grantS  I.N.C.R.E.A.S.E
Name = inv1 No new state computed
Name = reqS No new state computed
increase = 1
**********************
Random choose
Name = grantS  OK !
Now we have a representation of size = 127
Minimization in Progress
Name = inv1  I.N.C.R.E.A.S.E
Name = inv2 No new state computed
Name = reqS No new state computed
Name = reqE1 No new state computed
Name = grantE No new state computed
Name = reqE2 No new state computed
increase = 1
**********************
Random choose
Name = inv1  OK !
Now we have a representation of size = 155
Minimization in Progress
Name = inv2 No new state computed
Name = grantS No new state computed
Name = reqE2 No new state computed
Name = reqS  I.N.C.R.E.A.S.E
Name = grantE No new state computed
Name = reqE1 No new state computed
increase = 1
**********************
Random choose
Name = reqS  OK !
Now we have a representation of size = 192
Minimization in Progress
Name = inv2 No new state computed
Name = reqE1 No new state computed
Name = reqE2 No new state computed
Name = grantS No new state computed
Name = inv1 No new state computed
Name = grantE  I.N.C.R.E.A.S.E
increase = 1
**********************
Random choose
Name = grantE  OK !
Now we have a representation of size = 227
Minimization in Progress
Name = grantS No new state computed
Name = reqE2 No new state computed
Name = inv2 No new state computed
Name = reqS No new state computed
Name = reqE1 No new state computed
Name = inv1 No new state computed
increase = 0
nb accelerations 5
Fix point FOUND
seed is : 2691
