current set encoding is : prestaf
seed is : 21768
cycles of length 1
(1/6), name = t1, size = 45
(2/6), name = t2, size = 71
(3/6), name = t3, size = 72
(4/6), name = t4, size = 51
(5/6), name = t5, size = 80
(6/6), name = t6, size = 78
**********************
Random choose
Name = t2  No new state computed
Name = t6  No new state computed
Name = t3  No new state computed
Name = t5  No new state computed
Name = t1  OK !
Now we have a representation of size = 26
Minimization in Progress
Name = t2  I.N.C.R.E.A.S.E
Name = t6 No new state computed
Name = t5 No new state computed
Name = t4  I.N.C.R.E.A.S.E
Name = t3 No new state computed
increase = 1
**********************
Random choose
Name = t4  OK !
Now we have a representation of size = 74
Minimization in Progress
Name = t6 No new state computed
Name = t5  I.N.C.R.E.A.S.E
Name = t1  I.N.C.R.E.A.S.E
Name = t3 No new state computed
Name = t2  I.N.C.R.E.A.S.E
increase = 1
**********************
Random choose
Name = t2  OK !
Now we have a representation of size = 96
Minimization in Progress
Name = t4 No new state computed
Name = t1  I.N.C.R.E.A.S.E
Name = t6 No new state computed
Name = t5  I.N.C.R.E.A.S.E
Name = t3 No new state computed
increase = 1
**********************
Random choose
Name = t5  OK !
Now we have a representation of size = 108
Minimization in Progress
Name = t2 No new state computed
Name = t4 No new state computed
Name = t1  I.N.C.R.E.A.S.E
Name = t3 No new state computed
Name = t6 No new state computed
increase = 1
**********************
Random choose
Name = t1  OK !
Now we have a representation of size = 133
Minimization in Progress
Name = t3 No new state computed
Name = t5 No new state computed
Name = t4 No new state computed
Name = t6 No new state computed
Name = t2 No new state computed
increase = 0
nb accelerations 5
Fix point FOUND
seed is : 21768
