current set encoding is : omega
seed is : 21768
cycles of length 1
(1/7), name = reqS, size = 96
(2/7), name = inv1, size = 96
(3/7), name = inv2, size = 73
(4/7), name = grantS, size = 72
(5/7), name = reqE1, size = 96
(6/7), name = reqE2, size = 96
(7/7), name = grantE, size = 72
**********************
Random choose
Name = inv1  No new state computed
Name = grantE  OK !
Now we have a representation of size = 36
Minimization in Progress
Name = grantS  I.N.C.R.E.A.S.E
Name = inv2 No new state computed
Name = inv1 No new state computed
Name = reqE2 No new state computed
Name = reqS No new state computed
Name = reqE1 No new state computed
increase = 1
**********************
Random choose
Name = grantS  OK !
Now we have a representation of size = 48
Minimization in Progress
Name = reqS No new state computed
Name = reqE2 No new state computed
Name = inv2 No new state computed
Name = grantE No new state computed
Name = reqE1 No new state computed
Name = inv1  I.N.C.R.E.A.S.E
increase = 1
**********************
Random choose
Name = inv1  OK !
Now we have a representation of size = 84
Minimization in Progress
Name = reqS  I.N.C.R.E.A.S.E
Name = grantS No new state computed
Name = reqE2 No new state computed
Name = grantE No new state computed
Name = reqE1 No new state computed
Name = inv2 No new state computed
increase = 1
**********************
Random choose
Name = reqS  OK !
Now we have a representation of size = 132
Minimization in Progress
Name = inv2 No new state computed
Name = reqE1 No new state computed
Name = inv1 No new state computed
Name = grantS No new state computed
Name = reqE2 No new state computed
Name = grantE  I.N.C.R.E.A.S.E
increase = 1
**********************
Random choose
Name = grantE  OK !
Now we have a representation of size = 180
Minimization in Progress
Name = grantS No new state computed
Name = reqE2 No new state computed
Name = reqS No new state computed
Name = inv2 No new state computed
Name = inv1 No new state computed
Name = reqE1 No new state computed
increase = 0
nb accelerations 5
Fix point FOUND
seed is : 21768
