input; seed; formula size in nodes; formula size in chars; automata size; total time; synthesis time
barber; 2691;365;1600;36;0.36;0
barber; 3284;365;1600;36;0.36;0
barber; 21768;365;1600;36;0.36;0
berkeley; 2691;239;1189;29;0.24;0
berkeley; 3284;239;1189;29;0.23;0
berkeley; 21768;239;1190;29;0.24;0.01
BoigelotLegayWolperCAV03.without_strategy; 2691;369;1327;523;25.50;0.03
BoigelotLegayWolperCAV03.without_strategy; 3284;369;1327;523;22.83;0.03
BoigelotLegayWolperCAV03.without_strategy; 21768;369;1327;523;34.75;0.03
BoigelotLegayWolperCAV03.with_strategy; 2691;369;1327;523;6.06;0.03
BoigelotLegayWolperCAV03.with_strategy; 3284;369;1327;523;4.13;0.02
BoigelotLegayWolperCAV03.with_strategy; 21768;369;1327;523;36.60;0.03
canibals_v2; 2691;ERR
canibals_v2; 3284;ERR
canibals_v2; 21768;ERR
centralserver; 2691;793;3167;75;2.52;0.01
centralserver; 3284;793;3167;75;2.50;0.01
centralserver; 21768;793;3167;75;2.50;0.01
consistency; 2691;719;2949;90;71.51;0.03
consistency; 3284;719;2949;90;71.79;0.03
consistency; 21768;719;2949;90;71.91;0.02
consistencyInv; 2691;3380;12503;205;0.69;0.25
consistencyInv; 3284;3380;12503;205;0.69;0.26
consistencyInv; 21768;3380;12503;205;0.69;0.24
consprod; 2691;4679;17548;353;2.48;0.01
consprod; 3284;4679;17548;353;2.56;0.01
consprod; 21768;4679;17548;353;2.54;0.01
consprodjava; 2691;12895;48470;1967;16.16;2.38
consprodjava; 3284;12895;48470;1967;19.23;2.44
consprodjava; 21768;12895;48470;1967;24.85;2.4
consprodjavaN; 2691;12895;48470;1967;16.12;2.38
consprodjavaN; 3284;12895;48470;1967;19.27;2.4
consprodjavaN; 21768;12895;48470;1967;25.11;2.42
consprodjavaNInv; 2691;6222;22100;308;2.97;0.41
consprodjavaNInv; 3284;6222;22100;308;2.93;0.4
consprodjavaNInv; 21768;6222;22100;308;2.97;0.41
csm; 2691;721;2812;66;4.67;0.02
csm; 3284;721;2812;66;4.72;0.01
csm; 21768;721;2812;66;4.76;0.01
csmInv; 2691;3813;13901;140;0.73;0.03
csmInv; 3284;3813;13901;140;0.74;0.03
csmInv; 21768;3813;13901;140;0.73;0.03
dekker; 2691;2767;10053;200;4.22;0.01
dekker; 3284;2767;10053;200;4.22;0.01
dekker; 21768;2767;10052;200;4.23;0
DRAGON; 2691;258;1224;23;0.35;0
DRAGON; 3284;258;1224;23;0.35;0
DRAGON; 21768;258;1224;23;0.34;0
efm; 2691;195;936;26;0.33;0
efm; 3284;195;937;26;0.31;0.01
efm; 21768;195;937;26;0.32;0.01
FIREFLY; 2691;226;1116;28;0.25;0
FIREFLY; 3284;226;1117;28;0.25;0.02
FIREFLY; 21768;226;1116;28;0.26;0
fms; 2691;12173;43804;528;14.03;1.52
fms; 3284;12173;43804;528;11.68;1.51
fms; 21768;12173;43804;528;13.59;1.53
fmsInv; 2691;12173;43804;528;13.82;1.32
fmsInv; 3284;12173;43803;528;11.78;0.99
fmsInv; 21768;12173;43804;528;13.60;1.29
futurbus; 2691;798;3369;106;0.52;0.03
futurbus; 3284;798;3369;106;0.54;0.04
futurbus; 21768;798;3369;106;0.52;0.03
gb; 2691;ERR
gb; 3284;ERR
gb; 21768;ERR
ILLINOIS; 2691;201;985;22;0.30;0
ILLINOIS; 3284;201;985;22;0.31;0
ILLINOIS; 21768;201;986;22;0.29;0.01
incdec; 2691;ERR
incdec; 3284;ERR
incdec; 21768;ERR
incdecInv; 2691;26232;88914;1047;60.14;19.33
incdecInv; 3284;26232;88914;1047;62.47;19.42
incdecInv; 21768;26232;88914;1047;62.98;19.32
kanban; 2691;483;1949;31;2.17;0
kanban; 3284;483;1949;31;2.16;0
kanban; 21768;483;1949;31;2.12;0
lamport; 2691;359;1519;25;0.67;0
lamport; 3284;359;1519;25;0.66;0
lamport; 21768;359;1519;25;0.64;0
lastinfirstserved; 2691;560;2275;68;0.46;0
lastinfirstserved; 3284;560;2276;68;0.46;0.01
lastinfirstserved; 21768;560;2275;68;0.46;0
lift; 2691;881;3817;73;0.51;0.01
lift; 3284;881;3817;73;0.51;0.01
lift; 21768;881;3816;73;0.50;0
manufacturing; 2691;130;541;9;3.91;0
manufacturing; 3284;130;542;9;3.92;0.01
manufacturing; 21768;130;541;9;4.02;0
MESI; 2691;188;935;18;0.24;0
MESI; 3284;188;936;18;0.23;0.02
MESI; 21768;188;936;18;0.24;0.02
MOESI; 2691;270;1295;33;0.26;0.02
MOESI; 3284;270;1294;33;0.27;0
MOESI; 21768;270;1295;33;0.26;0.01
multipoll; 2691;10626;39934;612;3.11;0.63
multipoll; 3284;10626;39934;612;3.04;0.62
multipoll; 21768;10626;39934;612;2.86;0.6
peterson; 2691;588;2329;39;1.18;0
peterson; 3284;588;2330;39;1.16;0.01
peterson; 21768;588;2329;39;1.18;0
PRODUCER-CONSUMMER; 2691;77;389;35;0.23;0
PRODUCER-CONSUMMER; 3284;77;389;35;0.23;0
PRODUCER-CONSUMMER; 21768;77;389;35;0.25;0
readwrit; 2691;733;2917;93;6.15;0
readwrit; 3284;733;2917;93;6.18;0
readwrit; 21768;733;2917;93;6.11;0
rtp; 2691;225;1027;11;0.44;0
rtp; 3284;225;1027;11;0.44;0
rtp; 21768;225;1028;11;0.44;0.01
swimmingpool.cheated; 2691;ERR
swimmingpool.cheated; 3284;ERR
swimmingpool.cheated; 21768;ERR
swimmingpool; 2691;ERR
swimmingpool; 3284;ERR
swimmingpool; 21768;ERR
swimmingpoolInv; 2691;ERR
swimmingpoolInv; 3284;ERR
swimmingpoolInv; 21768;ERR
SYNAPSE; 2691;162;816;18;0.21;0
SYNAPSE; 3284;162;816;18;0.23;0
SYNAPSE; 21768;162;816;18;0.23;0
ticket2i; 2691;1251;5048;133;0.28;0.01
ticket2i; 3284;1251;5048;133;0.30;0.01
ticket2i; 21768;1251;5048;133;0.32;0.01
ticket3i; 2691;5601;22332;609;0.46;0.04
ticket3i; 3284;5601;22332;609;0.44;0.05
ticket3i; 21768;5601;22332;609;0.42;0.06
train; 2691;37;325;1;0.56;0
train; 3284;37;325;1;0.69;0
train; 21768;37;325;1;0.56;0
ttp2; 2691;126511;502715;17373;72.80;41.97
ttp2; 3284;126511;502712;17373;74.30;44.47
ttp2; 21768;126511;502712;17373;72.81;42.69
ttp; 2691;92890;366993;17971;49.88;26.32
ttp; 3284;92890;366993;17971;48.49;25.57
ttp; 21768;92890;366993;17971;48.28;25.32
