current set encoding is : lira
seed is : 21768
cycles of length 1
(1/3), name = r1, size = 14
(2/3), name = r2, size = 15
(3/3), name = r3, size = 16
**********************
Random choose
Name = r1  OK !
Now we have a representation of size = 6
Minimization in Progress
Name = r3  I.N.C.R.E.A.S.E
Name = r2  I.N.C.R.E.A.S.E
increase = 1
**********************
Random choose
Name = r2  OK !
Now we have a representation of size = 8
Minimization in Progress
Name = r3 No new state computed
Name = r1  OK !
Now we have a representation of size = 8
Name = r3 No new state computed
Name = r2 No new state computed
increase = 0
nb accelerations 3
Fix point FOUND
seed is : 21768
