current set encoding is : lash-lsdf
seed is : 2691
cycles of length 1
(1/12), name = r1, size = 74
(2/12), name = r2, size = 367
(3/12), name = r3, size = 136
(4/12), name = r4, size = 91
(5/12), name = r5, size = 87
(6/12), name = r6, size = 155
(7/12), name = r7, size = 70
(8/12), name = r8, size = 335
(9/12), name = r9, size = 137
(10/12), name = r10, size = 149
(11/12), name = r11, size = 155
(12/12), name = r12, size = 143
**********************
Random choose
Name = r5  No new state computed
Name = r1  OK !
Now we have a representation of size = 23
Minimization in Progress
Name = r5 No new state computed
Name = r9 No new state computed
Name = r11 No new state computed
Name = r6 No new state computed
Name = r7  OK !
Now we have a representation of size = 23
Name = r10 No new state computed
Name = r1 No new state computed
Name = r3 No new state computed
Name = r4 No new state computed
Name = r2  I.N.C.R.E.A.S.E
Name = r6 No new state computed
Name = r12 No new state computed
Name = r5 No new state computed
Name = r8  I.N.C.R.E.A.S.E
Name = r9 No new state computed
Name = r11 No new state computed
increase = 1
**********************
Random choose
Name = r8  OK !
Now we have a representation of size = 46
Minimization in Progress
Name = r1 No new state computed
Name = r6 No new state computed
Name = r7 No new state computed
Name = r4 No new state computed
Name = r9 No new state computed
Name = r5 No new state computed
Name = r12 No new state computed
Name = r10  OK !
Now we have a representation of size = 46
Name = r6 No new state computed
Name = r11  OK !
Now we have a representation of size = 46
Name = r8 No new state computed
Name = r6 No new state computed
Name = r2  OK !
Now we have a representation of size = 40
Name = r12 No new state computed
Name = r7 No new state computed
Name = r6 No new state computed
Name = r8 No new state computed
Name = r1 No new state computed
Name = r11 No new state computed
Name = r5 No new state computed
Name = r4 No new state computed
Name = r9 No new state computed
Name = r10 No new state computed
Name = r3 No new state computed
increase = 0
nb accelerations 6
Fix point FOUND
seed is : 2691
