current set encoding is : omega
seed is : 21768
cycles of length 1
(1/17), name = r2, size = 66
(2/17), name = r3, size = 66
(3/17), name = r4, size = 102
(4/17), name = r5, size = 41
(5/17), name = r6, size = 66
(6/17), name = r7, size = 44
(7/17), name = r8, size = 46
(8/17), name = r9, size = 44
(9/17), name = r10, size = 46
(10/17), name = r11, size = 40
(11/17), name = r12, size = 66
(12/17), name = r13, size = 44
(13/17), name = r14, size = 69
(14/17), name = r15, size = 44
(15/17), name = r16, size = 69
(16/17), name = r17, size = 82
(17/17), name = r18, size = 40
**********************
Random choose
Name = r5  OK !
Now we have a representation of size = 22
Minimization in Progress
Name = r7  I.N.C.R.E.A.S.E
Name = r9  I.N.C.R.E.A.S.E
Name = r10  I.N.C.R.E.A.S.E
Name = r17 No new state computed
Name = r6 No new state computed
Name = r3 No new state computed
Name = r14 No new state computed
Name = r2  I.N.C.R.E.A.S.E
Name = r12 No new state computed
Name = r13 No new state computed
Name = r11  I.N.C.R.E.A.S.E
Name = r16 No new state computed
Name = r15 No new state computed
Name = r18 No new state computed
Name = r8 No new state computed
Name = r4 No new state computed
increase = 1
**********************
Random choose
Name = r11  OK !
Now we have a representation of size = 32
Minimization in Progress
Name = r18 No new state computed
Name = r7  I.N.C.R.E.A.S.E
Name = r6 No new state computed
Name = r15 No new state computed
Name = r12 No new state computed
Name = r4 No new state computed
Name = r5 No new state computed
Name = r16 No new state computed
Name = r14 No new state computed
Name = r9  I.N.C.R.E.A.S.E
Name = r8 No new state computed
Name = r2  I.N.C.R.E.A.S.E
Name = r13  I.N.C.R.E.A.S.E
Name = r17 No new state computed
Name = r10  I.N.C.R.E.A.S.E
Name = r3 No new state computed
increase = 1
**********************
Random choose
Name = r10  OK !
Now we have a representation of size = 44
Minimization in Progress
Name = r6 No new state computed
Name = r16 No new state computed
Name = r7  I.N.C.R.E.A.S.E
Name = r18 No new state computed
Name = r3 No new state computed
Name = r12 No new state computed
Name = r9  I.N.C.R.E.A.S.E
Name = r4 No new state computed
Name = r17 No new state computed
Name = r11  I.N.C.R.E.A.S.E
Name = r5 No new state computed
Name = r15 No new state computed
Name = r14 No new state computed
Name = r2  I.N.C.R.E.A.S.E
Name = r13  I.N.C.R.E.A.S.E
Name = r8 No new state computed
increase = 1
**********************
Random choose
Name = r13  OK !
Now we have a representation of size = 52
Minimization in Progress
Name = r11  I.N.C.R.E.A.S.E
Name = r4 No new state computed
Name = r10 No new state computed
Name = r7  I.N.C.R.E.A.S.E
Name = r14 No new state computed
Name = r2  I.N.C.R.E.A.S.E
Name = r12 No new state computed
Name = r15 No new state computed
Name = r18  I.N.C.R.E.A.S.E
Name = r9  I.N.C.R.E.A.S.E
Name = r17 No new state computed
Name = r3 No new state computed
Name = r16 No new state computed
Name = r6 No new state computed
Name = r8 No new state computed
Name = r5 No new state computed
increase = 1
**********************
Random choose
Name = r9  OK !
Now we have a representation of size = 64
Minimization in Progress
Name = r8  I.N.C.R.E.A.S.E
Name = r13 No new state computed
Name = r10 No new state computed
Name = r17 No new state computed
Name = r15 No new state computed
Name = r5 No new state computed
Name = r16 No new state computed
Name = r4 No new state computed
Name = r14 No new state computed
Name = r12 No new state computed
Name = r2  I.N.C.R.E.A.S.E
Name = r11  I.N.C.R.E.A.S.E
Name = r6 No new state computed
Name = r18  I.N.C.R.E.A.S.E
Name = r3 No new state computed
Name = r7  I.N.C.R.E.A.S.E
increase = 1
**********************
Random choose
Name = r7  OK !
Now we have a representation of size = 91
Minimization in Progress
Name = r2  I.N.C.R.E.A.S.E
Name = r9  I.N.C.R.E.A.S.E
Name = r12 No new state computed
Name = r8  I.N.C.R.E.A.S.E
Name = r14 No new state computed
Name = r10  I.N.C.R.E.A.S.E
Name = r5 No new state computed
Name = r3 No new state computed
Name = r6 No new state computed
Name = r11  I.N.C.R.E.A.S.E
Name = r4 No new state computed
Name = r17 No new state computed
Name = r13 No new state computed
Name = r18  I.N.C.R.E.A.S.E
Name = r16 No new state computed
Name = r15 No new state computed
increase = 1
**********************
Random choose
Name = r18  OK !
Now we have a representation of size = 101
Minimization in Progress
Name = r11  I.N.C.R.E.A.S.E
Name = r17 No new state computed
Name = r14 No new state computed
Name = r5 No new state computed
Name = r12 No new state computed
Name = r9  I.N.C.R.E.A.S.E
Name = r8  I.N.C.R.E.A.S.E
Name = r16 No new state computed
Name = r2  I.N.C.R.E.A.S.E
Name = r6 No new state computed
Name = r4 No new state computed
Name = r15 No new state computed
Name = r7 No new state computed
Name = r13 No new state computed
Name = r10  I.N.C.R.E.A.S.E
Name = r3 No new state computed
increase = 1
**********************
Random choose
Name = r10  OK !
Now we have a representation of size = 147
Minimization in Progress
Name = r13 No new state computed
Name = r14 No new state computed
Name = r2  I.N.C.R.E.A.S.E
Name = r4 No new state computed
Name = r9  I.N.C.R.E.A.S.E
Name = r6 No new state computed
Name = r5 No new state computed
Name = r3 No new state computed
Name = r17 No new state computed
Name = r8  I.N.C.R.E.A.S.E
Name = r16 No new state computed
Name = r12 No new state computed
Name = r7 No new state computed
Name = r18 No new state computed
Name = r15 No new state computed
Name = r11  I.N.C.R.E.A.S.E
increase = 1
**********************
Random choose
Name = r11  OK !
Now we have a representation of size = 234
Minimization in Progress
Name = r3 No new state computed
Name = r17 No new state computed
Name = r10 No new state computed
Name = r14  I.N.C.R.E.A.S.E
Name = r18 No new state computed
Name = r4 No new state computed
Name = r9  I.N.C.R.E.A.S.E
Name = r15  I.N.C.R.E.A.S.E
Name = r8  I.N.C.R.E.A.S.E
Name = r2  I.N.C.R.E.A.S.E
Name = r6 No new state computed
Name = r16  I.N.C.R.E.A.S.E
Name = r7 No new state computed
Name = r12  I.N.C.R.E.A.S.E
Name = r5 No new state computed
Name = r13  I.N.C.R.E.A.S.E
increase = 1
**********************
Random choose
Name = r13  OK !
Now we have a representation of size = 328
Minimization in Progress
Name = r11 No new state computed
Name = r2  I.N.C.R.E.A.S.E
Name = r5 No new state computed
Name = r4 No new state computed
Name = r7 No new state computed
Name = r9  I.N.C.R.E.A.S.E
Name = r15  I.N.C.R.E.A.S.E
Name = r17 No new state computed
Name = r6 No new state computed
Name = r18  I.N.C.R.E.A.S.E
Name = r3 No new state computed
Name = r8  I.N.C.R.E.A.S.E
Name = r16  I.N.C.R.E.A.S.E
Name = r12  I.N.C.R.E.A.S.E
Name = r14  I.N.C.R.E.A.S.E
Name = r10 No new state computed
increase = 1
**********************
Random choose
Name = r14  OK !
Now we have a representation of size = 412
Minimization in Progress
Name = r12  I.N.C.R.E.A.S.E
Name = r3 No new state computed
Name = r5 No new state computed
Name = r7 No new state computed
Name = r15  I.N.C.R.E.A.S.E
Name = r2  I.N.C.R.E.A.S.E
Name = r13 No new state computed
Name = r16  I.N.C.R.E.A.S.E
Name = r17 No new state computed
Name = r9  I.N.C.R.E.A.S.E
Name = r11 No new state computed
Name = r4 No new state computed
Name = r18  I.N.C.R.E.A.S.E
Name = r10 No new state computed
Name = r8  I.N.C.R.E.A.S.E
Name = r6 No new state computed
increase = 1
**********************
Random choose
Name = r8  OK !
Now we have a representation of size = 428
Minimization in Progress
Name = r10 No new state computed
Name = r13 No new state computed
Name = r9  I.N.C.R.E.A.S.E
Name = r14 No new state computed
Name = r6 No new state computed
Name = r12  I.N.C.R.E.A.S.E
Name = r5 No new state computed
Name = r17 No new state computed
Name = r7 No new state computed
Name = r16  I.N.C.R.E.A.S.E
Name = r2  I.N.C.R.E.A.S.E
Name = r18  I.N.C.R.E.A.S.E
Name = r15  I.N.C.R.E.A.S.E
Name = r3 No new state computed
Name = r11  I.N.C.R.E.A.S.E
Name = r4 No new state computed
increase = 1
**********************
Random choose
Name = r11  OK !
Now we have a representation of size = 530
Minimization in Progress
Name = r14  I.N.C.R.E.A.S.E
Name = r7 No new state computed
Name = r4 No new state computed
Name = r2  I.N.C.R.E.A.S.E
Name = r6 No new state computed
Name = r16  I.N.C.R.E.A.S.E
Name = r3 No new state computed
Name = r13 No new state computed
Name = r10 No new state computed
Name = r9  I.N.C.R.E.A.S.E
Name = r12  I.N.C.R.E.A.S.E
Name = r18  I.N.C.R.E.A.S.E
Name = r17 No new state computed
Name = r8 No new state computed
Name = r15  I.N.C.R.E.A.S.E
Name = r5 No new state computed
increase = 1
**********************
Random choose
Name = r15  OK !
Now we have a representation of size = 576
Minimization in Progress
Name = r3 No new state computed
Name = r5 No new state computed
Name = r10 No new state computed
Name = r8 No new state computed
Name = r17 No new state computed
Name = r12  I.N.C.R.E.A.S.E
Name = r6 No new state computed
Name = r9  I.N.C.R.E.A.S.E
Name = r7 No new state computed
Name = r11 No new state computed
Name = r14  I.N.C.R.E.A.S.E
Name = r18  I.N.C.R.E.A.S.E
Name = r2  I.N.C.R.E.A.S.E
Name = r4 No new state computed
Name = r13 No new state computed
Name = r16  I.N.C.R.E.A.S.E
increase = 1
**********************
Random choose
Name = r16  OK !
Now we have a representation of size = 729
Minimization in Progress
Name = r5 No new state computed
Name = r14  I.N.C.R.E.A.S.E
Name = r2  I.N.C.R.E.A.S.E
Name = r9  I.N.C.R.E.A.S.E
Name = r17 No new state computed
Name = r4 No new state computed
Name = r15 No new state computed
Name = r18  I.N.C.R.E.A.S.E
Name = r10 No new state computed
Name = r8 No new state computed
Name = r3 No new state computed
Name = r11 No new state computed
Name = r7 No new state computed
Name = r12  I.N.C.R.E.A.S.E
Name = r13 No new state computed
Name = r6 No new state computed
increase = 1
**********************
Random choose
Name = r12  OK !
Now we have a representation of size = 973
Minimization in Progress
Name = r3 No new state computed
Name = r7 No new state computed
Name = r15 No new state computed
Name = r5 No new state computed
Name = r6 No new state computed
Name = r13 No new state computed
Name = r17 No new state computed
Name = r2  I.N.C.R.E.A.S.E
Name = r9  I.N.C.R.E.A.S.E
Name = r16 No new state computed
Name = r18  I.N.C.R.E.A.S.E
Name = r11 No new state computed
Name = r4 No new state computed
Name = r8 No new state computed
Name = r10 No new state computed
Name = r14  I.N.C.R.E.A.S.E
increase = 1
**********************
Random choose
Name = r14  OK !
Now we have a representation of size = 1074
Minimization in Progress
Name = r5 No new state computed
Name = r17 No new state computed
Name = r7 No new state computed
Name = r9  I.N.C.R.E.A.S.E
Name = r15 No new state computed
Name = r6 No new state computed
Name = r12 No new state computed
Name = r16 No new state computed
Name = r10 No new state computed
Name = r11 No new state computed
Name = r4 No new state computed
Name = r18  I.N.C.R.E.A.S.E
Name = r3 No new state computed
Name = r2  I.N.C.R.E.A.S.E
Name = r13 No new state computed
Name = r8 No new state computed
increase = 1
**********************
Random choose
Name = r2  OK !
Now we have a representation of size = 1111
Minimization in Progress
Name = r9  I.N.C.R.E.A.S.E
Name = r4 No new state computed
Name = r14 No new state computed
Name = r12 No new state computed
Name = r17 No new state computed
Name = r15 No new state computed
Name = r10 No new state computed
Name = r7 No new state computed
Name = r8 No new state computed
Name = r6 No new state computed
Name = r11 No new state computed
Name = r16 No new state computed
Name = r18  I.N.C.R.E.A.S.E
Name = r5  I.N.C.R.E.A.S.E
Name = r13 No new state computed
Name = r3 No new state computed
increase = 1
**********************
Random choose
Name = r5  OK !
Now we have a representation of size = 1182
Minimization in Progress
Name = r7  I.N.C.R.E.A.S.E
Name = r12 No new state computed
Name = r13 No new state computed
Name = r16 No new state computed
Name = r3 No new state computed
Name = r4 No new state computed
Name = r15 No new state computed
Name = r6 No new state computed
Name = r8 No new state computed
Name = r18  I.N.C.R.E.A.S.E
Name = r11  I.N.C.R.E.A.S.E
Name = r17 No new state computed
Name = r14 No new state computed
Name = r10  I.N.C.R.E.A.S.E
Name = r9  I.N.C.R.E.A.S.E
Name = r2 No new state computed
increase = 1
**********************
Random choose
Name = r9  OK !
Now we have a representation of size = 1447
Minimization in Progress
Name = r12 No new state computed
Name = r17 No new state computed
Name = r15 No new state computed
Name = r5 No new state computed
Name = r10  I.N.C.R.E.A.S.E
Name = r11  I.N.C.R.E.A.S.E
Name = r13 No new state computed
Name = r6 No new state computed
Name = r14 No new state computed
Name = r16 No new state computed
Name = r7  I.N.C.R.E.A.S.E
Name = r4 No new state computed
Name = r18  I.N.C.R.E.A.S.E
Name = r2 No new state computed
Name = r3 No new state computed
Name = r8  I.N.C.R.E.A.S.E
increase = 1
**********************
Random choose
Name = r8  OK !
Now we have a representation of size = 1704
Minimization in Progress
Name = r16 No new state computed
Name = r11  I.N.C.R.E.A.S.E
Name = r14 No new state computed
Name = r2 No new state computed
Name = r12 No new state computed
Name = r15 No new state computed
Name = r7  I.N.C.R.E.A.S.E
Name = r17 No new state computed
Name = r6 No new state computed
Name = r10  I.N.C.R.E.A.S.E
Name = r18  I.N.C.R.E.A.S.E
Name = r3 No new state computed
Name = r9 No new state computed
Name = r4 No new state computed
Name = r13 No new state computed
Name = r5 No new state computed
increase = 1
**********************
Random choose
Name = r18  OK !
Now we have a representation of size = 1843
Minimization in Progress
Name = r9 No new state computed
Name = r7  I.N.C.R.E.A.S.E
Name = r5 No new state computed
Name = r3 No new state computed
Name = r4 No new state computed
Name = r14 No new state computed
Name = r8 No new state computed
Name = r11  I.N.C.R.E.A.S.E
Name = r10  I.N.C.R.E.A.S.E
Name = r15 No new state computed
Name = r12 No new state computed
Name = r17 No new state computed
Name = r13 No new state computed
Name = r2 No new state computed
Name = r16 No new state computed
Name = r6 No new state computed
increase = 1
**********************
Random choose
Name = r10  OK !
Now we have a representation of size = 1982
Minimization in Progress
Name = r12 No new state computed
Name = r11  I.N.C.R.E.A.S.E
Name = r16 No new state computed
Name = r8 No new state computed
Name = r18 No new state computed
Name = r4 No new state computed
Name = r3 No new state computed
Name = r17 No new state computed
Name = r2 No new state computed
Name = r9 No new state computed
Name = r5 No new state computed
Name = r15 No new state computed
Name = r7  I.N.C.R.E.A.S.E
Name = r13 No new state computed
Name = r14 No new state computed
Name = r6 No new state computed
increase = 1
**********************
Random choose
Name = r7  OK !
Now we have a representation of size = 2643
Minimization in Progress
Name = r18 No new state computed
Name = r10  I.N.C.R.E.A.S.E
Name = r6 No new state computed
Name = r9  I.N.C.R.E.A.S.E
Name = r16 No new state computed
Name = r12 No new state computed
Name = r4 No new state computed
Name = r17 No new state computed
Name = r5 No new state computed
Name = r14 No new state computed
Name = r3 No new state computed
Name = r13 No new state computed
Name = r11  I.N.C.R.E.A.S.E
Name = r8 No new state computed
Name = r15 No new state computed
Name = r2 No new state computed
increase = 1
**********************
Random choose
Name = r11  OK !
Now we have a representation of size = 3368
Minimization in Progress
Name = r10  I.N.C.R.E.A.S.E
Name = r9  I.N.C.R.E.A.S.E
Name = r12  I.N.C.R.E.A.S.E
Name = r4 No new state computed
Name = r17 No new state computed
Name = r18 No new state computed
Name = r6 No new state computed
Name = r16  I.N.C.R.E.A.S.E
Name = r13  I.N.C.R.E.A.S.E
Name = r2 No new state computed
Name = r8 No new state computed
Name = r5 No new state computed
Name = r15  I.N.C.R.E.A.S.E
Name = r3 No new state computed
Name = r14  I.N.C.R.E.A.S.E
Name = r7 No new state computed
increase = 1
**********************
Random choose
Name = r14  OK !
Now we have a representation of size = 3781
Minimization in Progress
Name = r3 No new state computed
Name = r6 No new state computed
Name = r13  I.N.C.R.E.A.S.E
Name = r12  I.N.C.R.E.A.S.E
Name = r5 No new state computed
Name = r17 No new state computed
Name = r15  I.N.C.R.E.A.S.E
Name = r8 No new state computed
Name = r16  I.N.C.R.E.A.S.E
Name = r11 No new state computed
Name = r7 No new state computed
Name = r2 No new state computed
Name = r18 No new state computed
Name = r4 No new state computed
Name = r9  I.N.C.R.E.A.S.E
Name = r10  I.N.C.R.E.A.S.E
increase = 1
**********************
Random choose
Name = r10  OK !
Now we have a representation of size = 4607
Minimization in Progress
Name = r7 No new state computed
Name = r4 No new state computed
Name = r5 No new state computed
Name = r3 No new state computed
Name = r2 No new state computed
Name = r9  I.N.C.R.E.A.S.E
Name = r18 No new state computed
Name = r13  I.N.C.R.E.A.S.E
Name = r17 No new state computed
Name = r11  I.N.C.R.E.A.S.E
Name = r6 No new state computed
Name = r15  I.N.C.R.E.A.S.E
Name = r16  I.N.C.R.E.A.S.E
Name = r12  I.N.C.R.E.A.S.E
Name = r14 No new state computed
Name = r8 No new state computed
increase = 1
**********************
Random choose
Name = r12  OK !
Now we have a representation of size = 6100
Minimization in Progress
Name = r2 No new state computed
Name = r14 No new state computed
Name = r8 No new state computed
Name = r5 No new state computed
Name = r13  I.N.C.R.E.A.S.E
Name = r10 No new state computed
Name = r17 No new state computed
Name = r6 No new state computed
Name = r4 No new state computed
Name = r11  I.N.C.R.E.A.S.E
Name = r18 No new state computed
Name = r7 No new state computed
Name = r16  I.N.C.R.E.A.S.E
Name = r15  I.N.C.R.E.A.S.E
Name = r3 No new state computed
Name = r9  I.N.C.R.E.A.S.E
increase = 1
**********************
Random choose
Name = r9  OK !
Now we have a representation of size = 7413
Minimization in Progress
Name = r7 No new state computed
Name = r3 No new state computed
Name = r5 No new state computed
Name = r17 No new state computed
Name = r11  I.N.C.R.E.A.S.E
Name = r16  I.N.C.R.E.A.S.E
Name = r6 No new state computed
Name = r14 No new state computed
Name = r12 