current set encoding is : prestaf
seed is : 21768
cycles of length 1
(1/14), name = r1, size = 2089
(2/14), name = r2, size = 163
(3/14), name = r3, size = 156
(4/14), name = r4, size = 155
(5/14), name = r5, size = 1637
(6/14), name = r6, size = 6344
(7/14), name = r7, size = 165
(8/14), name = r8, size = 2089
(9/14), name = r9, size = 145
(10/14), name = r10, size = 138
(11/14), name = r11, size = 137
(12/14), name = r12, size = 1614
(13/14), name = r13, size = 6508
(14/14), name = r14, size = 147
**********************
Random choose
Name = r3  OK !
Now we have a representation of size = 93
Minimization in Progress
Name = r5 No new state computed
Name = r7 No new state computed
Name = r12 No new state computed
Name = r13 No new state computed
Name = r4  I.N.C.R.E.A.S.E
Name = r2  I.N.C.R.E.A.S.E
Name = r9 No new state computed
Name = r1 No new state computed
Name = r6 No new state computed
Name = r14 No new state computed
Name = r11 No new state computed
Name = r10  I.N.C.R.E.A.S.E
Name = r8 No new state computed
increase = 1
**********************
Random choose
Name = r10  OK !
Now we have a representation of size = 139
Minimization in Progress
Name = r2  I.N.C.R.E.A.S.E
Name = r8 No new state computed
Name = r13 No new state computed
Name = r6 No new state computed
Name = r4  I.N.C.R.E.A.S.E
Name = r3 No new state computed
Name = r12 No new state computed
Name = r14 No new state computed
Name = r11  I.N.C.R.E.A.S.E
Name = r5 No new state computed
Name = r9  I.N.C.R.E.A.S.E
Name = r7 No new state computed
Name = r1 No new state computed
increase = 1
**********************
Random choose
Name = r9  OK !
Now we have a representation of size = 184
Minimization in Progress
Name = r10  I.N.C.R.E.A.S.E
Name = r2  I.N.C.R.E.A.S.E
Name = r8  I.N.C.R.E.A.S.E
Name = r11  OK !
Now we have a representation of size = 184
Name = r5 No new state computed
Name = r12 No new state computed
Name = r4  I.N.C.R.E.A.S.E
Name = r10  I.N.C.R.E.A.S.E
Name = r14  OK !
Now we have a representation of size = 184
Name = r9 No new state computed
Name = r2  I.N.C.R.E.A.S.E
Name = r11 No new state computed
Name = r8  I.N.C.R.E.A.S.E
Name = r3 No new state computed
Name = r5 No new state computed
Name = r10  I.N.C.R.E.A.S.E
Name = r4  I.N.C.R.E.A.S.E
Name = r6 No new state computed
Name = r13 No new state computed
Name = r1 No new state computed
Name = r12 No new state computed
Name = r7  I.N.C.R.E.A.S.E
increase = 1
**********************
Random choose
Name = r7  OK !
Now we have a representation of size = 194
Minimization in Progress
Name = r8  I.N.C.R.E.A.S.E
Name = r2  I.N.C.R.E.A.S.E
Name = r14 No new state computed
Name = r5 No new state computed
Name = r4  I.N.C.R.E.A.S.E
Name = r1 No new state computed
Name = r13 No new state computed
Name = r6 No new state computed
Name = r9 No new state computed
Name = r10  I.N.C.R.E.A.S.E
Name = r11 No new state computed
Name = r3 No new state computed
Name = r12 No new state computed
increase = 1
**********************
Random choose
Name = r10  OK !
Now we have a representation of size = 196
Minimization in Progress
Name = r6 No new state computed
Name = r4  I.N.C.R.E.A.S.E
Name = r14 No new state computed
Name = r5 No new state computed
Name = r7 No new state computed
Name = r11  I.N.C.R.E.A.S.E
Name = r12 No new state computed
Name = r8  I.N.C.R.E.A.S.E
Name = r2  I.N.C.R.E.A.S.E
Name = r9  I.N.C.R.E.A.S.E
Name = r1 No new state computed
Name = r13 No new state computed
Name = r3 No new state computed
increase = 1
**********************
Random choose
Name = r9  OK !
Now we have a representation of size = 239
Minimization in Progress
Name = r1 No new state computed
Name = r7  I.N.C.R.E.A.S.E
Name = r8  I.N.C.R.E.A.S.E
Name = r14  OK !
Now we have a representation of size = 236
Name = r12 No new state computed
Name = r4  I.N.C.R.E.A.S.E
Name = r1 No new state computed
Name = r6 No new state computed
Name = r7  I.N.C.R.E.A.S.E
Name = r13 No new state computed
Name = r8  I.N.C.R.E.A.S.E
Name = r5 No new state computed
Name = r2  I.N.C.R.E.A.S.E
Name = r11  OK !
Now we have a representation of size = 199
Name = r8  I.N.C.R.E.A.S.E
Name = r6 No new state computed
Name = r12 No new state computed
Name = r2  I.N.C.R.E.A.S.E
Name = r9 No new state computed
Name = r7  OK !
Now we have a representation of size = 199
Name = r1 No new state computed
Name = r5 No new state computed
Name = r14 No new state computed
Name = r11 No new state computed
Name = r8  I.N.C.R.E.A.S.E
Name = r3 No new state computed
Name = r10 No new state computed
Name = r12 No new state computed
Name = r4  I.N.C.R.E.A.S.E
Name = r6 No new state computed
Name = r13 No new state computed
Name = r2  I.N.C.R.E.A.S.E
Name = r9 No new state computed
increase = 1
**********************
Random choose
Name = r2  OK !
Now we have a representation of size = 275
Minimization in Progress
Name = r11 No new state computed
Name = r7  I.N.C.R.E.A.S.E
Name = r3  I.N.C.R.E.A.S.E
Name = r1  I.N.C.R.E.A.S.E
Name = r6 No new state computed
Name = r9 No new state computed
Name = r8  I.N.C.R.E.A.S.E
Name = r10 No new state computed
Name = r14  I.N.C.R.E.A.S.E
Name = r13 No new state computed
Name = r5 No new state computed
Name = r12 No new state computed
Name = r4  OK !
Now we have a representation of size = 275
Name = r13 No new state computed
Name = r11 No new state computed
Name = r5 No new state computed
Name = r9 No new state computed
Name = r7  I.N.C.R.E.A.S.E
Name = r14  I.N.C.R.E.A.S.E
Name = r2 No new state computed
Name = r10 No new state computed
Name = r1  I.N.C.R.E.A.S.E
Name = r12 No new state computed
Name = r6 No new state computed
Name = r3  I.N.C.R.E.A.S.E
Name = r8  I.N.C.R.E.A.S.E
increase = 1
**********************
Random choose
Name = r8  OK !
Now we have a representation of size = 286
Minimization in Progress
Name = r3  I.N.C.R.E.A.S.E
Name = r10 No new state computed
Name = r12 No new state computed
Name = r9 No new state computed
Name = r1  I.N.C.R.E.A.S.E
Name = r6 No new state computed
Name = r13 No new state computed
Name = r2 No new state computed
Name = r4 No new state computed
Name = r5 No new state computed
Name = r11 No new state computed
Name = r14  I.N.C.R.E.A.S.E
Name = r7  I.N.C.R.E.A.S.E
increase = 1
**********************
Random choose
Name = r7  OK !
Now we have a representation of size = 304
Minimization in Progress
Name = r4 No new state computed
Name = r3  I.N.C.R.E.A.S.E
Name = r6 No new state computed
Name = r14  I.N.C.R.E.A.S.E
Name = r13 No new state computed
Name = r9 No new state computed
Name = r8 No new state computed
Name = r5 No new state computed
Name = r2 No new state computed
Name = r1  I.N.C.R.E.A.S.E
Name = r10 No new state computed
Name = r11 No new state computed
Name = r12 No new state computed
increase = 1
**********************
Random choose
Name = r1  OK !
Now we have a representation of size = 305
Minimization in Progress
Name = r4 No new state computed
Name = r8 No new state computed
Name = r14  I.N.C.R.E.A.S.E
Name = r3  I.N.C.R.E.A.S.E
Name = r13 No new state computed
Name = r10 No new state computed
Name = r11 No new state computed
Name = r2 No new state computed
Name = r7 No new state computed
Name = r5 No new state computed
Name = r9 No new state computed
Name = r6 No new state computed
Name = r12 No new state computed
increase = 1
**********************
Random choose
Name = r3  OK !
Now we have a representation of size = 316
Minimization in Progress
Name = r11 No new state computed
Name = r6 No new state computed
Name = r12 No new state computed
Name = r4  I.N.C.R.E.A.S.E
Name = r5 No new state computed
Name = r13 No new state computed
Name = r10 No new state computed
Name = r8 No new state computed
Name = r2  I.N.C.R.E.A.S.E
Name = r7 No new state computed
Name = r9 No new state computed
Name = r14  I.N.C.R.E.A.S.E
Name = r1 No new state computed
increase = 1
**********************
Random choose
Name = r14  OK !
Now we have a representation of size = 318
Minimization in Progress
Name = r9 No new state computed
Name = r2  I.N.C.R.E.A.S.E
Name = r10 No new state computed
Name = r12 No new state computed
Name = r6 No new state computed
Name = r1 No new state computed
Name = r13 No new state computed
Name = r5 No new state computed
Name = r11 No new state computed
Name = r8 No new state computed
Name = r4  I.N.C.R.E.A.S.E
Name = r3 No new state computed
Name = r7 No new state computed
increase = 1
**********************
Random choose
Name = r4  OK !
Now we have a representation of size = 393
Minimization in Progress
Name = r3 No new state computed
Name = r6 No new state computed
Name = r12 No new state computed
Name = r7  I.N.C.R.E.A.S.E
Name = r9 No new state computed
Name = r13 No new state computed
Name = r2  I.N.C.R.E.A.S.E
Name = r8 No new state computed
Name = r14  OK !
Now we have a representation of size = 360
Name = r9 No new state computed
Name = r2  I.N.C.R.E.A.S.E
Name = r3 No new state computed
Name = r7  I.N.C.R.E.A.S.E
Name = r5 No new state computed
Name = r12 No new state computed
Name = r10 No new state computed
Name = r11 No new state computed
Name = r13 No new state computed
Name = r6 No new state computed
Name = r8 No new state computed
Name = r4 No new state computed
Name = r1 No new state computed
increase = 1
**********************
Random choose
Name = r7  OK !
Now we have a representation of size = 364
Minimization in Progress
Name = r4 No new state computed
Name = r10 No new state computed
Name = r14 No new state computed
Name = r12 No new state computed
Name = r2  I.N.C.R.E.A.S.E
Name = r11 No new state computed
Name = r1 No new state computed
Name = r13 No new state computed
Name = r9 No new state computed
Name = r8 No new state computed
Name = r6 No new state computed
Name = r5 No new state computed
Name = r3 No new state computed
increase = 1
**********************
Random choose
Name = r2  OK !
Now we have a representation of size = 444
Minimization in Progress
Name = r13 No new state computed
Name = r3 No new state computed
Name = r1  OK !
Now we have a representation of size = 385
Name = r5 No new state computed
Name = r11 No new state computed
Name = r8 No new state computed
Name = r13 No new state computed
Name = r2 No new state computed
Name = r3 No new state computed
Name = r7  I.N.C.R.E.A.S.E
Name = r9 No new state computed
Name = r6 No new state computed
Name = r10 No new state computed
Name = r14  OK !
Now we have a representation of size = 349
Name = r1 No new state computed
Name = r12 No new state computed
Name = r10 No new state computed
Name = r9 No new state computed
Name = r3 No new state computed
Name = r6 No new state computed
Name = r11 No new state computed
Name = r2 No new state computed
Name = r5 No new state computed
Name = r13 No new state computed
Name = r4 No new state computed
Name = r7  OK !
Now we have a representation of size = 308
Name = r8 No new state computed
Name = r6 No new state computed
Name = r5 No new state computed
Name = r11 No new state computed
Name = r4 No new state computed
Name = r9 No new state computed
Name = r10 No new state computed
Name = r3 No new state computed
Name = r13 No new state computed
Name = r2 No new state computed
Name = r1 No new state computed
Name = r12 No new state computed
Name = r14 No new state computed
increase = 0
nb accelerations 25
Fix point FOUND
seed is : 21768
