current set encoding is : lira
seed is : 3284
cycles of length 1
(1/17), name = r2, size = 13
(2/17), name = r3, size = 13
(3/17), name = r4, size = 7
(4/17), name = r5, size = 12
(5/17), name = r6, size = 14
(6/17), name = r7, size = 38
(7/17), name = r8, size = 134
(8/17), name = r9, size = 38
(9/17), name = r10, size = 134
(10/17), name = r11, size = 9
(11/17), name = r12, size = 21
(12/17), name = r13, size = 33
(13/17), name = r14, size = 113
(14/17), name = r15, size = 33
(15/17), name = r16, size = 113
(16/17), name = r17, size = 22
(17/17), name = r18, size = 8
**********************
Random choose
Name = r8  No new state computed
Name = r10  No new state computed
Name = r15  No new state computed
Name = r4  No new state computed
Name = r12  No new state computed
Name = r3  No new state computed
Name = r2  OK !
Now we have a representation of size = 11
Minimization in Progress
Name = r7 No new state computed
Name = r12 No new state computed
Name = r18 No new state computed
Name = r15 No new state computed
Name = r4 No new state computed
Name = r11 No new state computed
Name = r14 No new state computed
Name = r6 No new state computed
Name = r5  I.N.C.R.E.A.S.E
Name = r13 No new state computed
Name = r17 No new state computed
Name = r9 No new state computed
Name = r16 No new state computed
Name = r8 No new state computed
Name = r10 No new state computed
Name = r3 No new state computed
increase = 1
**********************
Random choose
Name = r5  OK !
Now we have a representation of size = 21
Minimization in Progress
Name = r7  I.N.C.R.E.A.S.E
Name = r15 No new state computed
Name = r12 No new state computed
Name = r14 No new state computed
Name = r2 No new state computed
Name = r9  I.N.C.R.E.A.S.E
Name = r4 No new state computed
Name = r3 No new state computed
Name = r13 No new state computed
Name = r17 No new state computed
Name = r16 No new state computed
Name = r10  I.N.C.R.E.A.S.E
Name = r11  I.N.C.R.E.A.S.E
Name = r8 No new state computed
Name = r18 No new state computed
Name = r6 No new state computed
increase = 1
**********************
Random choose
Name = r11  OK !
Now we have a representation of size = 22
Minimization in Progress
Name = r16 No new state computed
Name = r7  I.N.C.R.E.A.S.E
Name = r15 No new state computed
Name = r2 No new state computed
Name = r5 No new state computed
Name = r12 No new state computed
Name = r17 No new state computed
Name = r8 No new state computed
Name = r13  OK !
Now we have a representation of size = 22
Name = r8 No new state computed
Name = r17 No new state computed
Name = r16 No new state computed
Name = r3 No new state computed
Name = r11 No new state computed
Name = r9  I.N.C.R.E.A.S.E
Name = r6 No new state computed
Name = r15 No new state computed
Name = r5 No new state computed
Name = r4 No new state computed
Name = r18  OK !
Now we have a representation of size = 22
Name = r3 No new state computed
Name = r10  I.N.C.R.E.A.S.E
Name = r14 No new state computed
Name = r4 No new state computed
Name = r5 No new state computed
Name = r12 No new state computed
Name = r6 No new state computed
Name = r9  I.N.C.R.E.A.S.E
Name = r2 No new state computed
Name = r7  I.N.C.R.E.A.S.E
Name = r11 No new state computed
Name = r16 No new state computed
Name = r8 No new state computed
Name = r15 No new state computed
Name = r13 No new state computed
Name = r17 No new state computed
increase = 1
**********************
Random choose
Name = r7  OK !
Now we have a representation of size = 36
Minimization in Progress
Name = r13 No new state computed
Name = r10  I.N.C.R.E.A.S.E
Name = r4 No new state computed
Name = r3 No new state computed
Name = r17 No new state computed
Name = r8 No new state computed
Name = r18 No new state computed
Name = r2 No new state computed
Name = r15 No new state computed
Name = r14 No new state computed
Name = r9  I.N.C.R.E.A.S.E
Name = r16 No new state computed
Name = r11  I.N.C.R.E.A.S.E
Name = r5 No new state computed
Name = r12 No new state computed
Name = r6 No new state computed
increase = 1
**********************
Random choose
Name = r11  OK !
Now we have a representation of size = 41
Minimization in Progress
Name = r8 No new state computed
Name = r14 No new state computed
Name = r16 No new state computed
Name = r18 No new state computed
Name = r15 No new state computed
Name = r6 No new state computed
Name = r7 No new state computed
Name = r9  I.N.C.R.E.A.S.E
Name = r3 No new state computed
Name = r4 No new state computed
Name = r13  I.N.C.R.E.A.S.E
Name = r10  I.N.C.R.E.A.S.E
Name = r2 No new state computed
Name = r17 No new state computed
Name = r12 No new state computed
Name = r5 No new state computed
increase = 1
**********************
Random choose
Name = r10  OK !
Now we have a representation of size = 124
Minimization in Progress
Name = r18 No new state computed
Name = r15 No new state computed
Name = r14 No new state computed
Name = r8 No new state computed
Name = r7 No new state computed
Name = r13  I.N.C.R.E.A.S.E
Name = r12 No new state computed
Name = r9  I.N.C.R.E.A.S.E
Name = r11  I.N.C.R.E.A.S.E
Name = r2 No new state computed
Name = r17 No new state computed
Name = r3 No new state computed
Name = r5 No new state computed
Name = r4 No new state computed
Name = r16 No new state computed
Name = r6 No new state computed
increase = 1
**********************
Random choose
Name = r11  OK !
Now we have a representation of size = 139
Minimization in Progress
Name = r12  I.N.C.R.E.A.S.E
Name = r3 No new state computed
Name = r15 No new state computed
Name = r7 No new state computed
Name = r14 No new state computed
Name = r13  I.N.C.R.E.A.S.E
Name = r4 No new state computed
Name = r17 No new state computed
Name = r8 No new state computed
Name = r2 No new state computed
Name = r10 No new state computed
Name = r6 No new state computed
Name = r9  I.N.C.R.E.A.S.E
Name = r16 No new state computed
Name = r18 No new state computed
Name = r5 No new state computed
increase = 1
**********************
Random choose
Name = r9  OK !
Now we have a representation of size = 262
Minimization in Progress
Name = r10 No new state computed
Name = r11  I.N.C.R.E.A.S.E
Name = r2 No new state computed
Name = r15 No new state computed
Name = r3 No new state computed
Name = r8  I.N.C.R.E.A.S.E
Name = r17 No new state computed
Name = r18 No new state computed
Name = r7  OK !
Now we have a representation of size = 248
Name = r14 No new state computed
Name = r5 No new state computed
Name = r8  I.N.C.R.E.A.S.E
Name = r10  I.N.C.R.E.A.S.E
Name = r6 No new state computed
Name = r17 No new state computed
Name = r4 No new state computed
Name = r13  I.N.C.R.E.A.S.E
Name = r18 No new state computed
Name = r12  I.N.C.R.E.A.S.E
Name = r9 No new state computed
Name = r3 No new state computed
Name = r16 No new state computed
Name = r15 No new state computed
Name = r2 No new state computed
Name = r11  I.N.C.R.E.A.S.E
increase = 1
**********************
Random choose
Name = r11  OK !
Now we have a representation of size = 272
Minimization in Progress
Name = r8  I.N.C.R.E.A.S.E
Name = r2 No new state computed
Name = r3 No new state computed
Name = r16  I.N.C.R.E.A.S.E
Name = r18 No new state computed
Name = r9 No new state computed
Name = r7 No new state computed
Name = r5 No new state computed
Name = r13  I.N.C.R.E.A.S.E
Name = r10  I.N.C.R.E.A.S.E
Name = r17 No new state computed
Name = r15  I.N.C.R.E.A.S.E
Name = r6 No new state computed
Name = r12  I.N.C.R.E.A.S.E
Name = r4 No new state computed
Name = r14  I.N.C.R.E.A.S.E
increase = 1
**********************
Random choose
Name = r14  OK !
Now we have a representation of size = 305
Minimization in Progress
Name = r12  I.N.C.R.E.A.S.E
Name = r8  I.N.C.R.E.A.S.E
Name = r13  I.N.C.R.E.A.S.E
Name = r2 No new state computed
Name = r4 No new state computed
Name = r3 No new state computed
Name = r7 No new state computed
Name = r9 No new state computed
Name = r16  I.N.C.R.E.A.S.E
Name = r15  I.N.C.R.E.A.S.E
Name = r18 No new state computed
Name = r5 No new state computed
Name = r6 No new state computed
Name = r11 No new state computed
Name = r17 No new state computed
Name = r10  I.N.C.R.E.A.S.E
increase = 1
**********************
Random choose
Name = r10  OK !
Now we have a representation of size = 385
Minimization in Progress
Name = r4 No new state computed
Name = r15  I.N.C.R.E.A.S.E
Name = r6 No new state computed
Name = r14 No new state computed
Name = r9 No new state computed
Name = r11  I.N.C.R.E.A.S.E
Name = r5 No new state computed
Name = r12  I.N.C.R.E.A.S.E
Name = r18 No new state computed
Name = r8  I.N.C.R.E.A.S.E
Name = r16  I.N.C.R.E.A.S.E
Name = r7 No new state computed
Name = r3 No new state computed
Name = r17 No new state computed
Name = r2 No new state computed
Name = r13  I.N.C.R.E.A.S.E
increase = 1
**********************
Random choose
Name = r13  OK !
Now we have a representation of size = 460
Minimization in Progress
Name = r4 No new state computed
Name = r15  I.N.C.R.E.A.S.E
Name = r3 No new state computed
Name = r6 No new state computed
Name = r18  OK !
Now we have a representation of size = 460
Name = r11  I.N.C.R.E.A.S.E
Name = r4 No new state computed
Name = r12  I.N.C.R.E.A.S.E
Name = r14 No new state computed
Name = r5 No new state computed
Name = r7 No new state computed
Name = r17 