let
  G0 := int * (1, 0, 0, 0, 0) + int * (0, 0, 0, 1, 0);
  G1 := int * (1, 0, 0, 0, 0);
  nat5 := (nat, nat, nat, nat, nat);
  R := 
    let
      PCF6_0 := 
        let
          CF0 := (0, 0, 0, 1, 0) + G0;
          CF1 := (0, 0, 0, 0, 0);
        in
          CF0 ^ CF1;
      I_F5_4 := 2 * PCF6_0;
      PCF8_0 := 
        let
          CF0 := (0, 0, 0, 1, 0) + G0;
        in
          CF0 ^ G1;
      I_F7_4 := 2 * PCF8_0;
      I_F4_3 := I_F5_4 || I_F7_4 + (0, 0, 0, 1, 0);
      I_F10_4 := 2 * G1;
      I_F3_2 := I_F4_3 || I_F10_4 + (0, 0, 1, 0, 0);
      I_F2_1 := I_F3_2 || I_F10_4 + (0, 1, 0, 0, 0);
      I_F16_4 := 2 * G0;
      I_F15_3 := I_F16_4 || I_F7_4 + (0, 0, 0, 1, 0);
      I_F14_2 := I_F15_3 || I_F10_4 + (0, 0, 1, 0, 0);
      I_F13_1 := I_F14_2 || I_F10_4 + (0, 1, 0, 0, 0);
    in
      I_F2_1 || I_F13_1 + (1, 0, 0, 0, 0);
in
  { (invalid, dirty, exclusive, shared, state) | (invalid, dirty, exclusive, shared, state) in nat5 && R };
// Automata size             : #SA=12 #EA=9 #S=28 #D=6 #Refs=25 #to0=4/56
// Formula size              : 226 nodes
// Time to synthesis formula : 20 ms
