let
  G0 := int * (1, 0, 0, 0, 0) + int * (0, 1, 0, 0, 0);
  G1 := int * (1, 0, 0, 0, 0);
  nat5 := (nat, nat, nat, nat, nat);
  R := 
    let
      PCF6_0 := 
        let
          CF0 := (0, 1, 0, 0, 0) + G0;
          CF1 := (0, 0, 0, 0, 0);
        in
          CF0 ^ CF1;
      I_F5_4 := 2 * PCF6_0;
      I_F7_4 := 2 * G1;
      I_F4_3 := I_F5_4 || I_F7_4 + (0, 0, 0, 1, 0);
      PCF11_0 := 
        let
          CF0 := (0, 1, 0, 0, 0) + G0;
        in
          CF0 ^ G1;
      I_F10_4 := 2 * PCF11_0;
      I_F3_2 := I_F4_3 || I_F10_4 + (0, 0, 1, 0, 0);
      I_F14_4 := 2 * G0;
      I_F12_2 := I_F14_4 || I_F14_4 + (0, 0, 1, 0, 0);
      I_F2_1 := I_F3_2 || I_F12_2 + (0, 1, 0, 0, 0);
      I_F18_3 := I_F14_4 || I_F7_4 + (0, 0, 0, 1, 0);
      I_F17_2 := I_F18_3 || I_F10_4 + (0, 0, 1, 0, 0);
      I_F16_1 := I_F17_2 || I_F12_2 + (0, 1, 0, 0, 0);
    in
      I_F2_1 || I_F16_1 + (1, 0, 0, 0, 0);
in
  { (invalid, unowned, nonexclusive, exclusive, state) | (invalid, unowned, nonexclusive, exclusive, state) in nat5 && R };
// Automata size             : #SA=13 #EA=8 #S=29 #D=6 #Refs=13 #to0=4/58
// Formula size              : 239 nodes
// Time to synthesis formula : 0 ms
