current set encoding is : lash-msdf
seed is : 3284
cycles of length 1
(1/3), name = r2, size = 338
(2/3), name = r3, size = 326
(3/3), name = r4, size = 130
**********************
Random choose
Name = r3  No new state computed
Name = r4  No new state computed
Name = r2  OK !
Now we have a representation of size = 134
Minimization in Progress
Name = r4 No new state computed
Name = r3 No new state computed
increase = 0
nb accelerations 1
Fix point FOUND
cycles of length 1
(1/1), name = r5, size = 383
**********************
Random choose
Name = r5  OK !
Now we have a representation of size = 355
Minimization in Progress
increase = 0
nb accelerations 1
Fix point FOUND
cycles of length 1
(1/5), name = r6, size = 328
(2/5), name = r7, size = 1160
(3/5), name = r8, size = 5248
(4/5), name = r9, size = 1166
(5/5), name = r10, size = 5546
**********************
Random choose
Name = r6  No new state computed
Name = r7  OK !
Now we have a representation of size = 568
Minimization in Progress
Name = r8 No new state computed
Name = r6 No new state computed
Name = r9  I.N.C.R.E.A.S.E
Name = r10  I.N.C.R.E.A.S.E
increase = 1
**********************
Random choose
Name = r10  OK !
Now we have a representation of size = 2204
Minimization in Progress
Name = r9  I.N.C.R.E.A.S.E
Name = r6 No new state computed
Name = r8 No new state computed
Name = r7 No new state computed
increase = 1
**********************
Random choose
Name = r9  OK !
Now we have a representation of size = 4674
Minimization in Progress
Name = r7  OK !
Now we have a representation of size = 4294
Name = r9 No new state computed
Name = r8  I.N.C.R.E.A.S.E
Name = r6 No new state computed
Name = r10  I.N.C.R.E.A.S.E
increase = 1
**********************
Random choose
Name = r10  OK !
Now we have a representation of size = 6614
Minimization in Progress
Name = r7 No new state computed
Name = r6 No new state computed
Name = r8  I.N.C.R.E.A.S.E
Name = r9 No new state computed
increase = 1
**********************
Random choose
Name = r8  OK !
Now we have a representation of size = 13851
Minimization in Progress
Name = r9 No new state computed
Name = r10 No new state computed
Name = r6 No new state computed
Name = r7 No new state computed
increase = 0
nb accelerations 6
Fix point FOUND
cycles of length 1
(1/1), name = r11, size = 171
**********************
Random choose
Name = r11  OK !
Now we have a representation of size = 15207
Minimization in Progress
increase = 0
nb accelerations 1
Fix point FOUND
cycles of length 1
(1/6), name = r12, size = 418
(2/6), name = r13, size = 818
(3/6), name = r14, size = 3147
(4/6), name = r15, size = 881
(5/6), name = r16, size = 3503
(6/6), name = r17, size = 1253
**********************
Random choose
Name = r12  OK !
Now we have a representation of size = 16078
Minimization in Progress
Name = r17 No new state computed
Name = r14  OK !
Now we have a representation of size = 15864
Name = r12 No new state computed
Name = r13  I.N.C.R.E.A.S.E
Name = r15  I.N.C.R.E.A.S.E
Name = r16 No new state computed
Name = r17 No new state computed
increase = 1
**********************
Random choose
Name = r15  OK !
Now we have a representation of size = 19057
Minimization in Progress
Name = r16 