current set encoding is : prestaf
seed is : 2691
cycles of length 1
(1/12), name = t1, size = 149
(2/12), name = t2, size = 149
(3/12), name = t3, size = 149
(4/12), name = t4, size = 149
(5/12), name = t5, size = 173
(6/12), name = t6, size = 149
(7/12), name = t7, size = 161
(8/12), name = t8, size = 149
(9/12), name = t9, size = 155
(10/12), name = t10, size = 155
(11/12), name = t11, size = 149
(12/12), name = t12, size = 185
**********************
Random choose
Name = t5  No new state computed
Name = t1  OK !
Now we have a representation of size = 4
Minimization in Progress
Name = t5 No new state computed
Name = t9 No new state computed
Name = t11 No new state computed
Name = t6 No new state computed
Name = t7 No new state computed
Name = t8 No new state computed
Name = t12 No new state computed
Name = t2  I.N.C.R.E.A.S.E
Name = t4 No new state computed
Name = t10 No new state computed
Name = t3 No new state computed
increase = 1
**********************
Random choose
Name = t2  OK !
Now we have a representation of size = 5
Minimization in Progress
Name = t4 No new state computed
Name = t5 No new state computed
Name = t11 No new state computed
Name = t6 No new state computed
Name = t10 No new state computed
Name = t1 No new state computed
Name = t3  I.N.C.R.E.A.S.E
Name = t7 No new state computed
Name = t12 No new state computed
Name = t9 No new state computed
Name = t8 No new state computed
increase = 1
**********************
Random choose
Name = t3  OK !
Now we have a representation of size = 6
Minimization in Progress
Name = t8 No new state computed
Name = t10 No new state computed
Name = t5  I.N.C.R.E.A.S.E
Name = t9 No new state computed
Name = t6 No new state computed
Name = t4  I.N.C.R.E.A.S.E
Name = t1 No new state computed
Name = t11 No new state computed
Name = t2 No new state computed
Name = t12 No new state computed
Name = t7 No new state computed
increase = 1
**********************
Random choose
Name = t4  OK !
Now we have a representation of size = 7
Minimization in Progress
Name = t1 No new state computed
Name = t3 No new state computed
Name = t9 No new state computed
Name = t8 No new state computed
Name = t10 No new state computed
Name = t2 No new state computed
Name = t7 No new state computed
Name = t5  I.N.C.R.E.A.S.E
Name = t11 No new state computed
Name = t6  I.N.C.R.E.A.S.E
Name = t12 No new state computed
increase = 1
**********************
Random choose
Name = t6  OK !
Now we have a representation of size = 8
Minimization in Progress
Name = t7  I.N.C.R.E.A.S.E
Name = t5  I.N.C.R.E.A.S.E
Name = t12 No new state computed
Name = t9  I.N.C.R.E.A.S.E
Name = t11 No new state computed
Name = t2 No new state computed
Name = t1 No new state computed
Name = t4 No new state computed
Name = t10 No new state computed
Name = t8  I.N.C.R.E.A.S.E
Name = t3 No new state computed
increase = 1
**********************
Random choose
Name = t8  OK !
Now we have a representation of size = 9
Minimization in Progress
Name = t7  I.N.C.R.E.A.S.E
Name = t3 No new state computed
Name = t6 No new state computed
Name = t1 No new state computed
Name = t10  I.N.C.R.E.A.S.E
Name = t5  I.N.C.R.E.A.S.E
Name = t4 No new state computed
Name = t9  I.N.C.R.E.A.S.E
Name = t2 No new state computed
Name = t11 No new state computed
Name = t12 No new state computed
increase = 1
**********************
Random choose
Name = t9  OK !
Now we have a representation of size = 10
Minimization in Progress
Name = t7  I.N.C.R.E.A.S.E
Name = t8 No new state computed
Name = t6 No new state computed
Name = t10  I.N.C.R.E.A.S.E
Name = t2 No new state computed
Name = t1 No new state computed
Name = t12 No new state computed
Name = t4 No new state computed
Name = t5  I.N.C.R.E.A.S.E
Name = t11  I.N.C.R.E.A.S.E
Name = t3 No new state computed
increase = 1
**********************
Random choose
Name = t11  OK !
Now we have a representation of size = 11
Minimization in Progress
Name = t8 No new state computed
Name = t3 No new state computed
Name = t4 No new state computed
Name = t12 No new state computed
Name = t10 No new state computed
Name = t2 No new state computed
Name = t1 No new state computed
Name = t5 No new state computed
Name = t9 No new state computed
Name = t6 No new state computed
Name = t7 No new state computed
increase = 0
nb accelerations 8
Fix point FOUND
seed is : 2691
