current set encoding is : lash-lsdf
seed is : 21768
cycles of length 1
(1/5), name = t1, size = 482
(2/5), name = t2, size = 268
(3/5), name = t3, size = 268
(4/5), name = t4, size = 248
(5/5), name = t5, size = 268
**********************
Random choose
Name = t1  OK !
Now we have a representation of size = 31
Minimization in Progress
Name = t2 No new state computed
Name = t4 No new state computed
Name = t3 No new state computed
Name = t5  I.N.C.R.E.A.S.E
increase = 1
**********************
Random choose
Name = t5  OK !
Now we have a representation of size = 32
Minimization in Progress
Name = t2 No new state computed
Name = t1 No new state computed
Name = t4 No new state computed
Name = t3 No new state computed
increase = 0
nb accelerations 2
Fix point FOUND
seed is : 21768
