current set encoding is : lash-lsdf
seed is : 3284
cycles of length 1
(1/13), name = t1, size = 352
(2/13), name = t2, size = 1101
(3/13), name = t3, size = 1035
(4/13), name = t4, size = 1004
(5/13), name = t5, size = 1070
(6/13), name = t6, size = 352
(7/13), name = t7, size = 364
(8/13), name = t8, size = 352
(9/13), name = t9, size = 556
(10/13), name = t10, size = 574
(11/13), name = t11, size = 358
(12/13), name = t12, size = 586
(13/13), name = t13, size = 538
**********************
Random choose
Name = t6  OK !
Now we have a representation of size = 59
Minimization in Progress
Name = t7 No new state computed
Name = t10 No new state computed
Name = t3  I.N.C.R.E.A.S.E
Name = t8  OK !
Now we have a representation of size = 59
Name = t2 No new state computed
Name = t1 No new state computed
Name = t4 No new state computed
Name = t7 No new state computed
Name = t11 No new state computed
Name = t13 No new state computed
Name = t12 No new state computed
Name = t5 No new state computed
Name = t9  I.N.C.R.E.A.S.E
Name = t6 No new state computed
Name = t10 No new state computed
Name = t3  I.N.C.R.E.A.S.E
increase = 1
**********************
Random choose
Name = t3  OK !
Now we have a representation of size = 65
Minimization in Progress
Name = t11 No new state computed
Name = t8 No new state computed
Name = t1  OK !
Now we have a representation of size = 65
Name = t9  I.N.C.R.E.A.S.E
Name = t5 No new state computed
Name = t2 No new state computed
Name = t3 No new state computed
Name = t8 No new state computed
Name = t6 No new state computed
Name = t7 No new state computed
Name = t13 No new state computed
Name = t12 No new state computed
Name = t11 No new state computed
Name = t4 No new state computed
Name = t10 No new state computed
increase = 1
**********************
Random choose
Name = t9  OK !
Now we have a representation of size = 68
Minimization in Progress
Name = t13 No new state computed
Name = t1 No new state computed
Name = t3 No new state computed
Name = t6 No new state computed
Name = t2  I.N.C.R.E.A.S.E
Name = t10  I.N.C.R.E.A.S.E
Name = t12 No new state computed
Name = t5 No new state computed
Name = t8 No new state computed
Name = t7 No new state computed
Name = t11 No new state computed
Name = t4 No new state computed
increase = 1
**********************
Random choose
Name = t10  OK !
Now we have a representation of size = 75
Minimization in Progress
Name = t12 No new state computed
Name = t6 No new state computed
Name = t8 No new state computed
Name = t4 No new state computed
Name = t9  OK !
Now we have a representation of size = 75
Name = t5 No new state computed
Name = t6 No new state computed
Name = t1 No new state computed
Name = t8 No new state computed
Name = t11  I.N.C.R.E.A.S.E
Name = t3  I.N.C.R.E.A.S.E
Name = t12 No new state computed
Name = t7 No new state computed
Name = t2  I.N.C.R.E.A.S.E
Name = t13 No new state computed
Name = t10  I.N.C.R.E.A.S.E
Name = t4 No new state computed
increase = 1
**********************
Random choose
Name = t10  OK !
Now we have a representation of size = 109
Minimization in Progress
Name = t12 No new state computed
Name = t2  I.N.C.R.E.A.S.E
Name = t4 No new state computed
Name = t9  OK !
Now we have a representation of size = 108
Name = t6 No new state computed
Name = t10  I.N.C.R.E.A.S.E
Name = t2  I.N.C.R.E.A.S.E
Name = t8 No new state computed
Name = t7 No new state computed
Name = t1 No new state computed
Name = t13 No new state computed
Name = t4 No new state computed
Name = t12 No new state computed
Name = t11  I.N.C.R.E.A.S.E
Name = t3  I.N.C.R.E.A.S.E
Name = t5 No new state computed
increase = 1
**********************
Random choose
Name = t3  OK !
Now we have a representation of size = 113
Minimization in Progress
Name = t2  I.N.C.R.E.A.S.E
Name = t12 No new state computed
Name = t10  I.N.C.R.E.A.S.E
Name = t6 No new state computed
Name = t5 No new state computed
Name = t1  OK !
Now we have a representation of size = 98
Name = t5 No new state computed
Name = t3 No new state computed
Name = t12 No new state computed
Name = t13 No new state computed
Name = t6 No new state computed
Name = t8 No new state computed
Name = t7 No new state computed
Name = t4 No new state computed
Name = t2  I.N.C.R.E.A.S.E
Name = t11  I.N.C.R.E.A.S.E
Name = t10  I.N.C.R.E.A.S.E
Name = t9 No new state computed
increase = 1
**********************
Random choose
Name = t10  OK !
Now we have a representation of size = 105
Minimization in Progress
Name = t13 No new state computed
Name = t5 No new state computed
Name = t6 No new state computed
Name = t8 No new state computed
Name = t2  I.N.C.R.E.A.S.E
Name = t3  I.N.C.R.E.A.S.E
Name = t12 No new state computed
Name = t9  OK !
Now we have a representation of size = 105
Name = t2  I.N.C.R.E.A.S.E
Name = t11  I.N.C.R.E.A.S.E
Name = t8 No new state computed
Name = t10  I.N.C.R.E.A.S.E
Name = t5 No new state computed
Name = t7 No new state computed
Name = t6 No new state computed
Name = t3  I.N.C.R.E.A.S.E
Name = t12 No new state computed
Name = t4 No new state computed
Name = t13 No new state computed
Name = t1 No new state computed
increase = 1
**********************
Random choose
Name = t3  OK !
Now we have a representation of size = 110
Minimization in Progress
Name = t9 No new state computed
Name = t1  OK !
Now we have a representation of size = 95
Name = t12 No new state computed
Name = t5 No new state computed
Name = t9 No new state computed
Name = t8 No new state computed
Name = t2  I.N.C.R.E.A.S.E
Name = t10  I.N.C.R.E.A.S.E
Name = t4 No new state computed
Name = t13 No new state computed
Name = t6 No new state computed
Name = t7 No new state computed
Name = t11  I.N.C.R.E.A.S.E
Name = t3 No new state computed
increase = 1
**********************
Random choose
Name = t11  OK !
Now we have a representation of size = 104
Minimization in Progress
Name = t4 No new state computed
Name = t7 No new state computed
Name = t9 No new state computed
Name = t2  I.N.C.R.E.A.S.E
Name = t8 No new state computed
Name = t13  I.N.C.R.E.A.S.E
Name = t1 No new state computed
Name = t12 No new state computed
Name = t5 No new state computed
Name = t10  I.N.C.R.E.A.S.E
Name = t3 No new state computed
Name = t6 No new state computed
increase = 1
**********************
Random choose
Name = t10  OK !
Now we have a representation of size = 182
Minimization in Progress
Name = t1 No new state computed
Name = t12 No new state computed
Name = t2  I.N.C.R.E.A.S.E
Name = t6 No new state computed
Name = t7 No new state computed
Name = t9  OK !
Now we have a representation of size = 182
Name = t8 No new state computed
Name = t13  I.N.C.R.E.A.S.E
Name = t3  I.N.C.R.E.A.S.E
Name = t5 No new state computed
Name = t11  OK !
Now we have a representation of size = 155
Name = t5 No new state computed
Name = t9 No new state computed
Name = t3  I.N.C.R.E.A.S.E
Name = t12 No new state computed
Name = t6 No new state computed
Name = t13  I.N.C.R.E.A.S.E
Name = t8 No new state computed
Name = t2  I.N.C.R.E.A.S.E
Name = t4 No new state computed
Name = t7 No new state computed
Name = t1 No new state computed
Name = t10  I.N.C.R.E.A.S.E
increase = 1
**********************
Random choose
Name = t10  OK !
Now we have a representation of size = 197
Minimization in Progress
Name = t5 No new state computed
Name = t1 No new state computed
Name = t2  I.N.C.R.E.A.S.E
Name = t11  OK !
Now we have a representation of size = 158
Name = t10 No new state computed
Name = t8 No new state computed
Name = t6 No new state computed
Name = t4 No new state computed
Name = t12 No new state computed
Name = t9  OK !
Now we have a representation of size = 157
Name = t7 No new state computed
Name = t4 No new state computed
Name = t5 No new state computed
Name = t11 No new state computed
Name = t8 No new state computed
Name = t2  I.N.C.R.E.A.S.E
Name = t13  I.N.C.R.E.A.S.E
Name = t3  I.N.C.R.E.A.S.E
Name = t6 No new state computed
Name = t1 No new state computed
Name = t10  I.N.C.R.E.A.S.E
Name = t12 No new state computed
increase = 1
**********************
Random choose
Name = t10  OK !
Now we have a representation of size = 196
Minimization in Progress
Name = t7 No new state computed
Name = t13  I.N.C.R.E.A.S.E
Name = t8 No new state computed
Name = t4 No new state computed
Name = t1 No new state computed
Name = t6 No new state computed
Name = t12 No new state computed
Name = t11  OK !
Now we have a representation of size = 180
Name = t10 No new state computed
Name = t4 No new state computed
Name = t2  I.N.C.R.E.A.S.E
Name = t9  OK !
Now we have a representation of size = 177
Name = t4 No new state computed
Name = t11 No new state computed
Name = t7 No new state computed
Name = t8 No new state computed
Name = t3  I.N.C.R.E.A.S.E
Name = t13  I.N.C.R.E.A.S.E
Name = t10  I.N.C.R.E.A.S.E
Name = t5 No new state computed
Name = t6 No new state computed
Name = t12 No new state computed
Name = t1 No new state computed
Name = t2  I.N.C.R.E.A.S.E
increase = 1
**********************
Random choose
Name = t2  OK !
Now we have a representation of size = 183
Minimization in Progress
Name = t1  OK !
Now we have a representation of size = 182
Name = t13  I.N.C.R.E.A.S.E
Name = t2 No new state computed
Name = t9 No new state computed
Name = t12 No new state computed
Name = t3  I.N.C.R.E.A.S.E
Name = t7 No new state computed
Name = t4 No new state computed
Name = t10  I.N.C.R.E.A.S.E
Name = t6 No new state computed
Name = t8 No new state computed
Name = t5 No new state computed
Name = t11 No new state computed
increase = 1
**********************
Random choose
Name = t10  OK !
Now we have a representation of size = 223
Minimization in Progress
Name = t11  OK !
Now we have a representation of size = 187
Name = t5 No new state computed
Name = t4 No new state computed
Name = t2 No new state computed
Name = t12 No new state computed
Name = t10 No new state computed
Name = t13  I.N.C.R.E.A.S.E
Name = t3  I.N.C.R.E.A.S.E
Name = t9  OK !
Now we have a representation of size = 187
Name = t5 No new state computed
Name = t10  I.N.C.R.E.A.S.E
Name = t3  I.N.C.R.E.A.S.E
Name = t8 No new state computed
Name = t7 No new state computed
Name = t13  I.N.C.R.E.A.S.E
Name = t4 No new state computed
Name = t1 No new state computed
Name = t11 No new state computed
Name = t6 No new state computed
Name = t12 No new state computed
Name = t2  I.N.C.R.E.A.S.E
increase = 1
**********************
Random choose
Name = t2  OK !
Now we have a representation of size = 193
Minimization in Progress
Name = t7 No new state computed
Name = t3  I.N.C.R.E.A.S.E
Name = t13  I.N.C.R.E.A.S.E
Name = t6 No new state computed
Name = t12 No new state computed
Name = t11 No new state computed
Name = t10  I.N.C.R.E.A.S.E
Name = t5 No new state computed
Name = t8 No new state computed
Name = t4 No new state computed
Name = t9 No new state computed
Name = t1  OK !
Now we have a representation of size = 182
Name = t13  I.N.C.R.E.A.S.E
Name = t11 No new state computed
Name = t5 No new state computed
Name = t3  I.N.C.R.E.A.S.E
Name = t4 No new state computed
Name = t7 No new state computed
Name = t12 No new state computed
Name = t8 No new state computed
Name = t10  I.N.C.R.E.A.S.E
Name = t6 No new state computed
Name = t2 No new state computed
Name = t9 No new state computed
increase = 1
**********************
Random choose
Name = t10  OK !
Now we have a representation of size = 276
Minimization in Progress
Name = t3  I.N.C.R.E.A.S.E
Name = t12 No new state computed
Name = t7 No new state computed
Name = t8 No new state computed
Name = t9  OK !
Now we have a representation of size = 276
Name = t11  OK !
Now we have a representation of size = 226
Name = t8 No new state computed
Name = t6 No new state computed
Name = t2  I.N.C.R.E.A.S.E
Name = t7 No new state computed
Name = t1 No new state computed
Name = t9 No new state computed
Name = t12 No new state computed
Name = t10  I.N.C.R.E.A.S.E
Name = t4 No new state computed
Name = t5 No new state computed
Name = t13  I.N.C.R.E.A.S.E
Name = t3  I.N.C.R.E.A.S.E
increase = 1
**********************
Random choose
Name = t3  OK !
Now we have a representation of size = 231
Minimization in Progress
Name = t6 No new state computed
Name = t13  I.N.C.R.E.A.S.E
Name = t5 No new state computed
Name = t9 No new state computed
Name = t10  I.N.C.R.E.A.S.E
Name = t7 No new state computed
Name = t12 No new state computed
Name = t4 No new state computed
Name = t11 No new state computed
Name = t2  I.N.C.R.E.A.S.E
Name = t8 No new state computed
Name = t1  OK !
Now we have a representation of size = 210
Name = t3 No new state computed
Name = t2  I.N.C.R.E.A.S.E
Name = t6 No new state computed
Name = t8 No new state computed
Name = t13  I.N.C.R.E.A.S.E
Name = t4 No new state computed
Name = t5 No new state computed
Name = t7 No new state computed
Name = t10  I.N.C.R.E.A.S.E
Name = t12 No new state computed
Name = t9 No new state computed
Name = t11 No new state computed
increase = 1
**********************
Random choose
Name = t10  OK !
Now we have a representation of size = 283
Minimization in Progress
Name = t11  OK !
Now we have a representation of size = 221
Name = t5 No new state computed
Name = t6 No new state computed
Name = t7 No new state computed
Name = t9  OK !
Now we have a representation of size = 221
Name = t8 No new state computed
Name = t3  I.N.C.R.E.A.S.E
Name = t4 No new state computed
Name = t13  I.N.C.R.E.A.S.E
Name = t6 No new state computed
Name = t11 No new state computed
Name = t7 No new state computed
Name = t10  I.N.C.R.E.A.S.E
Name = t1 No new state computed
Name = t5 No new state computed
Name = t12 No new state computed
Name = t2  I.N.C.R.E.A.S.E
increase = 1
**********************
Random choose
Name = t2  OK !
Now we have a representation of size = 227
Minimization in Progress
Name = t1  OK !
Now we have a representation of size = 215
Name = t8 No new state computed
Name = t13  I.N.C.R.E.A.S.E
Name = t2 No new state computed
Name = t10  I.N.C.R.E.A.S.E
Name = t12 No new state computed
Name = t9 No new state computed
Name = t4 No new state computed
Name = t6 No new state computed
Name = t5 No new state computed
Name = t7 No new state computed
Name = t3  I.N.C.R.E.A.S.E
Name = t11 No new state computed
increase = 1
**********************
Random choose
Name = t3  OK !
Now we have a representation of size = 220
Minimization in Progress
Name = t9 No new state computed
Name = t5 No new state computed
Name = t6 No new state computed
Name = t2 No new state computed
Name = t12 No new state computed
Name = t4 No new state computed
Name = t10  I.N.C.R.E.A.S.E
Name = t8 No new state computed
Name = t7 No new state computed
Name = t13  I.N.C.R.E.A.S.E
Name = t1  OK !
Now we have a representation of size = 204
Name = t3 No new state computed
Name = t12 No new state computed
Name = t8 No new state computed
Name = t4 No new state computed
Name = t11 No new state computed
Name = t2 No new state computed
Name = t7 No new state computed
Name = t6 No new state computed
Name = t9 No new state computed
Name = t13  I.N.C.R.E.A.S.E
Name = t5 No new state computed
Name = t10  I.N.C.R.E.A.S.E
increase = 1
**********************
Random choose
Name = t10  OK !
Now we have a representation of size = 289
Minimization in Progress
Name = t2 No new state computed
Name = t8 No new state computed
Name = t7 No new state computed
Name = t11  OK !
Now we have a representation of size = 250
Name = t7 No new state computed
Name = t4 No new state computed
Name = t13  I.N.C.R.E.A.S.E
Name = t12 No new state computed
Name = t8 No new state computed
Name = t6 No new state computed
Name = t2 No new state computed
Name = t1 No new state computed
Name = t10 No new state computed
Name = t3  I.N.C.R.E.A.S.E
Name = t5 No new state computed
Name = t9  OK !
Now we have a representation of size = 250
Name = t8 No new state computed
Name = t13  I.N.C.R.E.A.S.E
Name = t5 No new state computed
Name = t12 No new state computed
Name = t1 No new state computed
Name = t2  I.N.C.R.E.A.S.E
Name = t7 No new state computed
Name = t6 No new state computed
Name = t10  I.N.C.R.E.A.S.E
Name = t4 No new state computed
Name = t3  I.N.C.R.E.A.S.E
Name = t11 No new state computed
increase = 1
**********************
Random choose
Name = t3  OK !
Now we have a representation of size = 255
Minimization in Progress
Name = t8 No new state computed
Name = t2  I.N.C.R.E.A.S.E
Name = t13  I.N.C.R.E.A.S.E
Name = t12 No new state computed
Name = t9 No new state computed
Name = t6 No new state computed
Name = t4 No new state computed
Name = t10  I.N.C.R.E.A.S.E
Name = t1  OK !
Now we have a representation of size = 229
Name = t12 No new state computed
Name = t2  I.N.C.R.E.A.S.E
Name = t11 No new state computed
Name = t8 No new state computed
Name = t4 No new state computed
Name = t3 No new state computed
Name = t5 No new state computed
Name = t10  I.N.C.R.E.A.S.E
Name = t6 No new state computed
Name = t13  I.N.C.R.E.A.S.E
Name = t9 No new state computed
Name = t7 No new state computed
increase = 1
**********************
Random choose
Name = t13  OK !
Now we have a representation of size = 234
Minimization in Progress
Name = t7 No new state computed
Name = t12 No new state computed
Name = t2  I.N.C.R.E.A.S.E
Name = t11 No new state computed
Name = t9 No new state computed
Name = t4 No new state computed
Name = t1 No new state computed
Name = t6 No new state computed
Name = t5 No new state computed
Name = t10  I.N.C.R.E.A.S.E
Name = t3 No new state computed
Name = t8 No new state computed
increase = 1
**********************
Random choose
Name = t10  OK !
Now we have a representation of size = 306
Minimization in Progress
Name = t7 No new state computed
Name = t8 No new state computed
Name = t3  I.N.C.R.E.A.S.E
Name = t4 No new state computed
Name = t13 No new state computed
Name = t5 No new state computed
Name = t9  OK !
Now we have a representation of size = 306
Name = t4 No new state computed
Name = t10  I.N.C.R.E.A.S.E
Name = t7 No new state computed
Name = t1 No new state computed
Name = t3  I.N.C.R.E.A.S.E
Name = t11  OK !
Now we have a representation of size = 247
Name = t10  I.N.C.R.E.A.S.E
Name = t6 No new state computed
Name = t4 No new state computed
Name = t8 No new state computed
Name = t3  I.N.C.R.E.A.S.E
Name = t12 No new state computed
Name = t9 No new state computed
Name = t5 No new state computed
Name = t13 No new state computed
Name = t1 No new state computed
Name = t2  I.N.C.R.E.A.S.E
Name = t7 No new state computed
increase = 1
**********************
Random choose
Name = t2  OK !
Now we have a representation of size = 253
Minimization in Progress
Name = t4 No new state computed
Name = t10  I.N.C.R.E.A.S.E
Name = t3  I.N.C.R.E.A.S.E
Name = t6 No new state computed
Name = t9 No new state computed
Name = t5 No new state computed
Name = t13 No new state computed
Name = t8 No new state computed
Name = t12 No new state computed
Name = t7 No new state computed
Name = t11 No new state computed
Name = t1  OK !
Now we have a representation of size = 240
Name = t2 No new state computed
Name = t10  I.N.C.R.E.A.S.E
Name = t3  I.N.C.R.E.A.S.E
Name = t8 No new state computed
Name = t9 No new state computed
Name = t4 No new state computed
Name = t5 No new state computed
Name = t6 No new state computed
Name = t13 No new state computed
Name = t7 No new state computed
Name = t12 No new state computed
Name = t11 No new state computed
increase = 1
**********************
Random choose
Name = t3  OK !
Now we have a representation of size = 245
Minimization in Progress
Name = t8 No new state computed
Name = t1  OK !
Now we have a representation of size = 210
Name = t3 No new state computed
Name = t4 No new state computed
Name = t12 No new state computed
Name = t9 No new state computed
Name = t11 No new state computed
Name = t8 No new state computed
Name = t5 No new state computed
Name = t7 No new state computed
Name = t13 No new state computed
Name = t2 No new state computed
Name = t6 No new state computed
Name = t10  I.N.C.R.E.A.S.E
increase = 1
**********************
Random choose
Name = t10  OK !
Now we have a representation of size = 354
Minimization in Progress
Name = t11  OK !
Now we have a representation of size = 293
Name = t2 No new state computed
Name = t10 No new state computed
Name = t6 No new state computed
Name = t13 No new state computed
Name = t1 No new state computed
Name = t3  I.N.C.R.E.A.S.E
Name = t9  OK !
Now we have a representation of size = 293
Name = t11 No new state computed
Name = t5 No new state computed
Name = t12 No new state computed
Name = t7 No new state computed
Name = t2  I.N.C.R.E.A.S.E
Name = t4 No new state computed
Name = t10  I.N.C.R.E.A.S.E
Name = t6 No new state computed
Name = t13 No new state computed
Name = t8 No new state computed
Name = t3  I.N.C.R.E.A.S.E
Name = t1 No new state computed
increase = 1
**********************
Random choose
Name = t3  OK !
Now we have a representation of size = 298
Minimization in Progress
Name = t10  I.N.C.R.E.A.S.E
Name = t2  I.N.C.R.E.A.S.E
Name = t12 No new state computed
Name = t11 No new state computed
Name = t5 No new state computed
Name = t6 No new state computed
Name = t7 No new state computed
Name = t4 No new state computed
Name = t9 No new state computed
Name = t1  OK !
Now we have a representation of size = 257
Name = t13 No new state computed
Name = t2  I.N.C.R.E.A.S.E
Name = t4 No new state computed
Name = t9 No new state computed
Name = t6 No new state computed
Name = t7 No new state computed
Name = t8 No new state computed
Name = t12 No new state computed
Name = t10  I.N.C.R.E.A.S.E
Name = t3 No new state computed
Name = t5 No new state computed
Name = t11 No new state computed
increase = 1
**********************
Random choose
Name = t10  OK !
Now we have a representation of size = 329
Minimization in Progress
Name = t7 No new state computed
Name = t12 No new state computed
Name = t8 No new state computed
Name = t4 No new state computed
Name = t5 No new state computed
Name = t9  OK !
Now we have a representation of size = 329
Name = t10  I.N.C.R.E.A.S.E
Name = t6 No new state computed
Name = t7 No new state computed
Name = t11  OK !
Now we have a representation of size = 270
Name = t8 No new state computed
Name = t7 No new state computed
Name = t12 No new state computed
Name = t3  I.N.C.R.E.A.S.E
Name = t9 No new state computed
Name = t5 No new state computed
Name = t6 No new state computed
Name = t4 No new state computed
Name = t13 No new state computed
Name = t10  I.N.C.R.E.A.S.E
Name = t2  I.N.C.R.E.A.S.E
Name = t1 No new state computed
increase = 1
**********************
Random choose
Name = t2  OK !
Now we have a representation of size = 276
Minimization in Progress
Name = t12 No new state computed
Name = t5 No new state computed
Name = t13 No new state computed
Name = t9 No new state computed
Name = t4 No new state computed
Name = t1  OK !
Now we have a representation of size = 263
Name = t9 No new state computed
Name = t11 No new state computed
Name = t3  I.N.C.R.E.A.S.E
Name = t10  I.N.C.R.E.A.S.E
Name = t5 No new state computed
Name = t7 No new state computed
Name = t4 No new state computed
Name = t13 No new state computed
Name = t12 No new state computed
Name = t2 No new state computed
Name = t6 No new state computed
Name = t8 No new state computed
increase = 1
**********************
Random choose
Name = t10  OK !
Now we have a representation of size = 363
Minimization in Progress
Name = t1 No new state computed
Name = t2 No new state computed
Name = t8 No new state computed
Name = t13 No new state computed
Name = t3  I.N.C.R.E.A.S.E
Name = t12 No new state computed
Name = t9  OK !
Now we have a representation of size = 363
Name = t4 No new state computed
Name = t13 No new state computed
Name = t12 No new state computed
Name = t3  I.N.C.R.E.A.S.E
Name = t5 No new state computed
Name = t8 No new state computed
Name = t2  I.N.C.R.E.A.S.E
Name = t7 No new state computed
Name = t10  I.N.C.R.E.A.S.E
Name = t1 No new state computed
Name = t11  OK !
Now we have a representation of size = 304
Name = t10  I.N.C.R.E.A.S.E
Name = t12 No new state computed
Name = t4 No new state computed
Name = t1 No new state computed
Name = t2  I.N.C.R.E.A.S.E
Name = t7 No new state computed
Name = t9 No new state computed
Name = t13 No new state computed
Name = t5 No new state computed
Name = t8 No new state computed
Name = t6 No new state computed
Name = t3  I.N.C.R.E.A.S.E
increase = 1
**********************
Random choose
Name = t3  OK !
Now we have a representation of size = 309
Minimization in Progress
Name = t8 No new state computed
Name = t13 No new state computed
Name = t6 No new state computed
Name = t4 No new state computed
Name = t1  OK !
Now we have a representation of size = 259
Name = t11 No new state computed
Name = t6 No new state computed
Name = t5 No new state computed
Name = t2  I.N.C.R.E.A.S.E
Name = t9 No new state computed
Name = t12 No new state computed
Name = t4 No new state computed
Name = t7 No new state computed
Name = t8 No new state computed
Name = t3 No new state computed
Name = t10  I.N.C.R.E.A.S.E
Name = t13 No new state computed
increase = 1
**********************
Random choose
Name = t10  OK !
Now we have a representation of size = 328
Minimization in Progress
Name = t11  OK !
Now we have a representation of size = 272
Name = t1 No new state computed
Name = t13 No new state computed
Name = t8 No new state computed
Name = t4 No new state computed
Name = t12 No new state computed
Name = t7 No new state computed
Name = t2  I.N.C.R.E.A.S.E
Name = t10 No new state computed
Name = t3  I.N.C.R.E.A.S.E
Name = t5 No new state computed
Name = t6 No new state computed
Name = t9  OK !
Now we have a representation of size = 272
Name = t8 No new state computed
Name = t3  I.N.C.R.E.A.S.E
Name = t1 No new state computed
Name = t2  I.N.C.R.E.A.S.E
Name = t5 No new state computed
Name = t10  I.N.C.R.E.A.S.E
Name = t7 No new state computed
Name = t6 No new state computed
Name = t11 No new state computed
Name = t13 No new state computed
Name = t12 No new state computed
Name = t4 No new state computed
increase = 1
**********************
Random choose
Name = t10  OK !
Now we have a representation of size = 459
Minimization in Progress
Name = t11  OK !
Now we have a representation of size = 362
Name = t12 No new state computed
Name = t9  OK !
Now we have a representation of size = 361
Name = t8 No new state computed
Name = t7 No new state computed
Name = t10  I.N.C.R.E.A.S.E
Name = t5 No new state computed
Name = t6 No new state computed
Name = t11 No new state computed
Name = t2  I.N.C.R.E.A.S.E
Name = t1 No new state computed
Name = t4 No new state computed
Name = t13 No new state computed
Name = t3  I.N.C.R.E.A.S.E
Name = t12 No new state computed
increase = 1
**********************
Random choose
Name = t3  OK !
Now we have a representation of size = 366
Minimization in Progress
Name = t9 No new state computed
Name = t6 No new state computed
Name = t5 No new state computed
Name = t10  I.N.C.R.E.A.S.E
Name = t1  OK !
Now we have a representation of size = 319
Name = t8 No new state computed
Name = t6 No new state computed
Name = t4 No new state computed
Name = t2  I.N.C.R.E.A.S.E
Name = t5 No new state computed
Name = t10  I.N.C.R.E.A.S.E
Name = t9 No new state computed
Name = t13 No new state computed
Name = t7 No new state computed
Name = t11 No new state computed
Name = t3 No new state computed
Name = t12 No new state computed
increase = 1
**********************
Random choose
Name = t10  OK !
Now we have a representation of size = 417
Minimization in Progress
Name = t5 No new state computed
Name = t4 No new state computed
Name = t3  I.N.C.R.E.A.S.E
Name = t9  OK !
Now we have a representation of size = 417
Name = t3  I.N.C.R.E.A.S.E
Name = t13 No new state computed
Name = t6 No new state computed
Name = t2  I.N.C.R.E.A.S.E
Name = t8 No new state computed
Name = t5 No new state computed
Name = t1 No new state computed
Name = t7 No new state computed
Name = t4 No new state computed
Name = t12 No new state computed
Name = t11  OK !
Now we have a representation of size = 332
Name = t5 No new state computed
Name = t12 No new state computed
Name = t2  I.N.C.R.E.A.S.E
Name = t13 No new state computed
Name = t1 No new state computed
Name = t9 No new state computed
Name = t7 No new state computed
Name = t10  I.N.C.R.E.A.S.E
Name = t6 No new state computed
Name = t8 No new state computed
Name = t4 No new state computed
Name = t3  I.N.C.R.E.A.S.E
increase = 1
**********************
Random choose
Name = t3  OK !
Now we have a representation of size = 337
Minimization in Progress
Name = t2  I.N.C.R.E.A.S.E
Name = t11 No new state computed
Name = t10  I.N.C.R.E.A.S.E
Name = t7 No new state computed
Name = t13 No new state computed
Name = t12 No new state computed
Name = t1  OK !
Now we have a representation of size = 320
Name = t4 No new state computed
Name = t6 No new state computed
Name = t9 No new state computed
Name = t8 No new state computed
Name = t11 No new state computed
Name = t10  I.N.C.R.E.A.S.E
Name = t3 No new state computed
Name = t12 No new state computed
Name = t5 No new state computed
Name = t2  I.N.C.R.E.A.S.E
Name = t7 No new state computed
Name = t13 No new state computed
increase = 1
**********************
Random choose
Name = t2  OK !
Now we have a representation of size = 326
Minimization in Progress
Name = t9 No new state computed
Name = t13 No new state computed
Name = t6 No new state computed
Name = t3 No new state computed
Name = t11 No new state computed
Name = t8 No new state computed
Name = t1  OK !
Now we have a representation of size = 271
Name = t7 No new state computed
Name = t12 No new state computed
Name = t4 No new state computed
Name = t13 No new state computed
Name = t9 No new state computed
Name = t10  I.N.C.R.E.A.S.E
Name = t6 No new state computed
Name = t5 No new state computed
Name = t8 No new state computed
Name = t11 No new state computed
Name = t3 No new state computed
Name = t2 No new state computed
increase = 1
**********************
Random choose
Name = t10  OK !
Now we have a representation of size = 403
Minimization in Progress
Name = t7 No new state computed
Name = t8 No new state computed
Name = t1 No new state computed
Name = t4 No new state computed
Name = t3  I.N.C.R.E.A.S.E
Name = t6 No new state computed
Name = t5 No new state computed
Name = t13 No new state computed
Name = t11  OK !
Now we have a representation of size = 318
Name = t3  I.N.C.R.E.A.S.E
Name = t8 No new state computed
Name = t1 No new state computed
Name = t9  OK !
Now we have a representation of size = 318
Name = t11 No new state computed
Name = t7 No new state computed
Name = t2  I.N.C.R.E.A.S.E
Name = t1 No new state computed
Name = t12 No new state computed
Name = t10  I.N.C.R.E.A.S.E
Name = t4 No new state computed
Name = t8 No new state computed
Name = t3  I.N.C.R.E.A.S.E
Name = t5 No new state computed
Name = t13 No new state computed
Name = t6 No new state computed
increase = 1
**********************
Random choose
Name = t3  OK !
Now we have a representation of size = 323
Minimization in Progress
Name = t8 No new state computed
Name = t5 No new state computed
Name = t2  I.N.C.R.E.A.S.E
Name = t9 No new state computed
Name = t11 No new state computed
Name = t4 No new state computed
Name = t13 No new state computed
Name = t10  I.N.C.R.E.A.S.E
Name = t6 No new state computed
Name = t7 No new state computed
Name = t12 No new state computed
Name = t1  OK !
Now we have a representation of size = 297
Name = t9 No new state computed
Name = t8 No new state computed
Name = t13 No new state computed
Name = t11 No new state computed
Name = t4 No new state computed
Name = t10  I.N.C.R.E.A.S.E
Name = t5 No new state computed
Name = t2  I.N.C.R.E.A.S.E
Name = t3 No new state computed
Name = t12 No new state computed
Name = t7 No new state computed
Name = t6 No new state computed
increase = 1
**********************
Random choose
Name = t2  OK !
Now we have a representation of size = 303
Minimization in Progress
Name = t13 No new state computed
Name = t10  I.N.C.R.E.A.S.E
Name = t9 No new state computed
Name = t6 No new state computed
Name = t5 No new state computed
Name = t12 No new state computed
Name = t4 No new state computed
Name = t1  OK !
Now we have a representation of size = 290
Name = t8 No new state computed
Name = t9 No new state computed
Name = t13 No new state computed
Name = t2 No new state computed
Name = t3 No new state computed
Name = t4 No new state computed
Name = t12 No new state computed
Name = t7 No new state computed
Name = t11 No new state computed
Name = t10  I.N.C.R.E.A.S.E
Name = t6 No new state computed
Name = t5 No new state computed
increase = 1
**********************
Random choose
Name = t10  OK !
Now we have a representation of size = 385
Minimization in Progress
Name = t13 No new state computed
Name = t3  I.N.C.R.E.A.S.E
Name = t9  OK !
Now we have a representation of size = 385
Name = t3  I.N.C.R.E.A.S.E
Name = t12 No new state computed
Name = t7 No new state computed
Name = t4 No new state computed
Name = t10  I.N.C.R.E.A.S.E
Name = t5 No new state computed
Name = t8 No new state computed
Name = t2  I.N.C.R.E.A.S.E
Name = t11  OK !
Now we have a representation of size = 303
Name = t8 No new state computed
Name = t2  I.N.C.R.E.A.S.E
Name = t4 No new state computed
Name = t13 No new state computed
Name = t3  I.N.C.R.E.A.S.E
Name = t7 No new state computed
Name = t9 No new state computed
Name = t5 No new state computed
Name = t12 No new state computed
Name = t6 No new state computed
Name = t1 No new state computed
Name = t10  I.N.C.R.E.A.S.E
increase = 1
**********************
Random choose
Name = t10  OK !
Now we have a representation of size = 462
Minimization in Progress
Name = t11  OK !
Now we have a representation of size = 380
Name = t8 No new state computed
Name = t9  OK !
Now we have a representation of size = 379
Name = t4 No new state computed
Name = t13 No new state computed
Name = t10  I.N.C.R.E.A.S.E
Name = t3  I.N.C.R.E.A.S.E
Name = t5 No new state computed
Name = t2  I.N.C.R.E.A.S.E
Name = t7 No new state computed
Name = t12 No new state computed
Name = t6 No new state computed
Name = t11 No new state computed
Name = t1 No new state computed
Name = t8 No new state computed
increase = 1
nb accelerations 100
All the cycles considered have been used without succes.
Inflating the linear system
(1/169)->
(2/169)->
(3/169)->
(4/169)->
(5/169)->
(6/169)->
(7/169)->
(8/169)->
(9/169)->
(10/169)->
(11/169)->
(12/169)->
(13/169)->
(14/169)->
(15/169)->
(16/169)->
(17/169)->
(18/169)->
(19/169)->
(20/169)->
(21/169)->
(22/169)->
(23/169)->
(24/169)->
(25/169)->
(26/169)->
(27/169)->
(28/169)->
(29/169)->
(30/169)->
(31/169)->
(32/169)->
(33/169)->
(34/169)->
(35/169)->
(36/169)->
(37/169)->
(38/169)->
(39/169)->
(40/169)->
(41/169)->
(42/169)->
(43/169)->
(44/169)->
(45/169)->
(46/169)->
(47/169)->
(48/169)->
(49/169)->
(50/169)->
(51/169)->
(52/169)->
(53/169)->
(54/169)->
(55/169)->
(56/169)->
(57/169)->
(58/169)->
(59/169)->
(60/169)->
(61/169)->
(62/169)->
(63/169)->
(64/169)->
(65/169)->
(66/169)->
(67/169)->
(68/169)->
(69/169)->
(70/169)->
(71/169)->
(72/169)->
(73/169)->
(74/169)->
(75/169)->
(76/169)->
(77/169)->
(78/169)->
(79/169)->
(80/169)->
(81/169)->
(82/169)->
(83/169)->
(84/169)->
(85/169)->
(86/169)->
(87/169)->
(88/169)->
(89/169)->
(90/169)->
(91/169)->
(92/169)->
(93/169)->
(94/169)->
(95/169)->
(96/169)->
(97/169)->
(98/169)->
(99/169)->
(100/169)->
(101/169)->
(102/169)->
(103/169)->
(104/169)->
(105/169)->
(106/169)->
(107/169)->
(108/169)->
(109/169)->
(110/169)->
(111/169)->
(112/169)->
(113/169)->
(114/169)->
(115/169)->
(116/169)->
(117/169)->
(118/169)->
(119/169)->
(120/169)->
(121/169)->
(122/169)->
(123/169)->
(124/169)->
(125/169)->
(126/169)->
(127/169)->
(128/169)->
(129/169)->
(130/169)->
(131/169)->
(132/169)->
(133/169)->
(134/169)->
(135/169)->
(136/169)->
(137/169)->
(138/169)->
(139/169)->
(140/169)->
(141/169)->
(142/169)->
(143/169)->
(144/169)->
(145/169)->
(146/169)->
(147/169)->
(148/169)->
(149/169)->
(150/169)->
(151/169)->
(152/169)->
(153/169)->
(154/169)->
(155/169)->
(156/169)->
(157/169)->
(158/169)->
(159/169)->
(160/169)->
(161/169)->
(162/169)->
(163/169)->
(164/169)->
(165/169)->
(166/169)->
(167/169)->
(168/169)->
(169/169)->
Simplification of the linear system 
2 functions have the same action, it remains only 1
2 functions have the same action, it remains only 1
1 functions have the same action, it remains only 1
1 functions have the same action, it remains only 1
2 functions have the same action, it remains only 1
2 functions have the same action, it remains only 1
2 functions have the same action, it remains only 1
1 functions have the same action, it remains only 1
2 functions have the same action, it remains only 1
2 functions have the same action, it remains only 1
1 functions have the same action, it remains only 1
2 functions have the same action, it remains only 1
1 functions have the same action, it remains only 1
2 functions have the same action, it remains only 1
1 functions have the same action, it remains only 1
2 functions have the same action, it remains only 1
1 functions have the same action, it remains only 1
2 functions have the same action, it remains only 1
1 functions have the same action, it remains only 1
2 functions have the same action, it remains only 1
1 functions have the same action, it remains only 1
2 functions have the same action, it remains only 1
1 functions have the same action, it remains only 1
2 functions have the same action, it remains only 1
1 functions have the same action, it remains only 1
2 functions have the same action, it remains only 1
2 functions have the same action, it remains only 1
4 functions have the same action, it remains only 1
1 functions have the same action, it remains only 1
2 functions have the same action, it remains only 1
2 functions have the same action, it remains only 1
2 functions have the same action, it remains only 1
1 functions have the same action, it remains only 1
2 functions have the same action, it remains only 1
Number of actions before simplification : 57
Number of actions after simplification  : 34
cycles of length 2
(1/34), name = (+t5.t1+t1.t5), size = 1112
(2/34), name = (+t4.t1+t1.t4), size = 1046
(3/34), name = +t1, size = 352
(4/34), name = +t5, size = 1070
(5/34), name = (+t10.t5+t5.t10), size = 2046
(6/34), name = (+t6.t5+t5.t6), size = 1058
(7/34), name = (+t9.t4+t4.t9), size = 2052
(8/34), name = +t4, size = 1004
(9/34), name = (+t6.t4+t4.t6), size = 992
(10/34), name = (+t9.t8+t8.t9), size = 550
(11/34), name = +t9, size = 556
(12/34), name = (+t12.t9+t9.t12), size = 1070
(13/34), name = +t8, size = 352
(14/34), name = (+t10.t9+t9.t10), size = 601
(15/34), name = +t11, size = 358
(16/34), name = (+t13.t11+t11.t13), size = 550
(17/34), name = +t13, size = 538
(18/34), name = (+t8.t7+t7.t8), size = 358
(19/34), name = +t12, size = 586
(20/34), name = (+t13.t12+t12.t13), size = 625
(21/34), name = +t7, size = 364
(22/34), name = (+t11.t10+t10.t11), size = 598
(23/34), name = +t10, size = 574
(24/34), name = (+t10.t7+t7.t10), size = 550
(25/34), name = +t6, size = 352
(26/34), name = (+t3.t1+t1.t3), size = 992
(27/34), name = (+t2.t1+t1.t2), size = 1058
(28/34), name = (+t5.t2+t4.t3+t3.t4+t2.t5), size = 1802
(29/34), name = +t3, size = 1035
(30/34), name = (+t10.t3+t3.t10), size = 2203
(31/34), name = (+t6.t3+t3.t6), size = 1047
(32/34), name = (+t9.t2+t2.t9), size = 2029
(33/34), name = +t2, size = 1101
(34/34), name = (+t6.t2+t2.t6), size = 1113
**********************
Random choose
Name = +t11  No new state computed
Name = (+t9.t2+t2.t9)  No new state computed
Name = (+t13.t11+t11.t13)  No new state computed
Name = +t5  No new state computed
Name = (+t8.t7+t7.t8)  No new state computed
Name = +t13  No new state computed
Name = (+t12.t9+t9.t12)  No new state computed
Name = +t7  No new state computed
Name = (+t10.t7+t7.t10)  No new state computed
Name = (+t6.t4+t4.t6)  No new state computed
Name = +t1  No new state computed
Name = (+t13.t12+t12.t13)  No new state computed
Name = (+t4.t1+t1.t4)  No new state computed
Name = +t9  No new state computed
Name = +t10  No new state computed
Name = (+t11.t10+t10.t11)  No new state computed
Name = +t4  No new state computed
Name = (+t9.t8+t8.t9)  OK !
Now we have a representation of size = 61
Minimization in Progress
Name = (+t5.t2+t4.t3+t3.t4+t2.t5) No new state computed
Name = (+t11.t10+t10.t11)  I.N.C.R.E.A.S.E
Name = (+t6.t2+t2.t6)  I.N.C.R.E.A.S.E
Name = (+t10.t7+t7.t10) No new state computed
Name = +t3 No new state computed
Name = +t6  I.N.C.R.E.A.S.E
Name = (+t3.t1+t1.t3) No new state computed
Name = (+t10.t5+t5.t10) No new state computed
Name = (+t13.t11+t11.t13) No new state computed
Name = (+t6.t4+t4.t6) No new state computed
Name = (+t5.t1+t1.t5) No new state computed
Name = +t12 No new state computed
Name = (+t12.t9+t9.t12) No new state computed
Name = (+t10.t3+t3.t10) No new state computed
Name = +t2 No new state computed
Name = +t10  I.N.C.R.E.A.S.E
Name = (+t6.t3+t3.t6)  I.N.C.R.E.A.S.E
Name = (+t9.t4+t4.t9) No new state computed
Name = +t13 No new state computed
Name = (+t10.t9+t9.t10) No new state computed
Name = +t1 No new state computed
Name = (+t9.t2+t2.t9) No new state computed
Name = +t5 No new state computed
Name = +t8  OK !
Now we have a representation of size = 61
Name = (+t6.t2+t2.t6)  I.N.C.R.E.A.S.E
Name = +t2 No new state computed
Name = (+t10.t7+t7.t10) No new state computed
Name = +t9 No new state computed
Name = (+t10.t9+t9.t10)  OK !
Now we have a representation of size = 61
Name = (+t6.t5+t5.t6) No new state computed
Name = +t3 No new state computed
Name = (+t6.t4+t4.t6) No new state computed
Name = (+t3.t1+t1.t3) No new state computed
Name = +t2 No new state computed
Name = +t1 No new state computed
Name = (+t11.t10+t10.t11)  I.N.C.R.E.A.S.E
Name = (+t4.t1+t1.t4) No new state computed
Name = (+t10.t3+t3.t10) No new state computed
Name = (+t10.t7+t7.t10) No new state computed
Name = (+t13.t11+t11.t13)  OK !
Now we have a representation of size = 61
Name = +t8 No new state computed
Name = (+t9.t2+t2.t9) No new state computed
Name = +t13 No new state computed
Name = (+t5.t2+t4.t3+t3.t4+t2.t5) No new state computed
Name = (+t12.t9+t9.t12) No new state computed
Name = (+t9.t8+t8.t9) No new state computed
Name = (+t3.t1+t1.t3) No new state computed
Name = +t6  I.N.C.R.E.A.S.E
Name = +t12 No new state computed
Name = (+t10.t9+t9.t10) No new state computed
Name = +t7 No new state computed
Name = (+t13.t12+t12.t13) No new state computed
Name = (+t4.t1+t1.t4) No new state computed
Name = (+t10.t5+t5.t10) No new state computed
Name = +t5 No new state computed
Name = (+t6.t4+t4.t6) No new state computed
Name = +t9 No new state computed
Name = +t11  OK !
Now we have a representation of size = 61
Name = (+t2.t1+t1.t2) No new state computed
Name = +t5 No new state computed
Name = +t1 No new state computed
Name = +t7 No new state computed
Name = (+t12.t9+t9.t12) No new state computed
Name = +t2 No new state computed
Name = (+t10.t7+t7.t10) No new state computed
Name = +t8 No new state computed
Name = +t12 No new state computed
Name = +t10 No new state computed
Name = +t3 No new state computed
Name = (+t13.t11+t11.t13) No new state computed
Name = (+t3.t1+t1.t3) No new state computed
Name = +t6  I.N.C.R.E.A.S.E
Name = (+t10.t9+t9.t10) No new state computed
Name = (+t6.t3+t3.t6)  I.N.C.R.E.A.S.E
Name = (+t6.t2+t2.t6)  I.N.C.R.E.A.S.E
Name = (+t4.t1+t1.t4) No new state computed
Name = (+t9.t4+t4.t9) No new state computed
Name = +t9 No new state computed
Name = (+t5.t1+t1.t5) No new state computed
Name = (+t8.t7+t7.t8) No new state computed
Name = (+t9.t2+t2.t9) No new state computed
Name = (+t9.t8+t8.t9) No new state computed
Name = (+t10.t3+t3.t10) No new state computed
Name = (+t13.t12+t12.t13) No new state computed
Name = (+t11.t10+t10.t11) No new state computed
Name = +t13 No new state computed
Name = (+t10.t5+t5.t10) No new state computed
Name = +t4 No new state computed
Name = (+t6.t4+t4.t6) No new state computed
Name = (+t6.t5+t5.t6) No new state computed
Name = (+t5.t2+t4.t3+t3.t4+t2.t5) No new state computed
increase = 1
**********************
Random choose
Name = (+t6.t2+t2.t6)  OK !
Now we have a representation of size = 68
Minimization in Progress
Name = (+t6.t4+t4.t6) No new state computed
Name = (+t12.t9+t9.t12) No new state computed
Name = +t9 No new state computed
Name = (+t9.t4+t4.t9) No new state computed
Name = +t4 No new state computed
Name = +t10 No new state computed
Name = (+t3.t1+t1.t3) No new state computed
Name = (+t10.t5+t5.t10) No new state computed
Name = +t3 No new state computed
Name = (+t13.t11+t11.t13) No new state computed
Name = +t12 No new state computed
Name = (+t2.t1+t1.t2) No new state computed
Name = +t6  I.N.C.R.E.A.S.E
Name = (+t5.t2+t4.t3+t3.t4+t2.t5) No new state computed
Name = (+t4.t1+t1.t4) No new state computed
Name = +t2 No new state computed
Name = (+t10.t3+t3.t10) No new state computed
Name = (+t10.t9+t9.t10) No new state computed
Name = +t7 No new state computed
Name = +t11 No new state computed
Name = +t1  OK !
Now we have a representation of size = 68
Name = (+t13.t11+t11.t13) No new state computed
Name = +t7 No new state computed
Name = +t12 No new state computed
Name = (+t9.t2+t2.t9) No new state computed
Name = (+t3.t1+t1.t3) No new state computed
Name = (+t10.t9+t9.t10) No new state computed
Name = (+t5.t2+t4.t3+t3.t4+t2.t5) No new state computed
Name = (+t4.t1+t1.t4) No new state computed
Name = (+t10.t5+t5.t10) No new state computed
Name = +t9 No new state computed
Name = +t4 No new state computed
Name = (+t12.t9+t9.t12) No new state computed
Name = +t13 No new state computed
Name = (+t10.t7+t7.t10) No new state computed
Name = +t11 No new state computed
Name = (+t13.t12+t12.t13) No new state computed
Name = (+t6.t4+t4.t6) No new state computed
Name = +t2 No new state computed
Name = (+t2.t1+t1.t2) No new state computed
Name = +t3 No new state computed
Name = (+t9.t8+t8.t9) No new state computed
Name = (+t6.t3+t3.t6)  I.N.C.R.E.A.S.E
Name = (+t6.t5+t5.t6)  I.N.C.R.E.A.S.E
Name = (+t9.t4+t4.t9) No new state computed
Name = (+t11.t10+t10.t11) No new state computed
Name = +t10 No new state computed
Name = (+t5.t1+t1.t5) No new state computed
Name = +t8 No new state computed
Name = (+t6.t2+t2.t6) No new state computed
Name = +t6  I.N.C.R.E.A.S.E
Name = (+t8.t7+t7.t8) No new state computed
Name = (+t10.t3+t3.t10) No new state computed
Name = +t5 No new state computed
increase = 1
**********************
Random choose
Name = +t6  OK !
Now we have a representation of size = 69
Minimization in Progress
Name = (+t3.t1+t1.t3)  I.N.C.R.E.A.S.E
Name = (+t13.t12+t12.t13) No new state computed
Name = +t5 No new state computed
Name = (+t6.t4+t4.t6) No new state computed
Name = (+t6.t3+t3.t6)  I.N.C.R.E.A.S.E
Name = (+t10.t5+t5.t10) No new state computed
Name = (+t12.t9+t9.t12) No new state computed
Name = +t11 No new state computed
Name = +t8 No new state computed
Name = (+t10.t7+t7.t10) No new state computed
Name = +t4 No new state computed
Name = (+t5.t1+t1.t5) No new state computed
Name = (+t13.t11+t11.t13) No new state computed
Name = (+t8.t7+t7.t8) No new state computed
Name = (+t9.t8+t8.t9) No new state computed
Name = (+t6.t2+t2.t6) No new state computed
Name = (+t10.t9+t9.t10) No new state computed
Name = +t9 No new state computed
Name = (+t6.t5+t5.t6) No new state computed
Name = (+t9.t2+t2.t9) No new state computed
Name = (+t4.t1+t1.t4) No new state computed
Name = (+t11.t10+t10.t11) No new state computed
Name = (+t2.t1+t1.t2) No new state computed
Name = +t7 No new state computed
Name = +t12 No new state computed
Name = (+t10.t3+t3.t10)  I.N.C.R.E.A.S.E
Name = +t3  I.N.C.R.E.A.S.E
Name = (+t5.t2+t4.t3+t3.t4+t2.t5) No new state computed
Name = +t13 No new state computed
Name = +t2 No new state computed
Name = +t1 No new state computed
Name = +t10 No new state computed
Name = (+t9.t4+t4.t9) No new state computed
increase = 1
**********************
Random choose
Name = +t3  OK !
Now we have a representation of size = 74
Minimization in Progress
Name = (+t5.t1+t1.t5) No new state computed
Name = (+t9.t8+t8.t9) No new state computed
Name = (+t6.t5+t5.t6) No new state computed
Name = (+t6.t3+t3.t6) No new state computed
Name = (+t11.t10+t10.t11) No new state computed
Name = +t7 No new state computed
Name = +t12 No new state computed
Name = (+t8.t7+t7.t8) No new state computed
Name = (+t4.t1+t1.t4) No new state computed
Name = (+t3.t1+t1.t3)  OK !
Now we have a representation of size = 73
Name = (+t10.t9+t9.t10) No new state computed
Name = (+t6.t3+t3.t6) No new state computed
Name = +t4 No new state computed
Name = +t1 No new state computed
Name = (+t11.t10+t10.t11) No new state computed
Name = +t6 No new state computed
Name = +t8 No new state computed
Name = +t13 No new state computed
Name = (+t5.t1+t1.t5) No new state computed
Name = (+t2.t1+t1.t2) No new state computed
Name = (+t13.t11+t11.t13) No new state computed
Name = (+t10.t3+t3.t10) No new state computed
Name = (+t10.t7+t7.t10) No new state computed
Name = +t11 No new state computed
Name = +t7 No new state computed
Name = (+t6.t5+t5.t6) No new state computed
Name = (+t6.t2+t2.t6) No new state computed
Name = (+t4.t1+t1.t4) No new state computed
Name = +t3 No new state computed
Name = +t2 No new state computed
Name = (+t13.t12+t12.t13) No new state computed
Name = +t12 No new state computed
Name = +t5 No new state computed
Name = +t9 No new state computed
Name = (+t9.t8+t8.t9) No new state computed
Name = (+t5.t2+t4.t3+t3.t4+t2.t5) No new state computed
Name = (+t9.t2+t2.t9) No new state computed
Name = (+t9.t4+t4.t9) No new state computed
Name = (+t6.t4+t4.t6) No new state computed
Name = (+t8.t7+t7.t8) No new state computed
Name = (+t12.t9+t9.t12) No new state computed
Name = (+t10.t5+t5.t10) No new state computed
Name = +t10 No new state computed
increase = 0
nb accelerations 10
Fix point FOUND
seed is : 3284
