current set encoding is : prestaf
seed is : 2691
cycles of length 1
(1/22), name = r1, size = 1458
(2/22), name = r2, size = 679
(3/22), name = r3, size = 1452
(4/22), name = r4, size = 679
(5/22), name = r5, size = 1482
(6/22), name = r6, size = 703
(7/22), name = r7, size = 703
(8/22), name = r8, size = 679
(9/22), name = r9, size = 1524
(10/22), name = r10, size = 679
(11/22), name = r11, size = 1512
(12/22), name = r12, size = 1530
(13/22), name = r13, size = 679
(14/22), name = r14, size = 1698
(15/22), name = r15, size = 679
(16/22), name = r16, size = 1578
(17/22), name = r17, size = 703
(18/22), name = r18, size = 703
(19/22), name = r19, size = 679
(20/22), name = r20, size = 1770
(21/22), name = r21, size = 679
(22/22), name = r22, size = 1746
**********************
Random choose
Name = r9  No new state computed
Name = r2  No new state computed
Name = r22  No new state computed
Name = r17  No new state computed
Name = r20  No new state computed
Name = r13  No new state computed
Name = r16  No new state computed
Name = r14  No new state computed
Name = r1  OK !
Now we have a representation of size = 18
Minimization in Progress
Name = r7 No new state computed
Name = r9 No new state computed
Name = r3 No new state computed
Name = r17 No new state computed
Name = r6 No new state computed
Name = r21 No new state computed
Name = r18 No new state computed
Name = r10 No new state computed
Name = r20 No new state computed
Name = r22 No new state computed
Name = r16 No new state computed
Name = r8 No new state computed
Name = r4 No new state computed
Name = r14 No new state computed
Name = r15 No new state computed
Name = r5 No new state computed
Name = r11 No new state computed
Name = r19 No new state computed
Name = r2  I.N.C.R.E.A.S.E
Name = r13 No new state computed
Name = r12  I.N.C.R.E.A.S.E
increase = 1
**********************
Random choose
Name = r12  OK !
Now we have a representation of size = 38
Minimization in Progress
Name = r4 No new state computed
Name = r2  I.N.C.R.E.A.S.E
Name = r13  I.N.C.R.E.A.S.E
Name = r11 No new state computed
Name = r17  I.N.C.R.E.A.S.E
Name = r20 No new state computed
Name = r5 No new state computed
Name = r14 No new state computed
Name = r19 No new state computed
Name = r15 No new state computed
Name = r21 No new state computed
Name = r22 No new state computed
Name = r10 No new state computed
Name = r16 No new state computed
Name = r9 No new state computed
Name = r6  I.N.C.R.E.A.S.E
Name = r3 No new state computed
Name = r8 No new state computed
Name = r18 No new state computed
Name = r7 No new state computed
Name = r1 No new state computed
increase = 1
**********************
Random choose
Name = r6  OK !
Now we have a representation of size = 41
Minimization in Progress
Name = r7 No new state computed
Name = r1 No new state computed
Name = r17  I.N.C.R.E.A.S.E
Name = r20 No new state computed
Name = r13  I.N.C.R.E.A.S.E
Name = r14 No new state computed
Name = r9 No new state computed
Name = r4 No new state computed
Name = r8 No new state computed
Name = r2  I.N.C.R.E.A.S.E
Name = r5 No new state computed
Name = r21 No new state computed
Name = r10 No new state computed
Name = r19 No new state computed
Name = r11 No new state computed
Name = r22 No new state computed
Name = r12 No new state computed
Name = r3 No new state computed
Name = r16 No new state computed
Name = r15 No new state computed
Name = r18 No new state computed
increase = 1
**********************
Random choose
Name = r2  OK !
Now we have a representation of size = 42
Minimization in Progress
Name = r5 No new state computed
Name = r4 No new state computed
Name = r22 No new state computed
Name = r17  I.N.C.R.E.A.S.E
Name = r19 No new state computed
Name = r11 No new state computed
Name = r6 No new state computed
Name = r10 No new state computed
Name = r20 No new state computed
Name = r21 No new state computed
Name = r16 No new state computed
Name = r13  I.N.C.R.E.A.S.E
Name = r18 No new state computed
Name = r1 No new state computed
Name = r8 No new state computed
Name = r7 No new state computed
Name = r3  I.N.C.R.E.A.S.E
Name = r9 No new state computed
Name = r14 No new state computed
Name = r12  OK !
Now we have a representation of size = 42
Name = r15 No new state computed
Name = r7 No new state computed
Name = r9 No new state computed
Name = r13  I.N.C.R.E.A.S.E
Name = r17  I.N.C.R.E.A.S.E
Name = r5 No new state computed
Name = r21 No new state computed
Name = r19 No new state computed
Name = r2 No new state computed
Name = r8 No new state computed
Name = r6 No new state computed
Name = r3  I.N.C.R.E.A.S.E
Name = r22 No new state computed
Name = r11 No new state computed
Name = r18 No new state computed
Name = r14 No new state computed
Name = r20 No new state computed
Name = r10 No new state computed
Name = r16 No new state computed
Name = r4 No new state computed
Name = r1 No new state computed
increase = 1
**********************
Random choose
Name = r3  OK !
Now we have a representation of size = 57
Minimization in Progress
Name = r11 No new state computed
Name = r19 No new state computed
Name = r22 No new state computed
Name = r10 No new state computed
Name = r17  I.N.C.R.E.A.S.E
Name = r4 No new state computed
Name = r2 No new state computed
Name = r16 No new state computed
Name = r12 No new state computed
Name = r18 No new state computed
Name = r13  I.N.C.R.E.A.S.E
Name = r20 No new state computed
Name = r21 No new state computed
Name = r5  I.N.C.R.E.A.S.E
Name = r15 No new state computed
Name = r14 No new state computed
Name = r9 No new state computed
Name = r6 No new state computed
Name = r7 No new state computed
Name = r1 No new state computed
Name = r8 No new state computed
increase = 1
**********************
Random choose
Name = r5  OK !
Now we have a representation of size = 70
Minimization in Progress
Name = r20 No new state computed
Name = r19 No new state computed
Name = r21 No new state computed
Name = r3 No new state computed
Name = r14 No new state computed
Name = r22 No new state computed
Name = r11 No new state computed
Name = r16 No new state computed
Name = r12 No new state computed
Name = r8 No new state computed
Name = r10 No new state computed
Name = r13  I.N.C.R.E.A.S.E
Name = r7 No new state computed
Name = r18 No new state computed
Name = r6 No new state computed
Name = r9 No new state computed
Name = r15 No new state computed
Name = r4 No new state computed
Name = r17  I.N.C.R.E.A.S.E
Name = r1  I.N.C.R.E.A.S.E
Name = r2 No new state computed
increase = 1
**********************
Random choose
Name = r1  OK !
Now we have a representation of size = 72
Minimization in Progress
Name = r22 No new state computed
Name = r11 No new state computed
Name = r9 No new state computed
Name = r5 No new state computed
Name = r21 No new state computed
Name = r16 No new state computed
Name = r2  OK !
Now we have a representation of size = 72
Name = r15 No new state computed
Name = r4 No new state computed
Name = r9 No new state computed
Name = r11 No new state computed
Name = r22 No new state computed
Name = r7 No new state computed
Name = r18 No new state computed
Name = r13  I.N.C.R.E.A.S.E
Name = r19 No new state computed
Name = r6  I.N.C.R.E.A.S.E
Name = r3 No new state computed
Name = r12  OK !
Now we have a representation of size = 72
Name = r1 No new state computed
Name = r21 No new state computed
Name = r7 No new state computed
Name = r14 No new state computed
Name = r19 No new state computed
Name = r2 No new state computed
Name = r11 No new state computed
Name = r22 No new state computed
Name = r20 No new state computed
Name = r17  I.N.C.R.E.A.S.E
Name = r16 No new state computed
Name = r10 No new state computed
Name = r6  I.N.C.R.E.A.S.E
Name = r5 No new state computed
Name = r3 No new state computed
Name = r8 No new state computed
Name = r4 No new state computed
Name = r15 No new state computed
Name = r18 No new state computed
Name = r13  I.N.C.R.E.A.S.E
Name = r9 No new state computed
increase = 1
**********************
Random choose
Name = r13  OK !
Now we have a representation of size = 81
Minimization in Progress
Name = r7 No new state computed
Name = r19 No new state computed
Name = r22 No new state computed
Name = r20 No new state computed
Name = r12 No new state computed
Name = r9 No new state computed
Name = r6  I.N.C.R.E.A.S.E
Name = r2 No new state computed
Name = r10 No new state computed
Name = r17  I.N.C.R.E.A.S.E
Name = r14  I.N.C.R.E.A.S.E
Name = r8 No new state computed
Name = r3 No new state computed
Name = r21 No new state computed
Name = r1  I.N.C.R.E.A.S.E
Name = r16 No new state computed
Name = r15  I.N.C.R.E.A.S.E
Name = r4 No new state computed
Name = r11 No new state computed
Name = r18 No new state computed
Name = r5 No new state computed
increase = 1
**********************
Random choose
Name = r15  OK !
Now we have a representation of size = 83
Minimization in Progress
Name = r8 No new state computed
Name = r14 No new state computed
Name = r13 No new state computed
Name = r20 No new state computed
Name = r9 No new state computed
Name = r6  I.N.C.R.E.A.S.E
Name = r3 No new state computed
Name = r16 No new state computed
Name = r17  I.N.C.R.E.A.S.E
Name = r19 No new state computed
Name = r21 No new state computed
Name = r7 No new state computed
Name = r4 No new state computed
Name = r22 No new state computed
Name = r2 No new state computed
Name = r18 No new state computed
Name = r12 No new state computed
Name = r10 No new state computed
Name = r5 No new state computed
Name = r11 No new state computed
Name = r1  I.N.C.R.E.A.S.E
increase = 1
**********************
Random choose
Name = r1  OK !
Now we have a representation of size = 95
Minimization in Progress
Name = r9 No new state computed
Name = r20 No new state computed
Name = r6  I.N.C.R.E.A.S.E
Name = r21 No new state computed
Name = r5 No new state computed
Name = r14 No new state computed
Name = r7 No new state computed
Name = r10 No new state computed
Name = r13 No new state computed
Name = r19 No new state computed
Name = r22 No new state computed
Name = r15 No new state computed
Name = r2 No new state computed
Name = r16 No new state computed
Name = r18 No new state computed
Name = r3 No new state computed
Name = r17  I.N.C.R.E.A.S.E
Name = r12 No new state computed
Name = r11 No new state computed
Name = r8 No new state computed
Name = r4 No new state computed
increase = 1
**********************
Random choose
Name = r17  OK !
Now we have a representation of size = 105
Minimization in Progress
Name = r22 No new state computed
Name = r3 No new state computed
Name = r11 No new state computed
Name = r1 No new state computed
Name = r18 No new state computed
Name = r6  I.N.C.R.E.A.S.E
Name = r16 No new state computed
Name = r10 No new state computed
Name = r21 No new state computed
Name = r14 No new state computed
Name = r13 No new state computed
Name = r12 No new state computed
Name = r19  I.N.C.R.E.A.S.E
Name = r5  OK !
Now we have a representation of size = 103
Name = r6  I.N.C.R.E.A.S.E
Name = r19  I.N.C.R.E.A.S.E
Name = r1 No new state computed
Name = r18 No new state computed
Name = r16 No new state computed
Name = r9 No new state computed
Name = r20 No new state computed
Name = r17 No new state computed
Name = r14 No new state computed
Name = r10 No new state computed
Name = r13 No new state computed
Name = r2 No new state computed
Name = r8 No new state computed
Name = r3 No new state computed
Name = r11 No new state computed
Name = r4 No new state computed
Name = r7 No new state computed
Name = r15 No new state computed
Name = r22 No new state computed
Name = r21 No new state computed
Name = r12 No new state computed
increase = 1
**********************
Random choose
Name = r19  OK !
Now we have a representation of size = 108
Minimization in Progress
Name = r16 No new state computed
Name = r8 No new state computed
Name = r10 No new state computed
Name = r20  I.N.C.R.E.A.S.E
Name = r18 No new state computed
Name = r5 No new state computed
Name = r17 No new state computed
Name = r6  I.N.C.R.E.A.S.E
Name = r21 No new state computed
Name = r1 No new state computed
Name = r15 No new state computed
Name = r4 No new state computed
Name = r12 No new state computed
Name = r14 No new state computed
Name = r2 No new state computed
Name = r22 No new state computed
Name = r11 No new state computed
Name = r13 No new state computed
Name = r9 No new state computed
Name = r3  I.N.C.R.E.A.S.E
Name = r7 No new state computed
increase = 1
**********************
Random choose
Name = r3  OK !
Now we have a representation of size = 114
Minimization in Progress
Name = r11 No new state computed
Name = r6  I.N.C.R.E.A.S.E
Name = r17 No new state computed
Name = r15 No new state computed
Name = r18 No new state computed
Name = r20  I.N.C.R.E.A.S.E
Name = r19 No new state computed
Name = r8 No new state computed
Name = r16 No new state computed
Name = r2 No new state computed
Name = r4 No new state computed
Name = r9 No new state computed
Name = r13 No new state computed
Name = r10 No new state computed
Name = r12 No new state computed
Name = r14 No new state computed
Name = r7 No new state computed
Name = r22 No new state computed
Name = r1 No new state computed
Name = r21 No new state computed
Name = r5  I.N.C.R.E.A.S.E
increase = 1
**********************
Random choose
Name = r5  OK !
Now we have a representation of size = 118
Minimization in Progress
Name = r13 No new state computed
Name = r9 No new state computed
Name = r18 No new state computed
Name = r15 No new state computed
Name = r1  OK !
Now we have a representation of size = 114
Name = r13 No new state computed
Name = r14 No new state computed
Name = r7 No new state computed
Name = r2 No new state computed
Name = r5 No new state computed
Name = r21 No new state computed
Name = r6  I.N.C.R.E.A.S.E
Name = r3 No new state computed
Name = r9 No new state computed
Name = r20  I.N.C.R.E.A.S.E
Name = r15 No new state computed
Name = r11 No new state computed
Name = r19 No new state computed
Name = r8 No new state computed
Name = r17 No new state computed
Name = r22 No new state computed
Name = r4 No new state computed
Name = r18 No new state computed
Name = r12 No new state computed
Name = r16 No new state computed
Name = r10 No new state computed
increase = 1
**********************
Random choose
Name = r20  OK !
Now we have a representation of size = 144
Minimization in Progress
Name = r1 No new state computed
Name = r12 No new state computed
Name = r10 No new state computed
Name = r6  I.N.C.R.E.A.S.E
Name = r16 No new state computed
Name = r21  I.N.C.R.E.A.S.E
Name = r11 No new state computed
Name = r22 No new state computed
Name = r14 No new state computed
Name = r9 No new state computed
Name = r5 No new state computed
Name = r18 No new state computed
Name = r17 No new state computed
Name = r15 No new state computed
Name = r19 No new state computed
Name = r7 No new state computed
Name = r8 No new state computed
Name = r4 No new state computed
Name = r2  OK !
Now we have a representation of size = 144
Name = r3 No new state computed
Name = r10 No new state computed
Name = r21  I.N.C.R.E.A.S.E
Name = r16 No new state computed
Name = r8 No new state computed
Name = r14 No new state computed
Name = r15 No new state computed
Name = r19 No new state computed
Name = r22 No new state computed
Name = r9 No new state computed
Name = r13 No new state computed
Name = r4 No new state computed
Name = r7 No new state computed
Name = r6  I.N.C.R.E.A.S.E
Name = r17 No new state computed
Name = r1 No new state computed
Name = r20 No new state computed
Name = r5 No new state computed
Name = r18 No new state computed
Name = r12 No new state computed
Name = r11 No new state computed
increase = 1
**********************
Random choose
Name = r6  OK !
Now we have a representation of size = 145
Minimization in Progress
Name = r11 No new state computed
Name = r18 No new state computed
Name = r7 No new state computed
Name = r21  I.N.C.R.E.A.S.E
Name = r19 No new state computed
Name = r3 No new state computed
Name = r17 No new state computed
Name = r4 No new state computed
Name = r2 No new state computed
Name = r12 No new state computed
Name = r5 No new state computed
Name = r15 No new state computed
Name = r1 No new state computed
Name = r16  I.N.C.R.E.A.S.E
Name = r9 No new state computed
Name = r22 No new state computed
Name = r13 No new state computed
Name = r10 No new state computed
Name = r14 No new state computed
Name = r20  I.N.C.R.E.A.S.E
Name = r8  I.N.C.R.E.A.S.E
increase = 1
**********************
Random choose
Name = r8  OK !
Now we have a representation of size = 146
Minimization in Progress
Name = r9  I.N.C.R.E.A.S.E
Name = r14  I.N.C.R.E.A.S.E
Name = r1 No new state computed
Name = r4 No new state computed
Name = r13 No new state computed
Name = r11 No new state computed
Name = r19 No new state computed
Name = r22 No new state computed
Name = r2 No new state computed
Name = r10 No new state computed
Name = r15 No new state computed
Name = r12 No new state computed
Name = r17 No new state computed
Name = r5 No new state computed
Name = r3 No new state computed
Name = r21  I.N.C.R.E.A.S.E
Name = r16  I.N.C.R.E.A.S.E
Name = r7 No new state computed
Name = r6 No new state computed
Name = r20  I.N.C.R.E.A.S.E
Name = r18 No new state computed
increase = 1
**********************
Random choose
Name = r20  OK !
Now we have a representation of size = 148
Minimization in Progress
Name = r1 No new state computed
Name = r4 No new state computed
Name = r5 No new state computed
Name = r2 No new state computed
Name = r18 No new state computed
Name = r8 No new state computed
Name = r22 No new state computed
Name = r3 No new state computed
Name = r6 No new state computed
Name = r7 No new state computed
Name = r13 No new state computed
Name = r17 No new state computed
Name = r11 No new state computed
Name = r9  I.N.C.R.E.A.S.E
Name = r16  I.N.C.R.E.A.S.E
Name = r10 No new state computed
Name = r15 No new state computed
Name = r12 No new state computed
Name = r21  I.N.C.R.E.A.S.E
Name = r19 No new state computed
Name = r14  I.N.C.R.E.A.S.E
increase = 1
**********************
Random choose
Name = r14  OK !
Now we have a representation of size = 154
Minimization in Progress
Name = r7 No new state computed
Name = r16  I.N.C.R.E.A.S.E
Name = r19 No new state computed
Name = r12 No new state computed
Name = r1 No new state computed
Name = r17 No new state computed
Name = r4 No new state computed
Name = r21  I.N.C.R.E.A.S.E
Name = r2 No new state computed
Name = r3 No new state computed
Name = r6 No new state computed
Name = r18 No new state computed
Name = r5 No new state computed
Name = r9  I.N.C.R.E.A.S.E
Name = r10 No new state computed
Name = r11 No new state computed
Name = r8 No new state computed
Name = r13 No new state computed
Name = r15 No new state computed
Name = r20 No new state computed
Name = r22 No new state computed
increase = 1
**********************
Random choose
Name = r9  OK !
Now we have a representation of size = 180
Minimization in Progress
Name = r12 No new state computed
Name = r20 No new state computed
Name = r15 No new state computed
Name = r7 No new state computed
Name = r4 No new state computed
Name = r22 No new state computed
Name = r11 No new state computed
Name = r8 No new state computed
Name = r3 No new state computed
Name = r2 No new state computed
Name = r10  I.N.C.R.E.A.S.E
Name = r19 No new state computed
Name = r1 No new state computed
Name = r17 No new state computed
Name = r18 No new state computed
Name = r16  I.N.C.R.E.A.S.E
Name = r14 No new state computed
Name = r21  I.N.C.R.E.A.S.E
Name = r6 No new state computed
Name = r5 No new state computed
Name = r13 No new state computed
increase = 1
**********************
Random choose
Name = r21  OK !
Now we have a representation of size = 184
Minimization in Progress
Name = r10  I.N.C.R.E.A.S.E
Name = r22 No new state computed
Name = r11 No new state computed
Name = r14 No new state computed
Name = r9 No new state computed
Name = r6 No new state computed
Name = r4 No new state computed
Name = r13 No new state computed
Name = r20 No new state computed
Name = r15 No new state computed
Name = r5 No new state computed
Name = r8 No new state computed
Name = r1 No new state computed
Name = r7 No new state computed
Name = r18 No new state computed
Name = r12 No new state computed
Name = r3 No new state computed
Name = r19 No new state computed
Name = r16  I.N.C.R.E.A.S.E
Name = r2 No new state computed
Name = r17 No new state computed
increase = 1
**********************
Random choose
Name = r16  OK !
Now we have a representation of size = 187
Minimization in Progress
Name = r14 No new state computed
Name = r21 No new state computed
Name = r17 No new state computed
Name = r11 No new state computed
Name = r20 No new state computed
Name = r10  I.N.C.R.E.A.S.E
Name = r1 No new state computed
Name = r19 No new state computed
Name = r8 No new state computed
Name = r12  I.N.C.R.E.A.S.E
Name = r5 No new state computed
Name = r15 No new state computed
Name = r18 No new state computed
Name = r2 No new state computed
Name = r4 No new state computed
Name = r6 No new state computed
Name = r3 No new state computed
Name = r13 No new state computed
Name = r7 No new state computed
Name = r9 No new state computed
Name = r22 No new state computed
increase = 1
**********************
Random choose
Name = r12  OK !
Now we have a representation of size = 189
Minimization in Progress
Name = r8 No new state computed
Name = r15 No new state computed
Name = r22 No new state computed
Name = r7 No new state computed
Name = r5 No new state computed
Name = r3 No new state computed
Name = r14 No new state computed
Name = r20 No new state computed
Name = r10  I.N.C.R.E.A.S.E
Name = r16 No new state computed
Name = r18 No new state computed
Name = r17  I.N.C.R.E.A.S.E
Name = r1 No new state computed
Name = r2 No new state computed
Name = r21 No new state computed
Name = r13  OK !
Now we have a representation of size = 187
Name = r5 No new state computed
Name = r4 No new state computed
Name = r21 No new state computed
Name = r20 No new state computed
Name = r10  I.N.C.R.E.A.S.E
Name = r19 No new state computed
Name = r11 No new state computed
Name = r15 No new state computed
Name = r14 No new state computed
Name = r8 No new state computed
Name = r2 No new state computed
Name = r3 No new state computed
Name = r17  OK !
Now we have a representation of size = 186
Name = r18 No new state computed
Name = r2 No new state computed
Name = r12 No new state computed
Name = r10  I.N.C.R.E.A.S.E
Name = r19  I.N.C.R.E.A.S.E
Name = r16 No new state computed
Name = r22 No new state computed
Name = r15 No new state computed
Name = r11 No new state computed
Name = r21 No new state computed
Name = r6 No new state computed
Name = r1 No new state computed
Name = r3 No new state computed
Name = r8 No new state computed
Name = r20 No new state computed
Name = r9  I.N.C.R.E.A.S.E
Name = r14 No new state computed
Name = r4 No new state computed
Name = r13 No new state computed
Name = r5 No new state computed
Name = r7 No new state computed
increase = 1
**********************
Random choose
Name = r9  OK !
Now we have a representation of size = 190
Minimization in Progress
Name = r19  OK !
Now we have a representation of size = 190
Name = r20  I.N.C.R.E.A.S.E
Name = r8 No new state computed
Name = r12 No new state computed
Name = r22 No new state computed
Name = r4 No new state computed
Name = r17 No new state computed
Name = r13 No new state computed
Name = r6 No new state computed
Name = r14 No new state computed
Name = r21 No new state computed
Name = r15 No new state computed
Name = r1 No new state computed
Name = r2 No new state computed
Name = r9 No new state computed
Name = r7 No new state computed
Name = r10  I.N.C.R.E.A.S.E
Name = r5 No new state computed
Name = r16 No new state computed
Name = r3 No new state computed
Name = r11 No new state computed
Name = r18 No new state computed
increase = 1
**********************
Random choose
Name = r10  OK !
Now we have a representation of size = 191
Minimization in Progress
Name = r2 No new state computed
Name = r9 No new state computed
Name = r19 No new state computed
Name = r11 No new state computed
Name = r18 No new state computed
Name = r13 No new state computed
Name = r5 No new state computed
Name = r14 No new state computed
Name = r12 No new state computed
Name = r3 No new state computed
Name = r22 No new state computed
Name = r16 No new state computed
Name = r8 No new state computed
Name = r15 No new state computed
Name = r17 No new state computed
Name = r1 No new state computed
Name = r21 No new state computed
Name = r4 No new state computed
Name = r20  I.N.C.R.E.A.S.E
Name = r7 No new state computed
Name = r6 No new state computed
increase = 1
**********************
Random choose
Name = r20  OK !
Now we have a representation of size = 200
Minimization in Progress
Name = r11 No new state computed
Name = r4 No new state computed
Name = r9 No new state computed
Name = r19 No new state computed
Name = r22 No new state computed
Name = r6 No new state computed
Name = r5 No new state computed
Name = r14 No new state computed
Name = r21 No new state computed
Name = r2 No new state computed
Name = r1 No new state computed
Name = r3 No new state computed
Name = r13 No new state computed
Name = r15 No new state computed
Name = r7 No new state computed
Name = r16 No new state computed
Name = r8 No new state computed
Name = r17 No new state computed
Name = r10 No new state computed
Name = r18 No new state computed
Name = r12 No new state computed
increase = 0
nb accelerations 35
Fix point FOUND
seed is : 2691
