current set encoding is : prestaf
seed is : 3284
cycles of length 1
(1/14), name = t1, size = 284
(2/14), name = t2, size = 1470
(3/14), name = t3, size = 2835
(4/14), name = t4, size = 1440
(5/14), name = t5, size = 665
(6/14), name = t6, size = 938
(7/14), name = t7, size = 1494
(8/14), name = t8, size = 284
(9/14), name = t9, size = 1218
(10/14), name = t10, size = 2331
(11/14), name = t11, size = 1188
(12/14), name = t12, size = 694
(13/14), name = t13, size = 938
(14/14), name = t14, size = 1242
**********************
Random choose
Name = t6  No new state computed
Name = t7  No new state computed
Name = t11  No new state computed
Name = t3  No new state computed
Name = t9  No new state computed
Name = t2  No new state computed
Name = t1  OK !
Now we have a representation of size = 49
Minimization in Progress
Name = t5 No new state computed
Name = t9 No new state computed
Name = t14 No new state computed
Name = t11 No new state computed
Name = t2  I.N.C.R.E.A.S.E
Name = t8  I.N.C.R.E.A.S.E
Name = t10 No new state computed
Name = t3 No new state computed
Name = t6 No new state computed
Name = t12 No new state computed
Name = t13 No new state computed
Name = t4 No new state computed
Name = t7 No new state computed
increase = 1
**********************
Random choose
Name = t8  OK !
Now we have a representation of size = 69
Minimization in Progress
Name = t9  I.N.C.R.E.A.S.E
Name = t5 No new state computed
Name = t3 No new state computed
Name = t4 No new state computed
Name = t13 No new state computed
Name = t7 No new state computed
Name = t14 No new state computed
Name = t1 No new state computed
Name = t10 No new state computed
Name = t6 No new state computed
Name = t12 No new state computed
Name = t11 No new state computed
Name = t2  I.N.C.R.E.A.S.E
increase = 1
**********************
Random choose
Name = t2  OK !
Now we have a representation of size = 93
Minimization in Progress
Name = t1 No new state computed
Name = t4 No new state computed
Name = t7 No new state computed
Name = t14 No new state computed
Name = t12 No new state computed
Name = t8 No new state computed
Name = t11 No new state computed
Name = t3  I.N.C.R.E.A.S.E
Name = t5 No new state computed
Name = t13 No new state computed
Name = t9  I.N.C.R.E.A.S.E
Name = t10 No new state computed
Name = t6 No new state computed
increase = 1
**********************
Random choose
Name = t9  OK !
Now we have a representation of size = 102
Minimization in Progress
Name = t10 No new state computed
Name = t5 No new state computed
Name = t12  I.N.C.R.E.A.S.E
Name = t11 No new state computed
Name = t13 No new state computed
Name = t1 No new state computed
Name = t6 No new state computed
Name = t4 No new state computed
Name = t3  I.N.C.R.E.A.S.E
Name = t14 No new state computed
Name = t2 No new state computed
Name = t8 No new state computed
Name = t7 No new state computed
increase = 1
**********************
Random choose
Name = t3  OK !
Now we have a representation of size = 109
Minimization in Progress
Name = t2  I.N.C.R.E.A.S.E
Name = t7 No new state computed
Name = t11 No new state computed
Name = t13 No new state computed
Name = t14 No new state computed
Name = t8 No new state computed
Name = t4 No new state computed
Name = t6 No new state computed
Name = t1 No new state computed
Name = t12  I.N.C.R.E.A.S.E
Name = t9  OK !
Now we have a representation of size = 103
Name = t1 No new state computed
Name = t2  I.N.C.R.E.A.S.E
Name = t14 No new state computed
Name = t13 No new state computed
Name = t4 No new state computed
Name = t6 No new state computed
Name = t5 No new state computed
Name = t10 No new state computed
Name = t8 No new state computed
Name = t11 No new state computed
Name = t12  I.N.C.R.E.A.S.E
Name = t3 No new state computed
Name = t7 No new state computed
increase = 1
**********************
Random choose
Name = t12  OK !
Now we have a representation of size = 112
Minimization in Progress
Name = t5 No new state computed
Name = t3 No new state computed
Name = t6 No new state computed
Name = t2  I.N.C.R.E.A.S.E
Name = t7 No new state computed
Name = t9 No new state computed
Name = t8 No new state computed
Name = t13  I.N.C.R.E.A.S.E
Name = t10 No new state computed
Name = t4 No new state computed
Name = t14 No new state computed
Name = t11 No new state computed
Name = t1 No new state computed
increase = 1
**********************
Random choose
Name = t13  OK !
Now we have a representation of size = 134
Minimization in Progress
Name = t5 No new state computed
Name = t7 No new state computed
Name = t10 No new state computed
Name = t2  I.N.C.R.E.A.S.E
Name = t4 No new state computed
Name = t12 No new state computed
Name = t3 No new state computed
Name = t1 No new state computed
Name = t14  I.N.C.R.E.A.S.E
Name = t8 No new state computed
Name = t9 No new state computed
Name = t11 No new state computed
Name = t6 No new state computed
increase = 1
**********************
Random choose
Name = t14  OK !
Now we have a representation of size = 176
Minimization in Progress
Name = t12 No new state computed
Name = t6 No new state computed
Name = t13 No new state computed
Name = t5 No new state computed
Name = t10 No new state computed
Name = t7 No new state computed
Name = t9  I.N.C.R.E.A.S.E
Name = t1 No new state computed
Name = t8 No new state computed
Name = t2  I.N.C.R.E.A.S.E
Name = t3 No new state computed
Name = t4  I.N.C.R.E.A.S.E
Name = t11 No new state computed
increase = 1
**********************
Random choose
Name = t4  OK !
Now we have a representation of size = 184
Minimization in Progress
Name = t14 No new state computed
Name = t8 No new state computed
Name = t1 No new state computed
Name = t10 No new state computed
Name = t13 No new state computed
Name = t9  OK !
Now we have a representation of size = 184
Name = t7 No new state computed
Name = t4 No new state computed
Name = t13 No new state computed
Name = t14 No new state computed
Name = t2  I.N.C.R.E.A.S.E
Name = t8 No new state computed
Name = t11 No new state computed
Name = t1 No new state computed
Name = t12 No new state computed
Name = t5  I.N.C.R.E.A.S.E
Name = t10  I.N.C.R.E.A.S.E
Name = t3 No new state computed
Name = t6 No new state computed
increase = 1
**********************
Random choose
Name = t10  OK !
Now we have a representation of size = 188
Minimization in Progress
Name = t1 No new state computed
Name = t13 No new state computed
Name = t2  I.N.C.R.E.A.S.E
Name = t7 No new state computed
Name = t8 No new state computed
Name = t14 No new state computed
Name = t5  I.N.C.R.E.A.S.E
Name = t9  I.N.C.R.E.A.S.E
Name = t11 No new state computed
Name = t6 No new state computed
Name = t4  I.N.C.R.E.A.S.E
Name = t12 No new state computed
Name = t3 No new state computed
increase = 1
**********************
Random choose
Name = t4  OK !
Now we have a representation of size = 190
Minimization in Progress
Name = t14 No new state computed
Name = t6 No new state computed
Name = t8 No new state computed
Name = t7 No new state computed
Name = t9  I.N.C.R.E.A.S.E
Name = t2  I.N.C.R.E.A.S.E
Name = t10 No new state computed
Name = t3 No new state computed
Name = t1 No new state computed
Name = t5  I.N.C.R.E.A.S.E
Name = t11 No new state computed
Name = t13 No new state computed
Name = t12 No new state computed
increase = 1
**********************
Random choose
Name = t5  OK !
Now we have a representation of size = 205
Minimization in Progress
Name = t1 No new state computed
Name = t10 No new state computed
Name = t8 No new state computed
Name = t6  I.N.C.R.E.A.S.E
Name = t4 No new state computed
Name = t12 No new state computed
Name = t9  I.N.C.R.E.A.S.E
Name = t7 No new state computed
Name = t2  I.N.C.R.E.A.S.E
Name = t14 No new state computed
Name = t11 No new state computed
Name = t3 No new state computed
Name = t13 No new state computed
increase = 1
**********************
Random choose
Name = t2  OK !
Now we have a representation of size = 230
Minimization in Progress
Name = t9  I.N.C.R.E.A.S.E
Name = t6  I.N.C.R.E.A.S.E
Name = t10 No new state computed
Name = t1 No new state computed
Name = t14 No new state computed
Name = t11 No new state computed
Name = t4 No new state computed
Name = t12 No new state computed
Name = t7 No new state computed
Name = t13 No new state computed
Name = t8 No new state computed
Name = t5  OK !
Now we have a representation of size = 230
Name = t12 No new state computed
Name = t2 No new state computed
Name = t9  I.N.C.R.E.A.S.E
Name = t3  I.N.C.R.E.A.S.E
Name = t13 No new state computed
Name = t8 No new state computed
Name = t10 No new state computed
Name = t6  I.N.C.R.E.A.S.E
Name = t4 No new state computed
Name = t14 No new state computed
Name = t11 No new state computed
Name = t1 No new state computed
Name = t7 No new state computed
increase = 1
**********************
Random choose
Name = t6  OK !
Now we have a representation of size = 237
Minimization in Progress
Name = t13 No new state computed
Name = t9  I.N.C.R.E.A.S.E
Name = t10 No new state computed
Name = t4 No new state computed
Name = t7  I.N.C.R.E.A.S.E
Name = t1 No new state computed
Name = t8 No new state computed
Name = t12 No new state computed
Name = t5 No new state computed
Name = t14 No new state computed
Name = t11 No new state computed
Name = t2 No new state computed
Name = t3  I.N.C.R.E.A.S.E
increase = 1
**********************
Random choose
Name = t3  OK !
Now we have a representation of size = 244
Minimization in Progress
Name = t14 No new state computed
Name = t10 No new state computed
Name = t11 No new state computed
Name = t13 No new state computed
Name = t5 No new state computed
Name = t8 No new state computed
Name = t12 No new state computed
Name = t2 No new state computed
Name = t1 No new state computed
Name = t7  I.N.C.R.E.A.S.E
Name = t9  I.N.C.R.E.A.S.E
Name = t4 No new state computed
Name = t6 No new state computed
increase = 1
**********************
Random choose
Name = t9  OK !
Now we have a representation of size = 249
Minimization in Progress
Name = t11 No new state computed
Name = t5 No new state computed
Name = t10  I.N.C.R.E.A.S.E
Name = t3 No new state computed
Name = t8 No new state computed
Name = t7  I.N.C.R.E.A.S.E
Name = t14 No new state computed
Name = t4 No new state computed
Name = t1 No new state computed
Name = t13 No new state computed
Name = t6 No new state computed
Name = t12  I.N.C.R.E.A.S.E
Name = t2 No new state computed
increase = 1
**********************
Random choose
Name = t12  OK !
Now we have a representation of size = 252
Minimization in Progress
Name = t8 No new state computed
Name = t4 No new state computed
Name = t2 No new state computed
Name = t6 No new state computed
Name = t13  I.N.C.R.E.A.S.E
Name = t3 No new state computed
Name = t9 No new state computed
Name = t10  I.N.C.R.E.A.S.E
Name = t7  I.N.C.R.E.A.S.E
Name = t14 No new state computed
Name = t5 No new state computed
Name = t11 No new state computed
Name = t1 No new state computed
increase = 1
**********************
Random choose
Name = t7  OK !
Now we have a representation of size = 274
Minimization in Progress
Name = t13  I.N.C.R.E.A.S.E
Name = t6 No new state computed
Name = t3 No new state computed
Name = t5 No new state computed
Name = t9  I.N.C.R.E.A.S.E
Name = t1 No new state computed
Name = t12 No new state computed
Name = t10  I.N.C.R.E.A.S.E
Name = t2  OK !
Now we have a representation of size = 274
Name = t8 No new state computed
Name = t7 No new state computed
Name = t3  I.N.C.R.E.A.S.E
Name = t11  OK !
Now we have a representation of size = 274
Name = t10  I.N.C.R.E.A.S.E
Name = t14 No new state computed
Name = t12  OK !
Now we have a representation of size = 270
Name = t14 No new state computed
Name = t8 No new state computed
Name = t6 No new state computed
Name = t2 No new state computed
Name = t7 No new state computed
Name = t1 No new state computed
Name = t9  I.N.C.R.E.A.S.E
Name = t13  I.N.C.R.E.A.S.E
Name = t10  I.N.C.R.E.A.S.E
Name = t4 No new state computed
Name = t5 No new state computed
Name = t11 No new state computed
Name = t3  I.N.C.R.E.A.S.E
increase = 1
**********************
Random choose
Name = t3  OK !
Now we have a representation of size = 284
Minimization in Progress
Name = t7 No new state computed
Name = t4  OK !
Now we have a representation of size = 283
Name = t7 No new state computed
Name = t12 No new state computed
Name = t6 No new state computed
Name = t10  I.N.C.R.E.A.S.E
Name = t8 No new state computed
Name = t11  OK !
Now we have a representation of size = 283
Name = t10  I.N.C.R.E.A.S.E
Name = t8 No new state computed
Name = t14 No new state computed
Name = t3  I.N.C.R.E.A.S.E
Name = t2 No new state computed
Name = t9  I.N.C.R.E.A.S.E
Name = t4 No new state computed
Name = t6 No new state computed
Name = t1 No new state computed
Name = t12  OK !
Now we have a representation of size = 280
Name = t10  I.N.C.R.E.A.S.E
Name = t8 No new state computed
Name = t11 No new state computed
Name = t9  I.N.C.R.E.A.S.E
Name = t4 No new state computed
Name = t1 No new state computed
Name = t7 No new state computed
Name = t3  I.N.C.R.E.A.S.E
Name = t6 No new state computed
Name = t5 No new state computed
Name = t13  I.N.C.R.E.A.S.E
Name = t2 No new state computed
Name = t14 No new state computed
increase = 1
**********************
Random choose
Name = t13  OK !
Now we have a representation of size = 287
Minimization in Progress
Name = t6 No new state computed
Name = t12 No new state computed
Name = t9  I.N.C.R.E.A.S.E
Name = t4 No new state computed
Name = t5 No new state computed
Name = t14  I.N.C.R.E.A.S.E
Name = t2 No new state computed
Name = t1 No new state computed
Name = t7 No new state computed
Name = t10  I.N.C.R.E.A.S.E
Name = t8 No new state computed
Name = t11 No new state computed
Name = t3  I.N.C.R.E.A.S.E
increase = 1
**********************
Random choose
Name = t3  OK !
Now we have a representation of size = 291
Minimization in Progress
Name = t14  I.N.C.R.E.A.S.E
Name = t13 No new state computed
Name = t10  I.N.C.R.E.A.S.E
Name = t12 No new state computed
Name = t6 No new state computed
Name = t9  I.N.C.R.E.A.S.E
Name = t8 No new state computed
Name = t4 No new state computed
Name = t11 No new state computed
Name = t1 No new state computed
Name = t5 No new state computed
Name = t7 No new state computed
Name = t2 No new state computed
increase = 1
**********************
Random choose
Name = t9  OK !
Now we have a representation of size = 298
Minimization in Progress
Name = t3 No new state computed
Name = t2 No new state computed
Name = t6 No new state computed
Name = t14  I.N.C.R.E.A.S.E
Name = t4 No new state computed
Name = t7 No new state computed
Name = t11 No new state computed
Name = t1 No new state computed
Name = t8 No new state computed
Name = t5 No new state computed
Name = t13 No new state computed
Name = t10  I.N.C.R.E.A.S.E
Name = t12  I.N.C.R.E.A.S.E
increase = 1
**********************
Random choose
Name = t12  OK !
Now we have a representation of size = 302
Minimization in Progress
Name = t3 No new state computed
Name = t13  I.N.C.R.E.A.S.E
Name = t4 No new state computed
Name = t9 No new state computed
Name = t14  I.N.C.R.E.A.S.E
Name = t5 No new state computed
Name = t7 No new state computed
Name = t1 No new state computed
Name = t11 No new state computed
Name = t10  I.N.C.R.E.A.S.E
Name = t8 No new state computed
Name = t2 No new state computed
Name = t6 No new state computed
increase = 1
**********************
Random choose
Name = t10  OK !
Now we have a representation of size = 310
Minimization in Progress
Name = t5 No new state computed
Name = t9 No new state computed
Name = t11 No new state computed
Name = t12 No new state computed
Name = t3 No new state computed
Name = t2  I.N.C.R.E.A.S.E
Name = t7 No new state computed
Name = t13  I.N.C.R.E.A.S.E
Name = t1 No new state computed
Name = t8 No new state computed
Name = t4  I.N.C.R.E.A.S.E
Name = t14  I.N.C.R.E.A.S.E
Name = t6 No new state computed
increase = 1
**********************
Random choose
Name = t14  OK !
Now we have a representation of size = 316
Minimization in Progress
Name = t11 No new state computed
Name = t1 No new state computed
Name = t3 No new state computed
Name = t2  I.N.C.R.E.A.S.E
Name = t13  I.N.C.R.E.A.S.E
Name = t4  I.N.C.R.E.A.S.E
Name = t9  OK !
Now we have a representation of size = 316
Name = t14 No new state computed
Name = t3 No new state computed
Name = t8 No new state computed
Name = t2  I.N.C.R.E.A.S.E
Name = t10  OK !
Now we have a representation of size = 313
Name = t11 No new state computed
Name = t13  I.N.C.R.E.A.S.E
Name = t14 No new state computed
Name = t7 No new state computed
Name = t4  I.N.C.R.E.A.S.E
Name = t2  I.N.C.R.E.A.S.E
Name = t12 No new state computed
Name = t8 No new state computed
Name = t1 No new state computed
Name = t9  OK !
Now we have a representation of size = 310
Name = t6 No new state computed
Name = t4  I.N.C.R.E.A.S.E
Name = t14 No new state computed
Name = t3 No new state computed
Name = t12 No new state computed
Name = t1 No new state computed
Name = t13  I.N.C.R.E.A.S.E
Name = t8 No new state computed
Name = t10  OK !
Now we have a representation of size = 308
Name = t8 No new state computed
Name = t2  I.N.C.R.E.A.S.E
Name = t9 No new state computed
Name = t13  I.N.C.R.E.A.S.E
Name = t5 No new state computed
Name = t12 No new state computed
Name = t14 No new state computed
Name = t1 No new state computed
Name = t7 No new state computed
Name = t4  I.N.C.R.E.A.S.E
Name = t6 No new state computed
Name = t11 No new state computed
Name = t3 No new state computed
increase = 1
**********************
Random choose
Name = t4  OK !
Now we have a representation of size = 310
Minimization in Progress
Name = t3 No new state computed
Name = t5  I.N.C.R.E.A.S.E
Name = t13  I.N.C.R.E.A.S.E
Name = t7 No new state computed
Name = t12 No new state computed
Name = t11 No new state computed
Name = t6 No new state computed
Name = t9 No new state computed
Name = t1 No new state computed
Name = t2 No new state computed
Name = t8 No new state computed
Name = t14 No new state computed
Name = t10 No new state computed
increase = 1
**********************
Random choose
Name = t13  OK !
Now we have a representation of size = 317
Minimization in Progress
Name = t5  I.N.C.R.E.A.S.E
Name = t11 No new state computed
Name = t4 No new state computed
Name = t14  I.N.C.R.E.A.S.E
Name = t12 No new state computed
Name = t8 No new state computed
Name = t10 No new state computed
Name = t1 No new state computed
Name = t9 No new state computed
Name = t6 No new state computed
Name = t7 No new state computed
Name = t2 No new state computed
Name = t3 No new state computed
increase = 1
**********************
Random choose
Name = t14  OK !
Now we have a representation of size = 332
Minimization in Progress
Name = t9  I.N.C.R.E.A.S.E
Name = t13 No new state computed
Name = t7 No new state computed
Name = t2  I.N.C.R.E.A.S.E
Name = t4  I.N.C.R.E.A.S.E
Name = t11 No new state computed
Name = t5  I.N.C.R.E.A.S.E
Name = t12 No new state computed
Name = t3 No new state computed
Name = t1 No new state computed
Name = t8 No new state computed
Name = t6 No new state computed
Name = t10 No new state computed
increase = 1
**********************
Random choose
Name = t5  OK !
Now we have a representation of size = 339
Minimization in Progress
Name = t13 No new state computed
Name = t7 No new state computed
Name = t9  I.N.C.R.E.A.S.E
Name = t11 No new state computed
Name = t1 No new state computed
Name = t2  I.N.C.R.E.A.S.E
Name = t14 No new state computed
Name = t3 No new state computed
Name = t4  I.N.C.R.E.A.S.E
Name = t10 No new state computed
Name = t12 No new state computed
Name = t6  I.N.C.R.E.A.S.E
Name = t8 No new state computed
increase = 1
**********************
Random choose
Name = t6  OK !
Now we have a representation of size = 348
Minimization in Progress
Name = t12 No new state computed
Name = t14 No new state computed
Name = t13 No new state computed
Name = t8 No new state computed
Name = t7  I.N.C.R.E.A.S.E
Name = t1 No new state computed
Name = t4  I.N.C.R.E.A.S.E
Name = t2  I.N.C.R.E.A.S.E
Name = t11 No new state computed
Name = t9  I.N.C.R.E.A.S.E
Name = t10 No new state computed
Name = t5 No new state computed
Name = t3 No new state computed
increase = 1
**********************
Random choose
Name = t9  OK !
Now we have a representation of size = 351
Minimization in Progress
Name = t8 No new state computed
Name = t1 No new state computed
Name = t5 No new state computed
Name = t14 No new state computed
Name = t13 No new state computed
Name = t4  I.N.C.R.E.A.S.E
Name = t3 No new state computed
Name = t11 No new state computed
Name = t12 No new state computed
Name = t2  I.N.C.R.E.A.S.E
Name = t7  I.N.C.R.E.A.S.E
Name = t10  I.N.C.R.E.A.S.E
Name = t6 No new state computed
increase = 1
**********************
Random choose
Name = t10  OK !
Now we have a representation of size = 356
Minimization in Progress
Name = t7  I.N.C.R.E.A.S.E
Name = t12 No new state computed
Name = t1 No new state computed
Name = t8 No new state computed
Name = t2  I.N.C.R.E.A.S.E
Name = t14 No new state computed
Name = t9 No new state computed
Name = t4  I.N.C.R.E.A.S.E
Name = t6 No new state computed
Name = t5 No new state computed
Name = t3 No new state computed
Name = t11 No new state computed
Name = t13 No new state computed
increase = 1
**********************
Random choose
Name = t4  OK !
Now we have a representation of size = 357
Minimization in Progress
Name = t1 No new state computed
Name = t2 No new state computed
Name = t14 No new state computed
Name = t10 No new state computed
Name = t6 No new state computed
Name = t8 No new state computed
Name = t7  I.N.C.R.E.A.S.E
Name = t13 No new state computed
Name = t5  I.N.C.R.E.A.S.E
Name = t11 No new state computed
Name = t12 No new state computed
Name = t9 No new state computed
Name = t3 No new state computed
increase = 1
**********************
Random choose
Name = t5  OK !
Now we have a representation of size = 359
Minimization in Progress
Name = t9 No new state computed
Name = t13 No new state computed
Name = t4 No new state computed
Name = t6 No new state computed
Name = t14 No new state computed
Name = t7  I.N.C.R.E.A.S.E
Name = t11 No new state computed
Name = t8 No new state computed
Name = t3 No new state computed
Name = t12 No new state computed
Name = t2 No new state computed
Name = t10 No new state computed
Name = t1 No new state computed
increase = 1
**********************
Random choose
Name = t7  OK !
Now we have a representation of size = 371
Minimization in Progress
Name = t5 No new state computed
Name = t8 No new state computed
Name = t11 No new state computed
Name = t14 No new state computed
Name = t12 No new state computed
Name = t9 No new state computed
Name = t6 No new state computed
Name = t2  OK !
Now we have a representation of size = 371
Name = t13 No new state computed
Name = t6 No new state computed
Name = t3  OK !
Now we have a representation of size = 358
Name = t12 No new state computed
Name = t6 No new state computed
Name = t1 No new state computed
Name = t8 No new state computed
Name = t9 No new state computed
Name = t2  OK !
Now we have a representation of size = 353
Name = t4 No new state computed
Name = t7 No new state computed
Name = t11 No new state computed
Name = t12 No new state computed
Name = t1 No new state computed
Name = t5 No new state computed
Name = t13 No new state computed
Name = t10 No new state computed
Name = t9 No new state computed
Name = t8 No new state computed
Name = t6 No new state computed
Name = t14 No new state computed
Name = t3  OK !
Now we have a representation of size = 353
Name = t5 No new state computed
Name = t2 No new state computed
Name = t13 No new state computed
Name = t4 No new state computed
Name = t7 No new state computed
Name = t14 No new state computed
Name = t8 No new state computed
Name = t10 No new state computed
Name = t9 No new state computed
Name = t1 No new state computed
Name = t11 No new state computed
Name = t12 No new state computed
Name = t6 No new state computed
increase = 0
nb accelerations 52
Fix point FOUND
seed is : 3284
