current set encoding is : lash-msdf
seed is : 3284
cycles of length 1
(1/1), name = f1, size = 187
**********************
Random choose
Name = f1  OK !
Now we have a representation of size = 43
Minimization in Progress
increase = 0
nb accelerations 1
Fix point FOUND
(1/4)->
(2/4)->
(3/4)->
(4/4)->
Simplification of the linear system 
1 functions have the same action, it remains only 1
2 functions have the same action, it remains only 1
1 functions have the same action, it remains only 1
Number of actions before simplification : 4
Number of actions after simplification  : 3
cycles of length 2
(1/3), name = +f3, size = 245
(2/3), name = (+f3.f2+f2.f3), size = 274
(3/3), name = +f2, size = 277
**********************
Random choose
Name = (+f3.f2+f2.f3)  OK !
Now we have a representation of size = 170
Minimization in Progress
Name = +f2  I.N.C.R.E.A.S.E
Name = +f3  I.N.C.R.E.A.S.E
increase = 1
**********************
Random choose
Name = +f3  OK !
Now we have a representation of size = 670
Minimization in Progress
Name = (+f3.f2+f2.f3) No new state computed
Name = +f2  I.N.C.R.E.A.S.E
increase = 1
**********************
Random choose
Name = +f2  OK !
Now we have a representation of size = 808
Minimization in Progress
Name = +f3 No new state computed
Name = (+f3.f2+f2.f3) No new state computed
increase = 0
nb accelerations 3
Fix point FOUND
cycles of length 1
(1/3), name = f1, size = 187
(2/3), name = f2, size = 277
(3/3), name = f3, size = 245
**********************
Random choose
Name = f3  No new state computed
Name = f1  No new state computed
Name = f2  No new state computed
nb accelerations 0
Fix point FOUND
seed is : 3284
