current set encoding is : omega
seed is : 21768
cycles of length 1
(1/13), name = t1, size = 92
(2/13), name = t2, size = 94
(3/13), name = t3, size = 94
(4/13), name = t4, size = 94
(5/13), name = t5, size = 94
(6/13), name = t6, size = 92
(7/13), name = t7, size = 92
(8/13), name = t8, size = 92
(9/13), name = t9, size = 63
(10/13), name = t10, size = 93
(11/13), name = t11, size = 92
(12/13), name = t12, size = 93
(13/13), name = t13, size = 63
**********************
Random choose
Name = t3  No new state computed
Name = t4  No new state computed
Name = t6  OK !
Now we have a representation of size = 30
Minimization in Progress
Name = t8  I.N.C.R.E.A.S.E
Name = t5 No new state computed
Name = t4 No new state computed
Name = t2 No new state computed
Name = t11 No new state computed
Name = t1 No new state computed
Name = t7 No new state computed
Name = t10 No new state computed
Name = t12 No new state computed
Name = t13 No new state computed
Name = t3  I.N.C.R.E.A.S.E
Name = t9 No new state computed
increase = 1
**********************
Random choose
Name = t3  OK !
Now we have a representation of size = 45
Minimization in Progress
Name = t8  I.N.C.R.E.A.S.E
Name = t2 No new state computed
Name = t6 No new state computed
Name = t4 No new state computed
Name = t13 No new state computed
Name = t12 No new state computed
Name = t10 No new state computed
Name = t11 No new state computed
Name = t5 No new state computed
Name = t9 No new state computed
Name = t7 No new state computed
Name = t1  I.N.C.R.E.A.S.E
increase = 1
**********************
Random choose
Name = t1  OK !
Now we have a representation of size = 60
Minimization in Progress
Name = t9 No new state computed
Name = t2 No new state computed
Name = t7 No new state computed
Name = t8  I.N.C.R.E.A.S.E
Name = t3 No new state computed
Name = t10 No new state computed
Name = t11 No new state computed
Name = t5 No new state computed
Name = t6 No new state computed
Name = t12 No new state computed
Name = t13 No new state computed
Name = t4 No new state computed
increase = 1
**********************
Random choose
Name = t8  OK !
Now we have a representation of size = 124
Minimization in Progress
Name = t9  I.N.C.R.E.A.S.E
Name = t4 No new state computed
Name = t6 No new state computed
Name = t10 No new state computed
Name = t5 No new state computed
Name = t12 No new state computed
Name = t13 No new state computed
Name = t2 No new state computed
Name = t11 No new state computed
Name = t1 No new state computed
Name = t7 No new state computed
Name = t3 No new state computed
increase = 1
**********************
Random choose
Name = t9  OK !
Now we have a representation of size = 156
Minimization in Progress
Name = t8 No new state computed
Name = t5 No new state computed
Name = t11 No new state computed
Name = t1 No new state computed
Name = t13 No new state computed
Name = t7 No new state computed
Name = t4 No new state computed
Name = t10  I.N.C.R.E.A.S.E
Name = t12 No new state computed
Name = t6 No new state computed
Name = t2  I.N.C.R.E.A.S.E
Name = t3 No new state computed
increase = 1
**********************
Random choose
Name = t2  OK !
Now we have a representation of size = 172
Minimization in Progress
Name = t4 No new state computed
Name = t10  I.N.C.R.E.A.S.E
Name = t5 No new state computed
Name = t7 No new state computed
Name = t11 No new state computed
Name = t12 No new state computed
Name = t8 No new state computed
Name = t13 No new state computed
Name = t9 No new state computed
Name = t1  I.N.C.R.E.A.S.E
Name = t6 No new state computed
Name = t3 No new state computed
increase = 1
**********************
Random choose
Name = t1  OK !
Now we have a representation of size = 219
Minimization in Progress
Name = t13 No new state computed
Name = t7 No new state computed
Name = t11 No new state computed
Name = t9 No new state computed
Name = t10  I.N.C.R.E.A.S.E
Name = t2 No new state computed
Name = t12 No new state computed
Name = t3 No new state computed
Name = t5 No new state computed
Name = t8 No new state computed
Name = t4 No new state computed
Name = t6 No new state computed
increase = 1
**********************
Random choose
Name = t10  OK !
Now we have a representation of size = 251
Minimization in Progress
Name = t5 No new state computed
Name = t2 No new state computed
Name = t6 No new state computed
Name = t12 No new state computed
Name = t4 No new state computed
Name = t11  I.N.C.R.E.A.S.E
Name = t13 No new state computed
Name = t9  I.N.C.R.E.A.S.E
Name = t1 No new state computed
Name = t7 No new state computed
Name = t3  I.N.C.R.E.A.S.E
Name = t8 No new state computed
increase = 1
**********************
Random choose
Name = t3  OK !
Now we have a representation of size = 298
Minimization in Progress
Name = t11  I.N.C.R.E.A.S.E
Name = t4 No new state computed
Name = t10 No new state computed
Name = t7 No new state computed
Name = t5 No new state computed
Name = t6 No new state computed
Name = t1  I.N.C.R.E.A.S.E
Name = t12 No new state computed
Name = t2 No new state computed
Name = t13 No new state computed
Name = t8 No new state computed
Name = t9  I.N.C.R.E.A.S.E
increase = 1
**********************
Random choose
Name = t9  OK !
Now we have a representation of size = 362
Minimization in Progress
Name = t1  I.N.C.R.E.A.S.E
Name = t7 No new state computed
Name = t8 No new state computed
Name = t10  I.N.C.R.E.A.S.E
Name = t12 No new state computed
Name = t2  I.N.C.R.E.A.S.E
Name = t4 No new state computed
Name = t3 No new state computed
Name = t11  I.N.C.R.E.A.S.E
Name = t13 No new state computed
Name = t6 No new state computed
Name = t5 No new state computed
increase = 1
**********************
Random choose
Name = t11  OK !
Now we have a representation of size = 442
Minimization in Progress
Name = t5 No new state computed
Name = t10  I.N.C.R.E.A.S.E
Name = t8 No new state computed
Name = t4 No new state computed
Name = t2  I.N.C.R.E.A.S.E
Name = t13  I.N.C.R.E.A.S.E
Name = t1  I.N.C.R.E.A.S.E
Name = t6 No new state computed
Name = t3 No new state computed
Name = t9 No new state computed
Name = t7 No new state computed
Name = t12 No new state computed
increase = 1
**********************
Random choose
Name = t1  OK !
Now we have a representation of size = 552
Minimization in Progress
Name = t10  I.N.C.R.E.A.S.E
Name = t12 No new state computed
Name = t9 No new state computed
Name = t13  I.N.C.R.E.A.S.E
Name = t6 No new state computed
Name = t3 No new state computed
Name = t2  I.N.C.R.E.A.S.E
Name = t4 No new state computed
Name = t5 No new state computed
Name = t11 No new state computed
Name = t8 No new state computed
Name = t7 No new state computed
increase = 1
**********************
Random choose
Name = t2  OK !
Now we have a representation of size = 616
Minimization in Progress
Name = t4 No new state computed
Name = t13  I.N.C.R.E.A.S.E
Name = t5 No new state computed
Name = t6 No new state computed
Name = t12 No new state computed
Name = t3 No new state computed
Name = t8 No new state computed
Name = t9 No new state computed
Name = t11 No new state computed
Name = t1  I.N.C.R.E.A.S.E
Name = t7 No new state computed
Name = t10  I.N.C.R.E.A.S.E
increase = 1
**********************
Random choose
Name = t10  OK !
Now we have a representation of size = 744
Minimization in Progress
Name = t7 No new state computed
Name = t3  I.N.C.R.E.A.S.E
Name = t12 No new state computed
Name = t1  I.N.C.R.E.A.S.E
Name = t2 No new state computed
Name = t11  I.N.C.R.E.A.S.E
Name = t8 No new state computed
Name = t9  I.N.C.R.E.A.S.E
Name = t6 No new state computed
Name = t5 No new state computed
Name = t13  I.N.C.R.E.A.S.E
Name = t4 No new state computed
increase = 1
**********************
Random choose
Name = t13  OK !
Now we have a representation of size = 888
Minimization in Progress
Name = t7 No new state computed
Name = t5 No new state computed
Name = t8 No new state computed
Name = t11  I.N.C.R.E.A.S.E
Name = t4 No new state computed
Name = t3  I.N.C.R.E.A.S.E
Name = t10 No new state computed
Name = t6 No new state computed
Name = t12 No new state computed
Name = t9  I.N.C.R.E.A.S.E
Name = t1  I.N.C.R.E.A.S.E
Name = t2 No new state computed
increase = 1
**********************
Random choose
Name = t1  OK !
Now we have a representation of size = 1094
Minimization in Progress
Name = t5 No new state computed
Name = t11  I.N.C.R.E.A.S.E
Name = t7 No new state computed
Name = t6 No new state computed
Name = t2 No new state computed
Name = t10 No new state computed
Name = t13 No new state computed
Name = t4 No new state computed
Name = t9  I.N.C.R.E.A.S.E
Name = t3  I.N.C.R.E.A.S.E
Name = t8 No new state computed
Name = t12 No new state computed
increase = 1
**********************
Random choose
Name = t3  OK !
Now we have a representation of size = 1253
Minimization in Progress
Name = t13 No new state computed
Name = t1  I.N.C.R.E.A.S.E
Name = t4 No new state computed
Name = t5 No new state computed
Name = t2 No new state computed
Name = t10 No new state computed
Name = t7 No new state computed
Name = t6 No new state computed
Name = t9  I.N.C.R.E.A.S.E
Name = t11  I.N.C.R.E.A.S.E
Name = t12 No new state computed
Name = t8 No new state computed
increase = 1
**********************
Random choose
Name = t11  OK !
Now we have a representation of size = 1656
Minimization in Progress
Name = t9  I.N.C.R.E.A.S.E
Name = t8 No new state computed
Name = t2 No new state computed
Name = t3 No new state computed
Name = t6 No new state computed
Name = t4 No new state computed
Name = t1  I.N.C.R.E.A.S.E
Name = t5 No new state computed
Name = t10 No new state computed
Name = t12 No new state computed
Name = t7 No new state computed
Name = t13 No new state computed
increase = 1
**********************
Random choose
Name = t1  OK !
Now we have a representation of size = 2150
Minimization in Progress
Name = t9  I.N.C.R.E.A.S.E
Name = t12 No new state computed
Name = t3 No new state computed
Name = t8 No new state computed
Name = t5 No new state computed
Name = t7 No new state computed
Name = t2 No new state computed
Name = t11 No new state computed
Name = t13 No new state computed
Name = t6 No new state computed
Name = t4 No new state computed
Name = t10 No new state computed
increase = 1
**********************
Random choose
Name = t9  OK !
Now we have a representation of size = 2632
Minimization in Progress
Name = t1 No new state computed
Name = t10  I.N.C.R.E.A.S.E
Name = t13 No new state computed
Name = t11 No new state computed
Name = t2  I.N.C.R.E.A.S.E
Name = t12 No new state computed
Name = t3 No new state computed
Name = t5 No new state computed
Name = t6 No new state computed
Name = t8 No new state computed
Name = t7 No new state computed
Name = t4 No new state computed
increase = 1
**********************
Random choose
Name = t2  OK !
Now we have a representation of size = 2969
Minimization in Progress
Name = t12 No new state computed
Name = t4 No new state computed
Name = t11 No new state computed
Name = t10  I.N.C.R.E.A.S.E
Name = t1  I.N.C.R.E.A.S.E
Name = t8 No new state computed
Name = t6 No new state computed
Name = t5 No new state computed
Name = t9 No new state computed
Name = t7 No new state computed
Name = t13 No new state computed
Name = t3 No new state computed
increase = 1
**********************
Random choose
Name = t1  OK !
Now we have a representation of size = 3800
Minimization in Progress
Name = t3 No new state computed
Name = t10  I.N.C.R.E.A.S.E
Name = t12 No new state computed
Name = t11 No new state computed
Name = t4 No new state computed
Name = t8 No new state computed
Name = t9 No new state computed
Name = t6 No new state computed
Name = t2 No new state computed
Name = t7 No new state computed
Name = t13 No new state computed
Name = t5 No new state computed
increase = 1
**********************
Random choose
Name = t10  OK !
Now we have a representation of size = 4474
Minimization in Progress
Name = t5 No new state computed
Name = t9  I.N.C.R.E.A.S.E
Name = t12 No new state computed
Name = t2 No new state computed
Name = t11  I.N.C.R.E.A.S.E
Name = t13 No new state computed
Name = t3  I.N.C.R.E.A.S.E
Name = t1 No new state computed
Name = t4 No new state computed
Name = t6 No new state computed
Name = t8 No new state computed
Name = t7 No new state computed
increase = 1
**********************
Random choose
Name = t3  OK !
Now we have a representation of size = 5067
Minimization in Progress
Name = t11  I.N.C.R.E.A.S.E
Name = t7 No new state computed
Name = t8 No new state computed
Name = t6 No new state computed
Name = t12 No new state computed
Name = t4 No new state computed
Name = t1  I.N.C.R.E.A.S.E
Name = t9  I.N.C.R.E.A.S.E
Name = t2 No new state computed
Name = t5 No new state computed
Name = t13 No new state computed
Name = t10 No new state computed
increase = 1
**********************
Random choose
Name = t9  OK !
Now we have a representation of size = 6223
Minimization in Progress
Name = t10  I.N.C.R.E.A.S.E
Name = t13 No new state computed
Name = t2  I.N.C.R.E.A.S.E
Name = t12 No new state computed
Name = t11  I.N.C.R.E.A.S.E
Name = t4 No new state computed
Name = t5 No new state computed
Name = t3 No new state computed
Name = t8 No new state computed
Name = t1  I.N.C.R.E.A.S.E
Name = t7 No new state computed
Name = t6 No new state computed
increase = 1
**********************
Random choose
Name = t1  OK !
Now we have a representation of size = 7647
Minimization in Progress
Name = t11  I.N.C.R.E.A.S.E
Name = t2  I.N.C.R.E.A.S.E
Name = t7 No new state computed
Name = t10  I.N.C.R.E.A.S.E
Name = t8 No new state computed
Name = t12 No new state computed
Name = t5 No new state computed
Name = t6 No new state computed
Name = t4 No new state computed
Name = t9 