\relax 
\select@language{english}
\@writefile{toc}{\select@language{english}}
\@writefile{lof}{\select@language{english}}
\@writefile{lot}{\select@language{english}}
\@writefile{toc}{\contentsline {section}{\numberline {1}$F^3$MDP Framework}{1}}
\@writefile{toc}{\contentsline {subsection}{\numberline {1.1}Framework}{1}}
\citation{libDAI}
\@writefile{toc}{\contentsline {subsection}{\numberline {1.2}Evaluation}{2}}
\newlabel{sec_eval}{{1.2}{2}}
\newlabel{eq_V}{{1}{2}}
\@writefile{toc}{\contentsline {subsection}{\numberline {1.3}Optimization}{3}}
\@writefile{toc}{\contentsline {subsubsection}{\numberline {1.3.1}Coordinate descent ($F^3MDP\_CD$ Algorithm)}{3}}
\@writefile{toc}{\contentsline {subsubsection}{\numberline {1.3.2}Gradient descent ($F^3MDP\_GD$ Algorithm)}{3}}
\newlabel{finitediffgradient}{{2}{3}}
\newlabel{eq_local_modif}{{3}{4}}
\@writefile{toc}{\contentsline {subsubsection}{\numberline {1.3.3}Equality constraints on some of the local policies}{4}}
\@writefile{toc}{\contentsline {section}{\numberline {2} $F^3MDP\_GD$ Algorithm}{5}}
\newlabel{F3MDPAlgo}{{1}{6}}
\@writefile{loa}{\contentsline {algocf}{\numberline {1}{\ignorespaces $F^3MDP\_GD$}}{6}}
\@writefile{toc}{\contentsline {section}{\numberline {3}Functions called by $F^3MDP\_GD$}{6}}
\newlabel{ComputeValue}{{2}{6}}
\@writefile{loa}{\contentsline {algocf}{\numberline {2}{\ignorespaces EvalPolicy}}{6}}
\newlabel{LineSearch}{{3}{7}}
\@writefile{loa}{\contentsline {algocf}{\numberline {3}{\ignorespaces LineSearch }}{7}}
\newlabel{WolfeLineSearch}{{4}{7}}
\@writefile{loa}{\contentsline {algocf}{\numberline {4}{\ignorespaces WolfeLineSearch }}{7}}
\newlabel{ArmijoTest}{{5}{7}}
\@writefile{loa}{\contentsline {algocf}{\numberline {5}{\ignorespaces ArmijoTest }}{7}}
\newlabel{WolfeTest}{{6}{7}}
\@writefile{loa}{\contentsline {algocf}{\numberline {6}{\ignorespaces WolfeTest }}{7}}
\bibcite{libDAI}{1}
\@writefile{loa}{\contentsline {algocf}{\numberline {7}{\ignorespaces TransformReward}}{8}}
\@writefile{loa}{\contentsline {algocf}{\numberline {8}{\ignorespaces DeltaToTheta}}{8}}
\@writefile{loa}{\contentsline {algocf}{\numberline {9}{\ignorespaces ThetaToDelta}}{8}}
\@writefile{loa}{\contentsline {algocf}{\numberline {10}{\ignorespaces LocalModif}}{8}}
