<?xml version="1.0" encoding="UTF-8" standalone="no"?>
<!DOCTYPE svg PUBLIC "-//W3C//DTD SVG 1.1//EN"
 "http://www.w3.org/Graphics/SVG/1.1/DTD/svg11.dtd">
<!-- Generated by graphviz version 2.40.1 (20161225.0304)
 -->
<!-- Title: %3 Pages: 1 -->
<svg width="1184pt" height="128pt"
 viewBox="0.00 0.00 1184.17 128.50" xmlns="http://www.w3.org/2000/svg" xmlns:xlink="http://www.w3.org/1999/xlink">
<g id="graph0" class="graph" transform="scale(1 1) rotate(0) translate(4 124.4961)">
<title>%3</title>
<polygon fill="#ffffff" stroke="transparent" points="-4,4 -4,-124.4961 1180.166,-124.4961 1180.166,4 -4,4"/>
<!-- J -->
<g id="node1" class="node">
<title>J</title>
<g id="a_node1"><a xlink:title="J (Juvenile):&#10;	juvenile animals">
<path fill="#ffa500" stroke="#000000" d="M12,-28.3789C12,-28.3789 42,-28.3789 42,-28.3789 48,-28.3789 54,-34.3789 54,-40.3789 54,-40.3789 54,-69.6211 54,-69.6211 54,-75.6211 48,-81.6211 42,-81.6211 42,-81.6211 12,-81.6211 12,-81.6211 6,-81.6211 0,-75.6211 0,-69.6211 0,-69.6211 0,-40.3789 0,-40.3789 0,-34.3789 6,-28.3789 12,-28.3789"/>
<text text-anchor="middle" x="26.7227" y="-64.8211" font-family="Arial" font-size="16.00" fill="#000000">J </text>
<polyline fill="none" stroke="#000000" points="0,-55.2227 53.4453,-55.2227 "/>
<text text-anchor="middle" x="26.7227" y="-38.4227" font-family="Arial" font-size="16.00" fill="#000000">◆</text>
</a>
</g>
</g>
<!-- A -->
<g id="node2" class="node">
<title>A</title>
<g id="a_node2"><a xlink:title="A (Non&#45;gestating Adult):&#10;	adult animals">
<path fill="#a52a2a" stroke="#000000" d="M224.2656,-28.3789C224.2656,-28.3789 254.2656,-28.3789 254.2656,-28.3789 260.2656,-28.3789 266.2656,-34.3789 266.2656,-40.3789 266.2656,-40.3789 266.2656,-69.6211 266.2656,-69.6211 266.2656,-75.6211 260.2656,-81.6211 254.2656,-81.6211 254.2656,-81.6211 224.2656,-81.6211 224.2656,-81.6211 218.2656,-81.6211 212.2656,-75.6211 212.2656,-69.6211 212.2656,-69.6211 212.2656,-40.3789 212.2656,-40.3789 212.2656,-34.3789 218.2656,-28.3789 224.2656,-28.3789"/>
<text text-anchor="middle" x="238.8828" y="-64.8211" font-family="Arial" font-size="16.00" fill="#000000">A </text>
<polyline fill="none" stroke="#000000" points="212.2656,-55.2227 265.5,-55.2227 "/>
<text text-anchor="middle" x="238.8828" y="-38.4227" font-family="Arial" font-size="16.00" fill="#000000">◆</text>
</a>
</g>
</g>
<!-- J&#45;&gt;A -->
<g id="edge5" class="edge">
<title>J&#45;&gt;A</title>
<g id="a_edge5"><a xlink:title="COND: GreaterThan(age, adult_age)">
<path fill="none" stroke="#000000" stroke-width="1.5" d="M64.4847,-55C101.5718,-55 158.2475,-55 196.9359,-55"/>
<polyline fill="none" stroke="#000000" stroke-width="1.5" points="54.3155,-55 59.3155,-55 "/>
<polygon fill="#000000" stroke="#000000" stroke-width="1.5" points="60.3154,-60.0001 60.3155,-50.0001 62.3155,-50.0001 62.3154,-60.0001 60.3154,-60.0001"/>
<polyline fill="none" stroke="#000000" stroke-width="1.5" points="59.3155,-55 64.3155,-55.0001 "/>
<polygon fill="#000000" stroke="#000000" stroke-width="1.5" points="202.055,-58.5001 212.055,-55 202.055,-51.5001 202.055,-58.5001"/>
<polyline fill="none" stroke="#000000" stroke-width="1.5" points="202.055,-55.0001 197.055,-55.0001 "/>
</a>
</g>
<g id="a_edge5&#45;label"><a xlink:title="proba: 1">
<text text-anchor="middle" x="133.1328" y="-57.8" font-family="Times,serif" font-size="14.00" fill="#000000">proba: 1</text>
</a>
</g>
</g>
<!-- G -->
<g id="node3" class="node">
<title>G</title>
<g id="a_node3"><a xlink:title="G (Gestating Adult):&#10;	adult animals (producing new juveniles)">
<path fill="#00bfff" stroke="#000000" d="M596.166,-66.0039C596.166,-66.0039 626.166,-66.0039 626.166,-66.0039 632.166,-66.0039 638.166,-72.0039 638.166,-78.0039 638.166,-78.0039 638.166,-107.9961 638.166,-107.9961 638.166,-113.9961 632.166,-119.9961 626.166,-119.9961 626.166,-119.9961 596.166,-119.9961 596.166,-119.9961 590.166,-119.9961 584.166,-113.9961 584.166,-107.9961 584.166,-107.9961 584.166,-78.0039 584.166,-78.0039 584.166,-72.0039 590.166,-66.0039 596.166,-66.0039"/>
<text text-anchor="middle" x="611.1504" y="-103.1961" font-family="Arial" font-size="16.00" fill="#000000">G ◷ </text>
<polyline fill="none" stroke="#000000" points="584.166,-92.8477 638.1348,-92.8477 "/>
<text text-anchor="middle" x="611.1504" y="-76.0477" font-family="Arial" font-size="16.00" fill="#000000">◆</text>
</a>
</g>
</g>
<!-- A&#45;&gt;G -->
<g id="edge2" class="edge">
<title>A&#45;&gt;G</title>
<g id="a_edge2"><a xlink:title="COND: is_Female">
<path fill="none" stroke="#000000" stroke-width="1.5" d="M276.6282,-53.4783C313.6681,-52.4237 371.9812,-51.9861 422.166,-57 473.3195,-62.1107 531.2775,-74.0879 569.3699,-82.8283"/>
<polyline fill="none" stroke="#000000" stroke-width="1.5" points="266.3094,-53.804 271.307,-53.6463 "/>
<polygon fill="#000000" stroke="#000000" stroke-width="1.5" points="272.4643,-58.6122 272.1487,-48.6172 274.1477,-48.5541 274.4633,-58.5491 272.4643,-58.6122"/>
<polyline fill="none" stroke="#000000" stroke-width="1.5" points="271.307,-53.6463 276.3045,-53.4885 "/>
<polygon fill="#000000" stroke="#000000" stroke-width="1.5" points="573.6229,-87.4179 584.1573,-86.2884 575.2177,-80.602 573.6229,-87.4179"/>
<polyline fill="none" stroke="#000000" stroke-width="1.5" points="574.4203,-84.01 569.5518,-82.8708 "/>
</a>
</g>
<g id="a_edge2&#45;label"><a xlink:title="reproduction [parameter]:&#10;	reproduction rate (/days) &#160;&#160;&#160;&#160;&#160;&#160;&#160;&#160;&#160;&#160;&#160;&#160;&#160;&#160;&#160;&#160;&#160;&#160;&#160;&#160;&#160;&#160;&#160;&#160;&#160;&#160;&#160;&#160;&#160;&#160;&#160;&#160;&#160;&#160;&#160;&#160;&#160;&#160;&#160;&#160;&#160;&#160;&#160;&#160;&#160;&#160;&#10;	1/20">
<text text-anchor="middle" x="372.2158" y="-59.8" font-family="Times,serif" font-size="14.00" fill="#000000">rate: reproduction</text>
</a>
</g>
</g>
<!-- D -->
<g id="node4" class="node">
<title>D</title>
<g id="a_node4"><a xlink:title="D (Dead):&#10;	compartment to put dead animals">
<path fill="#ffffff" stroke="#000000" stroke-dasharray="1,5" d="M1134.166,-1C1134.166,-1 1164.166,-1 1164.166,-1 1170.166,-1 1176.166,-7 1176.166,-13 1176.166,-13 1176.166,-25 1176.166,-25 1176.166,-31 1170.166,-37 1164.166,-37 1164.166,-37 1134.166,-37 1134.166,-37 1128.166,-37 1122.166,-31 1122.166,-25 1122.166,-25 1122.166,-13 1122.166,-13 1122.166,-7 1128.166,-1 1134.166,-1"/>
<text text-anchor="middle" x="1149.166" y="-15.7" font-family="Arial" font-size="16.00" fill="#000000">D</text>
</a>
</g>
</g>
<!-- A&#45;&gt;D -->
<g id="edge1" class="edge">
<title>A&#45;&gt;D</title>
<path fill="none" stroke="#000000" stroke-width="1.5" d="M256.8563,-28.1445C268.3005,-14.183 284.6344,0 303.7656,0 303.7656,0 303.7656,0 1084.666,0 1092.1517,0 1099.9343,-1.1921 1107.3953,-2.9792"/>
<polygon fill="#000000" stroke="#000000" stroke-width="1.5" points="1111.4791,-7.8282 1122.0603,-7.2916 1113.4539,-1.1125 1111.4791,-7.8282"/>
<polyline fill="none" stroke="#000000" stroke-width="1.5" points="1112.4665,-4.4704 1107.6696,-3.0598 "/>
<g id="a_edge1&#45;label"><a xlink:title="rate: &#160;&#160;&#160;&#160;&#160;&#160;&#160;&#160;&#160;1 &#160;&#160;&#160;&#160;&#160;&#160;&#160;&#160;&#10;───────────────────&#10;avg_adult_death_age">
<text text-anchor="middle" x="611.166" y="-36.3999" font-family="Times,serif" font-size="14.00" fill="#000000">rate: &#160;&#160;&#160;&#160;&#160;&#160;&#160;&#160;&#160;1 &#160;&#160;&#160;&#160;&#160;&#160;&#160;&#160;</text>
<text text-anchor="middle" x="611.166" y="-22.3999" font-family="Times,serif" font-size="14.00" fill="#000000">───────────────────</text>
<text text-anchor="middle" x="611.166" y="-2.8" font-family="Times,serif" font-size="14.00" fill="#000000">avg_adult_death_age</text>
</a>
</g>
</g>
<!-- G&#45;&gt;A -->
<g id="edge3" class="edge">
<title>G&#45;&gt;A</title>
<path fill="none" stroke="#000000" stroke-width="1.5" d="M584.0599,-91.198C532.8642,-87.7364 418.4499,-79.7227 322.2656,-71 311.2987,-70.0054 305.5983,-69.9164 293.6079,-68.0575"/>
<polygon fill="#000000" stroke="#000000" stroke-width="1.5" points="277.1891,-61.4378 266.7171,-63.0467 275.9067,-68.3194 277.1891,-61.4378"/>
<polyline fill="none" stroke="#000000" stroke-width="1.5" points="276.5479,-64.8786 281.4633,-65.7945 "/>
<polygon fill="#000000" stroke="#000000" stroke-width="1.5" points="293.2602,-67.9928 286.629,-70.826 281.4633,-65.7945 288.0945,-62.9613 293.2602,-67.9928"/>
<g id="a_edge3&#45;label"><a xlink:title="proba: 1">
<text text-anchor="middle" x="372.2158" y="-81.8" font-family="Times,serif" font-size="14.00" fill="#000000">proba: 1</text>
</a>
</g>
</g>
<!-- G&#45;&gt;D -->
<g id="edge4" class="edge">
<title>G&#45;&gt;D</title>
<g id="a_edge4"><a xlink:title="ESCAPE: True">
<path fill="none" stroke="#000000" stroke-width="1.5" d="M653.1215,-87.2292C753.4707,-73.4265 1006.4595,-38.6288 1107.0109,-24.7983"/>
<polyline fill="none" stroke="#000000" stroke-width="1.5" points="638.2142,-89.2796 643.1676,-88.5983 "/>
<polygon fill="none" stroke="#000000" stroke-width="1.5" points="642.6906,-85.1309 653.0743,-87.2356 643.6445,-92.0656 642.6906,-85.1309"/>
<polygon fill="#000000" stroke="#000000" stroke-width="1.5" points="1112.6342,-27.5578 1122.064,-22.7278 1111.6803,-20.6231 1112.6342,-27.5578"/>
<polyline fill="none" stroke="#000000" stroke-width="1.5" points="1112.1573,-24.0905 1107.2039,-24.7718 "/>
</a>
</g>
<g id="a_edge4&#45;label"><a xlink:title="rate: &#160;&#160;&#160;&#160;&#160;&#160;&#160;&#160;&#160;1 &#160;&#160;&#160;&#160;&#160;&#160;&#160;&#160;&#10;───────────────────&#10;avg_adult_death_age">
<text text-anchor="middle" x="933.166" y="-102.3999" font-family="Times,serif" font-size="14.00" fill="#000000">rate: &#160;&#160;&#160;&#160;&#160;&#160;&#160;&#160;&#160;1 &#160;&#160;&#160;&#160;&#160;&#160;&#160;&#160;</text>
<text text-anchor="middle" x="933.166" y="-88.3999" font-family="Times,serif" font-size="14.00" fill="#000000">───────────────────</text>
<text text-anchor="middle" x="933.166" y="-68.8" font-family="Times,serif" font-size="14.00" fill="#000000">avg_adult_death_age</text>
</a>
</g>
</g>
</g>
</svg>
