N31856 X3.294 Y92.428 Z105.213
N31857 X3.301 Y92.444 Z105.635
N31858 Z107.635
N31859 G0 Z231.23
N31860 ROT
N31861 M9
N31862 M5
N31863 TRAFOOF
N31864 G54
N31865 G0 SUPA Z-5 D0
N31866 M23
N31867 G0 A0 C0
N31868 M30 ; Fin de programme
