021106
031106
061106
071106
081106
091106
101106
131106
141106
151106
161106
171106
201106
211106
221106
231106
241106
271106
281106
291106
301106
011206
041206
051206
061206
071206
081206
111206
121206
131206
141206
151206
181206
191206
201206
211206
221206
271206
281206
291206
020107
030107
040107
050107
080107
090107
100107
110107
120107
150107
160107
170107
180107
190107
220107
230107
240107
250107
260107
290107
300107
310107
010207
020207
050207
060207
070207
080207
090207
120207
130207
140207
150207
160207
190207
200207
210207
220207
230207
260207
270207
280207
010307
020307
050307
060307
070307
080307
090307
120307
130307
140307
150307
160307
190307
200307
210307
220307
230307
260307
270307
280307
290307
300307
020407
030407
040407
050407
100407
110407
120407
130407
160407
170407
180407
190407
200407
230407
240407
250407
260407
270407
300407
020507
030507
040507
070507
090507
100507
110507
140507
150507
160507
180507
210507
220507
230507
240507
250507
280507
290507
300507
310507
010607
040607
050607
060607
070607
080607
110607
120607
130607
140607
150607
180607
190607
200607
210607
220607
250607
260607
270607
280607
290607
020707
030707
040707
050707
060707
090707
100707
110707
120707
130707
160707
170707
180707
190707
200707
230707
240707
250707
260707
270707
300707
310707
010807
020807
030807
060807
070807
080807
090807
100807
130807
140807
160807
170807
200807
210807
220807
230807
240807
270807
280807
290807
300807
310807
030907
040907
050907
060907
070907
100907
110907
120907
130907
140907
170907
180907
190907
200907
210907
240907
250907
260907
270907
280907
011007
021007
031007
041007
051007
081007
091007
101007
111007
121007
151007
161007
171007
181007
191007
221007
231007
241007
251007
261007
291007
301007
311007
021107
051107
061107
071107
081107
091107
121107
131107
141107
151107
161107
191107
201107
211107
221107
231107
261107
271107
281107
291107
301107
031207
041207
051207
061207
071207
101207
111207
121207
131207
141207
171207
181207
191207
201207
211207
241207
271207
281207
311207