[
  {
    "model": "training.TrainingType",
    "pk": 1,
    "fields": {
      "trt_name": "Cours"
    }
  },
  {
    "model": "training.TrainingType",
    "pk": 2,
    "fields": {
      "trt_name": "Cours/TP"
    }
  },
  {
    "model": "training.TrainingType",
    "pk": 3,
    "fields": {
      "trt_name": "Séminaire"
    }
  },
  {
    "model": "training.TrainingType",
    "pk": 4,
    "fields": {
      "trt_name": "Journée thématique"
    }
  },
  {
    "model": "training.TrainingType",
    "pk": 5,
    "fields": {
      "trt_name": "Colloque"
    }
  }
]



