<?xml version="1.0" encoding="utf-8"?>
<!-- Generator: Adobe Illustrator 15.1.0, SVG Export Plug-In . SVG Version: 6.00 Build 0)  -->
<!DOCTYPE svg PUBLIC "-//W3C//DTD SVG 1.0//EN" "http://www.w3.org/TR/2001/REC-SVG-20010904/DTD/svg10.dtd">
<svg version="1.0" id="Calque_1" xmlns="http://www.w3.org/2000/svg" xmlns:xlink="http://www.w3.org/1999/xlink" x="0px" y="0px"
	 width="225px" height="180px" viewBox="0 0 416.979 410.979" enable-background="new 0 0 416.979 410.979"
	 xml:space="preserve">
<g id="Calque_2" display="none">
	<rect x="-16.13" y="-16.279" display="inline" fill="#1E4395" width="446" height="440"/>
</g>
<g id="RrPmlC.tif" display="none">
	
		<image display="inline" overflow="visible" width="222" height="233" id="Layer_0_1_" xlink:href="8DD115EC.png"  transform="matrix(1 0 0 1 608.8696 88.7207)">
	</image>
</g>
<ellipse fill="#FFFFFF" cx="147.87" cy="179.221" rx="78" ry="78.5"/>
<path fill="#FFFFFF" d="M215.87,219.721c0,0,72,60,98,48s31-21,20-30s-56-43-79-41s-45,1-46,8S215.87,219.721,215.87,219.721z"/>
<g>
	<g>
		<g enable-background="new    ">
			<g enable-background="new    ">
				<defs>
					<path id="SVGID_1_" enable-background="new    " d="M219.88,172.8l-0.741,22.076c0.319-9.505-1.666-19.241-6.235-28.548
						c-16.273-33.143-59.247-48.499-95.808-34.237c-26.293,10.257-42.217,33.08-43.034,57.417
						c0.247-7.359,0.494-14.717,0.741-22.076c0.817-24.338,16.74-47.161,43.034-57.417c36.561-14.262,79.535,1.094,95.808,34.236
						C218.215,153.56,220.2,163.295,219.88,172.8z"/>
				</defs>
				<clipPath id="SVGID_2_">
					<use xlink:href="#SVGID_1_"  overflow="visible"/>
				</clipPath>
				<g clip-path="url(#SVGID_2_)" enable-background="new    ">
					<path fill="#858585" d="M219.88,172.8l-0.741,22.076c0.319-9.505-1.666-19.241-6.235-28.548
						c-15.457-31.48-55.003-46.914-90.263-36.161l0.741-22.076c35.259-10.753,74.806,4.68,90.263,36.16
						C218.215,153.56,220.2,163.295,219.88,172.8"/>
					<path fill="#8A8A8A" d="M123.382,108.092l-0.741,22.076c-1.862,0.568-3.712,1.208-5.545,1.924
						c-4.34,1.693-8.397,3.729-12.151,6.056l0.741-22.076c3.754-2.328,7.811-4.363,12.151-6.056
						C119.671,109.3,121.521,108.659,123.382,108.092"/>
					<path fill="#8F8F8F" d="M105.686,116.071l-0.741,22.076c-5.706,3.539-10.71,7.754-14.937,12.471l0.741-22.076
						C94.976,123.826,99.98,119.61,105.686,116.071"/>
					<path fill="#949494" d="M90.749,128.542l-0.741,22.076c-9.839,10.979-15.469,24.676-15.946,38.89l0.741-22.076
						C75.28,153.219,80.91,139.521,90.749,128.542"/>
				</g>
			</g>
			<g enable-background="new    ">
				<defs>
					<path id="SVGID_3_" enable-background="new    " d="M227.135,195.13c-0.232,6.912-1.563,13.715-3.904,20.203l0.741-22.076
						c2.341-6.488,3.672-13.291,3.904-20.204C227.654,179.677,227.357,188.507,227.135,195.13z"/>
				</defs>
				<clipPath id="SVGID_4_">
					<use xlink:href="#SVGID_3_"  overflow="visible"/>
				</clipPath>
				<g clip-path="url(#SVGID_4_)" enable-background="new    ">
					<path fill="#949494" d="M227.876,173.055l-0.741,22.076c-0.232,6.912-1.563,13.715-3.904,20.203l0.741-22.076
						C226.314,186.77,227.645,179.967,227.876,173.055"/>
				</g>
			</g>
			<g enable-background="new    ">
				<defs>
					<path id="SVGID_5_" enable-background="new    " d="M215.641,214.708c0.218-6.5,0.436-12.998,0.655-19.498
						c0,0.004-0.001,0.008-0.001,0.013C216.077,201.718,215.858,208.212,215.641,214.708z"/>
				</defs>
				<clipPath id="SVGID_6_">
					<use xlink:href="#SVGID_5_"  overflow="visible"/>
				</clipPath>
				<g clip-path="url(#SVGID_6_)" enable-background="new    ">
					<path fill="#8A8A8A" d="M218.288,194.522l-0.741,22.076c-0.699,0.213-1.363,0.442-1.993,0.688
						c-0.742,0.29-1.421,0.595-2.044,0.913l0.741-22.076c0.623-0.317,1.303-0.623,2.044-0.912
						C216.924,194.965,217.589,194.735,218.288,194.522"/>
				</g>
			</g>
			<g enable-background="new    ">
				<defs>
					<path id="SVGID_7_" enable-background="new    " d="M215.554,217.286c-0.742,0.29-1.421,0.595-2.044,0.913
						c0.247-7.359,0.496-14.717,0.741-22.076c0.623-0.317,1.303-0.623,2.044-0.912c0,0,0,0,0,0c0,0.004-0.001,0.008-0.001,0.013
						c-0.247,7.354-0.495,14.708-0.74,22.062c0.018-0.53,0.036-1.06,0.054-1.59c0.229-6.829,0.458-13.656,0.688-20.485
						c2.159-0.842,4.737-1.495,7.677-1.952l-0.741,22.076C220.292,215.791,217.713,216.444,215.554,217.286z"/>
				</defs>
				<clipPath id="SVGID_8_">
					<use xlink:href="#SVGID_7_"  overflow="visible"/>
				</clipPath>
				<g clip-path="url(#SVGID_8_)" enable-background="new    ">
					<path fill="#858585" d="M223.973,193.258l-0.741,22.076c-2.083,0.324-3.985,0.747-5.685,1.265l0.741-22.076
						C219.988,194.004,221.889,193.582,223.973,193.258"/>
					<path fill="#8A8A8A" d="M218.288,194.522l-0.741,22.076c-0.699,0.213-1.363,0.442-1.993,0.688
						c-0.742,0.29-1.421,0.595-2.044,0.913l0.741-22.076c0.623-0.317,1.303-0.623,2.044-0.912
						C216.924,194.965,217.589,194.735,218.288,194.522"/>
				</g>
			</g>
			<g enable-background="new    ">
				<defs>
					<path id="SVGID_9_" enable-background="new    " d="M331.746,242.947c-0.247,7.359-0.495,14.717-0.741,22.076
						c0.107-3.203-3.82-12.093-12.769-16.817c-12.465-6.571-53.89-25.524-79.991-26.431c-7.807-0.269-14.362,0.367-18.617,1.795
						c-0.291,0.098-0.571,0.198-0.84,0.303c-1.209,0.472-2.584,1.167-3.286,2.077l0.742-22.076c0.701-0.909,2.076-1.604,3.286-2.076
						c0.269-0.105,0.549-0.206,0.84-0.304c4.256-1.428,10.811-2.063,18.617-1.795c26.101,0.907,67.526,19.86,79.991,26.431
						C327.926,230.854,331.854,239.744,331.746,242.947z"/>
				</defs>
				<clipPath id="SVGID_10_">
					<use xlink:href="#SVGID_9_"  overflow="visible"/>
				</clipPath>
				<g clip-path="url(#SVGID_10_)" enable-background="new    ">
					<path fill="#858585" d="M331.746,242.947l-0.741,22.076c0.107-3.203-3.82-12.093-12.769-16.817
						c-12.465-6.571-53.89-25.524-79.991-26.431c-7.463-0.257-13.783,0.313-18.043,1.611l0.741-22.076
						c4.26-1.298,10.58-1.868,18.043-1.611c26.101,0.907,67.526,19.86,79.991,26.431
						C327.926,230.854,331.854,239.744,331.746,242.947"/>
					<path fill="#8A8A8A" d="M220.944,201.31l-0.741,22.076c-0.196,0.06-0.387,0.121-0.574,0.184
						c-0.291,0.098-0.571,0.198-0.84,0.303c-0.65,0.254-1.349,0.572-1.964,0.954l0.741-22.076c0.615-0.382,1.313-0.7,1.964-0.954
						c0.269-0.105,0.549-0.206,0.84-0.304C220.557,201.431,220.748,201.37,220.944,201.31"/>
					<path fill="#8F8F8F" d="M217.565,202.751l-0.741,22.076c-0.452,0.28-0.858,0.593-1.169,0.94l0.742-22.076
						C216.707,203.344,217.114,203.03,217.565,202.751"/>
					<path fill="#949494" d="M216.396,203.691l-0.742,22.076c-0.054,0.06-0.104,0.121-0.152,0.183l0.742-22.076
						C216.292,203.812,216.343,203.751,216.396,203.691"/>
				</g>
			</g>
			<g>
				<path fill="#ECECEC" d="M216.244,203.874c0.701-0.909,2.076-1.604,3.286-2.076c0.269-0.105,0.549-0.206,0.84-0.304
					c-0.716,1.382-1.48,2.744-2.293,4.083C217.354,204.915,216.739,204.342,216.244,203.874z"/>
			</g>
			<g enable-background="new    ">
				<defs>
					<path id="SVGID_11_" enable-background="new    " d="M219.628,223.569c-0.716,1.383-1.48,2.744-2.293,4.083
						c0.218-6.499,0.437-12.998,0.655-19.497l0.086-2.579c0.813-1.34,1.577-2.701,2.293-4.083
						C220.147,208.116,221.305,217.159,219.628,223.569z"/>
				</defs>
				<clipPath id="SVGID_12_">
					<use xlink:href="#SVGID_11_"  overflow="visible"/>
				</clipPath>
				<g clip-path="url(#SVGID_12_)" enable-background="new    ">
					<path fill="#949494" d="M220.37,201.494l-0.741,22.076c-0.716,1.383-1.48,2.744-2.293,4.083l0.741-22.076
						C218.89,204.237,219.653,202.876,220.37,201.494"/>
				</g>
			</g>
			<g>
				<polygon fill="#808080" points="208.124,206.507 207.383,228.583 206.97,228.166 207.711,206.09 				"/>
			</g>
			<g>
				<polygon fill="#808080" points="208.801,207.192 208.06,229.268 207.383,228.583 208.124,206.507 				"/>
			</g>
			<g enable-background="new    ">
				<defs>
					<path id="SVGID_13_" enable-background="new    " d="M339.697,243.29c-0.247,7.359-0.495,14.717-0.741,22.076
						c-0.094,2.785-1.239,4.464-2.308,5.437c-0.729,0.673-1.723,1.246-3.023,1.753c-9.07,3.538-35.573,4.73-63.644-3.964
						c-25.017-7.749-47.33-25.985-56.946-34.642c-2.944-2.65-4.698-4.403-4.975-4.682l0.741-22.076
						c0.277,0.279,2.032,2.032,4.975,4.682c9.616,8.656,31.93,26.893,56.946,34.642c28.071,8.694,54.574,7.502,63.644,3.964
						c1.3-0.507,2.294-1.08,3.023-1.753C338.458,247.754,339.603,246.075,339.697,243.29z"/>
				</defs>
				<clipPath id="SVGID_14_">
					<use xlink:href="#SVGID_13_"  overflow="visible"/>
				</clipPath>
				<g clip-path="url(#SVGID_14_)" enable-background="new    ">
					<path fill="#949494" d="M339.697,243.29l-0.741,22.076c-0.08,2.373-0.922,3.942-1.831,4.957l0.741-22.076
						C338.774,247.232,339.617,245.662,339.697,243.29"/>
					<path fill="#8F8F8F" d="M337.866,248.247l-0.741,22.076c-0.158,0.177-0.318,0.336-0.477,0.48
						c-0.307,0.283-0.662,0.549-1.066,0.8l0.742-22.076c0.404-0.25,0.758-0.516,1.065-0.8
						C337.548,248.583,337.708,248.423,337.866,248.247"/>
					<path fill="#8A8A8A" d="M336.324,249.526l-0.742,22.076c-0.555,0.344-1.205,0.66-1.957,0.953
						c-0.453,0.177-0.95,0.348-1.487,0.512l0.741-22.076c0.538-0.164,1.034-0.335,1.487-0.512
						C335.119,250.186,335.769,249.871,336.324,249.526"/>
					<path fill="#858585" d="M332.879,250.991l-0.741,22.076c-10.234,3.121-35.487,3.784-62.157-4.476
						c-25.017-7.749-47.33-25.985-56.946-34.642c-2.944-2.65-4.698-4.403-4.975-4.682l0.741-22.076
						c0.277,0.279,2.032,2.032,4.975,4.682c9.616,8.656,31.93,26.893,56.946,34.642
						C297.392,254.775,322.645,254.112,332.879,250.991"/>
				</g>
			</g>
			<g>
				<path fill="#ECECEC" d="M322.993,219.946c9.544,5.036,15.547,14.365,16.551,20.984c0.65,4.24-0.812,6.576-2.154,7.797
					c-0.729,0.673-1.723,1.246-3.023,1.753c-9.07,3.538-35.573,4.73-63.644-3.964c-25.016-7.749-47.33-25.985-56.946-34.642
					c-2.943-2.65-4.698-4.403-4.975-4.682l-0.677-0.685l-0.413-0.417l0.073-1.468c0.138-2.529,1.419-5.925,6.466-8.5
					c0.623-0.317,1.303-0.623,2.044-0.912c2.159-0.843,4.738-1.495,7.677-1.953c4.355-0.678,9.505-0.927,15.269-0.73
					C267.117,193.493,309.152,212.649,322.993,219.946z M331.615,243.678c0.917-2.265-2.867-12.39-12.638-17.548
					c-12.464-6.571-53.89-25.523-79.991-26.431c-7.807-0.269-14.361,0.367-18.617,1.795c-0.291,0.098-0.571,0.199-0.84,0.304
					c-1.21,0.472-2.585,1.167-3.286,2.076c0.495,0.468,1.109,1.042,1.833,1.704c8.24,7.533,30.746,26.582,55.209,34.156
					c26.66,8.255,51.204,6.751,57.846,4.16C331.362,243.803,331.523,243.731,331.615,243.678"/>
			</g>
			<g enable-background="new    ">
				<defs>
					<path id="SVGID_15_" enable-background="new    " d="M66.066,189.253c0.248-7.359,0.495-14.717,0.742-22.076
						c-0.354,10.541,1.846,21.336,6.914,31.657c18.052,36.766,65.773,53.801,106.368,37.966
						c14.12-5.508,25.548-14.282,33.687-24.926l-0.741,22.076c-8.139,10.645-19.567,19.418-33.688,24.926
						c-40.594,15.835-88.315-1.2-106.367-37.966C67.913,210.589,65.712,199.793,66.066,189.253z"/>
				</defs>
				<clipPath id="SVGID_16_">
					<use xlink:href="#SVGID_15_"  overflow="visible"/>
				</clipPath>
				<g clip-path="url(#SVGID_16_)" enable-background="new    ">
					<path fill="#949494" d="M213.776,211.874l-0.741,22.076c-1.136,1.487-2.337,2.937-3.6,4.346l0.741-22.076
						C211.439,214.81,212.64,213.36,213.776,211.874"/>
					<path fill="#8F8F8F" d="M210.176,216.22l-0.741,22.076c-4.699,5.243-10.262,9.929-16.607,13.863l0.741-22.076
						C199.914,226.149,205.478,221.463,210.176,216.22"/>
					<path fill="#8A8A8A" d="M193.569,230.083l-0.741,22.076c-4.165,2.582-8.666,4.839-13.48,6.717
						c-2.037,0.794-4.091,1.506-6.159,2.137l0.741-22.076c2.068-0.631,4.123-1.343,6.16-2.137
						C184.903,234.922,189.405,232.665,193.569,230.083"/>
					<path fill="#858585" d="M173.93,238.937l-0.741,22.076c-39.149,11.939-83.062-5.182-100.208-40.103
						c-5.068-10.321-7.269-21.116-6.915-31.657l0.742-22.076c-0.354,10.541,1.846,21.336,6.914,31.657
						C90.868,233.755,134.781,250.876,173.93,238.937"/>
				</g>
			</g>
			<g>
				<path fill="#ECECEC" d="M114.603,103.428c40.595-15.835,88.304,1.196,106.36,37.969c8.39,17.088,8.921,35.479,3.01,51.86
					c-2.939,0.457-5.518,1.11-7.677,1.953c-0.742,0.289-1.422,0.595-2.044,0.912c7.455-15.976,7.847-34.656-0.606-51.871
					c-16.273-33.143-59.247-48.499-95.808-34.236c-36.561,14.262-53.071,52.821-36.798,85.964
					c16.27,33.135,59.255,48.495,95.816,34.233c13.266-5.175,23.892-13.552,31.269-23.706l0.677,0.685
					c0.277,0.279,2.032,2.032,4.975,4.683c-8.139,10.644-19.567,19.418-33.687,24.926c-40.594,15.835-88.315-1.2-106.368-37.966
					C55.666,162.06,74.009,119.264,114.603,103.428z"/>
			</g>
		</g>
	</g>
</g>
<g>
	<g>
		<g enable-background="new    ">
			<g enable-background="new    ">
				<defs>
					<path id="SVGID_17_" enable-background="new    " d="M111.859,125.51c40.595-15.835,88.304,1.196,106.36,37.969
						c8.391,17.088,8.922,35.478,3.011,51.86c-2.94,0.458-5.519,1.11-7.678,1.953c-0.74,0.289-1.419,0.593-2.04,0.91
						c7.457-15.977,7.851-34.657-0.602-51.872c-16.273-33.143-59.259-48.502-95.82-34.24
						c-36.562,14.262-53.068,52.828-36.795,85.971c16.27,33.135,59.255,48.496,95.816,34.233
						c13.269-5.176,23.894-13.55,31.271-23.708l0.684,0.683c0.274,0.278,2.025,2.03,4.97,4.682
						c-8.139,10.647-19.568,19.421-33.69,24.93c-40.595,15.835-88.307-1.203-106.36-37.969
						C52.93,184.139,71.265,141.345,111.859,125.51z"/>
				</defs>
				<clipPath id="SVGID_18_">
					<use xlink:href="#SVGID_17_"  overflow="visible"/>
				</clipPath>
				<path clip-path="url(#SVGID_18_)" fill="none" stroke="#000000" stroke-width="0.25" stroke-miterlimit="10" d="M111.859,125.51
					c40.595-15.835,88.304,1.196,106.36,37.969c8.391,17.088,8.922,35.478,3.011,51.86c-2.94,0.458-5.519,1.11-7.678,1.953
					c-0.74,0.289-1.419,0.593-2.04,0.91c7.457-15.977,7.851-34.657-0.602-51.872c-16.273-33.143-59.259-48.502-95.82-34.24
					c-36.562,14.262-53.068,52.828-36.795,85.971c16.27,33.135,59.255,48.496,95.816,34.233
					c13.269-5.176,23.894-13.55,31.271-23.708l0.684,0.683c0.274,0.278,2.025,2.03,4.97,4.682
					c-8.139,10.647-19.568,19.421-33.69,24.93c-40.595,15.835-88.307-1.203-106.36-37.969
					C52.93,184.139,71.265,141.345,111.859,125.51z"/>
			</g>
			<g enable-background="new    ">
				<defs>
					<path id="SVGID_19_" enable-background="new    " d="M112.601,103.434c40.594-15.835,88.303,1.196,106.359,37.97
						c8.391,17.088,8.922,35.478,3.011,51.859c-2.94,0.458-5.518,1.111-7.678,1.953c-0.74,0.289-1.419,0.593-2.04,0.91
						c7.457-15.977,7.851-34.657-0.602-51.872c-16.273-33.143-59.258-48.503-95.82-34.241
						c-36.562,14.262-53.068,52.829-36.795,85.971c16.27,33.136,59.255,48.496,95.816,34.233
						c13.269-5.176,23.894-13.55,31.272-23.707l0.683,0.683c0.274,0.278,2.026,2.03,4.97,4.682
						c-8.139,10.647-19.568,19.421-33.69,24.93c-40.595,15.835-88.307-1.203-106.36-37.97
						C53.671,162.062,72.006,119.269,112.601,103.434z"/>
				</defs>
				<clipPath id="SVGID_20_">
					<use xlink:href="#SVGID_19_"  overflow="visible"/>
				</clipPath>
				<path clip-path="url(#SVGID_20_)" fill="none" stroke="#000000" stroke-width="0.25" stroke-miterlimit="10" d="
					M112.601,103.434c40.594-15.835,88.303,1.196,106.359,37.97c8.391,17.088,8.922,35.478,3.011,51.859
					c-2.94,0.458-5.518,1.111-7.678,1.953c-0.74,0.289-1.419,0.593-2.04,0.91c7.457-15.977,7.851-34.657-0.602-51.872
					c-16.273-33.143-59.258-48.503-95.82-34.241c-36.562,14.262-53.068,52.829-36.795,85.971
					c16.27,33.136,59.255,48.496,95.816,34.233c13.269-5.176,23.894-13.55,31.272-23.707l0.683,0.683
					c0.274,0.278,2.026,2.03,4.97,4.682c-8.139,10.647-19.568,19.421-33.69,24.93c-40.595,15.835-88.307-1.203-106.36-37.97
					C53.671,162.062,72.006,119.269,112.601,103.434z"/>
			</g>
			<g enable-background="new    ">
				<defs>
					<path id="SVGID_21_" enable-background="new    " d="M225.875,173.061l-0.741,22.076c-0.232,6.912-1.563,13.715-3.904,20.203
						l0.741-22.076C224.312,186.775,225.643,179.972,225.875,173.061z"/>
				</defs>
				<clipPath id="SVGID_22_">
					<use xlink:href="#SVGID_21_"  overflow="visible"/>
				</clipPath>
				<g clip-path="url(#SVGID_22_)" enable-background="new    ">
					<g>
						<path fill="none" stroke="#000000" stroke-width="0.25" stroke-miterlimit="10" d="M218.96,141.403l-0.741,22.076
							c8.391,17.088,8.922,35.478,3.011,51.86l0.741-22.076C227.882,176.881,227.351,158.491,218.96,141.403z"/>
						
							<line fill="none" stroke="#000000" stroke-width="0.25" stroke-miterlimit="10" x1="225.683" y1="176.334" x2="224.941" y2="198.41"/>
					</g>
				</g>
				<path clip-path="url(#SVGID_22_)" fill="none" stroke="#000000" stroke-width="0.25" stroke-miterlimit="10" d="
					M225.875,173.061l-0.741,22.076c-0.232,6.912-1.563,13.715-3.904,20.203l0.741-22.076
					C224.312,186.775,225.643,179.972,225.875,173.061z"/>
			</g>
			<g enable-background="new    ">
				<defs>
					<path id="SVGID_23_" enable-background="new    " d="M225.134,195.136c0.354-10.541-1.847-21.336-6.915-31.657
						c-18.056-36.773-65.765-53.804-106.36-37.969l0.742-22.076c40.594-15.835,88.303,1.196,106.359,37.97
						c5.068,10.32,7.269,21.116,6.915,31.657C225.652,179.683,225.356,188.514,225.134,195.136z"/>
				</defs>
				<clipPath id="SVGID_24_">
					<use xlink:href="#SVGID_23_"  overflow="visible"/>
				</clipPath>
				<g clip-path="url(#SVGID_24_)" enable-background="new    ">
					<g>
						<path fill="none" stroke="#000000" stroke-width="0.25" stroke-miterlimit="10" d="M112.601,103.434l-0.742,22.076
							c40.595-15.835,88.304,1.196,106.36,37.969l0.741-22.076C200.904,104.629,153.195,87.599,112.601,103.434z"/>
						
							<line fill="none" stroke="#000000" stroke-width="0.25" stroke-miterlimit="10" x1="154.205" y1="98.068" x2="153.464" y2="120.144"/>
						
							<line fill="none" stroke="#000000" stroke-width="0.25" stroke-miterlimit="10" x1="192.382" y1="111.696" x2="191.641" y2="133.772"/>
					</g>
					<g>
						<path fill="none" stroke="#000000" stroke-width="0.25" stroke-miterlimit="10" d="M218.96,141.403l-0.741,22.076
							c8.391,17.088,8.922,35.478,3.011,51.86l0.741-22.076C227.882,176.881,227.351,158.491,218.96,141.403z"/>
						
							<line fill="none" stroke="#000000" stroke-width="0.25" stroke-miterlimit="10" x1="224.784" y1="158.803" x2="224.042" y2="180.878"/>
					</g>
				</g>
				<path clip-path="url(#SVGID_24_)" fill="none" stroke="#000000" stroke-width="0.25" stroke-miterlimit="10" d="
					M225.134,195.136c0.354-10.541-1.847-21.336-6.915-31.657c-18.056-36.773-65.765-53.804-106.36-37.969l0.742-22.076
					c40.594-15.835,88.303,1.196,106.359,37.97c5.068,10.32,7.269,21.116,6.915,31.657
					C225.652,179.683,225.356,188.514,225.134,195.136z"/>
			</g>
			<g enable-background="new    ">
				<defs>
					<path id="SVGID_25_" enable-background="new    " d="M221.971,193.263l-0.741,22.076c-2.94,0.458-5.519,1.11-7.678,1.953
						c-0.74,0.289-1.419,0.593-2.04,0.91l0.741-22.076c0.621-0.317,1.3-0.621,2.04-0.91
						C216.453,194.374,219.031,193.721,221.971,193.263z"/>
				</defs>
				<clipPath id="SVGID_26_">
					<use xlink:href="#SVGID_25_"  overflow="visible"/>
				</clipPath>
				<g clip-path="url(#SVGID_26_)" enable-background="new    ">
					<g>
						<path fill="none" stroke="#000000" stroke-width="0.25" stroke-miterlimit="10" d="M221.971,193.263l-0.741,22.076
							c-2.94,0.458-5.519,1.11-7.678,1.953l0.741-22.076C216.453,194.374,219.031,193.721,221.971,193.263z"/>
						
							<line fill="none" stroke="#000000" stroke-width="0.25" stroke-miterlimit="10" x1="219.154" y1="193.785" x2="218.413" y2="215.861"/>
						
							<line fill="none" stroke="#000000" stroke-width="0.25" stroke-miterlimit="10" x1="216.59" y1="194.437" x2="215.849" y2="216.513"/>
					</g>
					<g>
						<path fill="none" stroke="#000000" stroke-width="0.25" stroke-miterlimit="10" d="M214.293,195.216l-0.741,22.076
							c-0.74,0.289-1.419,0.593-2.04,0.91l0.741-22.076C212.875,195.809,213.553,195.505,214.293,195.216z"/>
						
							<line fill="none" stroke="#000000" stroke-width="0.25" stroke-miterlimit="10" x1="213.574" y1="195.51" x2="212.833" y2="217.586"/>
						
							<line fill="none" stroke="#000000" stroke-width="0.25" stroke-miterlimit="10" x1="212.894" y1="195.813" x2="212.153" y2="217.889"/>
					</g>
				</g>
				<path clip-path="url(#SVGID_26_)" fill="none" stroke="#000000" stroke-width="0.25" stroke-miterlimit="10" d="
					M221.971,193.263l-0.741,22.076c-2.94,0.458-5.519,1.11-7.678,1.953c-0.74,0.289-1.419,0.593-2.04,0.91l0.741-22.076
					c0.621-0.317,1.3-0.621,2.04-0.91C216.453,194.374,219.031,193.721,221.971,193.263z"/>
			</g>
			<g enable-background="new    ">
				<defs>
					<path id="SVGID_27_" enable-background="new    " d="M217.886,172.798l-0.741,22.076c0.319-9.503-1.666-19.237-6.234-28.543
						c-16.273-33.143-59.259-48.502-95.82-34.24c-26.292,10.256-42.214,33.082-43.031,57.42v0c0.124-3.679,0.248-7.358,0.371-11.038
						c0.123-3.679,0.247-7.358,0.371-11.038c0.817-24.338,16.738-47.164,43.031-57.42c36.562-14.262,79.546,1.098,95.82,34.241
						C216.221,153.56,218.205,163.294,217.886,172.798z"/>
				</defs>
				<clipPath id="SVGID_28_">
					<use xlink:href="#SVGID_27_"  overflow="visible"/>
				</clipPath>
				<g clip-path="url(#SVGID_28_)" enable-background="new    ">
					<g>
						<path fill="none" stroke="#000000" stroke-width="0.25" stroke-miterlimit="10" d="M212.253,196.126l-0.741,22.076
							c7.457-15.977,7.851-34.657-0.602-51.872l0.741-22.076C220.104,161.469,219.71,180.149,212.253,196.126z"/>
						
							<line fill="none" stroke="#000000" stroke-width="0.25" stroke-miterlimit="10" x1="217.221" y1="161.803" x2="216.48" y2="183.879"/>
					</g>
					<g>
						<path fill="none" stroke="#000000" stroke-width="0.25" stroke-miterlimit="10" d="M211.651,144.254l-0.741,22.076
							c-16.273-33.143-59.259-48.502-95.82-34.24l0.741-22.076C152.393,95.751,195.378,111.111,211.651,144.254z"/>
						
							<line fill="none" stroke="#000000" stroke-width="0.25" stroke-miterlimit="10" x1="187.701" y1="117.478" x2="186.96" y2="139.554"/>
						
							<line fill="none" stroke="#000000" stroke-width="0.25" stroke-miterlimit="10" x1="153.307" y1="105.187" x2="152.565" y2="127.263"/>
					</g>
					<g>
						<path fill="none" stroke="#000000" stroke-width="0.25" stroke-miterlimit="10" d="M115.832,110.014l-0.741,22.076
							c-36.562,14.262-53.068,52.828-36.795,85.971l0.741-22.076C62.764,162.842,79.27,124.275,115.832,110.014z"/>
						
							<line fill="none" stroke="#000000" stroke-width="0.25" stroke-miterlimit="10" x1="86.426" y1="131.276" x2="85.685" y2="153.352"/>
						
							<line fill="none" stroke="#000000" stroke-width="0.25" stroke-miterlimit="10" x1="73.219" y1="162.135" x2="72.478" y2="184.211"/>
					</g>
				</g>
				<path clip-path="url(#SVGID_28_)" fill="none" stroke="#000000" stroke-width="0.25" stroke-miterlimit="10" d="
					M217.886,172.798l-0.741,22.076c0.319-9.503-1.666-19.237-6.234-28.543c-16.273-33.143-59.259-48.502-95.82-34.24
					c-26.292,10.256-42.214,33.082-43.031,57.42v0c0.124-3.679,0.248-7.358,0.371-11.038c0.123-3.679,0.247-7.358,0.371-11.038
					c0.817-24.338,16.738-47.164,43.031-57.42c36.562-14.262,79.546,1.098,95.82,34.241
					C216.221,153.56,218.205,163.294,217.886,172.798z"/>
			</g>
			<g enable-background="new    ">
				<defs>
					<path id="SVGID_29_" enable-background="new    " d="M217.145,194.874c-0.271,8.077-2.207,15.988-5.632,23.329l0.741-22.076
						c3.426-7.34,5.361-15.251,5.632-23.328C217.663,179.42,217.367,188.251,217.145,194.874z"/>
				</defs>
				<clipPath id="SVGID_30_">
					<use xlink:href="#SVGID_29_"  overflow="visible"/>
				</clipPath>
				<g clip-path="url(#SVGID_30_)" enable-background="new    ">
					<g>
						<path fill="none" stroke="#000000" stroke-width="0.25" stroke-miterlimit="10" d="M212.253,196.126l-0.741,22.076
							c7.457-15.977,7.851-34.657-0.602-51.872l0.741-22.076C220.104,161.469,219.71,180.149,212.253,196.126z"/>
						
							<line fill="none" stroke="#000000" stroke-width="0.25" stroke-miterlimit="10" x1="217.29" y1="179.402" x2="216.548" y2="201.479"/>
					</g>
				</g>
				<path clip-path="url(#SVGID_30_)" fill="none" stroke="#000000" stroke-width="0.25" stroke-miterlimit="10" d="
					M217.145,194.874c-0.271,8.077-2.207,15.988-5.632,23.329l0.741-22.076c3.426-7.34,5.361-15.251,5.632-23.328
					C217.663,179.42,217.367,188.251,217.145,194.874z"/>
			</g>
			<g enable-background="new    ">
				<defs>
					<path id="SVGID_31_" enable-background="new    " d="M72.801,167.434c-0.319,9.506,1.666,19.243,6.236,28.551
						c16.27,33.136,59.255,48.496,95.816,34.233c13.269-5.176,23.894-13.55,31.272-23.707l-0.742,22.076
						c-7.378,10.157-18.003,18.531-31.271,23.708c-36.562,14.262-79.546-1.098-95.816-34.233c-4.57-9.309-6.555-19.045-6.236-28.551
						C72.306,182.151,72.554,174.793,72.801,167.434z"/>
				</defs>
				<clipPath id="SVGID_32_">
					<use xlink:href="#SVGID_31_"  overflow="visible"/>
				</clipPath>
				<g clip-path="url(#SVGID_32_)" enable-background="new    ">
					<g>
						<path fill="none" stroke="#000000" stroke-width="0.25" stroke-miterlimit="10" d="M115.832,110.014l-0.741,22.076
							c-36.562,14.262-53.068,52.828-36.795,85.971l0.741-22.076C62.764,162.842,79.27,124.275,115.832,110.014z"/>
					</g>
					<g>
						<path fill="none" stroke="#000000" stroke-width="0.25" stroke-miterlimit="10" d="M79.037,195.985l-0.741,22.076
							c16.27,33.135,59.255,48.496,95.816,34.233l0.741-22.076C138.292,244.48,95.307,229.121,79.037,195.985z"/>
						
							<line fill="none" stroke="#000000" stroke-width="0.25" stroke-miterlimit="10" x1="102.984" y1="222.756" x2="102.243" y2="244.833"/>
						
							<line fill="none" stroke="#000000" stroke-width="0.25" stroke-miterlimit="10" x1="137.378" y1="235.045" x2="136.637" y2="257.121"/>
					</g>
					<g>
						<path fill="none" stroke="#000000" stroke-width="0.25" stroke-miterlimit="10" d="M174.853,230.218l-0.741,22.076
							c13.269-5.176,23.894-13.55,31.271-23.708l0.742-22.076C198.747,216.668,188.122,225.042,174.853,230.218z"/>
						
							<line fill="none" stroke="#000000" stroke-width="0.25" stroke-miterlimit="10" x1="187.218" y1="224.029" x2="186.477" y2="246.104"/>
						
							<line fill="none" stroke="#000000" stroke-width="0.25" stroke-miterlimit="10" x1="197.687" y1="216.021" x2="196.945" y2="238.097"/>
					</g>
				</g>
				<path clip-path="url(#SVGID_32_)" fill="none" stroke="#000000" stroke-width="0.25" stroke-miterlimit="10" d="M72.801,167.434
					c-0.319,9.506,1.666,19.243,6.236,28.551c16.27,33.136,59.255,48.496,95.816,34.233c13.269-5.176,23.894-13.55,31.272-23.707
					l-0.742,22.076c-7.378,10.157-18.003,18.531-31.271,23.708c-36.562,14.262-79.546-1.098-95.816-34.233
					c-4.57-9.309-6.555-19.045-6.236-28.551C72.306,182.151,72.554,174.793,72.801,167.434z"/>
			</g>
			<g enable-background="new    ">
				<defs>
					<polygon id="SVGID_33_" enable-background="new    " points="206.125,206.511 206.808,207.194 206.067,229.27 205.383,228.587 
											"/>
				</defs>
				<clipPath id="SVGID_34_">
					<use xlink:href="#SVGID_33_"  overflow="visible"/>
				</clipPath>
				<polygon clip-path="url(#SVGID_34_)" fill="none" stroke="#000000" stroke-width="0.25" stroke-miterlimit="10" points="
					206.125,206.511 206.808,207.194 206.067,229.27 205.383,228.587 				"/>
			</g>
			<g enable-background="new    ">
				<defs>
					<path id="SVGID_35_" enable-background="new    " d="M206.808,207.194c0.274,0.278,2.026,2.03,4.97,4.682l-0.741,22.076
						c-2.944-2.652-4.696-4.404-4.97-4.682L206.808,207.194z"/>
				</defs>
				<clipPath id="SVGID_36_">
					<use xlink:href="#SVGID_35_"  overflow="visible"/>
				</clipPath>
				<g clip-path="url(#SVGID_36_)" enable-background="new    ">
					<g>
						<path fill="none" stroke="#000000" stroke-width="0.25" stroke-miterlimit="10" d="M206.808,207.194l-0.741,22.076
							c0.274,0.278,2.025,2.03,4.97,4.682l0.741-22.076C208.834,209.224,207.083,207.472,206.808,207.194z"/>
						
							<line fill="none" stroke="#000000" stroke-width="0.25" stroke-miterlimit="10" x1="207.564" y1="207.942" x2="206.823" y2="230.018"/>
						
							<line fill="none" stroke="#000000" stroke-width="0.25" stroke-miterlimit="10" x1="209.242" y1="209.545" x2="208.5" y2="231.621"/>
					</g>
				</g>
				<path clip-path="url(#SVGID_36_)" fill="none" stroke="#000000" stroke-width="0.25" stroke-miterlimit="10" d="
					M206.808,207.194c0.274,0.278,2.026,2.03,4.97,4.682l-0.741,22.076c-2.944-2.652-4.696-4.404-4.97-4.682L206.808,207.194z"/>
			</g>
			<g enable-background="new    ">
				<defs>
					<path id="SVGID_37_" enable-background="new    " d="M64.812,167.174c0.907-27.013,18.59-52.351,47.789-63.741l-0.742,22.076
						c-29.199,11.39-46.881,36.728-47.789,63.74C64.318,181.891,64.565,174.533,64.812,167.174z"/>
				</defs>
				<clipPath id="SVGID_38_">
					<use xlink:href="#SVGID_37_"  overflow="visible"/>
				</clipPath>
				<g clip-path="url(#SVGID_38_)" enable-background="new    ">
					<g>
						<path fill="none" stroke="#000000" stroke-width="0.25" stroke-miterlimit="10" d="M71.728,198.836l-0.741,22.076
							c-18.056-36.773,0.279-79.567,40.873-95.402l0.742-22.076C72.006,119.269,53.671,162.062,71.728,198.836z"/>
						
							<line fill="none" stroke="#000000" stroke-width="0.25" stroke-miterlimit="10" x1="65.278" y1="161.277" x2="64.537" y2="183.354"/>
						
							<line fill="none" stroke="#000000" stroke-width="0.25" stroke-miterlimit="10" x1="79.95" y1="127.034" x2="79.208" y2="149.11"/>
					</g>
				</g>
				<path clip-path="url(#SVGID_38_)" fill="none" stroke="#000000" stroke-width="0.25" stroke-miterlimit="10" d="M64.812,167.174
					c0.907-27.013,18.59-52.351,47.789-63.741l-0.742,22.076c-29.199,11.39-46.881,36.728-47.789,63.74
					C64.318,181.891,64.565,174.533,64.812,167.174z"/>
			</g>
			<g enable-background="new    ">
				<defs>
					<path id="SVGID_39_" enable-background="new    " d="M64.071,189.25c0.247-7.359,0.494-14.717,0.741-22.076
						c-0.354,10.542,1.847,21.339,6.916,31.662c18.053,36.767,65.765,53.805,106.36,37.97c14.123-5.509,25.551-14.283,33.69-24.93
						l-0.741,22.076c-8.139,10.647-19.568,19.421-33.69,24.93c-40.595,15.835-88.307-1.203-106.36-37.969
						C65.918,210.589,63.717,199.792,64.071,189.25z"/>
				</defs>
				<clipPath id="SVGID_40_">
					<use xlink:href="#SVGID_39_"  overflow="visible"/>
				</clipPath>
				<g clip-path="url(#SVGID_40_)" enable-background="new    ">
					<g>
						<path fill="none" stroke="#000000" stroke-width="0.25" stroke-miterlimit="10" d="M211.778,211.875l-0.741,22.076
							c-8.139,10.647-19.568,19.421-33.69,24.93l0.741-22.076C192.21,231.296,203.639,222.522,211.778,211.875z"/>
						
							<line fill="none" stroke="#000000" stroke-width="0.25" stroke-miterlimit="10" x1="202.564" y1="221.847" x2="201.823" y2="243.923"/>
						
							<line fill="none" stroke="#000000" stroke-width="0.25" stroke-miterlimit="10" x1="191.29" y1="230.26" x2="190.548" y2="252.336"/>
					</g>
					<g>
						<path fill="none" stroke="#000000" stroke-width="0.25" stroke-miterlimit="10" d="M178.087,236.806l-0.741,22.076
							c-40.595,15.835-88.307-1.203-106.36-37.969l0.741-22.076C89.78,235.603,137.493,252.641,178.087,236.806z"/>
						
							<line fill="none" stroke="#000000" stroke-width="0.25" stroke-miterlimit="10" x1="136.482" y1="242.17" x2="135.741" y2="264.246"/>
						
							<line fill="none" stroke="#000000" stroke-width="0.25" stroke-miterlimit="10" x1="98.305" y1="228.54" x2="97.563" y2="250.616"/>
					</g>
					<g>
						<path fill="none" stroke="#000000" stroke-width="0.25" stroke-miterlimit="10" d="M71.728,198.836l-0.741,22.076
							c-18.056-36.773,0.279-79.567,40.873-95.402l0.742-22.076C72.006,119.269,53.671,162.062,71.728,198.836z"/>
					</g>
				</g>
				<path clip-path="url(#SVGID_40_)" fill="none" stroke="#000000" stroke-width="0.25" stroke-miterlimit="10" d="M64.071,189.25
					c0.247-7.359,0.494-14.717,0.741-22.076c-0.354,10.542,1.847,21.339,6.916,31.662c18.053,36.767,65.765,53.805,106.36,37.97
					c14.123-5.509,25.551-14.283,33.69-24.93l-0.741,22.076c-8.139,10.647-19.568,19.421-33.69,24.93
					c-40.595,15.835-88.307-1.203-106.36-37.969C65.918,210.589,63.717,199.792,64.071,189.25z"/>
			</g>
			<g enable-background="new    ">
				<defs>
					<path id="SVGID_41_" enable-background="new    " d="M213.497,225.948c0.713-0.905,2.088-1.6,3.29-2.069
						c0.269-0.105,0.549-0.206,0.84-0.304c-0.715,1.38-1.48,2.743-2.292,4.081C214.609,226.993,213.994,226.418,213.497,225.948z"/>
				</defs>
				<clipPath id="SVGID_42_">
					<use xlink:href="#SVGID_41_"  overflow="visible"/>
				</clipPath>
				<path clip-path="url(#SVGID_42_)" fill="none" stroke="#000000" stroke-width="0.25" stroke-miterlimit="10" d="
					M213.497,225.948c0.713-0.905,2.088-1.6,3.29-2.069c0.269-0.105,0.549-0.206,0.84-0.304c-0.715,1.38-1.48,2.743-2.292,4.081
					C214.609,226.993,213.994,226.418,213.497,225.948z"/>
			</g>
			<g enable-background="new    ">
				<defs>
					<path id="SVGID_43_" enable-background="new    " d="M214.239,203.872c0.713-0.905,2.087-1.601,3.289-2.069
						c0.27-0.105,0.549-0.206,0.84-0.304c-0.715,1.381-1.479,2.743-2.292,4.081C215.351,204.917,214.735,204.342,214.239,203.872z"
						/>
				</defs>
				<clipPath id="SVGID_44_">
					<use xlink:href="#SVGID_43_"  overflow="visible"/>
				</clipPath>
				<path clip-path="url(#SVGID_44_)" fill="none" stroke="#000000" stroke-width="0.25" stroke-miterlimit="10" d="
					M214.239,203.872c0.713-0.905,2.087-1.601,3.289-2.069c0.27-0.105,0.549-0.206,0.84-0.304c-0.715,1.381-1.479,2.743-2.292,4.081
					C215.351,204.917,214.735,204.342,214.239,203.872z"/>
			</g>
			<g enable-background="new    ">
				<defs>
					<path id="SVGID_45_" enable-background="new    " d="M214.239,203.872c0.713-0.905,2.087-1.601,3.289-2.069
						c0.27-0.105,0.549-0.206,0.84-0.304l-0.741,22.076c-0.291,0.098-0.571,0.199-0.84,0.304c-1.202,0.469-2.576,1.164-3.29,2.069
						C213.72,219.325,211.963,210.096,214.239,203.872z"/>
				</defs>
				<clipPath id="SVGID_46_">
					<use xlink:href="#SVGID_45_"  overflow="visible"/>
				</clipPath>
				<g clip-path="url(#SVGID_46_)" enable-background="new    ">
					<g>
						<path fill="none" stroke="#000000" stroke-width="0.25" stroke-miterlimit="10" d="M214.239,203.872l-0.742,22.076
							c0.713-0.905,2.088-1.6,3.29-2.069l0.741-22.076C216.326,202.271,214.952,202.967,214.239,203.872z"/>
						
							<line fill="none" stroke="#000000" stroke-width="0.25" stroke-miterlimit="10" x1="215.141" y1="203.037" x2="214.4" y2="225.113"/>
						
							<line fill="none" stroke="#000000" stroke-width="0.25" stroke-miterlimit="10" x1="216.299" y1="202.347" x2="215.558" y2="224.422"/>
					</g>
					<g>
						<path fill="none" stroke="#000000" stroke-width="0.25" stroke-miterlimit="10" d="M217.528,201.803l-0.741,22.076
							c0.269-0.105,0.549-0.206,0.84-0.304l0.741-22.076C218.077,201.597,217.797,201.698,217.528,201.803z"/>
						
							<line fill="none" stroke="#000000" stroke-width="0.25" stroke-miterlimit="10" x1="217.801" y1="201.699" x2="217.059" y2="223.775"/>
						
							<line fill="none" stroke="#000000" stroke-width="0.25" stroke-miterlimit="10" x1="218.081" y1="201.598" x2="217.339" y2="223.674"/>
					</g>
				</g>
				<path clip-path="url(#SVGID_46_)" fill="none" stroke="#000000" stroke-width="0.25" stroke-miterlimit="10" d="
					M214.239,203.872c0.713-0.905,2.087-1.601,3.289-2.069c0.27-0.105,0.549-0.206,0.84-0.304l-0.741,22.076
					c-0.291,0.098-0.571,0.199-0.84,0.304c-1.202,0.469-2.576,1.164-3.29,2.069C213.72,219.325,211.963,210.096,214.239,203.872z"/>
			</g>
			<g enable-background="new    ">
				<defs>
					<path id="SVGID_47_" enable-background="new    " d="M218.368,201.499l-0.741,22.076c-0.715,1.38-1.48,2.743-2.292,4.081
						l0.741-22.076C216.888,204.242,217.653,202.88,218.368,201.499z"/>
				</defs>
				<clipPath id="SVGID_48_">
					<use xlink:href="#SVGID_47_"  overflow="visible"/>
				</clipPath>
				<g clip-path="url(#SVGID_48_)" enable-background="new    ">
					<g>
						<path fill="none" stroke="#000000" stroke-width="0.25" stroke-miterlimit="10" d="M218.368,201.499l-0.741,22.076
							c-0.715,1.38-1.48,2.743-2.292,4.081l0.741-22.076C216.888,204.242,217.653,202.88,218.368,201.499z"/>
						
							<line fill="none" stroke="#000000" stroke-width="0.25" stroke-miterlimit="10" x1="217.636" y1="202.874" x2="216.895" y2="224.949"/>
						
							<line fill="none" stroke="#000000" stroke-width="0.25" stroke-miterlimit="10" x1="216.872" y1="204.234" x2="216.131" y2="226.311"/>
					</g>
				</g>
				<path clip-path="url(#SVGID_48_)" fill="none" stroke="#000000" stroke-width="0.25" stroke-miterlimit="10" d="
					M218.368,201.499l-0.741,22.076c-0.715,1.38-1.48,2.743-2.292,4.081l0.741-22.076
					C216.888,204.242,217.653,202.88,218.368,201.499z"/>
			</g>
			<g enable-background="new    ">
				<defs>
					<path id="SVGID_49_" enable-background="new    " d="M216.076,205.58l-0.741,22.076c-0.726-0.664-1.341-1.238-1.838-1.708
						l0.742-22.076C214.735,204.342,215.351,204.917,216.076,205.58z"/>
				</defs>
				<clipPath id="SVGID_50_">
					<use xlink:href="#SVGID_49_"  overflow="visible"/>
				</clipPath>
				<g clip-path="url(#SVGID_50_)" enable-background="new    ">
					<g>
						<path fill="none" stroke="#000000" stroke-width="0.25" stroke-miterlimit="10" d="M216.076,205.58l-0.741,22.076
							c-0.726-0.664-1.341-1.238-1.838-1.708l0.742-22.076C214.735,204.342,215.351,204.917,216.076,205.58z"/>
						
							<line fill="none" stroke="#000000" stroke-width="0.25" stroke-miterlimit="10" x1="215.388" y1="204.947" x2="214.646" y2="227.023"/>
						
							<line fill="none" stroke="#000000" stroke-width="0.25" stroke-miterlimit="10" x1="214.774" y1="204.376" x2="214.033" y2="226.452"/>
					</g>
				</g>
				<path clip-path="url(#SVGID_50_)" fill="none" stroke="#000000" stroke-width="0.25" stroke-miterlimit="10" d="M216.076,205.58
					l-0.741,22.076c-0.726-0.664-1.341-1.238-1.838-1.708l0.742-22.076C214.735,204.342,215.351,204.917,216.076,205.58z"/>
			</g>
			<g enable-background="new    ">
				<defs>
					<path id="SVGID_51_" enable-background="new    " d="M320.25,242.027c9.54,5.028,15.555,14.362,16.555,20.973
						c0.642,4.244-0.816,6.587-2.15,7.805c-0.737,0.676-1.73,1.249-3.031,1.756c-9.07,3.538-35.577,4.722-63.644-3.964
						c-25.015-7.748-47.33-25.988-56.943-34.646c-2.944-2.652-4.695-4.404-4.97-4.682l-0.684-0.683l-0.415-0.416l0.082-1.471
						c0.13-2.527,1.412-5.923,6.462-8.498c0.621-0.317,1.3-0.622,2.04-0.91c2.16-0.843,4.737-1.495,7.678-1.953
						c4.357-0.679,9.509-0.929,15.269-0.729C264.374,215.575,306.409,234.731,320.25,242.027z M328.88,265.756
						c0.918-2.265-2.87-12.397-12.646-17.545c-12.457-6.574-53.89-25.523-79.991-26.431c-7.807-0.269-14.361,0.367-18.617,1.795
						c-0.291,0.098-0.571,0.199-0.84,0.304c-1.202,0.469-2.576,1.164-3.289,2.069c0.496,0.47,1.112,1.045,1.837,1.708
						c8.247,7.54,30.756,26.583,55.208,34.159c26.659,8.255,51.212,6.747,57.846,4.159
						C328.62,265.884,328.781,265.812,328.88,265.756"/>
				</defs>
				<clipPath id="SVGID_52_">
					<use xlink:href="#SVGID_51_"  overflow="visible"/>
				</clipPath>
				<path clip-path="url(#SVGID_52_)" fill="none" stroke="#000000" stroke-width="0.25" stroke-miterlimit="10" d="M320.25,242.027
					c9.54,5.028,15.555,14.362,16.555,20.973c0.642,4.244-0.816,6.587-2.15,7.805c-0.737,0.676-1.73,1.249-3.031,1.756
					c-9.07,3.538-35.577,4.722-63.644-3.964c-25.015-7.748-47.33-25.988-56.943-34.646c-2.944-2.652-4.695-4.404-4.97-4.682
					l-0.684-0.683l-0.415-0.416l0.082-1.471c0.13-2.527,1.412-5.923,6.462-8.498c0.621-0.317,1.3-0.622,2.04-0.91
					c2.16-0.843,4.737-1.495,7.678-1.953c4.357-0.679,9.509-0.929,15.269-0.729C264.374,215.575,306.409,234.731,320.25,242.027z
					 M328.88,265.756c0.918-2.265-2.87-12.397-12.646-17.545c-12.457-6.574-53.89-25.523-79.991-26.431
					c-7.807-0.269-14.361,0.367-18.617,1.795c-0.291,0.098-0.571,0.199-0.84,0.304c-1.202,0.469-2.576,1.164-3.289,2.069
					c0.496,0.47,1.112,1.045,1.837,1.708c8.247,7.54,30.756,26.583,55.208,34.159c26.659,8.255,51.212,6.747,57.846,4.159
					C328.62,265.884,328.781,265.812,328.88,265.756"/>
			</g>
			<g enable-background="new    ">
				<defs>
					<path id="SVGID_53_" enable-background="new    " d="M320.991,219.952c9.54,5.028,15.555,14.362,16.555,20.973
						c0.642,4.244-0.816,6.587-2.15,7.805c-0.737,0.676-1.731,1.249-3.031,1.756c-9.07,3.538-35.576,4.722-63.644-3.964
						c-25.015-7.748-47.33-25.988-56.943-34.646c-2.944-2.651-4.695-4.403-4.97-4.682l-0.684-0.683l-0.415-0.416l0.082-1.472
						c0.13-2.527,1.412-5.923,6.462-8.498c0.622-0.317,1.3-0.622,2.04-0.91c2.16-0.842,4.737-1.495,7.678-1.953
						c4.357-0.678,9.509-0.928,15.269-0.729C265.115,193.499,307.15,212.655,320.991,219.952z M329.622,243.68
						c0.918-2.265-2.87-12.397-12.646-17.545c-12.457-6.574-53.89-25.523-79.991-26.431c-7.807-0.269-14.362,0.367-18.618,1.794
						c-0.291,0.098-0.57,0.199-0.84,0.304c-1.202,0.469-2.576,1.164-3.289,2.069c0.496,0.47,1.112,1.045,1.837,1.708
						c8.247,7.54,30.756,26.583,55.208,34.159c26.659,8.255,51.212,6.747,57.846,4.16
						C329.361,243.808,329.522,243.737,329.622,243.68"/>
				</defs>
				<clipPath id="SVGID_54_">
					<use xlink:href="#SVGID_53_"  overflow="visible"/>
				</clipPath>
				<path clip-path="url(#SVGID_54_)" fill="none" stroke="#000000" stroke-width="0.25" stroke-miterlimit="10" d="
					M320.991,219.952c9.54,5.028,15.555,14.362,16.555,20.973c0.642,4.244-0.816,6.587-2.15,7.805
					c-0.737,0.676-1.731,1.249-3.031,1.756c-9.07,3.538-35.576,4.722-63.644-3.964c-25.015-7.748-47.33-25.988-56.943-34.646
					c-2.944-2.651-4.695-4.403-4.97-4.682l-0.684-0.683l-0.415-0.416l0.082-1.472c0.13-2.527,1.412-5.923,6.462-8.498
					c0.622-0.317,1.3-0.622,2.04-0.91c2.16-0.842,4.737-1.495,7.678-1.953c4.357-0.678,9.509-0.928,15.269-0.729
					C265.115,193.499,307.15,212.655,320.991,219.952z M329.622,243.68c0.918-2.265-2.87-12.397-12.646-17.545
					c-12.457-6.574-53.89-25.523-79.991-26.431c-7.807-0.269-14.362,0.367-18.618,1.794c-0.291,0.098-0.57,0.199-0.84,0.304
					c-1.202,0.469-2.576,1.164-3.289,2.069c0.496,0.47,1.112,1.045,1.837,1.708c8.247,7.54,30.756,26.583,55.208,34.159
					c26.659,8.255,51.212,6.747,57.846,4.16C329.361,243.808,329.522,243.737,329.622,243.68"/>
			</g>
			<g enable-background="new    ">
				<defs>
					<path id="SVGID_55_" enable-background="new    " d="M337.696,243.275c-0.248,7.359-0.495,14.717-0.742,22.076
						c-0.094,2.795-1.236,4.482-2.3,5.454c-0.737,0.676-1.73,1.249-3.031,1.756c-9.07,3.538-35.577,4.722-63.644-3.964
						c-25.015-7.748-47.33-25.988-56.943-34.646c-2.944-2.652-4.695-4.404-4.97-4.682l0.741-22.076
						c0.274,0.278,2.026,2.03,4.97,4.682c9.613,8.658,31.928,26.898,56.943,34.646c28.068,8.686,54.574,7.502,63.644,3.964
						c1.3-0.507,2.294-1.08,3.031-1.756C336.459,247.758,337.602,246.071,337.696,243.275z"/>
				</defs>
				<clipPath id="SVGID_56_">
					<use xlink:href="#SVGID_55_"  overflow="visible"/>
				</clipPath>
				<g clip-path="url(#SVGID_56_)" enable-background="new    ">
					<g>
						<path fill="none" stroke="#000000" stroke-width="0.25" stroke-miterlimit="10" d="M337.546,240.924L336.805,263
							c0.642,4.244-0.816,6.587-2.15,7.805l0.742-22.076C336.73,247.511,338.188,245.168,337.546,240.924z"/>
						
							<line fill="none" stroke="#000000" stroke-width="0.25" stroke-miterlimit="10" x1="337.57" y1="244.563" x2="336.829" y2="266.639"/>
						
							<line fill="none" stroke="#000000" stroke-width="0.25" stroke-miterlimit="10" x1="336.689" y1="247.107" x2="335.947" y2="269.184"/>
					</g>
					<g>
						<path fill="none" stroke="#000000" stroke-width="0.25" stroke-miterlimit="10" d="M335.396,248.729l-0.742,22.076
							c-0.737,0.676-1.73,1.249-3.031,1.756l0.741-22.076C333.665,249.978,334.659,249.405,335.396,248.729z"/>
						
							<line fill="none" stroke="#000000" stroke-width="0.25" stroke-miterlimit="10" x1="334.571" y1="249.372" x2="333.83" y2="271.448"/>
						
							<line fill="none" stroke="#000000" stroke-width="0.25" stroke-miterlimit="10" x1="333.565" y1="249.955" x2="332.823" y2="272.031"/>
					</g>
					<g>
						<path fill="none" stroke="#000000" stroke-width="0.25" stroke-miterlimit="10" d="M332.365,250.485l-0.741,22.076
							c-9.07,3.538-35.577,4.722-63.644-3.964l0.741-22.076C296.789,255.208,323.294,254.023,332.365,250.485z"/>
						
							<line fill="none" stroke="#000000" stroke-width="0.25" stroke-miterlimit="10" x1="318.07" y1="252.96" x2="317.329" y2="275.037"/>
						
							<line fill="none" stroke="#000000" stroke-width="0.25" stroke-miterlimit="10" x1="295.68" y1="252.196" x2="294.938" y2="274.272"/>
					</g>
					<g>
						<path fill="none" stroke="#000000" stroke-width="0.25" stroke-miterlimit="10" d="M268.721,246.521l-0.741,22.076
							c-25.015-7.748-47.33-25.988-56.943-34.646l0.741-22.076C221.391,220.533,243.706,238.773,268.721,246.521z"/>
						
							<line fill="none" stroke="#000000" stroke-width="0.25" stroke-miterlimit="10" x1="244.976" y1="236.02" x2="244.235" y2="258.096"/>
						
							<line fill="none" stroke="#000000" stroke-width="0.25" stroke-miterlimit="10" x1="225.254" y1="222.984" x2="224.513" y2="245.06"/>
					</g>
					<g>
						<path fill="none" stroke="#000000" stroke-width="0.25" stroke-miterlimit="10" d="M211.778,211.875l-0.741,22.076
							c-2.944-2.652-4.695-4.404-4.97-4.682l0.741-22.076C207.083,207.472,208.834,209.224,211.778,211.875z"/>
						
							<line fill="none" stroke="#000000" stroke-width="0.25" stroke-miterlimit="10" x1="209.242" y1="209.545" x2="208.5" y2="231.621"/>
						
							<line fill="none" stroke="#000000" stroke-width="0.25" stroke-miterlimit="10" x1="207.564" y1="207.942" x2="206.823" y2="230.018"/>
					</g>
				</g>
				<path clip-path="url(#SVGID_56_)" fill="none" stroke="#000000" stroke-width="0.25" stroke-miterlimit="10" d="
					M337.696,243.275c-0.248,7.359-0.495,14.717-0.742,22.076c-0.094,2.795-1.236,4.482-2.3,5.454
					c-0.737,0.676-1.73,1.249-3.031,1.756c-9.07,3.538-35.577,4.722-63.644-3.964c-25.015-7.748-47.33-25.988-56.943-34.646
					c-2.944-2.652-4.695-4.404-4.97-4.682l0.741-22.076c0.274,0.278,2.026,2.03,4.97,4.682c9.613,8.658,31.928,26.898,56.943,34.646
					c28.068,8.686,54.574,7.502,63.644,3.964c1.3-0.507,2.294-1.08,3.031-1.756C336.459,247.758,337.602,246.071,337.696,243.275z"
					/>
			</g>
			<g enable-background="new    ">
				<defs>
					<path id="SVGID_57_" enable-background="new    " d="M336.955,265.352c0.024-0.71-0.02-1.492-0.15-2.351
						c-1-6.611-7.015-15.945-16.555-20.973l0.741-22.076c9.54,5.028,15.555,14.362,16.555,20.973c0.13,0.859,0.174,1.641,0.15,2.351
						C337.449,250.634,337.202,257.993,336.955,265.352z"/>
				</defs>
				<clipPath id="SVGID_58_">
					<use xlink:href="#SVGID_57_"  overflow="visible"/>
				</clipPath>
				<g clip-path="url(#SVGID_58_)" enable-background="new    ">
					<g>
						<path fill="none" stroke="#000000" stroke-width="0.25" stroke-miterlimit="10" d="M320.991,219.952l-0.741,22.076
							c9.54,5.028,15.555,14.362,16.555,20.973l0.742-22.076C336.546,234.313,330.531,224.979,320.991,219.952z"/>
						
							<line fill="none" stroke="#000000" stroke-width="0.25" stroke-miterlimit="10" x1="329.301" y1="226.154" x2="328.56" y2="248.23"/>
						
							<line fill="none" stroke="#000000" stroke-width="0.25" stroke-miterlimit="10" x1="334.93" y1="233.666" x2="334.188" y2="255.742"/>
					</g>
					<g>
						<path fill="none" stroke="#000000" stroke-width="0.25" stroke-miterlimit="10" d="M337.546,240.924L336.805,263
							c0.642,4.244-0.816,6.587-2.15,7.805l0.742-22.076C336.73,247.511,338.188,245.168,337.546,240.924z"/>
					</g>
				</g>
				<path clip-path="url(#SVGID_58_)" fill="none" stroke="#000000" stroke-width="0.25" stroke-miterlimit="10" d="
					M336.955,265.352c0.024-0.71-0.02-1.492-0.15-2.351c-1-6.611-7.015-15.945-16.555-20.973l0.741-22.076
					c9.54,5.028,15.555,14.362,16.555,20.973c0.13,0.859,0.174,1.641,0.15,2.351C337.449,250.634,337.202,257.993,336.955,265.352z"
					/>
			</g>
			<g enable-background="new    ">
				<defs>
					<polygon id="SVGID_59_" enable-background="new    " points="206.808,207.194 206.067,229.27 205.383,228.587 206.125,206.511 
											"/>
				</defs>
				<clipPath id="SVGID_60_">
					<use xlink:href="#SVGID_59_"  overflow="visible"/>
				</clipPath>
				<polygon clip-path="url(#SVGID_60_)" fill="none" stroke="#000000" stroke-width="0.25" stroke-miterlimit="10" points="
					206.808,207.194 206.067,229.27 205.383,228.587 206.125,206.511 				"/>
			</g>
			<g enable-background="new    ">
				<defs>
					<polygon id="SVGID_61_" enable-background="new    " points="206.125,206.511 205.383,228.587 204.968,228.171 
						205.709,206.096 					"/>
				</defs>
				<clipPath id="SVGID_62_">
					<use xlink:href="#SVGID_61_"  overflow="visible"/>
				</clipPath>
				<polygon clip-path="url(#SVGID_62_)" fill="none" stroke="#000000" stroke-width="0.25" stroke-miterlimit="10" points="
					206.125,206.511 205.383,228.587 204.968,228.171 205.709,206.096 				"/>
			</g>
			<g enable-background="new    ">
				<defs>
					<polygon id="SVGID_63_" enable-background="new    " points="205.709,206.096 205.791,204.624 205.05,226.7 204.968,228.171 
											"/>
				</defs>
				<clipPath id="SVGID_64_">
					<use xlink:href="#SVGID_63_"  overflow="visible"/>
				</clipPath>
				<polygon clip-path="url(#SVGID_64_)" fill="none" stroke="#000000" stroke-width="0.25" stroke-miterlimit="10" points="
					205.709,206.096 205.791,204.624 205.05,226.7 204.968,228.171 				"/>
			</g>
			<g enable-background="new    ">
				<defs>
					<path id="SVGID_65_" enable-background="new    " d="M205.791,204.624c0.13-2.527,1.412-5.923,6.462-8.498
						c0.622-0.317,1.3-0.622,2.04-0.91c2.16-0.842,4.737-1.495,7.678-1.953c4.357-0.678,9.509-0.928,15.269-0.729
						c27.875,0.965,69.91,20.122,83.751,27.418l-0.741,22.076c-13.841-7.296-55.876-26.453-83.751-27.418
						c-5.76-0.199-10.912,0.051-15.269,0.729c-2.94,0.458-5.518,1.11-7.678,1.953c-0.74,0.289-1.419,0.593-2.04,0.91
						c-5.05,2.575-6.332,5.971-6.462,8.498L205.791,204.624z"/>
				</defs>
				<clipPath id="SVGID_66_">
					<use xlink:href="#SVGID_65_"  overflow="visible"/>
				</clipPath>
				<g clip-path="url(#SVGID_66_)" enable-background="new    ">
					<g>
						<path fill="none" stroke="#000000" stroke-width="0.25" stroke-miterlimit="10" d="M205.791,204.624L205.05,226.7
							c0.13-2.527,1.412-5.923,6.462-8.498l0.741-22.076C207.203,198.701,205.921,202.097,205.791,204.624z"/>
						
							<line fill="none" stroke="#000000" stroke-width="0.25" stroke-miterlimit="10" x1="206.402" y1="201.87" x2="205.661" y2="223.946"/>
						
							<line fill="none" stroke="#000000" stroke-width="0.25" stroke-miterlimit="10" x1="208.362" y1="198.912" x2="207.621" y2="220.988"/>
					</g>
					<g>
						<path fill="none" stroke="#000000" stroke-width="0.25" stroke-miterlimit="10" d="M212.253,196.126l-0.741,22.076
							c0.621-0.317,1.3-0.622,2.04-0.91l0.741-22.076C213.553,195.504,212.875,195.809,212.253,196.126z"/>
						
							<line fill="none" stroke="#000000" stroke-width="0.25" stroke-miterlimit="10" x1="212.894" y1="195.813" x2="212.153" y2="217.889"/>
						
							<line fill="none" stroke="#000000" stroke-width="0.25" stroke-miterlimit="10" x1="213.574" y1="195.51" x2="212.833" y2="217.586"/>
					</g>
					<g>
						<path fill="none" stroke="#000000" stroke-width="0.25" stroke-miterlimit="10" d="M214.293,195.216l-0.741,22.076
							c2.16-0.843,4.737-1.495,7.678-1.953l0.741-22.076C219.031,193.721,216.453,194.374,214.293,195.216z"/>
						
							<line fill="none" stroke="#000000" stroke-width="0.25" stroke-miterlimit="10" x1="216.59" y1="194.437" x2="215.849" y2="216.513"/>
						
							<line fill="none" stroke="#000000" stroke-width="0.25" stroke-miterlimit="10" x1="219.154" y1="193.786" x2="218.413" y2="215.861"/>
					</g>
					<g>
						<path fill="none" stroke="#000000" stroke-width="0.25" stroke-miterlimit="10" d="M221.971,193.263l-0.741,22.076
							c4.357-0.679,9.509-0.929,15.269-0.729l0.741-22.076C231.48,192.334,226.328,192.584,221.971,193.263z"/>
						
							<line fill="none" stroke="#000000" stroke-width="0.25" stroke-miterlimit="10" x1="226.586" y1="192.728" x2="225.845" y2="214.804"/>
						
							<line fill="none" stroke="#000000" stroke-width="0.25" stroke-miterlimit="10" x1="231.69" y1="192.483" x2="230.948" y2="214.559"/>
					</g>
					<g>
						<path fill="none" stroke="#000000" stroke-width="0.25" stroke-miterlimit="10" d="M237.24,192.533l-0.741,22.076
							c27.875,0.965,69.91,20.122,83.751,27.418l0.741-22.076C307.15,212.655,265.115,193.499,237.24,192.533z"/>
						
							<line fill="none" stroke="#000000" stroke-width="0.25" stroke-miterlimit="10" x1="268.267" y1="198.449" x2="267.525" y2="220.525"/>
						
							<line fill="none" stroke="#000000" stroke-width="0.25" stroke-miterlimit="10" x1="299.321" y1="209.815" x2="298.58" y2="231.891"/>
					</g>
				</g>
				<path clip-path="url(#SVGID_66_)" fill="none" stroke="#000000" stroke-width="0.25" stroke-miterlimit="10" d="
					M205.791,204.624c0.13-2.527,1.412-5.923,6.462-8.498c0.622-0.317,1.3-0.622,2.04-0.91c2.16-0.842,4.737-1.495,7.678-1.953
					c4.357-0.678,9.509-0.928,15.269-0.729c27.875,0.965,69.91,20.122,83.751,27.418l-0.741,22.076
					c-13.841-7.296-55.876-26.453-83.751-27.418c-5.76-0.199-10.912,0.051-15.269,0.729c-2.94,0.458-5.518,1.11-7.678,1.953
					c-0.74,0.289-1.419,0.593-2.04,0.91c-5.05,2.575-6.332,5.971-6.462,8.498L205.791,204.624z"/>
			</g>
			<g enable-background="new    ">
				<defs>
					<path id="SVGID_67_" enable-background="new    " d="M329.752,242.949c-0.247,7.359-0.494,14.717-0.741,22.076
						c0.107-3.203-3.823-12.099-12.776-16.814c-12.457-6.574-53.89-25.523-79.991-26.431c-7.807-0.269-14.361,0.367-18.617,1.795
						c-0.291,0.098-0.571,0.199-0.84,0.304c-1.202,0.469-2.576,1.164-3.289,2.069l0.741-22.076c0.713-0.905,2.087-1.601,3.289-2.069
						c0.27-0.105,0.549-0.206,0.84-0.304c4.256-1.428,10.811-2.063,18.618-1.794c26.101,0.907,67.534,19.857,79.991,26.431
						C325.929,230.85,329.86,239.746,329.752,242.949z"/>
				</defs>
				<clipPath id="SVGID_68_">
					<use xlink:href="#SVGID_67_"  overflow="visible"/>
				</clipPath>
				<g clip-path="url(#SVGID_68_)" enable-background="new    ">
					<g>
						<path fill="none" stroke="#000000" stroke-width="0.25" stroke-miterlimit="10" d="M329.622,243.68l-0.741,22.076
							c0.918-2.265-2.87-12.397-12.646-17.545l0.741-22.076C326.751,231.283,330.54,241.415,329.622,243.68z"/>
						
							<line fill="none" stroke="#000000" stroke-width="0.25" stroke-miterlimit="10" x1="328.923" y1="239.269" x2="328.182" y2="261.345"/>
						
							<line fill="none" stroke="#000000" stroke-width="0.25" stroke-miterlimit="10" x1="324.803" y1="232.469" x2="324.062" y2="254.544"/>
					</g>
					<g>
						<path fill="none" stroke="#000000" stroke-width="0.25" stroke-miterlimit="10" d="M316.976,226.135l-0.741,22.076
							c-12.457-6.574-53.89-25.523-79.991-26.431l0.742-22.076C263.086,200.612,304.52,219.562,316.976,226.135z"/>
						
							<line fill="none" stroke="#000000" stroke-width="0.25" stroke-miterlimit="10" x1="296.502" y1="216.562" x2="295.76" y2="238.639"/>
						
							<line fill="none" stroke="#000000" stroke-width="0.25" stroke-miterlimit="10" x1="266.556" y1="205.499" x2="265.815" y2="227.575"/>
					</g>
					<g>
						<path fill="none" stroke="#000000" stroke-width="0.25" stroke-miterlimit="10" d="M236.985,199.705l-0.742,22.076
							c-7.807-0.269-14.361,0.367-18.617,1.795l0.741-22.076C222.624,200.071,229.179,199.436,236.985,199.705z"/>
						
							<line fill="none" stroke="#000000" stroke-width="0.25" stroke-miterlimit="10" x1="229.635" y1="199.733" x2="228.893" y2="221.809"/>
						
							<line fill="none" stroke="#000000" stroke-width="0.25" stroke-miterlimit="10" x1="223.351" y1="200.339" x2="222.61" y2="222.416"/>
					</g>
					<g>
						<path fill="none" stroke="#000000" stroke-width="0.25" stroke-miterlimit="10" d="M218.368,201.499l-0.741,22.076
							c-0.291,0.098-0.571,0.199-0.84,0.304l0.741-22.076C217.797,201.698,218.077,201.597,218.368,201.499z"/>
						
							<line fill="none" stroke="#000000" stroke-width="0.25" stroke-miterlimit="10" x1="218.081" y1="201.598" x2="217.339" y2="223.674"/>
						
							<line fill="none" stroke="#000000" stroke-width="0.25" stroke-miterlimit="10" x1="217.801" y1="201.699" x2="217.06" y2="223.775"/>
					</g>
					<g>
						<path fill="none" stroke="#000000" stroke-width="0.25" stroke-miterlimit="10" d="M217.528,201.803l-0.741,22.076
							c-1.202,0.469-2.576,1.164-3.289,2.069l0.741-22.076C214.952,202.967,216.326,202.271,217.528,201.803z"/>
						
							<line fill="none" stroke="#000000" stroke-width="0.25" stroke-miterlimit="10" x1="216.299" y1="202.347" x2="215.558" y2="224.422"/>
						
							<line fill="none" stroke="#000000" stroke-width="0.25" stroke-miterlimit="10" x1="215.141" y1="203.038" x2="214.4" y2="225.113"/>
					</g>
				</g>
				<path clip-path="url(#SVGID_68_)" fill="none" stroke="#000000" stroke-width="0.25" stroke-miterlimit="10" d="
					M329.752,242.949c-0.247,7.359-0.494,14.717-0.741,22.076c0.107-3.203-3.823-12.099-12.776-16.814
					c-12.457-6.574-53.89-25.523-79.991-26.431c-7.807-0.269-14.361,0.367-18.617,1.795c-0.291,0.098-0.571,0.199-0.84,0.304
					c-1.202,0.469-2.576,1.164-3.289,2.069l0.741-22.076c0.713-0.905,2.087-1.601,3.289-2.069c0.27-0.105,0.549-0.206,0.84-0.304
					c4.256-1.428,10.811-2.063,18.618-1.794c26.101,0.907,67.534,19.857,79.991,26.431
					C325.929,230.85,329.86,239.746,329.752,242.949z"/>
			</g>
			<g enable-background="new    ">
				<defs>
					<path id="SVGID_69_" enable-background="new    " d="M329.011,265.025c-0.01,0.294-0.054,0.541-0.131,0.731l0.741-22.076
						c0.077-0.19,0.121-0.437,0.131-0.731C329.505,250.308,329.259,257.667,329.011,265.025z"/>
				</defs>
				<clipPath id="SVGID_70_">
					<use xlink:href="#SVGID_69_"  overflow="visible"/>
				</clipPath>
				<g clip-path="url(#SVGID_70_)" enable-background="new    ">
					<g>
						<path fill="none" stroke="#000000" stroke-width="0.25" stroke-miterlimit="10" d="M329.622,243.68l-0.741,22.076
							c0.918-2.265-2.87-12.397-12.646-17.545l0.741-22.076C326.751,231.283,330.54,241.415,329.622,243.68z"/>
					</g>
				</g>
				<path clip-path="url(#SVGID_70_)" fill="none" stroke="#000000" stroke-width="0.25" stroke-miterlimit="10" d="
					M329.011,265.025c-0.01,0.294-0.054,0.541-0.131,0.731l0.741-22.076c0.077-0.19,0.121-0.437,0.131-0.731
					C329.505,250.308,329.259,257.667,329.011,265.025z"/>
			</g>
			<g enable-background="new    ">
				<defs>
					<path id="SVGID_71_" enable-background="new    " d="M214.239,203.872c0.496,0.47,1.112,1.045,1.837,1.708
						c8.247,7.54,30.756,26.583,55.208,34.159c26.659,8.255,51.212,6.747,57.846,4.16c0.23-0.09,0.392-0.162,0.491-0.218
						l-0.741,22.076c-0.1,0.056-0.261,0.128-0.491,0.218c-6.634,2.588-31.187,4.096-57.846-4.159
						c-24.452-7.576-46.962-26.619-55.208-34.159c-0.725-0.664-1.341-1.238-1.837-1.708
						C213.72,219.325,214.016,210.495,214.239,203.872z"/>
				</defs>
				<clipPath id="SVGID_72_">
					<use xlink:href="#SVGID_71_"  overflow="visible"/>
				</clipPath>
				<g clip-path="url(#SVGID_72_)" enable-background="new    ">
					<g>
						<path fill="none" stroke="#000000" stroke-width="0.25" stroke-miterlimit="10" d="M214.239,203.872l-0.741,22.076
							c0.496,0.47,1.112,1.045,1.837,1.708l0.741-22.076C215.351,204.917,214.735,204.342,214.239,203.872z"/>
						
							<line fill="none" stroke="#000000" stroke-width="0.25" stroke-miterlimit="10" x1="214.774" y1="204.376" x2="214.033" y2="226.452"/>
						
							<line fill="none" stroke="#000000" stroke-width="0.25" stroke-miterlimit="10" x1="215.388" y1="204.947" x2="214.646" y2="227.023"/>
					</g>
					<g>
						<path fill="none" stroke="#000000" stroke-width="0.25" stroke-miterlimit="10" d="M216.076,205.58l-0.741,22.076
							c8.247,7.54,30.756,26.583,55.208,34.159l0.741-22.076C246.833,232.163,224.323,213.12,216.076,205.58z"/>
						
							<line fill="none" stroke="#000000" stroke-width="0.25" stroke-miterlimit="10" x1="228.621" y1="216.104" x2="227.879" y2="238.18"/>
						
							<line fill="none" stroke="#000000" stroke-width="0.25" stroke-miterlimit="10" x1="247.937" y1="229.191" x2="247.195" y2="251.268"/>
					</g>
					<g>
						<path fill="none" stroke="#000000" stroke-width="0.25" stroke-miterlimit="10" d="M271.285,239.739l-0.741,22.076
							c26.659,8.255,51.212,6.747,57.846,4.159l0.741-22.076C322.497,246.486,297.944,247.994,271.285,239.739z"/>
						
							<line fill="none" stroke="#000000" stroke-width="0.25" stroke-miterlimit="10" x1="296.656" y1="245.061" x2="295.915" y2="267.137"/>
						
							<line fill="none" stroke="#000000" stroke-width="0.25" stroke-miterlimit="10" x1="317.109" y1="245.805" x2="316.368" y2="267.88"/>
					</g>
					<g>
						<path fill="none" stroke="#000000" stroke-width="0.25" stroke-miterlimit="10" d="M329.13,243.898l-0.741,22.076
							c0.23-0.09,0.392-0.162,0.491-0.218l0.741-22.076C329.522,243.737,329.361,243.808,329.13,243.898z"/>
						
							<line fill="none" stroke="#000000" stroke-width="0.25" stroke-miterlimit="10" x1="329.338" y1="243.814" x2="328.597" y2="265.89"/>
						
							<line fill="none" stroke="#000000" stroke-width="0.25" stroke-miterlimit="10" x1="329.501" y1="243.742" x2="328.76" y2="265.818"/>
					</g>
				</g>
				<path clip-path="url(#SVGID_72_)" fill="none" stroke="#000000" stroke-width="0.25" stroke-miterlimit="10" d="
					M214.239,203.872c0.496,0.47,1.112,1.045,1.837,1.708c8.247,7.54,30.756,26.583,55.208,34.159
					c26.659,8.255,51.212,6.747,57.846,4.16c0.23-0.09,0.392-0.162,0.491-0.218l-0.741,22.076c-0.1,0.056-0.261,0.128-0.491,0.218
					c-6.634,2.588-31.187,4.096-57.846-4.159c-24.452-7.576-46.962-26.619-55.208-34.159c-0.725-0.664-1.341-1.238-1.837-1.708
					C213.72,219.325,214.016,210.495,214.239,203.872z"/>
			</g>
		</g>
	</g>
</g>
<ellipse opacity="0.31" fill="#FFFFFF" cx="145.87" cy="171.221" rx="76" ry="70.5"/>
</svg>
