<?xml version="1.0" encoding="utf-8"?>
<!-- Generator: Adobe Illustrator 15.1.0, SVG Export Plug-In . SVG Version: 6.00 Build 0)  -->
<!DOCTYPE svg PUBLIC "-//W3C//DTD SVG 1.1//EN" "http://www.w3.org/Graphics/SVG/1.1/DTD/svg11.dtd">
<svg version="1.1" id="Calque_1" xmlns="http://www.w3.org/2000/svg" xmlns:xlink="http://www.w3.org/1999/xlink" x="0px" y="0px"
	 width="138.667px" height="78.333px" viewBox="0 0 138.667 78.333" enable-background="new 0 0 138.667 78.333"
	 xml:space="preserve">
<g>
	<defs>
		<rect id="SVGID_1_" x="-86" y="-58.426" width="311.806" height="198.426"/>
	</defs>
	<clipPath id="SVGID_2_">
		<use xlink:href="#SVGID_1_"  overflow="visible"/>
	</clipPath>
	<path clip-path="url(#SVGID_2_)" fill="#C10033" d="M64.344,5.339c0,1.596-1.294,2.889-2.889,2.889c-1.596,0-2.89-1.293-2.89-2.889
		s1.294-2.889,2.89-2.889C63.05,2.45,64.344,3.743,64.344,5.339"/>
	<path clip-path="url(#SVGID_2_)" fill="#C10033" d="M7.716,49.2c0,1.596-1.294,2.889-2.889,2.889c-1.596,0-2.89-1.293-2.89-2.889
		c0-1.597,1.294-2.89,2.89-2.89C6.422,46.311,7.716,47.604,7.716,49.2"/>
	<path clip-path="url(#SVGID_2_)" fill="#C10033" d="M137.189,18.848c0,1.596-1.294,2.889-2.889,2.889
		c-1.597,0-2.891-1.293-2.891-2.889c0-1.596,1.294-2.889,2.891-2.889C135.896,15.959,137.189,17.252,137.189,18.848"/>
	<path clip-path="url(#SVGID_2_)" fill="#7BC6BC" d="M107.41,42.809c0-6.052-5.112-11.166-11.166-11.166
		c-0.151,0-0.3,0.018-0.449,0.024l-3.988,6.495c1.172-1.114,2.751-1.777,4.438-1.777c2.709,0,5.143,1.708,6.056,4.252l0.12,0.334
		H90.082l-3.957,6.445c1.793,3.827,5.7,6.56,10.119,6.56c4.379,0,8.519-2.7,10.199-6.607h-5.609
		c-1.252,1.214-2.918,1.909-4.59,1.909c-2.566,0-4.87-1.506-5.869-3.838l-0.15-0.348h16.967
		C107.338,44.368,107.41,43.602,107.41,42.809"/>
	<path clip-path="url(#SVGID_2_)" fill="#7BC6BC" d="M119.355,42.714c-0.808-1.693-1.735-3.262-1.735-4.864
		c0-0.977,0.8-1.466,1.599-1.466s1.644,0.489,1.644,1.466h5.196c0-3.642-3.064-6.707-6.84-6.707c-3.598,0-6.84,2.887-6.84,6.707
		c0,5.375,2.904,6.354,2.904,9.062c0,1.065-0.844,1.864-1.999,1.864c-0.786,0-1.569-0.518-1.594-1.423h-5.244
		c0.012,1.807,0.763,3.521,2.041,4.754c1.103,1.028,2.502,1.661,4.024,1.822L119.355,42.714z"/>
	<polygon clip-path="url(#SVGID_2_)" fill="#F9B200" points="25.158,67.795 48.174,30.331 48.174,53.352 53.47,53.352 
		67.895,30.254 67.895,53.352 72.255,53.352 75.169,48.61 72.592,48.61 72.592,21.915 64.189,21.915 61.304,26.612 64.586,26.612 
		52.915,45.37 52.915,21.915 44.513,21.915 41.625,26.612 44.906,26.612 33.96,44.443 33.958,44.44 19.615,67.795 	"/>
	<polygon clip-path="url(#SVGID_2_)" fill="#7BC6BC" points="83.009,48.61 83.009,32.354 76.002,32.354 76.002,37.095 
		78.269,37.095 78.269,53.352 82.361,53.352 85.275,48.61 	"/>
	<path clip-path="url(#SVGID_2_)" fill="#7BC6BC" d="M90.476,24.118c0,1.596-1.294,2.889-2.89,2.889s-2.89-1.293-2.89-2.889
		c0-1.596,1.294-2.889,2.89-2.889S90.476,22.522,90.476,24.118"/>
	<polygon clip-path="url(#SVGID_2_)" fill="#4B4B4D" points="48.144,63.481 48.753,63.481 48.753,67.302 50.702,67.302 
		50.702,67.833 48.144,67.833 	"/>
	<polygon clip-path="url(#SVGID_2_)" fill="#4B4B4D" points="51.685,63.481 54.211,63.481 54.211,64.011 52.294,64.011 
		52.294,65.374 53.854,65.374 53.854,65.903 52.294,65.903 52.294,67.302 54.316,67.302 54.316,67.833 51.685,67.833 	"/>
	<path clip-path="url(#SVGID_2_)" fill="#4B4B4D" d="M55.511,66.872c0,0,0.462,0.468,1.109,0.468c0.407,0,0.752-0.229,0.752-0.641
		c0-0.943-2.108-0.74-2.108-2.078c0-0.679,0.586-1.214,1.405-1.214c0.808,0,1.234,0.438,1.234,0.438l-0.278,0.506
		c0,0-0.401-0.376-0.956-0.376c-0.462,0-0.789,0.289-0.789,0.634c0,0.9,2.109,0.659,2.109,2.072c0,0.671-0.518,1.227-1.381,1.227
		c-0.925,0-1.443-0.573-1.443-0.573L55.511,66.872z"/>
	<path clip-path="url(#SVGID_2_)" fill="#4B4B4D" d="M61.223,63.481h0.641l0.999,2.354c0.098,0.241,0.215,0.586,0.215,0.586h0.013
		c0,0,0.117-0.345,0.216-0.586l0.998-2.354h0.642l0.351,4.352h-0.604l-0.216-2.744c-0.019-0.264-0.006-0.64-0.006-0.64h-0.013
		c0,0-0.13,0.4-0.234,0.64l-0.869,1.961h-0.542l-0.863-1.961c-0.099-0.233-0.235-0.652-0.235-0.652h-0.013
		c0,0,0.007,0.389-0.011,0.652l-0.21,2.744h-0.611L61.223,63.481z"/>
	<path clip-path="url(#SVGID_2_)" fill="#4B4B4D" d="M68.784,66.582h-1.639l-0.432,1.251h-0.628l1.566-4.353h0.64l1.567,4.353
		h-0.635L68.784,66.582z M67.965,64.079c0,0-0.099,0.395-0.173,0.615l-0.487,1.382h1.319l-0.48-1.382
		c-0.075-0.221-0.167-0.615-0.167-0.615H67.965z"/>
	<polygon clip-path="url(#SVGID_2_)" fill="#4B4B4D" points="71.443,64.012 69.953,64.012 69.953,63.481 73.547,63.481 
		73.547,64.012 72.054,64.012 72.054,67.832 71.443,67.832 	"/>
	<polygon clip-path="url(#SVGID_2_)" fill="#4B4B4D" points="74.448,63.481 75.059,63.481 75.059,65.393 77.314,65.393 
		77.314,63.481 77.926,63.481 77.926,67.833 77.314,67.833 77.314,65.921 75.059,65.921 75.059,67.833 74.448,67.833 	"/>
	<path clip-path="url(#SVGID_2_)" fill="#4B4B4D" d="M79.402,66.872c0,0,0.462,0.468,1.109,0.468c0.407,0,0.752-0.229,0.752-0.641
		c0-0.943-2.108-0.74-2.108-2.078c0-0.679,0.586-1.214,1.405-1.214c0.809,0,1.234,0.438,1.234,0.438l-0.278,0.506
		c0,0-0.401-0.376-0.956-0.376c-0.462,0-0.789,0.289-0.789,0.634c0,0.9,2.109,0.659,2.109,2.072c0,0.671-0.519,1.227-1.381,1.227
		c-0.926,0-1.443-0.573-1.443-0.573L79.402,66.872z"/>
	<path clip-path="url(#SVGID_2_)" fill="#4B4B4D" d="M47.836,70.885h0.659l1.079,3.076c0.08,0.233,0.166,0.598,0.166,0.598h0.013
		c0,0,0.086-0.364,0.166-0.598l1.092-3.076h0.647l-1.603,4.352h-0.611L47.836,70.885z"/>
	<polygon clip-path="url(#SVGID_2_)" fill="#4B4B4D" points="52.567,70.885 55.094,70.885 55.094,71.414 53.177,71.414 
		53.177,72.777 54.737,72.777 54.737,73.307 53.177,73.307 53.177,74.705 55.199,74.705 55.199,75.236 52.567,75.236 	"/>
	<path clip-path="url(#SVGID_2_)" fill="#4B4B4D" d="M58.267,70.811c1.048,0,1.584,0.573,1.584,0.573l-0.302,0.455
		c0,0-0.505-0.474-1.258-0.474c-0.973,0-1.608,0.74-1.608,1.664c0,0.931,0.647,1.72,1.615,1.72c0.82,0,1.344-0.566,1.344-0.566
		l0.326,0.438c0,0-0.597,0.69-1.688,0.69c-1.307,0-2.226-0.999-2.226-2.274C56.054,71.772,57.002,70.811,58.267,70.811"/>
	<polygon clip-path="url(#SVGID_2_)" fill="#4B4B4D" points="62.012,71.415 60.521,71.415 60.521,70.885 64.115,70.885 
		64.115,71.415 62.622,71.415 62.622,75.235 62.012,75.235 	"/>
	<polygon clip-path="url(#SVGID_2_)" fill="#4B4B4D" points="65.017,70.885 67.543,70.885 67.543,71.414 65.626,71.414 
		65.626,72.777 67.187,72.777 67.187,73.307 65.626,73.307 65.626,74.705 67.648,74.705 67.648,75.236 65.017,75.236 	"/>
	<path clip-path="url(#SVGID_2_)" fill="#4B4B4D" d="M68.768,70.885h0.609v2.811c0,0.666,0.433,1.054,1.098,1.054
		c0.673,0,1.109-0.388,1.109-1.065v-2.799h0.61v2.811c0,0.967-0.697,1.615-1.713,1.615c-1.018,0-1.714-0.648-1.714-1.615V70.885z"/>
	<path clip-path="url(#SVGID_2_)" fill="#4B4B4D" d="M73.599,70.885h1.332c0.456,0,0.646,0.036,0.812,0.099
		c0.444,0.166,0.734,0.603,0.734,1.177c0,0.554-0.31,1.023-0.784,1.177v0.014c0,0,0.05,0.055,0.13,0.196l0.925,1.689h-0.689
		l-0.919-1.733h-0.932v1.733h-0.609V70.885z M75.083,72.975c0.476,0,0.771-0.304,0.771-0.789c0-0.321-0.124-0.549-0.345-0.672
		c-0.117-0.062-0.26-0.1-0.599-0.1h-0.703v1.561H75.083z"/>
	<path clip-path="url(#SVGID_2_)" fill="#4B4B4D" d="M79.694,70.885h1.441c1.332,0,2.207,0.795,2.207,2.17
		c0,1.38-0.875,2.181-2.207,2.181h-1.441V70.885z M81.093,74.706c0.98,0,1.621-0.579,1.621-1.651c0-1.066-0.646-1.64-1.621-1.64
		h-0.789v3.291H81.093z"/>
	<rect x="84.334" y="70.81" clip-path="url(#SVGID_2_)" fill="#4B4B4D" width="0.475" height="1.159"/>
	<rect x="86.024" y="70.884" clip-path="url(#SVGID_2_)" fill="#4B4B4D" width="0.609" height="4.353"/>
	<path clip-path="url(#SVGID_2_)" fill="#4B4B4D" d="M88.096,70.885H88.7l1.936,2.829c0.16,0.233,0.363,0.629,0.363,0.629h0.013
		c0,0-0.043-0.39-0.043-0.629v-2.829h0.61v4.352h-0.598l-1.942-2.824c-0.16-0.239-0.364-0.634-0.364-0.634h-0.012
		c0,0,0.043,0.388,0.043,0.634v2.824h-0.61V70.885z"/>
	<path clip-path="url(#SVGID_2_)" fill="#4B4B4D" d="M93.044,70.885h0.604l1.936,2.829c0.16,0.233,0.363,0.629,0.363,0.629h0.013
		c0,0-0.043-0.39-0.043-0.629v-2.829h0.61v4.352H95.93l-1.942-2.824c-0.16-0.239-0.364-0.634-0.364-0.634h-0.012
		c0,0,0.043,0.388,0.043,0.634v2.824h-0.61V70.885z"/>
	<path clip-path="url(#SVGID_2_)" fill="#4B4B4D" d="M99.933,70.811c1.259,0,2.232,0.967,2.232,2.218
		c0,1.283-0.974,2.282-2.232,2.282c-1.257,0-2.236-0.999-2.236-2.282C97.696,71.777,98.676,70.811,99.933,70.811 M99.933,74.75
		c0.889,0,1.604-0.74,1.604-1.722c0-0.948-0.716-1.664-1.604-1.664c-0.888,0-1.607,0.716-1.607,1.664
		C98.325,74.01,99.045,74.75,99.933,74.75"/>
	<path clip-path="url(#SVGID_2_)" fill="#4B4B4D" d="M102.755,70.885h0.659l1.079,3.076c0.08,0.233,0.166,0.598,0.166,0.598h0.013
		c0,0,0.086-0.364,0.166-0.598l1.093-3.076h0.646l-1.603,4.352h-0.611L102.755,70.885z"/>
	<path clip-path="url(#SVGID_2_)" fill="#4B4B4D" d="M109.465,73.985h-1.639l-0.433,1.251h-0.628l1.566-4.353h0.64l1.567,4.353
		h-0.635L109.465,73.985z M108.646,71.482c0,0-0.099,0.395-0.173,0.615l-0.486,1.382h1.318l-0.479-1.382
		c-0.075-0.221-0.167-0.615-0.167-0.615H108.646z"/>
	<polygon clip-path="url(#SVGID_2_)" fill="#4B4B4D" points="112.125,71.415 110.635,71.415 110.635,70.885 114.229,70.885 
		114.229,71.415 112.735,71.415 112.735,75.235 112.125,75.235 	"/>
	<rect x="115.13" y="70.884" clip-path="url(#SVGID_2_)" fill="#4B4B4D" width="0.61" height="4.353"/>
	<path clip-path="url(#SVGID_2_)" fill="#4B4B4D" d="M119.144,70.811c1.259,0,2.232,0.967,2.232,2.218
		c0,1.283-0.974,2.282-2.232,2.282c-1.257,0-2.236-0.999-2.236-2.282C116.907,71.777,117.887,70.811,119.144,70.811 M119.144,74.75
		c0.889,0,1.604-0.74,1.604-1.722c0-0.948-0.716-1.664-1.604-1.664c-0.888,0-1.607,0.716-1.607,1.664
		C117.536,74.01,118.256,74.75,119.144,74.75"/>
	<path clip-path="url(#SVGID_2_)" fill="#4B4B4D" d="M122.546,70.885h0.604l1.936,2.829c0.16,0.233,0.363,0.629,0.363,0.629h0.013
		c0,0-0.043-0.39-0.043-0.629v-2.829h0.61v4.352h-0.598l-1.942-2.824c-0.16-0.239-0.364-0.634-0.364-0.634h-0.012
		c0,0,0.043,0.388,0.043,0.634v2.824h-0.61V70.885z"/>
	<path clip-path="url(#SVGID_2_)" fill="#7BC6BC" d="M33.833,38.172V26.656h1.776v-4.741h-4.493l-1.185,1.99l-0.224-0.18
		c-2.052-1.649-4.485-2.521-7.04-2.521c-6.052,0-11.165,5.113-11.165,11.166c0,6.052,5.113,11.165,11.165,11.165
		c2.59,0,5.024-0.855,7.04-2.477l0.227-0.182l1.183,2.037h1.801l2.913-4.741H33.833z M22.667,38.838
		c-3.542,0-6.424-2.902-6.424-6.468c0-3.543,2.882-6.425,6.424-6.425c3.543,0,6.425,2.882,6.425,6.425
		C29.092,35.936,26.21,38.838,22.667,38.838"/>
</g>
</svg>
