[
{
    "fields": {
        "username": "admin",
        "first_name": "",
        "last_name": "",
        "is_active": true,
        "is_superuser": true,
        "is_staff": true,
        "last_login": "2014-10-23T17:53:51.639",
        "groups": [],
        "user_permissions": [],
        "password": "pbkdf2_sha256$12000$xYpX2M9u8Tmn$vm7Aj4ovg3TmtBIQlVXkEHB24Egz/OaA3rLMtJmlxxk=",
        "email": "",
        "date_joined": "2014-10-23T17:53:51.639"
    },
    "model": "auth.user",
    "pk": 1
}
]