"ShortName";"Full Name"
"PPE";"European People's Party"
"NI";"Non-Inscrits"
"Verts/ALE";"The Greens–European Free Alliance"
"S&D";"Progressive Alliance of Socialists and Democrats"
"EFDD";"Europe of Freedom and Direct Democracy"
"GUE/NGL";"European United Left–Nordic Green Left"
"ALDE";"Alliance of Liberals and Democrats for Europe"
"ECR";"European Conservatives and Reformists"
"ENF";"Europe of Nations and Freedom"
