#FIG 3.2  Produced by xfig version 3.2.5
Landscape
Center
Inches
Letter  
100.00
Single
-2
1200 2
1 4 0 1 1 1 40 0 20 0.000 1 3.1416 900 3150 106 106 794 3150 1006 3150
1 4 0 1 0 0 40 0 20 0.000 1 3.1416 2700 3150 106 106 2594 3150 2806 3150
1 4 0 1 0 0 40 0 20 0.000 1 3.1416 4500 3150 106 106 4394 3150 4606 3150
1 4 0 1 1 1 40 0 20 0.000 1 3.1416 6300 3150 106 106 6194 3150 6406 3150
2 1 0 2 0 7 50 -1 -1 0.000 0 0 -1 1 0 2
	1 1 4.00 60.00 120.00
	 1125 3150 2475 3150
2 1 0 2 0 7 50 -1 -1 0.000 0 0 -1 1 0 2
	1 1 4.00 60.00 120.00
	 4725 3150 6075 3150
2 1 0 2 0 7 50 -1 -1 0.000 0 0 -1 0 1 2
	1 1 4.00 60.00 120.00
	 2925 3150 4275 3150
4 0 0 50 -1 0 16 0.0000 4 195 225 525 3225 A\001
4 0 1 50 -1 0 16 0.0000 4 195 705 225 3600 entr\351e\001
4 0 0 50 -1 0 16 0.0000 4 195 165 6600 3225 F\001
4 0 1 50 -1 0 16 0.0000 4 195 630 6000 2850 sortie\001
4 0 0 50 -1 0 16 0.0000 4 195 180 2625 3600 C\001
4 0 0 50 -1 0 16 0.0000 4 195 165 4425 3600 E\001
4 0 4 50 -1 0 16 0.0000 4 195 285 5025 3000 +4\001
4 0 4 50 -1 0 16 0.0000 4 195 285 1425 3000 +9\001
4 0 4 50 -1 0 16 0.0000 4 195 225 3675 3000 -3\001
