#FIG 3.2  Produced by xfig version 3.2.5
Landscape
Center
Inches
Letter  
100.00
Single
-2
1200 2
1 4 0 1 0 0 40 0 20 0.000 1 3.1416 2626 2174 106 106 2520 2174 2732 2174
1 4 0 1 0 0 40 0 20 0.000 1 3.1416 2475 4200 106 106 2369 4200 2581 4200
1 4 0 1 0 0 40 0 20 0.000 1 3.1416 4800 2219 106 106 4694 2219 4906 2219
1 4 0 1 0 0 40 0 20 0.000 1 3.1416 4671 4184 106 106 4565 4184 4777 4184
1 4 0 1 1 1 40 0 20 0.000 1 3.1416 900 3150 106 106 794 3150 1006 3150
1 4 0 1 1 1 40 0 20 0.000 1 3.1416 6900 3419 106 106 6794 3419 7006 3419
2 1 0 2 0 7 50 -1 -1 0.000 0 0 -1 1 0 2
	1 1 4.00 60.00 120.00
	 1050 3000 2400 2250
2 1 0 2 0 7 50 -1 -1 0.000 0 0 -1 1 0 2
	1 1 4.00 60.00 120.00
	 1050 3300 2250 4125
2 1 0 2 0 7 50 -1 -1 0.000 0 0 -1 1 0 2
	1 1 4.00 60.00 120.00
	 2625 4200 4500 4200
2 1 0 3 4 7 50 -1 -1 0.000 0 0 -1 1 0 2
	1 1 4.00 60.00 120.00
	 4800 4200 6750 3600
2 1 0 2 0 7 50 -1 -1 0.000 0 0 -1 1 0 2
	1 1 4.00 60.00 120.00
	 4950 2175 6750 3300
2 1 0 3 4 7 50 -1 -1 0.000 0 0 -1 1 0 2
	1 1 4.00 60.00 120.00
	 4650 4050 4800 2400
2 1 0 2 0 7 50 -1 -1 0.000 0 0 -1 1 0 2
	1 1 4.00 60.00 120.00
	 4658 2335 2633 4060
3 0 0 2 0 7 50 -1 -1 0.000 0 1 0 4
	1 1 4.00 60.00 120.00
	 2475 2325 2250 2775 2250 3450 2325 4050
	 0.000 1.000 1.000 0.000
3 0 0 3 4 7 50 -1 -1 0.000 0 1 0 2
	1 1 4.00 60.00 120.00
	 2775 2175 4650 2175
	 0.000 0.000
3 0 1 2 1 7 50 -1 -1 6.000 0 1 0 7
	1 1 4.00 60.00 120.00
	 6975 3600 6675 4425 5625 5025 3750 5025 1800 4950 1275 4125
	 975 3375
	 0.000 1.000 1.000 1.000 1.000 1.000 0.000
3 0 0 2 0 7 50 -1 -1 0.000 0 1 0 4
	1 1 4.00 60.00 120.00
	 2550 4050 2850 3375 2925 2700 2775 2325
	 0.000 1.000 1.000 0.000
4 0 0 50 -1 0 16 0.0000 4 180 150 7125 3525 F\001
4 0 0 50 -1 0 16 0.0000 4 180 180 2550 1950 B\001
4 0 0 50 -1 0 16 0.0000 4 180 195 4575 4575 D\001
4 0 0 50 -1 0 16 0.0000 4 180 165 4725 2025 E\001
4 0 0 50 -1 0 16 0.0000 4 180 195 525 3225 A\001
4 0 0 50 -1 0 16 0.0000 4 180 180 2325 4575 C\001
4 0 0 50 -1 0 16 0.0000 4 180 135 2925 3225 4\001
4 0 0 50 -1 0 16 0.0000 4 195 135 3750 3375 9\001
4 0 1 50 -1 0 16 0.0000 4 180 600 6675 3075 sortie\001
4 0 1 50 -1 0 16 0.0000 4 180 660 225 3600 entr\351e\001
4 0 0 50 -1 0 16 0.0000 4 195 270 1575 2475 16\001
4 0 4 50 -1 0 16 0.0000 4 180 270 1200 2700 11\001
4 0 0 50 -1 0 16 0.0000 4 180 270 3675 2100 12\001
4 0 4 50 -1 0 16 0.0000 4 180 135 2025 2925 0\001
4 0 0 50 -1 0 16 0.0000 4 180 270 1875 3300 10\001
4 0 4 50 -1 0 16 0.0000 4 180 135 2925 2925 1\001
4 0 4 50 -1 0 16 0.0000 4 180 135 1275 3750 8\001
4 0 0 50 -1 0 16 0.0000 4 180 270 1425 3975 13\001
4 0 4 50 -1 0 16 0.0000 4 180 135 3525 3525 4\001
4 0 4 50 -1 0 16 0.0000 4 180 270 3075 4425 11\001
4 0 4 50 -1 0 16 0.0000 4 180 135 4800 3150 7\001
4 0 0 50 -1 0 16 0.0000 4 180 270 5925 2700 20\001
4 0 4 50 -1 0 16 0.0000 4 180 270 5625 2550 15\001
4 0 4 50 -1 0 16 0.0000 4 180 135 5400 4200 4\001
4 0 4 50 -1 0 16 0.0000 4 195 270 3000 5325 19\001
4 0 0 50 -1 0 16 0.0000 4 225 2160 4125 5325 arc de retour (fictif)\001
4 0 4 50 -1 0 16 0.0000 4 180 270 3300 2100 12\001
4 0 0 50 -1 0 16 0.0000 4 180 135 4800 3525 7\001
4 0 0 50 -1 0 16 0.0000 4 180 135 5775 4125 4\001
4 0 0 50 -1 0 16 0.0000 4 180 270 3450 4425 14\001
