\relax 
\providecommand\hyper@newdestlabel[2]{}
\providecommand\HyperFirstAtBeginDocument{\AtBeginDocument}
\HyperFirstAtBeginDocument{\ifx\hyper@anchor\@undefined
\global\let\oldcontentsline\contentsline
\gdef\contentsline#1#2#3#4{\oldcontentsline{#1}{#2}{#3}}
\global\let\oldnewlabel\newlabel
\gdef\newlabel#1#2{\newlabelxx{#1}#2}
\gdef\newlabelxx#1#2#3#4#5#6{\oldnewlabel{#1}{{#2}{#3}}}
\AtEndDocument{\ifx\hyper@anchor\@undefined
\let\contentsline\oldcontentsline
\let\newlabel\oldnewlabel
\fi}
\fi}
\global\let\hyper@last\relax 
\gdef\HyperFirstAtBeginDocument#1{#1}
\providecommand*\HyPL@Entry[1]{}
\abx@aux@refcontext{nty/global//global/global}
\abx@aux@cite{Colombo-Koenigsberg}
\abx@aux@segm{0}{0}{Colombo-Koenigsberg}
\abx@aux@cite{algo_cormen}
\abx@aux@segm{0}{0}{algo_cormen}
\abx@aux@cite{IREMpN_lycee}
\abx@aux@segm{0}{0}{IREMpN_lycee}
\abx@aux@cite{IREMpN_BTS}
\abx@aux@segm{0}{0}{IREMpN_BTS}
\abx@aux@cite{graphe_cogis}
\abx@aux@segm{0}{0}{graphe_cogis}
\abx@aux@cite{video_John_Chaussard}
\abx@aux@segm{0}{0}{video_John_Chaussard}
\abx@aux@cite{AYACHE}
\abx@aux@segm{0}{0}{AYACHE}
\abx@aux@cite{rapport_selmis}
\abx@aux@segm{0}{0}{rapport_selmis}
\HyPL@Entry{0<</S/D>>}
\providecommand \oddpage@label [2]{}
\@writefile{toc}{\boolfalse {citerequest}\boolfalse {citetracker}\boolfalse {pagetracker}\boolfalse {backtracker}\relax }
\@writefile{lof}{\boolfalse {citerequest}\boolfalse {citetracker}\boolfalse {pagetracker}\boolfalse {backtracker}\relax }
\@writefile{lot}{\boolfalse {citerequest}\boolfalse {citetracker}\boolfalse {pagetracker}\boolfalse {backtracker}\relax }
\babel@aux{french}{}
\@writefile{toc}{\contentsline {section}{\numberline {1}Introduction}{1}{section.1}}
\@writefile{toc}{\contentsline {section}{\numberline {2}Trame du projet}{1}{section.2}}
\@writefile{toc}{\contentsline {subsection}{\numberline {2.1}Objectif}{1}{subsection.2.1}}
\@writefile{toc}{\contentsline {subsection}{\numberline {2.2}Tâches préalables}{2}{subsection.2.2}}
\@writefile{toc}{\contentsline {section}{\numberline {3}\'Etude préalable}{2}{section.3}}
\@writefile{toc}{\contentsline {subsection}{\numberline {3.1}Les fichiers image}{2}{subsection.3.1}}
\@writefile{toc}{\contentsline {subsubsection}{\numberline {3.1.1}Format des images : BMP $\rightarrow $ PNG}{2}{subsubsection.3.1.1}}
\@writefile{toc}{\contentsline {subsubsection}{\numberline {3.1.2}Description du format PNG}{3}{subsubsection.3.1.2}}
\@writefile{toc}{\contentsline {subsubsection}{\numberline {3.1.3}Le repérage des pixels dans l'image}{3}{subsubsection.3.1.3}}
\@writefile{toc}{\contentsline {subsubsection}{\numberline {3.1.4}Les couleurs}{3}{subsubsection.3.1.4}}
\@writefile{toc}{\contentsline {subsection}{\numberline {3.2}Quelques notions sur les graphes}{4}{subsection.3.2}}
\@writefile{toc}{\contentsline {subsubsection}{\numberline {3.2.1}Graphe}{4}{subsubsection.3.2.1}}
\@writefile{toc}{\contentsline {subsubsection}{\numberline {3.2.2}Graphe pondéré}{4}{subsubsection.3.2.2}}
\abx@aux@segm{0}{0}{algo_cormen}
\abx@aux@cite{cours_AEsbelin_et_al}
\abx@aux@segm{0}{0}{cours_AEsbelin_et_al}
\abx@aux@cite{cours_notes_AEsbelin_et_al}
\abx@aux@segm{0}{0}{cours_notes_AEsbelin_et_al}
\@writefile{toc}{\contentsline {subsubsection}{\numberline {3.2.3}Graphe orienté pondéré}{5}{subsubsection.3.2.3}}
\@writefile{toc}{\contentsline {subsubsection}{\numberline {3.2.4}Graphes de flots}{5}{subsubsection.3.2.4}}
\@writefile{toc}{\contentsline {paragraph}{Introduction}{5}{section*.1}}
\@writefile{toc}{\contentsline {paragraph}{Exemple de réseau de transport}{6}{section*.2}}
\@writefile{toc}{\contentsline {paragraph}{Du réseau de transport au graphe de flots}{6}{section*.3}}
\@writefile{toc}{\contentsline {paragraph}{Propriétés des flux à travers un réseau}{6}{section*.4}}
\@writefile{toc}{\contentsline {paragraph}{Exemples :}{7}{section*.5}}
\@writefile{toc}{\contentsline {paragraph}{En résumé}{8}{section*.6}}
\@writefile{toc}{\contentsline {subsubsection}{\numberline {3.2.5}Réseaux à $Sources$ et $Puits$ multiples}{8}{subsubsection.3.2.5}}
\@writefile{toc}{\contentsline {subsubsection}{\numberline {3.2.6}Propriétés ensemblistes des flux}{10}{subsubsection.3.2.6}}
\@writefile{toc}{\contentsline {subsubsection}{\numberline {3.2.7}Notion de coupe dans un graphe de flots}{10}{subsubsection.3.2.7}}
\abx@aux@segm{0}{0}{video_John_Chaussard}
\abx@aux@cite{video_John_Chaussard_SV}
\abx@aux@segm{0}{0}{video_John_Chaussard_SV}
\abx@aux@segm{0}{0}{algo_cormen}
\abx@aux@segm{0}{0}{algo_cormen}
\abx@aux@segm{0}{0}{cours_AEsbelin_et_al}
\abx@aux@segm{0}{0}{cours_notes_AEsbelin_et_al}
\abx@aux@segm{0}{0}{algo_cormen}
\@writefile{toc}{\contentsline {subsection}{\numberline {3.3}Algorithmes de segmentation et Ford-Fulkerson}{13}{subsection.3.3}}
\@writefile{toc}{\contentsline {subsubsection}{\numberline {3.3.1}Problème du flot maximal}{13}{subsubsection.3.3.1}}
\@writefile{toc}{\contentsline {subparagraph}{Problème}{13}{section*.7}}
\abx@aux@segm{0}{0}{algo_cormen}
\@writefile{toc}{\contentsline {subparagraph}{Une solution au problème}{14}{section*.8}}
\@writefile{toc}{\contentsline {subsubsection}{\numberline {3.3.2}Chemin augmentant - première approche}{14}{subsubsection.3.3.2}}
\@writefile{toc}{\contentsline {subsubsection}{\numberline {3.3.3}Idée générale de la méthode de Ford Fulkerson}{14}{subsubsection.3.3.3}}
\@writefile{loa}{\contentsline {algocf}{\numberline {1}{\ignorespaces Algorithme de Ford-Fulkerson (méthode de parcours non précisée)}}{14}{algocf.1}}
\@writefile{toc}{\contentsline {paragraph}{Exemple de déroulement de l'algorithme de Ford-Fulkerson}{15}{section*.9}}
\@writefile{toc}{\contentsline {subsubsection}{\numberline {3.3.4}Flot maximal / coupe minimale : algorithme de Ford Fulkerson}{18}{subsubsection.3.3.4}}
\@writefile{loa}{\contentsline {algocf}{\numberline {2}{\ignorespaces Algorithme de Ford-Fulkerson avec parcours en largeur}}{18}{algocf.2}}
\@writefile{toc}{\contentsline {paragraph}{\relax $\@@underline {\hbox {Le graphe d'écart}}\mathsurround \z@ $\relax }{18}{section*.10}}
\@writefile{toc}{\contentsline {paragraph}{\relax $\@@underline {\hbox {Exemple d'exécution de l'algorithme}}\mathsurround \z@ $\relax }{19}{section*.11}}
\abx@aux@segm{0}{0}{algo_cormen}
\abx@aux@segm{0}{0}{algo_cormen}
\@writefile{toc}{\contentsline {paragraph}{Chemin augmentant}{25}{section*.12}}
\@writefile{toc}{\contentsline {subsubsection}{\numberline {3.3.5}Théorème de la coupe}{26}{subsubsection.3.3.5}}
\@writefile{toc}{\contentsline {paragraph}{Propriétés}{26}{section*.13}}
\@writefile{toc}{\contentsline {paragraph}{Théorème de la coupe}{26}{section*.14}}
\@writefile{toc}{\contentsline {paragraph}{Principe de la démonstration}{26}{section*.15}}
\@writefile{toc}{\contentsline {paragraph}{Conséquences}{26}{section*.16}}
\@writefile{toc}{\contentsline {subsubsection}{\numberline {3.3.6}Recherche de chemin avec l'algorithme de Bellman-Ford}{27}{subsubsection.3.3.6}}
\@writefile{loa}{\contentsline {algocf}{\numberline {3}{\ignorespaces Algorithme de Bellmann-Ford}}{27}{algocf.3}}
\@writefile{toc}{\contentsline {subsubsection}{\numberline {3.3.7}Recherche de chemin : algorithme de parcours en largeur}{28}{subsubsection.3.3.7}}
\@writefile{loa}{\contentsline {algocf}{\numberline {4}{\ignorespaces Algorithme de Parcours en largeur}}{28}{algocf.4}}
\@writefile{toc}{\contentsline {subsubsection}{\numberline {3.3.8}Flot maximal / coupe minimale : algorithme d'Edmonds-Karp}{29}{subsubsection.3.3.8}}
\@writefile{loa}{\contentsline {algocf}{\numberline {5}{\ignorespaces Algorithme d'Edmonds-Karp}}{29}{algocf.5}}
\@writefile{toc}{\contentsline {subsubsection}{\numberline {3.3.9}Complexité temporelle des algorithmes de Graph Cut}{29}{subsubsection.3.3.9}}
\abx@aux@segm{0}{0}{algo_cormen}
\abx@aux@segm{0}{0}{algo_cormen}
\abx@aux@cite{cours_Mazanera}
\abx@aux@segm{0}{0}{cours_Mazanera}
\@writefile{toc}{\contentsline {subsection}{\numberline {3.4}Morphologie mathématique}{31}{subsection.3.4}}
\abx@aux@cite{cours_John_Chaussard}
\abx@aux@segm{0}{0}{cours_John_Chaussard}
\abx@aux@cite{video_John_Chaussard_MP}
\abx@aux@segm{0}{0}{video_John_Chaussard_MP}
\@writefile{toc}{\contentsline {subsubsection}{\numberline {3.4.1}Image binaire}{32}{subsubsection.3.4.1}}
\@writefile{toc}{\contentsline {subsubsection}{\numberline {3.4.2}\'Element structurant}{32}{subsubsection.3.4.2}}
\@writefile{toc}{\contentsline {subsubsection}{\numberline {3.4.3}Les transformations}{33}{subsubsection.3.4.3}}
\abx@aux@segm{0}{0}{cours_John_Chaussard}
\abx@aux@segm{0}{0}{cours_John_Chaussard}
\abx@aux@cite{cours_Malmberg}
\abx@aux@segm{0}{0}{cours_Malmberg}
\@writefile{toc}{\contentsline {subsection}{\numberline {3.5}Ford Fulkerson : de l'image au graphe}{35}{subsection.3.5}}
\abx@aux@segm{0}{0}{video_John_Chaussard_SV}
\abx@aux@segm{0}{0}{video_John_Chaussard_SV}
\abx@aux@segm{0}{0}{video_John_Chaussard_MP}
\@writefile{toc}{\contentsline {subsection}{\numberline {3.6}Algorithme de segmentation : La ligne de partage des eaux}{37}{subsection.3.6}}
\@writefile{loa}{\contentsline {algocf}{\numberline {6}{\ignorespaces Ligne de partage des eaux}}{38}{algocf.6}}
\@writefile{loa}{\contentsline {algocf}{\numberline {7}{\ignorespaces Ligne de partage des eaux}}{39}{algocf.7}}
\@writefile{toc}{\contentsline {section}{\numberline {4}Remarques sur le déroulement - journal de bord}{39}{section.4}}
\@writefile{toc}{\contentsline {subsection}{\numberline {4.1}Bilan au 22 janvier 2019}{39}{subsection.4.1}}
\abx@aux@segm{0}{0}{cours_Malmberg}
\@writefile{toc}{\contentsline {subsection}{\numberline {4.2}Bilan au 15 Mars 2019}{40}{subsection.4.2}}
\@writefile{toc}{\contentsline {subsection}{\numberline {4.3}Bilan au 30 avril 2019}{40}{subsection.4.3}}
\abx@aux@segm{0}{0}{cours_John_Chaussard}
\@writefile{toc}{\contentsline {subsection}{\numberline {4.4}Bilan au 31 mai 2019}{42}{subsection.4.4}}
\@writefile{toc}{\contentsline {section}{\numberline {5}Remarques sur le fonctionnement des 3 algorithmes}{42}{section.5}}
\@writefile{toc}{\contentsline {section}{\numberline {6}Conclusion}{43}{section.6}}
\abx@aux@refcontextdefaultsdone
\abx@aux@defaultrefcontext{0}{cours_Mazanera}{nty/global//global/global}
\abx@aux@defaultrefcontext{0}{AYACHE}{nty/global//global/global}
\abx@aux@defaultrefcontext{0}{cours_John_Chaussard}{nty/global//global/global}
\abx@aux@defaultrefcontext{0}{video_John_Chaussard}{nty/global//global/global}
\abx@aux@defaultrefcontext{0}{video_John_Chaussard_MP}{nty/global//global/global}
\abx@aux@defaultrefcontext{0}{video_John_Chaussard_SV}{nty/global//global/global}
\abx@aux@defaultrefcontext{0}{graphe_cogis}{nty/global//global/global}
\abx@aux@defaultrefcontext{0}{Colombo-Koenigsberg}{nty/global//global/global}
\abx@aux@defaultrefcontext{0}{algo_cormen}{nty/global//global/global}
\abx@aux@defaultrefcontext{0}{IREMpN_BTS}{nty/global//global/global}
\abx@aux@defaultrefcontext{0}{IREMpN_lycee}{nty/global//global/global}
\abx@aux@defaultrefcontext{0}{cours_Malmberg}{nty/global//global/global}
\abx@aux@defaultrefcontext{0}{rapport_selmis}{nty/global//global/global}
\abx@aux@defaultrefcontext{0}{cours_AEsbelin_et_al}{nty/global//global/global}
\abx@aux@defaultrefcontext{0}{cours_notes_AEsbelin_et_al}{nty/global//global/global}
