[0] Config.pm:304> INFO - This is Biber 2.12
[1] Config.pm:307> INFO - Logfile is 'main.blg'
[76] biber-MSWIN64:315> INFO - === 
[174] Biber.pm:371> INFO - Reading 'main.bcf'
[449] Biber.pm:889> INFO - Found 15 citekeys in bib section 0
[512] Biber.pm:4093> INFO - Processing section 0
[560] Biber.pm:4254> INFO - Looking for bibtex format file 'biblio.bib' for section 0
[578] bibtex.pm:1523> INFO - LaTeX decoding ...
[627] bibtex.pm:1340> INFO - Found BibTeX data source 'biblio.bib'
[737] Utils.pm:193> WARN - ISBN '286240 116 X' in entry 'IREMpN_lycee' is invalid - run biber with '--validate_datamodel' for details.
[868] Utils.pm:193> WARN - BibTeX subsystem: warning: comma(s) at end of name (removing)
[869] Utils.pm:193> WARN - BibTeX subsystem: author, warning: comma(s) at end of name (removing)
[869] Utils.pm:193> WARN - BibTeX subsystem: warning: comma(s) at end of name (removing)
[869] Utils.pm:193> WARN - BibTeX subsystem: author, warning: comma(s) at end of name (removing)
[870] Utils.pm:193> WARN - BibTeX subsystem: warning: comma(s) at end of name (removing)
[870] Utils.pm:193> WARN - BibTeX subsystem: author, warning: comma(s) at end of name (removing)
[870] Utils.pm:193> WARN - BibTeX subsystem: warning: comma(s) at end of name (removing)
[870] Utils.pm:193> WARN - BibTeX subsystem: author, warning: comma(s) at end of name (removing)
[870] Utils.pm:193> WARN - BibTeX subsystem: warning: comma(s) at end of name (removing)
[870] Utils.pm:193> WARN - BibTeX subsystem: author, warning: comma(s) at end of name (removing)
[951] UCollate.pm:68> INFO - Overriding locale 'fr-FR' defaults 'variable = shifted' with 'variable = non-ignorable'
[951] UCollate.pm:68> INFO - Overriding locale 'fr-FR' defaults 'normalization = NFD' with 'normalization = prenormalized'
[952] Biber.pm:3921> INFO - Sorting list 'nty/global//global/global' of type 'entry' with template 'nty' and locale 'fr-FR'
[952] Biber.pm:3927> INFO - No sort tailoring available for locale 'fr-FR'
[1033] bbl.pm:636> INFO - Writing 'main.bbl' with encoding 'UTF-8'
[1044] bbl.pm:739> INFO - Output to main.bbl
[1045] Biber.pm:110> INFO - WARNINGS: 11
