\relax 
\providecommand\hyper@newdestlabel[2]{}
\providecommand\HyperFirstAtBeginDocument{\AtBeginDocument}
\HyperFirstAtBeginDocument{\ifx\hyper@anchor\@undefined
\global\let\oldcontentsline\contentsline
\gdef\contentsline#1#2#3#4{\oldcontentsline{#1}{#2}{#3}}
\global\let\oldnewlabel\newlabel
\gdef\newlabel#1#2{\newlabelxx{#1}#2}
\gdef\newlabelxx#1#2#3#4#5#6{\oldnewlabel{#1}{{#2}{#3}}}
\AtEndDocument{\ifx\hyper@anchor\@undefined
\let\contentsline\oldcontentsline
\let\newlabel\oldnewlabel
\fi}
\fi}
\global\let\hyper@last\relax 
\gdef\HyperFirstAtBeginDocument#1{#1}
\providecommand*\HyPL@Entry[1]{}
\abx@aux@refcontext{nty/global//global/global}
\abx@aux@cite{Colombo-Koenigsberg}
\abx@aux@segm{0}{0}{Colombo-Koenigsberg}
\abx@aux@cite{algo_cormen}
\abx@aux@segm{0}{0}{algo_cormen}
\abx@aux@cite{IREMpN_lycee}
\abx@aux@segm{0}{0}{IREMpN_lycee}
\abx@aux@cite{IREMpN_BTS}
\abx@aux@segm{0}{0}{IREMpN_BTS}
\abx@aux@cite{graphe_cogis}
\abx@aux@segm{0}{0}{graphe_cogis}
\abx@aux@cite{video_John_Chaussard}
\abx@aux@segm{0}{0}{video_John_Chaussard}
\abx@aux@cite{AYACHE}
\abx@aux@segm{0}{0}{AYACHE}
\abx@aux@cite{rapport_selmis}
\abx@aux@segm{0}{0}{rapport_selmis}
\HyPL@Entry{0<</S/D>>}
\providecommand \oddpage@label [2]{}
\@writefile{toc}{\boolfalse {citerequest}\boolfalse {citetracker}\boolfalse {pagetracker}\boolfalse {backtracker}\relax }
\@writefile{lof}{\boolfalse {citerequest}\boolfalse {citetracker}\boolfalse {pagetracker}\boolfalse {backtracker}\relax }
\@writefile{lot}{\boolfalse {citerequest}\boolfalse {citetracker}\boolfalse {pagetracker}\boolfalse {backtracker}\relax }
\babel@aux{french}{}
\@writefile{toc}{\contentsline {section}{\numberline {1}Introduction}{1}{section.1}}
\@writefile{toc}{\contentsline {section}{\numberline {2}Trame du projet}{1}{section.2}}
\@writefile{toc}{\contentsline {subsection}{\numberline {2.1}Objectif}{1}{subsection.2.1}}
\@writefile{toc}{\contentsline {subsection}{\numberline {2.2}Tâches préalables}{2}{subsection.2.2}}
\@writefile{toc}{\contentsline {section}{\numberline {3}\'Etude préalable}{2}{section.3}}
\@writefile{toc}{\contentsline {subsection}{\numberline {3.1}Les fichiers image}{2}{subsection.3.1}}
\@writefile{toc}{\contentsline {subsubsection}{\numberline {3.1.1}Format des images : BMP $\rightarrow $ PNG}{2}{subsubsection.3.1.1}}
\@writefile{toc}{\contentsline {subsubsection}{\numberline {3.1.2}Description du format PNG}{2}{subsubsection.3.1.2}}
\@writefile{toc}{\contentsline {subsubsection}{\numberline {3.1.3}Le repérage des pixels dans l'image}{2}{subsubsection.3.1.3}}
\@writefile{toc}{\contentsline {subsubsection}{\numberline {3.1.4}Les couleurs}{3}{subsubsection.3.1.4}}
\@writefile{toc}{\contentsline {subsection}{\numberline {3.2}Utilisation de graphes}{3}{subsection.3.2}}
\@writefile{toc}{\contentsline {subsubsection}{\numberline {3.2.1}Graphe pondéré}{3}{subsubsection.3.2.1}}
\@writefile{toc}{\contentsline {subsubsection}{\numberline {3.2.2}Graphe orienté pondéré}{3}{subsubsection.3.2.2}}
\@writefile{toc}{\contentsline {subsection}{\numberline {3.3}Les algorithmes à mettre en \oe uvre pour la segmentation}{3}{subsection.3.3}}
\@writefile{toc}{\contentsline {subsubsection}{\numberline {3.3.1}Graphes de flots : Ford Fulkerson}{4}{subsubsection.3.3.1}}
\@writefile{toc}{\contentsline {subsubsection}{\numberline {3.3.2}Recherche de chemin : Bellman-Ford}{4}{subsubsection.3.3.2}}
\@writefile{toc}{\contentsline {subsubsection}{\numberline {3.3.3}Graph cut et ligne de partage des eaux}{4}{subsubsection.3.3.3}}
\@writefile{toc}{\contentsline {subsection}{\numberline {3.4}Les classes}{4}{subsection.3.4}}
\@writefile{toc}{\contentsline {subsubsection}{\numberline {3.4.1}La classe Application}{4}{subsubsection.3.4.1}}
\@writefile{toc}{\contentsline {subsubsection}{\numberline {3.4.2}La classe Couleur}{4}{subsubsection.3.4.2}}
\@writefile{toc}{\contentsline {subsubsection}{\numberline {3.4.3}La classe Image}{4}{subsubsection.3.4.3}}
\@writefile{toc}{\contentsline {subsubsection}{\numberline {3.4.4}La classe Sommet}{4}{subsubsection.3.4.4}}
\@writefile{toc}{\contentsline {subsubsection}{\numberline {3.4.5}La classe Arc}{4}{subsubsection.3.4.5}}
\@writefile{toc}{\contentsline {subsubsection}{\numberline {3.4.6}La classe Graphe}{4}{subsubsection.3.4.6}}
\@writefile{toc}{\contentsline {subsubsection}{\numberline {3.4.7}La classe Partage}{4}{subsubsection.3.4.7}}
\@writefile{toc}{\contentsline {section}{\numberline {4}Remarques sur le déroulement}{4}{section.4}}
\@writefile{toc}{\contentsline {subsection}{\numberline {4.1}Au 22 janvier 2019}{4}{subsection.4.1}}
\abx@aux@refcontextdefaultsdone
\abx@aux@defaultrefcontext{0}{AYACHE}{nty/global//global/global}
\abx@aux@defaultrefcontext{0}{video_John_Chaussard}{nty/global//global/global}
\abx@aux@defaultrefcontext{0}{graphe_cogis}{nty/global//global/global}
\abx@aux@defaultrefcontext{0}{Colombo-Koenigsberg}{nty/global//global/global}
\abx@aux@defaultrefcontext{0}{algo_cormen}{nty/global//global/global}
\abx@aux@defaultrefcontext{0}{IREMpN_BTS}{nty/global//global/global}
\abx@aux@defaultrefcontext{0}{IREMpN_lycee}{nty/global//global/global}
\abx@aux@defaultrefcontext{0}{rapport_selmis}{nty/global//global/global}
